{"text_format":"1","workbook":"xlsx","n_sheets":11,"sheets":["parametres","Synthese","Affectation","Laurent","René","Jean Michel","Etienne","Jean Louis","Hervé","Christian","Chloé"],"not_rendered":{"charts":0,"images":0,"macros":1,"external_links":0,"defined_names":2,"comments":1,"pivot_tables":0},"unopened":[],"bounds":{"document_bytes":16777216,"sheet_cells":100000,"rows_first":2000,"rows_last":500,"rows_between":2000,"halvings":0,"cell_chars":16384,"cell_head_chars":4096},"cells_cut":0,"cells_raw":0,"read":"whole","date_system":"1900"}

{"sheet":"parametres","index":0,"n_rows":3,"n_cols":11,"rows_kept":3,"cut":false,"hidden":false,"merged":[]}
[null,null,"VALLONS","CRECHES","AIN","PARAY","CLUNY","CP","MALADIE","REPOS","FORMATION"]
["Semaine","VIERGE","05:20:00","06:45:00","04:40:00","05:00:00","04:15:00","00:00:00","00:00:00","00:00:00","02:00:00"]
["Samedi",null,"03:25:00","02:55:00","03:20:00","04:15:00","03:00:00","00:00:00","00:00:00","00:00:00"]

{"sheet":"Synthese","index":1,"n_rows":37,"n_cols":18,"rows_kept":37,"cut":false,"hidden":false,"merged":[[0,0,0,16]]}
[{"$f":"B4","v":"2025-02-01"}]
[]
[null,"Date","Laurent",null,"René",null,"Jean Michel",null,"Etienne",null,"Jean Louis",null,"Christian",null,"Hervé",null,"Chloé"]
[{"$f":"B4","v":"2025-02-01"},"2025-02-01","MALADIE",{"$f":"IF(ISNUMBER(B4),IF(OR(ISBLANK(C4),WEEKDAY($B4,2)=7),0,IF(WEEKDAY($B4,2)<=5,HLOOKUP(C4,parametres!$C$1:$S$3,2,FALSE),HLOOKUP(C4,parametres!$C$1:$S$3,3,FALSE))))","v":"00:00:00"},"MALADIE",{"$f":"IF(ISNUMBER(D4),IF(OR(ISBLANK(E4),WEEKDAY($B4,2)=7),0,IF(WEEKDAY($B4,2)<=5,HLOOKUP(E4,parametres!$C$1:$S$3,2,FALSE),HLOOKUP(E4,parametres!$C$1:$S$3,3,FALSE))))","v":"00:00:00"},"CLUNY",{"$f":"IF(ISNUMBER(F4),IF(OR(ISBLANK(G4),WEEKDAY($B4,2)=7),0,IF(WEEKDAY($B4,2)<=5,HLOOKUP(G4,parametres!$C$1:$S$3,2,FALSE),HLOOKUP(G4,parametres!$C$1:$S$3,3,FALSE))))","v":"03:00:00"},"CRECHES",{"$f":"IF(ISNUMBER(H4),IF(OR(ISBLANK(I4),WEEKDAY($B4,2)=7),0,IF(WEEKDAY($B4,2)<=5,HLOOKUP(I4,parametres!$C$1:$S$3,2,FALSE),HLOOKUP(I4,parametres!$C$1:$S$3,3,FALSE))))","v":"02:55:00"},"PARAY",{"$f":"IF(ISNUMBER(J4),IF(OR(ISBLANK(K4),WEEKDAY($B4,2)=7),0,IF(WEEKDAY($B4,2)<=5,HLOOKUP(K4,parametres!$C$1:$S$3,2,FALSE),HLOOKUP(K4,parametres!$C$1:$S$3,3,FALSE))))","v":"04:15:00"},"REPOS",{"$f":"IF(ISNUMBER(L4),IF(OR(ISBLANK(M4),WEEKDAY($B4,2)=7),0,IF(WEEKDAY($B4,2)<=5,HLOOKUP(M4,parametres!$C$1:$S$3,2,FALSE),HLOOKUP(M4,parametres!$C$1:$S$3,3,FALSE))))","v":"00:00:00"},"VALLONS",{"$f":"IF(ISNUMBER(N4),IF(OR(ISBLANK(O4),WEEKDAY($B4,2)=7),0,IF(WEEKDAY($B4,2)<=5,HLOOKUP(O4,parametres!$C$1:$S$3,2,FALSE),HLOOKUP(O4,parametres!$C$1:$S$3,3,FALSE))))","v":"03:25:00"},"AIN",{"$f":"IF(ISNUMBER(P4),IF(OR(ISBLANK(Q4),WEEKDAY($B4,2)=7),0,IF(WEEKDAY($B4,2)<=5,HLOOKUP(Q4,parametres!$C$1:$S$3,2,FALSE),HLOOKUP(Q4,parametres!$C$1:$S$3,3,FALSE))))","v":"03:20:00"}]
["2025-02-02",{"$f":"IF(B4=\"\",\"\",IF(B4=EOMONTH(B4,0),\"\",B4+1))","v":"2025-02-02"},null,{"$f":"IF(ISNUMBER(B5),IF(OR(ISBLANK(C5),WEEKDAY($B5,2)=7),0,IF(WEEKDAY($B5,2)<=5,HLOOKUP(C5,parametres!$C$1:$S$3,2,FALSE),HLOOKUP(C5,parametres!$C$1:$S$3,3,FALSE))))","v":"00:00:00"},null,{"$f":"IF(ISNUMBER(D5),IF(OR(ISBLANK(E5),WEEKDAY($B5,2)=7),0,IF(WEEKDAY($B5,2)<=5,HLOOKUP(E5,parametres!$C$1:$S$3,2,FALSE),HLOOKUP(E5,parametres!$C$1:$S$3,3,FALSE))))","v":"00:00:00"},null,{"$f":"IF(ISNUMBER(F5),IF(OR(ISBLANK(G5),WEEKDAY($B5,2)=7),0,IF(WEEKDAY($B5,2)<=5,HLOOKUP(G5,parametres!$C$1:$S$3,2,FALSE),HLOOKUP(G5,parametres!$C$1:$S$3,3,FALSE))))","v":"00:00:00"},null,{"$f":"IF(ISNUMBER(H5),IF(OR(ISBLANK(I5),WEEKDAY($B5,2)=7),0,IF(WEEKDAY($B5,2)<=5,HLOOKUP(I5,parametres!$C$1:$S$3,2,FALSE),HLOOKUP(I5,parametres!$C$1:$S$3,3,FALSE))))","v":"00:00:00"},null,{"$f":"IF(ISNUMBER(J5),IF(OR(ISBLANK(K5),WEEKDAY($B5,2)=7),0,IF(WEEKDAY($B5,2)<=5,HLOOKUP(K5,parametres!$C$1:$S$3,2,FALSE),HLOOKUP(K5,parametres!$C$1:$S$3,3,FALSE))))","v":"00:00:00"},null,{"$f":"IF(ISNUMBER(L5),IF(OR(ISBLANK(M5),WEEKDAY($B5,2)=7),0,IF(WEEKDAY($B5,2)<=5,HLOOKUP(M5,parametres!$C$1:$S$3,2,FALSE),HLOOKUP(M5,parametres!$C$1:$S$3,3,FALSE))))","v":"00:00:00"},null,{"$f":"IF(ISNUMBER(N5),IF(OR(ISBLANK(O5),WEEKDAY($B5,2)=7),0,IF(WEEKDAY($B5,2)<=5,HLOOKUP(O5,parametres!$C$1:$S$3,2,FALSE),HLOOKUP(O5,parametres!$C$1:$S$3,3,FALSE))))","v":"00:00:00"},null,{"$f":"IF(ISNUMBER(P5),IF(OR(ISBLANK(Q5),WEEKDAY($B5,2)=7),0,IF(WEEKDAY($B5,2)<=5,HLOOKUP(Q5,parametres!$C$1:$S$3,2,FALSE),HLOOKUP(Q5,parametres!$C$1:$S$3,3,FALSE))))","v":"00:00:00"}]
["2025-02-03",{"$f":"IF(B5=\"\",\"\",IF(B5=EOMONTH(B5,0),\"\",B5+1))","v":"2025-02-03"},"MALADIE",{"$f":"IF(ISNUMBER(B6),IF(OR(ISBLANK(C6),WEEKDAY($B6,2)=7),0,IF(WEEKDAY($B6,2)<=5,HLOOKUP(C6,parametres!$C$1:$S$3,2,FALSE),HLOOKUP(C6,parametres!$C$1:$S$3,3,FALSE))))","v":"00:00:00"},"MALADIE",{"$f":"IF(ISNUMBER(D6),IF(OR(ISBLANK(E6),WEEKDAY($B6,2)=7),0,IF(WEEKDAY($B6,2)<=5,HLOOKUP(E6,parametres!$C$1:$S$3,2,FALSE),HLOOKUP(E6,parametres!$C$1:$S$3,3,FALSE))))","v":"00:00:00"},"CLUNY",{"$f":"IF(ISNUMBER(F6),IF(OR(ISBLANK(G6),WEEKDAY($B6,2)=7),0,IF(WEEKDAY($B6,2)<=5,HLOOKUP(G6,parametres!$C$1:$S$3,2,FALSE),HLOOKUP(G6,parametres!$C$1:$S$3,3,FALSE))))","v":"04:15:00"},"CRECHES",{"$f":"IF(ISNUMBER(H6),IF(OR(ISBLANK(I6),WEEKDAY($B6,2)=7),0,IF(WEEKDAY($B6,2)<=5,HLOOKUP(I6,parametres!$C$1:$S$3,2,FALSE),HLOOKUP(I6,parametres!$C$1:$S$3,3,FALSE))))","v":"06:45:00"},"PARAY",{"$f":"IF(ISNUMBER(J6),IF(OR(ISBLANK(K6),WEEKDAY($B6,2)=7),0,IF(WEEKDAY($B6,2)<=5,HLOOKUP(K6,parametres!$C$1:$S$3,2,FALSE),HLOOKUP(K6,parametres!$C$1:$S$3,3,FALSE))))","v":"05:00:00"},"VALLONS",{"$f":"IF(ISNUMBER(L6),IF(OR(ISBLANK(M6),WEEKDAY($B6,2)=7),0,IF(WEEKDAY($B6,2)<=5,HLOOKUP(M6,parametres!$C$1:$S$3,2,FALSE),HLOOKUP(M6,parametres!$C$1:$S$3,3,FALSE))))","v":"05:20:00"},"REPOS",{"$f":"IF(ISNUMBER(N6),IF(OR(ISBLANK(O6),WEEKDAY($B6,2)=7),0,IF(WEEKDAY($B6,2)<=5,HLOOKUP(O6,parametres!$C$1:$S$3,2,FALSE),HLOOKUP(O6,parametres!$C$1:$S$3,3,FALSE))))","v":"00:00:00"},"AIN",{"$f":"IF(ISNUMBER(P6),IF(OR(ISBLANK(Q6),WEEKDAY($B6,2)=7),0,IF(WEEKDAY($B6,2)<=5,HLOOKUP(Q6,parametres!$C$1:$S$3,2,FALSE),HLOOKUP(Q6,parametres!$C$1:$S$3,3,FALSE))))","v":"04:40:00"}]
["2025-02-04","2025-02-04","MALADIE",{"$f":"IF(ISNUMBER(B7),IF(OR(ISBLANK(C7),WEEKDAY($B7,2)=7),0,IF(WEEKDAY($B7,2)<=5,HLOOKUP(C7,parametres!$C$1:$S$3,2,FALSE),HLOOKUP(C7,parametres!$C$1:$S$3,3,FALSE))))","v":"00:00:00"},"MALADIE",{"$f":"IF(ISNUMBER(D7),IF(OR(ISBLANK(E7),WEEKDAY($B7,2)=7),0,IF(WEEKDAY($B7,2)<=5,HLOOKUP(E7,parametres!$C$1:$S$3,2,FALSE),HLOOKUP(E7,parametres!$C$1:$S$3,3,FALSE))))","v":"00:00:00"},"REPOS",{"$f":"IF(ISNUMBER(F7),IF(OR(ISBLANK(G7),WEEKDAY($B7,2)=7),0,IF(WEEKDAY($B7,2)<=5,HLOOKUP(G7,parametres!$C$1:$S$3,2,FALSE),HLOOKUP(G7,parametres!$C$1:$S$3,3,FALSE))))","v":"00:00:00"},"CRECHES",{"$f":"IF(ISNUMBER(H7),IF(OR(ISBLANK(I7),WEEKDAY($B7,2)=7),0,IF(WEEKDAY($B7,2)<=5,HLOOKUP(I7,parametres!$C$1:$S$3,2,FALSE),HLOOKUP(I7,parametres!$C$1:$S$3,3,FALSE))))","v":"06:45:00"},"PARAY",{"$f":"IF(ISNUMBER(J7),IF(OR(ISBLANK(K7),WEEKDAY($B7,2)=7),0,IF(WEEKDAY($B7,2)<=5,HLOOKUP(K7,parametres!$C$1:$S$3,2,FALSE),HLOOKUP(K7,parametres!$C$1:$S$3,3,FALSE))))","v":"05:00:00"},"CLUNY",{"$f":"IF(ISNUMBER(L7),IF(OR(ISBLANK(M7),WEEKDAY($B7,2)=7),0,IF(WEEKDAY($B7,2)<=5,HLOOKUP(M7,parametres!$C$1:$S$3,2,FALSE),HLOOKUP(M7,parametres!$C$1:$S$3,3,FALSE))))","v":"04:15:00"},"VALLONS",{"$f":"IF(ISNUMBER(N7),IF(OR(ISBLANK(O7),WEEKDAY($B7,2)=7),0,IF(WEEKDAY($B7,2)<=5,HLOOKUP(O7,parametres!$C$1:$S$3,2,FALSE),HLOOKUP(O7,parametres!$C$1:$S$3,3,FALSE))))","v":"05:20:00"},"AIN",{"$f":"IF(ISNUMBER(P7),IF(OR(ISBLANK(Q7),WEEKDAY($B7,2)=7),0,IF(WEEKDAY($B7,2)<=5,HLOOKUP(Q7,parametres!$C$1:$S$3,2,FALSE),HLOOKUP(Q7,parametres!$C$1:$S$3,3,FALSE))))","v":"04:40:00"}]
["2025-02-05","2025-02-05","MALADIE",{"$f":"IF(ISNUMBER(B8),IF(OR(ISBLANK(C8),WEEKDAY($B8,2)=7),0,IF(WEEKDAY($B8,2)<=5,HLOOKUP(C8,parametres!$C$1:$S$3,2,FALSE),HLOOKUP(C8,parametres!$C$1:$S$3,3,FALSE))))","v":"00:00:00"},"MALADIE",{"$f":"IF(ISNUMBER(D8),IF(OR(ISBLANK(E8),WEEKDAY($B8,2)=7),0,IF(WEEKDAY($B8,2)<=5,HLOOKUP(E8,parametres!$C$1:$S$3,2,FALSE),HLOOKUP(E8,parametres!$C$1:$S$3,3,FALSE))))","v":"00:00:00"},"CLUNY",{"$f":"IF(ISNUMBER(F8),IF(OR(ISBLANK(G8),WEEKDAY($B8,2)=7),0,IF(WEEKDAY($B8,2)<=5,HLOOKUP(G8,parametres!$C$1:$S$3,2,FALSE),HLOOKUP(G8,parametres!$C$1:$S$3,3,FALSE))))","v":"04:15:00"},"CRECHES",{"$f":"IF(ISNUMBER(H8),IF(OR(ISBLANK(I8),WEEKDAY($B8,2)=7),0,IF(WEEKDAY($B8,2)<=5,HLOOKUP(I8,parametres!$C$1:$S$3,2,FALSE),HLOOKUP(I8,parametres!$C$1:$S$3,3,FALSE))))","v":"06:45:00"},"PARAY",{"$f":"IF(ISNUMBER(J8),IF(OR(ISBLANK(K8),WEEKDAY($B8,2)=7),0,IF(WEEKDAY($B8,2)<=5,HLOOKUP(K8,parametres!$C$1:$S$3,2,FALSE),HLOOKUP(K8,parametres!$C$1:$S$3,3,FALSE))))","v":"05:00:00"},"REPOS",{"$f":"IF(ISNUMBER(L8),IF(OR(ISBLANK(M8),WEEKDAY($B8,2)=7),0,IF(WEEKDAY($B8,2)<=5,HLOOKUP(M8,parametres!$C$1:$S$3,2,FALSE),HLOOKUP(M8,parametres!$C$1:$S$3,3,FALSE))))","v":"00:00:00"},"VALLONS",{"$f":"IF(ISNUMBER(N8),IF(OR(ISBLANK(O8),WEEKDAY($B8,2)=7),0,IF(WEEKDAY($B8,2)<=5,HLOOKUP(O8,parametres!$C$1:$S$3,2,FALSE),HLOOKUP(O8,parametres!$C$1:$S$3,3,FALSE))))","v":"05:20:00"},"AIN",{"$f":"IF(ISNUMBER(P8),IF(OR(ISBLANK(Q8),WEEKDAY($B8,2)=7),0,IF(WEEKDAY($B8,2)<=5,HLOOKUP(Q8,parametres!$C$1:$S$3,2,FALSE),HLOOKUP(Q8,parametres!$C$1:$S$3,3,FALSE))))","v":"04:40:00"}]
["2025-02-06","2025-02-06","MALADIE",{"$f":"IF(ISNUMBER(B9),IF(OR(ISBLANK(C9),WEEKDAY($B9,2)=7),0,IF(WEEKDAY($B9,2)<=5,HLOOKUP(C9,parametres!$C$1:$S$3,2,FALSE),HLOOKUP(C9,parametres!$C$1:$S$3,3,FALSE))))","v":"00:00:00"},"MALADIE",{"$f":"IF(ISNUMBER(D9),IF(OR(ISBLANK(E9),WEEKDAY($B9,2)=7),0,IF(WEEKDAY($B9,2)<=5,HLOOKUP(E9,parametres!$C$1:$S$3,2,FALSE),HLOOKUP(E9,parametres!$C$1:$S$3,3,FALSE))))","v":"00:00:00"},"CLUNY",{"$f":"IF(ISNUMBER(F9),IF(OR(ISBLANK(G9),WEEKDAY($B9,2)=7),0,IF(WEEKDAY($B9,2)<=5,HLOOKUP(G9,parametres!$C$1:$S$3,2,FALSE),HLOOKUP(G9,parametres!$C$1:$S$3,3,FALSE))))","v":"04:15:00"},"CRECHES",{"$f":"IF(ISNUMBER(H9),IF(OR(ISBLANK(I9),WEEKDAY($B9,2)=7),0,IF(WEEKDAY($B9,2)<=5,HLOOKUP(I9,parametres!$C$1:$S$3,2,FALSE),HLOOKUP(I9,parametres!$C$1:$S$3,3,FALSE))))","v":"06:45:00"},"PARAY",{"$f":"IF(ISNUMBER(J9),IF(OR(ISBLANK(K9),WEEKDAY($B9,2)=7),0,IF(WEEKDAY($B9,2)<=5,HLOOKUP(K9,parametres!$C$1:$S$3,2,FALSE),HLOOKUP(K9,parametres!$C$1:$S$3,3,FALSE))))","v":"05:00:00"},"VALLONS",{"$f":"IF(ISNUMBER(L9),IF(OR(ISBLANK(M9),WEEKDAY($B9,2)=7),0,IF(WEEKDAY($B9,2)<=5,HLOOKUP(M9,parametres!$C$1:$S$3,2,FALSE),HLOOKUP(M9,parametres!$C$1:$S$3,3,FALSE))))","v":"05:20:00"},"REPOS",{"$f":"IF(ISNUMBER(N9),IF(OR(ISBLANK(O9),WEEKDAY($B9,2)=7),0,IF(WEEKDAY($B9,2)<=5,HLOOKUP(O9,parametres!$C$1:$S$3,2,FALSE),HLOOKUP(O9,parametres!$C$1:$S$3,3,FALSE))))","v":"00:00:00"},"AIN",{"$f":"IF(ISNUMBER(P9),IF(OR(ISBLANK(Q9),WEEKDAY($B9,2)=7),0,IF(WEEKDAY($B9,2)<=5,HLOOKUP(Q9,parametres!$C$1:$S$3,2,FALSE),HLOOKUP(Q9,parametres!$C$1:$S$3,3,FALSE))))","v":"04:40:00"}]
["2025-02-07","2025-02-07","MALADIE",{"$f":"IF(ISNUMBER(B10),IF(OR(ISBLANK(C10),WEEKDAY($B10,2)=7),0,IF(WEEKDAY($B10,2)<=5,HLOOKUP(C10,parametres!$C$1:$S$3,2,FALSE),HLOOKUP(C10,parametres!$C$1:$S$3,3,FALSE))))","v":"00:00:00"},"MALADIE",{"$f":"IF(ISNUMBER(D10),IF(OR(ISBLANK(E10),WEEKDAY($B10,2)=7),0,IF(WEEKDAY($B10,2)<=5,HLOOKUP(E10,parametres!$C$1:$S$3,2,FALSE),HLOOKUP(E10,parametres!$C$1:$S$3,3,FALSE))))","v":"00:00:00"},"CLUNY",{"$f":"IF(ISNUMBER(F10),IF(OR(ISBLANK(G10),WEEKDAY($B10,2)=7),0,IF(WEEKDAY($B10,2)<=5,HLOOKUP(G10,parametres!$C$1:$S$3,2,FALSE),HLOOKUP(G10,parametres!$C$1:$S$3,3,FALSE))))","v":"04:15:00"},"CRECHES",{"$f":"IF(ISNUMBER(H10),IF(OR(ISBLANK(I10),WEEKDAY($B10,2)=7),0,IF(WEEKDAY($B10,2)<=5,HLOOKUP(I10,parametres!$C$1:$S$3,2,FALSE),HLOOKUP(I10,parametres!$C$1:$S$3,3,FALSE))))","v":"06:45:00"},"REPOS",{"$f":"IF(ISNUMBER(J10),IF(OR(ISBLANK(K10),WEEKDAY($B10,2)=7),0,IF(WEEKDAY($B10,2)<=5,HLOOKUP(K10,parametres!$C$1:$S$3,2,FALSE),HLOOKUP(K10,parametres!$C$1:$S$3,3,FALSE))))","v":"00:00:00"},"PARAY",{"$f":"IF(ISNUMBER(L10),IF(OR(ISBLANK(M10),WEEKDAY($B10,2)=7),0,IF(WEEKDAY($B10,2)<=5,HLOOKUP(M10,parametres!$C$1:$S$3,2,FALSE),HLOOKUP(M10,parametres!$C$1:$S$3,3,FALSE))))","v":"05:00:00"},"VALLONS",{"$f":"IF(ISNUMBER(N10),IF(OR(ISBLANK(O10),WEEKDAY($B10,2)=7),0,IF(WEEKDAY($B10,2)<=5,HLOOKUP(O10,parametres!$C$1:$S$3,2,FALSE),HLOOKUP(O10,parametres!$C$1:$S$3,3,FALSE))))","v":"05:20:00"},"AIN",{"$f":"IF(ISNUMBER(P10),IF(OR(ISBLANK(Q10),WEEKDAY($B10,2)=7),0,IF(WEEKDAY($B10,2)<=5,HLOOKUP(Q10,parametres!$C$1:$S$3,2,FALSE),HLOOKUP(Q10,parametres!$C$1:$S$3,3,FALSE))))","v":"04:40:00"}]
["2025-02-08","2025-02-08","MALADIE",{"$f":"IF(ISNUMBER(B11),IF(OR(ISBLANK(C11),WEEKDAY($B11,2)=7),0,IF(WEEKDAY($B11,2)<=5,HLOOKUP(C11,parametres!$C$1:$S$3,2,FALSE),HLOOKUP(C11,parametres!$C$1:$S$3,3,FALSE))))","v":"00:00:00"},"MALADIE",{"$f":"IF(ISNUMBER(D11),IF(OR(ISBLANK(E11),WEEKDAY($B11,2)=7),0,IF(WEEKDAY($B11,2)<=5,HLOOKUP(E11,parametres!$C$1:$S$3,2,FALSE),HLOOKUP(E11,parametres!$C$1:$S$3,3,FALSE))))","v":"00:00:00"},"CLUNY",{"$f":"IF(ISNUMBER(F11),IF(OR(ISBLANK(G11),WEEKDAY($B11,2)=7),0,IF(WEEKDAY($B11,2)<=5,HLOOKUP(G11,parametres!$C$1:$S$3,2,FALSE),HLOOKUP(G11,parametres!$C$1:$S$3,3,FALSE))))","v":"03:00:00"},"CRECHES",{"$f":"IF(ISNUMBER(H11),IF(OR(ISBLANK(I11),WEEKDAY($B11,2)=7),0,IF(WEEKDAY($B11,2)<=5,HLOOKUP(I11,parametres!$C$1:$S$3,2,FALSE),HLOOKUP(I11,parametres!$C$1:$S$3,3,FALSE))))","v":"02:55:00"},"PARAY",{"$f":"IF(ISNUMBER(J11),IF(OR(ISBLANK(K11),WEEKDAY($B11,2)=7),0,IF(WEEKDAY($B11,2)<=5,HLOOKUP(K11,parametres!$C$1:$S$3,2,FALSE),HLOOKUP(K11,parametres!$C$1:$S$3,3,FALSE))))","v":"04:15:00"},"AIN",{"$f":"IF(ISNUMBER(L11),IF(OR(ISBLANK(M11),WEEKDAY($B11,2)=7),0,IF(WEEKDAY($B11,2)<=5,HLOOKUP(M11,parametres!$C$1:$S$3,2,FALSE),HLOOKUP(M11,parametres!$C$1:$S$3,3,FALSE))))","v":"03:20:00"},"VALLONS",{"$f":"IF(ISNUMBER(N11),IF(OR(ISBLANK(O11),WEEKDAY($B11,2)=7),0,IF(WEEKDAY($B11,2)<=5,HLOOKUP(O11,parametres!$C$1:$S$3,2,FALSE),HLOOKUP(O11,parametres!$C$1:$S$3,3,FALSE))))","v":"03:25:00"},"REPOS",{"$f":"IF(ISNUMBER(P11),IF(OR(ISBLANK(Q11),WEEKDAY($B11,2)=7),0,IF(WEEKDAY($B11,2)<=5,HLOOKUP(Q11,parametres!$C$1:$S$3,2,FALSE),HLOOKUP(Q11,parametres!$C$1:$S$3,3,FALSE))))","v":"00:00:00"}]
["2025-02-09","2025-02-09",null,{"$f":"IF(ISNUMBER(B12),IF(OR(ISBLANK(C12),WEEKDAY($B12,2)=7),0,IF(WEEKDAY($B12,2)<=5,HLOOKUP(C12,parametres!$C$1:$S$3,2,FALSE),HLOOKUP(C12,parametres!$C$1:$S$3,3,FALSE))))","v":"00:00:00"},null,{"$f":"IF(ISNUMBER(D12),IF(OR(ISBLANK(E12),WEEKDAY($B12,2)=7),0,IF(WEEKDAY($B12,2)<=5,HLOOKUP(E12,parametres!$C$1:$S$3,2,FALSE),HLOOKUP(E12,parametres!$C$1:$S$3,3,FALSE))))","v":"00:00:00"},null,{"$f":"IF(ISNUMBER(F12),IF(OR(ISBLANK(G12),WEEKDAY($B12,2)=7),0,IF(WEEKDAY($B12,2)<=5,HLOOKUP(G12,parametres!$C$1:$S$3,2,FALSE),HLOOKUP(G12,parametres!$C$1:$S$3,3,FALSE))))","v":"00:00:00"},null,{"$f":"IF(ISNUMBER(H12),IF(OR(ISBLANK(I12),WEEKDAY($B12,2)=7),0,IF(WEEKDAY($B12,2)<=5,HLOOKUP(I12,parametres!$C$1:$S$3,2,FALSE),HLOOKUP(I12,parametres!$C$1:$S$3,3,FALSE))))","v":"00:00:00"},null,{"$f":"IF(ISNUMBER(J12),IF(OR(ISBLANK(K12),WEEKDAY($B12,2)=7),0,IF(WEEKDAY($B12,2)<=5,HLOOKUP(K12,parametres!$C$1:$S$3,2,FALSE),HLOOKUP(K12,parametres!$C$1:$S$3,3,FALSE))))","v":"00:00:00"},null,{"$f":"IF(ISNUMBER(L12),IF(OR(ISBLANK(M12),WEEKDAY($B12,2)=7),0,IF(WEEKDAY($B12,2)<=5,HLOOKUP(M12,parametres!$C$1:$S$3,2,FALSE),HLOOKUP(M12,parametres!$C$1:$S$3,3,FALSE))))","v":"00:00:00"},null,{"$f":"IF(ISNUMBER(N12),IF(OR(ISBLANK(O12),WEEKDAY($B12,2)=7),0,IF(WEEKDAY($B12,2)<=5,HLOOKUP(O12,parametres!$C$1:$S$3,2,FALSE),HLOOKUP(O12,parametres!$C$1:$S$3,3,FALSE))))","v":"00:00:00"},null,{"$f":"IF(ISNUMBER(P12),IF(OR(ISBLANK(Q12),WEEKDAY($B12,2)=7),0,IF(WEEKDAY($B12,2)<=5,HLOOKUP(Q12,parametres!$C$1:$S$3,2,FALSE),HLOOKUP(Q12,parametres!$C$1:$S$3,3,FALSE))))","v":"00:00:00"}]
["2025-02-10","2025-02-10","MALADIE",{"$f":"IF(ISNUMBER(B13),IF(OR(ISBLANK(C13),WEEKDAY($B13,2)=7),0,IF(WEEKDAY($B13,2)<=5,HLOOKUP(C13,parametres!$C$1:$S$3,2,FALSE),HLOOKUP(C13,parametres!$C$1:$S$3,3,FALSE))))","v":"00:00:00"},"MALADIE",{"$f":"IF(ISNUMBER(D13),IF(OR(ISBLANK(E13),WEEKDAY($B13,2)=7),0,IF(WEEKDAY($B13,2)<=5,HLOOKUP(E13,parametres!$C$1:$S$3,2,FALSE),HLOOKUP(E13,parametres!$C$1:$S$3,3,FALSE))))","v":"00:00:00"},"REPOS",{"$f":"IF(ISNUMBER(F13),IF(OR(ISBLANK(G13),WEEKDAY($B13,2)=7),0,IF(WEEKDAY($B13,2)<=5,HLOOKUP(G13,parametres!$C$1:$S$3,2,FALSE),HLOOKUP(G13,parametres!$C$1:$S$3,3,FALSE))))","v":"00:00:00"},"CRECHES",{"$f":"IF(ISNUMBER(H13),IF(OR(ISBLANK(I13),WEEKDAY($B13,2)=7),0,IF(WEEKDAY($B13,2)<=5,HLOOKUP(I13,parametres!$C$1:$S$3,2,FALSE),HLOOKUP(I13,parametres!$C$1:$S$3,3,FALSE))))","v":"06:45:00"},"PARAY",{"$f":"IF(ISNUMBER(J13),IF(OR(ISBLANK(K13),WEEKDAY($B13,2)=7),0,IF(WEEKDAY($B13,2)<=5,HLOOKUP(K13,parametres!$C$1:$S$3,2,FALSE),HLOOKUP(K13,parametres!$C$1:$S$3,3,FALSE))))","v":"05:00:00"},"CLUNY",{"$f":"IF(ISNUMBER(L13),IF(OR(ISBLANK(M13),WEEKDAY($B13,2)=7),0,IF(WEEKDAY($B13,2)<=5,HLOOKUP(M13,parametres!$C$1:$S$3,2,FALSE),HLOOKUP(M13,parametres!$C$1:$S$3,3,FALSE))))","v":"04:15:00"},"VALLONS",{"$f":"IF(ISNUMBER(N13),IF(OR(ISBLANK(O13),WEEKDAY($B13,2)=7),0,IF(WEEKDAY($B13,2)<=5,HLOOKUP(O13,parametres!$C$1:$S$3,2,FALSE),HLOOKUP(O13,parametres!$C$1:$S$3,3,FALSE))))","v":"05:20:00"},"AIN",{"$f":"IF(ISNUMBER(P13),IF(OR(ISBLANK(Q13),WEEKDAY($B13,2)=7),0,IF(WEEKDAY($B13,2)<=5,HLOOKUP(Q13,parametres!$C$1:$S$3,2,FALSE),HLOOKUP(Q13,parametres!$C$1:$S$3,3,FALSE))))","v":"04:40:00"}]
["2025-02-11","2025-02-11","MALADIE",{"$f":"IF(ISNUMBER(B14),IF(OR(ISBLANK(C14),WEEKDAY($B14,2)=7),0,IF(WEEKDAY($B14,2)<=5,HLOOKUP(C14,parametres!$C$1:$S$3,2,FALSE),HLOOKUP(C14,parametres!$C$1:$S$3,3,FALSE))))","v":"00:00:00"},"MALADIE",{"$f":"IF(ISNUMBER(D14),IF(OR(ISBLANK(E14),WEEKDAY($B14,2)=7),0,IF(WEEKDAY($B14,2)<=5,HLOOKUP(E14,parametres!$C$1:$S$3,2,FALSE),HLOOKUP(E14,parametres!$C$1:$S$3,3,FALSE))))","v":"00:00:00"},"CLUNY",{"$f":"IF(ISNUMBER(F14),IF(OR(ISBLANK(G14),WEEKDAY($B14,2)=7),0,IF(WEEKDAY($B14,2)<=5,HLOOKUP(G14,parametres!$C$1:$S$3,2,FALSE),HLOOKUP(G14,parametres!$C$1:$S$3,3,FALSE))))","v":"04:15:00"},"CRECHES",{"$f":"IF(ISNUMBER(H14),IF(OR(ISBLANK(I14),WEEKDAY($B14,2)=7),0,IF(WEEKDAY($B14,2)<=5,HLOOKUP(I14,parametres!$C$1:$S$3,2,FALSE),HLOOKUP(I14,parametres!$C$1:$S$3,3,FALSE))))","v":"06:45:00"},"PARAY",{"$f":"IF(ISNUMBER(J14),IF(OR(ISBLANK(K14),WEEKDAY($B14,2)=7),0,IF(WEEKDAY($B14,2)<=5,HLOOKUP(K14,parametres!$C$1:$S$3,2,FALSE),HLOOKUP(K14,parametres!$C$1:$S$3,3,FALSE))))","v":"05:00:00"},"VALLONS",{"$f":"IF(ISNUMBER(L14),IF(OR(ISBLANK(M14),WEEKDAY($B14,2)=7),0,IF(WEEKDAY($B14,2)<=5,HLOOKUP(M14,parametres!$C$1:$S$3,2,FALSE),HLOOKUP(M14,parametres!$C$1:$S$3,3,FALSE))))","v":"05:20:00"},"REPOS",{"$f":"IF(ISNUMBER(N14),IF(OR(ISBLANK(O14),WEEKDAY($B14,2)=7),0,IF(WEEKDAY($B14,2)<=5,HLOOKUP(O14,parametres!$C$1:$S$3,2,FALSE),HLOOKUP(O14,parametres!$C$1:$S$3,3,FALSE))))","v":"00:00:00"},"AIN",{"$f":"IF(ISNUMBER(P14),IF(OR(ISBLANK(Q14),WEEKDAY($B14,2)=7),0,IF(WEEKDAY($B14,2)<=5,HLOOKUP(Q14,parametres!$C$1:$S$3,2,FALSE),HLOOKUP(Q14,parametres!$C$1:$S$3,3,FALSE))))","v":"04:40:00"}]
["2025-02-12","2025-02-12","MALADIE",{"$f":"IF(ISNUMBER(B15),IF(OR(ISBLANK(C15),WEEKDAY($B15,2)=7),0,IF(WEEKDAY($B15,2)<=5,HLOOKUP(C15,parametres!$C$1:$S$3,2,FALSE),HLOOKUP(C15,parametres!$C$1:$S$3,3,FALSE))))","v":"00:00:00"},"MALADIE",{"$f":"IF(ISNUMBER(D15),IF(OR(ISBLANK(E15),WEEKDAY($B15,2)=7),0,IF(WEEKDAY($B15,2)<=5,HLOOKUP(E15,parametres!$C$1:$S$3,2,FALSE),HLOOKUP(E15,parametres!$C$1:$S$3,3,FALSE))))","v":"00:00:00"},"CLUNY",{"$f":"IF(ISNUMBER(F15),IF(OR(ISBLANK(G15),WEEKDAY($B15,2)=7),0,IF(WEEKDAY($B15,2)<=5,HLOOKUP(G15,parametres!$C$1:$S$3,2,FALSE),HLOOKUP(G15,parametres!$C$1:$S$3,3,FALSE))))","v":"04:15:00"},"CRECHES",{"$f":"IF(ISNUMBER(H15),IF(OR(ISBLANK(I15),WEEKDAY($B15,2)=7),0,IF(WEEKDAY($B15,2)<=5,HLOOKUP(I15,parametres!$C$1:$S$3,2,FALSE),HLOOKUP(I15,parametres!$C$1:$S$3,3,FALSE))))","v":"06:45:00"},"PARAY",{"$f":"IF(ISNUMBER(J15),IF(OR(ISBLANK(K15),WEEKDAY($B15,2)=7),0,IF(WEEKDAY($B15,2)<=5,HLOOKUP(K15,parametres!$C$1:$S$3,2,FALSE),HLOOKUP(K15,parametres!$C$1:$S$3,3,FALSE))))","v":"05:00:00"},"REPOS",{"$f":"IF(ISNUMBER(L15),IF(OR(ISBLANK(M15),WEEKDAY($B15,2)=7),0,IF(WEEKDAY($B15,2)<=5,HLOOKUP(M15,parametres!$C$1:$S$3,2,FALSE),HLOOKUP(M15,parametres!$C$1:$S$3,3,FALSE))))","v":"00:00:00"},"VALLONS",{"$f":"IF(ISNUMBER(N15),IF(OR(ISBLANK(O15),WEEKDAY($B15,2)=7),0,IF(WEEKDAY($B15,2)<=5,HLOOKUP(O15,parametres!$C$1:$S$3,2,FALSE),HLOOKUP(O15,parametres!$C$1:$S$3,3,FALSE))))","v":"05:20:00"},"AIN",{"$f":"IF(ISNUMBER(P15),IF(OR(ISBLANK(Q15),WEEKDAY($B15,2)=7),0,IF(WEEKDAY($B15,2)<=5,HLOOKUP(Q15,parametres!$C$1:$S$3,2,FALSE),HLOOKUP(Q15,parametres!$C$1:$S$3,3,FALSE))))","v":"04:40:00"}]
["2025-02-13","2025-02-13","MALADIE",{"$f":"IF(ISNUMBER(B16),IF(OR(ISBLANK(C16),WEEKDAY($B16,2)=7),0,IF(WEEKDAY($B16,2)<=5,HLOOKUP(C16,parametres!$C$1:$S$3,2,FALSE),HLOOKUP(C16,parametres!$C$1:$S$3,3,FALSE))))","v":"00:00:00"},"MALADIE",{"$f":"IF(ISNUMBER(D16),IF(OR(ISBLANK(E16),WEEKDAY($B16,2)=7),0,IF(WEEKDAY($B16,2)<=5,HLOOKUP(E16,parametres!$C$1:$S$3,2,FALSE),HLOOKUP(E16,parametres!$C$1:$S$3,3,FALSE))))","v":"00:00:00"},"CLUNY",{"$f":"IF(ISNUMBER(F16),IF(OR(ISBLANK(G16),WEEKDAY($B16,2)=7),0,IF(WEEKDAY($B16,2)<=5,HLOOKUP(G16,parametres!$C$1:$S$3,2,FALSE),HLOOKUP(G16,parametres!$C$1:$S$3,3,FALSE))))","v":"04:15:00"},"CRECHES",{"$f":"IF(ISNUMBER(H16),IF(OR(ISBLANK(I16),WEEKDAY($B16,2)=7),0,IF(WEEKDAY($B16,2)<=5,HLOOKUP(I16,parametres!$C$1:$S$3,2,FALSE),HLOOKUP(I16,parametres!$C$1:$S$3,3,FALSE))))","v":"06:45:00"},"REPOS",{"$f":"IF(ISNUMBER(J16),IF(OR(ISBLANK(K16),WEEKDAY($B16,2)=7),0,IF(WEEKDAY($B16,2)<=5,HLOOKUP(K16,parametres!$C$1:$S$3,2,FALSE),HLOOKUP(K16,parametres!$C$1:$S$3,3,FALSE))))","v":"00:00:00"},"PARAY",{"$f":"IF(ISNUMBER(L16),IF(OR(ISBLANK(M16),WEEKDAY($B16,2)=7),0,IF(WEEKDAY($B16,2)<=5,HLOOKUP(M16,parametres!$C$1:$S$3,2,FALSE),HLOOKUP(M16,parametres!$C$1:$S$3,3,FALSE))))","v":"05:00:00"},"VALLONS",{"$f":"IF(ISNUMBER(N16),IF(OR(ISBLANK(O16),WEEKDAY($B16,2)=7),0,IF(WEEKDAY($B16,2)<=5,HLOOKUP(O16,parametres!$C$1:$S$3,2,FALSE),HLOOKUP(O16,parametres!$C$1:$S$3,3,FALSE))))","v":"05:20:00"},"AIN",{"$f":"IF(ISNUMBER(P16),IF(OR(ISBLANK(Q16),WEEKDAY($B16,2)=7),0,IF(WEEKDAY($B16,2)<=5,HLOOKUP(Q16,parametres!$C$1:$S$3,2,FALSE),HLOOKUP(Q16,parametres!$C$1:$S$3,3,FALSE))))","v":"04:40:00"}]
["2025-02-14","2025-02-14","MALADIE",{"$f":"IF(ISNUMBER(B17),IF(OR(ISBLANK(C17),WEEKDAY($B17,2)=7),0,IF(WEEKDAY($B17,2)<=5,HLOOKUP(C17,parametres!$C$1:$S$3,2,FALSE),HLOOKUP(C17,parametres!$C$1:$S$3,3,FALSE))))","v":"00:00:00"},"MALADIE",{"$f":"IF(ISNUMBER(D17),IF(OR(ISBLANK(E17),WEEKDAY($B17,2)=7),0,IF(WEEKDAY($B17,2)<=5,HLOOKUP(E17,parametres!$C$1:$S$3,2,FALSE),HLOOKUP(E17,parametres!$C$1:$S$3,3,FALSE))))","v":"00:00:00"},"CLUNY",{"$f":"IF(ISNUMBER(F17),IF(OR(ISBLANK(G17),WEEKDAY($B17,2)=7),0,IF(WEEKDAY($B17,2)<=5,HLOOKUP(G17,parametres!$C$1:$S$3,2,FALSE),HLOOKUP(G17,parametres!$C$1:$S$3,3,FALSE))))","v":"04:15:00"},"CRECHES",{"$f":"IF(ISNUMBER(H17),IF(OR(ISBLANK(I17),WEEKDAY($B17,2)=7),0,IF(WEEKDAY($B17,2)<=5,HLOOKUP(I17,parametres!$C$1:$S$3,2,FALSE),HLOOKUP(I17,parametres!$C$1:$S$3,3,FALSE))))","v":"06:45:00"},"PARAY",{"$f":"IF(ISNUMBER(J17),IF(OR(ISBLANK(K17),WEEKDAY($B17,2)=7),0,IF(WEEKDAY($B17,2)<=5,HLOOKUP(K17,parametres!$C$1:$S$3,2,FALSE),HLOOKUP(K17,parametres!$C$1:$S$3,3,FALSE))))","v":"05:00:00"},"AIN",{"$f":"IF(ISNUMBER(L17),IF(OR(ISBLANK(M17),WEEKDAY($B17,2)=7),0,IF(WEEKDAY($B17,2)<=5,HLOOKUP(M17,parametres!$C$1:$S$3,2,FALSE),HLOOKUP(M17,parametres!$C$1:$S$3,3,FALSE))))","v":"04:40:00"},"VALLONS",{"$f":"IF(ISNUMBER(N17),IF(OR(ISBLANK(O17),WEEKDAY($B17,2)=7),0,IF(WEEKDAY($B17,2)<=5,HLOOKUP(O17,parametres!$C$1:$S$3,2,FALSE),HLOOKUP(O17,parametres!$C$1:$S$3,3,FALSE))))","v":"05:20:00"},"REPOS",{"$f":"IF(ISNUMBER(P17),IF(OR(ISBLANK(Q17),WEEKDAY($B17,2)=7),0,IF(WEEKDAY($B17,2)<=5,HLOOKUP(Q17,parametres!$C$1:$S$3,2,FALSE),HLOOKUP(Q17,parametres!$C$1:$S$3,3,FALSE))))","v":"00:00:00"}]
["2025-02-15","2025-02-15","MALADIE",{"$f":"IF(ISNUMBER(B18),IF(OR(ISBLANK(C18),WEEKDAY($B18,2)=7),0,IF(WEEKDAY($B18,2)<=5,HLOOKUP(C18,parametres!$C$1:$S$3,2,FALSE),HLOOKUP(C18,parametres!$C$1:$S$3,3,FALSE))))","v":"00:00:00"},"MALADIE",{"$f":"IF(ISNUMBER(D18),IF(OR(ISBLANK(E18),WEEKDAY($B18,2)=7),0,IF(WEEKDAY($B18,2)<=5,HLOOKUP(E18,parametres!$C$1:$S$3,2,FALSE),HLOOKUP(E18,parametres!$C$1:$S$3,3,FALSE))))","v":"00:00:00"},"CLUNY",{"$f":"IF(ISNUMBER(F18),IF(OR(ISBLANK(G18),WEEKDAY($B18,2)=7),0,IF(WEEKDAY($B18,2)<=5,HLOOKUP(G18,parametres!$C$1:$S$3,2,FALSE),HLOOKUP(G18,parametres!$C$1:$S$3,3,FALSE))))","v":"03:00:00"},"CRECHES",{"$f":"IF(ISNUMBER(H18),IF(OR(ISBLANK(I18),WEEKDAY($B18,2)=7),0,IF(WEEKDAY($B18,2)<=5,HLOOKUP(I18,parametres!$C$1:$S$3,2,FALSE),HLOOKUP(I18,parametres!$C$1:$S$3,3,FALSE))))","v":"02:55:00"},"REPOS",{"$f":"IF(ISNUMBER(J18),IF(OR(ISBLANK(K18),WEEKDAY($B18,2)=7),0,IF(WEEKDAY($B18,2)<=5,HLOOKUP(K18,parametres!$C$1:$S$3,2,FALSE),HLOOKUP(K18,parametres!$C$1:$S$3,3,FALSE))))","v":"00:00:00"},"PARAY",{"$f":"IF(ISNUMBER(L18),IF(OR(ISBLANK(M18),WEEKDAY($B18,2)=7),0,IF(WEEKDAY($B18,2)<=5,HLOOKUP(M18,parametres!$C$1:$S$3,2,FALSE),HLOOKUP(M18,parametres!$C$1:$S$3,3,FALSE))))","v":"04:15:00"},"VALLONS",{"$f":"IF(ISNUMBER(N18),IF(OR(ISBLANK(O18),WEEKDAY($B18,2)=7),0,IF(WEEKDAY($B18,2)<=5,HLOOKUP(O18,parametres!$C$1:$S$3,2,FALSE),HLOOKUP(O18,parametres!$C$1:$S$3,3,FALSE))))","v":"03:25:00"},"AIN",{"$f":"IF(ISNUMBER(P18),IF(OR(ISBLANK(Q18),WEEKDAY($B18,2)=7),0,IF(WEEKDAY($B18,2)<=5,HLOOKUP(Q18,parametres!$C$1:$S$3,2,FALSE),HLOOKUP(Q18,parametres!$C$1:$S$3,3,FALSE))))","v":"03:20:00"}]
["2025-02-16","2025-02-16",null,{"$f":"IF(ISNUMBER(B19),IF(OR(ISBLANK(C19),WEEKDAY($B19,2)=7),0,IF(WEEKDAY($B19,2)<=5,HLOOKUP(C19,parametres!$C$1:$S$3,2,FALSE),HLOOKUP(C19,parametres!$C$1:$S$3,3,FALSE))))","v":"00:00:00"},null,{"$f":"IF(ISNUMBER(D19),IF(OR(ISBLANK(E19),WEEKDAY($B19,2)=7),0,IF(WEEKDAY($B19,2)<=5,HLOOKUP(E19,parametres!$C$1:$S$3,2,FALSE),HLOOKUP(E19,parametres!$C$1:$S$3,3,FALSE))))","v":"00:00:00"},null,{"$f":"IF(ISNUMBER(F19),IF(OR(ISBLANK(G19),WEEKDAY($B19,2)=7),0,IF(WEEKDAY($B19,2)<=5,HLOOKUP(G19,parametres!$C$1:$S$3,2,FALSE),HLOOKUP(G19,parametres!$C$1:$S$3,3,FALSE))))","v":"00:00:00"},null,{"$f":"IF(ISNUMBER(H19),IF(OR(ISBLANK(I19),WEEKDAY($B19,2)=7),0,IF(WEEKDAY($B19,2)<=5,HLOOKUP(I19,parametres!$C$1:$S$3,2,FALSE),HLOOKUP(I19,parametres!$C$1:$S$3,3,FALSE))))","v":"00:00:00"},null,{"$f":"IF(ISNUMBER(J19),IF(OR(ISBLANK(K19),WEEKDAY($B19,2)=7),0,IF(WEEKDAY($B19,2)<=5,HLOOKUP(K19,parametres!$C$1:$S$3,2,FALSE),HLOOKUP(K19,parametres!$C$1:$S$3,3,FALSE))))","v":"00:00:00"},null,{"$f":"IF(ISNUMBER(L19),IF(OR(ISBLANK(M19),WEEKDAY($B19,2)=7),0,IF(WEEKDAY($B19,2)<=5,HLOOKUP(M19,parametres!$C$1:$S$3,2,FALSE),HLOOKUP(M19,parametres!$C$1:$S$3,3,FALSE))))","v":"00:00:00"},null,{"$f":"IF(ISNUMBER(N19),IF(OR(ISBLANK(O19),WEEKDAY($B19,2)=7),0,IF(WEEKDAY($B19,2)<=5,HLOOKUP(O19,parametres!$C$1:$S$3,2,FALSE),HLOOKUP(O19,parametres!$C$1:$S$3,3,FALSE))))","v":"00:00:00"},null,{"$f":"IF(ISNUMBER(P19),IF(OR(ISBLANK(Q19),WEEKDAY($B19,2)=7),0,IF(WEEKDAY($B19,2)<=5,HLOOKUP(Q19,parametres!$C$1:$S$3,2,FALSE),HLOOKUP(Q19,parametres!$C$1:$S$3,3,FALSE))))","v":"00:00:00"}]
["2025-02-17","2025-02-17","VALLONS",{"$f":"IF(ISNUMBER(B20),IF(OR(ISBLANK(C20),WEEKDAY($B20,2)=7),0,IF(WEEKDAY($B20,2)<=5,HLOOKUP(C20,parametres!$C$1:$S$3,2,FALSE),HLOOKUP(C20,parametres!$C$1:$S$3,3,FALSE))))","v":"05:20:00"},"MALADIE",{"$f":"IF(ISNUMBER(D20),IF(OR(ISBLANK(E20),WEEKDAY($B20,2)=7),0,IF(WEEKDAY($B20,2)<=5,HLOOKUP(E20,parametres!$C$1:$S$3,2,FALSE),HLOOKUP(E20,parametres!$C$1:$S$3,3,FALSE))))","v":"00:00:00"},"CLUNY",{"$f":"IF(ISNUMBER(F20),IF(OR(ISBLANK(G20),WEEKDAY($B20,2)=7),0,IF(WEEKDAY($B20,2)<=5,HLOOKUP(G20,parametres!$C$1:$S$3,2,FALSE),HLOOKUP(G20,parametres!$C$1:$S$3,3,FALSE))))","v":"04:15:00"},"REPOS",{"$f":"IF(ISNUMBER(H20),IF(OR(ISBLANK(I20),WEEKDAY($B20,2)=7),0,IF(WEEKDAY($B20,2)<=5,HLOOKUP(I20,parametres!$C$1:$S$3,2,FALSE),HLOOKUP(I20,parametres!$C$1:$S$3,3,FALSE))))","v":"00:00:00"},"PARAY",{"$f":"IF(ISNUMBER(J20),IF(OR(ISBLANK(K20),WEEKDAY($B20,2)=7),0,IF(WEEKDAY($B20,2)<=5,HLOOKUP(K20,parametres!$C$1:$S$3,2,FALSE),HLOOKUP(K20,parametres!$C$1:$S$3,3,FALSE))))","v":"05:00:00"},"REPOS",{"$f":"IF(ISNUMBER(L20),IF(OR(ISBLANK(M20),WEEKDAY($B20,2)=7),0,IF(WEEKDAY($B20,2)<=5,HLOOKUP(M20,parametres!$C$1:$S$3,2,FALSE),HLOOKUP(M20,parametres!$C$1:$S$3,3,FALSE))))","v":"00:00:00"},"AIN",{"$f":"IF(ISNUMBER(N20),IF(OR(ISBLANK(O20),WEEKDAY($B20,2)=7),0,IF(WEEKDAY($B20,2)<=5,HLOOKUP(O20,parametres!$C$1:$S$3,2,FALSE),HLOOKUP(O20,parametres!$C$1:$S$3,3,FALSE))))","v":"04:40:00"},"CRECHES",{"$f":"IF(ISNUMBER(P20),IF(OR(ISBLANK(Q20),WEEKDAY($B20,2)=7),0,IF(WEEKDAY($B20,2)<=5,HLOOKUP(Q20,parametres!$C$1:$S$3,2,FALSE),HLOOKUP(Q20,parametres!$C$1:$S$3,3,FALSE))))","v":"06:45:00"}]
["2025-02-18","2025-02-18","VALLONS",{"$f":"IF(ISNUMBER(B21),IF(OR(ISBLANK(C21),WEEKDAY($B21,2)=7),0,IF(WEEKDAY($B21,2)<=5,HLOOKUP(C21,parametres!$C$1:$S$3,2,FALSE),HLOOKUP(C21,parametres!$C$1:$S$3,3,FALSE))))","v":"05:20:00"},"MALADIE",{"$f":"IF(ISNUMBER(D21),IF(OR(ISBLANK(E21),WEEKDAY($B21,2)=7),0,IF(WEEKDAY($B21,2)<=5,HLOOKUP(E21,parametres!$C$1:$S$3,2,FALSE),HLOOKUP(E21,parametres!$C$1:$S$3,3,FALSE))))","v":"00:00:00"},"CLUNY",{"$f":"IF(ISNUMBER(F21),IF(OR(ISBLANK(G21),WEEKDAY($B21,2)=7),0,IF(WEEKDAY($B21,2)<=5,HLOOKUP(G21,parametres!$C$1:$S$3,2,FALSE),HLOOKUP(G21,parametres!$C$1:$S$3,3,FALSE))))","v":"04:15:00"},"REPOS",{"$f":"IF(ISNUMBER(H21),IF(OR(ISBLANK(I21),WEEKDAY($B21,2)=7),0,IF(WEEKDAY($B21,2)<=5,HLOOKUP(I21,parametres!$C$1:$S$3,2,FALSE),HLOOKUP(I21,parametres!$C$1:$S$3,3,FALSE))))","v":"00:00:00"},"PARAY",{"$f":"IF(ISNUMBER(J21),IF(OR(ISBLANK(K21),WEEKDAY($B21,2)=7),0,IF(WEEKDAY($B21,2)<=5,HLOOKUP(K21,parametres!$C$1:$S$3,2,FALSE),HLOOKUP(K21,parametres!$C$1:$S$3,3,FALSE))))","v":"05:00:00"},"REPOS",{"$f":"IF(ISNUMBER(L21),IF(OR(ISBLANK(M21),WEEKDAY($B21,2)=7),0,IF(WEEKDAY($B21,2)<=5,HLOOKUP(M21,parametres!$C$1:$S$3,2,FALSE),HLOOKUP(M21,parametres!$C$1:$S$3,3,FALSE))))","v":"00:00:00"},"AIN",{"$f":"IF(ISNUMBER(N21),IF(OR(ISBLANK(O21),WEEKDAY($B21,2)=7),0,IF(WEEKDAY($B21,2)<=5,HLOOKUP(O21,parametres!$C$1:$S$3,2,FALSE),HLOOKUP(O21,parametres!$C$1:$S$3,3,FALSE))))","v":"04:40:00"},"CRECHES",{"$f":"IF(ISNUMBER(P21),IF(OR(ISBLANK(Q21),WEEKDAY($B21,2)=7),0,IF(WEEKDAY($B21,2)<=5,HLOOKUP(Q21,parametres!$C$1:$S$3,2,FALSE),HLOOKUP(Q21,parametres!$C$1:$S$3,3,FALSE))))","v":"06:45:00"}]
["2025-02-19","2025-02-19","VALLONS",{"$f":"IF(ISNUMBER(B22),IF(OR(ISBLANK(C22),WEEKDAY($B22,2)=7),0,IF(WEEKDAY($B22,2)<=5,HLOOKUP(C22,parametres!$C$1:$S$3,2,FALSE),HLOOKUP(C22,parametres!$C$1:$S$3,3,FALSE))))","v":"05:20:00"},"MALADIE",{"$f":"IF(ISNUMBER(D22),IF(OR(ISBLANK(E22),WEEKDAY($B22,2)=7),0,IF(WEEKDAY($B22,2)<=5,HLOOKUP(E22,parametres!$C$1:$S$3,2,FALSE),HLOOKUP(E22,parametres!$C$1:$S$3,3,FALSE))))","v":"00:00:00"},"REPOS",{"$f":"IF(ISNUMBER(F22),IF(OR(ISBLANK(G22),WEEKDAY($B22,2)=7),0,IF(WEEKDAY($B22,2)<=5,HLOOKUP(G22,parametres!$C$1:$S$3,2,FALSE),HLOOKUP(G22,parametres!$C$1:$S$3,3,FALSE))))","v":"00:00:00"},"REPOS",{"$f":"IF(ISNUMBER(H22),IF(OR(ISBLANK(I22),WEEKDAY($B22,2)=7),0,IF(WEEKDAY($B22,2)<=5,HLOOKUP(I22,parametres!$C$1:$S$3,2,FALSE),HLOOKUP(I22,parametres!$C$1:$S$3,3,FALSE))))","v":"00:00:00"},"PARAY",{"$f":"IF(ISNUMBER(J22),IF(OR(ISBLANK(K22),WEEKDAY($B22,2)=7),0,IF(WEEKDAY($B22,2)<=5,HLOOKUP(K22,parametres!$C$1:$S$3,2,FALSE),HLOOKUP(K22,parametres!$C$1:$S$3,3,FALSE))))","v":"05:00:00"},"CLUNY",{"$f":"IF(ISNUMBER(L22),IF(OR(ISBLANK(M22),WEEKDAY($B22,2)=7),0,IF(WEEKDAY($B22,2)<=5,HLOOKUP(M22,parametres!$C$1:$S$3,2,FALSE),HLOOKUP(M22,parametres!$C$1:$S$3,3,FALSE))))","v":"04:15:00"},"AIN",{"$f":"IF(ISNUMBER(N22),IF(OR(ISBLANK(O22),WEEKDAY($B22,2)=7),0,IF(WEEKDAY($B22,2)<=5,HLOOKUP(O22,parametres!$C$1:$S$3,2,FALSE),HLOOKUP(O22,parametres!$C$1:$S$3,3,FALSE))))","v":"04:40:00"},"CRECHES",{"$f":"IF(ISNUMBER(P22),IF(OR(ISBLANK(Q22),WEEKDAY($B22,2)=7),0,IF(WEEKDAY($B22,2)<=5,HLOOKUP(Q22,parametres!$C$1:$S$3,2,FALSE),HLOOKUP(Q22,parametres!$C$1:$S$3,3,FALSE))))","v":"06:45:00"}]
["2025-02-20","2025-02-20","VALLONS",{"$f":"IF(ISNUMBER(B23),IF(OR(ISBLANK(C23),WEEKDAY($B23,2)=7),0,IF(WEEKDAY($B23,2)<=5,HLOOKUP(C23,parametres!$C$1:$S$3,2,FALSE),HLOOKUP(C23,parametres!$C$1:$S$3,3,FALSE))))","v":"05:20:00"},"MALADIE",{"$f":"IF(ISNUMBER(D23),IF(OR(ISBLANK(E23),WEEKDAY($B23,2)=7),0,IF(WEEKDAY($B23,2)<=5,HLOOKUP(E23,parametres!$C$1:$S$3,2,FALSE),HLOOKUP(E23,parametres!$C$1:$S$3,3,FALSE))))","v":"00:00:00"},"CLUNY",{"$f":"IF(ISNUMBER(F23),IF(OR(ISBLANK(G23),WEEKDAY($B23,2)=7),0,IF(WEEKDAY($B23,2)<=5,HLOOKUP(G23,parametres!$C$1:$S$3,2,FALSE),HLOOKUP(G23,parametres!$C$1:$S$3,3,FALSE))))","v":"04:15:00"},"CRECHES",{"$f":"IF(ISNUMBER(H23),IF(OR(ISBLANK(I23),WEEKDAY($B23,2)=7),0,IF(WEEKDAY($B23,2)<=5,HLOOKUP(I23,parametres!$C$1:$S$3,2,FALSE),HLOOKUP(I23,parametres!$C$1:$S$3,3,FALSE))))","v":"06:45:00"},"REPOS",{"$f":"IF(ISNUMBER(J23),IF(OR(ISBLANK(K23),WEEKDAY($B23,2)=7),0,IF(WEEKDAY($B23,2)<=5,HLOOKUP(K23,parametres!$C$1:$S$3,2,FALSE),HLOOKUP(K23,parametres!$C$1:$S$3,3,FALSE))))","v":"00:00:00"},"PARAY",{"$f":"IF(ISNUMBER(L23),IF(OR(ISBLANK(M23),WEEKDAY($B23,2)=7),0,IF(WEEKDAY($B23,2)<=5,HLOOKUP(M23,parametres!$C$1:$S$3,2,FALSE),HLOOKUP(M23,parametres!$C$1:$S$3,3,FALSE))))","v":"05:00:00"},"REPOS",{"$f":"IF(ISNUMBER(N23),IF(OR(ISBLANK(O23),WEEKDAY($B23,2)=7),0,IF(WEEKDAY($B23,2)<=5,HLOOKUP(O23,parametres!$C$1:$S$3,2,FALSE),HLOOKUP(O23,parametres!$C$1:$S$3,3,FALSE))))","v":"00:00:00"},"AIN",{"$f":"IF(ISNUMBER(P23),IF(OR(ISBLANK(Q23),WEEKDAY($B23,2)=7),0,IF(WEEKDAY($B23,2)<=5,HLOOKUP(Q23,parametres!$C$1:$S$3,2,FALSE),HLOOKUP(Q23,parametres!$C$1:$S$3,3,FALSE))))","v":"04:40:00"}]
["2025-02-21","2025-02-21","VALLONS",{"$f":"IF(ISNUMBER(B24),IF(OR(ISBLANK(C24),WEEKDAY($B24,2)=7),0,IF(WEEKDAY($B24,2)<=5,HLOOKUP(C24,parametres!$C$1:$S$3,2,FALSE),HLOOKUP(C24,parametres!$C$1:$S$3,3,FALSE))))","v":"05:20:00"},"MALADIE",{"$f":"IF(ISNUMBER(D24),IF(OR(ISBLANK(E24),WEEKDAY($B24,2)=7),0,IF(WEEKDAY($B24,2)<=5,HLOOKUP(E24,parametres!$C$1:$S$3,2,FALSE),HLOOKUP(E24,parametres!$C$1:$S$3,3,FALSE))))","v":"00:00:00"},"CLUNY",{"$f":"IF(ISNUMBER(F24),IF(OR(ISBLANK(G24),WEEKDAY($B24,2)=7),0,IF(WEEKDAY($B24,2)<=5,HLOOKUP(G24,parametres!$C$1:$S$3,2,FALSE),HLOOKUP(G24,parametres!$C$1:$S$3,3,FALSE))))","v":"04:15:00"},"CRECHES",{"$f":"IF(ISNUMBER(H24),IF(OR(ISBLANK(I24),WEEKDAY($B24,2)=7),0,IF(WEEKDAY($B24,2)<=5,HLOOKUP(I24,parametres!$C$1:$S$3,2,FALSE),HLOOKUP(I24,parametres!$C$1:$S$3,3,FALSE))))","v":"06:45:00"},"PARAY",{"$f":"IF(ISNUMBER(J24),IF(OR(ISBLANK(K24),WEEKDAY($B24,2)=7),0,IF(WEEKDAY($B24,2)<=5,HLOOKUP(K24,parametres!$C$1:$S$3,2,FALSE),HLOOKUP(K24,parametres!$C$1:$S$3,3,FALSE))))","v":"05:00:00"},"AIN",{"$f":"IF(ISNUMBER(L24),IF(OR(ISBLANK(M24),WEEKDAY($B24,2)=7),0,IF(WEEKDAY($B24,2)<=5,HLOOKUP(M24,parametres!$C$1:$S$3,2,FALSE),HLOOKUP(M24,parametres!$C$1:$S$3,3,FALSE))))","v":"04:40:00"},"REPOS",{"$f":"IF(ISNUMBER(N24),IF(OR(ISBLANK(O24),WEEKDAY($B24,2)=7),0,IF(WEEKDAY($B24,2)<=5,HLOOKUP(O24,parametres!$C$1:$S$3,2,FALSE),HLOOKUP(O24,parametres!$C$1:$S$3,3,FALSE))))","v":"00:00:00"},"REPOS",{"$f":"IF(ISNUMBER(P24),IF(OR(ISBLANK(Q24),WEEKDAY($B24,2)=7),0,IF(WEEKDAY($B24,2)<=5,HLOOKUP(Q24,parametres!$C$1:$S$3,2,FALSE),HLOOKUP(Q24,parametres!$C$1:$S$3,3,FALSE))))","v":"00:00:00"}]
["2025-02-22","2025-02-22","VALLONS",{"$f":"IF(ISNUMBER(B25),IF(OR(ISBLANK(C25),WEEKDAY($B25,2)=7),0,IF(WEEKDAY($B25,2)<=5,HLOOKUP(C25,parametres!$C$1:$S$3,2,FALSE),HLOOKUP(C25,parametres!$C$1:$S$3,3,FALSE))))","v":"03:25:00"},"MALADIE",{"$f":"IF(ISNUMBER(D25),IF(OR(ISBLANK(E25),WEEKDAY($B25,2)=7),0,IF(WEEKDAY($B25,2)<=5,HLOOKUP(E25,parametres!$C$1:$S$3,2,FALSE),HLOOKUP(E25,parametres!$C$1:$S$3,3,FALSE))))","v":"00:00:00"},"REPOS",{"$f":"IF(ISNUMBER(F25),IF(OR(ISBLANK(G25),WEEKDAY($B25,2)=7),0,IF(WEEKDAY($B25,2)<=5,HLOOKUP(G25,parametres!$C$1:$S$3,2,FALSE),HLOOKUP(G25,parametres!$C$1:$S$3,3,FALSE))))","v":"00:00:00"},"CRECHES",{"$f":"IF(ISNUMBER(H25),IF(OR(ISBLANK(I25),WEEKDAY($B25,2)=7),0,IF(WEEKDAY($B25,2)<=5,HLOOKUP(I25,parametres!$C$1:$S$3,2,FALSE),HLOOKUP(I25,parametres!$C$1:$S$3,3,FALSE))))","v":"02:55:00"},"PARAY",{"$f":"IF(ISNUMBER(J25),IF(OR(ISBLANK(K25),WEEKDAY($B25,2)=7),0,IF(WEEKDAY($B25,2)<=5,HLOOKUP(K25,parametres!$C$1:$S$3,2,FALSE),HLOOKUP(K25,parametres!$C$1:$S$3,3,FALSE))))","v":"04:15:00"},"CLUNY",{"$f":"IF(ISNUMBER(L25),IF(OR(ISBLANK(M25),WEEKDAY($B25,2)=7),0,IF(WEEKDAY($B25,2)<=5,HLOOKUP(M25,parametres!$C$1:$S$3,2,FALSE),HLOOKUP(M25,parametres!$C$1:$S$3,3,FALSE))))","v":"03:00:00"},"REPOS",{"$f":"IF(ISNUMBER(N25),IF(OR(ISBLANK(O25),WEEKDAY($B25,2)=7),0,IF(WEEKDAY($B25,2)<=5,HLOOKUP(O25,parametres!$C$1:$S$3,2,FALSE),HLOOKUP(O25,parametres!$C$1:$S$3,3,FALSE))))","v":"00:00:00"},"AIN",{"$f":"IF(ISNUMBER(P25),IF(OR(ISBLANK(Q25),WEEKDAY($B25,2)=7),0,IF(WEEKDAY($B25,2)<=5,HLOOKUP(Q25,parametres!$C$1:$S$3,2,FALSE),HLOOKUP(Q25,parametres!$C$1:$S$3,3,FALSE))))","v":"03:20:00"}]
["2025-02-23","2025-02-23",null,{"$f":"IF(ISNUMBER(B26),IF(OR(ISBLANK(C26),WEEKDAY($B26,2)=7),0,IF(WEEKDAY($B26,2)<=5,HLOOKUP(C26,parametres!$C$1:$S$3,2,FALSE),HLOOKUP(C26,parametres!$C$1:$S$3,3,FALSE))))","v":"00:00:00"},null,{"$f":"IF(ISNUMBER(D26),IF(OR(ISBLANK(E26),WEEKDAY($B26,2)=7),0,IF(WEEKDAY($B26,2)<=5,HLOOKUP(E26,parametres!$C$1:$S$3,2,FALSE),HLOOKUP(E26,parametres!$C$1:$S$3,3,FALSE))))","v":"00:00:00"},null,{"$f":"IF(ISNUMBER(F26),IF(OR(ISBLANK(G26),WEEKDAY($B26,2)=7),0,IF(WEEKDAY($B26,2)<=5,HLOOKUP(G26,parametres!$C$1:$S$3,2,FALSE),HLOOKUP(G26,parametres!$C$1:$S$3,3,FALSE))))","v":"00:00:00"},null,{"$f":"IF(ISNUMBER(H26),IF(OR(ISBLANK(I26),WEEKDAY($B26,2)=7),0,IF(WEEKDAY($B26,2)<=5,HLOOKUP(I26,parametres!$C$1:$S$3,2,FALSE),HLOOKUP(I26,parametres!$C$1:$S$3,3,FALSE))))","v":"00:00:00"},null,{"$f":"IF(ISNUMBER(J26),IF(OR(ISBLANK(K26),WEEKDAY($B26,2)=7),0,IF(WEEKDAY($B26,2)<=5,HLOOKUP(K26,parametres!$C$1:$S$3,2,FALSE),HLOOKUP(K26,parametres!$C$1:$S$3,3,FALSE))))","v":"00:00:00"},null,{"$f":"IF(ISNUMBER(L26),IF(OR(ISBLANK(M26),WEEKDAY($B26,2)=7),0,IF(WEEKDAY($B26,2)<=5,HLOOKUP(M26,parametres!$C$1:$S$3,2,FALSE),HLOOKUP(M26,parametres!$C$1:$S$3,3,FALSE))))","v":"00:00:00"},null,{"$f":"IF(ISNUMBER(N26),IF(OR(ISBLANK(O26),WEEKDAY($B26,2)=7),0,IF(WEEKDAY($B26,2)<=5,HLOOKUP(O26,parametres!$C$1:$S$3,2,FALSE),HLOOKUP(O26,parametres!$C$1:$S$3,3,FALSE))))","v":"00:00:00"},null,{"$f":"IF(ISNUMBER(P26),IF(OR(ISBLANK(Q26),WEEKDAY($B26,2)=7),0,IF(WEEKDAY($B26,2)<=5,HLOOKUP(Q26,parametres!$C$1:$S$3,2,FALSE),HLOOKUP(Q26,parametres!$C$1:$S$3,3,FALSE))))","v":"00:00:00"}]
["2025-02-24","2025-02-24","VALLONS",{"$f":"IF(ISNUMBER(B27),IF(OR(ISBLANK(C27),WEEKDAY($B27,2)=7),0,IF(WEEKDAY($B27,2)<=5,HLOOKUP(C27,parametres!$C$1:$S$3,2,FALSE),HLOOKUP(C27,parametres!$C$1:$S$3,3,FALSE))))","v":"05:20:00"},"MALADIE",{"$f":"IF(ISNUMBER(D27),IF(OR(ISBLANK(E27),WEEKDAY($B27,2)=7),0,IF(WEEKDAY($B27,2)<=5,HLOOKUP(E27,parametres!$C$1:$S$3,2,FALSE),HLOOKUP(E27,parametres!$C$1:$S$3,3,FALSE))))","v":"00:00:00"},"CLUNY",{"$f":"IF(ISNUMBER(F27),IF(OR(ISBLANK(G27),WEEKDAY($B27,2)=7),0,IF(WEEKDAY($B27,2)<=5,HLOOKUP(G27,parametres!$C$1:$S$3,2,FALSE),HLOOKUP(G27,parametres!$C$1:$S$3,3,FALSE))))","v":"04:15:00"},"CRECHES",{"$f":"IF(ISNUMBER(H27),IF(OR(ISBLANK(I27),WEEKDAY($B27,2)=7),0,IF(WEEKDAY($B27,2)<=5,HLOOKUP(I27,parametres!$C$1:$S$3,2,FALSE),HLOOKUP(I27,parametres!$C$1:$S$3,3,FALSE))))","v":"06:45:00"},"PARAY",{"$f":"IF(ISNUMBER(J27),IF(OR(ISBLANK(K27),WEEKDAY($B27,2)=7),0,IF(WEEKDAY($B27,2)<=5,HLOOKUP(K27,parametres!$C$1:$S$3,2,FALSE),HLOOKUP(K27,parametres!$C$1:$S$3,3,FALSE))))","v":"05:00:00"},"REPOS",{"$f":"IF(ISNUMBER(L27),IF(OR(ISBLANK(M27),WEEKDAY($B27,2)=7),0,IF(WEEKDAY($B27,2)<=5,HLOOKUP(M27,parametres!$C$1:$S$3,2,FALSE),HLOOKUP(M27,parametres!$C$1:$S$3,3,FALSE))))","v":"00:00:00"},"REPOS",{"$f":"IF(ISNUMBER(N27),IF(OR(ISBLANK(O27),WEEKDAY($B27,2)=7),0,IF(WEEKDAY($B27,2)<=5,HLOOKUP(O27,parametres!$C$1:$S$3,2,FALSE),HLOOKUP(O27,parametres!$C$1:$S$3,3,FALSE))))","v":"00:00:00"},"AIN",{"$f":"IF(ISNUMBER(P27),IF(OR(ISBLANK(Q27),WEEKDAY($B27,2)=7),0,IF(WEEKDAY($B27,2)<=5,HLOOKUP(Q27,parametres!$C$1:$S$3,2,FALSE),HLOOKUP(Q27,parametres!$C$1:$S$3,3,FALSE))))","v":"04:40:00"}]
["2025-02-25","2025-02-25","VALLONS",{"$f":"IF(ISNUMBER(B28),IF(OR(ISBLANK(C28),WEEKDAY($B28,2)=7),0,IF(WEEKDAY($B28,2)<=5,HLOOKUP(C28,parametres!$C$1:$S$3,2,FALSE),HLOOKUP(C28,parametres!$C$1:$S$3,3,FALSE))))","v":"05:20:00"},"MALADIE",{"$f":"IF(ISNUMBER(D28),IF(OR(ISBLANK(E28),WEEKDAY($B28,2)=7),0,IF(WEEKDAY($B28,2)<=5,HLOOKUP(E28,parametres!$C$1:$S$3,2,FALSE),HLOOKUP(E28,parametres!$C$1:$S$3,3,FALSE))))","v":"00:00:00"},"CLUNY",{"$f":"IF(ISNUMBER(F28),IF(OR(ISBLANK(G28),WEEKDAY($B28,2)=7),0,IF(WEEKDAY($B28,2)<=5,HLOOKUP(G28,parametres!$C$1:$S$3,2,FALSE),HLOOKUP(G28,parametres!$C$1:$S$3,3,FALSE))))","v":"04:15:00"},"CRECHES",{"$f":"IF(ISNUMBER(H28),IF(OR(ISBLANK(I28),WEEKDAY($B28,2)=7),0,IF(WEEKDAY($B28,2)<=5,HLOOKUP(I28,parametres!$C$1:$S$3,2,FALSE),HLOOKUP(I28,parametres!$C$1:$S$3,3,FALSE))))","v":"06:45:00"},"REPOS",{"$f":"IF(ISNUMBER(J28),IF(OR(ISBLANK(K28),WEEKDAY($B28,2)=7),0,IF(WEEKDAY($B28,2)<=5,HLOOKUP(K28,parametres!$C$1:$S$3,2,FALSE),HLOOKUP(K28,parametres!$C$1:$S$3,3,FALSE))))","v":"00:00:00"},"PARAY",{"$f":"IF(ISNUMBER(L28),IF(OR(ISBLANK(M28),WEEKDAY($B28,2)=7),0,IF(WEEKDAY($B28,2)<=5,HLOOKUP(M28,parametres!$C$1:$S$3,2,FALSE),HLOOKUP(M28,parametres!$C$1:$S$3,3,FALSE))))","v":"05:00:00"},"REPOS",{"$f":"IF(ISNUMBER(N28),IF(OR(ISBLANK(O28),WEEKDAY($B28,2)=7),0,IF(WEEKDAY($B28,2)<=5,HLOOKUP(O28,parametres!$C$1:$S$3,2,FALSE),HLOOKUP(O28,parametres!$C$1:$S$3,3,FALSE))))","v":"00:00:00"},"AIN",{"$f":"IF(ISNUMBER(P28),IF(OR(ISBLANK(Q28),WEEKDAY($B28,2)=7),0,IF(WEEKDAY($B28,2)<=5,HLOOKUP(Q28,parametres!$C$1:$S$3,2,FALSE),HLOOKUP(Q28,parametres!$C$1:$S$3,3,FALSE))))","v":"04:40:00"}]
["2025-02-26","2025-02-26","VALLONS",{"$f":"IF(ISNUMBER(B29),IF(OR(ISBLANK(C29),WEEKDAY($B29,2)=7),0,IF(WEEKDAY($B29,2)<=5,HLOOKUP(C29,parametres!$C$1:$S$3,2,FALSE),HLOOKUP(C29,parametres!$C$1:$S$3,3,FALSE))))","v":"05:20:00"},"MALADIE",{"$f":"IF(ISNUMBER(D29),IF(OR(ISBLANK(E29),WEEKDAY($B29,2)=7),0,IF(WEEKDAY($B29,2)<=5,HLOOKUP(E29,parametres!$C$1:$S$3,2,FALSE),HLOOKUP(E29,parametres!$C$1:$S$3,3,FALSE))))","v":"00:00:00"},"CLUNY",{"$f":"IF(ISNUMBER(F29),IF(OR(ISBLANK(G29),WEEKDAY($B29,2)=7),0,IF(WEEKDAY($B29,2)<=5,HLOOKUP(G29,parametres!$C$1:$S$3,2,FALSE),HLOOKUP(G29,parametres!$C$1:$S$3,3,FALSE))))","v":"04:15:00"},"CRECHES",{"$f":"IF(ISNUMBER(H29),IF(OR(ISBLANK(I29),WEEKDAY($B29,2)=7),0,IF(WEEKDAY($B29,2)<=5,HLOOKUP(I29,parametres!$C$1:$S$3,2,FALSE),HLOOKUP(I29,parametres!$C$1:$S$3,3,FALSE))))","v":"06:45:00"},"PARAY",{"$f":"IF(ISNUMBER(J29),IF(OR(ISBLANK(K29),WEEKDAY($B29,2)=7),0,IF(WEEKDAY($B29,2)<=5,HLOOKUP(K29,parametres!$C$1:$S$3,2,FALSE),HLOOKUP(K29,parametres!$C$1:$S$3,3,FALSE))))","v":"05:00:00"},"REPOS",{"$f":"IF(ISNUMBER(L29),IF(OR(ISBLANK(M29),WEEKDAY($B29,2)=7),0,IF(WEEKDAY($B29,2)<=5,HLOOKUP(M29,parametres!$C$1:$S$3,2,FALSE),HLOOKUP(M29,parametres!$C$1:$S$3,3,FALSE))))","v":"00:00:00"},"REPOS",{"$f":"IF(ISNUMBER(N29),IF(OR(ISBLANK(O29),WEEKDAY($B29,2)=7),0,IF(WEEKDAY($B29,2)<=5,HLOOKUP(O29,parametres!$C$1:$S$3,2,FALSE),HLOOKUP(O29,parametres!$C$1:$S$3,3,FALSE))))","v":"00:00:00"},"AIN",{"$f":"IF(ISNUMBER(P29),IF(OR(ISBLANK(Q29),WEEKDAY($B29,2)=7),0,IF(WEEKDAY($B29,2)<=5,HLOOKUP(Q29,parametres!$C$1:$S$3,2,FALSE),HLOOKUP(Q29,parametres!$C$1:$S$3,3,FALSE))))","v":"04:40:00"}]
["2025-02-27","2025-02-27","VALLONS",{"$f":"IF(ISNUMBER(B30),IF(OR(ISBLANK(C30),WEEKDAY($B30,2)=7),0,IF(WEEKDAY($B30,2)<=5,HLOOKUP(C30,parametres!$C$1:$S$3,2,FALSE),HLOOKUP(C30,parametres!$C$1:$S$3,3,FALSE))))","v":"05:20:00"},"MALADIE",{"$f":"IF(ISNUMBER(D30),IF(OR(ISBLANK(E30),WEEKDAY($B30,2)=7),0,IF(WEEKDAY($B30,2)<=5,HLOOKUP(E30,parametres!$C$1:$S$3,2,FALSE),HLOOKUP(E30,parametres!$C$1:$S$3,3,FALSE))))","v":"00:00:00"},"REPOS",{"$f":"IF(ISNUMBER(F30),IF(OR(ISBLANK(G30),WEEKDAY($B30,2)=7),0,IF(WEEKDAY($B30,2)<=5,HLOOKUP(G30,parametres!$C$1:$S$3,2,FALSE),HLOOKUP(G30,parametres!$C$1:$S$3,3,FALSE))))","v":"00:00:00"},"CRECHES",{"$f":"IF(ISNUMBER(H30),IF(OR(ISBLANK(I30),WEEKDAY($B30,2)=7),0,IF(WEEKDAY($B30,2)<=5,HLOOKUP(I30,parametres!$C$1:$S$3,2,FALSE),HLOOKUP(I30,parametres!$C$1:$S$3,3,FALSE))))","v":"06:45:00"},"PARAY",{"$f":"IF(ISNUMBER(J30),IF(OR(ISBLANK(K30),WEEKDAY($B30,2)=7),0,IF(WEEKDAY($B30,2)<=5,HLOOKUP(K30,parametres!$C$1:$S$3,2,FALSE),HLOOKUP(K30,parametres!$C$1:$S$3,3,FALSE))))","v":"05:00:00"},"CLUNY",{"$f":"IF(ISNUMBER(L30),IF(OR(ISBLANK(M30),WEEKDAY($B30,2)=7),0,IF(WEEKDAY($B30,2)<=5,HLOOKUP(M30,parametres!$C$1:$S$3,2,FALSE),HLOOKUP(M30,parametres!$C$1:$S$3,3,FALSE))))","v":"04:15:00"},"REPOS",{"$f":"IF(ISNUMBER(N30),IF(OR(ISBLANK(O30),WEEKDAY($B30,2)=7),0,IF(WEEKDAY($B30,2)<=5,HLOOKUP(O30,parametres!$C$1:$S$3,2,FALSE),HLOOKUP(O30,parametres!$C$1:$S$3,3,FALSE))))","v":"00:00:00"},"AIN",{"$f":"IF(ISNUMBER(P30),IF(OR(ISBLANK(Q30),WEEKDAY($B30,2)=7),0,IF(WEEKDAY($B30,2)<=5,HLOOKUP(Q30,parametres!$C$1:$S$3,2,FALSE),HLOOKUP(Q30,parametres!$C$1:$S$3,3,FALSE))))","v":"04:40:00"}]
["2025-02-28","2025-02-28","VALLONS",{"$f":"IF(ISNUMBER(B31),IF(OR(ISBLANK(C31),WEEKDAY($B31,2)=7),0,IF(WEEKDAY($B31,2)<=5,HLOOKUP(C31,parametres!$C$1:$S$3,2,FALSE),HLOOKUP(C31,parametres!$C$1:$S$3,3,FALSE))))","v":"05:20:00"},"MALADIE",{"$f":"IF(ISNUMBER(D31),IF(OR(ISBLANK(E31),WEEKDAY($B31,2)=7),0,IF(WEEKDAY($B31,2)<=5,HLOOKUP(E31,parametres!$C$1:$S$3,2,FALSE),HLOOKUP(E31,parametres!$C$1:$S$3,3,FALSE))))","v":"00:00:00"},"REPOS",{"$f":"IF(ISNUMBER(F31),IF(OR(ISBLANK(G31),WEEKDAY($B31,2)=7),0,IF(WEEKDAY($B31,2)<=5,HLOOKUP(G31,parametres!$C$1:$S$3,2,FALSE),HLOOKUP(G31,parametres!$C$1:$S$3,3,FALSE))))","v":"00:00:00"},"CRECHES",{"$f":"IF(ISNUMBER(H31),IF(OR(ISBLANK(I31),WEEKDAY($B31,2)=7),0,IF(WEEKDAY($B31,2)<=5,HLOOKUP(I31,parametres!$C$1:$S$3,2,FALSE),HLOOKUP(I31,parametres!$C$1:$S$3,3,FALSE))))","v":"06:45:00"},"PARAY",{"$f":"IF(ISNUMBER(J31),IF(OR(ISBLANK(K31),WEEKDAY($B31,2)=7),0,IF(WEEKDAY($B31,2)<=5,HLOOKUP(K31,parametres!$C$1:$S$3,2,FALSE),HLOOKUP(K31,parametres!$C$1:$S$3,3,FALSE))))","v":"05:00:00"},"CLUNY",{"$f":"IF(ISNUMBER(L31),IF(OR(ISBLANK(M31),WEEKDAY($B31,2)=7),0,IF(WEEKDAY($B31,2)<=5,HLOOKUP(M31,parametres!$C$1:$S$3,2,FALSE),HLOOKUP(M31,parametres!$C$1:$S$3,3,FALSE))))","v":"04:15:00"},"AIN",{"$f":"IF(ISNUMBER(N31),IF(OR(ISBLANK(O31),WEEKDAY($B31,2)=7),0,IF(WEEKDAY($B31,2)<=5,HLOOKUP(O31,parametres!$C$1:$S$3,2,FALSE),HLOOKUP(O31,parametres!$C$1:$S$3,3,FALSE))))","v":"04:40:00"},"REPOS",{"$f":"IF(ISNUMBER(P31),IF(OR(ISBLANK(Q31),WEEKDAY($B31,2)=7),0,IF(WEEKDAY($B31,2)<=5,HLOOKUP(Q31,parametres!$C$1:$S$3,2,FALSE),HLOOKUP(Q31,parametres!$C$1:$S$3,3,FALSE))))","v":"00:00:00"}]
["","",null,{"$f":"IF(ISNUMBER(B32),IF(OR(ISBLANK(C32),WEEKDAY($B32,2)=7),0,IF(WEEKDAY($B32,2)<=5,HLOOKUP(C32,parametres!$C$1:$S$3,2,FALSE),HLOOKUP(C32,parametres!$C$1:$S$3,3,FALSE))))","v":false},null,{"$f":"IF(ISNUMBER(D32),IF(OR(ISBLANK(E32),WEEKDAY($B32,2)=7),0,IF(WEEKDAY($B32,2)<=5,HLOOKUP(E32,parametres!$C$1:$S$3,2,FALSE),HLOOKUP(E32,parametres!$C$1:$S$3,3,FALSE))))","v":false},null,{"$f":"IF(ISNUMBER(F32),IF(OR(ISBLANK(G32),WEEKDAY($B32,2)=7),0,IF(WEEKDAY($B32,2)<=5,HLOOKUP(G32,parametres!$C$1:$S$3,2,FALSE),HLOOKUP(G32,parametres!$C$1:$S$3,3,FALSE))))","v":false},null,{"$f":"IF(ISNUMBER(H32),IF(OR(ISBLANK(I32),WEEKDAY($B32,2)=7),0,IF(WEEKDAY($B32,2)<=5,HLOOKUP(I32,parametres!$C$1:$S$3,2,FALSE),HLOOKUP(I32,parametres!$C$1:$S$3,3,FALSE))))","v":false},null,{"$f":"IF(ISNUMBER(J32),IF(OR(ISBLANK(K32),WEEKDAY($B32,2)=7),0,IF(WEEKDAY($B32,2)<=5,HLOOKUP(K32,parametres!$C$1:$S$3,2,FALSE),HLOOKUP(K32,parametres!$C$1:$S$3,3,FALSE))))","v":false},null,{"$f":"IF(ISNUMBER(L32),IF(OR(ISBLANK(M32),WEEKDAY($B32,2)=7),0,IF(WEEKDAY($B32,2)<=5,HLOOKUP(M32,parametres!$C$1:$S$3,2,FALSE),HLOOKUP(M32,parametres!$C$1:$S$3,3,FALSE))))","v":false},null,{"$f":"IF(ISNUMBER(N32),IF(OR(ISBLANK(O32),WEEKDAY($B32,2)=7),0,IF(WEEKDAY($B32,2)<=5,HLOOKUP(O32,parametres!$C$1:$S$3,2,FALSE),HLOOKUP(O32,parametres!$C$1:$S$3,3,FALSE))))","v":false},null,{"$f":"IF(ISNUMBER(P32),IF(OR(ISBLANK(Q32),WEEKDAY($B32,2)=7),0,IF(WEEKDAY($B32,2)<=5,HLOOKUP(Q32,parametres!$C$1:$S$3,2,FALSE),HLOOKUP(Q32,parametres!$C$1:$S$3,3,FALSE))))","v":false}]
["","",null,{"$f":"IF(ISNUMBER(B33),IF(OR(ISBLANK(C33),WEEKDAY($B33,2)=7),0,IF(WEEKDAY($B33,2)<=5,HLOOKUP(C33,parametres!$C$1:$S$3,2,FALSE),HLOOKUP(C33,parametres!$C$1:$S$3,3,FALSE))))","v":false},null,{"$f":"IF(ISNUMBER(D33),IF(OR(ISBLANK(E33),WEEKDAY($B33,2)=7),0,IF(WEEKDAY($B33,2)<=5,HLOOKUP(E33,parametres!$C$1:$S$3,2,FALSE),HLOOKUP(E33,parametres!$C$1:$S$3,3,FALSE))))","v":false},null,{"$f":"IF(ISNUMBER(F33),IF(OR(ISBLANK(G33),WEEKDAY($B33,2)=7),0,IF(WEEKDAY($B33,2)<=5,HLOOKUP(G33,parametres!$C$1:$S$3,2,FALSE),HLOOKUP(G33,parametres!$C$1:$S$3,3,FALSE))))","v":false},null,{"$f":"IF(ISNUMBER(H33),IF(OR(ISBLANK(I33),WEEKDAY($B33,2)=7),0,IF(WEEKDAY($B33,2)<=5,HLOOKUP(I33,parametres!$C$1:$S$3,2,FALSE),HLOOKUP(I33,parametres!$C$1:$S$3,3,FALSE))))","v":false},null,{"$f":"IF(ISNUMBER(J33),IF(OR(ISBLANK(K33),WEEKDAY($B33,2)=7),0,IF(WEEKDAY($B33,2)<=5,HLOOKUP(K33,parametres!$C$1:$S$3,2,FALSE),HLOOKUP(K33,parametres!$C$1:$S$3,3,FALSE))))","v":false},null,{"$f":"IF(ISNUMBER(L33),IF(OR(ISBLANK(M33),WEEKDAY($B33,2)=7),0,IF(WEEKDAY($B33,2)<=5,HLOOKUP(M33,parametres!$C$1:$S$3,2,FALSE),HLOOKUP(M33,parametres!$C$1:$S$3,3,FALSE))))","v":false},null,{"$f":"IF(ISNUMBER(N33),IF(OR(ISBLANK(O33),WEEKDAY($B33,2)=7),0,IF(WEEKDAY($B33,2)<=5,HLOOKUP(O33,parametres!$C$1:$S$3,2,FALSE),HLOOKUP(O33,parametres!$C$1:$S$3,3,FALSE))))","v":false},null,{"$f":"IF(ISNUMBER(P33),IF(OR(ISBLANK(Q33),WEEKDAY($B33,2)=7),0,IF(WEEKDAY($B33,2)<=5,HLOOKUP(Q33,parametres!$C$1:$S$3,2,FALSE),HLOOKUP(Q33,parametres!$C$1:$S$3,3,FALSE))))","v":false}]
["","",null,{"$f":"IF(ISNUMBER(B34),IF(OR(ISBLANK(C34),WEEKDAY($B34,2)=7),0,IF(WEEKDAY($B34,2)<=5,HLOOKUP(C34,parametres!$C$1:$S$3,2,FALSE),HLOOKUP(C34,parametres!$C$1:$S$3,3,FALSE))))","v":false},null,{"$f":"IF(ISNUMBER(D34),IF(OR(ISBLANK(E34),WEEKDAY($B34,2)=7),0,IF(WEEKDAY($B34,2)<=5,HLOOKUP(E34,parametres!$C$1:$S$3,2,FALSE),HLOOKUP(E34,parametres!$C$1:$S$3,3,FALSE))))","v":false},null,{"$f":"IF(ISNUMBER(F34),IF(OR(ISBLANK(G34),WEEKDAY($B34,2)=7),0,IF(WEEKDAY($B34,2)<=5,HLOOKUP(G34,parametres!$C$1:$S$3,2,FALSE),HLOOKUP(G34,parametres!$C$1:$S$3,3,FALSE))))","v":false},null,{"$f":"IF(ISNUMBER(H34),IF(OR(ISBLANK(I34),WEEKDAY($B34,2)=7),0,IF(WEEKDAY($B34,2)<=5,HLOOKUP(I34,parametres!$C$1:$S$3,2,FALSE),HLOOKUP(I34,parametres!$C$1:$S$3,3,FALSE))))","v":false},null,{"$f":"IF(ISNUMBER(J34),IF(OR(ISBLANK(K34),WEEKDAY($B34,2)=7),0,IF(WEEKDAY($B34,2)<=5,HLOOKUP(K34,parametres!$C$1:$S$3,2,FALSE),HLOOKUP(K34,parametres!$C$1:$S$3,3,FALSE))))","v":false},null,{"$f":"IF(ISNUMBER(L34),IF(OR(ISBLANK(M34),WEEKDAY($B34,2)=7),0,IF(WEEKDAY($B34,2)<=5,HLOOKUP(M34,parametres!$C$1:$S$3,2,FALSE),HLOOKUP(M34,parametres!$C$1:$S$3,3,FALSE))))","v":false},null,{"$f":"IF(ISNUMBER(N34),IF(OR(ISBLANK(O34),WEEKDAY($B34,2)=7),0,IF(WEEKDAY($B34,2)<=5,HLOOKUP(O34,parametres!$C$1:$S$3,2,FALSE),HLOOKUP(O34,parametres!$C$1:$S$3,3,FALSE))))","v":false},null,{"$f":"IF(ISNUMBER(P34),IF(OR(ISBLANK(Q34),WEEKDAY($B34,2)=7),0,IF(WEEKDAY($B34,2)<=5,HLOOKUP(Q34,parametres!$C$1:$S$3,2,FALSE),HLOOKUP(Q34,parametres!$C$1:$S$3,3,FALSE))))","v":false}]
[null,null,{"$f":"D35","v":2.3645833333333339},{"$f":"SUM(D4:D34)","v":2.3645833333333339},{"$f":"F35","v":0},{"$f":"SUM(F4:F34)","v":0},3.0312500000000004,{"$f":"SUM(H4:H34)","v":3.0312500000000004},5.2673611111111107,{"$f":"SUM(J4:J34)","v":5.2673611111111107},3.8645833333333344,{"$f":"SUM(L4:L34)","v":3.8645833333333344},3.2152777777777781,{"$f":"SUM(N4:N34)","v":3.2152777777777781},2.7604166666666679,{"$f":"SUM(P4:P34)","v":2.7604166666666679},3.9826388888888897,{"$f":"SUM(R4:R34)","v":3.9826388888888897}]
["Ajustements"]
["TOTAL",null,{"$f":"D37","v":2.3645833333333339},{"$f":"D35+C36","v":2.3645833333333339},{"$f":"F37","v":0},{"$f":"F35+E36","v":0},{"$f":"H37","v":3.0312500000000004},{"$f":"H35+G36","v":3.0312500000000004},{"$f":"J37","v":5.2673611111111107},{"$f":"J35+I36","v":5.2673611111111107},{"$f":"L37","v":3.8645833333333344},{"$f":"L35+K36","v":3.8645833333333344},{"$f":"N37","v":3.2152777777777781},{"$f":"N35+M36","v":3.2152777777777781},{"$f":"P37","v":2.7604166666666679},{"$f":"P35+O36","v":2.7604166666666679},{"$f":"R37","v":3.9826388888888897},{"$f":"R35+Q36","v":3.9826388888888897}]

{"sheet":"Affectation","index":2,"n_rows":32,"n_cols":8,"rows_kept":32,"cut":false,"hidden":false,"merged":[]}
[null,{"$f":"parametres!C1","v":"VALLONS"},{"$f":"parametres!D1","v":"CRECHES"},{"$f":"parametres!E1","v":"AIN"},{"$f":"parametres!F1","v":"PARAY"},{"$f":"parametres!G1","v":"CLUNY"},{"$f":"parametres!H1","v":"CP"},{"$f":"parametres!I1","v":"MALADIE"}]
[{"$f":"Synthese!A4","v":"2025-02-01"},{"$f":"_xlfn.IFNA(INDEX(Synthese!$B$3:$R$34, 1, MATCH(B$1, Synthese!$B4:$Q4, 0)),\"\")","v":"Hervé"},{"$f":"_xlfn.IFNA(INDEX(Synthese!$B$3:$R$34, 1, MATCH(C$1, Synthese!$B4:$Q4, 0)),\"\")","v":"Etienne"},{"$f":"_xlfn.IFNA(INDEX(Synthese!$B$3:$R$34, 1, MATCH(D$1, Synthese!$B4:$Q4, 0)),\"\")","v":"Chloé"},{"$f":"_xlfn.IFNA(INDEX(Synthese!$B$3:$R$34, 1, MATCH(E$1, Synthese!$B4:$Q4, 0)),\"\")","v":"Jean Louis"},{"$f":"_xlfn.IFNA(INDEX(Synthese!$B$3:$R$34, 1, MATCH(F$1, Synthese!$B4:$Q4, 0)),\"\")","v":"Jean Michel"},{"$f":"_xlfn.IFNA(INDEX(Synthese!$B$3:$R$34, 1, MATCH(G$1, Synthese!$B4:$Q4, 0)),\"\")","v":""},{"$f":"_xlfn.IFNA(INDEX(Synthese!$B$3:$R$34, 1, MATCH(H$1, Synthese!$B4:$Q4, 0)),\"\")","v":"Laurent"}]
[{"$f":"Synthese!A5","v":"2025-02-02"},{"$f":"_xlfn.IFNA(INDEX(Synthese!$B$3:$R$34, 1, MATCH(B$1, Synthese!$B5:$Q5, 0)),\"\")","v":""},{"$f":"_xlfn.IFNA(INDEX(Synthese!$B$3:$R$34, 1, MATCH(C$1, Synthese!$B5:$Q5, 0)),\"\")","v":""},{"$f":"_xlfn.IFNA(INDEX(Synthese!$B$3:$R$34, 1, MATCH(D$1, Synthese!$B5:$Q5, 0)),\"\")","v":""},{"$f":"_xlfn.IFNA(INDEX(Synthese!$B$3:$R$34, 1, MATCH(E$1, Synthese!$B5:$Q5, 0)),\"\")","v":""},{"$f":"_xlfn.IFNA(INDEX(Synthese!$B$3:$R$34, 1, MATCH(F$1, Synthese!$B5:$Q5, 0)),\"\")","v":""},{"$f":"_xlfn.IFNA(INDEX(Synthese!$B$3:$R$34, 1, MATCH(G$1, Synthese!$B5:$Q5, 0)),\"\")","v":""},{"$f":"_xlfn.IFNA(INDEX(Synthese!$B$3:$R$34, 1, MATCH(H$1, Synthese!$B5:$Q5, 0)),\"\")","v":""}]
[{"$f":"Synthese!A6","v":"2025-02-03"},{"$f":"_xlfn.IFNA(INDEX(Synthese!$B$3:$R$34, 1, MATCH(B$1, Synthese!$B6:$Q6, 0)),\"\")","v":"Christian"},{"$f":"_xlfn.IFNA(INDEX(Synthese!$B$3:$R$34, 1, MATCH(C$1, Synthese!$B6:$Q6, 0)),\"\")","v":"Etienne"},{"$f":"_xlfn.IFNA(INDEX(Synthese!$B$3:$R$34, 1, MATCH(D$1, Synthese!$B6:$Q6, 0)),\"\")","v":"Chloé"},{"$f":"_xlfn.IFNA(INDEX(Synthese!$B$3:$R$34, 1, MATCH(E$1, Synthese!$B6:$Q6, 0)),\"\")","v":"Jean Louis"},{"$f":"_xlfn.IFNA(INDEX(Synthese!$B$3:$R$34, 1, MATCH(F$1, Synthese!$B6:$Q6, 0)),\"\")","v":"Jean Michel"},{"$f":"_xlfn.IFNA(INDEX(Synthese!$B$3:$R$34, 1, MATCH(G$1, Synthese!$B6:$Q6, 0)),\"\")","v":""},{"$f":"_xlfn.IFNA(INDEX(Synthese!$B$3:$R$34, 1, MATCH(H$1, Synthese!$B6:$Q6, 0)),\"\")","v":"Laurent"}]
[{"$f":"Synthese!A7","v":"2025-02-04"},{"$f":"_xlfn.IFNA(INDEX(Synthese!$B$3:$R$34, 1, MATCH(B$1, Synthese!$B7:$Q7, 0)),\"\")","v":"Hervé"},{"$f":"_xlfn.IFNA(INDEX(Synthese!$B$3:$R$34, 1, MATCH(C$1, Synthese!$B7:$Q7, 0)),\"\")","v":"Etienne"},{"$f":"_xlfn.IFNA(INDEX(Synthese!$B$3:$R$34, 1, MATCH(D$1, Synthese!$B7:$Q7, 0)),\"\")","v":"Chloé"},{"$f":"_xlfn.IFNA(INDEX(Synthese!$B$3:$R$34, 1, MATCH(E$1, Synthese!$B7:$Q7, 0)),\"\")","v":"Jean Louis"},{"$f":"_xlfn.IFNA(INDEX(Synthese!$B$3:$R$34, 1, MATCH(F$1, Synthese!$B7:$Q7, 0)),\"\")","v":"Christian"},{"$f":"_xlfn.IFNA(INDEX(Synthese!$B$3:$R$34, 1, MATCH(G$1, Synthese!$B7:$Q7, 0)),\"\")","v":""},{"$f":"_xlfn.IFNA(INDEX(Synthese!$B$3:$R$34, 1, MATCH(H$1, Synthese!$B7:$Q7, 0)),\"\")","v":"Laurent"}]
[{"$f":"Synthese!A8","v":"2025-02-05"},{"$f":"_xlfn.IFNA(INDEX(Synthese!$B$3:$R$34, 1, MATCH(B$1, Synthese!$B8:$Q8, 0)),\"\")","v":"Hervé"},{"$f":"_xlfn.IFNA(INDEX(Synthese!$B$3:$R$34, 1, MATCH(C$1, Synthese!$B8:$Q8, 0)),\"\")","v":"Etienne"},{"$f":"_xlfn.IFNA(INDEX(Synthese!$B$3:$R$34, 1, MATCH(D$1, Synthese!$B8:$Q8, 0)),\"\")","v":"Chloé"},{"$f":"_xlfn.IFNA(INDEX(Synthese!$B$3:$R$34, 1, MATCH(E$1, Synthese!$B8:$Q8, 0)),\"\")","v":"Jean Louis"},{"$f":"_xlfn.IFNA(INDEX(Synthese!$B$3:$R$34, 1, MATCH(F$1, Synthese!$B8:$Q8, 0)),\"\")","v":"Jean Michel"},{"$f":"_xlfn.IFNA(INDEX(Synthese!$B$3:$R$34, 1, MATCH(G$1, Synthese!$B8:$Q8, 0)),\"\")","v":""},{"$f":"_xlfn.IFNA(INDEX(Synthese!$B$3:$R$34, 1, MATCH(H$1, Synthese!$B8:$Q8, 0)),\"\")","v":"Laurent"}]
[{"$f":"Synthese!A9","v":"2025-02-06"},{"$f":"_xlfn.IFNA(INDEX(Synthese!$B$3:$R$34, 1, MATCH(B$1, Synthese!$B9:$Q9, 0)),\"\")","v":"Christian"},{"$f":"_xlfn.IFNA(INDEX(Synthese!$B$3:$R$34, 1, MATCH(C$1, Synthese!$B9:$Q9, 0)),\"\")","v":"Etienne"},{"$f":"_xlfn.IFNA(INDEX(Synthese!$B$3:$R$34, 1, MATCH(D$1, Synthese!$B9:$Q9, 0)),\"\")","v":"Chloé"},{"$f":"_xlfn.IFNA(INDEX(Synthese!$B$3:$R$34, 1, MATCH(E$1, Synthese!$B9:$Q9, 0)),\"\")","v":"Jean Louis"},{"$f":"_xlfn.IFNA(INDEX(Synthese!$B$3:$R$34, 1, MATCH(F$1, Synthese!$B9:$Q9, 0)),\"\")","v":"Jean Michel"},{"$f":"_xlfn.IFNA(INDEX(Synthese!$B$3:$R$34, 1, MATCH(G$1, Synthese!$B9:$Q9, 0)),\"\")","v":""},{"$f":"_xlfn.IFNA(INDEX(Synthese!$B$3:$R$34, 1, MATCH(H$1, Synthese!$B9:$Q9, 0)),\"\")","v":"Laurent"}]
[{"$f":"Synthese!A10","v":"2025-02-07"},{"$f":"_xlfn.IFNA(INDEX(Synthese!$B$3:$R$34, 1, MATCH(B$1, Synthese!$B10:$Q10, 0)),\"\")","v":"Hervé"},{"$f":"_xlfn.IFNA(INDEX(Synthese!$B$3:$R$34, 1, MATCH(C$1, Synthese!$B10:$Q10, 0)),\"\")","v":"Etienne"},{"$f":"_xlfn.IFNA(INDEX(Synthese!$B$3:$R$34, 1, MATCH(D$1, Synthese!$B10:$Q10, 0)),\"\")","v":"Chloé"},{"$f":"_xlfn.IFNA(INDEX(Synthese!$B$3:$R$34, 1, MATCH(E$1, Synthese!$B10:$Q10, 0)),\"\")","v":"Christian"},{"$f":"_xlfn.IFNA(INDEX(Synthese!$B$3:$R$34, 1, MATCH(F$1, Synthese!$B10:$Q10, 0)),\"\")","v":"Jean Michel"},{"$f":"_xlfn.IFNA(INDEX(Synthese!$B$3:$R$34, 1, MATCH(G$1, Synthese!$B10:$Q10, 0)),\"\")","v":""},{"$f":"_xlfn.IFNA(INDEX(Synthese!$B$3:$R$34, 1, MATCH(H$1, Synthese!$B10:$Q10, 0)),\"\")","v":"Laurent"}]
[{"$f":"Synthese!A11","v":"2025-02-08"},{"$f":"_xlfn.IFNA(INDEX(Synthese!$B$3:$R$34, 1, MATCH(B$1, Synthese!$B11:$Q11, 0)),\"\")","v":"Hervé"},{"$f":"_xlfn.IFNA(INDEX(Synthese!$B$3:$R$34, 1, MATCH(C$1, Synthese!$B11:$Q11, 0)),\"\")","v":"Etienne"},{"$f":"_xlfn.IFNA(INDEX(Synthese!$B$3:$R$34, 1, MATCH(D$1, Synthese!$B11:$Q11, 0)),\"\")","v":"Christian"},{"$f":"_xlfn.IFNA(INDEX(Synthese!$B$3:$R$34, 1, MATCH(E$1, Synthese!$B11:$Q11, 0)),\"\")","v":"Jean Louis"},{"$f":"_xlfn.IFNA(INDEX(Synthese!$B$3:$R$34, 1, MATCH(F$1, Synthese!$B11:$Q11, 0)),\"\")","v":"Jean Michel"},{"$f":"_xlfn.IFNA(INDEX(Synthese!$B$3:$R$34, 1, MATCH(G$1, Synthese!$B11:$Q11, 0)),\"\")","v":""},{"$f":"_xlfn.IFNA(INDEX(Synthese!$B$3:$R$34, 1, MATCH(H$1, Synthese!$B11:$Q11, 0)),\"\")","v":"Laurent"}]
[{"$f":"Synthese!A12","v":"2025-02-09"},{"$f":"_xlfn.IFNA(INDEX(Synthese!$B$3:$R$34, 1, MATCH(B$1, Synthese!$B12:$Q12, 0)),\"\")","v":""},{"$f":"_xlfn.IFNA(INDEX(Synthese!$B$3:$R$34, 1, MATCH(C$1, Synthese!$B12:$Q12, 0)),\"\")","v":""},{"$f":"_xlfn.IFNA(INDEX(Synthese!$B$3:$R$34, 1, MATCH(D$1, Synthese!$B12:$Q12, 0)),\"\")","v":""},{"$f":"_xlfn.IFNA(INDEX(Synthese!$B$3:$R$34, 1, MATCH(E$1, Synthese!$B12:$Q12, 0)),\"\")","v":""},{"$f":"_xlfn.IFNA(INDEX(Synthese!$B$3:$R$34, 1, MATCH(F$1, Synthese!$B12:$Q12, 0)),\"\")","v":""},{"$f":"_xlfn.IFNA(INDEX(Synthese!$B$3:$R$34, 1, MATCH(G$1, Synthese!$B12:$Q12, 0)),\"\")","v":""},{"$f":"_xlfn.IFNA(INDEX(Synthese!$B$3:$R$34, 1, MATCH(H$1, Synthese!$B12:$Q12, 0)),\"\")","v":""}]
[{"$f":"Synthese!A13","v":"2025-02-10"},{"$f":"_xlfn.IFNA(INDEX(Synthese!$B$3:$R$34, 1, MATCH(B$1, Synthese!$B13:$Q13, 0)),\"\")","v":"Hervé"},{"$f":"_xlfn.IFNA(INDEX(Synthese!$B$3:$R$34, 1, MATCH(C$1, Synthese!$B13:$Q13, 0)),\"\")","v":"Etienne"},{"$f":"_xlfn.IFNA(INDEX(Synthese!$B$3:$R$34, 1, MATCH(D$1, Synthese!$B13:$Q13, 0)),\"\")","v":"Chloé"},{"$f":"_xlfn.IFNA(INDEX(Synthese!$B$3:$R$34, 1, MATCH(E$1, Synthese!$B13:$Q13, 0)),\"\")","v":"Jean Louis"},{"$f":"_xlfn.IFNA(INDEX(Synthese!$B$3:$R$34, 1, MATCH(F$1, Synthese!$B13:$Q13, 0)),\"\")","v":"Christian"},{"$f":"_xlfn.IFNA(INDEX(Synthese!$B$3:$R$34, 1, MATCH(G$1, Synthese!$B13:$Q13, 0)),\"\")","v":""},{"$f":"_xlfn.IFNA(INDEX(Synthese!$B$3:$R$34, 1, MATCH(H$1, Synthese!$B13:$Q13, 0)),\"\")","v":"Laurent"}]
[{"$f":"Synthese!A14","v":"2025-02-11"},{"$f":"_xlfn.IFNA(INDEX(Synthese!$B$3:$R$34, 1, MATCH(B$1, Synthese!$B14:$Q14, 0)),\"\")","v":"Christian"},{"$f":"_xlfn.IFNA(INDEX(Synthese!$B$3:$R$34, 1, MATCH(C$1, Synthese!$B14:$Q14, 0)),\"\")","v":"Etienne"},{"$f":"_xlfn.IFNA(INDEX(Synthese!$B$3:$R$34, 1, MATCH(D$1, Synthese!$B14:$Q14, 0)),\"\")","v":"Chloé"},{"$f":"_xlfn.IFNA(INDEX(Synthese!$B$3:$R$34, 1, MATCH(E$1, Synthese!$B14:$Q14, 0)),\"\")","v":"Jean Louis"},{"$f":"_xlfn.IFNA(INDEX(Synthese!$B$3:$R$34, 1, MATCH(F$1, Synthese!$B14:$Q14, 0)),\"\")","v":"Jean Michel"},{"$f":"_xlfn.IFNA(INDEX(Synthese!$B$3:$R$34, 1, MATCH(G$1, Synthese!$B14:$Q14, 0)),\"\")","v":""},{"$f":"_xlfn.IFNA(INDEX(Synthese!$B$3:$R$34, 1, MATCH(H$1, Synthese!$B14:$Q14, 0)),\"\")","v":"Laurent"}]
[{"$f":"Synthese!A15","v":"2025-02-12"},{"$f":"_xlfn.IFNA(INDEX(Synthese!$B$3:$R$34, 1, MATCH(B$1, Synthese!$B15:$Q15, 0)),\"\")","v":"Hervé"},{"$f":"_xlfn.IFNA(INDEX(Synthese!$B$3:$R$34, 1, MATCH(C$1, Synthese!$B15:$Q15, 0)),\"\")","v":"Etienne"},{"$f":"_xlfn.IFNA(INDEX(Synthese!$B$3:$R$34, 1, MATCH(D$1, Synthese!$B15:$Q15, 0)),\"\")","v":"Chloé"},{"$f":"_xlfn.IFNA(INDEX(Synthese!$B$3:$R$34, 1, MATCH(E$1, Synthese!$B15:$Q15, 0)),\"\")","v":"Jean Louis"},{"$f":"_xlfn.IFNA(INDEX(Synthese!$B$3:$R$34, 1, MATCH(F$1, Synthese!$B15:$Q15, 0)),\"\")","v":"Jean Michel"},{"$f":"_xlfn.IFNA(INDEX(Synthese!$B$3:$R$34, 1, MATCH(G$1, Synthese!$B15:$Q15, 0)),\"\")","v":""},{"$f":"_xlfn.IFNA(INDEX(Synthese!$B$3:$R$34, 1, MATCH(H$1, Synthese!$B15:$Q15, 0)),\"\")","v":"Laurent"}]
[{"$f":"Synthese!A16","v":"2025-02-13"},{"$f":"_xlfn.IFNA(INDEX(Synthese!$B$3:$R$34, 1, MATCH(B$1, Synthese!$B16:$Q16, 0)),\"\")","v":"Hervé"},{"$f":"_xlfn.IFNA(INDEX(Synthese!$B$3:$R$34, 1, MATCH(C$1, Synthese!$B16:$Q16, 0)),\"\")","v":"Etienne"},{"$f":"_xlfn.IFNA(INDEX(Synthese!$B$3:$R$34, 1, MATCH(D$1, Synthese!$B16:$Q16, 0)),\"\")","v":"Chloé"},{"$f":"_xlfn.IFNA(INDEX(Synthese!$B$3:$R$34, 1, MATCH(E$1, Synthese!$B16:$Q16, 0)),\"\")","v":"Christian"},{"$f":"_xlfn.IFNA(INDEX(Synthese!$B$3:$R$34, 1, MATCH(F$1, Synthese!$B16:$Q16, 0)),\"\")","v":"Jean Michel"},{"$f":"_xlfn.IFNA(INDEX(Synthese!$B$3:$R$34, 1, MATCH(G$1, Synthese!$B16:$Q16, 0)),\"\")","v":""},{"$f":"_xlfn.IFNA(INDEX(Synthese!$B$3:$R$34, 1, MATCH(H$1, Synthese!$B16:$Q16, 0)),\"\")","v":"Laurent"}]
[{"$f":"Synthese!A17","v":"2025-02-14"},{"$f":"_xlfn.IFNA(INDEX(Synthese!$B$3:$R$34, 1, MATCH(B$1, Synthese!$B17:$Q17, 0)),\"\")","v":"Hervé"},{"$f":"_xlfn.IFNA(INDEX(Synthese!$B$3:$R$34, 1, MATCH(C$1, Synthese!$B17:$Q17, 0)),\"\")","v":"Etienne"},{"$f":"_xlfn.IFNA(INDEX(Synthese!$B$3:$R$34, 1, MATCH(D$1, Synthese!$B17:$Q17, 0)),\"\")","v":"Christian"},{"$f":"_xlfn.IFNA(INDEX(Synthese!$B$3:$R$34, 1, MATCH(E$1, Synthese!$B17:$Q17, 0)),\"\")","v":"Jean Louis"},{"$f":"_xlfn.IFNA(INDEX(Synthese!$B$3:$R$34, 1, MATCH(F$1, Synthese!$B17:$Q17, 0)),\"\")","v":"Jean Michel"},{"$f":"_xlfn.IFNA(INDEX(Synthese!$B$3:$R$34, 1, MATCH(G$1, Synthese!$B17:$Q17, 0)),\"\")","v":""},{"$f":"_xlfn.IFNA(INDEX(Synthese!$B$3:$R$34, 1, MATCH(H$1, Synthese!$B17:$Q17, 0)),\"\")","v":"Laurent"}]
[{"$f":"Synthese!A18","v":"2025-02-15"},{"$f":"_xlfn.IFNA(INDEX(Synthese!$B$3:$R$34, 1, MATCH(B$1, Synthese!$B18:$Q18, 0)),\"\")","v":"Hervé"},{"$f":"_xlfn.IFNA(INDEX(Synthese!$B$3:$R$34, 1, MATCH(C$1, Synthese!$B18:$Q18, 0)),\"\")","v":"Etienne"},{"$f":"_xlfn.IFNA(INDEX(Synthese!$B$3:$R$34, 1, MATCH(D$1, Synthese!$B18:$Q18, 0)),\"\")","v":"Chloé"},{"$f":"_xlfn.IFNA(INDEX(Synthese!$B$3:$R$34, 1, MATCH(E$1, Synthese!$B18:$Q18, 0)),\"\")","v":"Christian"},{"$f":"_xlfn.IFNA(INDEX(Synthese!$B$3:$R$34, 1, MATCH(F$1, Synthese!$B18:$Q18, 0)),\"\")","v":"Jean Michel"},{"$f":"_xlfn.IFNA(INDEX(Synthese!$B$3:$R$34, 1, MATCH(G$1, Synthese!$B18:$Q18, 0)),\"\")","v":""},{"$f":"_xlfn.IFNA(INDEX(Synthese!$B$3:$R$34, 1, MATCH(H$1, Synthese!$B18:$Q18, 0)),\"\")","v":"Laurent"}]
[{"$f":"Synthese!A19","v":"2025-02-16"},{"$f":"_xlfn.IFNA(INDEX(Synthese!$B$3:$R$34, 1, MATCH(B$1, Synthese!$B19:$Q19, 0)),\"\")","v":""},{"$f":"_xlfn.IFNA(INDEX(Synthese!$B$3:$R$34, 1, MATCH(C$1, Synthese!$B19:$Q19, 0)),\"\")","v":""},{"$f":"_xlfn.IFNA(INDEX(Synthese!$B$3:$R$34, 1, MATCH(D$1, Synthese!$B19:$Q19, 0)),\"\")","v":""},{"$f":"_xlfn.IFNA(INDEX(Synthese!$B$3:$R$34, 1, MATCH(E$1, Synthese!$B19:$Q19, 0)),\"\")","v":""},{"$f":"_xlfn.IFNA(INDEX(Synthese!$B$3:$R$34, 1, MATCH(F$1, Synthese!$B19:$Q19, 0)),\"\")","v":""},{"$f":"_xlfn.IFNA(INDEX(Synthese!$B$3:$R$34, 1, MATCH(G$1, Synthese!$B19:$Q19, 0)),\"\")","v":""},{"$f":"_xlfn.IFNA(INDEX(Synthese!$B$3:$R$34, 1, MATCH(H$1, Synthese!$B19:$Q19, 0)),\"\")","v":""}]
[{"$f":"Synthese!A20","v":"2025-02-17"},{"$f":"_xlfn.IFNA(INDEX(Synthese!$B$3:$R$34, 1, MATCH(B$1, Synthese!$B20:$Q20, 0)),\"\")","v":"Laurent"},{"$f":"_xlfn.IFNA(INDEX(Synthese!$B$3:$R$34, 1, MATCH(C$1, Synthese!$B20:$Q20, 0)),\"\")","v":"Chloé"},{"$f":"_xlfn.IFNA(INDEX(Synthese!$B$3:$R$34, 1, MATCH(D$1, Synthese!$B20:$Q20, 0)),\"\")","v":"Hervé"},{"$f":"_xlfn.IFNA(INDEX(Synthese!$B$3:$R$34, 1, MATCH(E$1, Synthese!$B20:$Q20, 0)),\"\")","v":"Jean Louis"},{"$f":"_xlfn.IFNA(INDEX(Synthese!$B$3:$R$34, 1, MATCH(F$1, Synthese!$B20:$Q20, 0)),\"\")","v":"Jean Michel"},{"$f":"_xlfn.IFNA(INDEX(Synthese!$B$3:$R$34, 1, MATCH(G$1, Synthese!$B20:$Q20, 0)),\"\")","v":""},{"$f":"_xlfn.IFNA(INDEX(Synthese!$B$3:$R$34, 1, MATCH(H$1, Synthese!$B20:$Q20, 0)),\"\")","v":"René"}]
[{"$f":"Synthese!A21","v":"2025-02-18"},{"$f":"_xlfn.IFNA(INDEX(Synthese!$B$3:$R$34, 1, MATCH(B$1, Synthese!$B21:$Q21, 0)),\"\")","v":"Laurent"},{"$f":"_xlfn.IFNA(INDEX(Synthese!$B$3:$R$34, 1, MATCH(C$1, Synthese!$B21:$Q21, 0)),\"\")","v":"Chloé"},{"$f":"_xlfn.IFNA(INDEX(Synthese!$B$3:$R$34, 1, MATCH(D$1, Synthese!$B21:$Q21, 0)),\"\")","v":"Hervé"},{"$f":"_xlfn.IFNA(INDEX(Synthese!$B$3:$R$34, 1, MATCH(E$1, Synthese!$B21:$Q21, 0)),\"\")","v":"Jean Louis"},{"$f":"_xlfn.IFNA(INDEX(Synthese!$B$3:$R$34, 1, MATCH(F$1, Synthese!$B21:$Q21, 0)),\"\")","v":"Jean Michel"},{"$f":"_xlfn.IFNA(INDEX(Synthese!$B$3:$R$34, 1, MATCH(G$1, Synthese!$B21:$Q21, 0)),\"\")","v":""},{"$f":"_xlfn.IFNA(INDEX(Synthese!$B$3:$R$34, 1, MATCH(H$1, Synthese!$B21:$Q21, 0)),\"\")","v":"René"}]
[{"$f":"Synthese!A22","v":"2025-02-19"},{"$f":"_xlfn.IFNA(INDEX(Synthese!$B$3:$R$34, 1, MATCH(B$1, Synthese!$B22:$Q22, 0)),\"\")","v":"Laurent"},{"$f":"_xlfn.IFNA(INDEX(Synthese!$B$3:$R$34, 1, MATCH(C$1, Synthese!$B22:$Q22, 0)),\"\")","v":"Chloé"},{"$f":"_xlfn.IFNA(INDEX(Synthese!$B$3:$R$34, 1, MATCH(D$1, Synthese!$B22:$Q22, 0)),\"\")","v":"Hervé"},{"$f":"_xlfn.IFNA(INDEX(Synthese!$B$3:$R$34, 1, MATCH(E$1, Synthese!$B22:$Q22, 0)),\"\")","v":"Jean Louis"},{"$f":"_xlfn.IFNA(INDEX(Synthese!$B$3:$R$34, 1, MATCH(F$1, Synthese!$B22:$Q22, 0)),\"\")","v":"Christian"},{"$f":"_xlfn.IFNA(INDEX(Synthese!$B$3:$R$34, 1, MATCH(G$1, Synthese!$B22:$Q22, 0)),\"\")","v":""},{"$f":"_xlfn.IFNA(INDEX(Synthese!$B$3:$R$34, 1, MATCH(H$1, Synthese!$B22:$Q22, 0)),\"\")","v":"René"}]
[{"$f":"Synthese!A23","v":"2025-02-20"},{"$f":"_xlfn.IFNA(INDEX(Synthese!$B$3:$R$34, 1, MATCH(B$1, Synthese!$B23:$Q23, 0)),\"\")","v":"Laurent"},{"$f":"_xlfn.IFNA(INDEX(Synthese!$B$3:$R$34, 1, MATCH(C$1, Synthese!$B23:$Q23, 0)),\"\")","v":"Etienne"},{"$f":"_xlfn.IFNA(INDEX(Synthese!$B$3:$R$34, 1, MATCH(D$1, Synthese!$B23:$Q23, 0)),\"\")","v":"Chloé"},{"$f":"_xlfn.IFNA(INDEX(Synthese!$B$3:$R$34, 1, MATCH(E$1, Synthese!$B23:$Q23, 0)),\"\")","v":"Christian"},{"$f":"_xlfn.IFNA(INDEX(Synthese!$B$3:$R$34, 1, MATCH(F$1, Synthese!$B23:$Q23, 0)),\"\")","v":"Jean Michel"},{"$f":"_xlfn.IFNA(INDEX(Synthese!$B$3:$R$34, 1, MATCH(G$1, Synthese!$B23:$Q23, 0)),\"\")","v":""},{"$f":"_xlfn.IFNA(INDEX(Synthese!$B$3:$R$34, 1, MATCH(H$1, Synthese!$B23:$Q23, 0)),\"\")","v":"René"}]
[{"$f":"Synthese!A24","v":"2025-02-21"},{"$f":"_xlfn.IFNA(INDEX(Synthese!$B$3:$R$34, 1, MATCH(B$1, Synthese!$B24:$Q24, 0)),\"\")","v":"Laurent"},{"$f":"_xlfn.IFNA(INDEX(Synthese!$B$3:$R$34, 1, MATCH(C$1, Synthese!$B24:$Q24, 0)),\"\")","v":"Etienne"},{"$f":"_xlfn.IFNA(INDEX(Synthese!$B$3:$R$34, 1, MATCH(D$1, Synthese!$B24:$Q24, 0)),\"\")","v":"Christian"},{"$f":"_xlfn.IFNA(INDEX(Synthese!$B$3:$R$34, 1, MATCH(E$1, Synthese!$B24:$Q24, 0)),\"\")","v":"Jean Louis"},{"$f":"_xlfn.IFNA(INDEX(Synthese!$B$3:$R$34, 1, MATCH(F$1, Synthese!$B24:$Q24, 0)),\"\")","v":"Jean Michel"},{"$f":"_xlfn.IFNA(INDEX(Synthese!$B$3:$R$34, 1, MATCH(G$1, Synthese!$B24:$Q24, 0)),\"\")","v":""},{"$f":"_xlfn.IFNA(INDEX(Synthese!$B$3:$R$34, 1, MATCH(H$1, Synthese!$B24:$Q24, 0)),\"\")","v":"René"}]
[{"$f":"Synthese!A25","v":"2025-02-22"},{"$f":"_xlfn.IFNA(INDEX(Synthese!$B$3:$R$34, 1, MATCH(B$1, Synthese!$B25:$Q25, 0)),\"\")","v":"Laurent"},{"$f":"_xlfn.IFNA(INDEX(Synthese!$B$3:$R$34, 1, MATCH(C$1, Synthese!$B25:$Q25, 0)),\"\")","v":"Etienne"},{"$f":"_xlfn.IFNA(INDEX(Synthese!$B$3:$R$34, 1, MATCH(D$1, Synthese!$B25:$Q25, 0)),\"\")","v":"Chloé"},{"$f":"_xlfn.IFNA(INDEX(Synthese!$B$3:$R$34, 1, MATCH(E$1, Synthese!$B25:$Q25, 0)),\"\")","v":"Jean Louis"},{"$f":"_xlfn.IFNA(INDEX(Synthese!$B$3:$R$34, 1, MATCH(F$1, Synthese!$B25:$Q25, 0)),\"\")","v":"Christian"},{"$f":"_xlfn.IFNA(INDEX(Synthese!$B$3:$R$34, 1, MATCH(G$1, Synthese!$B25:$Q25, 0)),\"\")","v":""},{"$f":"_xlfn.IFNA(INDEX(Synthese!$B$3:$R$34, 1, MATCH(H$1, Synthese!$B25:$Q25, 0)),\"\")","v":"René"}]
[{"$f":"Synthese!A26","v":"2025-02-23"},{"$f":"_xlfn.IFNA(INDEX(Synthese!$B$3:$R$34, 1, MATCH(B$1, Synthese!$B26:$Q26, 0)),\"\")","v":""},{"$f":"_xlfn.IFNA(INDEX(Synthese!$B$3:$R$34, 1, MATCH(C$1, Synthese!$B26:$Q26, 0)),\"\")","v":""},{"$f":"_xlfn.IFNA(INDEX(Synthese!$B$3:$R$34, 1, MATCH(D$1, Synthese!$B26:$Q26, 0)),\"\")","v":""},{"$f":"_xlfn.IFNA(INDEX(Synthese!$B$3:$R$34, 1, MATCH(E$1, Synthese!$B26:$Q26, 0)),\"\")","v":""},{"$f":"_xlfn.IFNA(INDEX(Synthese!$B$3:$R$34, 1, MATCH(F$1, Synthese!$B26:$Q26, 0)),\"\")","v":""},{"$f":"_xlfn.IFNA(INDEX(Synthese!$B$3:$R$34, 1, MATCH(G$1, Synthese!$B26:$Q26, 0)),\"\")","v":""},{"$f":"_xlfn.IFNA(INDEX(Synthese!$B$3:$R$34, 1, MATCH(H$1, Synthese!$B26:$Q26, 0)),\"\")","v":""}]
[{"$f":"Synthese!A27","v":"2025-02-24"},{"$f":"_xlfn.IFNA(INDEX(Synthese!$B$3:$R$34, 1, MATCH(B$1, Synthese!$B27:$Q27, 0)),\"\")","v":"Laurent"},{"$f":"_xlfn.IFNA(INDEX(Synthese!$B$3:$R$34, 1, MATCH(C$1, Synthese!$B27:$Q27, 0)),\"\")","v":"Etienne"},{"$f":"_xlfn.IFNA(INDEX(Synthese!$B$3:$R$34, 1, MATCH(D$1, Synthese!$B27:$Q27, 0)),\"\")","v":"Chloé"},{"$f":"_xlfn.IFNA(INDEX(Synthese!$B$3:$R$34, 1, MATCH(E$1, Synthese!$B27:$Q27, 0)),\"\")","v":"Jean Louis"},{"$f":"_xlfn.IFNA(INDEX(Synthese!$B$3:$R$34, 1, MATCH(F$1, Synthese!$B27:$Q27, 0)),\"\")","v":"Jean Michel"},{"$f":"_xlfn.IFNA(INDEX(Synthese!$B$3:$R$34, 1, MATCH(G$1, Synthese!$B27:$Q27, 0)),\"\")","v":""},{"$f":"_xlfn.IFNA(INDEX(Synthese!$B$3:$R$34, 1, MATCH(H$1, Synthese!$B27:$Q27, 0)),\"\")","v":"René"}]
[{"$f":"Synthese!A28","v":"2025-02-25"},{"$f":"_xlfn.IFNA(INDEX(Synthese!$B$3:$R$34, 1, MATCH(B$1, Synthese!$B28:$Q28, 0)),\"\")","v":"Laurent"},{"$f":"_xlfn.IFNA(INDEX(Synthese!$B$3:$R$34, 1, MATCH(C$1, Synthese!$B28:$Q28, 0)),\"\")","v":"Etienne"},{"$f":"_xlfn.IFNA(INDEX(Synthese!$B$3:$R$34, 1, MATCH(D$1, Synthese!$B28:$Q28, 0)),\"\")","v":"Chloé"},{"$f":"_xlfn.IFNA(INDEX(Synthese!$B$3:$R$34, 1, MATCH(E$1, Synthese!$B28:$Q28, 0)),\"\")","v":"Christian"},{"$f":"_xlfn.IFNA(INDEX(Synthese!$B$3:$R$34, 1, MATCH(F$1, Synthese!$B28:$Q28, 0)),\"\")","v":"Jean Michel"},{"$f":"_xlfn.IFNA(INDEX(Synthese!$B$3:$R$34, 1, MATCH(G$1, Synthese!$B28:$Q28, 0)),\"\")","v":""},{"$f":"_xlfn.IFNA(INDEX(Synthese!$B$3:$R$34, 1, MATCH(H$1, Synthese!$B28:$Q28, 0)),\"\")","v":"René"}]
[{"$f":"Synthese!A29","v":"2025-02-26"},{"$f":"_xlfn.IFNA(INDEX(Synthese!$B$3:$R$34, 1, MATCH(B$1, Synthese!$B29:$Q29, 0)),\"\")","v":"Laurent"},{"$f":"_xlfn.IFNA(INDEX(Synthese!$B$3:$R$34, 1, MATCH(C$1, Synthese!$B29:$Q29, 0)),\"\")","v":"Etienne"},{"$f":"_xlfn.IFNA(INDEX(Synthese!$B$3:$R$34, 1, MATCH(D$1, Synthese!$B29:$Q29, 0)),\"\")","v":"Chloé"},{"$f":"_xlfn.IFNA(INDEX(Synthese!$B$3:$R$34, 1, MATCH(E$1, Synthese!$B29:$Q29, 0)),\"\")","v":"Jean Louis"},{"$f":"_xlfn.IFNA(INDEX(Synthese!$B$3:$R$34, 1, MATCH(F$1, Synthese!$B29:$Q29, 0)),\"\")","v":"Jean Michel"},{"$f":"_xlfn.IFNA(INDEX(Synthese!$B$3:$R$34, 1, MATCH(G$1, Synthese!$B29:$Q29, 0)),\"\")","v":""},{"$f":"_xlfn.IFNA(INDEX(Synthese!$B$3:$R$34, 1, MATCH(H$1, Synthese!$B29:$Q29, 0)),\"\")","v":"René"}]
[{"$f":"Synthese!A30","v":"2025-02-27"},{"$f":"_xlfn.IFNA(INDEX(Synthese!$B$3:$R$34, 1, MATCH(B$1, Synthese!$B30:$Q30, 0)),\"\")","v":"Laurent"},{"$f":"_xlfn.IFNA(INDEX(Synthese!$B$3:$R$34, 1, MATCH(C$1, Synthese!$B30:$Q30, 0)),\"\")","v":"Etienne"},{"$f":"_xlfn.IFNA(INDEX(Synthese!$B$3:$R$34, 1, MATCH(D$1, Synthese!$B30:$Q30, 0)),\"\")","v":"Chloé"},{"$f":"_xlfn.IFNA(INDEX(Synthese!$B$3:$R$34, 1, MATCH(E$1, Synthese!$B30:$Q30, 0)),\"\")","v":"Jean Louis"},{"$f":"_xlfn.IFNA(INDEX(Synthese!$B$3:$R$34, 1, MATCH(F$1, Synthese!$B30:$Q30, 0)),\"\")","v":"Christian"},{"$f":"_xlfn.IFNA(INDEX(Synthese!$B$3:$R$34, 1, MATCH(G$1, Synthese!$B30:$Q30, 0)),\"\")","v":""},{"$f":"_xlfn.IFNA(INDEX(Synthese!$B$3:$R$34, 1, MATCH(H$1, Synthese!$B30:$Q30, 0)),\"\")","v":"René"}]
[{"$f":"Synthese!A31","v":"2025-02-28"},{"$f":"_xlfn.IFNA(INDEX(Synthese!$B$3:$R$34, 1, MATCH(B$1, Synthese!$B31:$Q31, 0)),\"\")","v":"Laurent"},{"$f":"_xlfn.IFNA(INDEX(Synthese!$B$3:$R$34, 1, MATCH(C$1, Synthese!$B31:$Q31, 0)),\"\")","v":"Etienne"},{"$f":"_xlfn.IFNA(INDEX(Synthese!$B$3:$R$34, 1, MATCH(D$1, Synthese!$B31:$Q31, 0)),\"\")","v":"Hervé"},{"$f":"_xlfn.IFNA(INDEX(Synthese!$B$3:$R$34, 1, MATCH(E$1, Synthese!$B31:$Q31, 0)),\"\")","v":"Jean Louis"},{"$f":"_xlfn.IFNA(INDEX(Synthese!$B$3:$R$34, 1, MATCH(F$1, Synthese!$B31:$Q31, 0)),\"\")","v":"Christian"},{"$f":"_xlfn.IFNA(INDEX(Synthese!$B$3:$R$34, 1, MATCH(G$1, Synthese!$B31:$Q31, 0)),\"\")","v":""},{"$f":"_xlfn.IFNA(INDEX(Synthese!$B$3:$R$34, 1, MATCH(H$1, Synthese!$B31:$Q31, 0)),\"\")","v":"René"}]
[{"$f":"Synthese!A32","v":""},{"$f":"_xlfn.IFNA(INDEX(Synthese!$B$3:$R$34, 1, MATCH(B$1, Synthese!$B32:$Q32, 0)),\"\")","v":""},{"$f":"_xlfn.IFNA(INDEX(Synthese!$B$3:$R$34, 1, MATCH(C$1, Synthese!$B32:$Q32, 0)),\"\")","v":""},{"$f":"_xlfn.IFNA(INDEX(Synthese!$B$3:$R$34, 1, MATCH(D$1, Synthese!$B32:$Q32, 0)),\"\")","v":""},{"$f":"_xlfn.IFNA(INDEX(Synthese!$B$3:$R$34, 1, MATCH(E$1, Synthese!$B32:$Q32, 0)),\"\")","v":""},{"$f":"_xlfn.IFNA(INDEX(Synthese!$B$3:$R$34, 1, MATCH(F$1, Synthese!$B32:$Q32, 0)),\"\")","v":""},{"$f":"_xlfn.IFNA(INDEX(Synthese!$B$3:$R$34, 1, MATCH(G$1, Synthese!$B32:$Q32, 0)),\"\")","v":""},{"$f":"_xlfn.IFNA(INDEX(Synthese!$B$3:$R$34, 1, MATCH(H$1, Synthese!$B32:$Q32, 0)),\"\")","v":""}]
[{"$f":"Synthese!A33","v":""},{"$f":"_xlfn.IFNA(INDEX(Synthese!$B$3:$R$34, 1, MATCH(B$1, Synthese!$B33:$Q33, 0)),\"\")","v":""},{"$f":"_xlfn.IFNA(INDEX(Synthese!$B$3:$R$34, 1, MATCH(C$1, Synthese!$B33:$Q33, 0)),\"\")","v":""},{"$f":"_xlfn.IFNA(INDEX(Synthese!$B$3:$R$34, 1, MATCH(D$1, Synthese!$B33:$Q33, 0)),\"\")","v":""},{"$f":"_xlfn.IFNA(INDEX(Synthese!$B$3:$R$34, 1, MATCH(E$1, Synthese!$B33:$Q33, 0)),\"\")","v":""},{"$f":"_xlfn.IFNA(INDEX(Synthese!$B$3:$R$34, 1, MATCH(F$1, Synthese!$B33:$Q33, 0)),\"\")","v":""},{"$f":"_xlfn.IFNA(INDEX(Synthese!$B$3:$R$34, 1, MATCH(G$1, Synthese!$B33:$Q33, 0)),\"\")","v":""},{"$f":"_xlfn.IFNA(INDEX(Synthese!$B$3:$R$34, 1, MATCH(H$1, Synthese!$B33:$Q33, 0)),\"\")","v":""}]
[{"$f":"Synthese!A34","v":""},{"$f":"_xlfn.IFNA(INDEX(Synthese!$B$3:$R$34, 1, MATCH(B$1, Synthese!$B34:$Q34, 0)),\"\")","v":""},{"$f":"_xlfn.IFNA(INDEX(Synthese!$B$3:$R$34, 1, MATCH(C$1, Synthese!$B34:$Q34, 0)),\"\")","v":""},{"$f":"_xlfn.IFNA(INDEX(Synthese!$B$3:$R$34, 1, MATCH(D$1, Synthese!$B34:$Q34, 0)),\"\")","v":""},{"$f":"_xlfn.IFNA(INDEX(Synthese!$B$3:$R$34, 1, MATCH(E$1, Synthese!$B34:$Q34, 0)),\"\")","v":""},{"$f":"_xlfn.IFNA(INDEX(Synthese!$B$3:$R$34, 1, MATCH(F$1, Synthese!$B34:$Q34, 0)),\"\")","v":""},{"$f":"_xlfn.IFNA(INDEX(Synthese!$B$3:$R$34, 1, MATCH(G$1, Synthese!$B34:$Q34, 0)),\"\")","v":""},{"$f":"_xlfn.IFNA(INDEX(Synthese!$B$3:$R$34, 1, MATCH(H$1, Synthese!$B34:$Q34, 0)),\"\")","v":""}]

{"sheet":"Laurent","index":3,"n_rows":33,"n_cols":3,"rows_kept":33,"cut":false,"hidden":false,"merged":[]}
[null,{"$f":"RIGHT(CELL(\"nomfichier\",B1),LEN(CELL(\"nomfichier\",B1))-FIND(\"]\",CELL(\"nomfichier\",B1)))","v":"Laurent"}]
[{"$f":"IF(WEEKDAY(Synthese!B4)=1,\"DIMANCHE\",(Synthese!B4))","v":"2025-02-01"},{"$f":"Synthese!C4","v":"MALADIE"},{"$f":"Synthese!D4","v":"00:00:00"}]
[{"$f":"IF(WEEKDAY(Synthese!B5)=1,\"DIMANCHE\",(Synthese!B5))","v":"DIMANCHE"},{"$f":"Synthese!C5","v":0},{"$f":"Synthese!D5","v":"00:00:00"}]
[{"$f":"IF(WEEKDAY(Synthese!B6)=1,\"DIMANCHE\",(Synthese!B6))","v":"2025-02-03"},{"$f":"Synthese!C6","v":"MALADIE"},{"$f":"Synthese!D6","v":"00:00:00"}]
[{"$f":"IF(WEEKDAY(Synthese!B7)=1,\"DIMANCHE\",(Synthese!B7))","v":"2025-02-04"},{"$f":"Synthese!C7","v":"MALADIE"},{"$f":"Synthese!D7","v":"00:00:00"}]
[{"$f":"IF(WEEKDAY(Synthese!B8)=1,\"DIMANCHE\",(Synthese!B8))","v":"2025-02-05"},{"$f":"Synthese!C8","v":"MALADIE"},{"$f":"Synthese!D8","v":"00:00:00"}]
[{"$f":"IF(WEEKDAY(Synthese!B9)=1,\"DIMANCHE\",(Synthese!B9))","v":"2025-02-06"},{"$f":"Synthese!C9","v":"MALADIE"},{"$f":"Synthese!D9","v":"00:00:00"}]
[{"$f":"IF(WEEKDAY(Synthese!B10)=1,\"DIMANCHE\",(Synthese!B10))","v":"2025-02-07"},{"$f":"Synthese!C10","v":"MALADIE"},{"$f":"Synthese!D10","v":"00:00:00"}]
[{"$f":"IF(WEEKDAY(Synthese!B11)=1,\"DIMANCHE\",(Synthese!B11))","v":"2025-02-08"},{"$f":"Synthese!C11","v":"MALADIE"},{"$f":"Synthese!D11","v":"00:00:00"}]
[{"$f":"IF(WEEKDAY(Synthese!B12)=1,\"DIMANCHE\",(Synthese!B12))","v":"DIMANCHE"},{"$f":"Synthese!C12","v":0},{"$f":"Synthese!D12","v":"00:00:00"}]
[{"$f":"IF(WEEKDAY(Synthese!B13)=1,\"DIMANCHE\",(Synthese!B13))","v":"2025-02-10"},{"$f":"Synthese!C13","v":"MALADIE"},{"$f":"Synthese!D13","v":"00:00:00"}]
[{"$f":"IF(WEEKDAY(Synthese!B14)=1,\"DIMANCHE\",(Synthese!B14))","v":"2025-02-11"},{"$f":"Synthese!C14","v":"MALADIE"},{"$f":"Synthese!D14","v":"00:00:00"}]
[{"$f":"IF(WEEKDAY(Synthese!B15)=1,\"DIMANCHE\",(Synthese!B15))","v":"2025-02-12"},{"$f":"Synthese!C15","v":"MALADIE"},{"$f":"Synthese!D15","v":"00:00:00"}]
[{"$f":"IF(WEEKDAY(Synthese!B16)=1,\"DIMANCHE\",(Synthese!B16))","v":"2025-02-13"},{"$f":"Synthese!C16","v":"MALADIE"},{"$f":"Synthese!D16","v":"00:00:00"}]
[{"$f":"IF(WEEKDAY(Synthese!B17)=1,\"DIMANCHE\",(Synthese!B17))","v":"2025-02-14"},{"$f":"Synthese!C17","v":"MALADIE"},{"$f":"Synthese!D17","v":"00:00:00"}]
[{"$f":"IF(WEEKDAY(Synthese!B18)=1,\"DIMANCHE\",(Synthese!B18))","v":"2025-02-15"},{"$f":"Synthese!C18","v":"MALADIE"},{"$f":"Synthese!D18","v":"00:00:00"}]
[{"$f":"IF(WEEKDAY(Synthese!B19)=1,\"DIMANCHE\",(Synthese!B19))","v":"DIMANCHE"},{"$f":"Synthese!C19","v":0},{"$f":"Synthese!D19","v":"00:00:00"}]
[{"$f":"IF(WEEKDAY(Synthese!B20)=1,\"DIMANCHE\",(Synthese!B20))","v":"2025-02-17"},{"$f":"Synthese!C20","v":"VALLONS"},{"$f":"Synthese!D20","v":"05:20:00"}]
[{"$f":"IF(WEEKDAY(Synthese!B21)=1,\"DIMANCHE\",(Synthese!B21))","v":"2025-02-18"},{"$f":"Synthese!C21","v":"VALLONS"},{"$f":"Synthese!D21","v":"05:20:00"}]
[{"$f":"IF(WEEKDAY(Synthese!B22)=1,\"DIMANCHE\",(Synthese!B22))","v":"2025-02-19"},{"$f":"Synthese!C22","v":"VALLONS"},{"$f":"Synthese!D22","v":"05:20:00"}]
[{"$f":"IF(WEEKDAY(Synthese!B23)=1,\"DIMANCHE\",(Synthese!B23))","v":"2025-02-20"},{"$f":"Synthese!C23","v":"VALLONS"},{"$f":"Synthese!D23","v":"05:20:00"}]
[{"$f":"IF(WEEKDAY(Synthese!B24)=1,\"DIMANCHE\",(Synthese!B24))","v":"2025-02-21"},{"$f":"Synthese!C24","v":"VALLONS"},{"$f":"Synthese!D24","v":"05:20:00"}]
[{"$f":"IF(WEEKDAY(Synthese!B25)=1,\"DIMANCHE\",(Synthese!B25))","v":"2025-02-22"},{"$f":"Synthese!C25","v":"VALLONS"},{"$f":"Synthese!D25","v":"03:25:00"}]
[{"$f":"IF(WEEKDAY(Synthese!B26)=1,\"DIMANCHE\",(Synthese!B26))","v":"DIMANCHE"},{"$f":"Synthese!C26","v":0},{"$f":"Synthese!D26","v":"00:00:00"}]
[{"$f":"IF(WEEKDAY(Synthese!B27)=1,\"DIMANCHE\",(Synthese!B27))","v":"2025-02-24"},{"$f":"Synthese!C27","v":"VALLONS"},{"$f":"Synthese!D27","v":"05:20:00"}]
[{"$f":"IF(WEEKDAY(Synthese!B28)=1,\"DIMANCHE\",(Synthese!B28))","v":"2025-02-25"},{"$f":"Synthese!C28","v":"VALLONS"},{"$f":"Synthese!D28","v":"05:20:00"}]
[{"$f":"IF(WEEKDAY(Synthese!B29)=1,\"DIMANCHE\",(Synthese!B29))","v":"2025-02-26"},{"$f":"Synthese!C29","v":"VALLONS"},{"$f":"Synthese!D29","v":"05:20:00"}]
[{"$f":"IF(WEEKDAY(Synthese!B30)=1,\"DIMANCHE\",(Synthese!B30))","v":"2025-02-27"},{"$f":"Synthese!C30","v":"VALLONS"},{"$f":"Synthese!D30","v":"05:20:00"}]
[{"$f":"IF(WEEKDAY(Synthese!B31)=1,\"DIMANCHE\",(Synthese!B31))","v":"2025-02-28"},{"$f":"Synthese!C31","v":"VALLONS"},{"$f":"Synthese!D31","v":"05:20:00"}]
[{"$f":"IF(WEEKDAY(Synthese!B32)=1,\"DIMANCHE\",(Synthese!B32))","v":{"$error":"#VALUE!"}},{"$f":"Synthese!C32","v":0},{"$f":"Synthese!D32","v":false}]
[{"$f":"IF(WEEKDAY(Synthese!B33)=1,\"DIMANCHE\",(Synthese!B33))","v":{"$error":"#VALUE!"}},{"$f":"Synthese!C33","v":0},{"$f":"Synthese!D33","v":false}]
[{"$f":"IF(WEEKDAY(Synthese!B34)=1,\"DIMANCHE\",(Synthese!B34))","v":{"$error":"#VALUE!"}},{"$f":"Synthese!C34","v":0},{"$f":"Synthese!D34","v":false}]
[null,null,{"$f":"SUM(C2:C32)","v":2.3645833333333339}]

{"sheet":"René","index":4,"n_rows":33,"n_cols":3,"rows_kept":33,"cut":false,"hidden":false,"merged":[]}
[null,{"$f":"RIGHT(CELL(\"nomfichier\",B1),LEN(CELL(\"nomfichier\",B1))-FIND(\"]\",CELL(\"nomfichier\",B1)))","v":"René"}]
[{"$f":"IF(WEEKDAY(Synthese!B4)=1,\"DIMANCHE\",(Synthese!B4))","v":"2025-02-01"},{"$f":"Synthese!E4","v":"MALADIE"},{"$f":"Synthese!F4","v":"00:00:00"}]
[{"$f":"IF(WEEKDAY(Synthese!B5)=1,\"DIMANCHE\",(Synthese!B5))","v":"DIMANCHE"},{"$f":"Synthese!E5","v":0},{"$f":"Synthese!F5","v":"00:00:00"}]
[{"$f":"IF(WEEKDAY(Synthese!B6)=1,\"DIMANCHE\",(Synthese!B6))","v":"2025-02-03"},{"$f":"Synthese!E6","v":"MALADIE"},{"$f":"Synthese!F6","v":"00:00:00"}]
[{"$f":"IF(WEEKDAY(Synthese!B7)=1,\"DIMANCHE\",(Synthese!B7))","v":"2025-02-04"},{"$f":"Synthese!E7","v":"MALADIE"},{"$f":"Synthese!F7","v":"00:00:00"}]
[{"$f":"IF(WEEKDAY(Synthese!B8)=1,\"DIMANCHE\",(Synthese!B8))","v":"2025-02-05"},{"$f":"Synthese!E8","v":"MALADIE"},{"$f":"Synthese!F8","v":"00:00:00"}]
[{"$f":"IF(WEEKDAY(Synthese!B9)=1,\"DIMANCHE\",(Synthese!B9))","v":"2025-02-06"},{"$f":"Synthese!E9","v":"MALADIE"},{"$f":"Synthese!F9","v":"00:00:00"}]
[{"$f":"IF(WEEKDAY(Synthese!B10)=1,\"DIMANCHE\",(Synthese!B10))","v":"2025-02-07"},{"$f":"Synthese!E10","v":"MALADIE"},{"$f":"Synthese!F10","v":"00:00:00"}]
[{"$f":"IF(WEEKDAY(Synthese!B11)=1,\"DIMANCHE\",(Synthese!B11))","v":"2025-02-08"},{"$f":"Synthese!E11","v":"MALADIE"},{"$f":"Synthese!F11","v":"00:00:00"}]
[{"$f":"IF(WEEKDAY(Synthese!B12)=1,\"DIMANCHE\",(Synthese!B12))","v":"DIMANCHE"},{"$f":"Synthese!E12","v":0},{"$f":"Synthese!F12","v":"00:00:00"}]
[{"$f":"IF(WEEKDAY(Synthese!B13)=1,\"DIMANCHE\",(Synthese!B13))","v":"2025-02-10"},{"$f":"Synthese!E13","v":"MALADIE"},{"$f":"Synthese!F13","v":"00:00:00"}]
[{"$f":"IF(WEEKDAY(Synthese!B14)=1,\"DIMANCHE\",(Synthese!B14))","v":"2025-02-11"},{"$f":"Synthese!E14","v":"MALADIE"},{"$f":"Synthese!F14","v":"00:00:00"}]
[{"$f":"IF(WEEKDAY(Synthese!B15)=1,\"DIMANCHE\",(Synthese!B15))","v":"2025-02-12"},{"$f":"Synthese!E15","v":"MALADIE"},{"$f":"Synthese!F15","v":"00:00:00"}]
[{"$f":"IF(WEEKDAY(Synthese!B16)=1,\"DIMANCHE\",(Synthese!B16))","v":"2025-02-13"},{"$f":"Synthese!E16","v":"MALADIE"},{"$f":"Synthese!F16","v":"00:00:00"}]
[{"$f":"IF(WEEKDAY(Synthese!B17)=1,\"DIMANCHE\",(Synthese!B17))","v":"2025-02-14"},{"$f":"Synthese!E17","v":"MALADIE"},{"$f":"Synthese!F17","v":"00:00:00"}]
[{"$f":"IF(WEEKDAY(Synthese!B18)=1,\"DIMANCHE\",(Synthese!B18))","v":"2025-02-15"},{"$f":"Synthese!E18","v":"MALADIE"},{"$f":"Synthese!F18","v":"00:00:00"}]
[{"$f":"IF(WEEKDAY(Synthese!B19)=1,\"DIMANCHE\",(Synthese!B19))","v":"DIMANCHE"},{"$f":"Synthese!E19","v":0},{"$f":"Synthese!F19","v":"00:00:00"}]
[{"$f":"IF(WEEKDAY(Synthese!B20)=1,\"DIMANCHE\",(Synthese!B20))","v":"2025-02-17"},{"$f":"Synthese!E20","v":"MALADIE"},{"$f":"Synthese!F20","v":"00:00:00"}]
[{"$f":"IF(WEEKDAY(Synthese!B21)=1,\"DIMANCHE\",(Synthese!B21))","v":"2025-02-18"},{"$f":"Synthese!E21","v":"MALADIE"},{"$f":"Synthese!F21","v":"00:00:00"}]
[{"$f":"IF(WEEKDAY(Synthese!B22)=1,\"DIMANCHE\",(Synthese!B22))","v":"2025-02-19"},{"$f":"Synthese!E22","v":"MALADIE"},{"$f":"Synthese!F22","v":"00:00:00"}]
[{"$f":"IF(WEEKDAY(Synthese!B23)=1,\"DIMANCHE\",(Synthese!B23))","v":"2025-02-20"},{"$f":"Synthese!E23","v":"MALADIE"},{"$f":"Synthese!F23","v":"00:00:00"}]
[{"$f":"IF(WEEKDAY(Synthese!B24)=1,\"DIMANCHE\",(Synthese!B24))","v":"2025-02-21"},{"$f":"Synthese!E24","v":"MALADIE"},{"$f":"Synthese!F24","v":"00:00:00"}]
[{"$f":"IF(WEEKDAY(Synthese!B25)=1,\"DIMANCHE\",(Synthese!B25))","v":"2025-02-22"},{"$f":"Synthese!E25","v":"MALADIE"},{"$f":"Synthese!F25","v":"00:00:00"}]
[{"$f":"IF(WEEKDAY(Synthese!B26)=1,\"DIMANCHE\",(Synthese!B26))","v":"DIMANCHE"},{"$f":"Synthese!E26","v":0},{"$f":"Synthese!F26","v":"00:00:00"}]
[{"$f":"IF(WEEKDAY(Synthese!B27)=1,\"DIMANCHE\",(Synthese!B27))","v":"2025-02-24"},{"$f":"Synthese!E27","v":"MALADIE"},{"$f":"Synthese!F27","v":"00:00:00"}]
[{"$f":"IF(WEEKDAY(Synthese!B28)=1,\"DIMANCHE\",(Synthese!B28))","v":"2025-02-25"},{"$f":"Synthese!E28","v":"MALADIE"},{"$f":"Synthese!F28","v":"00:00:00"}]
[{"$f":"IF(WEEKDAY(Synthese!B29)=1,\"DIMANCHE\",(Synthese!B29))","v":"2025-02-26"},{"$f":"Synthese!E29","v":"MALADIE"},{"$f":"Synthese!F29","v":"00:00:00"}]
[{"$f":"IF(WEEKDAY(Synthese!B30)=1,\"DIMANCHE\",(Synthese!B30))","v":"2025-02-27"},{"$f":"Synthese!E30","v":"MALADIE"},{"$f":"Synthese!F30","v":"00:00:00"}]
[{"$f":"IF(WEEKDAY(Synthese!B31)=1,\"DIMANCHE\",(Synthese!B31))","v":"2025-02-28"},{"$f":"Synthese!E31","v":"MALADIE"},{"$f":"Synthese!F31","v":"00:00:00"}]
[{"$f":"IF(WEEKDAY(Synthese!B32)=1,\"DIMANCHE\",(Synthese!B32))","v":{"$error":"#VALUE!"}},{"$f":"Synthese!E32","v":0},{"$f":"Synthese!F32","v":false}]
[{"$f":"IF(WEEKDAY(Synthese!B33)=1,\"DIMANCHE\",(Synthese!B33))","v":{"$error":"#VALUE!"}},{"$f":"Synthese!E33","v":0},{"$f":"Synthese!F33","v":false}]
[{"$f":"IF(WEEKDAY(Synthese!B34)=1,\"DIMANCHE\",(Synthese!B34))","v":{"$error":"#VALUE!"}},{"$f":"Synthese!E34","v":0},{"$f":"Synthese!F34","v":false}]
[null,null,{"$f":"SUM(C2:C32)","v":0}]

{"sheet":"Jean Michel","index":5,"n_rows":33,"n_cols":3,"rows_kept":33,"cut":false,"hidden":false,"merged":[]}
[null,{"$f":"RIGHT(CELL(\"nomfichier\",B1),LEN(CELL(\"nomfichier\",B1))-FIND(\"]\",CELL(\"nomfichier\",B1)))","v":"Jean Michel"}]
[{"$f":"IF(WEEKDAY(Synthese!B4)=1,\"DIMANCHE\",(Synthese!B4))","v":"2025-02-01"},{"$f":"Synthese!G4","v":"CLUNY"},{"$f":"Synthese!H4","v":"03:00:00"}]
[{"$f":"IF(WEEKDAY(Synthese!B5)=1,\"DIMANCHE\",(Synthese!B5))","v":"DIMANCHE"},{"$f":"Synthese!G5","v":0},{"$f":"Synthese!H5","v":"00:00:00"}]
[{"$f":"IF(WEEKDAY(Synthese!B6)=1,\"DIMANCHE\",(Synthese!B6))","v":"2025-02-03"},{"$f":"Synthese!G6","v":"CLUNY"},{"$f":"Synthese!H6","v":"04:15:00"}]
[{"$f":"IF(WEEKDAY(Synthese!B7)=1,\"DIMANCHE\",(Synthese!B7))","v":"2025-02-04"},{"$f":"Synthese!G7","v":"REPOS"},{"$f":"Synthese!H7","v":"00:00:00"}]
[{"$f":"IF(WEEKDAY(Synthese!B8)=1,\"DIMANCHE\",(Synthese!B8))","v":"2025-02-05"},{"$f":"Synthese!G8","v":"CLUNY"},{"$f":"Synthese!H8","v":"04:15:00"}]
[{"$f":"IF(WEEKDAY(Synthese!B9)=1,\"DIMANCHE\",(Synthese!B9))","v":"2025-02-06"},{"$f":"Synthese!G9","v":"CLUNY"},{"$f":"Synthese!H9","v":"04:15:00"}]
[{"$f":"IF(WEEKDAY(Synthese!B10)=1,\"DIMANCHE\",(Synthese!B10))","v":"2025-02-07"},{"$f":"Synthese!G10","v":"CLUNY"},{"$f":"Synthese!H10","v":"04:15:00"}]
[{"$f":"IF(WEEKDAY(Synthese!B11)=1,\"DIMANCHE\",(Synthese!B11))","v":"2025-02-08"},{"$f":"Synthese!G11","v":"CLUNY"},{"$f":"Synthese!H11","v":"03:00:00"}]
[{"$f":"IF(WEEKDAY(Synthese!B12)=1,\"DIMANCHE\",(Synthese!B12))","v":"DIMANCHE"},{"$f":"Synthese!G12","v":0},{"$f":"Synthese!H12","v":"00:00:00"}]
[{"$f":"IF(WEEKDAY(Synthese!B13)=1,\"DIMANCHE\",(Synthese!B13))","v":"2025-02-10"},{"$f":"Synthese!G13","v":"REPOS"},{"$f":"Synthese!H13","v":"00:00:00"}]
[{"$f":"IF(WEEKDAY(Synthese!B14)=1,\"DIMANCHE\",(Synthese!B14))","v":"2025-02-11"},{"$f":"Synthese!G14","v":"CLUNY"},{"$f":"Synthese!H14","v":"04:15:00"}]
[{"$f":"IF(WEEKDAY(Synthese!B15)=1,\"DIMANCHE\",(Synthese!B15))","v":"2025-02-12"},{"$f":"Synthese!G15","v":"CLUNY"},{"$f":"Synthese!H15","v":"04:15:00"}]
[{"$f":"IF(WEEKDAY(Synthese!B16)=1,\"DIMANCHE\",(Synthese!B16))","v":"2025-02-13"},{"$f":"Synthese!G16","v":"CLUNY"},{"$f":"Synthese!H16","v":"04:15:00"}]
[{"$f":"IF(WEEKDAY(Synthese!B17)=1,\"DIMANCHE\",(Synthese!B17))","v":"2025-02-14"},{"$f":"Synthese!G17","v":"CLUNY"},{"$f":"Synthese!H17","v":"04:15:00"}]
[{"$f":"IF(WEEKDAY(Synthese!B18)=1,\"DIMANCHE\",(Synthese!B18))","v":"2025-02-15"},{"$f":"Synthese!G18","v":"CLUNY"},{"$f":"Synthese!H18","v":"03:00:00"}]
[{"$f":"IF(WEEKDAY(Synthese!B19)=1,\"DIMANCHE\",(Synthese!B19))","v":"DIMANCHE"},{"$f":"Synthese!G19","v":0},{"$f":"Synthese!H19","v":"00:00:00"}]
[{"$f":"IF(WEEKDAY(Synthese!B20)=1,\"DIMANCHE\",(Synthese!B20))","v":"2025-02-17"},{"$f":"Synthese!G20","v":"CLUNY"},{"$f":"Synthese!H20","v":"04:15:00"}]
[{"$f":"IF(WEEKDAY(Synthese!B21)=1,\"DIMANCHE\",(Synthese!B21))","v":"2025-02-18"},{"$f":"Synthese!G21","v":"CLUNY"},{"$f":"Synthese!H21","v":"04:15:00"}]
[{"$f":"IF(WEEKDAY(Synthese!B22)=1,\"DIMANCHE\",(Synthese!B22))","v":"2025-02-19"},{"$f":"Synthese!G22","v":"REPOS"},{"$f":"Synthese!H22","v":"00:00:00"}]
[{"$f":"IF(WEEKDAY(Synthese!B23)=1,\"DIMANCHE\",(Synthese!B23))","v":"2025-02-20"},{"$f":"Synthese!G23","v":"CLUNY"},{"$f":"Synthese!H23","v":"04:15:00"}]
[{"$f":"IF(WEEKDAY(Synthese!B24)=1,\"DIMANCHE\",(Synthese!B24))","v":"2025-02-21"},{"$f":"Synthese!G24","v":"CLUNY"},{"$f":"Synthese!H24","v":"04:15:00"}]
[{"$f":"IF(WEEKDAY(Synthese!B25)=1,\"DIMANCHE\",(Synthese!B25))","v":"2025-02-22"},{"$f":"Synthese!G25","v":"REPOS"},{"$f":"Synthese!H25","v":"00:00:00"}]
[{"$f":"IF(WEEKDAY(Synthese!B26)=1,\"DIMANCHE\",(Synthese!B26))","v":"DIMANCHE"},{"$f":"Synthese!G26","v":0},{"$f":"Synthese!H26","v":"00:00:00"}]
[{"$f":"IF(WEEKDAY(Synthese!B27)=1,\"DIMANCHE\",(Synthese!B27))","v":"2025-02-24"},{"$f":"Synthese!G27","v":"CLUNY"},{"$f":"Synthese!H27","v":"04:15:00"}]
[{"$f":"IF(WEEKDAY(Synthese!B28)=1,\"DIMANCHE\",(Synthese!B28))","v":"2025-02-25"},{"$f":"Synthese!G28","v":"CLUNY"},{"$f":"Synthese!H28","v":"04:15:00"}]
[{"$f":"IF(WEEKDAY(Synthese!B29)=1,\"DIMANCHE\",(Synthese!B29))","v":"2025-02-26"},{"$f":"Synthese!G29","v":"CLUNY"},{"$f":"Synthese!H29","v":"04:15:00"}]
[{"$f":"IF(WEEKDAY(Synthese!B30)=1,\"DIMANCHE\",(Synthese!B30))","v":"2025-02-27"},{"$f":"Synthese!G30","v":"REPOS"},{"$f":"Synthese!H30","v":"00:00:00"}]
[{"$f":"IF(WEEKDAY(Synthese!B31)=1,\"DIMANCHE\",(Synthese!B31))","v":"2025-02-28"},{"$f":"Synthese!G31","v":"REPOS"},{"$f":"Synthese!H31","v":"00:00:00"}]
[{"$f":"IF(WEEKDAY(Synthese!B32)=1,\"DIMANCHE\",(Synthese!B32))","v":{"$error":"#VALUE!"}},{"$f":"Synthese!G32","v":0},{"$f":"Synthese!H32","v":false}]
[{"$f":"IF(WEEKDAY(Synthese!B33)=1,\"DIMANCHE\",(Synthese!B33))","v":{"$error":"#VALUE!"}},{"$f":"Synthese!G33","v":0},{"$f":"Synthese!H33","v":false}]
[{"$f":"IF(WEEKDAY(Synthese!B34)=1,\"DIMANCHE\",(Synthese!B34))","v":{"$error":"#VALUE!"}},{"$f":"Synthese!G34","v":0},{"$f":"Synthese!H34","v":false}]
[null,null,{"$f":"SUM(C2:C32)","v":3.0312500000000004}]

{"sheet":"Etienne","index":6,"n_rows":33,"n_cols":3,"rows_kept":33,"cut":false,"hidden":false,"merged":[]}
[null,{"$f":"RIGHT(CELL(\"nomfichier\",B1),LEN(CELL(\"nomfichier\",B1))-FIND(\"]\",CELL(\"nomfichier\",B1)))","v":"Etienne"}]
[{"$f":"IF(WEEKDAY(Synthese!B4)=1,\"DIMANCHE\",(Synthese!B4))","v":"2025-02-01"},{"$f":"Synthese!I4","v":"CRECHES"},{"$f":"Synthese!J4","v":"02:55:00"}]
[{"$f":"IF(WEEKDAY(Synthese!B5)=1,\"DIMANCHE\",(Synthese!B5))","v":"DIMANCHE"},{"$f":"Synthese!I5","v":0},{"$f":"Synthese!J5","v":"00:00:00"}]
[{"$f":"IF(WEEKDAY(Synthese!B6)=1,\"DIMANCHE\",(Synthese!B6))","v":"2025-02-03"},{"$f":"Synthese!I6","v":"CRECHES"},{"$f":"Synthese!J6","v":"06:45:00"}]
[{"$f":"IF(WEEKDAY(Synthese!B7)=1,\"DIMANCHE\",(Synthese!B7))","v":"2025-02-04"},{"$f":"Synthese!I7","v":"CRECHES"},{"$f":"Synthese!J7","v":"06:45:00"}]
[{"$f":"IF(WEEKDAY(Synthese!B8)=1,\"DIMANCHE\",(Synthese!B8))","v":"2025-02-05"},{"$f":"Synthese!I8","v":"CRECHES"},{"$f":"Synthese!J8","v":"06:45:00"}]
[{"$f":"IF(WEEKDAY(Synthese!B9)=1,\"DIMANCHE\",(Synthese!B9))","v":"2025-02-06"},{"$f":"Synthese!I9","v":"CRECHES"},{"$f":"Synthese!J9","v":"06:45:00"}]
[{"$f":"IF(WEEKDAY(Synthese!B10)=1,\"DIMANCHE\",(Synthese!B10))","v":"2025-02-07"},{"$f":"Synthese!I10","v":"CRECHES"},{"$f":"Synthese!J10","v":"06:45:00"}]
[{"$f":"IF(WEEKDAY(Synthese!B11)=1,\"DIMANCHE\",(Synthese!B11))","v":"2025-02-08"},{"$f":"Synthese!I11","v":"CRECHES"},{"$f":"Synthese!J11","v":"02:55:00"}]
[{"$f":"IF(WEEKDAY(Synthese!B12)=1,\"DIMANCHE\",(Synthese!B12))","v":"DIMANCHE"},{"$f":"Synthese!I12","v":0},{"$f":"Synthese!J12","v":"00:00:00"}]
[{"$f":"IF(WEEKDAY(Synthese!B13)=1,\"DIMANCHE\",(Synthese!B13))","v":"2025-02-10"},{"$f":"Synthese!I13","v":"CRECHES"},{"$f":"Synthese!J13","v":"06:45:00"}]
[{"$f":"IF(WEEKDAY(Synthese!B14)=1,\"DIMANCHE\",(Synthese!B14))","v":"2025-02-11"},{"$f":"Synthese!I14","v":"CRECHES"},{"$f":"Synthese!J14","v":"06:45:00"}]
[{"$f":"IF(WEEKDAY(Synthese!B15)=1,\"DIMANCHE\",(Synthese!B15))","v":"2025-02-12"},{"$f":"Synthese!I15","v":"CRECHES"},{"$f":"Synthese!J15","v":"06:45:00"}]
[{"$f":"IF(WEEKDAY(Synthese!B16)=1,\"DIMANCHE\",(Synthese!B16))","v":"2025-02-13"},{"$f":"Synthese!I16","v":"CRECHES"},{"$f":"Synthese!J16","v":"06:45:00"}]
[{"$f":"IF(WEEKDAY(Synthese!B17)=1,\"DIMANCHE\",(Synthese!B17))","v":"2025-02-14"},{"$f":"Synthese!I17","v":"CRECHES"},{"$f":"Synthese!J17","v":"06:45:00"}]
[{"$f":"IF(WEEKDAY(Synthese!B18)=1,\"DIMANCHE\",(Synthese!B18))","v":"2025-02-15"},{"$f":"Synthese!I18","v":"CRECHES"},{"$f":"Synthese!J18","v":"02:55:00"}]
[{"$f":"IF(WEEKDAY(Synthese!B19)=1,\"DIMANCHE\",(Synthese!B19))","v":"DIMANCHE"},{"$f":"Synthese!I19","v":0},{"$f":"Synthese!J19","v":"00:00:00"}]
[{"$f":"IF(WEEKDAY(Synthese!B20)=1,\"DIMANCHE\",(Synthese!B20))","v":"2025-02-17"},{"$f":"Synthese!I20","v":"REPOS"},{"$f":"Synthese!J20","v":"00:00:00"}]
[{"$f":"IF(WEEKDAY(Synthese!B21)=1,\"DIMANCHE\",(Synthese!B21))","v":"2025-02-18"},{"$f":"Synthese!I21","v":"REPOS"},{"$f":"Synthese!J21","v":"00:00:00"}]
[{"$f":"IF(WEEKDAY(Synthese!B22)=1,\"DIMANCHE\",(Synthese!B22))","v":"2025-02-19"},{"$f":"Synthese!I22","v":"REPOS"},{"$f":"Synthese!J22","v":"00:00:00"}]
[{"$f":"IF(WEEKDAY(Synthese!B23)=1,\"DIMANCHE\",(Synthese!B23))","v":"2025-02-20"},{"$f":"Synthese!I23","v":"CRECHES"},{"$f":"Synthese!J23","v":"06:45:00"}]
[{"$f":"IF(WEEKDAY(Synthese!B24)=1,\"DIMANCHE\",(Synthese!B24))","v":"2025-02-21"},{"$f":"Synthese!I24","v":"CRECHES"},{"$f":"Synthese!J24","v":"06:45:00"}]
[{"$f":"IF(WEEKDAY(Synthese!B25)=1,\"DIMANCHE\",(Synthese!B25))","v":"2025-02-22"},{"$f":"Synthese!I25","v":"CRECHES"},{"$f":"Synthese!J25","v":"02:55:00"}]
[{"$f":"IF(WEEKDAY(Synthese!B26)=1,\"DIMANCHE\",(Synthese!B26))","v":"DIMANCHE"},{"$f":"Synthese!I26","v":0},{"$f":"Synthese!J26","v":"00:00:00"}]
[{"$f":"IF(WEEKDAY(Synthese!B27)=1,\"DIMANCHE\",(Synthese!B27))","v":"2025-02-24"},{"$f":"Synthese!I27","v":"CRECHES"},{"$f":"Synthese!J27","v":"06:45:00"}]
[{"$f":"IF(WEEKDAY(Synthese!B28)=1,\"DIMANCHE\",(Synthese!B28))","v":"2025-02-25"},{"$f":"Synthese!I28","v":"CRECHES"},{"$f":"Synthese!J28","v":"06:45:00"}]
[{"$f":"IF(WEEKDAY(Synthese!B29)=1,\"DIMANCHE\",(Synthese!B29))","v":"2025-02-26"},{"$f":"Synthese!I29","v":"CRECHES"},{"$f":"Synthese!J29","v":"06:45:00"}]
[{"$f":"IF(WEEKDAY(Synthese!B30)=1,\"DIMANCHE\",(Synthese!B30))","v":"2025-02-27"},{"$f":"Synthese!I30","v":"CRECHES"},{"$f":"Synthese!J30","v":"06:45:00"}]
[{"$f":"IF(WEEKDAY(Synthese!B31)=1,\"DIMANCHE\",(Synthese!B31))","v":"2025-02-28"},{"$f":"Synthese!I31","v":"CRECHES"},{"$f":"Synthese!J31","v":"06:45:00"}]
[{"$f":"IF(WEEKDAY(Synthese!B32)=1,\"DIMANCHE\",(Synthese!B32))","v":{"$error":"#VALUE!"}},{"$f":"Synthese!I32","v":0},{"$f":"Synthese!J32","v":false}]
[{"$f":"IF(WEEKDAY(Synthese!B33)=1,\"DIMANCHE\",(Synthese!B33))","v":{"$error":"#VALUE!"}},{"$f":"Synthese!I33","v":0},{"$f":"Synthese!J33","v":false}]
[{"$f":"IF(WEEKDAY(Synthese!B34)=1,\"DIMANCHE\",(Synthese!B34))","v":{"$error":"#VALUE!"}},{"$f":"Synthese!I34","v":0},{"$f":"Synthese!J34","v":false}]
[null,null,{"$f":"SUM(C2:C32)","v":5.2673611111111107}]

{"sheet":"Jean Louis","index":7,"n_rows":33,"n_cols":3,"rows_kept":33,"cut":false,"hidden":false,"merged":[]}
[null,{"$f":"RIGHT(CELL(\"nomfichier\",B1),LEN(CELL(\"nomfichier\",B1))-FIND(\"]\",CELL(\"nomfichier\",B1)))","v":"Jean Louis"}]
[{"$f":"IF(WEEKDAY(Synthese!B4)=1,\"DIMANCHE\",(Synthese!B4))","v":"2025-02-01"},{"$f":"Synthese!K4","v":"PARAY"},{"$f":"Synthese!L4","v":"04:15:00"}]
[{"$f":"IF(WEEKDAY(Synthese!B5)=1,\"DIMANCHE\",(Synthese!B5))","v":"DIMANCHE"},{"$f":"Synthese!K5","v":0},{"$f":"Synthese!L5","v":"00:00:00"}]
[{"$f":"IF(WEEKDAY(Synthese!B6)=1,\"DIMANCHE\",(Synthese!B6))","v":"2025-02-03"},{"$f":"Synthese!K6","v":"PARAY"},{"$f":"Synthese!L6","v":"05:00:00"}]
[{"$f":"IF(WEEKDAY(Synthese!B7)=1,\"DIMANCHE\",(Synthese!B7))","v":"2025-02-04"},{"$f":"Synthese!K7","v":"PARAY"},{"$f":"Synthese!L7","v":"05:00:00"}]
[{"$f":"IF(WEEKDAY(Synthese!B8)=1,\"DIMANCHE\",(Synthese!B8))","v":"2025-02-05"},{"$f":"Synthese!K8","v":"PARAY"},{"$f":"Synthese!L8","v":"05:00:00"}]
[{"$f":"IF(WEEKDAY(Synthese!B9)=1,\"DIMANCHE\",(Synthese!B9))","v":"2025-02-06"},{"$f":"Synthese!K9","v":"PARAY"},{"$f":"Synthese!L9","v":"05:00:00"}]
[{"$f":"IF(WEEKDAY(Synthese!B10)=1,\"DIMANCHE\",(Synthese!B10))","v":"2025-02-07"},{"$f":"Synthese!K10","v":"REPOS"},{"$f":"Synthese!L10","v":"00:00:00"}]
[{"$f":"IF(WEEKDAY(Synthese!B11)=1,\"DIMANCHE\",(Synthese!B11))","v":"2025-02-08"},{"$f":"Synthese!K11","v":"PARAY"},{"$f":"Synthese!L11","v":"04:15:00"}]
[{"$f":"IF(WEEKDAY(Synthese!B12)=1,\"DIMANCHE\",(Synthese!B12))","v":"DIMANCHE"},{"$f":"Synthese!K12","v":0},{"$f":"Synthese!L12","v":"00:00:00"}]
[{"$f":"IF(WEEKDAY(Synthese!B13)=1,\"DIMANCHE\",(Synthese!B13))","v":"2025-02-10"},{"$f":"Synthese!K13","v":"PARAY"},{"$f":"Synthese!L13","v":"05:00:00"}]
[{"$f":"IF(WEEKDAY(Synthese!B14)=1,\"DIMANCHE\",(Synthese!B14))","v":"2025-02-11"},{"$f":"Synthese!K14","v":"PARAY"},{"$f":"Synthese!L14","v":"05:00:00"}]
[{"$f":"IF(WEEKDAY(Synthese!B15)=1,\"DIMANCHE\",(Synthese!B15))","v":"2025-02-12"},{"$f":"Synthese!K15","v":"PARAY"},{"$f":"Synthese!L15","v":"05:00:00"}]
[{"$f":"IF(WEEKDAY(Synthese!B16)=1,\"DIMANCHE\",(Synthese!B16))","v":"2025-02-13"},{"$f":"Synthese!K16","v":"REPOS"},{"$f":"Synthese!L16","v":"00:00:00"}]
[{"$f":"IF(WEEKDAY(Synthese!B17)=1,\"DIMANCHE\",(Synthese!B17))","v":"2025-02-14"},{"$f":"Synthese!K17","v":"PARAY"},{"$f":"Synthese!L17","v":"05:00:00"}]
[{"$f":"IF(WEEKDAY(Synthese!B18)=1,\"DIMANCHE\",(Synthese!B18))","v":"2025-02-15"},{"$f":"Synthese!K18","v":"REPOS"},{"$f":"Synthese!L18","v":"00:00:00"}]
[{"$f":"IF(WEEKDAY(Synthese!B19)=1,\"DIMANCHE\",(Synthese!B19))","v":"DIMANCHE"},{"$f":"Synthese!K19","v":0},{"$f":"Synthese!L19","v":"00:00:00"}]
[{"$f":"IF(WEEKDAY(Synthese!B20)=1,\"DIMANCHE\",(Synthese!B20))","v":"2025-02-17"},{"$f":"Synthese!K20","v":"PARAY"},{"$f":"Synthese!L20","v":"05:00:00"}]
[{"$f":"IF(WEEKDAY(Synthese!B21)=1,\"DIMANCHE\",(Synthese!B21))","v":"2025-02-18"},{"$f":"Synthese!K21","v":"PARAY"},{"$f":"Synthese!L21","v":"05:00:00"}]
[{"$f":"IF(WEEKDAY(Synthese!B22)=1,\"DIMANCHE\",(Synthese!B22))","v":"2025-02-19"},{"$f":"Synthese!K22","v":"PARAY"},{"$f":"Synthese!L22","v":"05:00:00"}]
[{"$f":"IF(WEEKDAY(Synthese!B23)=1,\"DIMANCHE\",(Synthese!B23))","v":"2025-02-20"},{"$f":"Synthese!K23","v":"REPOS"},{"$f":"Synthese!L23","v":"00:00:00"}]
[{"$f":"IF(WEEKDAY(Synthese!B24)=1,\"DIMANCHE\",(Synthese!B24))","v":"2025-02-21"},{"$f":"Synthese!K24","v":"PARAY"},{"$f":"Synthese!L24","v":"05:00:00"}]
[{"$f":"IF(WEEKDAY(Synthese!B25)=1,\"DIMANCHE\",(Synthese!B25))","v":"2025-02-22"},{"$f":"Synthese!K25","v":"PARAY"},{"$f":"Synthese!L25","v":"04:15:00"}]
[{"$f":"IF(WEEKDAY(Synthese!B26)=1,\"DIMANCHE\",(Synthese!B26))","v":"DIMANCHE"},{"$f":"Synthese!K26","v":0},{"$f":"Synthese!L26","v":"00:00:00"}]
[{"$f":"IF(WEEKDAY(Synthese!B27)=1,\"DIMANCHE\",(Synthese!B27))","v":"2025-02-24"},{"$f":"Synthese!K27","v":"PARAY"},{"$f":"Synthese!L27","v":"05:00:00"}]
[{"$f":"IF(WEEKDAY(Synthese!B28)=1,\"DIMANCHE\",(Synthese!B28))","v":"2025-02-25"},{"$f":"Synthese!K28","v":"REPOS"},{"$f":"Synthese!L28","v":"00:00:00"}]
[{"$f":"IF(WEEKDAY(Synthese!B29)=1,\"DIMANCHE\",(Synthese!B29))","v":"2025-02-26"},{"$f":"Synthese!K29","v":"PARAY"},{"$f":"Synthese!L29","v":"05:00:00"}]
[{"$f":"IF(WEEKDAY(Synthese!B30)=1,\"DIMANCHE\",(Synthese!B30))","v":"2025-02-27"},{"$f":"Synthese!K30","v":"PARAY"},{"$f":"Synthese!L30","v":"05:00:00"}]
[{"$f":"IF(WEEKDAY(Synthese!B31)=1,\"DIMANCHE\",(Synthese!B31))","v":"2025-02-28"},{"$f":"Synthese!K31","v":"PARAY"},{"$f":"Synthese!L31","v":"05:00:00"}]
[{"$f":"IF(WEEKDAY(Synthese!B32)=1,\"DIMANCHE\",(Synthese!B32))","v":{"$error":"#VALUE!"}},{"$f":"Synthese!K32","v":0},{"$f":"Synthese!L32","v":false}]
[{"$f":"IF(WEEKDAY(Synthese!B33)=1,\"DIMANCHE\",(Synthese!B33))","v":{"$error":"#VALUE!"}},{"$f":"Synthese!K33","v":0},{"$f":"Synthese!L33","v":false}]
[{"$f":"IF(WEEKDAY(Synthese!B34)=1,\"DIMANCHE\",(Synthese!B34))","v":{"$error":"#VALUE!"}},{"$f":"Synthese!K34","v":0},{"$f":"Synthese!L34","v":false}]
[null,null,{"$f":"SUM(C2:C32)","v":3.8645833333333344}]

{"sheet":"Hervé","index":8,"n_rows":33,"n_cols":3,"rows_kept":33,"cut":false,"hidden":false,"merged":[]}
[null,{"$f":"RIGHT(CELL(\"nomfichier\",B1),LEN(CELL(\"nomfichier\",B1))-FIND(\"]\",CELL(\"nomfichier\",B1)))","v":"Hervé"}]
[{"$f":"IF(WEEKDAY(Synthese!B4)=1,\"DIMANCHE\",(Synthese!B4))","v":"2025-02-01"},{"$f":"Synthese!O4","v":"VALLONS"},{"$f":"Synthese!P4","v":"03:25:00"}]
[{"$f":"IF(WEEKDAY(Synthese!B5)=1,\"DIMANCHE\",(Synthese!B5))","v":"DIMANCHE"},{"$f":"Synthese!O5","v":0},{"$f":"Synthese!P5","v":"00:00:00"}]
[{"$f":"IF(WEEKDAY(Synthese!B6)=1,\"DIMANCHE\",(Synthese!B6))","v":"2025-02-03"},{"$f":"Synthese!O6","v":"REPOS"},{"$f":"Synthese!P6","v":"00:00:00"}]
[{"$f":"IF(WEEKDAY(Synthese!B7)=1,\"DIMANCHE\",(Synthese!B7))","v":"2025-02-04"},{"$f":"Synthese!O7","v":"VALLONS"},{"$f":"Synthese!P7","v":"05:20:00"}]
[{"$f":"IF(WEEKDAY(Synthese!B8)=1,\"DIMANCHE\",(Synthese!B8))","v":"2025-02-05"},{"$f":"Synthese!O8","v":"VALLONS"},{"$f":"Synthese!P8","v":"05:20:00"}]
[{"$f":"IF(WEEKDAY(Synthese!B9)=1,\"DIMANCHE\",(Synthese!B9))","v":"2025-02-06"},{"$f":"Synthese!O9","v":"REPOS"},{"$f":"Synthese!P9","v":"00:00:00"}]
[{"$f":"IF(WEEKDAY(Synthese!B10)=1,\"DIMANCHE\",(Synthese!B10))","v":"2025-02-07"},{"$f":"Synthese!O10","v":"VALLONS"},{"$f":"Synthese!P10","v":"05:20:00"}]
[{"$f":"IF(WEEKDAY(Synthese!B11)=1,\"DIMANCHE\",(Synthese!B11))","v":"2025-02-08"},{"$f":"Synthese!O11","v":"VALLONS"},{"$f":"Synthese!P11","v":"03:25:00"}]
[{"$f":"IF(WEEKDAY(Synthese!B12)=1,\"DIMANCHE\",(Synthese!B12))","v":"DIMANCHE"},{"$f":"Synthese!O12","v":0},{"$f":"Synthese!P12","v":"00:00:00"}]
[{"$f":"IF(WEEKDAY(Synthese!B13)=1,\"DIMANCHE\",(Synthese!B13))","v":"2025-02-10"},{"$f":"Synthese!O13","v":"VALLONS"},{"$f":"Synthese!P13","v":"05:20:00"}]
[{"$f":"IF(WEEKDAY(Synthese!B14)=1,\"DIMANCHE\",(Synthese!B14))","v":"2025-02-11"},{"$f":"Synthese!O14","v":"REPOS"},{"$f":"Synthese!P14","v":"00:00:00"}]
[{"$f":"IF(WEEKDAY(Synthese!B15)=1,\"DIMANCHE\",(Synthese!B15))","v":"2025-02-12"},{"$f":"Synthese!O15","v":"VALLONS"},{"$f":"Synthese!P15","v":"05:20:00"}]
[{"$f":"IF(WEEKDAY(Synthese!B16)=1,\"DIMANCHE\",(Synthese!B16))","v":"2025-02-13"},{"$f":"Synthese!O16","v":"VALLONS"},{"$f":"Synthese!P16","v":"05:20:00"}]
[{"$f":"IF(WEEKDAY(Synthese!B17)=1,\"DIMANCHE\",(Synthese!B17))","v":"2025-02-14"},{"$f":"Synthese!O17","v":"VALLONS"},{"$f":"Synthese!P17","v":"05:20:00"}]
[{"$f":"IF(WEEKDAY(Synthese!B18)=1,\"DIMANCHE\",(Synthese!B18))","v":"2025-02-15"},{"$f":"Synthese!O18","v":"VALLONS"},{"$f":"Synthese!P18","v":"03:25:00"}]
[{"$f":"IF(WEEKDAY(Synthese!B19)=1,\"DIMANCHE\",(Synthese!B19))","v":"DIMANCHE"},{"$f":"Synthese!O19","v":0},{"$f":"Synthese!P19","v":"00:00:00"}]
[{"$f":"IF(WEEKDAY(Synthese!B20)=1,\"DIMANCHE\",(Synthese!B20))","v":"2025-02-17"},{"$f":"Synthese!O20","v":"AIN"},{"$f":"Synthese!P20","v":"04:40:00"}]
[{"$f":"IF(WEEKDAY(Synthese!B21)=1,\"DIMANCHE\",(Synthese!B21))","v":"2025-02-18"},{"$f":"Synthese!O21","v":"AIN"},{"$f":"Synthese!P21","v":"04:40:00"}]
[{"$f":"IF(WEEKDAY(Synthese!B22)=1,\"DIMANCHE\",(Synthese!B22))","v":"2025-02-19"},{"$f":"Synthese!O22","v":"AIN"},{"$f":"Synthese!P22","v":"04:40:00"}]
[{"$f":"IF(WEEKDAY(Synthese!B23)=1,\"DIMANCHE\",(Synthese!B23))","v":"2025-02-20"},{"$f":"Synthese!O23","v":"REPOS"},{"$f":"Synthese!P23","v":"00:00:00"}]
[{"$f":"IF(WEEKDAY(Synthese!B24)=1,\"DIMANCHE\",(Synthese!B24))","v":"2025-02-21"},{"$f":"Synthese!O24","v":"REPOS"},{"$f":"Synthese!P24","v":"00:00:00"}]
[{"$f":"IF(WEEKDAY(Synthese!B25)=1,\"DIMANCHE\",(Synthese!B25))","v":"2025-02-22"},{"$f":"Synthese!O25","v":"REPOS"},{"$f":"Synthese!P25","v":"00:00:00"}]
[{"$f":"IF(WEEKDAY(Synthese!B26)=1,\"DIMANCHE\",(Synthese!B26))","v":"DIMANCHE"},{"$f":"Synthese!O26","v":0},{"$f":"Synthese!P26","v":"00:00:00"}]
[{"$f":"IF(WEEKDAY(Synthese!B27)=1,\"DIMANCHE\",(Synthese!B27))","v":"2025-02-24"},{"$f":"Synthese!O27","v":"REPOS"},{"$f":"Synthese!P27","v":"00:00:00"}]
[{"$f":"IF(WEEKDAY(Synthese!B28)=1,\"DIMANCHE\",(Synthese!B28))","v":"2025-02-25"},{"$f":"Synthese!O28","v":"REPOS"},{"$f":"Synthese!P28","v":"00:00:00"}]
[{"$f":"IF(WEEKDAY(Synthese!B29)=1,\"DIMANCHE\",(Synthese!B29))","v":"2025-02-26"},{"$f":"Synthese!O29","v":"REPOS"},{"$f":"Synthese!P29","v":"00:00:00"}]
[{"$f":"IF(WEEKDAY(Synthese!B30)=1,\"DIMANCHE\",(Synthese!B30))","v":"2025-02-27"},{"$f":"Synthese!O30","v":"REPOS"},{"$f":"Synthese!P30","v":"00:00:00"}]
[{"$f":"IF(WEEKDAY(Synthese!B31)=1,\"DIMANCHE\",(Synthese!B31))","v":"2025-02-28"},{"$f":"Synthese!O31","v":"AIN"},{"$f":"Synthese!P31","v":"04:40:00"}]
[{"$f":"IF(WEEKDAY(Synthese!B32)=1,\"DIMANCHE\",(Synthese!B32))","v":{"$error":"#VALUE!"}},{"$f":"Synthese!O32","v":0},{"$f":"Synthese!P32","v":false}]
[{"$f":"IF(WEEKDAY(Synthese!B33)=1,\"DIMANCHE\",(Synthese!B33))","v":{"$error":"#VALUE!"}},{"$f":"Synthese!O33","v":0},{"$f":"Synthese!P33","v":false}]
[{"$f":"IF(WEEKDAY(Synthese!B34)=1,\"DIMANCHE\",(Synthese!B34))","v":{"$error":"#VALUE!"}},{"$f":"Synthese!O34","v":0},{"$f":"Synthese!P34","v":false}]
[null,null,{"$f":"SUM(C2:C32)","v":2.7604166666666679}]

{"sheet":"Christian","index":9,"n_rows":33,"n_cols":3,"rows_kept":33,"cut":false,"hidden":false,"merged":[]}
[null,{"$f":"RIGHT(CELL(\"nomfichier\",B1),LEN(CELL(\"nomfichier\",B1))-FIND(\"]\",CELL(\"nomfichier\",B1)))","v":"Christian"}]
[{"$f":"IF(WEEKDAY(Synthese!B4)=1,\"DIMANCHE\",(Synthese!B4))","v":"2025-02-01"},{"$f":"Synthese!M4","v":"REPOS"},{"$f":"Synthese!N4","v":"00:00:00"}]
[{"$f":"IF(WEEKDAY(Synthese!B5)=1,\"DIMANCHE\",(Synthese!B5))","v":"DIMANCHE"},{"$f":"Synthese!M5","v":0},{"$f":"Synthese!N5","v":"00:00:00"}]
[{"$f":"IF(WEEKDAY(Synthese!B6)=1,\"DIMANCHE\",(Synthese!B6))","v":"2025-02-03"},{"$f":"Synthese!M6","v":"VALLONS"},{"$f":"Synthese!N6","v":"05:20:00"}]
[{"$f":"IF(WEEKDAY(Synthese!B7)=1,\"DIMANCHE\",(Synthese!B7))","v":"2025-02-04"},{"$f":"Synthese!M7","v":"CLUNY"},{"$f":"Synthese!N7","v":"04:15:00"}]
[{"$f":"IF(WEEKDAY(Synthese!B8)=1,\"DIMANCHE\",(Synthese!B8))","v":"2025-02-05"},{"$f":"Synthese!M8","v":"REPOS"},{"$f":"Synthese!N8","v":"00:00:00"}]
[{"$f":"IF(WEEKDAY(Synthese!B9)=1,\"DIMANCHE\",(Synthese!B9))","v":"2025-02-06"},{"$f":"Synthese!M9","v":"VALLONS"},{"$f":"Synthese!N9","v":"05:20:00"}]
[{"$f":"IF(WEEKDAY(Synthese!B10)=1,\"DIMANCHE\",(Synthese!B10))","v":"2025-02-07"},{"$f":"Synthese!M10","v":"PARAY"},{"$f":"Synthese!N10","v":"05:00:00"}]
[{"$f":"IF(WEEKDAY(Synthese!B11)=1,\"DIMANCHE\",(Synthese!B11))","v":"2025-02-08"},{"$f":"Synthese!M11","v":"AIN"},{"$f":"Synthese!N11","v":"03:20:00"}]
[{"$f":"IF(WEEKDAY(Synthese!B12)=1,\"DIMANCHE\",(Synthese!B12))","v":"DIMANCHE"},{"$f":"Synthese!M12","v":0},{"$f":"Synthese!N12","v":"00:00:00"}]
[{"$f":"IF(WEEKDAY(Synthese!B13)=1,\"DIMANCHE\",(Synthese!B13))","v":"2025-02-10"},{"$f":"Synthese!M13","v":"CLUNY"},{"$f":"Synthese!N13","v":"04:15:00"}]
[{"$f":"IF(WEEKDAY(Synthese!B14)=1,\"DIMANCHE\",(Synthese!B14))","v":"2025-02-11"},{"$f":"Synthese!M14","v":"VALLONS"},{"$f":"Synthese!N14","v":"05:20:00"}]
[{"$f":"IF(WEEKDAY(Synthese!B15)=1,\"DIMANCHE\",(Synthese!B15))","v":"2025-02-12"},{"$f":"Synthese!M15","v":"REPOS"},{"$f":"Synthese!N15","v":"00:00:00"}]
[{"$f":"IF(WEEKDAY(Synthese!B16)=1,\"DIMANCHE\",(Synthese!B16))","v":"2025-02-13"},{"$f":"Synthese!M16","v":"PARAY"},{"$f":"Synthese!N16","v":"05:00:00"}]
[{"$f":"IF(WEEKDAY(Synthese!B17)=1,\"DIMANCHE\",(Synthese!B17))","v":"2025-02-14"},{"$f":"Synthese!M17","v":"AIN"},{"$f":"Synthese!N17","v":"04:40:00"}]
[{"$f":"IF(WEEKDAY(Synthese!B18)=1,\"DIMANCHE\",(Synthese!B18))","v":"2025-02-15"},{"$f":"Synthese!M18","v":"PARAY"},{"$f":"Synthese!N18","v":"04:15:00"}]
[{"$f":"IF(WEEKDAY(Synthese!B19)=1,\"DIMANCHE\",(Synthese!B19))","v":"DIMANCHE"},{"$f":"Synthese!M19","v":0},{"$f":"Synthese!N19","v":"00:00:00"}]
[{"$f":"IF(WEEKDAY(Synthese!B20)=1,\"DIMANCHE\",(Synthese!B20))","v":"2025-02-17"},{"$f":"Synthese!M20","v":"REPOS"},{"$f":"Synthese!N20","v":"00:00:00"}]
[{"$f":"IF(WEEKDAY(Synthese!B21)=1,\"DIMANCHE\",(Synthese!B21))","v":"2025-02-18"},{"$f":"Synthese!M21","v":"REPOS"},{"$f":"Synthese!N21","v":"00:00:00"}]
[{"$f":"IF(WEEKDAY(Synthese!B22)=1,\"DIMANCHE\",(Synthese!B22))","v":"2025-02-19"},{"$f":"Synthese!M22","v":"CLUNY"},{"$f":"Synthese!N22","v":"04:15:00"}]
[{"$f":"IF(WEEKDAY(Synthese!B23)=1,\"DIMANCHE\",(Synthese!B23))","v":"2025-02-20"},{"$f":"Synthese!M23","v":"PARAY"},{"$f":"Synthese!N23","v":"05:00:00"}]
[{"$f":"IF(WEEKDAY(Synthese!B24)=1,\"DIMANCHE\",(Synthese!B24))","v":"2025-02-21"},{"$f":"Synthese!M24","v":"AIN"},{"$f":"Synthese!N24","v":"04:40:00"}]
[{"$f":"IF(WEEKDAY(Synthese!B25)=1,\"DIMANCHE\",(Synthese!B25))","v":"2025-02-22"},{"$f":"Synthese!M25","v":"CLUNY"},{"$f":"Synthese!N25","v":"03:00:00"}]
[{"$f":"IF(WEEKDAY(Synthese!B26)=1,\"DIMANCHE\",(Synthese!B26))","v":"DIMANCHE"},{"$f":"Synthese!M26","v":0},{"$f":"Synthese!N26","v":"00:00:00"}]
[{"$f":"IF(WEEKDAY(Synthese!B27)=1,\"DIMANCHE\",(Synthese!B27))","v":"2025-02-24"},{"$f":"Synthese!M27","v":"REPOS"},{"$f":"Synthese!N27","v":"00:00:00"}]
[{"$f":"IF(WEEKDAY(Synthese!B28)=1,\"DIMANCHE\",(Synthese!B28))","v":"2025-02-25"},{"$f":"Synthese!M28","v":"PARAY"},{"$f":"Synthese!N28","v":"05:00:00"}]
[{"$f":"IF(WEEKDAY(Synthese!B29)=1,\"DIMANCHE\",(Synthese!B29))","v":"2025-02-26"},{"$f":"Synthese!M29","v":"REPOS"},{"$f":"Synthese!N29","v":"00:00:00"}]
[{"$f":"IF(WEEKDAY(Synthese!B30)=1,\"DIMANCHE\",(Synthese!B30))","v":"2025-02-27"},{"$f":"Synthese!M30","v":"CLUNY"},{"$f":"Synthese!N30","v":"04:15:00"}]
[{"$f":"IF(WEEKDAY(Synthese!B31)=1,\"DIMANCHE\",(Synthese!B31))","v":"2025-02-28"},{"$f":"Synthese!M31","v":"CLUNY"},{"$f":"Synthese!N31","v":"04:15:00"}]
[{"$f":"IF(WEEKDAY(Synthese!B32)=1,\"DIMANCHE\",(Synthese!B32))","v":{"$error":"#VALUE!"}},{"$f":"Synthese!M32","v":0},{"$f":"Synthese!N32","v":false}]
[{"$f":"IF(WEEKDAY(Synthese!B33)=1,\"DIMANCHE\",(Synthese!B33))","v":{"$error":"#VALUE!"}},{"$f":"Synthese!M33","v":0},{"$f":"Synthese!N33","v":false}]
[{"$f":"IF(WEEKDAY(Synthese!B34)=1,\"DIMANCHE\",(Synthese!B34))","v":{"$error":"#VALUE!"}},{"$f":"Synthese!M34","v":0},{"$f":"Synthese!N34","v":false}]
[null,null,{"$f":"SUM(C2:C32)","v":3.2152777777777781}]

{"sheet":"Chloé","index":10,"n_rows":33,"n_cols":3,"rows_kept":33,"cut":false,"hidden":false,"merged":[]}
[null,{"$f":"RIGHT(CELL(\"nomfichier\",B1),LEN(CELL(\"nomfichier\",B1))-FIND(\"]\",CELL(\"nomfichier\",B1)))","v":"Chloé"}]
[{"$f":"IF(WEEKDAY(Synthese!B4)=1,\"DIMANCHE\",(Synthese!B4))","v":"2025-02-01"},{"$f":"Synthese!Q4","v":"AIN"},{"$f":"Synthese!R4","v":"03:20:00"}]
[{"$f":"IF(WEEKDAY(Synthese!B5)=1,\"DIMANCHE\",(Synthese!B5))","v":"DIMANCHE"},{"$f":"Synthese!Q5","v":0},{"$f":"Synthese!R5","v":"00:00:00"}]
[{"$f":"IF(WEEKDAY(Synthese!B6)=1,\"DIMANCHE\",(Synthese!B6))","v":"2025-02-03"},{"$f":"Synthese!Q6","v":"AIN"},{"$f":"Synthese!R6","v":"04:40:00"}]
[{"$f":"IF(WEEKDAY(Synthese!B7)=1,\"DIMANCHE\",(Synthese!B7))","v":"2025-02-04"},{"$f":"Synthese!Q7","v":"AIN"},{"$f":"Synthese!R7","v":"04:40:00"}]
[{"$f":"IF(WEEKDAY(Synthese!B8)=1,\"DIMANCHE\",(Synthese!B8))","v":"2025-02-05"},{"$f":"Synthese!Q8","v":"AIN"},{"$f":"Synthese!R8","v":"04:40:00"}]
[{"$f":"IF(WEEKDAY(Synthese!B9)=1,\"DIMANCHE\",(Synthese!B9))","v":"2025-02-06"},{"$f":"Synthese!Q9","v":"AIN"},{"$f":"Synthese!R9","v":"04:40:00"}]
[{"$f":"IF(WEEKDAY(Synthese!B10)=1,\"DIMANCHE\",(Synthese!B10))","v":"2025-02-07"},{"$f":"Synthese!Q10","v":"AIN"},{"$f":"Synthese!R10","v":"04:40:00"}]
[{"$f":"IF(WEEKDAY(Synthese!B11)=1,\"DIMANCHE\",(Synthese!B11))","v":"2025-02-08"},{"$f":"Synthese!Q11","v":"REPOS"},{"$f":"Synthese!R11","v":"00:00:00"}]
[{"$f":"IF(WEEKDAY(Synthese!B12)=1,\"DIMANCHE\",(Synthese!B12))","v":"DIMANCHE"},{"$f":"Synthese!Q12","v":0},{"$f":"Synthese!R12","v":"00:00:00"}]
[{"$f":"IF(WEEKDAY(Synthese!B13)=1,\"DIMANCHE\",(Synthese!B13))","v":"2025-02-10"},{"$f":"Synthese!Q13","v":"AIN"},{"$f":"Synthese!R13","v":"04:40:00"}]
[{"$f":"IF(WEEKDAY(Synthese!B14)=1,\"DIMANCHE\",(Synthese!B14))","v":"2025-02-11"},{"$f":"Synthese!Q14","v":"AIN"},{"$f":"Synthese!R14","v":"04:40:00"}]
[{"$f":"IF(WEEKDAY(Synthese!B15)=1,\"DIMANCHE\",(Synthese!B15))","v":"2025-02-12"},{"$f":"Synthese!Q15","v":"AIN"},{"$f":"Synthese!R15","v":"04:40:00"}]
[{"$f":"IF(WEEKDAY(Synthese!B16)=1,\"DIMANCHE\",(Synthese!B16))","v":"2025-02-13"},{"$f":"Synthese!Q16","v":"AIN"},{"$f":"Synthese!R16","v":"04:40:00"}]
[{"$f":"IF(WEEKDAY(Synthese!B17)=1,\"DIMANCHE\",(Synthese!B17))","v":"2025-02-14"},{"$f":"Synthese!Q17","v":"REPOS"},{"$f":"Synthese!R17","v":"00:00:00"}]
[{"$f":"IF(WEEKDAY(Synthese!B18)=1,\"DIMANCHE\",(Synthese!B18))","v":"2025-02-15"},{"$f":"Synthese!Q18","v":"AIN"},{"$f":"Synthese!R18","v":"03:20:00"}]
[{"$f":"IF(WEEKDAY(Synthese!B19)=1,\"DIMANCHE\",(Synthese!B19))","v":"DIMANCHE"},{"$f":"Synthese!Q19","v":0},{"$f":"Synthese!R19","v":"00:00:00"}]
[{"$f":"IF(WEEKDAY(Synthese!B20)=1,\"DIMANCHE\",(Synthese!B20))","v":"2025-02-17"},{"$f":"Synthese!Q20","v":"CRECHES"},{"$f":"Synthese!R20","v":"06:45:00"}]
[{"$f":"IF(WEEKDAY(Synthese!B21)=1,\"DIMANCHE\",(Synthese!B21))","v":"2025-02-18"},{"$f":"Synthese!Q21","v":"CRECHES"},{"$f":"Synthese!R21","v":"06:45:00"}]
[{"$f":"IF(WEEKDAY(Synthese!B22)=1,\"DIMANCHE\",(Synthese!B22))","v":"2025-02-19"},{"$f":"Synthese!Q22","v":"CRECHES"},{"$f":"Synthese!R22","v":"06:45:00"}]
[{"$f":"IF(WEEKDAY(Synthese!B23)=1,\"DIMANCHE\",(Synthese!B23))","v":"2025-02-20"},{"$f":"Synthese!Q23","v":"AIN"},{"$f":"Synthese!R23","v":"04:40:00"}]
[{"$f":"IF(WEEKDAY(Synthese!B24)=1,\"DIMANCHE\",(Synthese!B24))","v":"2025-02-21"},{"$f":"Synthese!Q24","v":"REPOS"},{"$f":"Synthese!R24","v":"00:00:00"}]
[{"$f":"IF(WEEKDAY(Synthese!B25)=1,\"DIMANCHE\",(Synthese!B25))","v":"2025-02-22"},{"$f":"Synthese!Q25","v":"AIN"},{"$f":"Synthese!R25","v":"03:20:00"}]
[{"$f":"IF(WEEKDAY(Synthese!B26)=1,\"DIMANCHE\",(Synthese!B26))","v":"DIMANCHE"},{"$f":"Synthese!Q26","v":0},{"$f":"Synthese!R26","v":"00:00:00"}]
[{"$f":"IF(WEEKDAY(Synthese!B27)=1,\"DIMANCHE\",(Synthese!B27))","v":"2025-02-24"},{"$f":"Synthese!Q27","v":"AIN"},{"$f":"Synthese!R27","v":"04:40:00"}]
[{"$f":"IF(WEEKDAY(Synthese!B28)=1,\"DIMANCHE\",(Synthese!B28))","v":"2025-02-25"},{"$f":"Synthese!Q28","v":"AIN"},{"$f":"Synthese!R28","v":"04:40:00"}]
[{"$f":"IF(WEEKDAY(Synthese!B29)=1,\"DIMANCHE\",(Synthese!B29))","v":"2025-02-26"},{"$f":"Synthese!Q29","v":"AIN"},{"$f":"Synthese!R29","v":"04:40:00"}]
[{"$f":"IF(WEEKDAY(Synthese!B30)=1,\"DIMANCHE\",(Synthese!B30))","v":"2025-02-27"},{"$f":"Synthese!Q30","v":"AIN"},{"$f":"Synthese!R30","v":"04:40:00"}]
[{"$f":"IF(WEEKDAY(Synthese!B31)=1,\"DIMANCHE\",(Synthese!B31))","v":"2025-02-28"},{"$f":"Synthese!Q31","v":"REPOS"},{"$f":"Synthese!R31","v":"00:00:00"}]
[{"$f":"IF(WEEKDAY(Synthese!B32)=1,\"DIMANCHE\",(Synthese!B32))","v":{"$error":"#VALUE!"}},{"$f":"Synthese!Q32","v":0},{"$f":"Synthese!R32","v":false}]
[{"$f":"IF(WEEKDAY(Synthese!B33)=1,\"DIMANCHE\",(Synthese!B33))","v":{"$error":"#VALUE!"}},{"$f":"Synthese!Q33","v":0},{"$f":"Synthese!R33","v":false}]
[{"$f":"IF(WEEKDAY(Synthese!B34)=1,\"DIMANCHE\",(Synthese!B34))","v":{"$error":"#VALUE!"}},{"$f":"Synthese!Q34","v":0},{"$f":"Synthese!R34","v":false}]
[null,null,{"$f":"SUM(C2:C32)","v":3.9826388888888897}]