{"text_format":"1","workbook":"xlsx","n_sheets":11,"sheets":["parametres","Synthese","Affectation","Laurent","René","Jean Michel","Etienne","Jean Louis","Hervé","Christian","Chloé"],"not_rendered":{"charts":0,"images":0,"macros":1,"external_links":0,"defined_names":2,"comments":1,"pivot_tables":0},"unopened":[],"bounds":{"document_bytes":16777216,"sheet_cells":100000,"rows_first":2000,"rows_last":500,"rows_between":2000,"halvings":0,"cell_chars":16384,"cell_head_chars":4096},"cells_cut":0,"cells_raw":0,"read":"whole","date_system":"1900"}

{"sheet":"parametres","index":0,"n_rows":3,"n_cols":11,"rows_kept":3,"cut":false,"hidden":false,"merged":[]}
[null,null,"VALLONS","CRECHES","AIN","PARAY","CLUNY","CP","MALADIE","REPOS","FORMATION"]
["Semaine","VIERGE","05:20:00","06:45:00","04:40:00","05:00:00","04:15:00","00:00:00","00:00:00","00:00:00","02:00:00"]
["Samedi",null,"03:25:00","02:55:00","03:20:00","04:15:00","03:00:00","00:00:00","00:00:00","00:00:00"]

{"sheet":"Synthese","index":1,"n_rows":37,"n_cols":18,"rows_kept":37,"cut":false,"hidden":false,"merged":[[0,0,0,16]]}
[{"$f":"B4","v":"2025-02-01"}]
[]
[null,"Date","Laurent",null,"René",null,"Jean Michel",null,"Etienne",null,"Jean Louis",null,"Christian",null,"Hervé",null,"Chloé"]
[{"$f":"B4","v":"2025-02-01"},"2025-02-01","MALADIE",{"$f":"IF(ISNUMBER(B4),IF(OR(ISBLANK(C4),WEEKDAY($B4,2)=7),0,IF(WEEKDAY($B4,2)<=5,HLOOKUP(C4,parametres!$C$1:$S$3,2,FALSE),HLOOKUP(C4,parametres!$C$1:$S$3,3,FALSE))))","v":"00:00:00"},"MALADIE",{"$f":"IF(ISNUMBER(D4),IF(OR(ISBLANK(E4),WEEKDAY($B4,2)=7),0,IF(WEEKDAY($B4,2)<=5,HLOOKUP(E4,parametres!$C$1:$S$3,2,FALSE),HLOOKUP(E4,parametres!$C$1:$S$3,3,FALSE))))","v":"00:00:00"},"CLUNY",{"$f":"IF(ISNUMBER(F4),IF(OR(ISBLANK(G4),WEEKDAY($B4,2)=7),0,IF(WEEKDAY($B4,2)<=5,HLOOKUP(G4,parametres!$C$1:$S$3,2,FALSE),HLOOKUP(G4,parametres!$C$1:$S$3,3,FALSE))))","v":"03:00:00"},"CRECHES",{"$f":"IF(ISNUMBER(H4),IF(OR(ISBLANK(I4),WEEKDAY($B4,2)=7),0,IF(WEEKDAY($B4,2)<=5,HLOOKUP(I4,parametres!$C$1:$S$3,2,FALSE),HLOOKUP(I4,parametres!$C$1:$S$3,3,FALSE))))","v":"02:55:00"},"PARAY",{"$f":"IF(ISNUMBER(J4),IF(OR(ISBLANK(K4),WEEKDAY($B4,2)=7),0,IF(WEEKDAY($B4,2)<=5,HLOOKUP(K4,parametres!$C$1:$S$3,2,FALSE),HLOOKUP(K4,parametres!$C$1:$S$3,3,FALSE))))","v":"04:15:00"},"REPOS",{"$f":"IF(ISNUMBER(L4),IF(OR(ISBLANK(M4),WEEKDAY($B4,2)=7),0,IF(WEEKDAY($B4,2)<=5,HLOOKUP(M4,parametres!$C$1:$S$3,2,FALSE),HLOOKUP(M4,parametres!$C$1:$S$3,3,FALSE))))","v":"00:00:00"},"VALLONS",{"$f":"IF(ISNUMBER(N4),IF(OR(ISBLANK(O4),WEEKDAY($B4,2)=7),0,IF(WEEKDAY($B4,2)<=5,HLOOKUP(O4,parametres!$C$1:$S$3,2,FALSE),HLOOKUP(O4,parametres!$C$1:$S$3,3,FALSE))))","v":"03:25:00"},"AIN",{"$f":"IF(ISNUMBER(P4),IF(OR(ISBLANK(Q4),WEEKDAY($B4,2)=7),0,IF(WEEKDAY($B4,2)<=5,HLOOKUP(Q4,parametres!$C$1:$S$3,2,FALSE),HLOOKUP(Q4,parametres!$C$1:$S$3,3,FALSE))))","v":"03:20:00"}]
["2025-02-02",{"$f":"IF(B4=\"\",\"\",IF(B4=EOMONTH(B4,0),\"\",B4+1))","v":"2025-02-02"},null,{"$f":"IF(ISNUMBER(B5),IF(OR(ISBLANK(C5),WEEKDAY($B5,2)=7),0,IF(WEEKDAY($B5,2)<=5,HLOOKUP(C5,parametres!$C$1:$S$3,2,FALSE),HLOOKUP(C5,parametres!$C$1:$S$3,3,FALSE))))","v":"00:00:00"},null,{"$f":"IF(ISNUMBER(D5),IF(OR(ISBLANK(E5),WEEKDAY($B5,2)=7),0,IF(WEEKDAY($B5,2)<=5,HLOOKUP(E5,parametres!$C$1:$S$3,2,FALSE),HLOOKUP(E5,parametres!$C$1:$S$3,3,FALSE))))","v":"00:00:00"},null,{"$f":"IF(ISNUMBER(F5),IF(OR(ISBLANK(G5),WEEKDAY($B5,2)=7),0,IF(WEEKDAY($B5,2)<=5,HLOOKUP(G5,parametres!$C$1:$S$3,2,FALSE),HLOOKUP(G5,parametres!$C$1:$S$3,3,FALSE))))","v":"00:00:00"},null,{"$f":"IF(ISNUMBER(H5),IF(OR(ISBLANK(I5),WEEKDAY($B5,2)=7),0,IF(WEEKDAY($B5,2)<=5,HLOOKUP(I5,parametres!$C$1:$S$3,2,FALSE),HLOOKUP(I5,parametres!$C$1:$S$3,3,FALSE))))","v":"00:00:00"},null,{"$f":"IF(ISNUMBER(J5),IF(OR(ISBLANK(K5),WEEKDAY($B5,2)=7),0,IF(WEEKDAY($B5,2)<=5,HLOOKUP(K5,parametres!$C$1:$S$3,2,FALSE),HLOOKUP(K5,parametres!$C$1:$S$3,3,FALSE))))","v":"00:00:00"},null,{"$f":"IF(ISNUMBER(L5),IF(OR(ISBLANK(M5),WEEKDAY($B5,2)=7),0,IF(WEEKDAY($B5,2)<=5,HLOOKUP(M5,parametres!$C$1:$S$3,2,FALSE),HLOOKUP(M5,parametres!$C$1:$S$3,3,FALSE))))","v":"00:00:00"},null,{"$f":"IF(ISNUMBER(N5),IF(OR(ISBLANK(O5),WEEKDAY($B5,2)=7),0,IF(WEEKDAY($B5,2)<=5,HLOOKUP(O5,parametres!$C$1:$S$3,2,FALSE),HLOOKUP(O5,parametres!$C$1:$S$3,3,FALSE))))","v":"00:00:00"},null,{"$f":"IF(ISNUMBER(P5),IF(OR(ISBLANK(Q5),WEEKDAY($B5,2)=7),0,IF(WEEKDAY($B5,2)<=5,HLOOKUP(Q5,parametres!$C$1:$S$3,2,FALSE),HLOOKUP(Q5,parametres!$C$1:$S$3,3,FALSE))))","v":"00:00:00"}]
["2025-02-03",{"$f":"IF(B5=\"\",\"\",IF(B5=EOMONTH(B5,0),\"\",B5+1))","v":"2025-02-03"},"MALADIE",{"$f":"IF(ISNUMBER(B6),IF(OR(ISBLANK(C6),WEEKDAY($B6,2)=7),0,IF(WEEKDAY($B6,2)<=5,HLOOKUP(C6,parametres!$C$1:$S$3,2,FALSE),HLOOKUP(C6,parametres!$C$1:$S$3,3,FALSE))))","v":"00:00:00"},"MALADIE",{"$f":"IF(ISNUMBER(D6),IF(OR(ISBLANK(E6),WEEKDAY($B6,2)=7),0,IF(WEEKDAY($B6,2)<=5,HLOOKUP(E6,parametres!$C$1:$S$3,2,FALSE),HLOOKUP(E6,parametres!$C$1:$S$3,3,FALSE))))","v":"00:00:00"},"CLUNY",{"$f":"IF(ISNUMBER(F6),IF(OR(ISBLANK(G6),WEEKDAY($B6,2)=7),0,IF(WEEKDAY($B6,2)<=5,HLOOKUP(G6,parametres!$C$1:$S$3,2,FALSE),HLOOKUP(G6,parametres!$C$1:$S$3,3,FALSE))))","v":"04:15:00"},"CRECHES",{"$f":"IF(ISNUMBER(H6),IF(OR(ISBLANK(I6),WEEKDAY($B6,2)=7),0,IF(WEEKDAY($B6,2)<=5,HLOOKUP(I6,parametres!$C$1:$S$3,2,FALSE),HLOOKUP(I6,parametres!$C$1:$S$3,3,FALSE))))","v":"06:45:00"},"PARAY",{"$f":"IF(ISNUMBER(J6),IF(OR(ISBLANK(K6),WEEKDAY($B6,2)=7),0,IF(WEEKDAY($B6,2)<=5,HLOOKUP(K6,parametres!$C$1:$S$3,2,FALSE),HLOOKUP(K6,parametres!$C$1:$S$3,3,FALSE))))","v":"05:00:00"},"VALLONS",{"$f":"IF(ISNUMBER(L6),IF(OR(ISBLANK(M6),WEEKDAY($B6,2)=7),0,IF(WEEKDAY($B6,2)<=5,HLOOKUP(M6,parametres!$C$1:$S$3,2,FALSE),HLOOKUP(M6,parametres!$C$1:$S$3,3,FALSE))))","v":"05:20:00"},"REPOS",{"$f":"IF(ISNUMBER(N6),IF(OR(ISBLANK(O6),WEEKDAY($B6,2)=7),0,IF(WEEKDAY($B6,2)<=5,HLOOKUP(O6,parametres!$C$1:$S$3,2,FALSE),HLOOKUP(O6,parametres!$C$1:$S$3,3,FALSE))))","v":"00:00:00"},"AIN",{"$f":"IF(ISNUMBER(P6),IF(OR(ISBLANK(Q6),WEEKDAY($B6,2)=7),0,IF(WEEKDAY($B6,2)<=5,HLOOKUP(Q6,parametres!$C$1:$S$3,2,FALSE),HLOOKUP(Q6,parametres!$C$1:$S$3,3,FALSE))))","v":"04:40:00"}]
["2025-02-04","2025-02-04","MALADIE",{"$f":"IF(ISNUMBER(B7),IF(OR(ISBLANK(C7),WEEKDAY($B7,2)=7),0,IF(WEEKDAY($B7,2)<=5,HLOOKUP(C7,parametres!$C$1:$S$3,2,FALSE),HLOOKUP(C7,parametres!$C$1:$S$3,3,FALSE))))","v":"00:00:00"},"MALADIE",{"$f":"IF(ISNUMBER(D7),IF(OR(ISBLANK(E7),WEEKDAY($B7,2)=7),0,IF(WEEKDAY($B7,2)<=5,HLOOKUP(E7,parametres!$C$1:$S$3,2,FALSE),HLOOKUP(E7,parametres!$C$1:$S$3,3,FALSE))))","v":"00:00:00"},"REPOS",{"$f":"IF(ISNUMBER(F7),IF(OR(ISBLANK(G7),WEEKDAY($B7,2)=7),0,IF(WEEKDAY($B7,2)<=5,HLOOKUP(G7,parametres!$C$1:$S$3,2,FALSE),HLOOKUP(G7,parametres!$C$1:$S$3,3,FALSE))))","v":"00:00:00"},"CRECHES",{"$f":"IF(ISNUMBER(H7),IF(OR(ISBLANK(I7),WEEKDAY($B7,2)=7),0,IF(WEEKDAY($B7,2)<=5,HLOOKUP(I7,parametres!$C$1:$S$3,2,FALSE),HLOOKUP(I7,parametres!$C$1:$S$3,3,FALSE))))","v":"06:45:00"},"PARAY",{"$f":"IF(ISNUMBER(J7),IF(OR(ISBLANK(K7),WEEKDAY($B7,2)=7),0,IF(WEEKDAY($B7,2)<=5,HLOOKUP(K7,parametres!$C$1:$S$3,2,FALSE),HLOOKUP(K7,parametres!$C$1:$S$3,3,FALSE))))","v":"05:00:00"},"CLUNY",{"$f":"IF(ISNUMBER(L7),IF(OR(ISBLANK(M7),WEEKDAY($B7,2)=7),0,IF(WEEKDAY($B7,2)<=5,HLOOKUP(M7,parametres!$C$1:$S$3,2,FALSE),HLOOKUP(M7,parametres!$C$1:$S$3,3,FALSE))))","v":"04:15:00"},"VALLONS",{"$f":"IF(ISNUMBER(N7),IF(OR(ISBLANK(O7),WEEKDAY($B7,2)=7),0,IF(WEEKDAY($B7,2)<=5,HLOOKUP(O7,parametres!$C$1:$S$3,2,FALSE),HLOOKUP(O7,parametres!$C$1:$S$3,3,FALSE))))","v":"05:20:00"},"AIN",{"$f":"IF(ISNUMBER(P7),IF(OR(ISBLANK(Q7),WEEKDAY($B7,2)=7),0,IF(WEEKDAY($B7,2)<=5,HLOOKUP(Q7,parametres!$C$1:$S$3,2,FALSE),HLOOKUP(Q7,parametres!$C$1:$S$3,3,FALSE))))","v":"04:40:00"}]
["2025-02-05","2025-02-05","MALADIE",{"$f":"IF(ISNUMBER(B8),IF(OR(ISBLANK(C8),WEEKDAY($B8,2)=7),0,IF(WEEKDAY($B8,2)<=5,HLOOKUP(C8,parametres!$C$1:$S$3,2,FALSE),HLOOKUP(C8,parametres!$C$1:$S$3,3,FALSE))))","v":"00:00:00"},"MALADIE",{"$f":"IF(ISNUMBER(D8),IF(OR(ISBLANK(E8),WEEKDAY($B8,2)=7),0,IF(WEEKDAY($B8,2)<=5,HLOOKUP(E8,parametres!$C$1:$S$3,2,FALSE),HLOOKUP(E8,parametres!$C$1:$S$3,3,FALSE))))","v":"00:00:00"},"CLUNY",{"$f":"IF(ISNUMBER(F8),IF(OR(ISBLANK(G8),WEEKDAY($B8,2)=7),0,IF(WEEKDAY($B8,2)<=5,HLOOKUP(G8,parametres!$C$1:$S$3,2,FALSE),HLOOKUP(G8,parametres!$C$1:$S$3,3,FALSE))))","v":"04:15:00"},"CRECHES",{"$f":"IF(ISNUMBER(H8),IF(OR(ISBLANK(I8),WEEKDAY($B8,2)=7),0,IF(WEEKDAY($B8,2)<=5,HLOOKUP(I8,parametres!$C$1:$S$3,2,FALSE),HLOOKUP(I8,parametres!$C$1:$S$3,3,FALSE))))","v":"06:45:00"},"PARAY",{"$f":"IF(ISNUMBER(J8),IF(OR(ISBLANK(K8),WEEKDAY($B8,2)=7),0,IF(WEEKDAY($B8,2)<=5,HLOOKUP(K8,parametres!$C$1:$S$3,2,FALSE),HLOOKUP(K8,parametres!$C$1:$S$3,3,FALSE))))","v":"05:00:00"},"REPOS",{"$f":"IF(ISNUMBER(L8),IF(OR(ISBLANK(M8),WEEKDAY($B8,2)=7),0,IF(WEEKDAY($B8,2)<=5,HLOOKUP(M8,parametres!$C$1:$S$3,2,FALSE),HLOOKUP(M8,parametres!$C$1:$S$3,3,FALSE))))","v":"00:00:00"},"VALLONS",{"$f":"IF(ISNUMBER(N8),IF(OR(ISBLANK(O8),WEEKDAY($B8,2)=7),0,IF(WEEKDAY($B8,2)<=5,HLOOKUP(O8,parametres!$C$1:$S$3,2,FALSE),HLOOKUP(O8,parametres!$C$1:$S$3,3,FALSE))))","v":"05:20:00"},"AIN",{"$f":"IF(ISNUMBER(P8),IF(OR(ISBLANK(Q8),WEEKDAY($B8,2)=7),0,IF(WEEKDAY($B8,2)<=5,HLOOKUP(Q8,parametres!$C$1:$S$3,2,FALSE),HLOOKUP(Q8,parametres!$C$1:$S$3,3,FALSE))))","v":"04:40:00"}]
{"$rows_left_out":30}
{"sheet":"Affectation","index":2,"n_rows":32,"n_cols":8,"rows_kept":32,"cut":false,"hidden":false,"merged":[]}
[null,{"$f":"parametres!C1","v":"VALLONS"},{"$f":"parametres!D1","v":"CRECHES"},{"$f":"parametres!E1","v":"AIN"},{"$f":"parametres!F1","v":"PARAY"},{"$f":"parametres!G1","v":"CLUNY"},{"$f":"parametres!H1","v":"CP"},{"$f":"parametres!I1","v":"MALADIE"}]
[{"$f":"Synthese!A4","v":"2025-02-01"},{"$f":"_xlfn.IFNA(INDEX(Synthese!$B$3:$R$34, 1, MATCH(B$1, Synthese!$B4:$Q4, 0)),\"\")","v":"Hervé"},{"$f":"_xlfn.IFNA(INDEX(Synthese!$B$3:$R$34, 1, MATCH(C$1, Synthese!$B4:$Q4, 0)),\"\")","v":"Etienne"},{"$f":"_xlfn.IFNA(INDEX(Synthese!$B$3:$R$34, 1, MATCH(D$1, Synthese!$B4:$Q4, 0)),\"\")","v":"Chloé"},{"$f":"_xlfn.IFNA(INDEX(Synthese!$B$3:$R$34, 1, MATCH(E$1, Synthese!$B4:$Q4, 0)),\"\")","v":"Jean Louis"},{"$f":"_xlfn.IFNA(INDEX(Synthese!$B$3:$R$34, 1, MATCH(F$1, Synthese!$B4:$Q4, 0)),\"\")","v":"Jean Michel"},{"$f":"_xlfn.IFNA(INDEX(Synthese!$B$3:$R$34, 1, MATCH(G$1, Synthese!$B4:$Q4, 0)),\"\")","v":""},{"$f":"_xlfn.IFNA(INDEX(Synthese!$B$3:$R$34, 1, MATCH(H$1, Synthese!$B4:$Q4, 0)),\"\")","v":"Laurent"}]
[{"$f":"Synthese!A5","v":"2025-02-02"},{"$f":"_xlfn.IFNA(INDEX(Synthese!$B$3:$R$34, 1, MATCH(B$1, Synthese!$B5:$Q5, 0)),\"\")","v":""},{"$f":"_xlfn.IFNA(INDEX(Synthese!$B$3:$R$34, 1, MATCH(C$1, Synthese!$B5:$Q5, 0)),\"\")","v":""},{"$f":"_xlfn.IFNA(INDEX(Synthese!$B$3:$R$34, 1, MATCH(D$1, Synthese!$B5:$Q5, 0)),\"\")","v":""},{"$f":"_xlfn.IFNA(INDEX(Synthese!$B$3:$R$34, 1, MATCH(E$1, Synthese!$B5:$Q5, 0)),\"\")","v":""},{"$f":"_xlfn.IFNA(INDEX(Synthese!$B$3:$R$34, 1, MATCH(F$1, Synthese!$B5:$Q5, 0)),\"\")","v":""},{"$f":"_xlfn.IFNA(INDEX(Synthese!$B$3:$R$34, 1, MATCH(G$1, Synthese!$B5:$Q5, 0)),\"\")","v":""},{"$f":"_xlfn.IFNA(INDEX(Synthese!$B$3:$R$34, 1, MATCH(H$1, Synthese!$B5:$Q5, 0)),\"\")","v":""}]
[{"$f":"Synthese!A6","v":"2025-02-03"},{"$f":"_xlfn.IFNA(INDEX(Synthese!$B$3:$R$34, 1, MATCH(B$1, Synthese!$B6:$Q6, 0)),\"\")","v":"Christian"},{"$f":"_xlfn.IFNA(INDEX(Synthese!$B$3:$R$34, 1, MATCH(C$1, Synthese!$B6:$Q6, 0)),\"\")","v":"Etienne"},{"$f":"_xlfn.IFNA(INDEX(Synthese!$B$3:$R$34, 1, MATCH(D$1, Synthese!$B6:$Q6, 0)),\"\")","v":"Chloé"},{"$f":"_xlfn.IFNA(INDEX(Synthese!$B$3:$R$34, 1, MATCH(E$1, Synthese!$B6:$Q6, 0)),\"\")","v":"Jean Louis"},{"$f":"_xlfn.IFNA(INDEX(Synthese!$B$3:$R$34, 1, MATCH(F$1, Synthese!$B6:$Q6, 0)),\"\")","v":"Jean Michel"},{"$f":"_xlfn.IFNA(INDEX(Synthese!$B$3:$R$34, 1, MATCH(G$1, Synthese!$B6:$Q6, 0)),\"\")","v":""},{"$f":"_xlfn.IFNA(INDEX(Synthese!$B$3:$R$34, 1, MATCH(H$1, Synthese!$B6:$Q6, 0)),\"\")","v":"Laurent"}]
[{"$f":"Synthese!A7","v":"2025-02-04"},{"$f":"_xlfn.IFNA(INDEX(Synthese!$B$3:$R$34, 1, MATCH(B$1, Synthese!$B7:$Q7, 0)),\"\")","v":"Hervé"},{"$f":"_xlfn.IFNA(INDEX(Synthese!$B$3:$R$34, 1, MATCH(C$1, Synthese!$B7:$Q7, 0)),\"\")","v":"Etienne"},{"$f":"_xlfn.IFNA(INDEX(Synthese!$B$3:$R$34, 1, MATCH(D$1, Synthese!$B7:$Q7, 0)),\"\")","v":"Chloé"},{"$f":"_xlfn.IFNA(INDEX(Synthese!$B$3:$R$34, 1, MATCH(E$1, Synthese!$B7:$Q7, 0)),\"\")","v":"Jean Louis"},{"$f":"_xlfn.IFNA(INDEX(Synthese!$B$3:$R$34, 1, MATCH(F$1, Synthese!$B7:$Q7, 0)),\"\")","v":"Christian"},{"$f":"_xlfn.IFNA(INDEX(Synthese!$B$3:$R$34, 1, MATCH(G$1, Synthese!$B7:$Q7, 0)),\"\")","v":""},{"$f":"_xlfn.IFNA(INDEX(Synthese!$B$3:$R$34, 1, MATCH(H$1, Synthese!$B7:$Q7, 0)),\"\")","v":"Laurent"}]
[{"$f":"Synthese!A8","v":"2025-02-05"},{"$f":"_xlfn.IFNA(INDEX(Synthese!$B$3:$R$34, 1, MATCH(B$1, Synthese!$B8:$Q8, 0)),\"\")","v":"Hervé"},{"$f":"_xlfn.IFNA(INDEX(Synthese!$B$3:$R$34, 1, MATCH(C$1, Synthese!$B8:$Q8, 0)),\"\")","v":"Etienne"},{"$f":"_xlfn.IFNA(INDEX(Synthese!$B$3:$R$34, 1, MATCH(D$1, Synthese!$B8:$Q8, 0)),\"\")","v":"Chloé"},{"$f":"_xlfn.IFNA(INDEX(Synthese!$B$3:$R$34, 1, MATCH(E$1, Synthese!$B8:$Q8, 0)),\"\")","v":"Jean Louis"},{"$f":"_xlfn.IFNA(INDEX(Synthese!$B$3:$R$34, 1, MATCH(F$1, Synthese!$B8:$Q8, 0)),\"\")","v":"Jean Michel"},{"$f":"_xlfn.IFNA(INDEX(Synthese!$B$3:$R$34, 1, MATCH(G$1, Synthese!$B8:$Q8, 0)),\"\")","v":""},{"$f":"_xlfn.IFNA(INDEX(Synthese!$B$3:$R$34, 1, MATCH(H$1, Synthese!$B8:$Q8, 0)),\"\")","v":"Laurent"}]
[{"$f":"Synthese!A9","v":"2025-02-06"},{"$f":"_xlfn.IFNA(INDEX(Synthese!$B$3:$R$34, 1, MATCH(B$1, Synthese!$B9:$Q9, 0)),\"\")","v":"Christian"},{"$f":"_xlfn.IFNA(INDEX(Synthese!$B$3:$R$34, 1, MATCH(C$1, Synthese!$B9:$Q9, 0)),\"\")","v":"Etienne"},{"$f":"_xlfn.IFNA(INDEX(Synthese!$B$3:$R$34, 1, MATCH(D$1, Synthese!$B9:$Q9, 0)),\"\")","v":"Chloé"},{"$f":"_xlfn.IFNA(INDEX(Synthese!$B$3:$R$34, 1, MATCH(E$1, Synthese!$B9:$Q9, 0)),\"\")","v":"Jean Louis"},{"$f":"_xlfn.IFNA(INDEX(Synthese!$B$3:$R$34, 1, MATCH(F$1, Synthese!$B9:$Q9, 0)),\"\")","v":"Jean Michel"},{"$f":"_xlfn.IFNA(INDEX(Synthese!$B$3:$R$34, 1, MATCH(G$1, Synthese!$B9:$Q9, 0)),\"\")","v":""},{"$f":"_xlfn.IFNA(INDEX(Synthese!$B$3:$R$34, 1, MATCH(H$1, Synthese!$B9:$Q9, 0)),\"\")","v":"Laurent"}]
[{"$f":"Synthese!A10","v":"2025-02-07"},{"$f":"_xlfn.IFNA(INDEX(Synthese!$B$3:$R$34, 1, MATCH(B$1, Synthese!$B10:$Q10, 0)),\"\")","v":"Hervé"},{"$f":"_xlfn.IFNA(INDEX(Synthese!$B$3:$R$34, 1, MATCH(C$1, Synthese!$B10:$Q10, 0)),\"\")","v":"Etienne"},{"$f":"_xlfn.IFNA(INDEX(Synthese!$B$3:$R$34, 1, MATCH(D$1, Synthese!$B10:$Q10, 0)),\"\")","v":"Chloé"},{"$f":"_xlfn.IFNA(INDEX(Synthese!$B$3:$R$34, 1, MATCH(E$1, Synthese!$B10:$Q10, 0)),\"\")","v":"Christian"},{"$f":"_xlfn.IFNA(INDEX(Synthese!$B$3:$R$34, 1, MATCH(F$1, Synthese!$B10:$Q10, 0)),\"\")","v":"Jean Michel"},{"$f":"_xlfn.IFNA(INDEX(Synthese!$B$3:$R$34, 1, MATCH(G$1, Synthese!$B10:$Q10, 0)),\"\")","v":""},{"$f":"_xlfn.IFNA(INDEX(Synthese!$B$3:$R$34, 1, MATCH(H$1, Synthese!$B10:$Q10, 0)),\"\")","v":"Laurent"}]
{"$rows_left_out":25}
{"sheet":"Laurent","index":3,"n_rows":33,"n_cols":3,"rows_kept":33,"cut":false,"hidden":false,"merged":[]}
[null,{"$f":"RIGHT(CELL(\"nomfichier\",B1),LEN(CELL(\"nomfichier\",B1))-FIND(\"]\",CELL(\"nomfichier\",B1)))","v":"Laurent"}]
[{"$f":"IF(WEEKDAY(Synthese!B4)=1,\"DIMANCHE\",(Synthese!B4))","v":"2025-02-01"},{"$f":"Synthese!C4","v":"MALADIE"},{"$f":"Synthese!D4","v":"00:00:00"}]
[{"$f":"IF(WEEKDAY(Synthese!B5)=1,\"DIMANCHE\",(Synthese!B5))","v":"DIMANCHE"},{"$f":"Synthese!C5","v":0},{"$f":"Synthese!D5","v":"00:00:00"}]
[{"$f":"IF(WEEKDAY(Synthese!B6)=1,\"DIMANCHE\",(Synthese!B6))","v":"2025-02-03"},{"$f":"Synthese!C6","v":"MALADIE"},{"$f":"Synthese!D6","v":"00:00:00"}]
[{"$f":"IF(WEEKDAY(Synthese!B7)=1,\"DIMANCHE\",(Synthese!B7))","v":"2025-02-04"},{"$f":"Synthese!C7","v":"MALADIE"},{"$f":"Synthese!D7","v":"00:00:00"}]
[{"$f":"IF(WEEKDAY(Synthese!B8)=1,\"DIMANCHE\",(Synthese!B8))","v":"2025-02-05"},{"$f":"Synthese!C8","v":"MALADIE"},{"$f":"Synthese!D8","v":"00:00:00"}]
[{"$f":"IF(WEEKDAY(Synthese!B9)=1,\"DIMANCHE\",(Synthese!B9))","v":"2025-02-06"},{"$f":"Synthese!C9","v":"MALADIE"},{"$f":"Synthese!D9","v":"00:00:00"}]
[{"$f":"IF(WEEKDAY(Synthese!B10)=1,\"DIMANCHE\",(Synthese!B10))","v":"2025-02-07"},{"$f":"Synthese!C10","v":"MALADIE"},{"$f":"Synthese!D10","v":"00:00:00"}]
{"$rows_left_out":26}
{"sheet":"René","index":4,"n_rows":33,"n_cols":3,"rows_kept":33,"cut":false,"hidden":false,"merged":[]}
[null,{"$f":"RIGHT(CELL(\"nomfichier\",B1),LEN(CELL(\"nomfichier\",B1))-FIND(\"]\",CELL(\"nomfichier\",B1)))","v":"René"}]
[{"$f":"IF(WEEKDAY(Synthese!B4)=1,\"DIMANCHE\",(Synthese!B4))","v":"2025-02-01"},{"$f":"Synthese!E4","v":"MALADIE"},{"$f":"Synthese!F4","v":"00:00:00"}]
[{"$f":"IF(WEEKDAY(Synthese!B5)=1,\"DIMANCHE\",(Synthese!B5))","v":"DIMANCHE"},{"$f":"Synthese!E5","v":0},{"$f":"Synthese!F5","v":"00:00:00"}]
[{"$f":"IF(WEEKDAY(Synthese!B6)=1,\"DIMANCHE\",(Synthese!B6))","v":"2025-02-03"},{"$f":"Synthese!E6","v":"MALADIE"},{"$f":"Synthese!F6","v":"00:00:00"}]
[{"$f":"IF(WEEKDAY(Synthese!B7)=1,\"DIMANCHE\",(Synthese!B7))","v":"2025-02-04"},{"$f":"Synthese!E7","v":"MALADIE"},{"$f":"Synthese!F7","v":"00:00:00"}]
[{"$f":"IF(WEEKDAY(Synthese!B8)=1,\"DIMANCHE\",(Synthese!B8))","v":"2025-02-05"},{"$f":"Synthese!E8","v":"MALADIE"},{"$f":"Synthese!F8","v":"00:00:00"}]
[{"$f":"IF(WEEKDAY(Synthese!B9)=1,\"DIMANCHE\",(Synthese!B9))","v":"2025-02-06"},{"$f":"Synthese!E9","v":"MALADIE"},{"$f":"Synthese!F9","v":"00:00:00"}]
[{"$f":"IF(WEEKDAY(Synthese!B10)=1,\"DIMANCHE\",(Synthese!B10))","v":"2025-02-07"},{"$f":"Synthese!E10","v":"MALADIE"},{"$f":"Synthese!F10","v":"00:00:00"}]
{"$rows_left_out":26}
{"sheet":"Jean Michel","index":5,"n_rows":33,"n_cols":3,"rows_kept":33,"cut":false,"hidden":false,"merged":[]}
[null,{"$f":"RIGHT(CELL(\"nomfichier\",B1),LEN(CELL(\"nomfichier\",B1))-FIND(\"]\",CELL(\"nomfichier\",B1)))","v":"Jean Michel"}]
[{"$f":"IF(WEEKDAY(Synthese!B4)=1,\"DIMANCHE\",(Synthese!B4))","v":"2025-02-01"},{"$f":"Synthese!G4","v":"CLUNY"},{"$f":"Synthese!H4","v":"03:00:00"}]
[{"$f":"IF(WEEKDAY(Synthese!B5)=1,\"DIMANCHE\",(Synthese!B5))","v":"DIMANCHE"},{"$f":"Synthese!G5","v":0},{"$f":"Synthese!H5","v":"00:00:00"}]
[{"$f":"IF(WEEKDAY(Synthese!B6)=1,\"DIMANCHE\",(Synthese!B6))","v":"2025-02-03"},{"$f":"Synthese!G6","v":"CLUNY"},{"$f":"Synthese!H6","v":"04:15:00"}]
[{"$f":"IF(WEEKDAY(Synthese!B7)=1,\"DIMANCHE\",(Synthese!B7))","v":"2025-02-04"},{"$f":"Synthese!G7","v":"REPOS"},{"$f":"Synthese!H7","v":"00:00:00"}]
[{"$f":"IF(WEEKDAY(Synthese!B8)=1,\"DIMANCHE\",(Synthese!B8))","v":"2025-02-05"},{"$f":"Synthese!G8","v":"CLUNY"},{"$f":"Synthese!H8","v":"04:15:00"}]
[{"$f":"IF(WEEKDAY(Synthese!B9)=1,\"DIMANCHE\",(Synthese!B9))","v":"2025-02-06"},{"$f":"Synthese!G9","v":"CLUNY"},{"$f":"Synthese!H9","v":"04:15:00"}]
[{"$f":"IF(WEEKDAY(Synthese!B10)=1,\"DIMANCHE\",(Synthese!B10))","v":"2025-02-07"},{"$f":"Synthese!G10","v":"CLUNY"},{"$f":"Synthese!H10","v":"04:15:00"}]
{"$rows_left_out":26}
{"sheet":"Etienne","index":6,"n_rows":33,"n_cols":3,"rows_kept":33,"cut":false,"hidden":false,"merged":[]}
[null,{"$f":"RIGHT(CELL(\"nomfichier\",B1),LEN(CELL(\"nomfichier\",B1))-FIND(\"]\",CELL(\"nomfichier\",B1)))","v":"Etienne"}]
[{"$f":"IF(WEEKDAY(Synthese!B4)=1,\"DIMANCHE\",(Synthese!B4))","v":"2025-02-01"},{"$f":"Synthese!I4","v":"CRECHES"},{"$f":"Synthese!J4","v":"02:55:00"}]
[{"$f":"IF(WEEKDAY(Synthese!B5)=1,\"DIMANCHE\",(Synthese!B5))","v":"DIMANCHE"},{"$f":"Synthese!I5","v":0},{"$f":"Synthese!J5","v":"00:00:00"}]
[{"$f":"IF(WEEKDAY(Synthese!B6)=1,\"DIMANCHE\",(Synthese!B6))","v":"2025-02-03"},{"$f":"Synthese!I6","v":"CRECHES"},{"$f":"Synthese!J6","v":"06:45:00"}]
[{"$f":"IF(WEEKDAY(Synthese!B7)=1,\"DIMANCHE\",(Synthese!B7))","v":"2025-02-04"},{"$f":"Synthese!I7","v":"CRECHES"},{"$f":"Synthese!J7","v":"06:45:00"}]
[{"$f":"IF(WEEKDAY(Synthese!B8)=1,\"DIMANCHE\",(Synthese!B8))","v":"2025-02-05"},{"$f":"Synthese!I8","v":"CRECHES"},{"$f":"Synthese!J8","v":"06:45:00"}]
[{"$f":"IF(WEEKDAY(Synthese!B9)=1,\"DIMANCHE\",(Synthese!B9))","v":"2025-02-06"},{"$f":"Synthese!I9","v":"CRECHES"},{"$f":"Synthese!J9","v":"06:45:00"}]
[{"$f":"IF(WEEKDAY(Synthese!B10)=1,\"DIMANCHE\",(Synthese!B10))","v":"2025-02-07"},{"$f":"Synthese!I10","v":"CRECHES"},{"$f":"Synthese!J10","v":"06:45:00"}]
{"$rows_left_out":26}
{"sheet":"Jean Louis","index":7,"n_rows":33,"n_cols":3,"rows_kept":33,"cut":false,"hidden":false,"merged":[]}
[null,{"$f":"RIGHT(CELL(\"nomfichier\",B1),LEN(CELL(\"nomfichier\",B1))-FIND(\"]\",CELL(\"nomfichier\",B1)))","v":"Jean Louis"}]
[{"$f":"IF(WEEKDAY(Synthese!B4)=1,\"DIMANCHE\",(Synthese!B4))","v":"2025-02-01"},{"$f":"Synthese!K4","v":"PARAY"},{"$f":"Synthese!L4","v":"04:15:00"}]
[{"$f":"IF(WEEKDAY(Synthese!B5)=1,\"DIMANCHE\",(Synthese!B5))","v":"DIMANCHE"},{"$f":"Synthese!K5","v":0},{"$f":"Synthese!L5","v":"00:00:00"}]
[{"$f":"IF(WEEKDAY(Synthese!B6)=1,\"DIMANCHE\",(Synthese!B6))","v":"2025-02-03"},{"$f":"Synthese!K6","v":"PARAY"},{"$f":"Synthese!L6","v":"05:00:00"}]
[{"$f":"IF(WEEKDAY(Synthese!B7)=1,\"DIMANCHE\",(Synthese!B7))","v":"2025-02-04"},{"$f":"Synthese!K7","v":"PARAY"},{"$f":"Synthese!L7","v":"05:00:00"}]
[{"$f":"IF(WEEKDAY(Synthese!B8)=1,\"DIMANCHE\",(Synthese!B8))","v":"2025-02-05"},{"$f":"Synthese!K8","v":"PARAY"},{"$f":"Synthese!L8","v":"05:00:00"}]
[{"$f":"IF(WEEKDAY(Synthese!B9)=1,\"DIMANCHE\",(Synthese!B9))","v":"2025-02-06"},{"$f":"Synthese!K9","v":"PARAY"},{"$f":"Synthese!L9","v":"05:00:00"}]
[{"$f":"IF(WEEKDAY(Synthese!B10)=1,\"DIMANCHE\",(Synthese!B10))","v":"2025-02-07"},{"$f":"Synthese!K10","v":"REPOS"},{"$f":"Synthese!L10","v":"00:00:00"}]
{"$rows_left_out":26}
{"sheet":"Hervé","index":8,"n_rows":33,"n_cols":3,"rows_kept":33,"cut":false,"hidden":false,"merged":[]}
[null,{"$f":"RIGHT(CELL(\"nomfichier\",B1),LEN(CELL(\"nomfichier\",B1))-FIND(\"]\",CELL(\"nomfichier\",B1)))","v":"Hervé"}]
[{"$f":"IF(WEEKDAY(Synthese!B4)=1,\"DIMANCHE\",(Synthese!B4))","v":"2025-02-01"},{"$f":"Synthese!O4","v":"VALLONS"},{"$f":"Synthese!P4","v":"03:25:00"}]
[{"$f":"IF(WEEKDAY(Synthese!B5)=1,\"DIMANCHE\",(Synthese!B5))","v":"DIMANCHE"},{"$f":"Synthese!O5","v":0},{"$f":"Synthese!P5","v":"00:00:00"}]
[{"$f":"IF(WEEKDAY(Synthese!B6)=1,\"DIMANCHE\",(Synthese!B6))","v":"2025-02-03"},{"$f":"Synthese!O6","v":"REPOS"},{"$f":"Synthese!P6","v":"00:00:00"}]
[{"$f":"IF(WEEKDAY(Synthese!B7)=1,\"DIMANCHE\",(Synthese!B7))","v":"2025-02-04"},{"$f":"Synthese!O7","v":"VALLONS"},{"$f":"Synthese!P7","v":"05:20:00"}]
[{"$f":"IF(WEEKDAY(Synthese!B8)=1,\"DIMANCHE\",(Synthese!B8))","v":"2025-02-05"},{"$f":"Synthese!O8","v":"VALLONS"},{"$f":"Synthese!P8","v":"05:20:00"}]
[{"$f":"IF(WEEKDAY(Synthese!B9)=1,\"DIMANCHE\",(Synthese!B9))","v":"2025-02-06"},{"$f":"Synthese!O9","v":"REPOS"},{"$f":"Synthese!P9","v":"00:00:00"}]
[{"$f":"IF(WEEKDAY(Synthese!B10)=1,\"DIMANCHE\",(Synthese!B10))","v":"2025-02-07"},{"$f":"Synthese!O10","v":"VALLONS"},{"$f":"Synthese!P10","v":"05:20:00"}]
{"$rows_left_out":26}
{"sheet":"Christian","index":9,"n_rows":33,"n_cols":3,"rows_kept":33,"cut":false,"hidden":false,"merged":[]}
[null,{"$f":"RIGHT(CELL(\"nomfichier\",B1),LEN(CELL(\"nomfichier\",B1))-FIND(\"]\",CELL(\"nomfichier\",B1)))","v":"Christian"}]
[{"$f":"IF(WEEKDAY(Synthese!B4)=1,\"DIMANCHE\",(Synthese!B4))","v":"2025-02-01"},{"$f":"Synthese!M4","v":"REPOS"},{"$f":"Synthese!N4","v":"00:00:00"}]
[{"$f":"IF(WEEKDAY(Synthese!B5)=1,\"DIMANCHE\",(Synthese!B5))","v":"DIMANCHE"},{"$f":"Synthese!M5","v":0},{"$f":"Synthese!N5","v":"00:00:00"}]
[{"$f":"IF(WEEKDAY(Synthese!B6)=1,\"DIMANCHE\",(Synthese!B6))","v":"2025-02-03"},{"$f":"Synthese!M6","v":"VALLONS"},{"$f":"Synthese!N6","v":"05:20:00"}]
[{"$f":"IF(WEEKDAY(Synthese!B7)=1,\"DIMANCHE\",(Synthese!B7))","v":"2025-02-04"},{"$f":"Synthese!M7","v":"CLUNY"},{"$f":"Synthese!N7","v":"04:15:00"}]
[{"$f":"IF(WEEKDAY(Synthese!B8)=1,\"DIMANCHE\",(Synthese!B8))","v":"2025-02-05"},{"$f":"Synthese!M8","v":"REPOS"},{"$f":"Synthese!N8","v":"00:00:00"}]
[{"$f":"IF(WEEKDAY(Synthese!B9)=1,\"DIMANCHE\",(Synthese!B9))","v":"2025-02-06"},{"$f":"Synthese!M9","v":"VALLONS"},{"$f":"Synthese!N9","v":"05:20:00"}]
[{"$f":"IF(WEEKDAY(Synthese!B10)=1,\"DIMANCHE\",(Synthese!B10))","v":"2025-02-07"},{"$f":"Synthese!M10","v":"PARAY"},{"$f":"Synthese!N10","v":"05:00:00"}]
{"$rows_left_out":26}
{"sheet":"Chloé","index":10,"n_rows":33,"n_cols":3,"rows_kept":33,"cut":false,"hidden":false,"merged":[]}
[null,{"$f":"RIGHT(CELL(\"nomfichier\",B1),LEN(CELL(\"nomfichier\",B1))-FIND(\"]\",CELL(\"nomfichier\",B1)))","v":"Chloé"}]
[{"$f":"IF(WEEKDAY(Synthese!B4)=1,\"DIMANCHE\",(Synthese!B4))","v":"2025-02-01"},{"$f":"Synthese!Q4","v":"AIN"},{"$f":"Synthese!R4","v":"03:20:00"}]
[{"$f":"IF(WEEKDAY(Synthese!B5)=1,\"DIMANCHE\",(Synthese!B5))","v":"DIMANCHE"},{"$f":"Synthese!Q5","v":0},{"$f":"Synthese!R5","v":"00:00:00"}]
[{"$f":"IF(WEEKDAY(Synthese!B6)=1,\"DIMANCHE\",(Synthese!B6))","v":"2025-02-03"},{"$f":"Synthese!Q6","v":"AIN"},{"$f":"Synthese!R6","v":"04:40:00"}]
[{"$f":"IF(WEEKDAY(Synthese!B7)=1,\"DIMANCHE\",(Synthese!B7))","v":"2025-02-04"},{"$f":"Synthese!Q7","v":"AIN"},{"$f":"Synthese!R7","v":"04:40:00"}]
[{"$f":"IF(WEEKDAY(Synthese!B8)=1,\"DIMANCHE\",(Synthese!B8))","v":"2025-02-05"},{"$f":"Synthese!Q8","v":"AIN"},{"$f":"Synthese!R8","v":"04:40:00"}]
[{"$f":"IF(WEEKDAY(Synthese!B9)=1,\"DIMANCHE\",(Synthese!B9))","v":"2025-02-06"},{"$f":"Synthese!Q9","v":"AIN"},{"$f":"Synthese!R9","v":"04:40:00"}]
[{"$f":"IF(WEEKDAY(Synthese!B10)=1,\"DIMANCHE\",(Synthese!B10))","v":"2025-02-07"},{"$f":"Synthese!Q10","v":"AIN"},{"$f":"Synthese!R10","v":"04:40:00"}]
{"$rows_left_out":25}