{"text_format":"1","workbook":"xlsx","n_sheets":16,"sheets":["Planning Bénévoles","DISPONIBILITE","LUNDI","MARDI","MERCREDI","JEUDI","VENDREDI","SAMEDI","DIMANCHE 30","Finale","Tenues","Présence","Présence2","Repas","CHAUFFEURS","Planning Responsables"],"not_rendered":{"charts":0,"images":0,"macros":1,"external_links":0,"defined_names":17,"comments":0,"pivot_tables":0},"unopened":[],"bounds":{"document_bytes":16777216,"sheet_cells":100000,"rows_first":2000,"rows_last":500,"rows_between":2000,"halvings":0,"cell_chars":16384,"cell_head_chars":4096},"cells_cut":0,"cells_raw":0,"read":"whole","date_system":"1900"}

{"sheet":"Planning Bénévoles","index":0,"n_rows":40,"n_cols":20,"rows_kept":40,"cut":false,"hidden":false,"merged":[[37,0,39,0],[0,8,0,10],[2,0,3,0],[23,0,25,0],[10,1,13,1],[14,1,15,1],[17,1,18,1],[26,0,28,0],[6,0,22,0],[4,0,5,0],[37,1,39,1],[26,1,28,1],[31,1,34,1],[29,0,34,0],[35,0,36,0],[35,1,36,1],[20,1,21,1],[29,1,30,1],[0,11,0,13],[0,14,0,16],[0,17,0,18],[6,1,9,1],[0,2,0,4],[0,5,0,7],[4,1,5,1],[2,1,3,1]]}
["NOMBRE DE BÉNÉVOLES :",{"$f":"COUNTA(DISPONIBILITE!A4:A83)","v":74},"LUNDI 20",null,null,"MARDI 21",null,null,"MERCREDI 22",null,null,"JEUDI 23",null,null,"VENDREDI 24",null,null,"SAMEDI 25",null,"DIMANCHE 26"]
[null,null,"9H00-14H00","14H00-18H00",">18H00","9H00-14H00","14H00-18H00",">18H00","9H00-14H00","14H00-18H00",">18H00","9H00-14H00","14H00-18H00",">18H00","9H00-14H00","14H00-18H00",">18H00","9H00-14H00","14H00-18H00","13H00-18H00"]
["CONTROLE SAC ENTREE",null,null,null,null,"TANGUY Bob","DESJARDINS Jean Luc","DANGÉ Yann","TROBOE Marcel","LE GALL Yves","TANGUY Bob",null,null,null,"LANDOUARD Frédéric"]
[null,null,null,null,null,"DANGÉ Jean Pierre","LE ROY  Julian","MOAL Alain","BOTHOREL Hélène","ROBERT Mireille","MARCHE Sophie",null,null,null,"KERVELLA (K) Virginie"]
["ACCUEIL VESTIAIRE ",null,"ROUGER Olga","DESJARDINS Jean Luc","RAFFO Carine","RIHANI Mohamed","BOURGUIGNON Catherine","DUTERQUE Frédérique","MALANDAIN Manuela","TROBOE Marcel","BOURGUIGNON Catherine","FER (THG) Mélissa",null,null,"LE GALL Yves"]
[null,null,null,null,null,"GUILLERMOU Marie Évelyne","JANOT (K) Laetitia",null,null,"GUILLERMOU Marie Évelyne",null,"LANDOUARD Frédéric",null,null,"GUEGUEN (K) Sébastien"]
["COURT CENTRAL","Filtrage Entrée","DESJARDINS Jean Luc","DESECHALLIERS Carole","ROUGER Olga",null,"BOTHOREL Hélène","CAHN Didier","BEZIVIN Daniel","LANDOUARD Frédéric",null,"DUPUY Isabelle",null,null,"BOTHOREL Hélène"]
[null,null,"DUPUY Isabelle","LE ROY  Julian","CAHN Didier","BOTHOREL Hélène","DESECHALLIERS Carole","PLOUZENNEC Nadine","TANGUY Bob","CAHN Didier","LE BIHAN Guy","KERVELLA (K) Virginie",null,null,"NHEK (K) Alexandrine"]
[null,null,null,null,null,"GAONACH (THG) Sarah",null,null,"FER (THG) Mélissa","FER (THG) Mélissa",null,null,null,null,"TROBOE Marcel"]
[]
[null,"Placier Grande Tribune",null,"BOTHOREL Hélène",null,"GUEGUEN (K) Sébastien","STRUILLOU (K) Charlotte","LE ROY  Julian","ROUGER Olga","TANGUY Bob","RIHANI Mohamed","CLOAREC (K) Didier",null,null,"BIENNE (K) Xavier"]
[null,null,null,null,null,"LANDOUARD Frédéric","DANIEL Alain","DANIEL Annie France","PARISSE (THG) Amélie","LE BOSSER Jean René",null,"GUILLERMOU Marie Évelyne"]
[null,null,null,null,null,null,null,null,null,"MALANDAIN Manuela",null,null,null,null,null,null,null,null,"BOURGUIGNON Catherine"]
[]
[null,"Filtrage Tribune Est","TROBOE Marcel","CAHN Didier","DANGÉ Yann","MOAL Alain","RAFFO Carine","BOURGUIGNON Catherine","DANGÉ Jean Pierre","RAFFO Carine","LE ROY  Julian",null,"LE BIHAN Guy",null,"MOAL Alain"]
[null,null,null,"DUPUY Isabelle","BOURGUIGNON Catherine","RAMA (THG) Jurgen","MOAL Alain","LANDOUARD Frédéric","RAFFO Carine","LE BOSSER Liliane","ROUGER Olga",null,null,null,"BALMADIER (THG) Henri"]
[null,"Placier Tribune Est",null,null,null,"RAFFO Carine","GUILLERMOU Marie Évelyne",null,null,null,null,null,null,null,"JANOT (K) Laetitia",null,null,null,null,"BOTHOREL Hélène"]
[null,"Filtrage Tribune Ouest","DANGÉ Jean Pierre","DENES Annick","DUPUY Isabelle","GUERROT (THG) Gildas","CAHN Didier","MALANDAIN Manuela","LANDOUARD Frédéric","BOURGUIGNON Catherine","MOAL Alain",null,null,null,"BEZIVIN Daniel"]
[null,null,null,"COCHOU Philippe","MOAL Alain","TROBOE Marcel","BEAUGION (K) Régis","TANGUY Bob","FISSEUX Rosalina","LE ROY  Julian",null,null,null,null,"BEAUGION (K) Régis"]
[null,"Placier Tribune Ouest",null,null,null,null,"MALANDAIN Manuela",null,null,null,null,null,null,null,"BERTIN (THG) Nicolas"]
[null,"Filtrage Tribune Restaurant","RIHANI Mohamed","RAFFO Carine","LANDOUARD Frédéric","LE CORRE  Jérémy","LE BIHAN Guy","DENES Annick",null,"BOTHOREL Hélène","RAFFO Carine",null,null,null,"RAFFO Carine"]
[null,null,null,"TANGUY Bob","PLOUZENNEC Nadine","BEAUGION (K) Régis","GUERROT (THG) Gildas","RAFFO Carine","LE BIHAN Guy","MOAL Alain","YANG Johanne"]
[null,"Placier Tribune Restaurant"]
["COURT N°1",null,"LE BIHAN Guy","MALANDAIN Manuela","TANGUY Bob","DUPUY Isabelle","TROBOE Marcel","LE ROUX Stéphanie","MOAL Alain","BEZIVIN Daniel","PLOUZENNEC Nadine","BIENNE (K) Xavier",null,null,"DANGÉ Jean Pierre"]
[null,null,"TANGUY Bob","PLOUZENNEC Nadine","BOTHOREL Hélène","GUEZENNEC (K) Bruno",null,"DANIEL Alain","BOURGEON (THG) Jérémy","PARISSE (THG) Amélie","CAHN Didier","RAFFO Carine",null,null,"CLOAREC (K) Didier"]
[null,null,null,null,null,null,"NHEK (K) Alexandrine"]
["BAR GRAND PUBLIC",null,null,null,null,"FLOCH Philippe","LE CORRE  Jérémy","MIGLIACCIO Claire","ROCHCONGAR Christelle","LE CORRE  Jérémy","CORNEC Lucas","FLOCH Philippe","KERLEO Anne Marie","CORNEC Lucas","FLOCH Philippe",null,"MIGLIACCIO Claire"]
[null,null,"FLOCH Philippe",null,"ROCHCONGAR Christelle","LECHAT Loïc","KERLEO Anne Marie","CORNEC Lucas","FLOCH Philippe","COCHOU Philippe","LE CORRE  Jérémy","LE CORRE  Jérémy","COCHOU Philippe","LE CORRE  Jérémy",null,null,"CORNEC Lucas"]
[]
["BAR A CHAMPAGNE","Filtrage",null,"BOURGUIGNON Catherine","GARCETTE Jade","MALANDAIN Manuela","PLOUZENNEC Nadine","BASTARD Chloé",null,"PLOUZENNEC Nadine","BÉNIER Alizée",null,null,null,"MARCHE Sophie"]
[null,null,"LE CORRE  Jérémy","ROUGER Olga","BÉNIER Alizée",null,"ROUGER Olga","GUTIERREZ Valentina",null,"DENES Annick","SANS Loïs"]
[null,"Service",null,null,"YANG Johanne",null,null,"BÉNIER Alizée",null,null,"ROUAT Manon"]
[null,null,null,null,"SANS Loïs",null,null,"GARCETTE Jade",null,null,"GUTIERREZ Valentina"]
[null,null,null,null,null,null,null,"WOJCIK Eulalie",null,null,"HADOUZI Yasmine"]
[]
["BILLETERIE HALL"]
[null,null,"LE ROUX Stéphanie","LE CORRE  Jérémy","LE CORRE  Jérémy","ROUGER Olga","LE ROUX Stéphanie","ROUGER Olga",null,"ROUGER Olga",null,null,null,null,"ROUGER Olga"]
["REMPLACANTS",null,"MALANDAIN Manuela","TROBOE Marcel","HADOUZI Yasmine","JANOT (K) Laetitia","DANIEL Annie France","LE CORRE  Jérémy","DESJARDINS Jean Luc","DESJARDINS Jean Luc","GUILLERMOU Marie Évelyne",null,null,null,"ROBERT Mireille"]
[null,null,"BEZIVIN Daniel","LANDOUARD Frédéric","LE ROY  Julian","STRUILLOU (K) Charlotte","TANGUY Bob","LE BIHAN Guy","ROBERT Mireille",null,null,null,null,null,"LE ROY (THG) Christelle"]
[null,null,"LANDOUARD Frédéric","MOAL Alain","ROBERT Mireille","NHEK (K) Alexandrine","LANDOUARD Frédéric",null,"GUILLERMOU Marie Évelyne",null,null,null,null,null,"DUPUY Isabelle"]

{"sheet":"DISPONIBILITE","index":1,"n_rows":77,"n_cols":25,"rows_kept":77,"cut":false,"hidden":false,"merged":[[0,24,1,24],[0,23,1,23],[0,17,0,19],[0,20,0,21],[0,0,1,0],[0,1,1,1],[0,5,0,7],[0,8,0,10],[0,11,0,13],[0,14,0,16],[0,4,1,4],[0,3,1,3]]}
["NOM","PRÉNOM",null,"SEXE",{"$f":"COUNTA(A:A)-1","v":74},{"$f":"'Planning Bénévoles'!C1","v":"LUNDI 20"},null,null,{"$f":"'Planning Bénévoles'!F1","v":"MARDI 21"},null,null,{"$f":"'Planning Bénévoles'!I1","v":"MERCREDI 22"},null,null,{"$f":"'Planning Bénévoles'!L1","v":"JEUDI 23"},null,null,{"$f":"'Planning Bénévoles'!O1","v":"VENDREDI 24"},null,null,{"$f":"'Planning Bénévoles'!R1","v":"SAMEDI 25"},null,{"$f":"'Planning Bénévoles'!T1","v":"DIMANCHE 26"},"Taille de marinières","Nombre de créneaux"]
[null,"PRENOM",null,null,null,"09:00 - 14:00","14:00 - 18:00","> 18:00","09:00 - 14:00","14:00 - 18:00","> 18:00","09:00 - 14:00","14:00 - 18:00","> 18:00","09:00 - 14:00","14:00 - 18:00","> 18:00","09:00 - 14:00","14:00 - 18:00","> 18:00","09:00 - 14:00","14:00 - 18:00","13:00 - 18:00"]
[]
["BALMADIER (THG)","Henri","Ty Hent Glaz","H",{"$f":"A4&\" \"&B4","v":"BALMADIER (THG) Henri"},null,null,null,null,null,null,null,null,null,null,null,null,"oui","oui",null,null,null,null,"M",{"$f":"COUNTIF(F4:W4,\"oui\")","v":2}]
["BASTARD","Chloé","Etudiant","F",{"$f":"A5&\" \"&B5","v":"BASTARD Chloé"},null,null,"oui",null,null,"oui",null,null,null,null,null,null,null,null,null,null,null,null,"M",{"$f":"COUNTIF(F5:W5,\"oui\")","v":2}]
["BEAUGION (K)","Régis","Kergonan","H",{"$f":"A6&\" \"&B6","v":"BEAUGION (K) Régis"},"oui","oui",null,"oui","oui",null,null,null,null,"oui","oui",null,"oui","oui",null,null,null,null,"L",{"$f":"COUNTIF(F6:W6,\"oui\")","v":8}]
["BÉNIER","Alizée","Etudiant","F",{"$f":"A7&\" \"&B7","v":"BÉNIER Alizée"},null,null,"oui",null,null,"oui",null,null,"oui",null,null,"oui",null,null,"oui",null,"oui","oui","XL",{"$f":"COUNTIF(F7:W7,\"oui\")","v":7}]
["BERTIN (THG)","Nicolas","Ty Hent Glaz","H",{"$f":"A8&\" \"&B8","v":"BERTIN (THG) Nicolas"},null,null,null,null,null,null,null,null,null,null,null,null,"oui","oui",null,null,null,null,"XL",{"$f":"COUNTIF(F8:W8,\"oui\")","v":2}]
["BEZIVIN","Daniel",null,"H",{"$f":"A9&\" \"&B9","v":"BEZIVIN Daniel"},"oui","oui",null,null,null,null,"oui","oui",null,null,null,null,"oui","oui",null,"oui","oui",null,"L",{"$f":"COUNTIF(F9:W9,\"oui\")","v":8}]
["BIENNE (K)","Xavier","Kergonan","H",{"$f":"A10&\" \"&B10","v":"BIENNE (K) Xavier"},null,null,null,null,null,null,null,null,null,"oui","oui",null,"oui","oui",null,null,null,null,"L",{"$f":"COUNTIF(F10:W10,\"oui\")","v":4}]
["BOTHOREL","Hélène",null,"F",{"$f":"A11&\" \"&B11","v":"BOTHOREL Hélène"},null,"oui","oui","oui","oui",null,"oui","oui",null,"oui",null,"oui","oui","oui","oui",null,"oui","oui","S",{"$f":"COUNTIF(F11:W11,\"oui\")","v":13}]
["BOURGEON (THG)","Jérémy","Ty Hent Glaz","H",{"$f":"A12&\" \"&B12","v":"BOURGEON (THG) Jérémy"},null,null,null,null,null,null,"oui","oui",null,"oui","oui",null,null,null,null,null,null,null,"XL",{"$f":"COUNTIF(F12:W12,\"oui\")","v":4}]
["BOURGUIGNON","Catherine",null,"F",{"$f":"A13&\" \"&B13","v":"BOURGUIGNON Catherine"},null,"oui","oui",null,"oui","oui",null,"oui","oui",null,"oui","oui",null,"oui",null,null,"oui","oui","S",{"$f":"COUNTIF(F13:W13,\"oui\")","v":11}]
["CAHN","Didier",null,"H",{"$f":"A14&\" \"&B14","v":"CAHN Didier"},null,"oui","oui",null,"oui","oui",null,"oui","oui",null,"oui","oui",null,"oui",null,null,"oui","oui","L",{"$f":"COUNTIF(F14:W14,\"oui\")","v":11}]
["CLOAREC (K)","Didier","Kergonan","H",{"$f":"A15&\" \"&B15","v":"CLOAREC (K) Didier"},null,null,null,null,null,null,null,null,null,"oui","oui",null,"oui","oui",null,null,null,null,"XXL",{"$f":"COUNTIF(F15:W15,\"oui\")","v":4}]
["COCHOU","Philippe",null,"H",{"$f":"A16&\" \"&B16","v":"COCHOU Philippe"},null,"oui",null,null,null,null,null,"oui",null,null,"oui",null,null,"oui",null,null,"oui",null,"XXL",{"$f":"COUNTIF(F16:W16,\"oui\")","v":5}]
["CORNEC","Lucas",null,"H",{"$f":"A17&\" \"&B17","v":"CORNEC Lucas"},null,null,"oui",null,null,"oui",null,null,"oui",null,null,"oui",null,null,"oui",null,null,null,null,{"$f":"COUNTIF(F17:W17,\"oui\")","v":5}]
["DANGÉ","Yann",null,"H",{"$f":"A18&\" \"&B18","v":"DANGÉ Yann"},null,null,"oui",null,null,"oui",null,null,null,null,null,"oui",null,null,"oui","oui","oui","oui","M",{"$f":"COUNTIF(F18:W18,\"oui\")","v":7}]
["DANGÉ","Jean Pierre",null,"H",{"$f":"A19&\" \"&B19","v":"DANGÉ Jean Pierre"},"oui",null,null,"oui",null,null,"oui",null,null,"oui",null,null,"oui",null,null,"oui",null,null,"M",{"$f":"COUNTIF(F19:W19,\"oui\")","v":6}]
["DANIEL","Alain",null,"H",{"$f":"A20&\" \"&B20","v":"DANIEL Alain"},null,"oui","oui",null,"oui","oui",null,"oui",null,null,null,"oui",null,"oui","oui","oui","oui","oui","L",{"$f":"COUNTIF(F20:W20,\"oui\")","v":11}]
["DANIEL","Annie France",null,"F",{"$f":"A21&\" \"&B21","v":"DANIEL Annie France"},null,null,"oui",null,"oui","oui",null,null,null,null,null,"oui",null,"oui","oui","oui","oui","oui","L",{"$f":"COUNTIF(F21:W21,\"oui\")","v":9}]
["DENES","Annick",null,"F",{"$f":"A22&\" \"&B22","v":"DENES Annick"},null,"oui",null,null,"oui","oui",null,"oui",null,null,null,null,null,"oui","oui",null,"oui","oui","M",{"$f":"COUNTIF(F22:W22,\"oui\")","v":8}]
["DESECHALLIERS","Carole",null,"F",{"$f":"A23&\" \"&B23","v":"DESECHALLIERS Carole"},null,"oui",null,null,"oui",null,null,null,null,null,null,"oui",null,null,"oui","oui","oui","oui","XXL",{"$f":"COUNTIF(F23:W23,\"oui\")","v":7}]
["DESJARDINS","Jean Luc",null,"H",{"$f":"A24&\" \"&B24","v":"DESJARDINS Jean Luc"},"oui","oui",null,"oui","oui",null,"oui","oui",null,null,"oui",null,"oui","oui",null,"oui",null,"oui","XXL",{"$f":"COUNTIF(F24:W24,\"oui\")","v":11}]
["DUPUY","Isabelle",null,"F",{"$f":"A25&\" \"&B25","v":"DUPUY Isabelle"},"oui","oui","oui","oui",null,null,null,null,null,"oui","oui","oui","oui","oui","oui","oui","oui","oui","XS",{"$f":"COUNTIF(F25:W25,\"oui\")","v":13}]
["DUTERQUE","Frédérique",null,"F",{"$f":"A26&\" \"&B26","v":"DUTERQUE Frédérique"},null,"oui","oui",null,"oui","oui",null,null,null,null,"oui","oui",null,null,null,"oui","oui","oui","XL",{"$f":"COUNTIF(F26:W26,\"oui\")","v":9}]
["FER (THG)","Mélissa","Ty Hent Glaz","F",{"$f":"A27&\" \"&B27","v":"FER (THG) Mélissa"},null,null,null,null,null,null,"oui","oui",null,"oui","oui",null,null,null,null,null,null,null,"M",{"$f":"COUNTIF(F27:W27,\"oui\")","v":4}]
["FISSEUX","Rosalina",null,"F",{"$f":"A28&\" \"&B28","v":"FISSEUX Rosalina"},null,"oui",null,null,null,null,"oui",null,null,null,"oui",null,null,null,"oui",null,null,"oui","S",{"$f":"COUNTIF(F28:W28,\"oui\")","v":5}]
["FLOCH","Philippe",null,"H",{"$f":"A29&\" \"&B29","v":"FLOCH Philippe"},"oui",null,null,"oui",null,null,"oui",null,null,"oui",null,null,"oui",null,null,null,null,null,"M",{"$f":"COUNTIF(F29:W29,\"oui\")","v":5}]
["GAONACH (THG)","Sarah","Ty Hent Glaz","F",{"$f":"A30&\" \"&B30","v":"GAONACH (THG) Sarah"},"oui","oui",null,"oui","oui",null,null,null,null,null,null,null,null,null,null,null,null,null,"M",{"$f":"COUNTIF(F30:W30,\"oui\")","v":4}]
["GARCETTE","Jade","Etudiant","F",{"$f":"A31&\" \"&B31","v":"GARCETTE Jade"},null,null,"oui",null,null,"oui",null,null,null,null,null,null,null,null,"oui",null,"oui",null,"M",{"$f":"COUNTIF(F31:W31,\"oui\")","v":4}]
["GERNIGON","Laurence",null,"F",{"$f":"A32&\" \"&B32","v":"GERNIGON Laurence"},null,null,null,null,null,null,null,null,null,null,null,null,null,null,null,null,"oui","oui","M",{"$f":"COUNTIF(F32:W32,\"oui\")","v":2}]
["GUEGUEN (K)","Sébastien","Kergonan","H",{"$f":"A33&\" \"&B33","v":"GUEGUEN (K) Sébastien"},"oui","oui",null,"oui","oui",null,null,null,null,"oui","oui",null,"oui","oui",null,null,null,null,"XL",{"$f":"COUNTIF(F33:W33,\"oui\")","v":8}]
["GUERROT (THG)","Gildas","Ty Hent Glaz","H",{"$f":"A34&\" \"&B34","v":"GUERROT (THG) Gildas"},"oui","oui",null,"oui","oui",null,null,null,null,null,null,null,null,null,null,null,null,null,"M",{"$f":"COUNTIF(F34:W34,\"oui\")","v":4}]
["GUEZENNEC (K)","Bruno","Kergonan","H",{"$f":"A35&\" \"&B35","v":"GUEZENNEC (K) Bruno"},"oui","oui",null,"oui","oui",null,null,null,null,null,null,null,null,null,null,null,null,null,"XL",{"$f":"COUNTIF(F35:W35,\"oui\")","v":4}]
["GUILLERMOU","Marie Évelyne",null,"F",{"$f":"A36&\" \"&B36","v":"GUILLERMOU Marie Évelyne"},null,null,null,"oui","oui",null,"oui","oui","oui","oui","oui",null,null,null,null,"oui","oui",null,"XS",{"$f":"COUNTIF(F36:W36,\"oui\")","v":9}]
["GUTIERREZ","Valentina","Etudiant","F",{"$f":"A37&\" \"&B37","v":"GUTIERREZ Valentina"},null,null,null,null,null,"oui",null,null,"oui",null,null,null,null,null,null,null,null,null,"S",{"$f":"COUNTIF(F37:W37,\"oui\")","v":2}]
["HADOUZI","Yasmine","Etudiant","F",{"$f":"A38&\" \"&B38","v":"HADOUZI Yasmine"},null,null,"oui",null,null,"oui",null,null,"oui",null,null,"oui",null,null,null,null,"oui",null,"S",{"$f":"COUNTIF(F38:W38,\"oui\")","v":5}]
["JANOT (K)","Laetitia","Kergonan","F",{"$f":"A39&\" \"&B39","v":"JANOT (K) Laetitia"},"oui","oui",null,"oui","oui",null,null,null,null,"oui","oui",null,"oui","oui",null,null,null,null,"M",{"$f":"COUNTIF(F39:W39,\"oui\")","v":8}]
["KERLEO","Anne Marie",null,"F",{"$f":"A40&\" \"&B40","v":"KERLEO Anne Marie"},null,null,null,null,"oui",null,null,null,null,null,"oui",null,null,"oui",null,null,"oui",null,"L",{"$f":"COUNTIF(F40:W40,\"oui\")","v":4}]
["KERVELLA (K)","Virginie","Kergonan","F",{"$f":"A41&\" \"&B41","v":"KERVELLA (K) Virginie"},null,null,null,null,null,null,null,null,null,"oui","oui",null,"oui","oui",null,null,null,null,"M",{"$f":"COUNTIF(F41:W41,\"oui\")","v":4}]
["LANDOUARD","Frédéric",null,"H",{"$f":"A42&\" \"&B42","v":"LANDOUARD Frédéric"},"oui","oui","oui","oui","oui","oui","oui","oui","oui","oui","oui","oui","oui","oui","oui","oui","oui","oui","L",{"$f":"COUNTIF(F42:W42,\"oui\")","v":18}]
["LE BIHAN","Guy",null,"H",{"$f":"A43&\" \"&B43","v":"LE BIHAN Guy"},"oui",null,null,null,"oui","oui","oui",null,"oui",null,"oui","oui",null,null,"oui",null,null,null,"M",{"$f":"COUNTIF(F43:W43,\"oui\")","v":8}]
["LE BOSSER","Jean René",null,"H",{"$f":"A44&\" \"&B44","v":"LE BOSSER Jean René"},null,"oui",null,null,null,null,null,"oui",null,null,null,"oui",null,"oui",null,null,"oui","oui","M",{"$f":"COUNTIF(F44:W44,\"oui\")","v":6}]
["LE BOSSER","Liliane",null,"F",{"$f":"A45&\" \"&B45","v":"LE BOSSER Liliane"},null,"oui",null,null,null,null,null,"oui",null,null,null,"oui",null,"oui",null,null,"oui","oui","M",{"$f":"COUNTIF(F45:W45,\"oui\")","v":6}]
["LE CORRE ","Jérémy",null,"H",{"$f":"A46&\" \"&B46","v":"LE CORRE  Jérémy"},"oui","oui","oui","oui","oui","oui","oui","oui","oui","oui","oui","oui",null,null,null,"oui","oui","oui","M",{"$f":"COUNTIF(F46:W46,\"oui\")","v":15}]
["LE GALL","Yves",null,"H",{"$f":"A47&\" \"&B47","v":"LE GALL Yves"},"oui","oui",null,"oui","oui",null,"oui","oui",null,null,null,null,"oui","oui",null,"oui","oui","oui","XL",{"$f":"COUNTIF(F47:W47,\"oui\")","v":11}]
["LE ROUX","Stéphanie",null,"F",{"$f":"A48&\" \"&B48","v":"LE ROUX Stéphanie"},"oui",null,null,null,"oui","oui",null,null,null,null,null,null,null,"oui","oui",null,null,null,"M",{"$f":"COUNTIF(F48:W48,\"oui\")","v":5}]
["LE ROY ","Julian",null,"H",{"$f":"A49&\" \"&B49","v":"LE ROY  Julian"},null,"oui","oui",null,"oui","oui",null,"oui","oui",null,"oui","oui",null,"oui","oui","oui","oui","oui","M",{"$f":"COUNTIF(F49:W49,\"oui\")","v":13}]
["LE ROY (THG)","Christelle","Ty Hent Glaz","F",{"$f":"A50&\" \"&B50","v":"LE ROY (THG) Christelle"},null,null,null,null,null,null,null,null,null,null,null,null,"oui","oui",null,null,null,null,"L",{"$f":"COUNTIF(F50:W50,\"oui\")","v":2}]
["LECHAT","Loïc",null,"H",{"$f":"A51&\" \"&B51","v":"LECHAT Loïc"},null,null,null,"oui",null,null,null,null,null,null,null,"oui",null,null,null,null,"oui",null,"XL",{"$f":"COUNTIF(F51:W51,\"oui\")","v":3}]
["LOPIN","Jacky",null,"H",{"$f":"A52&\" \"&B52","v":"LOPIN Jacky"},null,null,null,null,null,null,"oui",null,null,null,"oui",null,null,"oui",null,"oui","oui","oui","XL",{"$f":"COUNTIF(F52:W52,\"oui\")","v":6}]
["MALANDAIN","Manuela",null,"F",{"$f":"A53&\" \"&B53","v":"MALANDAIN Manuela"},"oui","oui",null,"oui","oui","oui","oui","oui",null,"oui","oui","oui",null,null,null,"oui","oui","oui","M",{"$f":"COUNTIF(F53:W53,\"oui\")","v":13}]
["MARCHE","Sophie",null,"F",{"$f":"A54&\" \"&B54","v":"MARCHE Sophie"},"oui","oui","oui","oui","oui","oui","oui","oui","oui","oui","oui","oui","oui","oui","oui","oui","oui","oui",null,{"$f":"COUNTIF(F54:W54,\"oui\")","v":18}]
["MIGLIACCIO","Claire",null,"F",{"$f":"A55&\" \"&B55","v":"MIGLIACCIO Claire"},null,null,null,null,null,"oui",null,null,null,null,null,"oui",null,null,"oui",null,"oui","oui","L",{"$f":"COUNTIF(F55:W55,\"oui\")","v":5}]
["MOAL","Alain",null,"H",{"$f":"A56&\" \"&B56","v":"MOAL Alain"},"oui","oui","oui","oui","oui","oui","oui","oui","oui","oui","oui","oui","oui","oui","oui","oui","oui","oui","M",{"$f":"COUNTIF(F56:W56,\"oui\")","v":18}]
["NHEK (K)","Alexandrine","Kergonan","F",{"$f":"A57&\" \"&B57","v":"NHEK (K) Alexandrine"},"oui","oui",null,"oui","oui",null,null,null,null,"oui","oui",null,"oui","oui",null,null,null,null,"M",{"$f":"COUNTIF(F57:W57,\"oui\")","v":8}]
["PARISSE (THG)","Amélie","Ty Hent Glaz","F",{"$f":"A58&\" \"&B58","v":"PARISSE (THG) Amélie"},null,null,null,null,null,null,"oui","oui",null,"oui","oui",null,null,null,null,null,null,null,"M",{"$f":"COUNTIF(F58:W58,\"oui\")","v":4}]
["PLOUZENNEC","Nadine",null,"F",{"$f":"A59&\" \"&B59","v":"PLOUZENNEC Nadine"},null,"oui","oui",null,"oui","oui",null,"oui","oui",null,"oui","oui",null,"oui","oui",null,"oui","oui","L",{"$f":"COUNTIF(F59:W59,\"oui\")","v":12}]
["RAFFO","Carine",null,"F",{"$f":"A60&\" \"&B60","v":"RAFFO Carine"},"oui","oui","oui","oui","oui","oui","oui","oui","oui","oui","oui","oui","oui","oui","oui","oui","oui","oui","M",{"$f":"COUNTIF(F60:W60,\"oui\")","v":18}]
["RAMA (THG)","Jurgen","Ty Hent Glaz","H",{"$f":"A61&\" \"&B61","v":"RAMA (THG) Jurgen"},"oui","oui",null,"oui","oui",null,null,null,null,null,null,null,null,null,null,null,null,null,"M",{"$f":"COUNTIF(F61:W61,\"oui\")","v":4}]
["RIHANI","Mohamed",null,"H",{"$f":"A62&\" \"&B62","v":"RIHANI Mohamed"},"oui",null,null,"oui",null,null,null,null,"oui","oui",null,null,null,null,"oui",null,"oui","oui","XXL",{"$f":"COUNTIF(F62:W62,\"oui\")","v":7}]
["RIVOAL","Christian",null,"H",{"$f":"A63&\" \"&B63","v":"RIVOAL Christian"},null,null,null,null,null,null,null,"oui",null,null,null,null,null,"oui",null,null,null,"oui","L",{"$f":"COUNTIF(F63:W63,\"oui\")","v":3}]
["ROBERT","Mireille",null,"F",{"$f":"A64&\" \"&B64","v":"ROBERT Mireille"},"oui","oui","oui","oui","oui","oui","oui","oui","oui","oui","oui","oui","oui","oui","oui","oui","oui","oui","M",{"$f":"COUNTIF(F64:W64,\"oui\")","v":18}]
["ROCHCONGAR","Christelle",null,"F",{"$f":"A65&\" \"&B65","v":"ROCHCONGAR Christelle"},null,null,"oui",null,null,null,"oui",null,null,null,null,null,null,null,null,null,null,"oui","S",{"$f":"COUNTIF(F65:W65,\"oui\")","v":3}]
["ROUAT","Manon","Etudiant","F",{"$f":"A66&\" \"&B66","v":"ROUAT Manon"},null,null,"oui",null,null,null,null,null,"oui",null,null,"oui",null,null,"oui",null,"oui",null,"XL",{"$f":"COUNTIF(F66:W66,\"oui\")","v":5}]
["ROUGER","Olga",null,"F",{"$f":"A67&\" \"&B67","v":"ROUGER Olga"},"oui","oui","oui","oui","oui","oui","oui","oui","oui","oui","oui","oui","oui","oui","oui","oui","oui","oui","M",{"$f":"COUNTIF(F67:W67,\"oui\")","v":18}]
["SANS","Loïs","Etudiant","H",{"$f":"A68&\" \"&B68","v":"SANS Loïs"},null,null,"oui",null,null,null,null,null,"oui",null,null,null,null,null,"oui",null,null,"oui","M",{"$f":"COUNTIF(F68:W68,\"oui\")","v":4}]
["STRUILLOU (K)","Charlotte","Kergonan","F",{"$f":"A69&\" \"&B69","v":"STRUILLOU (K) Charlotte"},"oui","oui",null,"oui","oui",null,null,null,null,null,null,null,null,null,null,null,null,null,"XL",{"$f":"COUNTIF(F69:W69,\"oui\")","v":4}]
["TALLEC-GORAGUER","Clara",null,"F",{"$f":"A70&\" \"&B70","v":"TALLEC-GORAGUER Clara"},null,null,null,null,null,null,null,null,null,null,null,null,null,null,"oui","oui","oui","oui","S",{"$f":"COUNTIF(F70:W70,\"oui\")","v":4}]
["TANGUY","Bob",null,"H",{"$f":"A71&\" \"&B71","v":"TANGUY Bob"},"oui","oui","oui","oui","oui","oui","oui","oui","oui","oui","oui","oui",null,"oui","oui",null,"oui","oui","L",{"$f":"COUNTIF(F71:W71,\"oui\")","v":16}]
["TARHAN","Yeliz","Etudiant","H",{"$f":"A72&\" \"&B72","v":"TARHAN Yeliz"},null,null,"oui",null,null,"oui",null,null,null,null,null,null,null,null,null,null,"oui",null,"S",{"$f":"COUNTIF(F72:W72,\"oui\")","v":3}]
["TEST","La",null,"F",{"$f":"A73&\" \"&B73","v":"TEST La"},"oui","oui","oui","oui","oui","oui","oui","oui","oui","oui","oui","oui","oui","oui","oui","oui","oui","oui"]
["THEME","Sophie","Etudiant","F",{"$f":"A74&\" \"&B74","v":"THEME Sophie"},null,null,null,null,null,"oui",null,null,null,null,null,"oui",null,null,"oui",null,null,null,"M",{"$f":"COUNTIF(F74:W74,\"oui\")","v":3}]
["TROBOE","Marcel",null,"H",{"$f":"A75&\" \"&B75","v":"TROBOE Marcel"},"oui","oui",null,"oui","oui",null,"oui","oui",null,"oui","oui",null,"oui","oui",null,"oui","oui","oui","L",{"$f":"COUNTIF(F75:W75,\"oui\")","v":13}]
["WOJCIK","Eulalie","Etudiant","F",{"$f":"A76&\" \"&B76","v":"WOJCIK Eulalie"},null,null,null,null,null,"oui",null,null,null,null,null,"oui",null,null,"oui",null,"oui",null,"M",{"$f":"COUNTIF(F76:W76,\"oui\")","v":4}]
["YANG","Johanne","Etudiant","F",{"$f":"A77&\" \"&B77","v":"YANG Johanne"},null,null,"oui",null,null,"oui",null,null,null,null,null,null,null,null,"oui",null,"oui",null,"L",{"$f":"COUNTIF(F77:W77,\"oui\")","v":4}]

{"sheet":"LUNDI","index":2,"n_rows":40,"n_cols":7,"rows_kept":40,"cut":false,"hidden":false,"merged":[[29,0,34,0],[31,1,34,1],[31,2,34,2],[35,1,36,1],[35,2,36,2],[35,0,36,0],[6,0,22,0],[37,0,39,0],[6,3,9,3],[10,3,13,3],[14,3,15,3],[17,3,18,3],[23,0,25,0],[23,1,25,1],[23,2,25,2],[26,0,28,0],[20,3,21,3],[29,3,30,3],[23,3,25,3],[37,3,39,3],[6,2,22,2],[6,1,22,1],[0,4,0,6],[2,0,3,0],[2,1,3,1],[2,2,3,2],[4,0,5,0],[4,1,5,1],[4,2,5,2],[4,3,5,3],[2,3,3,3],[37,2,39,2],[37,1,39,1],[26,3,28,3],[26,2,28,2],[26,1,28,1],[29,1,30,1],[29,2,30,2],[31,3,34,3],[35,3,36,3]]}
[null,"MIDI","SOIR","POSTE","LUNDI"]
[null,null,null,null,"9H00-14H00","14H00-18H00",">18H00"]
["CONTROLE SAC ENTREE",{"$f":"COUNTIF(E3:E4,\">a\")","v":0},{"$f":"COUNTIF(G3:G4,\">a\")","v":0},null,{"$f":"'Planning Bénévoles'!C3","v":0},{"$f":"'Planning Bénévoles'!D3","v":0},{"$f":"'Planning Bénévoles'!E3","v":0}]
[null,null,null,null,{"$f":"'Planning Bénévoles'!C4","v":0},{"$f":"'Planning Bénévoles'!D4","v":0},{"$f":"'Planning Bénévoles'!E4","v":0}]
[{"$f":"'Planning Bénévoles'!A5","v":"ACCUEIL VESTIAIRE "},{"$f":"COUNTIF(E5:E6,\">a\")","v":1},{"$f":"COUNTIF(G5:G6,\">a\")","v":1},null,{"$f":"'Planning Bénévoles'!C5","v":"ROUGER Olga"},{"$f":"'Planning Bénévoles'!D5","v":"DESJARDINS Jean Luc"},{"$f":"'Planning Bénévoles'!E5","v":"RAFFO Carine"}]
[null,null,null,null,{"$f":"'Planning Bénévoles'!C6","v":0},{"$f":"'Planning Bénévoles'!D6","v":0},{"$f":"'Planning Bénévoles'!E6","v":0}]
["COURT CENTRAL",{"$f":"COUNTIF(E7:E23,\">a\")","v":5},{"$f":"COUNTIF(G7:G23,\">a\")","v":8},"Filtrage Entrée",{"$f":"'Planning Bénévoles'!C7","v":"DESJARDINS Jean Luc"},{"$f":"'Planning Bénévoles'!D7","v":"DESECHALLIERS Carole"},{"$f":"'Planning Bénévoles'!E7","v":"ROUGER Olga"}]
[null,null,null,null,{"$f":"'Planning Bénévoles'!C8","v":"DUPUY Isabelle"},{"$f":"'Planning Bénévoles'!D8","v":"LE ROY  Julian"},{"$f":"'Planning Bénévoles'!E8","v":"CAHN Didier"}]
[null,null,null,null,{"$f":"'Planning Bénévoles'!C9","v":0},{"$f":"'Planning Bénévoles'!D9","v":0},{"$f":"'Planning Bénévoles'!E9","v":0}]
[null,null,null,null,{"$f":"'Planning Bénévoles'!C10","v":0},{"$f":"'Planning Bénévoles'!D10","v":0},{"$f":"'Planning Bénévoles'!E10","v":0}]
[null,null,null,"Placier Grande Tribune",{"$f":"'Planning Bénévoles'!C11","v":0},{"$f":"'Planning Bénévoles'!D11","v":"BOTHOREL Hélène"},{"$f":"'Planning Bénévoles'!E11","v":0}]
[null,null,null,null,{"$f":"'Planning Bénévoles'!C12","v":0},{"$f":"'Planning Bénévoles'!D12","v":0},{"$f":"'Planning Bénévoles'!E12","v":0}]
[null,null,null,null,{"$f":"'Planning Bénévoles'!C13","v":0},{"$f":"'Planning Bénévoles'!D13","v":0},{"$f":"'Planning Bénévoles'!E13","v":0}]
[null,null,null,null,{"$f":"'Planning Bénévoles'!C14","v":0},{"$f":"'Planning Bénévoles'!D14","v":0},{"$f":"'Planning Bénévoles'!E14","v":0}]
[null,null,null,"Filtrage Tribune Est",{"$f":"'Planning Bénévoles'!C15","v":"TROBOE Marcel"},{"$f":"'Planning Bénévoles'!D15","v":"CAHN Didier"},{"$f":"'Planning Bénévoles'!E15","v":"DANGÉ Yann"}]
[null,null,null,null,{"$f":"'Planning Bénévoles'!C16","v":0},{"$f":"'Planning Bénévoles'!D16","v":"DUPUY Isabelle"},{"$f":"'Planning Bénévoles'!E16","v":"BOURGUIGNON Catherine"}]
[null,null,null,"Placier Tribune Est",{"$f":"'Planning Bénévoles'!C17","v":0},{"$f":"'Planning Bénévoles'!D17","v":0},{"$f":"'Planning Bénévoles'!E17","v":0}]
[null,null,null,"Filtrage Tribune Ouest",{"$f":"'Planning Bénévoles'!C18","v":"DANGÉ Jean Pierre"},{"$f":"'Planning Bénévoles'!D18","v":"DENES Annick"},{"$f":"'Planning Bénévoles'!E18","v":"DUPUY Isabelle"}]
[null,null,null,null,{"$f":"'Planning Bénévoles'!C19","v":0},{"$f":"'Planning Bénévoles'!D19","v":"COCHOU Philippe"},{"$f":"'Planning Bénévoles'!E19","v":"MOAL Alain"}]
[null,null,null,"Placier Tribune Ouest",{"$f":"'Planning Bénévoles'!C20","v":0},{"$f":"'Planning Bénévoles'!D20","v":0},{"$f":"'Planning Bénévoles'!E20","v":0}]
[null,null,null,"Filtrage Tribune Restaurant",{"$f":"'Planning Bénévoles'!C21","v":"RIHANI Mohamed"},{"$f":"'Planning Bénévoles'!D21","v":"RAFFO Carine"},{"$f":"'Planning Bénévoles'!E21","v":"LANDOUARD Frédéric"}]
[null,null,null,null,{"$f":"'Planning Bénévoles'!C22","v":0},{"$f":"'Planning Bénévoles'!D22","v":"TANGUY Bob"},{"$f":"'Planning Bénévoles'!E22","v":"PLOUZENNEC Nadine"}]
[null,null,null,"Placier Tribune Restaurant",{"$f":"'Planning Bénévoles'!C23","v":0},{"$f":"'Planning Bénévoles'!D23","v":0},{"$f":"'Planning Bénévoles'!E23","v":0}]
["COURT N°1",{"$f":"COUNTIF(E24:E26,\">a\")","v":2},{"$f":"COUNTIF(G24:G26,\">a\")","v":2},"Filtrage",{"$f":"'Planning Bénévoles'!C24","v":"LE BIHAN Guy"},{"$f":"'Planning Bénévoles'!D24","v":"MALANDAIN Manuela"},{"$f":"'Planning Bénévoles'!E24","v":"TANGUY Bob"}]
[null,null,null,null,{"$f":"'Planning Bénévoles'!C25","v":"TANGUY Bob"},{"$f":"'Planning Bénévoles'!D25","v":"PLOUZENNEC Nadine"},{"$f":"'Planning Bénévoles'!E25","v":"BOTHOREL Hélène"}]
[null,null,null,null,{"$f":"'Planning Bénévoles'!C26","v":0},{"$f":"'Planning Bénévoles'!D26","v":0},{"$f":"'Planning Bénévoles'!E26","v":0}]
["BAR GRAND PUBLIC",{"$f":"COUNTIF(E27:E29,\">a\")","v":1},{"$f":"COUNTIF(G27:G29,\">a\")","v":1},null,{"$f":"'Planning Bénévoles'!C27","v":0},{"$f":"'Planning Bénévoles'!D27","v":0},{"$f":"'Planning Bénévoles'!E27","v":0}]
[null,null,null,null,{"$f":"'Planning Bénévoles'!C28","v":"FLOCH Philippe"},{"$f":"'Planning Bénévoles'!D28","v":0},{"$f":"'Planning Bénévoles'!E28","v":"ROCHCONGAR Christelle"}]
[null,null,null,null,{"$f":"'Planning Bénévoles'!C29","v":0},{"$f":"'Planning Bénévoles'!D29","v":0},{"$f":"'Planning Bénévoles'!E29","v":0}]
["BAR A CHAMPAGNE",{"$f":"COUNTIF(E30:E31,\">a\")","v":1},{"$f":"COUNTIF(G30:G31,\">a\")","v":2},"Filtrage",{"$f":"'Planning Bénévoles'!C30","v":0},{"$f":"'Planning Bénévoles'!D30","v":"BOURGUIGNON Catherine"},{"$f":"'Planning Bénévoles'!E30","v":"GARCETTE Jade"}]
[null,null,null,null,{"$f":"'Planning Bénévoles'!C31","v":"LE CORRE  Jérémy"},{"$f":"'Planning Bénévoles'!D31","v":"ROUGER Olga"},{"$f":"'Planning Bénévoles'!E31","v":"BÉNIER Alizée"}]
[null,{"$f":"COUNTIF(E32:E35,\">a\")","v":0},{"$f":"COUNTIF(G32:G35,\">a\")","v":2},"Service",{"$f":"'Planning Bénévoles'!C32","v":0},{"$f":"'Planning Bénévoles'!D32","v":0},{"$f":"'Planning Bénévoles'!E32","v":"YANG Johanne"}]
[null,null,null,null,{"$f":"'Planning Bénévoles'!C33","v":0},{"$f":"'Planning Bénévoles'!D33","v":0},{"$f":"'Planning Bénévoles'!E33","v":"SANS Loïs"}]
[null,null,null,null,{"$f":"'Planning Bénévoles'!C34","v":0},{"$f":"'Planning Bénévoles'!D34","v":0},{"$f":"'Planning Bénévoles'!E34","v":0}]
[null,null,null,null,{"$f":"'Planning Bénévoles'!C35","v":0},{"$f":"'Planning Bénévoles'!D35","v":0},{"$f":"'Planning Bénévoles'!E35","v":0}]
["BILLETERIE HALL",{"$f":"COUNTIF(E36:E37,\">a\")","v":1},{"$f":"COUNTIF(G36:G37,\">a\")","v":1},null,{"$f":"'Planning Bénévoles'!C36","v":0},{"$f":"'Planning Bénévoles'!D36","v":0},{"$f":"'Planning Bénévoles'!E36","v":0}]
[null,null,null,null,{"$f":"'Planning Bénévoles'!C37","v":"LE ROUX Stéphanie"},{"$f":"'Planning Bénévoles'!D37","v":"LE CORRE  Jérémy"},{"$f":"'Planning Bénévoles'!E37","v":"LE CORRE  Jérémy"}]
["REMPLACANTS",{"$f":"COUNTIF(E38:E40,\">a\")","v":3},{"$f":"COUNTIF(G38:G40,\">a\")","v":3},null,{"$f":"'Planning Bénévoles'!C38","v":"MALANDAIN Manuela"},{"$f":"'Planning Bénévoles'!D38","v":"TROBOE Marcel"},{"$f":"'Planning Bénévoles'!E38","v":"HADOUZI Yasmine"}]
[null,null,null,null,{"$f":"'Planning Bénévoles'!C39","v":"BEZIVIN Daniel"},{"$f":"'Planning Bénévoles'!D39","v":"LANDOUARD Frédéric"},{"$f":"'Planning Bénévoles'!E39","v":"LE ROY  Julian"}]
[null,null,null,null,{"$f":"'Planning Bénévoles'!C40","v":"LANDOUARD Frédéric"},{"$f":"'Planning Bénévoles'!D40","v":"MOAL Alain"},{"$f":"'Planning Bénévoles'!E40","v":"ROBERT Mireille"}]

{"sheet":"MARDI","index":3,"n_rows":40,"n_cols":7,"rows_kept":40,"cut":false,"hidden":false,"merged":[[26,0,28,0],[31,3,34,3],[23,3,25,3],[26,1,28,1],[26,2,28,2],[26,3,28,3],[29,3,30,3],[29,1,30,1],[29,2,30,2],[29,0,34,0],[31,1,34,1],[31,2,34,2],[6,3,9,3],[10,3,13,3],[14,3,15,3],[17,3,18,3],[20,3,21,3],[6,0,22,0],[6,1,22,1],[6,2,22,2],[23,0,25,0],[23,1,25,1],[23,2,25,2],[4,0,5,0],[4,1,5,1],[4,2,5,2],[4,3,5,3],[0,4,0,6],[2,0,3,0],[2,1,3,1],[2,2,3,2],[2,3,3,3],[35,0,36,0],[35,1,36,1],[35,2,36,2],[35,3,36,3],[37,0,39,0],[37,1,39,1],[37,2,39,2],[37,3,39,3]]}
[null,"MIDI","SOIR","POSTE","MARDI"]
[null,null,null,null,"9H00-14H00","14H00-18H00",">18H00"]
["CONTROLE SAC ENTREE",{"$f":"COUNTIF(E3:E4,\">a\")","v":2},{"$f":"COUNTIF(G3:G4,\">a\")","v":2},null,{"$f":"'Planning Bénévoles'!F3","v":"TANGUY Bob"},{"$f":"'Planning Bénévoles'!G3","v":"DESJARDINS Jean Luc"},{"$f":"'Planning Bénévoles'!H3","v":"DANGÉ Yann"}]
[null,null,null,null,{"$f":"'Planning Bénévoles'!F4","v":"DANGÉ Jean Pierre"},{"$f":"'Planning Bénévoles'!G4","v":"LE ROY  Julian"},{"$f":"'Planning Bénévoles'!H4","v":"MOAL Alain"}]
[{"$f":"'Planning Bénévoles'!A5","v":"ACCUEIL VESTIAIRE "},{"$f":"COUNTIF(E5:E6,\">a\")","v":2},{"$f":"COUNTIF(G5:G6,\">a\")","v":1},null,{"$f":"'Planning Bénévoles'!F5","v":"RIHANI Mohamed"},{"$f":"'Planning Bénévoles'!G5","v":"BOURGUIGNON Catherine"},{"$f":"'Planning Bénévoles'!H5","v":"DUTERQUE Frédérique"}]
[null,null,null,null,{"$f":"'Planning Bénévoles'!F6","v":"GUILLERMOU Marie Évelyne"},{"$f":"'Planning Bénévoles'!G6","v":"JANOT (K) Laetitia"},{"$f":"'Planning Bénévoles'!H6","v":0}]
["COURT CENTRAL",{"$f":"COUNTIF(E7:E23,\">a\")","v":11},{"$f":"COUNTIF(G7:G23,\">a\")","v":10},"Filtrage Entrée",{"$f":"'Planning Bénévoles'!F7","v":0},{"$f":"'Planning Bénévoles'!G7","v":"BOTHOREL Hélène"},{"$f":"'Planning Bénévoles'!H7","v":"CAHN Didier"}]
[null,null,null,null,{"$f":"'Planning Bénévoles'!F8","v":"BOTHOREL Hélène"},{"$f":"'Planning Bénévoles'!G8","v":"DESECHALLIERS Carole"},{"$f":"'Planning Bénévoles'!H8","v":"PLOUZENNEC Nadine"}]
[null,null,null,null,{"$f":"'Planning Bénévoles'!F9","v":"GAONACH (THG) Sarah"},{"$f":"'Planning Bénévoles'!G9","v":0},{"$f":"'Planning Bénévoles'!H9","v":0}]
[null,null,null,null,{"$f":"'Planning Bénévoles'!F10","v":0},{"$f":"'Planning Bénévoles'!G10","v":0},{"$f":"'Planning Bénévoles'!H10","v":0}]
[null,null,null,"Placier Grande Tribune",{"$f":"'Planning Bénévoles'!F11","v":"GUEGUEN (K) Sébastien"},{"$f":"'Planning Bénévoles'!G11","v":"STRUILLOU (K) Charlotte"},{"$f":"'Planning Bénévoles'!H11","v":"LE ROY  Julian"}]
[null,null,null,null,{"$f":"'Planning Bénévoles'!F12","v":"LANDOUARD Frédéric"},{"$f":"'Planning Bénévoles'!G12","v":"DANIEL Alain"},{"$f":"'Planning Bénévoles'!H12","v":"DANIEL Annie France"}]
[null,null,null,null,{"$f":"'Planning Bénévoles'!F13","v":0},{"$f":"'Planning Bénévoles'!G13","v":0},{"$f":"'Planning Bénévoles'!H13","v":0}]
[null,null,null,null,{"$f":"'Planning Bénévoles'!F14","v":0},{"$f":"'Planning Bénévoles'!G14","v":0},{"$f":"'Planning Bénévoles'!H14","v":0}]
[null,null,null,"Filtrage Tribune Est",{"$f":"'Planning Bénévoles'!F15","v":"MOAL Alain"},{"$f":"'Planning Bénévoles'!G15","v":"RAFFO Carine"},{"$f":"'Planning Bénévoles'!H15","v":"BOURGUIGNON Catherine"}]
[null,null,null,null,{"$f":"'Planning Bénévoles'!F16","v":"RAMA (THG) Jurgen"},{"$f":"'Planning Bénévoles'!G16","v":"MOAL Alain"},{"$f":"'Planning Bénévoles'!H16","v":"LANDOUARD Frédéric"}]
[null,null,null,"Placier Tribune Est",{"$f":"'Planning Bénévoles'!F17","v":"RAFFO Carine"},{"$f":"'Planning Bénévoles'!G17","v":"GUILLERMOU Marie Évelyne"},{"$f":"'Planning Bénévoles'!H17","v":0}]
[null,null,null,"Filtrage Tribune Ouest",{"$f":"'Planning Bénévoles'!F18","v":"GUERROT (THG) Gildas"},{"$f":"'Planning Bénévoles'!G18","v":"CAHN Didier"},{"$f":"'Planning Bénévoles'!H18","v":"MALANDAIN Manuela"}]
[null,null,null,null,{"$f":"'Planning Bénévoles'!F19","v":"TROBOE Marcel"},{"$f":"'Planning Bénévoles'!G19","v":"BEAUGION (K) Régis"},{"$f":"'Planning Bénévoles'!H19","v":"TANGUY Bob"}]
[null,null,null,"Placier Tribune Ouest",{"$f":"'Planning Bénévoles'!F20","v":0},{"$f":"'Planning Bénévoles'!G20","v":"MALANDAIN Manuela"},{"$f":"'Planning Bénévoles'!H20","v":0}]
[null,null,null,"Filtrage Tribune Restaurant",{"$f":"'Planning Bénévoles'!F21","v":"LE CORRE  Jérémy"},{"$f":"'Planning Bénévoles'!G21","v":"LE BIHAN Guy"},{"$f":"'Planning Bénévoles'!H21","v":"DENES Annick"}]
[null,null,null,null,{"$f":"'Planning Bénévoles'!F22","v":"BEAUGION (K) Régis"},{"$f":"'Planning Bénévoles'!G22","v":"GUERROT (THG) Gildas"},{"$f":"'Planning Bénévoles'!H22","v":"RAFFO Carine"}]
[null,null,null,"Placier Tribune Restaurant",{"$f":"'Planning Bénévoles'!F23","v":0},{"$f":"'Planning Bénévoles'!G23","v":0},{"$f":"'Planning Bénévoles'!H23","v":0}]
["COURT N°1",{"$f":"COUNTIF(E24:E26,\">a\")","v":2},{"$f":"COUNTIF(G24:G26,\">a\")","v":2},"Filtrage",{"$f":"'Planning Bénévoles'!F24","v":"DUPUY Isabelle"},{"$f":"'Planning Bénévoles'!G24","v":"TROBOE Marcel"},{"$f":"'Planning Bénévoles'!H24","v":"LE ROUX Stéphanie"}]
[null,null,null,null,{"$f":"'Planning Bénévoles'!F25","v":"GUEZENNEC (K) Bruno"},{"$f":"'Planning Bénévoles'!G25","v":0},{"$f":"'Planning Bénévoles'!H25","v":"DANIEL Alain"}]
[null,null,null,null,{"$f":"'Planning Bénévoles'!F26","v":0},{"$f":"'Planning Bénévoles'!G26","v":"NHEK (K) Alexandrine"},{"$f":"'Planning Bénévoles'!H26","v":0}]
["BAR GRAND PUBLIC",{"$f":"COUNTIF(E27:E29,\">a\")","v":2},{"$f":"COUNTIF(G27:G29,\">a\")","v":2},null,{"$f":"'Planning Bénévoles'!F27","v":"FLOCH Philippe"},{"$f":"'Planning Bénévoles'!G27","v":"LE CORRE  Jérémy"},{"$f":"'Planning Bénévoles'!H27","v":"MIGLIACCIO Claire"}]
[null,null,null,null,{"$f":"'Planning Bénévoles'!F28","v":"LECHAT Loïc"},{"$f":"'Planning Bénévoles'!G28","v":"KERLEO Anne Marie"},{"$f":"'Planning Bénévoles'!H28","v":"CORNEC Lucas"}]
[null,null,null,null,{"$f":"'Planning Bénévoles'!F29","v":0},{"$f":"'Planning Bénévoles'!G29","v":0},{"$f":"'Planning Bénévoles'!H29","v":0}]
["BAR A CHAMPAGNE",{"$f":"COUNTIF(E30:E31,\">a\")","v":1},{"$f":"COUNTIF(G30:G31,\">a\")","v":2},"Filtrage",{"$f":"'Planning Bénévoles'!F30","v":"MALANDAIN Manuela"},{"$f":"'Planning Bénévoles'!G30","v":"PLOUZENNEC Nadine"},{"$f":"'Planning Bénévoles'!H30","v":"BASTARD Chloé"}]
[null,null,null,null,{"$f":"'Planning Bénévoles'!F31","v":0},{"$f":"'Planning Bénévoles'!G31","v":"ROUGER Olga"},{"$f":"'Planning Bénévoles'!H31","v":"GUTIERREZ Valentina"}]
[null,{"$f":"COUNTIF(E32:E35,\">a\")","v":0},{"$f":"COUNTIF(G32:G35,\">a\")","v":3},"Service",{"$f":"'Planning Bénévoles'!F32","v":0},{"$f":"'Planning Bénévoles'!G32","v":0},{"$f":"'Planning Bénévoles'!H32","v":"BÉNIER Alizée"}]
[null,null,null,null,{"$f":"'Planning Bénévoles'!F33","v":0},{"$f":"'Planning Bénévoles'!G33","v":0},{"$f":"'Planning Bénévoles'!H33","v":"GARCETTE Jade"}]
[null,null,null,null,{"$f":"'Planning Bénévoles'!F34","v":0},{"$f":"'Planning Bénévoles'!G34","v":0},{"$f":"'Planning Bénévoles'!H34","v":"WOJCIK Eulalie"}]
[null,null,null,null,{"$f":"'Planning Bénévoles'!F35","v":0},{"$f":"'Planning Bénévoles'!G35","v":0},{"$f":"'Planning Bénévoles'!H35","v":0}]
["BILLETERIE HALL",{"$f":"COUNTIF(E36:E37,\">a\")","v":1},{"$f":"COUNTIF(G36:G37,\">a\")","v":1},null,{"$f":"'Planning Bénévoles'!F36","v":0},{"$f":"'Planning Bénévoles'!G36","v":0},{"$f":"'Planning Bénévoles'!H36","v":0}]
[null,null,null,null,{"$f":"'Planning Bénévoles'!F37","v":"ROUGER Olga"},{"$f":"'Planning Bénévoles'!G37","v":"LE ROUX Stéphanie"},{"$f":"'Planning Bénévoles'!H37","v":"ROUGER Olga"}]
["REMPLACANTS",{"$f":"COUNTIF(E38:E40,\">a\")","v":3},{"$f":"COUNTIF(G38:G40,\">a\")","v":2},null,{"$f":"'Planning Bénévoles'!F38","v":"JANOT (K) Laetitia"},{"$f":"'Planning Bénévoles'!G38","v":"DANIEL Annie France"},{"$f":"'Planning Bénévoles'!H38","v":"LE CORRE  Jérémy"}]
[null,null,null,null,{"$f":"'Planning Bénévoles'!F39","v":"STRUILLOU (K) Charlotte"},{"$f":"'Planning Bénévoles'!G39","v":"TANGUY Bob"},{"$f":"'Planning Bénévoles'!H39","v":"LE BIHAN Guy"}]
[null,null,null,null,{"$f":"'Planning Bénévoles'!F40","v":"NHEK (K) Alexandrine"},{"$f":"'Planning Bénévoles'!G40","v":"LANDOUARD Frédéric"},{"$f":"'Planning Bénévoles'!H40","v":0}]

{"sheet":"MERCREDI","index":4,"n_rows":40,"n_cols":7,"rows_kept":40,"cut":false,"hidden":false,"merged":[[35,0,36,0],[35,1,36,1],[35,2,36,2],[35,3,36,3],[37,0,39,0],[37,1,39,1],[37,2,39,2],[37,3,39,3],[29,1,30,1],[29,2,30,2],[29,3,30,3],[29,0,34,0],[31,1,34,1],[31,2,34,2],[31,3,34,3],[23,0,25,0],[23,1,25,1],[23,2,25,2],[23,3,25,3],[26,0,28,0],[26,1,28,1],[26,2,28,2],[26,3,28,3],[4,0,5,0],[4,1,5,1],[4,2,5,2],[4,3,5,3],[6,0,22,0],[6,1,22,1],[6,2,22,2],[6,3,9,3],[10,3,13,3],[14,3,15,3],[17,3,18,3],[20,3,21,3],[0,4,0,6],[2,0,3,0],[2,1,3,1],[2,2,3,2],[2,3,3,3]]}
[null,"MIDI","SOIR","POSTE","MERCREDI"]
[null,null,null,null,"9H00-14H00","14H00-18H00",">18H00"]
["CONTROLE SAC ENTREE",{"$f":"COUNTIF(E3:E4,\">a\")","v":2},{"$f":"COUNTIF(G3:G4,\">a\")","v":2},null,{"$f":"'Planning Bénévoles'!I3","v":"TROBOE Marcel"},{"$f":"'Planning Bénévoles'!J3","v":"LE GALL Yves"},{"$f":"'Planning Bénévoles'!K3","v":"TANGUY Bob"}]
[null,null,null,null,{"$f":"'Planning Bénévoles'!I4","v":"BOTHOREL Hélène"},{"$f":"'Planning Bénévoles'!J4","v":"ROBERT Mireille"},{"$f":"'Planning Bénévoles'!K4","v":"MARCHE Sophie"}]
[{"$f":"'Planning Bénévoles'!A5","v":"ACCUEIL VESTIAIRE "},{"$f":"COUNTIF(E5:E6,\">a\")","v":1},{"$f":"COUNTIF(G5:G6,\">a\")","v":1},null,{"$f":"'Planning Bénévoles'!I5","v":"MALANDAIN Manuela"},{"$f":"'Planning Bénévoles'!J5","v":"TROBOE Marcel"},{"$f":"'Planning Bénévoles'!K5","v":"BOURGUIGNON Catherine"}]
[null,null,null,null,{"$f":"'Planning Bénévoles'!I6","v":0},{"$f":"'Planning Bénévoles'!J6","v":"GUILLERMOU Marie Évelyne"},{"$f":"'Planning Bénévoles'!K6","v":0}]
["COURT CENTRAL",{"$f":"COUNTIF(E7:E23,\">a\")","v":10},{"$f":"COUNTIF(G7:G23,\">a\")","v":7},"Filtrage Entrée",{"$f":"'Planning Bénévoles'!I7","v":"BEZIVIN Daniel"},{"$f":"'Planning Bénévoles'!J7","v":"LANDOUARD Frédéric"},{"$f":"'Planning Bénévoles'!K7","v":0}]
[null,null,null,null,{"$f":"'Planning Bénévoles'!I8","v":"TANGUY Bob"},{"$f":"'Planning Bénévoles'!J8","v":"CAHN Didier"},{"$f":"'Planning Bénévoles'!K8","v":"LE BIHAN Guy"}]
[null,null,null,null,{"$f":"'Planning Bénévoles'!I9","v":"FER (THG) Mélissa"},{"$f":"'Planning Bénévoles'!J9","v":"FER (THG) Mélissa"},{"$f":"'Planning Bénévoles'!K9","v":0}]
[null,null,null,null,{"$f":"'Planning Bénévoles'!I10","v":0},{"$f":"'Planning Bénévoles'!J10","v":0},{"$f":"'Planning Bénévoles'!K10","v":0}]
[null,null,null,"Placier Grande Tribune",{"$f":"'Planning Bénévoles'!I11","v":"ROUGER Olga"},{"$f":"'Planning Bénévoles'!J11","v":"TANGUY Bob"},{"$f":"'Planning Bénévoles'!K11","v":"RIHANI Mohamed"}]
[null,null,null,null,{"$f":"'Planning Bénévoles'!I12","v":"PARISSE (THG) Amélie"},{"$f":"'Planning Bénévoles'!J12","v":"LE BOSSER Jean René"},{"$f":"'Planning Bénévoles'!K12","v":0}]
[null,null,null,null,{"$f":"'Planning Bénévoles'!I13","v":0},{"$f":"'Planning Bénévoles'!J13","v":"MALANDAIN Manuela"},{"$f":"'Planning Bénévoles'!K13","v":0}]
[null,null,null,null,{"$f":"'Planning Bénévoles'!I14","v":0},{"$f":"'Planning Bénévoles'!J14","v":0},{"$f":"'Planning Bénévoles'!K14","v":0}]
[null,null,null,"Filtrage Tribune Est",{"$f":"'Planning Bénévoles'!I15","v":"DANGÉ Jean Pierre"},{"$f":"'Planning Bénévoles'!J15","v":"RAFFO Carine"},{"$f":"'Planning Bénévoles'!K15","v":"LE ROY  Julian"}]
[null,null,null,null,{"$f":"'Planning Bénévoles'!I16","v":"RAFFO Carine"},{"$f":"'Planning Bénévoles'!J16","v":"LE BOSSER Liliane"},{"$f":"'Planning Bénévoles'!K16","v":"ROUGER Olga"}]
[null,null,null,"Placier Tribune Est",{"$f":"'Planning Bénévoles'!I17","v":0},{"$f":"'Planning Bénévoles'!J17","v":0},{"$f":"'Planning Bénévoles'!K17","v":0}]
[null,null,null,"Filtrage Tribune Ouest",{"$f":"'Planning Bénévoles'!I18","v":"LANDOUARD Frédéric"},{"$f":"'Planning Bénévoles'!J18","v":"BOURGUIGNON Catherine"},{"$f":"'Planning Bénévoles'!K18","v":"MOAL Alain"}]
[null,null,null,null,{"$f":"'Planning Bénévoles'!I19","v":"FISSEUX Rosalina"},{"$f":"'Planning Bénévoles'!J19","v":"LE ROY  Julian"},{"$f":"'Planning Bénévoles'!K19","v":0}]
[null,null,null,"Placier Tribune Ouest",{"$f":"'Planning Bénévoles'!I20","v":0},{"$f":"'Planning Bénévoles'!J20","v":0},{"$f":"'Planning Bénévoles'!K20","v":0}]
[null,null,null,"Filtrage Tribune Restaurant",{"$f":"'Planning Bénévoles'!I21","v":0},{"$f":"'Planning Bénévoles'!J21","v":"BOTHOREL Hélène"},{"$f":"'Planning Bénévoles'!K21","v":"RAFFO Carine"}]
[null,null,null,null,{"$f":"'Planning Bénévoles'!I22","v":"LE BIHAN Guy"},{"$f":"'Planning Bénévoles'!J22","v":"MOAL Alain"},{"$f":"'Planning Bénévoles'!K22","v":"YANG Johanne"}]
[null,null,null,"Placier Tribune Restaurant",{"$f":"'Planning Bénévoles'!I23","v":0},{"$f":"'Planning Bénévoles'!J23","v":0},{"$f":"'Planning Bénévoles'!K23","v":0}]
["COURT N°1",{"$f":"COUNTIF(E24:E26,\">a\")","v":2},{"$f":"COUNTIF(G24:G26,\">a\")","v":2},"Filtrage",{"$f":"'Planning Bénévoles'!I24","v":"MOAL Alain"},{"$f":"'Planning Bénévoles'!J24","v":"BEZIVIN Daniel"},{"$f":"'Planning Bénévoles'!K24","v":"PLOUZENNEC Nadine"}]
[null,null,null,null,{"$f":"'Planning Bénévoles'!I25","v":"BOURGEON (THG) Jérémy"},{"$f":"'Planning Bénévoles'!J25","v":"PARISSE (THG) Amélie"},{"$f":"'Planning Bénévoles'!K25","v":"CAHN Didier"}]
[null,null,null,null,{"$f":"'Planning Bénévoles'!I26","v":0},{"$f":"'Planning Bénévoles'!J26","v":0},{"$f":"'Planning Bénévoles'!K26","v":0}]
["BAR GRAND PUBLIC",{"$f":"COUNTIF(E27:E29,\">a\")","v":2},{"$f":"COUNTIF(G27:G29,\">a\")","v":2},null,{"$f":"'Planning Bénévoles'!I27","v":"ROCHCONGAR Christelle"},{"$f":"'Planning Bénévoles'!J27","v":"LE CORRE  Jérémy"},{"$f":"'Planning Bénévoles'!K27","v":"CORNEC Lucas"}]
[null,null,null,null,{"$f":"'Planning Bénévoles'!I28","v":"FLOCH Philippe"},{"$f":"'Planning Bénévoles'!J28","v":"COCHOU Philippe"},{"$f":"'Planning Bénévoles'!K28","v":"LE CORRE  Jérémy"}]
[null,null,null,null,{"$f":"'Planning Bénévoles'!I29","v":0},{"$f":"'Planning Bénévoles'!J29","v":0},{"$f":"'Planning Bénévoles'!K29","v":0}]
["BAR A CHAMPAGNE",{"$f":"COUNTIF(E30:E31,\">a\")","v":0},{"$f":"COUNTIF(G30:G31,\">a\")","v":2},"Filtrage",{"$f":"'Planning Bénévoles'!I30","v":0},{"$f":"'Planning Bénévoles'!J30","v":"PLOUZENNEC Nadine"},{"$f":"'Planning Bénévoles'!K30","v":"BÉNIER Alizée"}]
[null,null,null,null,{"$f":"'Planning Bénévoles'!I31","v":0},{"$f":"'Planning Bénévoles'!J31","v":"DENES Annick"},{"$f":"'Planning Bénévoles'!K31","v":"SANS Loïs"}]
[null,{"$f":"COUNTIF(E32:E35,\">a\")","v":0},{"$f":"COUNTIF(G32:G35,\">a\")","v":3},"Service",{"$f":"'Planning Bénévoles'!I32","v":0},{"$f":"'Planning Bénévoles'!J32","v":0},{"$f":"'Planning Bénévoles'!K32","v":"ROUAT Manon"}]
[null,null,null,null,{"$f":"'Planning Bénévoles'!I33","v":0},{"$f":"'Planning Bénévoles'!J33","v":0},{"$f":"'Planning Bénévoles'!K33","v":"GUTIERREZ Valentina"}]
[null,null,null,null,{"$f":"'Planning Bénévoles'!I34","v":0},{"$f":"'Planning Bénévoles'!J34","v":0},{"$f":"'Planning Bénévoles'!K34","v":"HADOUZI Yasmine"}]
[null,null,null,null,{"$f":"'Planning Bénévoles'!I35","v":0},{"$f":"'Planning Bénévoles'!J35","v":0},{"$f":"'Planning Bénévoles'!K35","v":0}]
["BILLETERIE HALL",{"$f":"COUNTIF(E36:E37,\">a\")","v":0},{"$f":"COUNTIF(G36:G37,\">a\")","v":0},null,{"$f":"'Planning Bénévoles'!I36","v":0},{"$f":"'Planning Bénévoles'!J36","v":0},{"$f":"'Planning Bénévoles'!K36","v":0}]
[null,null,null,null,{"$f":"'Planning Bénévoles'!I37","v":0},{"$f":"'Planning Bénévoles'!J37","v":"ROUGER Olga"},{"$f":"'Planning Bénévoles'!K37","v":0}]
["REMPLACANTS",{"$f":"COUNTIF(E38:E40,\">a\")","v":3},{"$f":"COUNTIF(G38:G40,\">a\")","v":1},null,{"$f":"'Planning Bénévoles'!I38","v":"DESJARDINS Jean Luc"},{"$f":"'Planning Bénévoles'!J38","v":"DESJARDINS Jean Luc"},{"$f":"'Planning Bénévoles'!K38","v":"GUILLERMOU Marie Évelyne"}]
[null,null,null,null,{"$f":"'Planning Bénévoles'!I39","v":"ROBERT Mireille"},{"$f":"'Planning Bénévoles'!J39","v":0},{"$f":"'Planning Bénévoles'!K39","v":0}]
[null,null,null,null,{"$f":"'Planning Bénévoles'!I40","v":"GUILLERMOU Marie Évelyne"},{"$f":"'Planning Bénévoles'!J40","v":0},{"$f":"'Planning Bénévoles'!K40","v":0}]

{"sheet":"JEUDI","index":5,"n_rows":40,"n_cols":7,"rows_kept":40,"cut":false,"hidden":false,"merged":[[35,0,36,0],[35,1,36,1],[35,2,36,2],[35,3,36,3],[37,0,39,0],[37,1,39,1],[37,2,39,2],[37,3,39,3],[29,3,30,3],[29,1,30,1],[29,2,30,2],[29,0,34,0],[31,1,34,1],[31,2,34,2],[31,3,34,3],[23,3,25,3],[26,0,28,0],[26,1,28,1],[26,2,28,2],[26,3,28,3],[6,3,9,3],[10,3,13,3],[14,3,15,3],[17,3,18,3],[20,3,21,3],[6,0,22,0],[6,1,22,1],[6,2,22,2],[23,0,25,0],[23,1,25,1],[23,2,25,2],[4,0,5,0],[4,1,5,1],[4,2,5,2],[4,3,5,3],[0,4,0,6],[2,0,3,0],[2,1,3,1],[2,2,3,2],[2,3,3,3]]}
[null,"MIDI","SOIR","POSTE","JEUDI"]
[null,null,null,null,"9H00-14H00","14H00-18H00",">18H00"]
["CONTROLE SAC ENTREE",{"$f":"COUNTIF(E3:E4,\">a\")","v":0},{"$f":"COUNTIF(G3:G4,\">a\")","v":0},null,{"$f":"'Planning Bénévoles'!L3","v":0},{"$f":"'Planning Bénévoles'!M3","v":0},{"$f":"'Planning Bénévoles'!N3","v":0}]
[null,null,null,null,{"$f":"'Planning Bénévoles'!L4","v":0},{"$f":"'Planning Bénévoles'!M4","v":0},{"$f":"'Planning Bénévoles'!N4","v":0}]
[{"$f":"'Planning Bénévoles'!A5","v":"ACCUEIL VESTIAIRE "},{"$f":"COUNTIF(E5:E6,\">a\")","v":2},{"$f":"COUNTIF(G5:G6,\">a\")","v":0},null,{"$f":"'Planning Bénévoles'!L5","v":"FER (THG) Mélissa"},{"$f":"'Planning Bénévoles'!M5","v":0},{"$f":"'Planning Bénévoles'!N5","v":0}]
[null,null,null,null,{"$f":"'Planning Bénévoles'!L6","v":"LANDOUARD Frédéric"},{"$f":"'Planning Bénévoles'!M6","v":0},{"$f":"'Planning Bénévoles'!N6","v":0}]
["COURT CENTRAL",{"$f":"COUNTIF(E7:E23,\">a\")","v":4},{"$f":"COUNTIF(G7:G23,\">a\")","v":0},"Filtrage Entrée",{"$f":"'Planning Bénévoles'!L7","v":"DUPUY Isabelle"},{"$f":"'Planning Bénévoles'!M7","v":0},{"$f":"'Planning Bénévoles'!N7","v":0}]
[null,null,null,null,{"$f":"'Planning Bénévoles'!L8","v":"KERVELLA (K) Virginie"},{"$f":"'Planning Bénévoles'!M8","v":0},{"$f":"'Planning Bénévoles'!N8","v":0}]
[null,null,null,null,{"$f":"'Planning Bénévoles'!L9","v":0},{"$f":"'Planning Bénévoles'!M9","v":0},{"$f":"'Planning Bénévoles'!N9","v":0}]
[null,null,null,null,{"$f":"'Planning Bénévoles'!L10","v":0},{"$f":"'Planning Bénévoles'!M10","v":0},{"$f":"'Planning Bénévoles'!N10","v":0}]
[null,null,null,"Placier Grande Tribune",{"$f":"'Planning Bénévoles'!L11","v":"CLOAREC (K) Didier"},{"$f":"'Planning Bénévoles'!M11","v":0},{"$f":"'Planning Bénévoles'!N11","v":0}]
[null,null,null,null,{"$f":"'Planning Bénévoles'!L12","v":"GUILLERMOU Marie Évelyne"},{"$f":"'Planning Bénévoles'!M12","v":0},{"$f":"'Planning Bénévoles'!N12","v":0}]
[null,null,null,null,{"$f":"'Planning Bénévoles'!L13","v":0},{"$f":"'Planning Bénévoles'!M13","v":0},{"$f":"'Planning Bénévoles'!N13","v":0}]
[null,null,null,null,{"$f":"'Planning Bénévoles'!L14","v":0},{"$f":"'Planning Bénévoles'!M14","v":0},{"$f":"'Planning Bénévoles'!N14","v":0}]
[null,null,null,"Filtrage Tribune Est",{"$f":"'Planning Bénévoles'!L15","v":0},{"$f":"'Planning Bénévoles'!M15","v":"LE BIHAN Guy"},{"$f":"'Planning Bénévoles'!N15","v":0}]
[null,null,null,null,{"$f":"'Planning Bénévoles'!L16","v":0},{"$f":"'Planning Bénévoles'!M16","v":0},{"$f":"'Planning Bénévoles'!N16","v":0}]
[null,null,null,"Placier Tribune Est",{"$f":"'Planning Bénévoles'!L17","v":0},{"$f":"'Planning Bénévoles'!M17","v":0},{"$f":"'Planning Bénévoles'!N17","v":0}]
[null,null,null,"Filtrage Tribune Ouest",{"$f":"'Planning Bénévoles'!L18","v":0},{"$f":"'Planning Bénévoles'!M18","v":0},{"$f":"'Planning Bénévoles'!N18","v":0}]
[null,null,null,null,{"$f":"'Planning Bénévoles'!L19","v":0},{"$f":"'Planning Bénévoles'!M19","v":0},{"$f":"'Planning Bénévoles'!N19","v":0}]
[null,null,null,"Placier Tribune Ouest",{"$f":"'Planning Bénévoles'!L20","v":0},{"$f":"'Planning Bénévoles'!M20","v":0},{"$f":"'Planning Bénévoles'!N20","v":0}]
[null,null,null,"Filtrage Tribune Restaurant",{"$f":"'Planning Bénévoles'!L21","v":0},{"$f":"'Planning Bénévoles'!M21","v":0},{"$f":"'Planning Bénévoles'!N21","v":0}]
[null,null,null,null,{"$f":"'Planning Bénévoles'!L22","v":0},{"$f":"'Planning Bénévoles'!M22","v":0},{"$f":"'Planning Bénévoles'!N22","v":0}]
[null,null,null,"Placier Tribune Restaurant",{"$f":"'Planning Bénévoles'!L23","v":0},{"$f":"'Planning Bénévoles'!M23","v":0},{"$f":"'Planning Bénévoles'!N23","v":0}]
["COURT N°1",{"$f":"COUNTIF(E24:E26,\">a\")","v":2},{"$f":"COUNTIF(G24:G26,\">a\")","v":0},"Filtrage",{"$f":"'Planning Bénévoles'!L24","v":"BIENNE (K) Xavier"},{"$f":"'Planning Bénévoles'!M24","v":0},{"$f":"'Planning Bénévoles'!N24","v":0}]
[null,null,null,null,{"$f":"'Planning Bénévoles'!L25","v":"RAFFO Carine"},{"$f":"'Planning Bénévoles'!M25","v":0},{"$f":"'Planning Bénévoles'!N25","v":0}]
[null,null,null,null,{"$f":"'Planning Bénévoles'!L26","v":0},{"$f":"'Planning Bénévoles'!M26","v":0},{"$f":"'Planning Bénévoles'!N26","v":0}]
["BAR GRAND PUBLIC",{"$f":"COUNTIF(E27:E29,\">a\")","v":2},{"$f":"COUNTIF(G27:G29,\">a\")","v":2},null,{"$f":"'Planning Bénévoles'!L27","v":"FLOCH Philippe"},{"$f":"'Planning Bénévoles'!M27","v":"KERLEO Anne Marie"},{"$f":"'Planning Bénévoles'!N27","v":"CORNEC Lucas"}]
[null,null,null,null,{"$f":"'Planning Bénévoles'!L28","v":"LE CORRE  Jérémy"},{"$f":"'Planning Bénévoles'!M28","v":"COCHOU Philippe"},{"$f":"'Planning Bénévoles'!N28","v":"LE CORRE  Jérémy"}]
[null,null,null,null,{"$f":"'Planning Bénévoles'!L29","v":0},{"$f":"'Planning Bénévoles'!M29","v":0},{"$f":"'Planning Bénévoles'!N29","v":0}]
["BAR A CHAMPAGNE",{"$f":"COUNTIF(E30:E31,\">a\")","v":0},{"$f":"COUNTIF(G30:G31,\">a\")","v":0},"Filtrage",{"$f":"'Planning Bénévoles'!L30","v":0},{"$f":"'Planning Bénévoles'!M30","v":0},{"$f":"'Planning Bénévoles'!N30","v":0}]
[null,null,null,null,{"$f":"'Planning Bénévoles'!L31","v":0},{"$f":"'Planning Bénévoles'!M31","v":0},{"$f":"'Planning Bénévoles'!N31","v":0}]
[null,{"$f":"COUNTIF(E32:E35,\">a\")","v":0},{"$f":"COUNTIF(G32:G35,\">a\")","v":0},"Service",{"$f":"'Planning Bénévoles'!L32","v":0},{"$f":"'Planning Bénévoles'!M32","v":0},{"$f":"'Planning Bénévoles'!N32","v":0}]
[null,null,null,null,{"$f":"'Planning Bénévoles'!L33","v":0},{"$f":"'Planning Bénévoles'!M33","v":0},{"$f":"'Planning Bénévoles'!N33","v":0}]
[null,null,null,null,{"$f":"'Planning Bénévoles'!L34","v":0},{"$f":"'Planning Bénévoles'!M34","v":0},{"$f":"'Planning Bénévoles'!N34","v":0}]
[null,null,null,null,{"$f":"'Planning Bénévoles'!L35","v":0},{"$f":"'Planning Bénévoles'!M35","v":0},{"$f":"'Planning Bénévoles'!N35","v":0}]
["BILLETERIE HALL",{"$f":"COUNTIF(E36:E37,\">a\")","v":0},{"$f":"COUNTIF(G36:G37,\">a\")","v":0},null,{"$f":"'Planning Bénévoles'!L36","v":0},{"$f":"'Planning Bénévoles'!M36","v":0},{"$f":"'Planning Bénévoles'!N36","v":0}]
[null,null,null,null,{"$f":"'Planning Bénévoles'!L37","v":0},{"$f":"'Planning Bénévoles'!M37","v":0},{"$f":"'Planning Bénévoles'!N37","v":0}]
["REMPLACANTS",{"$f":"COUNTIF(E38:E40,\">a\")","v":0},{"$f":"COUNTIF(G38:G40,\">a\")","v":0},null,{"$f":"'Planning Bénévoles'!L38","v":0},{"$f":"'Planning Bénévoles'!M38","v":0},{"$f":"'Planning Bénévoles'!N38","v":0}]
[null,null,null,null,{"$f":"'Planning Bénévoles'!L39","v":0},{"$f":"'Planning Bénévoles'!M39","v":0},{"$f":"'Planning Bénévoles'!N39","v":0}]
[null,null,null,null,{"$f":"'Planning Bénévoles'!L40","v":0},{"$f":"'Planning Bénévoles'!M40","v":0},{"$f":"'Planning Bénévoles'!N40","v":0}]

{"sheet":"VENDREDI","index":6,"n_rows":40,"n_cols":7,"rows_kept":40,"cut":false,"hidden":false,"merged":[[35,0,36,0],[35,1,36,1],[35,2,36,2],[35,3,36,3],[37,0,39,0],[37,1,39,1],[37,2,39,2],[37,3,39,3],[29,3,30,3],[29,1,30,1],[29,2,30,2],[29,0,34,0],[31,1,34,1],[31,2,34,2],[31,3,34,3],[23,3,25,3],[26,0,28,0],[26,1,28,1],[26,2,28,2],[26,3,28,3],[6,3,9,3],[10,3,13,3],[14,3,15,3],[17,3,18,3],[20,3,21,3],[6,0,22,0],[6,1,22,1],[6,2,22,2],[23,0,25,0],[23,1,25,1],[23,2,25,2],[4,0,5,0],[4,1,5,1],[4,2,5,2],[4,3,5,3],[0,4,0,6],[2,0,3,0],[2,1,3,1],[2,2,3,2],[2,3,3,3]]}
[null,"MIDI","SOIR","POSTE","VENDREDI"]
[null,null,null,null,"9H00-14H00","14H00-18H00",">18H00"]
["CONTROLE SAC ENTREE",{"$f":"COUNTIF(E3:E4,\">a\")","v":2},{"$f":"COUNTIF(G3:G4,\">a\")","v":0},null,{"$f":"'Planning Bénévoles'!O3","v":"LANDOUARD Frédéric"},{"$f":"'Planning Bénévoles'!P3","v":0},{"$f":"'Planning Bénévoles'!Q3","v":0}]
[null,null,null,null,{"$f":"'Planning Bénévoles'!O4","v":"KERVELLA (K) Virginie"},{"$f":"'Planning Bénévoles'!P4","v":0},{"$f":"'Planning Bénévoles'!Q4","v":0}]
[{"$f":"'Planning Bénévoles'!A5","v":"ACCUEIL VESTIAIRE "},{"$f":"COUNTIF(E5:E6,\">a\")","v":2},{"$f":"COUNTIF(G5:G6,\">a\")","v":0},null,{"$f":"'Planning Bénévoles'!O5","v":"LE GALL Yves"},{"$f":"'Planning Bénévoles'!P5","v":0},{"$f":"'Planning Bénévoles'!Q5","v":0}]
[null,null,null,null,{"$f":"'Planning Bénévoles'!O6","v":"GUEGUEN (K) Sébastien"},{"$f":"'Planning Bénévoles'!P6","v":0},{"$f":"'Planning Bénévoles'!Q6","v":0}]
["COURT CENTRAL",{"$f":"COUNTIF(E7:E23,\">a\")","v":11},{"$f":"COUNTIF(G7:G23,\">a\")","v":0},"Filtrage Entrée",{"$f":"'Planning Bénévoles'!O7","v":"BOTHOREL Hélène"},{"$f":"'Planning Bénévoles'!P7","v":0},{"$f":"'Planning Bénévoles'!Q7","v":0}]
[null,null,null,null,{"$f":"'Planning Bénévoles'!O8","v":"NHEK (K) Alexandrine"},{"$f":"'Planning Bénévoles'!P8","v":0},{"$f":"'Planning Bénévoles'!Q8","v":0}]
[null,null,null,null,{"$f":"'Planning Bénévoles'!O9","v":"TROBOE Marcel"},{"$f":"'Planning Bénévoles'!P9","v":0},{"$f":"'Planning Bénévoles'!Q9","v":0}]
[null,null,null,null,{"$f":"'Planning Bénévoles'!O10","v":0},{"$f":"'Planning Bénévoles'!P10","v":0},{"$f":"'Planning Bénévoles'!Q10","v":0}]
[null,null,null,"Placier Grande Tribune",{"$f":"'Planning Bénévoles'!O11","v":"BIENNE (K) Xavier"},{"$f":"'Planning Bénévoles'!P11","v":0},{"$f":"'Planning Bénévoles'!Q11","v":0}]
[null,null,null,null,{"$f":"'Planning Bénévoles'!O12","v":0},{"$f":"'Planning Bénévoles'!P12","v":0},{"$f":"'Planning Bénévoles'!Q12","v":0}]
[null,null,null,null,{"$f":"'Planning Bénévoles'!O13","v":0},{"$f":"'Planning Bénévoles'!P13","v":0},{"$f":"'Planning Bénévoles'!Q13","v":0}]
[null,null,null,null,{"$f":"'Planning Bénévoles'!O14","v":0},{"$f":"'Planning Bénévoles'!P14","v":0},{"$f":"'Planning Bénévoles'!Q14","v":0}]
[null,null,null,"Filtrage Tribune Est",{"$f":"'Planning Bénévoles'!O15","v":"MOAL Alain"},{"$f":"'Planning Bénévoles'!P15","v":0},{"$f":"'Planning Bénévoles'!Q15","v":0}]
[null,null,null,null,{"$f":"'Planning Bénévoles'!O16","v":"BALMADIER (THG) Henri"},{"$f":"'Planning Bénévoles'!P16","v":0},{"$f":"'Planning Bénévoles'!Q16","v":0}]
[null,null,null,"Placier Tribune Est",{"$f":"'Planning Bénévoles'!O17","v":"JANOT (K) Laetitia"},{"$f":"'Planning Bénévoles'!P17","v":0},{"$f":"'Planning Bénévoles'!Q17","v":0}]
[null,null,null,"Filtrage Tribune Ouest",{"$f":"'Planning Bénévoles'!O18","v":"BEZIVIN Daniel"},{"$f":"'Planning Bénévoles'!P18","v":0},{"$f":"'Planning Bénévoles'!Q18","v":0}]
[null,null,null,null,{"$f":"'Planning Bénévoles'!O19","v":"BEAUGION (K) Régis"},{"$f":"'Planning Bénévoles'!P19","v":0},{"$f":"'Planning Bénévoles'!Q19","v":0}]
[null,null,null,"Placier Tribune Ouest",{"$f":"'Planning Bénévoles'!O20","v":"BERTIN (THG) Nicolas"},{"$f":"'Planning Bénévoles'!P20","v":0},{"$f":"'Planning Bénévoles'!Q20","v":0}]
[null,null,null,"Filtrage Tribune Restaurant",{"$f":"'Planning Bénévoles'!O21","v":"RAFFO Carine"},{"$f":"'Planning Bénévoles'!P21","v":0},{"$f":"'Planning Bénévoles'!Q21","v":0}]
[null,null,null,null,{"$f":"'Planning Bénévoles'!O22","v":0},{"$f":"'Planning Bénévoles'!P22","v":0},{"$f":"'Planning Bénévoles'!Q22","v":0}]
[null,null,null,"Placier Tribune Restaurant",{"$f":"'Planning Bénévoles'!O23","v":0},{"$f":"'Planning Bénévoles'!P23","v":0},{"$f":"'Planning Bénévoles'!Q23","v":0}]
["COURT N°1",{"$f":"COUNTIF(E24:E26,\">a\")","v":2},{"$f":"COUNTIF(G24:G26,\">a\")","v":0},"Filtrage",{"$f":"'Planning Bénévoles'!O24","v":"DANGÉ Jean Pierre"},{"$f":"'Planning Bénévoles'!P24","v":0},{"$f":"'Planning Bénévoles'!Q24","v":0}]
[null,null,null,null,{"$f":"'Planning Bénévoles'!O25","v":"CLOAREC (K) Didier"},{"$f":"'Planning Bénévoles'!P25","v":0},{"$f":"'Planning Bénévoles'!Q25","v":0}]
[null,null,null,null,{"$f":"'Planning Bénévoles'!O26","v":0},{"$f":"'Planning Bénévoles'!P26","v":0},{"$f":"'Planning Bénévoles'!Q26","v":0}]
["BAR GRAND PUBLIC",{"$f":"COUNTIF(E27:E29,\">a\")","v":1},{"$f":"COUNTIF(G27:G29,\">a\")","v":2},null,{"$f":"'Planning Bénévoles'!O27","v":"FLOCH Philippe"},{"$f":"'Planning Bénévoles'!P27","v":0},{"$f":"'Planning Bénévoles'!Q27","v":"MIGLIACCIO Claire"}]
[null,null,null,null,{"$f":"'Planning Bénévoles'!O28","v":0},{"$f":"'Planning Bénévoles'!P28","v":0},{"$f":"'Planning Bénévoles'!Q28","v":"CORNEC Lucas"}]
[null,null,null,null,{"$f":"'Planning Bénévoles'!O29","v":0},{"$f":"'Planning Bénévoles'!P29","v":0},{"$f":"'Planning Bénévoles'!Q29","v":0}]
["BAR A CHAMPAGNE",{"$f":"COUNTIF(E30:E31,\">a\")","v":1},{"$f":"COUNTIF(G30:G31,\">a\")","v":0},"Filtrage",{"$f":"'Planning Bénévoles'!O30","v":"MARCHE Sophie"},{"$f":"'Planning Bénévoles'!P30","v":0},{"$f":"'Planning Bénévoles'!Q30","v":0}]
[null,null,null,null,{"$f":"'Planning Bénévoles'!O31","v":0},{"$f":"'Planning Bénévoles'!P31","v":0},{"$f":"'Planning Bénévoles'!Q31","v":0}]
[null,{"$f":"COUNTIF(E32:E35,\">a\")","v":0},{"$f":"COUNTIF(G32:G35,\">a\")","v":0},"Service",{"$f":"'Planning Bénévoles'!O32","v":0},{"$f":"'Planning Bénévoles'!P32","v":0},{"$f":"'Planning Bénévoles'!Q32","v":0}]
[null,null,null,null,{"$f":"'Planning Bénévoles'!O33","v":0},{"$f":"'Planning Bénévoles'!P33","v":0},{"$f":"'Planning Bénévoles'!Q33","v":0}]
[null,null,null,null,{"$f":"'Planning Bénévoles'!O34","v":0},{"$f":"'Planning Bénévoles'!P34","v":0},{"$f":"'Planning Bénévoles'!Q34","v":0}]
[null,null,null,null,{"$f":"'Planning Bénévoles'!O35","v":0},{"$f":"'Planning Bénévoles'!P35","v":0},{"$f":"'Planning Bénévoles'!Q35","v":0}]
["BILLETERIE HALL",{"$f":"COUNTIF(E36:E37,\">a\")","v":1},{"$f":"COUNTIF(G36:G37,\">a\")","v":0},null,{"$f":"'Planning Bénévoles'!O36","v":0},{"$f":"'Planning Bénévoles'!P36","v":0},{"$f":"'Planning Bénévoles'!Q36","v":0}]
[null,null,null,null,{"$f":"'Planning Bénévoles'!O37","v":"ROUGER Olga"},{"$f":"'Planning Bénévoles'!P37","v":0},{"$f":"'Planning Bénévoles'!Q37","v":0}]
["REMPLACANTS",{"$f":"COUNTIF(E38:E40,\">a\")","v":3},{"$f":"COUNTIF(G38:G40,\">a\")","v":0},null,{"$f":"'Planning Bénévoles'!O38","v":"ROBERT Mireille"},{"$f":"'Planning Bénévoles'!P38","v":0},{"$f":"'Planning Bénévoles'!Q38","v":0}]
[null,null,null,null,{"$f":"'Planning Bénévoles'!O39","v":"LE ROY (THG) Christelle"},{"$f":"'Planning Bénévoles'!P39","v":0},{"$f":"'Planning Bénévoles'!Q39","v":0}]
[null,null,null,null,{"$f":"'Planning Bénévoles'!O40","v":"DUPUY Isabelle"},{"$f":"'Planning Bénévoles'!P40","v":0},{"$f":"'Planning Bénévoles'!Q40","v":0}]

{"sheet":"SAMEDI","index":7,"n_rows":40,"n_cols":5,"rows_kept":40,"cut":false,"hidden":false,"merged":[[37,0,39,0],[37,1,39,1],[37,2,39,2],[23,2,25,2],[26,0,28,0],[26,1,28,1],[26,2,28,2],[23,0,25,0],[23,1,25,1],[29,1,30,1],[35,1,36,1],[35,2,36,2],[35,0,36,0],[29,0,34,0],[31,1,34,1],[31,2,34,2],[29,2,30,2],[2,0,3,0],[2,1,3,1],[0,3,0,4],[2,2,3,2],[4,0,5,0],[4,1,5,1],[4,2,5,2],[6,0,22,0],[6,1,22,1],[6,2,9,2],[10,2,13,2],[14,2,15,2],[17,2,18,2],[20,2,21,2]]}
[null,"MIDI","POSTE","SAMEDI"]
[null,null,null,"9H00-14H00","14H00-18H00"]
["CONTROLE SAC ENTREE",{"$f":"COUNTIF(D3:D4,\">a\")","v":0},null,{"$f":"'Planning Bénévoles'!R3","v":0},{"$f":"'Planning Bénévoles'!S3","v":0}]
[null,null,null,{"$f":"'Planning Bénévoles'!R4","v":0},{"$f":"'Planning Bénévoles'!S4","v":0}]
[{"$f":"'Planning Bénévoles'!A5","v":"ACCUEIL VESTIAIRE "},{"$f":"COUNTIF(D5:D6,\">a\")","v":0},null,{"$f":"'Planning Bénévoles'!R5","v":0},{"$f":"'Planning Bénévoles'!S5","v":0}]
[null,null,null,{"$f":"'Planning Bénévoles'!R6","v":0},{"$f":"'Planning Bénévoles'!S6","v":0}]
["COURT CENTRAL",{"$f":"COUNTIF(D7:D23,\">a\")","v":0},"Filtrage Entrée",{"$f":"'Planning Bénévoles'!R7","v":0},{"$f":"'Planning Bénévoles'!S7","v":0}]
[null,null,null,{"$f":"'Planning Bénévoles'!R8","v":0},{"$f":"'Planning Bénévoles'!S8","v":0}]
[null,null,null,{"$f":"'Planning Bénévoles'!R9","v":0},{"$f":"'Planning Bénévoles'!S9","v":0}]
[null,null,null,{"$f":"'Planning Bénévoles'!R10","v":0},{"$f":"'Planning Bénévoles'!S10","v":0}]
[null,null,"Placier Grande Tribune",{"$f":"'Planning Bénévoles'!R11","v":0},{"$f":"'Planning Bénévoles'!S11","v":0}]
[null,null,null,{"$f":"'Planning Bénévoles'!R12","v":0},{"$f":"'Planning Bénévoles'!S12","v":0}]
[null,null,null,{"$f":"'Planning Bénévoles'!R13","v":0},{"$f":"'Planning Bénévoles'!S13","v":"BOURGUIGNON Catherine"}]
[null,null,null,{"$f":"'Planning Bénévoles'!R14","v":0},{"$f":"'Planning Bénévoles'!S14","v":0}]
[null,null,"Filtrage Tribune Est",{"$f":"'Planning Bénévoles'!R15","v":0},{"$f":"'Planning Bénévoles'!S15","v":0}]
[null,null,null,{"$f":"'Planning Bénévoles'!R16","v":0},{"$f":"'Planning Bénévoles'!S16","v":0}]
[null,null,"Placier Tribune Est",{"$f":"'Planning Bénévoles'!R17","v":0},{"$f":"'Planning Bénévoles'!S17","v":0}]
[null,null,"Filtrage Tribune Ouest",{"$f":"'Planning Bénévoles'!R18","v":0},{"$f":"'Planning Bénévoles'!S18","v":0}]
[null,null,null,{"$f":"'Planning Bénévoles'!R19","v":0},{"$f":"'Planning Bénévoles'!S19","v":0}]
[null,null,"Placier Tribune Ouest",{"$f":"'Planning Bénévoles'!R20","v":0},{"$f":"'Planning Bénévoles'!S20","v":0}]
[null,null,"Filtrage Tribune Restaurant",{"$f":"'Planning Bénévoles'!R21","v":0},{"$f":"'Planning Bénévoles'!S21","v":0}]
[null,null,null,{"$f":"'Planning Bénévoles'!R22","v":0},{"$f":"'Planning Bénévoles'!S22","v":0}]
[null,null,"Placier Tribune Restaurant",{"$f":"'Planning Bénévoles'!R23","v":0},{"$f":"'Planning Bénévoles'!S23","v":0}]
["COURT N°1",{"$f":"COUNTIF(D24:D26,\">a\")","v":0},"Filtrage",{"$f":"'Planning Bénévoles'!R24","v":0},{"$f":"'Planning Bénévoles'!S24","v":0}]
[null,null,null,{"$f":"'Planning Bénévoles'!R25","v":0},{"$f":"'Planning Bénévoles'!S25","v":0}]
[null,null,null,{"$f":"'Planning Bénévoles'!R26","v":0},{"$f":"'Planning Bénévoles'!S26","v":0}]
["BAR GRAND PUBLIC",{"$f":"COUNTIF(D27:D29,\">a\")","v":0},null,{"$f":"'Planning Bénévoles'!R27","v":0},{"$f":"'Planning Bénévoles'!S27","v":0}]
[null,null,null,{"$f":"'Planning Bénévoles'!R28","v":0},{"$f":"'Planning Bénévoles'!S28","v":0}]
[null,null,null,{"$f":"'Planning Bénévoles'!R29","v":0},{"$f":"'Planning Bénévoles'!S29","v":0}]
["BAR A CHAMPAGNE",{"$f":"COUNTIF(D30:D31,\">a\")","v":0},"Filtrage",{"$f":"'Planning Bénévoles'!R30","v":0},{"$f":"'Planning Bénévoles'!S30","v":0}]
[null,null,null,{"$f":"'Planning Bénévoles'!R31","v":0},{"$f":"'Planning Bénévoles'!S31","v":0}]
[null,{"$f":"COUNTIF(D32:D35,\">a\")","v":0},"Service",{"$f":"'Planning Bénévoles'!R32","v":0},{"$f":"'Planning Bénévoles'!S32","v":0}]
[null,null,null,{"$f":"'Planning Bénévoles'!R33","v":0},{"$f":"'Planning Bénévoles'!S33","v":0}]
[null,null,null,{"$f":"'Planning Bénévoles'!R34","v":0},{"$f":"'Planning Bénévoles'!S34","v":0}]
[null,null,null,{"$f":"'Planning Bénévoles'!R35","v":0},{"$f":"'Planning Bénévoles'!S35","v":0}]
["BILLETERIE HALL",{"$f":"COUNTIF(D36:D37,\">a\")","v":0},null,{"$f":"'Planning Bénévoles'!R36","v":0},{"$f":"'Planning Bénévoles'!S36","v":0}]
[null,null,null,{"$f":"'Planning Bénévoles'!R37","v":0},{"$f":"'Planning Bénévoles'!S37","v":0}]
["REMPLACANTS",{"$f":"COUNTIF(D38:D40,\">a\")","v":0},null,{"$f":"'Planning Bénévoles'!R38","v":0},{"$f":"'Planning Bénévoles'!S38","v":0}]
[null,null,null,{"$f":"'Planning Bénévoles'!R39","v":0},{"$f":"'Planning Bénévoles'!S39","v":0}]
[null,null,null,{"$f":"'Planning Bénévoles'!R40","v":0},{"$f":"'Planning Bénévoles'!S40","v":0}]

{"sheet":"DIMANCHE 30","index":8,"n_rows":40,"n_cols":3,"rows_kept":40,"cut":false,"hidden":false,"merged":[[2,0,3,0],[37,0,39,0],[29,0,34,0],[31,1,34,1],[35,0,36,0],[35,1,36,1],[2,1,3,1],[4,1,5,1],[6,1,9,1],[10,1,13,1],[14,1,15,1],[37,1,39,1],[4,0,5,0],[6,0,22,0],[17,1,18,1],[20,1,21,1],[23,1,25,1],[26,1,28,1],[29,1,30,1],[23,0,25,0],[26,0,28,0]]}
[null,"POSTE","DIMANCHE"]
[null,null,"13H00-18H00"]
["CONTROLE SAC ENTREE",null,{"$f":"'Planning Bénévoles'!T3","v":0}]
[null,null,{"$f":"'Planning Bénévoles'!T4","v":0}]
[{"$f":"'Planning Bénévoles'!A5","v":"ACCUEIL VESTIAIRE "},null,{"$f":"'Planning Bénévoles'!T5","v":0}]
[null,null,{"$f":"'Planning Bénévoles'!T6","v":0}]
["COURT CENTRAL","Filtrage Entrée",{"$f":"'Planning Bénévoles'!T7","v":0}]
[null,null,{"$f":"'Planning Bénévoles'!T8","v":0}]
[null,null,{"$f":"'Planning Bénévoles'!T9","v":0}]
[null,null,{"$f":"'Planning Bénévoles'!T10","v":0}]
[null,"Placier Grande Tribune",{"$f":"'Planning Bénévoles'!T11","v":0}]
[null,null,{"$f":"'Planning Bénévoles'!T12","v":0}]
[null,null,{"$f":"'Planning Bénévoles'!T13","v":0}]
[null,null,{"$f":"'Planning Bénévoles'!T14","v":0}]
[null,"Filtrage Tribune Est",{"$f":"'Planning Bénévoles'!T15","v":0}]
[null,null,{"$f":"'Planning Bénévoles'!T16","v":0}]
[null,"Placier Tribune Est",{"$f":"'Planning Bénévoles'!T17","v":"BOTHOREL Hélène"}]
[null,"Filtrage Tribune Ouest",{"$f":"'Planning Bénévoles'!T18","v":0}]
[null,null,{"$f":"'Planning Bénévoles'!T19","v":0}]
[null,"Placier Tribune Ouest",{"$f":"'Planning Bénévoles'!T20","v":0}]
[null,"Filtrage Tribune Restaurant",{"$f":"'Planning Bénévoles'!T21","v":0}]
[null,null,{"$f":"'Planning Bénévoles'!T22","v":0}]
[null,"Placier Tribune Restaurant",{"$f":"'Planning Bénévoles'!T23","v":0}]
["COURT N°1","Filtrage",{"$f":"'Planning Bénévoles'!T24","v":0}]
[null,null,{"$f":"'Planning Bénévoles'!T25","v":0}]
[null,null,{"$f":"'Planning Bénévoles'!T26","v":0}]
["BAR GRAND PUBLIC",null,{"$f":"'Planning Bénévoles'!T27","v":0}]
[null,null,{"$f":"'Planning Bénévoles'!T28","v":0}]
[null,null,{"$f":"'Planning Bénévoles'!T29","v":0}]
["BAR A CHAMPAGNE","Filtrage",{"$f":"'Planning Bénévoles'!T30","v":0}]
[null,null,{"$f":"'Planning Bénévoles'!T31","v":0}]
[null,"Service",{"$f":"'Planning Bénévoles'!T32","v":0}]
[null,null,{"$f":"'Planning Bénévoles'!T33","v":0}]
[null,null,{"$f":"'Planning Bénévoles'!T34","v":0}]
[null,null,{"$f":"'Planning Bénévoles'!T35","v":0}]
["BILLETERIE HALL",null,{"$f":"'Planning Bénévoles'!T36","v":0}]
[null,null,{"$f":"'Planning Bénévoles'!T37","v":0}]
["REMPLACANTS"," ",{"$f":"'Planning Bénévoles'!T38","v":0}]
[null,null,{"$f":"'Planning Bénévoles'!T39","v":0}]
[null,null,{"$f":"'Planning Bénévoles'!T40","v":0}]

{"sheet":"Finale","index":9,"n_rows":91,"n_cols":2,"rows_kept":91,"cut":false,"hidden":false,"merged":[[0,0,1,0],[0,1,1,1]]}
["NOM","PRÉNOM"]
[null,"PRENOM"]
["AVE","Yvon"]
["BALMADIER (THG)","Henri"]
["BASTARD","Chloé"]
["BEAUGION (K)","Régis"]
["BÉNIER","Alizée"]
["BERTIN (THG)","Nicolas"]
["BEZIVIN","Daniel"]
["BIENNE (K)","Xavier"]
["BOTHOREL","Hélène"]
["BOURGEON (THG)","Jérémy"]
["BOURGUIGNON","Catherine"]
["CAHN","Didier"]
["CASTRIC","Pierre"]
["CLOAREC (K)","Didier"]
["COCHOU","Philippe"]
["CORNEC","Lucas"]
["CORRÉ","Jacques"]
["DANGÉ","Jean Pierre"]
["DANGÉ","Yann"]
["DANIEL","Alain"]
["DANIEL","Annie France"]
["DENES","Annick"]
["DESECHALLIERS","Carole"]
["DESJARDINS","Jean Luc"]
["DUPUY","Isabelle"]
["DUTERQUE","Frédérique"]
["FER (THG)","Mélissa"]
["FISSEUX","Rosalina"]
["FLOCH","Philippe"]
["FRESNEAU","Michel"]
["GALLAIS","Daniel"]
["GAONACH (THG)","Sarah"]
["GARCETTE","Jade"]
["GERNIGON","Laurence"]
["GUEGUEN (K)","Sébastien"]
["GUERROT (THG)","Gildas"]
["GUEZENNEC (K)","Bruno"]
["GUILLERMOU","Marie Évelyne"]
["GUTIERREZ","Valentina"]
["HADOUZI","Yasmine"]
["HELAC","Adélie"]
["JANOT (K)","Laetitia"]
["KERCHROM","Claude"]
["KERLEO","Anne Marie"]
["KERVELLA (K)","Virginie"]
["LANDOUARD","Frédéric"]
["LE BIHAN","Guy"]
["LE BOSSER","Jean René"]
["LE BOSSER","Liliane"]
["LE CORRE ","Fred"]
["LE CORRE ","Jérémy"]
["LE FLOCH","Bruno"]
["LE GALL","Yves"]
["LE MAO","Michel"]
["LE ROUX","Stéphanie"]
["LE ROY ","Julian"]
["LE ROY (THG)","Christelle"]
["LECHAT","Loïc"]
["LEMARIE","Henry"]
["MAILLARD","Frédéric"]
["MALANDAIN","Manuela"]
["MARCHE","Sophie"]
["MIGLIACCIO","Claire"]
["MINGUY","Sophie"]
["MOAL","Alain"]
["NHEK (K)","Alexandrine"]
["PARISSE (THG)","Amélie"]
["PLOUZENNEC","Nadine"]
["PLOUZENNEC","Roland"]
["RAFFO","Carine"]
["RAMA (THG)","Jurgen"]
["RIHANI","Mohamed"]
["RIVOAL","Christian"]
["RIVOAL","Gilles"]
["ROBERT","Mireille"]
["ROCHCONGAR","Christelle"]
["ROUAT","Manon"]
["ROUGER","Olga"]
["SANS","Loïs"]
["SIRET","Christophe"]
["STRUILLOU (K)","Charlotte"]
["TALLEC-GORAGUER","Clara"]
["TANGUY","Bob"]
["TARHAN","Yeliz"]
["THEME","Sophie"]
["TROBOE","Marcel"]
["VINCOT","Yvon"]
["WOJCIK","Eulalie"]
["YANG","Johanne"]

{"sheet":"Tenues","index":10,"n_rows":9,"n_cols":15,"rows_kept":9,"cut":false,"hidden":false,"merged":[[0,1,0,2],[0,5,0,6],[0,9,0,10],[0,13,0,14]]}
[null,"BÉNÉVOLES",null,null,null,"CHAUFFEURS",null,null,null,"ETUDIANTS",null,null,null,"TOTAL"]
[null,"HOMMES","FEMMES",null,null,"HOMMES","FEMMES",null,null,"HOMMES","FEMMES",null,null,"HOMMES","FEMMES"]
["XS",{"$f":"COUNTIFS(DISPONIBILITE!$D$4:$D$75,\"H\",DISPONIBILITE!$X$4:$X$75,Tenues!$A3,DISPONIBILITE!$Y$4:$Y$75,\">=4\")","v":0},{"$f":"COUNTIFS(DISPONIBILITE!$D$4:$D$75,\"F\",DISPONIBILITE!$X$4:$X$75,Tenues!$A3,DISPONIBILITE!$Y$4:$Y$75,\">=4\")","v":2},null,"XS",{"$f":"COUNTIFS(CHAUFFEURS!$C$3:$C$17,\"H\",CHAUFFEURS!$Z$3:$Z$17,$E3)","v":0},{"$f":"COUNTIFS(CHAUFFEURS!$C$3:$C$17,\"F\",CHAUFFEURS!$Z$3:$Z$17,$E3)","v":0},null,"XS",{"$f":"COUNTIFS(DISPONIBILITE!$D$4:$D$75,\"H\",DISPONIBILITE!$X$4:$X$75,Tenues!$I3,DISPONIBILITE!$C$4:$C$75,\"Etudiant\")","v":0},{"$f":"COUNTIFS(DISPONIBILITE!$D$4:$D$75,\"F\",DISPONIBILITE!$X$4:$X$75,Tenues!$I3,DISPONIBILITE!$C$4:$C$75,\"Etudiant\")","v":0},null,"XS",{"$f":"B3+F3+J3","v":0},2]
["S",{"$f":"COUNTIFS(DISPONIBILITE!$D$4:$D$75,\"H\",DISPONIBILITE!$X$4:$X$75,Tenues!$A4,DISPONIBILITE!$Y$4:$Y$75,\">=4\")","v":0},{"$f":"COUNTIFS(DISPONIBILITE!$D$4:$D$75,\"F\",DISPONIBILITE!$X$4:$X$75,Tenues!$A4,DISPONIBILITE!$Y$4:$Y$75,\">=4\")","v":5},null,"S",{"$f":"COUNTIFS(CHAUFFEURS!$C$3:$C$17,\"H\",CHAUFFEURS!$Z$3:$Z$17,$E4)","v":0},{"$f":"COUNTIFS(CHAUFFEURS!$C$3:$C$17,\"F\",CHAUFFEURS!$Z$3:$Z$17,$E4)","v":0},null,"S",{"$f":"COUNTIFS(DISPONIBILITE!$D$4:$D$75,\"H\",DISPONIBILITE!$X$4:$X$75,Tenues!$I4,DISPONIBILITE!$C$4:$C$75,\"Etudiant\")","v":1},{"$f":"COUNTIFS(DISPONIBILITE!$D$4:$D$75,\"F\",DISPONIBILITE!$X$4:$X$75,Tenues!$I4,DISPONIBILITE!$C$4:$C$75,\"Etudiant\")","v":2},null,"S",1,7]
["M",{"$f":"COUNTIFS(DISPONIBILITE!$D$4:$D$75,\"H\",DISPONIBILITE!$X$4:$X$75,Tenues!$A5,DISPONIBILITE!$Y$4:$Y$75,\">=4\")","v":11},{"$f":"COUNTIFS(DISPONIBILITE!$D$4:$D$75,\"F\",DISPONIBILITE!$X$4:$X$75,Tenues!$A5,DISPONIBILITE!$Y$4:$Y$75,\">=4\")","v":14},null,"M",{"$f":"COUNTIFS(CHAUFFEURS!$C$3:$C$17,\"H\",CHAUFFEURS!$Z$3:$Z$17,$E5)","v":2},{"$f":"COUNTIFS(CHAUFFEURS!$C$3:$C$17,\"F\",CHAUFFEURS!$Z$3:$Z$17,$E5)","v":0},null,"M",{"$f":"COUNTIFS(DISPONIBILITE!$D$4:$D$75,\"H\",DISPONIBILITE!$X$4:$X$75,Tenues!$I5,DISPONIBILITE!$C$4:$C$75,\"Etudiant\")","v":1},{"$f":"COUNTIFS(DISPONIBILITE!$D$4:$D$75,\"F\",DISPONIBILITE!$X$4:$X$75,Tenues!$I5,DISPONIBILITE!$C$4:$C$75,\"Etudiant\")","v":3},null,"M",14,17]
["L",{"$f":"COUNTIFS(DISPONIBILITE!$D$4:$D$75,\"H\",DISPONIBILITE!$X$4:$X$75,Tenues!$A6,DISPONIBILITE!$Y$4:$Y$75,\">=4\")","v":8},{"$f":"COUNTIFS(DISPONIBILITE!$D$4:$D$75,\"F\",DISPONIBILITE!$X$4:$X$75,Tenues!$A6,DISPONIBILITE!$Y$4:$Y$75,\">=4\")","v":4},null,"L",{"$f":"COUNTIFS(CHAUFFEURS!$C$3:$C$17,\"H\",CHAUFFEURS!$Z$3:$Z$17,$E6)","v":1},{"$f":"COUNTIFS(CHAUFFEURS!$C$3:$C$17,\"F\",CHAUFFEURS!$Z$3:$Z$17,$E6)","v":0},null,"L",{"$f":"COUNTIFS(DISPONIBILITE!$D$4:$D$75,\"H\",DISPONIBILITE!$X$4:$X$75,Tenues!$I6,DISPONIBILITE!$C$4:$C$75,\"Etudiant\")","v":0},{"$f":"COUNTIFS(DISPONIBILITE!$D$4:$D$75,\"F\",DISPONIBILITE!$X$4:$X$75,Tenues!$I6,DISPONIBILITE!$C$4:$C$75,\"Etudiant\")","v":0},null,"L",9,4]
["XL",{"$f":"COUNTIFS(DISPONIBILITE!$D$4:$D$75,\"H\",DISPONIBILITE!$X$4:$X$75,Tenues!$A7,DISPONIBILITE!$Y$4:$Y$75,\">=4\")","v":5},{"$f":"COUNTIFS(DISPONIBILITE!$D$4:$D$75,\"F\",DISPONIBILITE!$X$4:$X$75,Tenues!$A7,DISPONIBILITE!$Y$4:$Y$75,\">=4\")","v":4},null,"XL",{"$f":"COUNTIFS(CHAUFFEURS!$C$3:$C$17,\"H\",CHAUFFEURS!$Z$3:$Z$17,$E7)","v":4},{"$f":"COUNTIFS(CHAUFFEURS!$C$3:$C$17,\"F\",CHAUFFEURS!$Z$3:$Z$17,$E7)","v":1},null,"XL",{"$f":"COUNTIFS(DISPONIBILITE!$D$4:$D$75,\"H\",DISPONIBILITE!$X$4:$X$75,Tenues!$I7,DISPONIBILITE!$C$4:$C$75,\"Etudiant\")","v":0},{"$f":"COUNTIFS(DISPONIBILITE!$D$4:$D$75,\"F\",DISPONIBILITE!$X$4:$X$75,Tenues!$I7,DISPONIBILITE!$C$4:$C$75,\"Etudiant\")","v":2},null,"XL",9,7]
["XXL",{"$f":"COUNTIFS(DISPONIBILITE!$D$4:$D$75,\"H\",DISPONIBILITE!$X$4:$X$75,Tenues!$A8,DISPONIBILITE!$Y$4:$Y$75,\">=4\")","v":4},{"$f":"COUNTIFS(DISPONIBILITE!$D$4:$D$75,\"F\",DISPONIBILITE!$X$4:$X$75,Tenues!$A8,DISPONIBILITE!$Y$4:$Y$75,\">=4\")","v":1},null,"XXL",{"$f":"COUNTIFS(CHAUFFEURS!$C$3:$C$17,\"H\",CHAUFFEURS!$Z$3:$Z$17,$E8)","v":7},{"$f":"COUNTIFS(CHAUFFEURS!$C$3:$C$17,\"F\",CHAUFFEURS!$Z$3:$Z$17,$E8)","v":0},null,"XXL",{"$f":"COUNTIFS(DISPONIBILITE!$D$4:$D$75,\"H\",DISPONIBILITE!$X$4:$X$75,Tenues!$I8,DISPONIBILITE!$C$4:$C$75,\"Etudiant\")","v":0},{"$f":"COUNTIFS(DISPONIBILITE!$D$4:$D$75,\"F\",DISPONIBILITE!$X$4:$X$75,Tenues!$I8,DISPONIBILITE!$C$4:$C$75,\"Etudiant\")","v":0},null,"XXL",11,1]
[null,{"$f":"SUM(B3:B8)","v":28},{"$f":"SUM(C3:C8)","v":30},null,0,14,1,null,0,2,7,null,{"$f":"SUM(N9:O9)","v":82},{"$f":"SUM(N3:N8)","v":44},{"$f":"SUM(O3:O8)","v":38}]

{"sheet":"Présence","index":11,"n_rows":179,"n_cols":18,"rows_kept":179,"cut":false,"hidden":false,"merged":[[0,9,0,11],[0,12,0,14],[0,15,0,16],[0,0,0,2],[0,3,0,5],[0,6,0,8]]}
[{"$f":"'Planning Bénévoles'!C1","v":"LUNDI 20"},null,null,{"$f":"'Planning Bénévoles'!F1","v":"MARDI 21"},null,null,{"$f":"'Planning Bénévoles'!I1","v":"MERCREDI 22"},null,null,{"$f":"'Planning Bénévoles'!L1","v":"JEUDI 23"},null,null,{"$f":"'Planning Bénévoles'!O1","v":"VENDREDI 24"},null,null,{"$f":"'Planning Bénévoles'!R1","v":"SAMEDI 25"},null,{"$f":"'Planning Bénévoles'!T1","v":"DIMANCHE 26"}]
["09:00 - 14:00","14:00 - 18:00","> 18:00","09:00 - 14:00","14:00 - 18:00","> 18:00","09:00 - 14:00","14:00 - 18:00","> 18:00","09:00 - 14:00","14:00 - 18:00","> 18:00","09:00 - 14:00","14:00 - 18:00","> 18:00","09:00 - 14:00","14:00 - 18:00","13:00 - 18:00"]
[{"$f":"IF(DISPONIBILITE!F4=\"oui\",DISPONIBILITE!$E4,\"\")","v":""},{"$f":"IF(DISPONIBILITE!G4=\"oui\",DISPONIBILITE!$E4,\"\")","v":""},{"$f":"IF(DISPONIBILITE!H4=\"oui\",DISPONIBILITE!$E4,\"\")","v":""},{"$f":"IF(DISPONIBILITE!I4=\"oui\",DISPONIBILITE!$E4,\"\")","v":""},{"$f":"IF(DISPONIBILITE!J4=\"oui\",DISPONIBILITE!$E4,\"\")","v":""},{"$f":"IF(DISPONIBILITE!K4=\"oui\",DISPONIBILITE!$E4,\"\")","v":""},{"$f":"IF(DISPONIBILITE!L4=\"oui\",DISPONIBILITE!$E4,\"\")","v":""},{"$f":"IF(DISPONIBILITE!M4=\"oui\",DISPONIBILITE!$E4,\"\")","v":""},{"$f":"IF(DISPONIBILITE!N4=\"oui\",DISPONIBILITE!$E4,\"\")","v":""},{"$f":"IF(DISPONIBILITE!O4=\"oui\",DISPONIBILITE!$E4,\"\")","v":""},{"$f":"IF(DISPONIBILITE!P4=\"oui\",DISPONIBILITE!$E4,\"\")","v":""},{"$f":"IF(DISPONIBILITE!Q4=\"oui\",DISPONIBILITE!$E4,\"\")","v":""},{"$f":"IF(DISPONIBILITE!R4=\"oui\",DISPONIBILITE!$E4,\"\")","v":"BALMADIER (THG) Henri"},{"$f":"IF(DISPONIBILITE!S4=\"oui\",DISPONIBILITE!$E4,\"\")","v":"BALMADIER (THG) Henri"},{"$f":"IF(DISPONIBILITE!T4=\"oui\",DISPONIBILITE!$E4,\"\")","v":""},{"$f":"IF(DISPONIBILITE!U4=\"oui\",DISPONIBILITE!$E4,\"\")","v":""},{"$f":"IF(DISPONIBILITE!V4=\"oui\",DISPONIBILITE!$E4,\"\")","v":""},{"$f":"IF(DISPONIBILITE!W4=\"oui\",DISPONIBILITE!$E4,\"\")","v":""}]
[{"$f":"IF(DISPONIBILITE!F5=\"oui\",DISPONIBILITE!$E5,\"\")","v":""},{"$f":"IF(DISPONIBILITE!G5=\"oui\",DISPONIBILITE!$E5,\"\")","v":""},{"$f":"IF(DISPONIBILITE!H5=\"oui\",DISPONIBILITE!$E5,\"\")","v":"BASTARD Chloé"},{"$f":"IF(DISPONIBILITE!I5=\"oui\",DISPONIBILITE!$E5,\"\")","v":""},{"$f":"IF(DISPONIBILITE!J5=\"oui\",DISPONIBILITE!$E5,\"\")","v":""},{"$f":"IF(DISPONIBILITE!K5=\"oui\",DISPONIBILITE!$E5,\"\")","v":"BASTARD Chloé"},{"$f":"IF(DISPONIBILITE!L5=\"oui\",DISPONIBILITE!$E5,\"\")","v":""},{"$f":"IF(DISPONIBILITE!M5=\"oui\",DISPONIBILITE!$E5,\"\")","v":""},{"$f":"IF(DISPONIBILITE!N5=\"oui\",DISPONIBILITE!$E5,\"\")","v":""},{"$f":"IF(DISPONIBILITE!O5=\"oui\",DISPONIBILITE!$E5,\"\")","v":""},{"$f":"IF(DISPONIBILITE!P5=\"oui\",DISPONIBILITE!$E5,\"\")","v":""},{"$f":"IF(DISPONIBILITE!Q5=\"oui\",DISPONIBILITE!$E5,\"\")","v":""},{"$f":"IF(DISPONIBILITE!R5=\"oui\",DISPONIBILITE!$E5,\"\")","v":""},{"$f":"IF(DISPONIBILITE!S5=\"oui\",DISPONIBILITE!$E5,\"\")","v":""},{"$f":"IF(DISPONIBILITE!T5=\"oui\",DISPONIBILITE!$E5,\"\")","v":""},{"$f":"IF(DISPONIBILITE!U5=\"oui\",DISPONIBILITE!$E5,\"\")","v":""},{"$f":"IF(DISPONIBILITE!V5=\"oui\",DISPONIBILITE!$E5,\"\")","v":""},{"$f":"IF(DISPONIBILITE!W5=\"oui\",DISPONIBILITE!$E5,\"\")","v":""}]
[{"$f":"IF(DISPONIBILITE!F6=\"oui\",DISPONIBILITE!$E6,\"\")","v":"BEAUGION (K) Régis"},{"$f":"IF(DISPONIBILITE!G6=\"oui\",DISPONIBILITE!$E6,\"\")","v":"BEAUGION (K) Régis"},{"$f":"IF(DISPONIBILITE!H6=\"oui\",DISPONIBILITE!$E6,\"\")","v":""},{"$f":"IF(DISPONIBILITE!I6=\"oui\",DISPONIBILITE!$E6,\"\")","v":"BEAUGION (K) Régis"},{"$f":"IF(DISPONIBILITE!J6=\"oui\",DISPONIBILITE!$E6,\"\")","v":"BEAUGION (K) Régis"},{"$f":"IF(DISPONIBILITE!K6=\"oui\",DISPONIBILITE!$E6,\"\")","v":""},{"$f":"IF(DISPONIBILITE!L6=\"oui\",DISPONIBILITE!$E6,\"\")","v":""},{"$f":"IF(DISPONIBILITE!M6=\"oui\",DISPONIBILITE!$E6,\"\")","v":""},{"$f":"IF(DISPONIBILITE!N6=\"oui\",DISPONIBILITE!$E6,\"\")","v":""},{"$f":"IF(DISPONIBILITE!O6=\"oui\",DISPONIBILITE!$E6,\"\")","v":"BEAUGION (K) Régis"},{"$f":"IF(DISPONIBILITE!P6=\"oui\",DISPONIBILITE!$E6,\"\")","v":"BEAUGION (K) Régis"},{"$f":"IF(DISPONIBILITE!Q6=\"oui\",DISPONIBILITE!$E6,\"\")","v":""},{"$f":"IF(DISPONIBILITE!R6=\"oui\",DISPONIBILITE!$E6,\"\")","v":"BEAUGION (K) Régis"},{"$f":"IF(DISPONIBILITE!S6=\"oui\",DISPONIBILITE!$E6,\"\")","v":"BEAUGION (K) Régis"},{"$f":"IF(DISPONIBILITE!T6=\"oui\",DISPONIBILITE!$E6,\"\")","v":""},{"$f":"IF(DISPONIBILITE!U6=\"oui\",DISPONIBILITE!$E6,\"\")","v":""},{"$f":"IF(DISPONIBILITE!V6=\"oui\",DISPONIBILITE!$E6,\"\")","v":""},{"$f":"IF(DISPONIBILITE!W6=\"oui\",DISPONIBILITE!$E6,\"\")","v":""}]
[{"$f":"IF(DISPONIBILITE!F7=\"oui\",DISPONIBILITE!$E7,\"\")","v":""},{"$f":"IF(DISPONIBILITE!G7=\"oui\",DISPONIBILITE!$E7,\"\")","v":""},{"$f":"IF(DISPONIBILITE!H7=\"oui\",DISPONIBILITE!$E7,\"\")","v":"BÉNIER Alizée"},{"$f":"IF(DISPONIBILITE!I7=\"oui\",DISPONIBILITE!$E7,\"\")","v":""},{"$f":"IF(DISPONIBILITE!J7=\"oui\",DISPONIBILITE!$E7,\"\")","v":""},{"$f":"IF(DISPONIBILITE!K7=\"oui\",DISPONIBILITE!$E7,\"\")","v":"BÉNIER Alizée"},{"$f":"IF(DISPONIBILITE!L7=\"oui\",DISPONIBILITE!$E7,\"\")","v":""},{"$f":"IF(DISPONIBILITE!M7=\"oui\",DISPONIBILITE!$E7,\"\")","v":""},{"$f":"IF(DISPONIBILITE!N7=\"oui\",DISPONIBILITE!$E7,\"\")","v":"BÉNIER Alizée"},{"$f":"IF(DISPONIBILITE!O7=\"oui\",DISPONIBILITE!$E7,\"\")","v":""},{"$f":"IF(DISPONIBILITE!P7=\"oui\",DISPONIBILITE!$E7,\"\")","v":""},{"$f":"IF(DISPONIBILITE!Q7=\"oui\",DISPONIBILITE!$E7,\"\")","v":"BÉNIER Alizée"},{"$f":"IF(DISPONIBILITE!R7=\"oui\",DISPONIBILITE!$E7,\"\")","v":""},{"$f":"IF(DISPONIBILITE!S7=\"oui\",DISPONIBILITE!$E7,\"\")","v":""},{"$f":"IF(DISPONIBILITE!T7=\"oui\",DISPONIBILITE!$E7,\"\")","v":"BÉNIER Alizée"},{"$f":"IF(DISPONIBILITE!U7=\"oui\",DISPONIBILITE!$E7,\"\")","v":""},{"$f":"IF(DISPONIBILITE!V7=\"oui\",DISPONIBILITE!$E7,\"\")","v":"BÉNIER Alizée"},{"$f":"IF(DISPONIBILITE!W7=\"oui\",DISPONIBILITE!$E7,\"\")","v":"BÉNIER Alizée"}]
[{"$f":"IF(DISPONIBILITE!F8=\"oui\",DISPONIBILITE!$E8,\"\")","v":""},{"$f":"IF(DISPONIBILITE!G8=\"oui\",DISPONIBILITE!$E8,\"\")","v":""},{"$f":"IF(DISPONIBILITE!H8=\"oui\",DISPONIBILITE!$E8,\"\")","v":""},{"$f":"IF(DISPONIBILITE!I8=\"oui\",DISPONIBILITE!$E8,\"\")","v":""},{"$f":"IF(DISPONIBILITE!J8=\"oui\",DISPONIBILITE!$E8,\"\")","v":""},{"$f":"IF(DISPONIBILITE!K8=\"oui\",DISPONIBILITE!$E8,\"\")","v":""},{"$f":"IF(DISPONIBILITE!L8=\"oui\",DISPONIBILITE!$E8,\"\")","v":""},{"$f":"IF(DISPONIBILITE!M8=\"oui\",DISPONIBILITE!$E8,\"\")","v":""},{"$f":"IF(DISPONIBILITE!N8=\"oui\",DISPONIBILITE!$E8,\"\")","v":""},{"$f":"IF(DISPONIBILITE!O8=\"oui\",DISPONIBILITE!$E8,\"\")","v":""},{"$f":"IF(DISPONIBILITE!P8=\"oui\",DISPONIBILITE!$E8,\"\")","v":""},{"$f":"IF(DISPONIBILITE!Q8=\"oui\",DISPONIBILITE!$E8,\"\")","v":""},{"$f":"IF(DISPONIBILITE!R8=\"oui\",DISPONIBILITE!$E8,\"\")","v":"BERTIN (THG) Nicolas"},{"$f":"IF(DISPONIBILITE!S8=\"oui\",DISPONIBILITE!$E8,\"\")","v":"BERTIN (THG) Nicolas"},{"$f":"IF(DISPONIBILITE!T8=\"oui\",DISPONIBILITE!$E8,\"\")","v":""},{"$f":"IF(DISPONIBILITE!U8=\"oui\",DISPONIBILITE!$E8,\"\")","v":""},{"$f":"IF(DISPONIBILITE!V8=\"oui\",DISPONIBILITE!$E8,\"\")","v":""},{"$f":"IF(DISPONIBILITE!W8=\"oui\",DISPONIBILITE!$E8,\"\")","v":""}]
[{"$f":"IF(DISPONIBILITE!F9=\"oui\",DISPONIBILITE!$E9,\"\")","v":"BEZIVIN Daniel"},{"$f":"IF(DISPONIBILITE!G9=\"oui\",DISPONIBILITE!$E9,\"\")","v":"BEZIVIN Daniel"},{"$f":"IF(DISPONIBILITE!H9=\"oui\",DISPONIBILITE!$E9,\"\")","v":""},{"$f":"IF(DISPONIBILITE!I9=\"oui\",DISPONIBILITE!$E9,\"\")","v":""},{"$f":"IF(DISPONIBILITE!J9=\"oui\",DISPONIBILITE!$E9,\"\")","v":""},{"$f":"IF(DISPONIBILITE!K9=\"oui\",DISPONIBILITE!$E9,\"\")","v":""},{"$f":"IF(DISPONIBILITE!L9=\"oui\",DISPONIBILITE!$E9,\"\")","v":"BEZIVIN Daniel"},{"$f":"IF(DISPONIBILITE!M9=\"oui\",DISPONIBILITE!$E9,\"\")","v":"BEZIVIN Daniel"},{"$f":"IF(DISPONIBILITE!N9=\"oui\",DISPONIBILITE!$E9,\"\")","v":""},{"$f":"IF(DISPONIBILITE!O9=\"oui\",DISPONIBILITE!$E9,\"\")","v":""},{"$f":"IF(DISPONIBILITE!P9=\"oui\",DISPONIBILITE!$E9,\"\")","v":""},{"$f":"IF(DISPONIBILITE!Q9=\"oui\",DISPONIBILITE!$E9,\"\")","v":""},{"$f":"IF(DISPONIBILITE!R9=\"oui\",DISPONIBILITE!$E9,\"\")","v":"BEZIVIN Daniel"},{"$f":"IF(DISPONIBILITE!S9=\"oui\",DISPONIBILITE!$E9,\"\")","v":"BEZIVIN Daniel"},{"$f":"IF(DISPONIBILITE!T9=\"oui\",DISPONIBILITE!$E9,\"\")","v":""},{"$f":"IF(DISPONIBILITE!U9=\"oui\",DISPONIBILITE!$E9,\"\")","v":"BEZIVIN Daniel"},{"$f":"IF(DISPONIBILITE!V9=\"oui\",DISPONIBILITE!$E9,\"\")","v":"BEZIVIN Daniel"},{"$f":"IF(DISPONIBILITE!W9=\"oui\",DISPONIBILITE!$E9,\"\")","v":""}]
[{"$f":"IF(DISPONIBILITE!F10=\"oui\",DISPONIBILITE!$E10,\"\")","v":""},{"$f":"IF(DISPONIBILITE!G10=\"oui\",DISPONIBILITE!$E10,\"\")","v":""},{"$f":"IF(DISPONIBILITE!H10=\"oui\",DISPONIBILITE!$E10,\"\")","v":""},{"$f":"IF(DISPONIBILITE!I10=\"oui\",DISPONIBILITE!$E10,\"\")","v":""},{"$f":"IF(DISPONIBILITE!J10=\"oui\",DISPONIBILITE!$E10,\"\")","v":""},{"$f":"IF(DISPONIBILITE!K10=\"oui\",DISPONIBILITE!$E10,\"\")","v":""},{"$f":"IF(DISPONIBILITE!L10=\"oui\",DISPONIBILITE!$E10,\"\")","v":""},{"$f":"IF(DISPONIBILITE!M10=\"oui\",DISPONIBILITE!$E10,\"\")","v":""},{"$f":"IF(DISPONIBILITE!N10=\"oui\",DISPONIBILITE!$E10,\"\")","v":""},{"$f":"IF(DISPONIBILITE!O10=\"oui\",DISPONIBILITE!$E10,\"\")","v":"BIENNE (K) Xavier"},{"$f":"IF(DISPONIBILITE!P10=\"oui\",DISPONIBILITE!$E10,\"\")","v":"BIENNE (K) Xavier"},{"$f":"IF(DISPONIBILITE!Q10=\"oui\",DISPONIBILITE!$E10,\"\")","v":""},{"$f":"IF(DISPONIBILITE!R10=\"oui\",DISPONIBILITE!$E10,\"\")","v":"BIENNE (K) Xavier"},{"$f":"IF(DISPONIBILITE!S10=\"oui\",DISPONIBILITE!$E10,\"\")","v":"BIENNE (K) Xavier"},{"$f":"IF(DISPONIBILITE!T10=\"oui\",DISPONIBILITE!$E10,\"\")","v":""},{"$f":"IF(DISPONIBILITE!U10=\"oui\",DISPONIBILITE!$E10,\"\")","v":""},{"$f":"IF(DISPONIBILITE!V10=\"oui\",DISPONIBILITE!$E10,\"\")","v":""},{"$f":"IF(DISPONIBILITE!W10=\"oui\",DISPONIBILITE!$E10,\"\")","v":""}]
[{"$f":"IF(DISPONIBILITE!F11=\"oui\",DISPONIBILITE!$E11,\"\")","v":""},{"$f":"IF(DISPONIBILITE!G11=\"oui\",DISPONIBILITE!$E11,\"\")","v":"BOTHOREL Hélène"},{"$f":"IF(DISPONIBILITE!H11=\"oui\",DISPONIBILITE!$E11,\"\")","v":"BOTHOREL Hélène"},{"$f":"IF(DISPONIBILITE!I11=\"oui\",DISPONIBILITE!$E11,\"\")","v":"BOTHOREL Hélène"},{"$f":"IF(DISPONIBILITE!J11=\"oui\",DISPONIBILITE!$E11,\"\")","v":"BOTHOREL Hélène"},{"$f":"IF(DISPONIBILITE!K11=\"oui\",DISPONIBILITE!$E11,\"\")","v":""},{"$f":"IF(DISPONIBILITE!L11=\"oui\",DISPONIBILITE!$E11,\"\")","v":"BOTHOREL Hélène"},{"$f":"IF(DISPONIBILITE!M11=\"oui\",DISPONIBILITE!$E11,\"\")","v":"BOTHOREL Hélène"},{"$f":"IF(DISPONIBILITE!N11=\"oui\",DISPONIBILITE!$E11,\"\")","v":""},{"$f":"IF(DISPONIBILITE!O11=\"oui\",DISPONIBILITE!$E11,\"\")","v":"BOTHOREL Hélène"},{"$f":"IF(DISPONIBILITE!P11=\"oui\",DISPONIBILITE!$E11,\"\")","v":""},{"$f":"IF(DISPONIBILITE!Q11=\"oui\",DISPONIBILITE!$E11,\"\")","v":"BOTHOREL Hélène"},{"$f":"IF(DISPONIBILITE!R11=\"oui\",DISPONIBILITE!$E11,\"\")","v":"BOTHOREL Hélène"},{"$f":"IF(DISPONIBILITE!S11=\"oui\",DISPONIBILITE!$E11,\"\")","v":"BOTHOREL Hélène"},{"$f":"IF(DISPONIBILITE!T11=\"oui\",DISPONIBILITE!$E11,\"\")","v":"BOTHOREL Hélène"},{"$f":"IF(DISPONIBILITE!U11=\"oui\",DISPONIBILITE!$E11,\"\")","v":""},{"$f":"IF(DISPONIBILITE!V11=\"oui\",DISPONIBILITE!$E11,\"\")","v":"BOTHOREL Hélène"},{"$f":"IF(DISPONIBILITE!W11=\"oui\",DISPONIBILITE!$E11,\"\")","v":"BOTHOREL Hélène"}]
[{"$f":"IF(DISPONIBILITE!F12=\"oui\",DISPONIBILITE!$E12,\"\")","v":""},{"$f":"IF(DISPONIBILITE!G12=\"oui\",DISPONIBILITE!$E12,\"\")","v":""},{"$f":"IF(DISPONIBILITE!H12=\"oui\",DISPONIBILITE!$E12,\"\")","v":""},{"$f":"IF(DISPONIBILITE!I12=\"oui\",DISPONIBILITE!$E12,\"\")","v":""},{"$f":"IF(DISPONIBILITE!J12=\"oui\",DISPONIBILITE!$E12,\"\")","v":""},{"$f":"IF(DISPONIBILITE!K12=\"oui\",DISPONIBILITE!$E12,\"\")","v":""},{"$f":"IF(DISPONIBILITE!L12=\"oui\",DISPONIBILITE!$E12,\"\")","v":"BOURGEON (THG) Jérémy"},{"$f":"IF(DISPONIBILITE!M12=\"oui\",DISPONIBILITE!$E12,\"\")","v":"BOURGEON (THG) Jérémy"},{"$f":"IF(DISPONIBILITE!N12=\"oui\",DISPONIBILITE!$E12,\"\")","v":""},{"$f":"IF(DISPONIBILITE!O12=\"oui\",DISPONIBILITE!$E12,\"\")","v":"BOURGEON (THG) Jérémy"},{"$f":"IF(DISPONIBILITE!P12=\"oui\",DISPONIBILITE!$E12,\"\")","v":"BOURGEON (THG) Jérémy"},{"$f":"IF(DISPONIBILITE!Q12=\"oui\",DISPONIBILITE!$E12,\"\")","v":""},{"$f":"IF(DISPONIBILITE!R12=\"oui\",DISPONIBILITE!$E12,\"\")","v":""},{"$f":"IF(DISPONIBILITE!S12=\"oui\",DISPONIBILITE!$E12,\"\")","v":""},{"$f":"IF(DISPONIBILITE!T12=\"oui\",DISPONIBILITE!$E12,\"\")","v":""},{"$f":"IF(DISPONIBILITE!U12=\"oui\",DISPONIBILITE!$E12,\"\")","v":""},{"$f":"IF(DISPONIBILITE!V12=\"oui\",DISPONIBILITE!$E12,\"\")","v":""},{"$f":"IF(DISPONIBILITE!W12=\"oui\",DISPONIBILITE!$E12,\"\")","v":""}]
[{"$f":"IF(DISPONIBILITE!F13=\"oui\",DISPONIBILITE!$E13,\"\")","v":""},{"$f":"IF(DISPONIBILITE!G13=\"oui\",DISPONIBILITE!$E13,\"\")","v":"BOURGUIGNON Catherine"},{"$f":"IF(DISPONIBILITE!H13=\"oui\",DISPONIBILITE!$E13,\"\")","v":"BOURGUIGNON Catherine"},{"$f":"IF(DISPONIBILITE!I13=\"oui\",DISPONIBILITE!$E13,\"\")","v":""},{"$f":"IF(DISPONIBILITE!J13=\"oui\",DISPONIBILITE!$E13,\"\")","v":"BOURGUIGNON Catherine"},{"$f":"IF(DISPONIBILITE!K13=\"oui\",DISPONIBILITE!$E13,\"\")","v":"BOURGUIGNON Catherine"},{"$f":"IF(DISPONIBILITE!L13=\"oui\",DISPONIBILITE!$E13,\"\")","v":""},{"$f":"IF(DISPONIBILITE!M13=\"oui\",DISPONIBILITE!$E13,\"\")","v":"BOURGUIGNON Catherine"},{"$f":"IF(DISPONIBILITE!N13=\"oui\",DISPONIBILITE!$E13,\"\")","v":"BOURGUIGNON Catherine"},{"$f":"IF(DISPONIBILITE!O13=\"oui\",DISPONIBILITE!$E13,\"\")","v":""},{"$f":"IF(DISPONIBILITE!P13=\"oui\",DISPONIBILITE!$E13,\"\")","v":"BOURGUIGNON Catherine"},{"$f":"IF(DISPONIBILITE!Q13=\"oui\",DISPONIBILITE!$E13,\"\")","v":"BOURGUIGNON Catherine"},{"$f":"IF(DISPONIBILITE!R13=\"oui\",DISPONIBILITE!$E13,\"\")","v":""},{"$f":"IF(DISPONIBILITE!S13=\"oui\",DISPONIBILITE!$E13,\"\")","v":"BOURGUIGNON Catherine"},{"$f":"IF(DISPONIBILITE!T13=\"oui\",DISPONIBILITE!$E13,\"\")","v":""},{"$f":"IF(DISPONIBILITE!U13=\"oui\",DISPONIBILITE!$E13,\"\")","v":""},{"$f":"IF(DISPONIBILITE!V13=\"oui\",DISPONIBILITE!$E13,\"\")","v":"BOURGUIGNON Catherine"},{"$f":"IF(DISPONIBILITE!W13=\"oui\",DISPONIBILITE!$E13,\"\")","v":"BOURGUIGNON Catherine"}]
[{"$f":"IF(DISPONIBILITE!F14=\"oui\",DISPONIBILITE!$E14,\"\")","v":""},{"$f":"IF(DISPONIBILITE!G14=\"oui\",DISPONIBILITE!$E14,\"\")","v":"CAHN Didier"},{"$f":"IF(DISPONIBILITE!H14=\"oui\",DISPONIBILITE!$E14,\"\")","v":"CAHN Didier"},{"$f":"IF(DISPONIBILITE!I14=\"oui\",DISPONIBILITE!$E14,\"\")","v":""},{"$f":"IF(DISPONIBILITE!J14=\"oui\",DISPONIBILITE!$E14,\"\")","v":"CAHN Didier"},{"$f":"IF(DISPONIBILITE!K14=\"oui\",DISPONIBILITE!$E14,\"\")","v":"CAHN Didier"},{"$f":"IF(DISPONIBILITE!L14=\"oui\",DISPONIBILITE!$E14,\"\")","v":""},{"$f":"IF(DISPONIBILITE!M14=\"oui\",DISPONIBILITE!$E14,\"\")","v":"CAHN Didier"},{"$f":"IF(DISPONIBILITE!N14=\"oui\",DISPONIBILITE!$E14,\"\")","v":"CAHN Didier"},{"$f":"IF(DISPONIBILITE!O14=\"oui\",DISPONIBILITE!$E14,\"\")","v":""},{"$f":"IF(DISPONIBILITE!P14=\"oui\",DISPONIBILITE!$E14,\"\")","v":"CAHN Didier"},{"$f":"IF(DISPONIBILITE!Q14=\"oui\",DISPONIBILITE!$E14,\"\")","v":"CAHN Didier"},{"$f":"IF(DISPONIBILITE!R14=\"oui\",DISPONIBILITE!$E14,\"\")","v":""},{"$f":"IF(DISPONIBILITE!S14=\"oui\",DISPONIBILITE!$E14,\"\")","v":"CAHN Didier"},{"$f":"IF(DISPONIBILITE!T14=\"oui\",DISPONIBILITE!$E14,\"\")","v":""},{"$f":"IF(DISPONIBILITE!U14=\"oui\",DISPONIBILITE!$E14,\"\")","v":""},{"$f":"IF(DISPONIBILITE!V14=\"oui\",DISPONIBILITE!$E14,\"\")","v":"CAHN Didier"},{"$f":"IF(DISPONIBILITE!W14=\"oui\",DISPONIBILITE!$E14,\"\")","v":"CAHN Didier"}]
[{"$f":"IF(DISPONIBILITE!F15=\"oui\",DISPONIBILITE!$E15,\"\")","v":""},{"$f":"IF(DISPONIBILITE!G15=\"oui\",DISPONIBILITE!$E15,\"\")","v":""},{"$f":"IF(DISPONIBILITE!H15=\"oui\",DISPONIBILITE!$E15,\"\")","v":""},{"$f":"IF(DISPONIBILITE!I15=\"oui\",DISPONIBILITE!$E15,\"\")","v":""},{"$f":"IF(DISPONIBILITE!J15=\"oui\",DISPONIBILITE!$E15,\"\")","v":""},{"$f":"IF(DISPONIBILITE!K15=\"oui\",DISPONIBILITE!$E15,\"\")","v":""},{"$f":"IF(DISPONIBILITE!L15=\"oui\",DISPONIBILITE!$E15,\"\")","v":""},{"$f":"IF(DISPONIBILITE!M15=\"oui\",DISPONIBILITE!$E15,\"\")","v":""},{"$f":"IF(DISPONIBILITE!N15=\"oui\",DISPONIBILITE!$E15,\"\")","v":""},{"$f":"IF(DISPONIBILITE!O15=\"oui\",DISPONIBILITE!$E15,\"\")","v":"CLOAREC (K) Didier"},{"$f":"IF(DISPONIBILITE!P15=\"oui\",DISPONIBILITE!$E15,\"\")","v":"CLOAREC (K) Didier"},{"$f":"IF(DISPONIBILITE!Q15=\"oui\",DISPONIBILITE!$E15,\"\")","v":""},{"$f":"IF(DISPONIBILITE!R15=\"oui\",DISPONIBILITE!$E15,\"\")","v":"CLOAREC (K) Didier"},{"$f":"IF(DISPONIBILITE!S15=\"oui\",DISPONIBILITE!$E15,\"\")","v":"CLOAREC (K) Didier"},{"$f":"IF(DISPONIBILITE!T15=\"oui\",DISPONIBILITE!$E15,\"\")","v":""},{"$f":"IF(DISPONIBILITE!U15=\"oui\",DISPONIBILITE!$E15,\"\")","v":""},{"$f":"IF(DISPONIBILITE!V15=\"oui\",DISPONIBILITE!$E15,\"\")","v":""},{"$f":"IF(DISPONIBILITE!W15=\"oui\",DISPONIBILITE!$E15,\"\")","v":""}]
[{"$f":"IF(DISPONIBILITE!F16=\"oui\",DISPONIBILITE!$E16,\"\")","v":""},{"$f":"IF(DISPONIBILITE!G16=\"oui\",DISPONIBILITE!$E16,\"\")","v":"COCHOU Philippe"},{"$f":"IF(DISPONIBILITE!H16=\"oui\",DISPONIBILITE!$E16,\"\")","v":""},{"$f":"IF(DISPONIBILITE!I16=\"oui\",DISPONIBILITE!$E16,\"\")","v":""},{"$f":"IF(DISPONIBILITE!J16=\"oui\",DISPONIBILITE!$E16,\"\")","v":""},{"$f":"IF(DISPONIBILITE!K16=\"oui\",DISPONIBILITE!$E16,\"\")","v":""},{"$f":"IF(DISPONIBILITE!L16=\"oui\",DISPONIBILITE!$E16,\"\")","v":""},{"$f":"IF(DISPONIBILITE!M16=\"oui\",DISPONIBILITE!$E16,\"\")","v":"COCHOU Philippe"},{"$f":"IF(DISPONIBILITE!N16=\"oui\",DISPONIBILITE!$E16,\"\")","v":""},{"$f":"IF(DISPONIBILITE!O16=\"oui\",DISPONIBILITE!$E16,\"\")","v":""},{"$f":"IF(DISPONIBILITE!P16=\"oui\",DISPONIBILITE!$E16,\"\")","v":"COCHOU Philippe"},{"$f":"IF(DISPONIBILITE!Q16=\"oui\",DISPONIBILITE!$E16,\"\")","v":""},{"$f":"IF(DISPONIBILITE!R16=\"oui\",DISPONIBILITE!$E16,\"\")","v":""},{"$f":"IF(DISPONIBILITE!S16=\"oui\",DISPONIBILITE!$E16,\"\")","v":"COCHOU Philippe"},{"$f":"IF(DISPONIBILITE!T16=\"oui\",DISPONIBILITE!$E16,\"\")","v":""},{"$f":"IF(DISPONIBILITE!U16=\"oui\",DISPONIBILITE!$E16,\"\")","v":""},{"$f":"IF(DISPONIBILITE!V16=\"oui\",DISPONIBILITE!$E16,\"\")","v":"COCHOU Philippe"},{"$f":"IF(DISPONIBILITE!W16=\"oui\",DISPONIBILITE!$E16,\"\")","v":""}]
[{"$f":"IF(DISPONIBILITE!F17=\"oui\",DISPONIBILITE!$E17,\"\")","v":""},{"$f":"IF(DISPONIBILITE!G17=\"oui\",DISPONIBILITE!$E17,\"\")","v":""},{"$f":"IF(DISPONIBILITE!H17=\"oui\",DISPONIBILITE!$E17,\"\")","v":"CORNEC Lucas"},{"$f":"IF(DISPONIBILITE!I17=\"oui\",DISPONIBILITE!$E17,\"\")","v":""},{"$f":"IF(DISPONIBILITE!J17=\"oui\",DISPONIBILITE!$E17,\"\")","v":""},{"$f":"IF(DISPONIBILITE!K17=\"oui\",DISPONIBILITE!$E17,\"\")","v":"CORNEC Lucas"},{"$f":"IF(DISPONIBILITE!L17=\"oui\",DISPONIBILITE!$E17,\"\")","v":""},{"$f":"IF(DISPONIBILITE!M17=\"oui\",DISPONIBILITE!$E17,\"\")","v":""},{"$f":"IF(DISPONIBILITE!N17=\"oui\",DISPONIBILITE!$E17,\"\")","v":"CORNEC Lucas"},{"$f":"IF(DISPONIBILITE!O17=\"oui\",DISPONIBILITE!$E17,\"\")","v":""},{"$f":"IF(DISPONIBILITE!P17=\"oui\",DISPONIBILITE!$E17,\"\")","v":""},{"$f":"IF(DISPONIBILITE!Q17=\"oui\",DISPONIBILITE!$E17,\"\")","v":"CORNEC Lucas"},{"$f":"IF(DISPONIBILITE!R17=\"oui\",DISPONIBILITE!$E17,\"\")","v":""},{"$f":"IF(DISPONIBILITE!S17=\"oui\",DISPONIBILITE!$E17,\"\")","v":""},{"$f":"IF(DISPONIBILITE!T17=\"oui\",DISPONIBILITE!$E17,\"\")","v":"CORNEC Lucas"},{"$f":"IF(DISPONIBILITE!U17=\"oui\",DISPONIBILITE!$E17,\"\")","v":""},{"$f":"IF(DISPONIBILITE!V17=\"oui\",DISPONIBILITE!$E17,\"\")","v":""},{"$f":"IF(DISPONIBILITE!W17=\"oui\",DISPONIBILITE!$E17,\"\")","v":""}]
[{"$f":"IF(DISPONIBILITE!F18=\"oui\",DISPONIBILITE!$E18,\"\")","v":""},{"$f":"IF(DISPONIBILITE!G18=\"oui\",DISPONIBILITE!$E18,\"\")","v":""},{"$f":"IF(DISPONIBILITE!H18=\"oui\",DISPONIBILITE!$E18,\"\")","v":"DANGÉ Yann"},{"$f":"IF(DISPONIBILITE!I18=\"oui\",DISPONIBILITE!$E18,\"\")","v":""},{"$f":"IF(DISPONIBILITE!J18=\"oui\",DISPONIBILITE!$E18,\"\")","v":""},{"$f":"IF(DISPONIBILITE!K18=\"oui\",DISPONIBILITE!$E18,\"\")","v":"DANGÉ Yann"},{"$f":"IF(DISPONIBILITE!L18=\"oui\",DISPONIBILITE!$E18,\"\")","v":""},{"$f":"IF(DISPONIBILITE!M18=\"oui\",DISPONIBILITE!$E18,\"\")","v":""},{"$f":"IF(DISPONIBILITE!N18=\"oui\",DISPONIBILITE!$E18,\"\")","v":""},{"$f":"IF(DISPONIBILITE!O18=\"oui\",DISPONIBILITE!$E18,\"\")","v":""},{"$f":"IF(DISPONIBILITE!P18=\"oui\",DISPONIBILITE!$E18,\"\")","v":""},{"$f":"IF(DISPONIBILITE!Q18=\"oui\",DISPONIBILITE!$E18,\"\")","v":"DANGÉ Yann"},{"$f":"IF(DISPONIBILITE!R18=\"oui\",DISPONIBILITE!$E18,\"\")","v":""},{"$f":"IF(DISPONIBILITE!S18=\"oui\",DISPONIBILITE!$E18,\"\")","v":""},{"$f":"IF(DISPONIBILITE!T18=\"oui\",DISPONIBILITE!$E18,\"\")","v":"DANGÉ Yann"},{"$f":"IF(DISPONIBILITE!U18=\"oui\",DISPONIBILITE!$E18,\"\")","v":"DANGÉ Yann"},{"$f":"IF(DISPONIBILITE!V18=\"oui\",DISPONIBILITE!$E18,\"\")","v":"DANGÉ Yann"},{"$f":"IF(DISPONIBILITE!W18=\"oui\",DISPONIBILITE!$E18,\"\")","v":"DANGÉ Yann"}]
[{"$f":"IF(DISPONIBILITE!F19=\"oui\",DISPONIBILITE!$E19,\"\")","v":"DANGÉ Jean Pierre"},{"$f":"IF(DISPONIBILITE!G19=\"oui\",DISPONIBILITE!$E19,\"\")","v":""},{"$f":"IF(DISPONIBILITE!H19=\"oui\",DISPONIBILITE!$E19,\"\")","v":""},{"$f":"IF(DISPONIBILITE!I19=\"oui\",DISPONIBILITE!$E19,\"\")","v":"DANGÉ Jean Pierre"},{"$f":"IF(DISPONIBILITE!J19=\"oui\",DISPONIBILITE!$E19,\"\")","v":""},{"$f":"IF(DISPONIBILITE!K19=\"oui\",DISPONIBILITE!$E19,\"\")","v":""},{"$f":"IF(DISPONIBILITE!L19=\"oui\",DISPONIBILITE!$E19,\"\")","v":"DANGÉ Jean Pierre"},{"$f":"IF(DISPONIBILITE!M19=\"oui\",DISPONIBILITE!$E19,\"\")","v":""},{"$f":"IF(DISPONIBILITE!N19=\"oui\",DISPONIBILITE!$E19,\"\")","v":""},{"$f":"IF(DISPONIBILITE!O19=\"oui\",DISPONIBILITE!$E19,\"\")","v":"DANGÉ Jean Pierre"},{"$f":"IF(DISPONIBILITE!P19=\"oui\",DISPONIBILITE!$E19,\"\")","v":""},{"$f":"IF(DISPONIBILITE!Q19=\"oui\",DISPONIBILITE!$E19,\"\")","v":""},{"$f":"IF(DISPONIBILITE!R19=\"oui\",DISPONIBILITE!$E19,\"\")","v":"DANGÉ Jean Pierre"},{"$f":"IF(DISPONIBILITE!S19=\"oui\",DISPONIBILITE!$E19,\"\")","v":""},{"$f":"IF(DISPONIBILITE!T19=\"oui\",DISPONIBILITE!$E19,\"\")","v":""},{"$f":"IF(DISPONIBILITE!U19=\"oui\",DISPONIBILITE!$E19,\"\")","v":"DANGÉ Jean Pierre"},{"$f":"IF(DISPONIBILITE!V19=\"oui\",DISPONIBILITE!$E19,\"\")","v":""},{"$f":"IF(DISPONIBILITE!W19=\"oui\",DISPONIBILITE!$E19,\"\")","v":""}]
[{"$f":"IF(DISPONIBILITE!F20=\"oui\",DISPONIBILITE!$E20,\"\")","v":""},{"$f":"IF(DISPONIBILITE!G20=\"oui\",DISPONIBILITE!$E20,\"\")","v":"DANIEL Alain"},{"$f":"IF(DISPONIBILITE!H20=\"oui\",DISPONIBILITE!$E20,\"\")","v":"DANIEL Alain"},{"$f":"IF(DISPONIBILITE!I20=\"oui\",DISPONIBILITE!$E20,\"\")","v":""},{"$f":"IF(DISPONIBILITE!J20=\"oui\",DISPONIBILITE!$E20,\"\")","v":"DANIEL Alain"},{"$f":"IF(DISPONIBILITE!K20=\"oui\",DISPONIBILITE!$E20,\"\")","v":"DANIEL Alain"},{"$f":"IF(DISPONIBILITE!L20=\"oui\",DISPONIBILITE!$E20,\"\")","v":""},{"$f":"IF(DISPONIBILITE!M20=\"oui\",DISPONIBILITE!$E20,\"\")","v":"DANIEL Alain"},{"$f":"IF(DISPONIBILITE!N20=\"oui\",DISPONIBILITE!$E20,\"\")","v":""},{"$f":"IF(DISPONIBILITE!O20=\"oui\",DISPONIBILITE!$E20,\"\")","v":""},{"$f":"IF(DISPONIBILITE!P20=\"oui\",DISPONIBILITE!$E20,\"\")","v":""},{"$f":"IF(DISPONIBILITE!Q20=\"oui\",DISPONIBILITE!$E20,\"\")","v":"DANIEL Alain"},{"$f":"IF(DISPONIBILITE!R20=\"oui\",DISPONIBILITE!$E20,\"\")","v":""},{"$f":"IF(DISPONIBILITE!S20=\"oui\",DISPONIBILITE!$E20,\"\")","v":"DANIEL Alain"},{"$f":"IF(DISPONIBILITE!T20=\"oui\",DISPONIBILITE!$E20,\"\")","v":"DANIEL Alain"},{"$f":"IF(DISPONIBILITE!U20=\"oui\",DISPONIBILITE!$E20,\"\")","v":"DANIEL Alain"},{"$f":"IF(DISPONIBILITE!V20=\"oui\",DISPONIBILITE!$E20,\"\")","v":"DANIEL Alain"},{"$f":"IF(DISPONIBILITE!W20=\"oui\",DISPONIBILITE!$E20,\"\")","v":"DANIEL Alain"}]
[{"$f":"IF(DISPONIBILITE!F21=\"oui\",DISPONIBILITE!$E21,\"\")","v":""},{"$f":"IF(DISPONIBILITE!G21=\"oui\",DISPONIBILITE!$E21,\"\")","v":""},{"$f":"IF(DISPONIBILITE!H21=\"oui\",DISPONIBILITE!$E21,\"\")","v":"DANIEL Annie France"},{"$f":"IF(DISPONIBILITE!I21=\"oui\",DISPONIBILITE!$E21,\"\")","v":""},{"$f":"IF(DISPONIBILITE!J21=\"oui\",DISPONIBILITE!$E21,\"\")","v":"DANIEL Annie France"},{"$f":"IF(DISPONIBILITE!K21=\"oui\",DISPONIBILITE!$E21,\"\")","v":"DANIEL Annie France"},{"$f":"IF(DISPONIBILITE!L21=\"oui\",DISPONIBILITE!$E21,\"\")","v":""},{"$f":"IF(DISPONIBILITE!M21=\"oui\",DISPONIBILITE!$E21,\"\")","v":""},{"$f":"IF(DISPONIBILITE!N21=\"oui\",DISPONIBILITE!$E21,\"\")","v":""},{"$f":"IF(DISPONIBILITE!O21=\"oui\",DISPONIBILITE!$E21,\"\")","v":""},{"$f":"IF(DISPONIBILITE!P21=\"oui\",DISPONIBILITE!$E21,\"\")","v":""},{"$f":"IF(DISPONIBILITE!Q21=\"oui\",DISPONIBILITE!$E21,\"\")","v":"DANIEL Annie France"},{"$f":"IF(DISPONIBILITE!R21=\"oui\",DISPONIBILITE!$E21,\"\")","v":""},{"$f":"IF(DISPONIBILITE!S21=\"oui\",DISPONIBILITE!$E21,\"\")","v":"DANIEL Annie France"},{"$f":"IF(DISPONIBILITE!T21=\"oui\",DISPONIBILITE!$E21,\"\")","v":"DANIEL Annie France"},{"$f":"IF(DISPONIBILITE!U21=\"oui\",DISPONIBILITE!$E21,\"\")","v":"DANIEL Annie France"},{"$f":"IF(DISPONIBILITE!V21=\"oui\",DISPONIBILITE!$E21,\"\")","v":"DANIEL Annie France"},{"$f":"IF(DISPONIBILITE!W21=\"oui\",DISPONIBILITE!$E21,\"\")","v":"DANIEL Annie France"}]
[{"$f":"IF(DISPONIBILITE!F22=\"oui\",DISPONIBILITE!$E22,\"\")","v":""},{"$f":"IF(DISPONIBILITE!G22=\"oui\",DISPONIBILITE!$E22,\"\")","v":"DENES Annick"},{"$f":"IF(DISPONIBILITE!H22=\"oui\",DISPONIBILITE!$E22,\"\")","v":""},{"$f":"IF(DISPONIBILITE!I22=\"oui\",DISPONIBILITE!$E22,\"\")","v":""},{"$f":"IF(DISPONIBILITE!J22=\"oui\",DISPONIBILITE!$E22,\"\")","v":"DENES Annick"},{"$f":"IF(DISPONIBILITE!K22=\"oui\",DISPONIBILITE!$E22,\"\")","v":"DENES Annick"},{"$f":"IF(DISPONIBILITE!L22=\"oui\",DISPONIBILITE!$E22,\"\")","v":""},{"$f":"IF(DISPONIBILITE!M22=\"oui\",DISPONIBILITE!$E22,\"\")","v":"DENES Annick"},{"$f":"IF(DISPONIBILITE!N22=\"oui\",DISPONIBILITE!$E22,\"\")","v":""},{"$f":"IF(DISPONIBILITE!O22=\"oui\",DISPONIBILITE!$E22,\"\")","v":""},{"$f":"IF(DISPONIBILITE!P22=\"oui\",DISPONIBILITE!$E22,\"\")","v":""},{"$f":"IF(DISPONIBILITE!Q22=\"oui\",DISPONIBILITE!$E22,\"\")","v":""},{"$f":"IF(DISPONIBILITE!R22=\"oui\",DISPONIBILITE!$E22,\"\")","v":""},{"$f":"IF(DISPONIBILITE!S22=\"oui\",DISPONIBILITE!$E22,\"\")","v":"DENES Annick"},{"$f":"IF(DISPONIBILITE!T22=\"oui\",DISPONIBILITE!$E22,\"\")","v":"DENES Annick"},{"$f":"IF(DISPONIBILITE!U22=\"oui\",DISPONIBILITE!$E22,\"\")","v":""},{"$f":"IF(DISPONIBILITE!V22=\"oui\",DISPONIBILITE!$E22,\"\")","v":"DENES Annick"},{"$f":"IF(DISPONIBILITE!W22=\"oui\",DISPONIBILITE!$E22,\"\")","v":"DENES Annick"}]
[{"$f":"IF(DISPONIBILITE!F23=\"oui\",DISPONIBILITE!$E23,\"\")","v":""},{"$f":"IF(DISPONIBILITE!G23=\"oui\",DISPONIBILITE!$E23,\"\")","v":"DESECHALLIERS Carole"},{"$f":"IF(DISPONIBILITE!H23=\"oui\",DISPONIBILITE!$E23,\"\")","v":""},{"$f":"IF(DISPONIBILITE!I23=\"oui\",DISPONIBILITE!$E23,\"\")","v":""},{"$f":"IF(DISPONIBILITE!J23=\"oui\",DISPONIBILITE!$E23,\"\")","v":"DESECHALLIERS Carole"},{"$f":"IF(DISPONIBILITE!K23=\"oui\",DISPONIBILITE!$E23,\"\")","v":""},{"$f":"IF(DISPONIBILITE!L23=\"oui\",DISPONIBILITE!$E23,\"\")","v":""},{"$f":"IF(DISPONIBILITE!M23=\"oui\",DISPONIBILITE!$E23,\"\")","v":""},{"$f":"IF(DISPONIBILITE!N23=\"oui\",DISPONIBILITE!$E23,\"\")","v":""},{"$f":"IF(DISPONIBILITE!O23=\"oui\",DISPONIBILITE!$E23,\"\")","v":""},{"$f":"IF(DISPONIBILITE!P23=\"oui\",DISPONIBILITE!$E23,\"\")","v":""},{"$f":"IF(DISPONIBILITE!Q23=\"oui\",DISPONIBILITE!$E23,\"\")","v":"DESECHALLIERS Carole"},{"$f":"IF(DISPONIBILITE!R23=\"oui\",DISPONIBILITE!$E23,\"\")","v":""},{"$f":"IF(DISPONIBILITE!S23=\"oui\",DISPONIBILITE!$E23,\"\")","v":""},{"$f":"IF(DISPONIBILITE!T23=\"oui\",DISPONIBILITE!$E23,\"\")","v":"DESECHALLIERS Carole"},{"$f":"IF(DISPONIBILITE!U23=\"oui\",DISPONIBILITE!$E23,\"\")","v":"DESECHALLIERS Carole"},{"$f":"IF(DISPONIBILITE!V23=\"oui\",DISPONIBILITE!$E23,\"\")","v":"DESECHALLIERS Carole"},{"$f":"IF(DISPONIBILITE!W23=\"oui\",DISPONIBILITE!$E23,\"\")","v":"DESECHALLIERS Carole"}]
[{"$f":"IF(DISPONIBILITE!F24=\"oui\",DISPONIBILITE!$E24,\"\")","v":"DESJARDINS Jean Luc"},{"$f":"IF(DISPONIBILITE!G24=\"oui\",DISPONIBILITE!$E24,\"\")","v":"DESJARDINS Jean Luc"},{"$f":"IF(DISPONIBILITE!H24=\"oui\",DISPONIBILITE!$E24,\"\")","v":""},{"$f":"IF(DISPONIBILITE!I24=\"oui\",DISPONIBILITE!$E24,\"\")","v":"DESJARDINS Jean Luc"},{"$f":"IF(DISPONIBILITE!J24=\"oui\",DISPONIBILITE!$E24,\"\")","v":"DESJARDINS Jean Luc"},{"$f":"IF(DISPONIBILITE!K24=\"oui\",DISPONIBILITE!$E24,\"\")","v":""},{"$f":"IF(DISPONIBILITE!L24=\"oui\",DISPONIBILITE!$E24,\"\")","v":"DESJARDINS Jean Luc"},{"$f":"IF(DISPONIBILITE!M24=\"oui\",DISPONIBILITE!$E24,\"\")","v":"DESJARDINS Jean Luc"},{"$f":"IF(DISPONIBILITE!N24=\"oui\",DISPONIBILITE!$E24,\"\")","v":""},{"$f":"IF(DISPONIBILITE!O24=\"oui\",DISPONIBILITE!$E24,\"\")","v":""},{"$f":"IF(DISPONIBILITE!P24=\"oui\",DISPONIBILITE!$E24,\"\")","v":"DESJARDINS Jean Luc"},{"$f":"IF(DISPONIBILITE!Q24=\"oui\",DISPONIBILITE!$E24,\"\")","v":""},{"$f":"IF(DISPONIBILITE!R24=\"oui\",DISPONIBILITE!$E24,\"\")","v":"DESJARDINS Jean Luc"},{"$f":"IF(DISPONIBILITE!S24=\"oui\",DISPONIBILITE!$E24,\"\")","v":"DESJARDINS Jean Luc"},{"$f":"IF(DISPONIBILITE!T24=\"oui\",DISPONIBILITE!$E24,\"\")","v":""},{"$f":"IF(DISPONIBILITE!U24=\"oui\",DISPONIBILITE!$E24,\"\")","v":"DESJARDINS Jean Luc"},{"$f":"IF(DISPONIBILITE!V24=\"oui\",DISPONIBILITE!$E24,\"\")","v":""},{"$f":"IF(DISPONIBILITE!W24=\"oui\",DISPONIBILITE!$E24,\"\")","v":"DESJARDINS Jean Luc"}]
[{"$f":"IF(DISPONIBILITE!F25=\"oui\",DISPONIBILITE!$E25,\"\")","v":"DUPUY Isabelle"},{"$f":"IF(DISPONIBILITE!G25=\"oui\",DISPONIBILITE!$E25,\"\")","v":"DUPUY Isabelle"},{"$f":"IF(DISPONIBILITE!H25=\"oui\",DISPONIBILITE!$E25,\"\")","v":"DUPUY Isabelle"},{"$f":"IF(DISPONIBILITE!I25=\"oui\",DISPONIBILITE!$E25,\"\")","v":"DUPUY Isabelle"},{"$f":"IF(DISPONIBILITE!J25=\"oui\",DISPONIBILITE!$E25,\"\")","v":""},{"$f":"IF(DISPONIBILITE!K25=\"oui\",DISPONIBILITE!$E25,\"\")","v":""},{"$f":"IF(DISPONIBILITE!L25=\"oui\",DISPONIBILITE!$E25,\"\")","v":""},{"$f":"IF(DISPONIBILITE!M25=\"oui\",DISPONIBILITE!$E25,\"\")","v":""},{"$f":"IF(DISPONIBILITE!N25=\"oui\",DISPONIBILITE!$E25,\"\")","v":""},{"$f":"IF(DISPONIBILITE!O25=\"oui\",DISPONIBILITE!$E25,\"\")","v":"DUPUY Isabelle"},{"$f":"IF(DISPONIBILITE!P25=\"oui\",DISPONIBILITE!$E25,\"\")","v":"DUPUY Isabelle"},{"$f":"IF(DISPONIBILITE!Q25=\"oui\",DISPONIBILITE!$E25,\"\")","v":"DUPUY Isabelle"},{"$f":"IF(DISPONIBILITE!R25=\"oui\",DISPONIBILITE!$E25,\"\")","v":"DUPUY Isabelle"},{"$f":"IF(DISPONIBILITE!S25=\"oui\",DISPONIBILITE!$E25,\"\")","v":"DUPUY Isabelle"},{"$f":"IF(DISPONIBILITE!T25=\"oui\",DISPONIBILITE!$E25,\"\")","v":"DUPUY Isabelle"},{"$f":"IF(DISPONIBILITE!U25=\"oui\",DISPONIBILITE!$E25,\"\")","v":"DUPUY Isabelle"},{"$f":"IF(DISPONIBILITE!V25=\"oui\",DISPONIBILITE!$E25,\"\")","v":"DUPUY Isabelle"},{"$f":"IF(DISPONIBILITE!W25=\"oui\",DISPONIBILITE!$E25,\"\")","v":"DUPUY Isabelle"}]
[{"$f":"IF(DISPONIBILITE!F26=\"oui\",DISPONIBILITE!$E26,\"\")","v":""},{"$f":"IF(DISPONIBILITE!G26=\"oui\",DISPONIBILITE!$E26,\"\")","v":"DUTERQUE Frédérique"},{"$f":"IF(DISPONIBILITE!H26=\"oui\",DISPONIBILITE!$E26,\"\")","v":"DUTERQUE Frédérique"},{"$f":"IF(DISPONIBILITE!I26=\"oui\",DISPONIBILITE!$E26,\"\")","v":""},{"$f":"IF(DISPONIBILITE!J26=\"oui\",DISPONIBILITE!$E26,\"\")","v":"DUTERQUE Frédérique"},{"$f":"IF(DISPONIBILITE!K26=\"oui\",DISPONIBILITE!$E26,\"\")","v":"DUTERQUE Frédérique"},{"$f":"IF(DISPONIBILITE!L26=\"oui\",DISPONIBILITE!$E26,\"\")","v":""},{"$f":"IF(DISPONIBILITE!M26=\"oui\",DISPONIBILITE!$E26,\"\")","v":""},{"$f":"IF(DISPONIBILITE!N26=\"oui\",DISPONIBILITE!$E26,\"\")","v":""},{"$f":"IF(DISPONIBILITE!O26=\"oui\",DISPONIBILITE!$E26,\"\")","v":""},{"$f":"IF(DISPONIBILITE!P26=\"oui\",DISPONIBILITE!$E26,\"\")","v":"DUTERQUE Frédérique"},{"$f":"IF(DISPONIBILITE!Q26=\"oui\",DISPONIBILITE!$E26,\"\")","v":"DUTERQUE Frédérique"},{"$f":"IF(DISPONIBILITE!R26=\"oui\",DISPONIBILITE!$E26,\"\")","v":""},{"$f":"IF(DISPONIBILITE!S26=\"oui\",DISPONIBILITE!$E26,\"\")","v":""},{"$f":"IF(DISPONIBILITE!T26=\"oui\",DISPONIBILITE!$E26,\"\")","v":""},{"$f":"IF(DISPONIBILITE!U26=\"oui\",DISPONIBILITE!$E26,\"\")","v":"DUTERQUE Frédérique"},{"$f":"IF(DISPONIBILITE!V26=\"oui\",DISPONIBILITE!$E26,\"\")","v":"DUTERQUE Frédérique"},{"$f":"IF(DISPONIBILITE!W26=\"oui\",DISPONIBILITE!$E26,\"\")","v":"DUTERQUE Frédérique"}]
[{"$f":"IF(DISPONIBILITE!F27=\"oui\",DISPONIBILITE!$E27,\"\")","v":""},{"$f":"IF(DISPONIBILITE!G27=\"oui\",DISPONIBILITE!$E27,\"\")","v":""},{"$f":"IF(DISPONIBILITE!H27=\"oui\",DISPONIBILITE!$E27,\"\")","v":""},{"$f":"IF(DISPONIBILITE!I27=\"oui\",DISPONIBILITE!$E27,\"\")","v":""},{"$f":"IF(DISPONIBILITE!J27=\"oui\",DISPONIBILITE!$E27,\"\")","v":""},{"$f":"IF(DISPONIBILITE!K27=\"oui\",DISPONIBILITE!$E27,\"\")","v":""},{"$f":"IF(DISPONIBILITE!L27=\"oui\",DISPONIBILITE!$E27,\"\")","v":"FER (THG) Mélissa"},{"$f":"IF(DISPONIBILITE!M27=\"oui\",DISPONIBILITE!$E27,\"\")","v":"FER (THG) Mélissa"},{"$f":"IF(DISPONIBILITE!N27=\"oui\",DISPONIBILITE!$E27,\"\")","v":""},{"$f":"IF(DISPONIBILITE!O27=\"oui\",DISPONIBILITE!$E27,\"\")","v":"FER (THG) Mélissa"},{"$f":"IF(DISPONIBILITE!P27=\"oui\",DISPONIBILITE!$E27,\"\")","v":"FER (THG) Mélissa"},{"$f":"IF(DISPONIBILITE!Q27=\"oui\",DISPONIBILITE!$E27,\"\")","v":""},{"$f":"IF(DISPONIBILITE!R27=\"oui\",DISPONIBILITE!$E27,\"\")","v":""},{"$f":"IF(DISPONIBILITE!S27=\"oui\",DISPONIBILITE!$E27,\"\")","v":""},{"$f":"IF(DISPONIBILITE!T27=\"oui\",DISPONIBILITE!$E27,\"\")","v":""},{"$f":"IF(DISPONIBILITE!U27=\"oui\",DISPONIBILITE!$E27,\"\")","v":""},{"$f":"IF(DISPONIBILITE!V27=\"oui\",DISPONIBILITE!$E27,\"\")","v":""},{"$f":"IF(DISPONIBILITE!W27=\"oui\",DISPONIBILITE!$E27,\"\")","v":""}]
[{"$f":"IF(DISPONIBILITE!F28=\"oui\",DISPONIBILITE!$E28,\"\")","v":""},{"$f":"IF(DISPONIBILITE!G28=\"oui\",DISPONIBILITE!$E28,\"\")","v":"FISSEUX Rosalina"},{"$f":"IF(DISPONIBILITE!H28=\"oui\",DISPONIBILITE!$E28,\"\")","v":""},{"$f":"IF(DISPONIBILITE!I28=\"oui\",DISPONIBILITE!$E28,\"\")","v":""},{"$f":"IF(DISPONIBILITE!J28=\"oui\",DISPONIBILITE!$E28,\"\")","v":""},{"$f":"IF(DISPONIBILITE!K28=\"oui\",DISPONIBILITE!$E28,\"\")","v":""},{"$f":"IF(DISPONIBILITE!L28=\"oui\",DISPONIBILITE!$E28,\"\")","v":"FISSEUX Rosalina"},{"$f":"IF(DISPONIBILITE!M28=\"oui\",DISPONIBILITE!$E28,\"\")","v":""},{"$f":"IF(DISPONIBILITE!N28=\"oui\",DISPONIBILITE!$E28,\"\")","v":""},{"$f":"IF(DISPONIBILITE!O28=\"oui\",DISPONIBILITE!$E28,\"\")","v":""},{"$f":"IF(DISPONIBILITE!P28=\"oui\",DISPONIBILITE!$E28,\"\")","v":"FISSEUX Rosalina"},{"$f":"IF(DISPONIBILITE!Q28=\"oui\",DISPONIBILITE!$E28,\"\")","v":""},{"$f":"IF(DISPONIBILITE!R28=\"oui\",DISPONIBILITE!$E28,\"\")","v":""},{"$f":"IF(DISPONIBILITE!S28=\"oui\",DISPONIBILITE!$E28,\"\")","v":""},{"$f":"IF(DISPONIBILITE!T28=\"oui\",DISPONIBILITE!$E28,\"\")","v":"FISSEUX Rosalina"},{"$f":"IF(DISPONIBILITE!U28=\"oui\",DISPONIBILITE!$E28,\"\")","v":""},{"$f":"IF(DISPONIBILITE!V28=\"oui\",DISPONIBILITE!$E28,\"\")","v":""},{"$f":"IF(DISPONIBILITE!W28=\"oui\",DISPONIBILITE!$E28,\"\")","v":"FISSEUX Rosalina"}]
[{"$f":"IF(DISPONIBILITE!F29=\"oui\",DISPONIBILITE!$E29,\"\")","v":"FLOCH Philippe"},{"$f":"IF(DISPONIBILITE!G29=\"oui\",DISPONIBILITE!$E29,\"\")","v":""},{"$f":"IF(DISPONIBILITE!H29=\"oui\",DISPONIBILITE!$E29,\"\")","v":""},{"$f":"IF(DISPONIBILITE!I29=\"oui\",DISPONIBILITE!$E29,\"\")","v":"FLOCH Philippe"},{"$f":"IF(DISPONIBILITE!J29=\"oui\",DISPONIBILITE!$E29,\"\")","v":""},{"$f":"IF(DISPONIBILITE!K29=\"oui\",DISPONIBILITE!$E29,\"\")","v":""},{"$f":"IF(DISPONIBILITE!L29=\"oui\",DISPONIBILITE!$E29,\"\")","v":"FLOCH Philippe"},{"$f":"IF(DISPONIBILITE!M29=\"oui\",DISPONIBILITE!$E29,\"\")","v":""},{"$f":"IF(DISPONIBILITE!N29=\"oui\",DISPONIBILITE!$E29,\"\")","v":""},{"$f":"IF(DISPONIBILITE!O29=\"oui\",DISPONIBILITE!$E29,\"\")","v":"FLOCH Philippe"},{"$f":"IF(DISPONIBILITE!P29=\"oui\",DISPONIBILITE!$E29,\"\")","v":""},{"$f":"IF(DISPONIBILITE!Q29=\"oui\",DISPONIBILITE!$E29,\"\")","v":""},{"$f":"IF(DISPONIBILITE!R29=\"oui\",DISPONIBILITE!$E29,\"\")","v":"FLOCH Philippe"},{"$f":"IF(DISPONIBILITE!S29=\"oui\",DISPONIBILITE!$E29,\"\")","v":""},{"$f":"IF(DISPONIBILITE!T29=\"oui\",DISPONIBILITE!$E29,\"\")","v":""},{"$f":"IF(DISPONIBILITE!U29=\"oui\",DISPONIBILITE!$E29,\"\")","v":""},{"$f":"IF(DISPONIBILITE!V29=\"oui\",DISPONIBILITE!$E29,\"\")","v":""},{"$f":"IF(DISPONIBILITE!W29=\"oui\",DISPONIBILITE!$E29,\"\")","v":""}]
[{"$f":"IF(DISPONIBILITE!F30=\"oui\",DISPONIBILITE!$E30,\"\")","v":"GAONACH (THG) Sarah"},{"$f":"IF(DISPONIBILITE!G30=\"oui\",DISPONIBILITE!$E30,\"\")","v":"GAONACH (THG) Sarah"},{"$f":"IF(DISPONIBILITE!H30=\"oui\",DISPONIBILITE!$E30,\"\")","v":""},{"$f":"IF(DISPONIBILITE!I30=\"oui\",DISPONIBILITE!$E30,\"\")","v":"GAONACH (THG) Sarah"},{"$f":"IF(DISPONIBILITE!J30=\"oui\",DISPONIBILITE!$E30,\"\")","v":"GAONACH (THG) Sarah"},{"$f":"IF(DISPONIBILITE!K30=\"oui\",DISPONIBILITE!$E30,\"\")","v":""},{"$f":"IF(DISPONIBILITE!L30=\"oui\",DISPONIBILITE!$E30,\"\")","v":""},{"$f":"IF(DISPONIBILITE!M30=\"oui\",DISPONIBILITE!$E30,\"\")","v":""},{"$f":"IF(DISPONIBILITE!N30=\"oui\",DISPONIBILITE!$E30,\"\")","v":""},{"$f":"IF(DISPONIBILITE!O30=\"oui\",DISPONIBILITE!$E30,\"\")","v":""},{"$f":"IF(DISPONIBILITE!P30=\"oui\",DISPONIBILITE!$E30,\"\")","v":""},{"$f":"IF(DISPONIBILITE!Q30=\"oui\",DISPONIBILITE!$E30,\"\")","v":""},{"$f":"IF(DISPONIBILITE!R30=\"oui\",DISPONIBILITE!$E30,\"\")","v":""},{"$f":"IF(DISPONIBILITE!S30=\"oui\",DISPONIBILITE!$E30,\"\")","v":""},{"$f":"IF(DISPONIBILITE!T30=\"oui\",DISPONIBILITE!$E30,\"\")","v":""},{"$f":"IF(DISPONIBILITE!U30=\"oui\",DISPONIBILITE!$E30,\"\")","v":""},{"$f":"IF(DISPONIBILITE!V30=\"oui\",DISPONIBILITE!$E30,\"\")","v":""},{"$f":"IF(DISPONIBILITE!W30=\"oui\",DISPONIBILITE!$E30,\"\")","v":""}]
[{"$f":"IF(DISPONIBILITE!F31=\"oui\",DISPONIBILITE!$E31,\"\")","v":""},{"$f":"IF(DISPONIBILITE!G31=\"oui\",DISPONIBILITE!$E31,\"\")","v":""},{"$f":"IF(DISPONIBILITE!H31=\"oui\",DISPONIBILITE!$E31,\"\")","v":"GARCETTE Jade"},{"$f":"IF(DISPONIBILITE!I31=\"oui\",DISPONIBILITE!$E31,\"\")","v":""},{"$f":"IF(DISPONIBILITE!J31=\"oui\",DISPONIBILITE!$E31,\"\")","v":""},{"$f":"IF(DISPONIBILITE!K31=\"oui\",DISPONIBILITE!$E31,\"\")","v":"GARCETTE Jade"},{"$f":"IF(DISPONIBILITE!L31=\"oui\",DISPONIBILITE!$E31,\"\")","v":""},{"$f":"IF(DISPONIBILITE!M31=\"oui\",DISPONIBILITE!$E31,\"\")","v":""},{"$f":"IF(DISPONIBILITE!N31=\"oui\",DISPONIBILITE!$E31,\"\")","v":""},{"$f":"IF(DISPONIBILITE!O31=\"oui\",DISPONIBILITE!$E31,\"\")","v":""},{"$f":"IF(DISPONIBILITE!P31=\"oui\",DISPONIBILITE!$E31,\"\")","v":""},{"$f":"IF(DISPONIBILITE!Q31=\"oui\",DISPONIBILITE!$E31,\"\")","v":""},{"$f":"IF(DISPONIBILITE!R31=\"oui\",DISPONIBILITE!$E31,\"\")","v":""},{"$f":"IF(DISPONIBILITE!S31=\"oui\",DISPONIBILITE!$E31,\"\")","v":""},{"$f":"IF(DISPONIBILITE!T31=\"oui\",DISPONIBILITE!$E31,\"\")","v":"GARCETTE Jade"},{"$f":"IF(DISPONIBILITE!U31=\"oui\",DISPONIBILITE!$E31,\"\")","v":""},{"$f":"IF(DISPONIBILITE!V31=\"oui\",DISPONIBILITE!$E31,\"\")","v":"GARCETTE Jade"},{"$f":"IF(DISPONIBILITE!W31=\"oui\",DISPONIBILITE!$E31,\"\")","v":""}]
[{"$f":"IF(DISPONIBILITE!F32=\"oui\",DISPONIBILITE!$E32,\"\")","v":""},{"$f":"IF(DISPONIBILITE!G32=\"oui\",DISPONIBILITE!$E32,\"\")","v":""},{"$f":"IF(DISPONIBILITE!H32=\"oui\",DISPONIBILITE!$E32,\"\")","v":""},{"$f":"IF(DISPONIBILITE!I32=\"oui\",DISPONIBILITE!$E32,\"\")","v":""},{"$f":"IF(DISPONIBILITE!J32=\"oui\",DISPONIBILITE!$E32,\"\")","v":""},{"$f":"IF(DISPONIBILITE!K32=\"oui\",DISPONIBILITE!$E32,\"\")","v":""},{"$f":"IF(DISPONIBILITE!L32=\"oui\",DISPONIBILITE!$E32,\"\")","v":""},{"$f":"IF(DISPONIBILITE!M32=\"oui\",DISPONIBILITE!$E32,\"\")","v":""},{"$f":"IF(DISPONIBILITE!N32=\"oui\",DISPONIBILITE!$E32,\"\")","v":""},{"$f":"IF(DISPONIBILITE!O32=\"oui\",DISPONIBILITE!$E32,\"\")","v":""},{"$f":"IF(DISPONIBILITE!P32=\"oui\",DISPONIBILITE!$E32,\"\")","v":""},{"$f":"IF(DISPONIBILITE!Q32=\"oui\",DISPONIBILITE!$E32,\"\")","v":""},{"$f":"IF(DISPONIBILITE!R32=\"oui\",DISPONIBILITE!$E32,\"\")","v":""},{"$f":"IF(DISPONIBILITE!S32=\"oui\",DISPONIBILITE!$E32,\"\")","v":""},{"$f":"IF(DISPONIBILITE!T32=\"oui\",DISPONIBILITE!$E32,\"\")","v":""},{"$f":"IF(DISPONIBILITE!U32=\"oui\",DISPONIBILITE!$E32,\"\")","v":""},{"$f":"IF(DISPONIBILITE!V32=\"oui\",DISPONIBILITE!$E32,\"\")","v":"GERNIGON Laurence"},{"$f":"IF(DISPONIBILITE!W32=\"oui\",DISPONIBILITE!$E32,\"\")","v":"GERNIGON Laurence"}]
[{"$f":"IF(DISPONIBILITE!F33=\"oui\",DISPONIBILITE!$E33,\"\")","v":"GUEGUEN (K) Sébastien"},{"$f":"IF(DISPONIBILITE!G33=\"oui\",DISPONIBILITE!$E33,\"\")","v":"GUEGUEN (K) Sébastien"},{"$f":"IF(DISPONIBILITE!H33=\"oui\",DISPONIBILITE!$E33,\"\")","v":""},{"$f":"IF(DISPONIBILITE!I33=\"oui\",DISPONIBILITE!$E33,\"\")","v":"GUEGUEN (K) Sébastien"},{"$f":"IF(DISPONIBILITE!J33=\"oui\",DISPONIBILITE!$E33,\"\")","v":"GUEGUEN (K) Sébastien"},{"$f":"IF(DISPONIBILITE!K33=\"oui\",DISPONIBILITE!$E33,\"\")","v":""},{"$f":"IF(DISPONIBILITE!L33=\"oui\",DISPONIBILITE!$E33,\"\")","v":""},{"$f":"IF(DISPONIBILITE!M33=\"oui\",DISPONIBILITE!$E33,\"\")","v":""},{"$f":"IF(DISPONIBILITE!N33=\"oui\",DISPONIBILITE!$E33,\"\")","v":""},{"$f":"IF(DISPONIBILITE!O33=\"oui\",DISPONIBILITE!$E33,\"\")","v":"GUEGUEN (K) Sébastien"},{"$f":"IF(DISPONIBILITE!P33=\"oui\",DISPONIBILITE!$E33,\"\")","v":"GUEGUEN (K) Sébastien"},{"$f":"IF(DISPONIBILITE!Q33=\"oui\",DISPONIBILITE!$E33,\"\")","v":""},{"$f":"IF(DISPONIBILITE!R33=\"oui\",DISPONIBILITE!$E33,\"\")","v":"GUEGUEN (K) Sébastien"},{"$f":"IF(DISPONIBILITE!S33=\"oui\",DISPONIBILITE!$E33,\"\")","v":"GUEGUEN (K) Sébastien"},{"$f":"IF(DISPONIBILITE!T33=\"oui\",DISPONIBILITE!$E33,\"\")","v":""},{"$f":"IF(DISPONIBILITE!U33=\"oui\",DISPONIBILITE!$E33,\"\")","v":""},{"$f":"IF(DISPONIBILITE!V33=\"oui\",DISPONIBILITE!$E33,\"\")","v":""},{"$f":"IF(DISPONIBILITE!W33=\"oui\",DISPONIBILITE!$E33,\"\")","v":""}]
[{"$f":"IF(DISPONIBILITE!F34=\"oui\",DISPONIBILITE!$E34,\"\")","v":"GUERROT (THG) Gildas"},{"$f":"IF(DISPONIBILITE!G34=\"oui\",DISPONIBILITE!$E34,\"\")","v":"GUERROT (THG) Gildas"},{"$f":"IF(DISPONIBILITE!H34=\"oui\",DISPONIBILITE!$E34,\"\")","v":""},{"$f":"IF(DISPONIBILITE!I34=\"oui\",DISPONIBILITE!$E34,\"\")","v":"GUERROT (THG) Gildas"},{"$f":"IF(DISPONIBILITE!J34=\"oui\",DISPONIBILITE!$E34,\"\")","v":"GUERROT (THG) Gildas"},{"$f":"IF(DISPONIBILITE!K34=\"oui\",DISPONIBILITE!$E34,\"\")","v":""},{"$f":"IF(DISPONIBILITE!L34=\"oui\",DISPONIBILITE!$E34,\"\")","v":""},{"$f":"IF(DISPONIBILITE!M34=\"oui\",DISPONIBILITE!$E34,\"\")","v":""},{"$f":"IF(DISPONIBILITE!N34=\"oui\",DISPONIBILITE!$E34,\"\")","v":""},{"$f":"IF(DISPONIBILITE!O34=\"oui\",DISPONIBILITE!$E34,\"\")","v":""},{"$f":"IF(DISPONIBILITE!P34=\"oui\",DISPONIBILITE!$E34,\"\")","v":""},{"$f":"IF(DISPONIBILITE!Q34=\"oui\",DISPONIBILITE!$E34,\"\")","v":""},{"$f":"IF(DISPONIBILITE!R34=\"oui\",DISPONIBILITE!$E34,\"\")","v":""},{"$f":"IF(DISPONIBILITE!S34=\"oui\",DISPONIBILITE!$E34,\"\")","v":""},{"$f":"IF(DISPONIBILITE!T34=\"oui\",DISPONIBILITE!$E34,\"\")","v":""},{"$f":"IF(DISPONIBILITE!U34=\"oui\",DISPONIBILITE!$E34,\"\")","v":""},{"$f":"IF(DISPONIBILITE!V34=\"oui\",DISPONIBILITE!$E34,\"\")","v":""},{"$f":"IF(DISPONIBILITE!W34=\"oui\",DISPONIBILITE!$E34,\"\")","v":""}]
[{"$f":"IF(DISPONIBILITE!F35=\"oui\",DISPONIBILITE!$E35,\"\")","v":"GUEZENNEC (K) Bruno"},{"$f":"IF(DISPONIBILITE!G35=\"oui\",DISPONIBILITE!$E35,\"\")","v":"GUEZENNEC (K) Bruno"},{"$f":"IF(DISPONIBILITE!H35=\"oui\",DISPONIBILITE!$E35,\"\")","v":""},{"$f":"IF(DISPONIBILITE!I35=\"oui\",DISPONIBILITE!$E35,\"\")","v":"GUEZENNEC (K) Bruno"},{"$f":"IF(DISPONIBILITE!J35=\"oui\",DISPONIBILITE!$E35,\"\")","v":"GUEZENNEC (K) Bruno"},{"$f":"IF(DISPONIBILITE!K35=\"oui\",DISPONIBILITE!$E35,\"\")","v":""},{"$f":"IF(DISPONIBILITE!L35=\"oui\",DISPONIBILITE!$E35,\"\")","v":""},{"$f":"IF(DISPONIBILITE!M35=\"oui\",DISPONIBILITE!$E35,\"\")","v":""},{"$f":"IF(DISPONIBILITE!N35=\"oui\",DISPONIBILITE!$E35,\"\")","v":""},{"$f":"IF(DISPONIBILITE!O35=\"oui\",DISPONIBILITE!$E35,\"\")","v":""},{"$f":"IF(DISPONIBILITE!P35=\"oui\",DISPONIBILITE!$E35,\"\")","v":""},{"$f":"IF(DISPONIBILITE!Q35=\"oui\",DISPONIBILITE!$E35,\"\")","v":""},{"$f":"IF(DISPONIBILITE!R35=\"oui\",DISPONIBILITE!$E35,\"\")","v":""},{"$f":"IF(DISPONIBILITE!S35=\"oui\",DISPONIBILITE!$E35,\"\")","v":""},{"$f":"IF(DISPONIBILITE!T35=\"oui\",DISPONIBILITE!$E35,\"\")","v":""},{"$f":"IF(DISPONIBILITE!U35=\"oui\",DISPONIBILITE!$E35,\"\")","v":""},{"$f":"IF(DISPONIBILITE!V35=\"oui\",DISPONIBILITE!$E35,\"\")","v":""},{"$f":"IF(DISPONIBILITE!W35=\"oui\",DISPONIBILITE!$E35,\"\")","v":""}]
[{"$f":"IF(DISPONIBILITE!F36=\"oui\",DISPONIBILITE!$E36,\"\")","v":""},{"$f":"IF(DISPONIBILITE!G36=\"oui\",DISPONIBILITE!$E36,\"\")","v":""},{"$f":"IF(DISPONIBILITE!H36=\"oui\",DISPONIBILITE!$E36,\"\")","v":""},{"$f":"IF(DISPONIBILITE!I36=\"oui\",DISPONIBILITE!$E36,\"\")","v":"GUILLERMOU Marie Évelyne"},{"$f":"IF(DISPONIBILITE!J36=\"oui\",DISPONIBILITE!$E36,\"\")","v":"GUILLERMOU Marie Évelyne"},{"$f":"IF(DISPONIBILITE!K36=\"oui\",DISPONIBILITE!$E36,\"\")","v":""},{"$f":"IF(DISPONIBILITE!L36=\"oui\",DISPONIBILITE!$E36,\"\")","v":"GUILLERMOU Marie Évelyne"},{"$f":"IF(DISPONIBILITE!M36=\"oui\",DISPONIBILITE!$E36,\"\")","v":"GUILLERMOU Marie Évelyne"},{"$f":"IF(DISPONIBILITE!N36=\"oui\",DISPONIBILITE!$E36,\"\")","v":"GUILLERMOU Marie Évelyne"},{"$f":"IF(DISPONIBILITE!O36=\"oui\",DISPONIBILITE!$E36,\"\")","v":"GUILLERMOU Marie Évelyne"},{"$f":"IF(DISPONIBILITE!P36=\"oui\",DISPONIBILITE!$E36,\"\")","v":"GUILLERMOU Marie Évelyne"},{"$f":"IF(DISPONIBILITE!Q36=\"oui\",DISPONIBILITE!$E36,\"\")","v":""},{"$f":"IF(DISPONIBILITE!R36=\"oui\",DISPONIBILITE!$E36,\"\")","v":""},{"$f":"IF(DISPONIBILITE!S36=\"oui\",DISPONIBILITE!$E36,\"\")","v":""},{"$f":"IF(DISPONIBILITE!T36=\"oui\",DISPONIBILITE!$E36,\"\")","v":""},{"$f":"IF(DISPONIBILITE!U36=\"oui\",DISPONIBILITE!$E36,\"\")","v":"GUILLERMOU Marie Évelyne"},{"$f":"IF(DISPONIBILITE!V36=\"oui\",DISPONIBILITE!$E36,\"\")","v":"GUILLERMOU Marie Évelyne"},{"$f":"IF(DISPONIBILITE!W36=\"oui\",DISPONIBILITE!$E36,\"\")","v":""}]
[{"$f":"IF(DISPONIBILITE!F37=\"oui\",DISPONIBILITE!$E37,\"\")","v":""},{"$f":"IF(DISPONIBILITE!G37=\"oui\",DISPONIBILITE!$E37,\"\")","v":""},{"$f":"IF(DISPONIBILITE!H37=\"oui\",DISPONIBILITE!$E37,\"\")","v":""},{"$f":"IF(DISPONIBILITE!I37=\"oui\",DISPONIBILITE!$E37,\"\")","v":""},{"$f":"IF(DISPONIBILITE!J37=\"oui\",DISPONIBILITE!$E37,\"\")","v":""},{"$f":"IF(DISPONIBILITE!K37=\"oui\",DISPONIBILITE!$E37,\"\")","v":"GUTIERREZ Valentina"},{"$f":"IF(DISPONIBILITE!L37=\"oui\",DISPONIBILITE!$E37,\"\")","v":""},{"$f":"IF(DISPONIBILITE!M37=\"oui\",DISPONIBILITE!$E37,\"\")","v":""},{"$f":"IF(DISPONIBILITE!N37=\"oui\",DISPONIBILITE!$E37,\"\")","v":"GUTIERREZ Valentina"},{"$f":"IF(DISPONIBILITE!O37=\"oui\",DISPONIBILITE!$E37,\"\")","v":""},{"$f":"IF(DISPONIBILITE!P37=\"oui\",DISPONIBILITE!$E37,\"\")","v":""},{"$f":"IF(DISPONIBILITE!Q37=\"oui\",DISPONIBILITE!$E37,\"\")","v":""},{"$f":"IF(DISPONIBILITE!R37=\"oui\",DISPONIBILITE!$E37,\"\")","v":""},{"$f":"IF(DISPONIBILITE!S37=\"oui\",DISPONIBILITE!$E37,\"\")","v":""},{"$f":"IF(DISPONIBILITE!T37=\"oui\",DISPONIBILITE!$E37,\"\")","v":""},{"$f":"IF(DISPONIBILITE!U37=\"oui\",DISPONIBILITE!$E37,\"\")","v":""},{"$f":"IF(DISPONIBILITE!V37=\"oui\",DISPONIBILITE!$E37,\"\")","v":""},{"$f":"IF(DISPONIBILITE!W37=\"oui\",DISPONIBILITE!$E37,\"\")","v":""}]
[{"$f":"IF(DISPONIBILITE!F38=\"oui\",DISPONIBILITE!$E38,\"\")","v":""},{"$f":"IF(DISPONIBILITE!G38=\"oui\",DISPONIBILITE!$E38,\"\")","v":""},{"$f":"IF(DISPONIBILITE!H38=\"oui\",DISPONIBILITE!$E38,\"\")","v":"HADOUZI Yasmine"},{"$f":"IF(DISPONIBILITE!I38=\"oui\",DISPONIBILITE!$E38,\"\")","v":""},{"$f":"IF(DISPONIBILITE!J38=\"oui\",DISPONIBILITE!$E38,\"\")","v":""},{"$f":"IF(DISPONIBILITE!K38=\"oui\",DISPONIBILITE!$E38,\"\")","v":"HADOUZI Yasmine"},{"$f":"IF(DISPONIBILITE!L38=\"oui\",DISPONIBILITE!$E38,\"\")","v":""},{"$f":"IF(DISPONIBILITE!M38=\"oui\",DISPONIBILITE!$E38,\"\")","v":""},{"$f":"IF(DISPONIBILITE!N38=\"oui\",DISPONIBILITE!$E38,\"\")","v":"HADOUZI Yasmine"},{"$f":"IF(DISPONIBILITE!O38=\"oui\",DISPONIBILITE!$E38,\"\")","v":""},{"$f":"IF(DISPONIBILITE!P38=\"oui\",DISPONIBILITE!$E38,\"\")","v":""},{"$f":"IF(DISPONIBILITE!Q38=\"oui\",DISPONIBILITE!$E38,\"\")","v":"HADOUZI Yasmine"},{"$f":"IF(DISPONIBILITE!R38=\"oui\",DISPONIBILITE!$E38,\"\")","v":""},{"$f":"IF(DISPONIBILITE!S38=\"oui\",DISPONIBILITE!$E38,\"\")","v":""},{"$f":"IF(DISPONIBILITE!T38=\"oui\",DISPONIBILITE!$E38,\"\")","v":""},{"$f":"IF(DISPONIBILITE!U38=\"oui\",DISPONIBILITE!$E38,\"\")","v":""},{"$f":"IF(DISPONIBILITE!V38=\"oui\",DISPONIBILITE!$E38,\"\")","v":"HADOUZI Yasmine"},{"$f":"IF(DISPONIBILITE!W38=\"oui\",DISPONIBILITE!$E38,\"\")","v":""}]
[{"$f":"IF(DISPONIBILITE!F39=\"oui\",DISPONIBILITE!$E39,\"\")","v":"JANOT (K) Laetitia"},{"$f":"IF(DISPONIBILITE!G39=\"oui\",DISPONIBILITE!$E39,\"\")","v":"JANOT (K) Laetitia"},{"$f":"IF(DISPONIBILITE!H39=\"oui\",DISPONIBILITE!$E39,\"\")","v":""},{"$f":"IF(DISPONIBILITE!I39=\"oui\",DISPONIBILITE!$E39,\"\")","v":"JANOT (K) Laetitia"},{"$f":"IF(DISPONIBILITE!J39=\"oui\",DISPONIBILITE!$E39,\"\")","v":"JANOT (K) Laetitia"},{"$f":"IF(DISPONIBILITE!K39=\"oui\",DISPONIBILITE!$E39,\"\")","v":""},{"$f":"IF(DISPONIBILITE!L39=\"oui\",DISPONIBILITE!$E39,\"\")","v":""},{"$f":"IF(DISPONIBILITE!M39=\"oui\",DISPONIBILITE!$E39,\"\")","v":""},{"$f":"IF(DISPONIBILITE!N39=\"oui\",DISPONIBILITE!$E39,\"\")","v":""},{"$f":"IF(DISPONIBILITE!O39=\"oui\",DISPONIBILITE!$E39,\"\")","v":"JANOT (K) Laetitia"},{"$f":"IF(DISPONIBILITE!P39=\"oui\",DISPONIBILITE!$E39,\"\")","v":"JANOT (K) Laetitia"},{"$f":"IF(DISPONIBILITE!Q39=\"oui\",DISPONIBILITE!$E39,\"\")","v":""},{"$f":"IF(DISPONIBILITE!R39=\"oui\",DISPONIBILITE!$E39,\"\")","v":"JANOT (K) Laetitia"},{"$f":"IF(DISPONIBILITE!S39=\"oui\",DISPONIBILITE!$E39,\"\")","v":"JANOT (K) Laetitia"},{"$f":"IF(DISPONIBILITE!T39=\"oui\",DISPONIBILITE!$E39,\"\")","v":""},{"$f":"IF(DISPONIBILITE!U39=\"oui\",DISPONIBILITE!$E39,\"\")","v":""},{"$f":"IF(DISPONIBILITE!V39=\"oui\",DISPONIBILITE!$E39,\"\")","v":""},{"$f":"IF(DISPONIBILITE!W39=\"oui\",DISPONIBILITE!$E39,\"\")","v":""}]
[{"$f":"IF(DISPONIBILITE!F40=\"oui\",DISPONIBILITE!$E40,\"\")","v":""},{"$f":"IF(DISPONIBILITE!G40=\"oui\",DISPONIBILITE!$E40,\"\")","v":""},{"$f":"IF(DISPONIBILITE!H40=\"oui\",DISPONIBILITE!$E40,\"\")","v":""},{"$f":"IF(DISPONIBILITE!I40=\"oui\",DISPONIBILITE!$E40,\"\")","v":""},{"$f":"IF(DISPONIBILITE!J40=\"oui\",DISPONIBILITE!$E40,\"\")","v":"KERLEO Anne Marie"},{"$f":"IF(DISPONIBILITE!K40=\"oui\",DISPONIBILITE!$E40,\"\")","v":""},{"$f":"IF(DISPONIBILITE!L40=\"oui\",DISPONIBILITE!$E40,\"\")","v":""},{"$f":"IF(DISPONIBILITE!M40=\"oui\",DISPONIBILITE!$E40,\"\")","v":""},{"$f":"IF(DISPONIBILITE!N40=\"oui\",DISPONIBILITE!$E40,\"\")","v":""},{"$f":"IF(DISPONIBILITE!O40=\"oui\",DISPONIBILITE!$E40,\"\")","v":""},{"$f":"IF(DISPONIBILITE!P40=\"oui\",DISPONIBILITE!$E40,\"\")","v":"KERLEO Anne Marie"},{"$f":"IF(DISPONIBILITE!Q40=\"oui\",DISPONIBILITE!$E40,\"\")","v":""},{"$f":"IF(DISPONIBILITE!R40=\"oui\",DISPONIBILITE!$E40,\"\")","v":""},{"$f":"IF(DISPONIBILITE!S40=\"oui\",DISPONIBILITE!$E40,\"\")","v":"KERLEO Anne Marie"},{"$f":"IF(DISPONIBILITE!T40=\"oui\",DISPONIBILITE!$E40,\"\")","v":""},{"$f":"IF(DISPONIBILITE!U40=\"oui\",DISPONIBILITE!$E40,\"\")","v":""},{"$f":"IF(DISPONIBILITE!V40=\"oui\",DISPONIBILITE!$E40,\"\")","v":"KERLEO Anne Marie"},{"$f":"IF(DISPONIBILITE!W40=\"oui\",DISPONIBILITE!$E40,\"\")","v":""}]
[{"$f":"IF(DISPONIBILITE!F41=\"oui\",DISPONIBILITE!$E41,\"\")","v":""},{"$f":"IF(DISPONIBILITE!G41=\"oui\",DISPONIBILITE!$E41,\"\")","v":""},{"$f":"IF(DISPONIBILITE!H41=\"oui\",DISPONIBILITE!$E41,\"\")","v":""},{"$f":"IF(DISPONIBILITE!I41=\"oui\",DISPONIBILITE!$E41,\"\")","v":""},{"$f":"IF(DISPONIBILITE!J41=\"oui\",DISPONIBILITE!$E41,\"\")","v":""},{"$f":"IF(DISPONIBILITE!K41=\"oui\",DISPONIBILITE!$E41,\"\")","v":""},{"$f":"IF(DISPONIBILITE!L41=\"oui\",DISPONIBILITE!$E41,\"\")","v":""},{"$f":"IF(DISPONIBILITE!M41=\"oui\",DISPONIBILITE!$E41,\"\")","v":""},{"$f":"IF(DISPONIBILITE!N41=\"oui\",DISPONIBILITE!$E41,\"\")","v":""},{"$f":"IF(DISPONIBILITE!O41=\"oui\",DISPONIBILITE!$E41,\"\")","v":"KERVELLA (K) Virginie"},{"$f":"IF(DISPONIBILITE!P41=\"oui\",DISPONIBILITE!$E41,\"\")","v":"KERVELLA (K) Virginie"},{"$f":"IF(DISPONIBILITE!Q41=\"oui\",DISPONIBILITE!$E41,\"\")","v":""},{"$f":"IF(DISPONIBILITE!R41=\"oui\",DISPONIBILITE!$E41,\"\")","v":"KERVELLA (K) Virginie"},{"$f":"IF(DISPONIBILITE!S41=\"oui\",DISPONIBILITE!$E41,\"\")","v":"KERVELLA (K) Virginie"},{"$f":"IF(DISPONIBILITE!T41=\"oui\",DISPONIBILITE!$E41,\"\")","v":""},{"$f":"IF(DISPONIBILITE!U41=\"oui\",DISPONIBILITE!$E41,\"\")","v":""},{"$f":"IF(DISPONIBILITE!V41=\"oui\",DISPONIBILITE!$E41,\"\")","v":""},{"$f":"IF(DISPONIBILITE!W41=\"oui\",DISPONIBILITE!$E41,\"\")","v":""}]
[{"$f":"IF(DISPONIBILITE!F42=\"oui\",DISPONIBILITE!$E42,\"\")","v":"LANDOUARD Frédéric"},{"$f":"IF(DISPONIBILITE!G42=\"oui\",DISPONIBILITE!$E42,\"\")","v":"LANDOUARD Frédéric"},{"$f":"IF(DISPONIBILITE!H42=\"oui\",DISPONIBILITE!$E42,\"\")","v":"LANDOUARD Frédéric"},{"$f":"IF(DISPONIBILITE!I42=\"oui\",DISPONIBILITE!$E42,\"\")","v":"LANDOUARD Frédéric"},{"$f":"IF(DISPONIBILITE!J42=\"oui\",DISPONIBILITE!$E42,\"\")","v":"LANDOUARD Frédéric"},{"$f":"IF(DISPONIBILITE!K42=\"oui\",DISPONIBILITE!$E42,\"\")","v":"LANDOUARD Frédéric"},{"$f":"IF(DISPONIBILITE!L42=\"oui\",DISPONIBILITE!$E42,\"\")","v":"LANDOUARD Frédéric"},{"$f":"IF(DISPONIBILITE!M42=\"oui\",DISPONIBILITE!$E42,\"\")","v":"LANDOUARD Frédéric"},{"$f":"IF(DISPONIBILITE!N42=\"oui\",DISPONIBILITE!$E42,\"\")","v":"LANDOUARD Frédéric"},{"$f":"IF(DISPONIBILITE!O42=\"oui\",DISPONIBILITE!$E42,\"\")","v":"LANDOUARD Frédéric"},{"$f":"IF(DISPONIBILITE!P42=\"oui\",DISPONIBILITE!$E42,\"\")","v":"LANDOUARD Frédéric"},{"$f":"IF(DISPONIBILITE!Q42=\"oui\",DISPONIBILITE!$E42,\"\")","v":"LANDOUARD Frédéric"},{"$f":"IF(DISPONIBILITE!R42=\"oui\",DISPONIBILITE!$E42,\"\")","v":"LANDOUARD Frédéric"},{"$f":"IF(DISPONIBILITE!S42=\"oui\",DISPONIBILITE!$E42,\"\")","v":"LANDOUARD Frédéric"},{"$f":"IF(DISPONIBILITE!T42=\"oui\",DISPONIBILITE!$E42,\"\")","v":"LANDOUARD Frédéric"},{"$f":"IF(DISPONIBILITE!U42=\"oui\",DISPONIBILITE!$E42,\"\")","v":"LANDOUARD Frédéric"},{"$f":"IF(DISPONIBILITE!V42=\"oui\",DISPONIBILITE!$E42,\"\")","v":"LANDOUARD Frédéric"},{"$f":"IF(DISPONIBILITE!W42=\"oui\",DISPONIBILITE!$E42,\"\")","v":"LANDOUARD Frédéric"}]
[{"$f":"IF(DISPONIBILITE!F43=\"oui\",DISPONIBILITE!$E43,\"\")","v":"LE BIHAN Guy"},{"$f":"IF(DISPONIBILITE!G43=\"oui\",DISPONIBILITE!$E43,\"\")","v":""},{"$f":"IF(DISPONIBILITE!H43=\"oui\",DISPONIBILITE!$E43,\"\")","v":""},{"$f":"IF(DISPONIBILITE!I43=\"oui\",DISPONIBILITE!$E43,\"\")","v":""},{"$f":"IF(DISPONIBILITE!J43=\"oui\",DISPONIBILITE!$E43,\"\")","v":"LE BIHAN Guy"},{"$f":"IF(DISPONIBILITE!K43=\"oui\",DISPONIBILITE!$E43,\"\")","v":"LE BIHAN Guy"},{"$f":"IF(DISPONIBILITE!L43=\"oui\",DISPONIBILITE!$E43,\"\")","v":"LE BIHAN Guy"},{"$f":"IF(DISPONIBILITE!M43=\"oui\",DISPONIBILITE!$E43,\"\")","v":""},{"$f":"IF(DISPONIBILITE!N43=\"oui\",DISPONIBILITE!$E43,\"\")","v":"LE BIHAN Guy"},{"$f":"IF(DISPONIBILITE!O43=\"oui\",DISPONIBILITE!$E43,\"\")","v":""},{"$f":"IF(DISPONIBILITE!P43=\"oui\",DISPONIBILITE!$E43,\"\")","v":"LE BIHAN Guy"},{"$f":"IF(DISPONIBILITE!Q43=\"oui\",DISPONIBILITE!$E43,\"\")","v":"LE BIHAN Guy"},{"$f":"IF(DISPONIBILITE!R43=\"oui\",DISPONIBILITE!$E43,\"\")","v":""},{"$f":"IF(DISPONIBILITE!S43=\"oui\",DISPONIBILITE!$E43,\"\")","v":""},{"$f":"IF(DISPONIBILITE!T43=\"oui\",DISPONIBILITE!$E43,\"\")","v":"LE BIHAN Guy"},{"$f":"IF(DISPONIBILITE!U43=\"oui\",DISPONIBILITE!$E43,\"\")","v":""},{"$f":"IF(DISPONIBILITE!V43=\"oui\",DISPONIBILITE!$E43,\"\")","v":""},{"$f":"IF(DISPONIBILITE!W43=\"oui\",DISPONIBILITE!$E43,\"\")","v":""}]
[{"$f":"IF(DISPONIBILITE!F44=\"oui\",DISPONIBILITE!$E44,\"\")","v":""},{"$f":"IF(DISPONIBILITE!G44=\"oui\",DISPONIBILITE!$E44,\"\")","v":"LE BOSSER Jean René"},{"$f":"IF(DISPONIBILITE!H44=\"oui\",DISPONIBILITE!$E44,\"\")","v":""},{"$f":"IF(DISPONIBILITE!I44=\"oui\",DISPONIBILITE!$E44,\"\")","v":""},{"$f":"IF(DISPONIBILITE!J44=\"oui\",DISPONIBILITE!$E44,\"\")","v":""},{"$f":"IF(DISPONIBILITE!K44=\"oui\",DISPONIBILITE!$E44,\"\")","v":""},{"$f":"IF(DISPONIBILITE!L44=\"oui\",DISPONIBILITE!$E44,\"\")","v":""},{"$f":"IF(DISPONIBILITE!M44=\"oui\",DISPONIBILITE!$E44,\"\")","v":"LE BOSSER Jean René"},{"$f":"IF(DISPONIBILITE!N44=\"oui\",DISPONIBILITE!$E44,\"\")","v":""},{"$f":"IF(DISPONIBILITE!O44=\"oui\",DISPONIBILITE!$E44,\"\")","v":""},{"$f":"IF(DISPONIBILITE!P44=\"oui\",DISPONIBILITE!$E44,\"\")","v":""},{"$f":"IF(DISPONIBILITE!Q44=\"oui\",DISPONIBILITE!$E44,\"\")","v":"LE BOSSER Jean René"},{"$f":"IF(DISPONIBILITE!R44=\"oui\",DISPONIBILITE!$E44,\"\")","v":""},{"$f":"IF(DISPONIBILITE!S44=\"oui\",DISPONIBILITE!$E44,\"\")","v":"LE BOSSER Jean René"},{"$f":"IF(DISPONIBILITE!T44=\"oui\",DISPONIBILITE!$E44,\"\")","v":""},{"$f":"IF(DISPONIBILITE!U44=\"oui\",DISPONIBILITE!$E44,\"\")","v":""},{"$f":"IF(DISPONIBILITE!V44=\"oui\",DISPONIBILITE!$E44,\"\")","v":"LE BOSSER Jean René"},{"$f":"IF(DISPONIBILITE!W44=\"oui\",DISPONIBILITE!$E44,\"\")","v":"LE BOSSER Jean René"}]
[{"$f":"IF(DISPONIBILITE!F45=\"oui\",DISPONIBILITE!$E45,\"\")","v":""},{"$f":"IF(DISPONIBILITE!G45=\"oui\",DISPONIBILITE!$E45,\"\")","v":"LE BOSSER Liliane"},{"$f":"IF(DISPONIBILITE!H45=\"oui\",DISPONIBILITE!$E45,\"\")","v":""},{"$f":"IF(DISPONIBILITE!I45=\"oui\",DISPONIBILITE!$E45,\"\")","v":""},{"$f":"IF(DISPONIBILITE!J45=\"oui\",DISPONIBILITE!$E45,\"\")","v":""},{"$f":"IF(DISPONIBILITE!K45=\"oui\",DISPONIBILITE!$E45,\"\")","v":""},{"$f":"IF(DISPONIBILITE!L45=\"oui\",DISPONIBILITE!$E45,\"\")","v":""},{"$f":"IF(DISPONIBILITE!M45=\"oui\",DISPONIBILITE!$E45,\"\")","v":"LE BOSSER Liliane"},{"$f":"IF(DISPONIBILITE!N45=\"oui\",DISPONIBILITE!$E45,\"\")","v":""},{"$f":"IF(DISPONIBILITE!O45=\"oui\",DISPONIBILITE!$E45,\"\")","v":""},{"$f":"IF(DISPONIBILITE!P45=\"oui\",DISPONIBILITE!$E45,\"\")","v":""},{"$f":"IF(DISPONIBILITE!Q45=\"oui\",DISPONIBILITE!$E45,\"\")","v":"LE BOSSER Liliane"},{"$f":"IF(DISPONIBILITE!R45=\"oui\",DISPONIBILITE!$E45,\"\")","v":""},{"$f":"IF(DISPONIBILITE!S45=\"oui\",DISPONIBILITE!$E45,\"\")","v":"LE BOSSER Liliane"},{"$f":"IF(DISPONIBILITE!T45=\"oui\",DISPONIBILITE!$E45,\"\")","v":""},{"$f":"IF(DISPONIBILITE!U45=\"oui\",DISPONIBILITE!$E45,\"\")","v":""},{"$f":"IF(DISPONIBILITE!V45=\"oui\",DISPONIBILITE!$E45,\"\")","v":"LE BOSSER Liliane"},{"$f":"IF(DISPONIBILITE!W45=\"oui\",DISPONIBILITE!$E45,\"\")","v":"LE BOSSER Liliane"}]
[{"$f":"IF(DISPONIBILITE!F46=\"oui\",DISPONIBILITE!$E46,\"\")","v":"LE CORRE  Jérémy"},{"$f":"IF(DISPONIBILITE!G46=\"oui\",DISPONIBILITE!$E46,\"\")","v":"LE CORRE  Jérémy"},{"$f":"IF(DISPONIBILITE!H46=\"oui\",DISPONIBILITE!$E46,\"\")","v":"LE CORRE  Jérémy"},{"$f":"IF(DISPONIBILITE!I46=\"oui\",DISPONIBILITE!$E46,\"\")","v":"LE CORRE  Jérémy"},{"$f":"IF(DISPONIBILITE!J46=\"oui\",DISPONIBILITE!$E46,\"\")","v":"LE CORRE  Jérémy"},{"$f":"IF(DISPONIBILITE!K46=\"oui\",DISPONIBILITE!$E46,\"\")","v":"LE CORRE  Jérémy"},{"$f":"IF(DISPONIBILITE!L46=\"oui\",DISPONIBILITE!$E46,\"\")","v":"LE CORRE  Jérémy"},{"$f":"IF(DISPONIBILITE!M46=\"oui\",DISPONIBILITE!$E46,\"\")","v":"LE CORRE  Jérémy"},{"$f":"IF(DISPONIBILITE!N46=\"oui\",DISPONIBILITE!$E46,\"\")","v":"LE CORRE  Jérémy"},{"$f":"IF(DISPONIBILITE!O46=\"oui\",DISPONIBILITE!$E46,\"\")","v":"LE CORRE  Jérémy"},{"$f":"IF(DISPONIBILITE!P46=\"oui\",DISPONIBILITE!$E46,\"\")","v":"LE CORRE  Jérémy"},{"$f":"IF(DISPONIBILITE!Q46=\"oui\",DISPONIBILITE!$E46,\"\")","v":"LE CORRE  Jérémy"},{"$f":"IF(DISPONIBILITE!R46=\"oui\",DISPONIBILITE!$E46,\"\")","v":""},{"$f":"IF(DISPONIBILITE!S46=\"oui\",DISPONIBILITE!$E46,\"\")","v":""},{"$f":"IF(DISPONIBILITE!T46=\"oui\",DISPONIBILITE!$E46,\"\")","v":""},{"$f":"IF(DISPONIBILITE!U46=\"oui\",DISPONIBILITE!$E46,\"\")","v":"LE CORRE  Jérémy"},{"$f":"IF(DISPONIBILITE!V46=\"oui\",DISPONIBILITE!$E46,\"\")","v":"LE CORRE  Jérémy"},{"$f":"IF(DISPONIBILITE!W46=\"oui\",DISPONIBILITE!$E46,\"\")","v":"LE CORRE  Jérémy"}]
[{"$f":"IF(DISPONIBILITE!F47=\"oui\",DISPONIBILITE!$E47,\"\")","v":"LE GALL Yves"},{"$f":"IF(DISPONIBILITE!G47=\"oui\",DISPONIBILITE!$E47,\"\")","v":"LE GALL Yves"},{"$f":"IF(DISPONIBILITE!H47=\"oui\",DISPONIBILITE!$E47,\"\")","v":""},{"$f":"IF(DISPONIBILITE!I47=\"oui\",DISPONIBILITE!$E47,\"\")","v":"LE GALL Yves"},{"$f":"IF(DISPONIBILITE!J47=\"oui\",DISPONIBILITE!$E47,\"\")","v":"LE GALL Yves"},{"$f":"IF(DISPONIBILITE!K47=\"oui\",DISPONIBILITE!$E47,\"\")","v":""},{"$f":"IF(DISPONIBILITE!L47=\"oui\",DISPONIBILITE!$E47,\"\")","v":"LE GALL Yves"},{"$f":"IF(DISPONIBILITE!M47=\"oui\",DISPONIBILITE!$E47,\"\")","v":"LE GALL Yves"},{"$f":"IF(DISPONIBILITE!N47=\"oui\",DISPONIBILITE!$E47,\"\")","v":""},{"$f":"IF(DISPONIBILITE!O47=\"oui\",DISPONIBILITE!$E47,\"\")","v":""},{"$f":"IF(DISPONIBILITE!P47=\"oui\",DISPONIBILITE!$E47,\"\")","v":""},{"$f":"IF(DISPONIBILITE!Q47=\"oui\",DISPONIBILITE!$E47,\"\")","v":""},{"$f":"IF(DISPONIBILITE!R47=\"oui\",DISPONIBILITE!$E47,\"\")","v":"LE GALL Yves"},{"$f":"IF(DISPONIBILITE!S47=\"oui\",DISPONIBILITE!$E47,\"\")","v":"LE GALL Yves"},{"$f":"IF(DISPONIBILITE!T47=\"oui\",DISPONIBILITE!$E47,\"\")","v":""},{"$f":"IF(DISPONIBILITE!U47=\"oui\",DISPONIBILITE!$E47,\"\")","v":"LE GALL Yves"},{"$f":"IF(DISPONIBILITE!V47=\"oui\",DISPONIBILITE!$E47,\"\")","v":"LE GALL Yves"},{"$f":"IF(DISPONIBILITE!W47=\"oui\",DISPONIBILITE!$E47,\"\")","v":"LE GALL Yves"}]
[{"$f":"IF(DISPONIBILITE!F48=\"oui\",DISPONIBILITE!$E48,\"\")","v":"LE ROUX Stéphanie"},{"$f":"IF(DISPONIBILITE!G48=\"oui\",DISPONIBILITE!$E48,\"\")","v":""},{"$f":"IF(DISPONIBILITE!H48=\"oui\",DISPONIBILITE!$E48,\"\")","v":""},{"$f":"IF(DISPONIBILITE!I48=\"oui\",DISPONIBILITE!$E48,\"\")","v":""},{"$f":"IF(DISPONIBILITE!J48=\"oui\",DISPONIBILITE!$E48,\"\")","v":"LE ROUX Stéphanie"},{"$f":"IF(DISPONIBILITE!K48=\"oui\",DISPONIBILITE!$E48,\"\")","v":"LE ROUX Stéphanie"},{"$f":"IF(DISPONIBILITE!L48=\"oui\",DISPONIBILITE!$E48,\"\")","v":""},{"$f":"IF(DISPONIBILITE!M48=\"oui\",DISPONIBILITE!$E48,\"\")","v":""},{"$f":"IF(DISPONIBILITE!N48=\"oui\",DISPONIBILITE!$E48,\"\")","v":""},{"$f":"IF(DISPONIBILITE!O48=\"oui\",DISPONIBILITE!$E48,\"\")","v":""},{"$f":"IF(DISPONIBILITE!P48=\"oui\",DISPONIBILITE!$E48,\"\")","v":""},{"$f":"IF(DISPONIBILITE!Q48=\"oui\",DISPONIBILITE!$E48,\"\")","v":""},{"$f":"IF(DISPONIBILITE!R48=\"oui\",DISPONIBILITE!$E48,\"\")","v":""},{"$f":"IF(DISPONIBILITE!S48=\"oui\",DISPONIBILITE!$E48,\"\")","v":"LE ROUX Stéphanie"},{"$f":"IF(DISPONIBILITE!T48=\"oui\",DISPONIBILITE!$E48,\"\")","v":"LE ROUX Stéphanie"},{"$f":"IF(DISPONIBILITE!U48=\"oui\",DISPONIBILITE!$E48,\"\")","v":""},{"$f":"IF(DISPONIBILITE!V48=\"oui\",DISPONIBILITE!$E48,\"\")","v":""},{"$f":"IF(DISPONIBILITE!W48=\"oui\",DISPONIBILITE!$E48,\"\")","v":""}]
[{"$f":"IF(DISPONIBILITE!F49=\"oui\",DISPONIBILITE!$E49,\"\")","v":""},{"$f":"IF(DISPONIBILITE!G49=\"oui\",DISPONIBILITE!$E49,\"\")","v":"LE ROY  Julian"},{"$f":"IF(DISPONIBILITE!H49=\"oui\",DISPONIBILITE!$E49,\"\")","v":"LE ROY  Julian"},{"$f":"IF(DISPONIBILITE!I49=\"oui\",DISPONIBILITE!$E49,\"\")","v":""},{"$f":"IF(DISPONIBILITE!J49=\"oui\",DISPONIBILITE!$E49,\"\")","v":"LE ROY  Julian"},{"$f":"IF(DISPONIBILITE!K49=\"oui\",DISPONIBILITE!$E49,\"\")","v":"LE ROY  Julian"},{"$f":"IF(DISPONIBILITE!L49=\"oui\",DISPONIBILITE!$E49,\"\")","v":""},{"$f":"IF(DISPONIBILITE!M49=\"oui\",DISPONIBILITE!$E49,\"\")","v":"LE ROY  Julian"},{"$f":"IF(DISPONIBILITE!N49=\"oui\",DISPONIBILITE!$E49,\"\")","v":"LE ROY  Julian"},{"$f":"IF(DISPONIBILITE!O49=\"oui\",DISPONIBILITE!$E49,\"\")","v":""},{"$f":"IF(DISPONIBILITE!P49=\"oui\",DISPONIBILITE!$E49,\"\")","v":"LE ROY  Julian"},{"$f":"IF(DISPONIBILITE!Q49=\"oui\",DISPONIBILITE!$E49,\"\")","v":"LE ROY  Julian"},{"$f":"IF(DISPONIBILITE!R49=\"oui\",DISPONIBILITE!$E49,\"\")","v":""},{"$f":"IF(DISPONIBILITE!S49=\"oui\",DISPONIBILITE!$E49,\"\")","v":"LE ROY  Julian"},{"$f":"IF(DISPONIBILITE!T49=\"oui\",DISPONIBILITE!$E49,\"\")","v":"LE ROY  Julian"},{"$f":"IF(DISPONIBILITE!U49=\"oui\",DISPONIBILITE!$E49,\"\")","v":"LE ROY  Julian"},{"$f":"IF(DISPONIBILITE!V49=\"oui\",DISPONIBILITE!$E49,\"\")","v":"LE ROY  Julian"},{"$f":"IF(DISPONIBILITE!W49=\"oui\",DISPONIBILITE!$E49,\"\")","v":"LE ROY  Julian"}]
[{"$f":"IF(DISPONIBILITE!F50=\"oui\",DISPONIBILITE!$E50,\"\")","v":""},{"$f":"IF(DISPONIBILITE!G50=\"oui\",DISPONIBILITE!$E50,\"\")","v":""},{"$f":"IF(DISPONIBILITE!H50=\"oui\",DISPONIBILITE!$E50,\"\")","v":""},{"$f":"IF(DISPONIBILITE!I50=\"oui\",DISPONIBILITE!$E50,\"\")","v":""},{"$f":"IF(DISPONIBILITE!J50=\"oui\",DISPONIBILITE!$E50,\"\")","v":""},{"$f":"IF(DISPONIBILITE!K50=\"oui\",DISPONIBILITE!$E50,\"\")","v":""},{"$f":"IF(DISPONIBILITE!L50=\"oui\",DISPONIBILITE!$E50,\"\")","v":""},{"$f":"IF(DISPONIBILITE!M50=\"oui\",DISPONIBILITE!$E50,\"\")","v":""},{"$f":"IF(DISPONIBILITE!N50=\"oui\",DISPONIBILITE!$E50,\"\")","v":""},{"$f":"IF(DISPONIBILITE!O50=\"oui\",DISPONIBILITE!$E50,\"\")","v":""},{"$f":"IF(DISPONIBILITE!P50=\"oui\",DISPONIBILITE!$E50,\"\")","v":""},{"$f":"IF(DISPONIBILITE!Q50=\"oui\",DISPONIBILITE!$E50,\"\")","v":""},{"$f":"IF(DISPONIBILITE!R50=\"oui\",DISPONIBILITE!$E50,\"\")","v":"LE ROY (THG) Christelle"},{"$f":"IF(DISPONIBILITE!S50=\"oui\",DISPONIBILITE!$E50,\"\")","v":"LE ROY (THG) Christelle"},{"$f":"IF(DISPONIBILITE!T50=\"oui\",DISPONIBILITE!$E50,\"\")","v":""},{"$f":"IF(DISPONIBILITE!U50=\"oui\",DISPONIBILITE!$E50,\"\")","v":""},{"$f":"IF(DISPONIBILITE!V50=\"oui\",DISPONIBILITE!$E50,\"\")","v":""},{"$f":"IF(DISPONIBILITE!W50=\"oui\",DISPONIBILITE!$E50,\"\")","v":""}]
[{"$f":"IF(DISPONIBILITE!F51=\"oui\",DISPONIBILITE!$E51,\"\")","v":""},{"$f":"IF(DISPONIBILITE!G51=\"oui\",DISPONIBILITE!$E51,\"\")","v":""},{"$f":"IF(DISPONIBILITE!H51=\"oui\",DISPONIBILITE!$E51,\"\")","v":""},{"$f":"IF(DISPONIBILITE!I51=\"oui\",DISPONIBILITE!$E51,\"\")","v":"LECHAT Loïc"},{"$f":"IF(DISPONIBILITE!J51=\"oui\",DISPONIBILITE!$E51,\"\")","v":""},{"$f":"IF(DISPONIBILITE!K51=\"oui\",DISPONIBILITE!$E51,\"\")","v":""},{"$f":"IF(DISPONIBILITE!L51=\"oui\",DISPONIBILITE!$E51,\"\")","v":""},{"$f":"IF(DISPONIBILITE!M51=\"oui\",DISPONIBILITE!$E51,\"\")","v":""},{"$f":"IF(DISPONIBILITE!N51=\"oui\",DISPONIBILITE!$E51,\"\")","v":""},{"$f":"IF(DISPONIBILITE!O51=\"oui\",DISPONIBILITE!$E51,\"\")","v":""},{"$f":"IF(DISPONIBILITE!P51=\"oui\",DISPONIBILITE!$E51,\"\")","v":""},{"$f":"IF(DISPONIBILITE!Q51=\"oui\",DISPONIBILITE!$E51,\"\")","v":"LECHAT Loïc"},{"$f":"IF(DISPONIBILITE!R51=\"oui\",DISPONIBILITE!$E51,\"\")","v":""},{"$f":"IF(DISPONIBILITE!S51=\"oui\",DISPONIBILITE!$E51,\"\")","v":""},{"$f":"IF(DISPONIBILITE!T51=\"oui\",DISPONIBILITE!$E51,\"\")","v":""},{"$f":"IF(DISPONIBILITE!U51=\"oui\",DISPONIBILITE!$E51,\"\")","v":""},{"$f":"IF(DISPONIBILITE!V51=\"oui\",DISPONIBILITE!$E51,\"\")","v":"LECHAT Loïc"},{"$f":"IF(DISPONIBILITE!W51=\"oui\",DISPONIBILITE!$E51,\"\")","v":""}]
[{"$f":"IF(DISPONIBILITE!F52=\"oui\",DISPONIBILITE!$E52,\"\")","v":""},{"$f":"IF(DISPONIBILITE!G52=\"oui\",DISPONIBILITE!$E52,\"\")","v":""},{"$f":"IF(DISPONIBILITE!H52=\"oui\",DISPONIBILITE!$E52,\"\")","v":""},{"$f":"IF(DISPONIBILITE!I52=\"oui\",DISPONIBILITE!$E52,\"\")","v":""},{"$f":"IF(DISPONIBILITE!J52=\"oui\",DISPONIBILITE!$E52,\"\")","v":""},{"$f":"IF(DISPONIBILITE!K52=\"oui\",DISPONIBILITE!$E52,\"\")","v":""},{"$f":"IF(DISPONIBILITE!L52=\"oui\",DISPONIBILITE!$E52,\"\")","v":"LOPIN Jacky"},{"$f":"IF(DISPONIBILITE!M52=\"oui\",DISPONIBILITE!$E52,\"\")","v":""},{"$f":"IF(DISPONIBILITE!N52=\"oui\",DISPONIBILITE!$E52,\"\")","v":""},{"$f":"IF(DISPONIBILITE!O52=\"oui\",DISPONIBILITE!$E52,\"\")","v":""},{"$f":"IF(DISPONIBILITE!P52=\"oui\",DISPONIBILITE!$E52,\"\")","v":"LOPIN Jacky"},{"$f":"IF(DISPONIBILITE!Q52=\"oui\",DISPONIBILITE!$E52,\"\")","v":""},{"$f":"IF(DISPONIBILITE!R52=\"oui\",DISPONIBILITE!$E52,\"\")","v":""},{"$f":"IF(DISPONIBILITE!S52=\"oui\",DISPONIBILITE!$E52,\"\")","v":"LOPIN Jacky"},{"$f":"IF(DISPONIBILITE!T52=\"oui\",DISPONIBILITE!$E52,\"\")","v":""},{"$f":"IF(DISPONIBILITE!U52=\"oui\",DISPONIBILITE!$E52,\"\")","v":"LOPIN Jacky"},{"$f":"IF(DISPONIBILITE!V52=\"oui\",DISPONIBILITE!$E52,\"\")","v":"LOPIN Jacky"},{"$f":"IF(DISPONIBILITE!W52=\"oui\",DISPONIBILITE!$E52,\"\")","v":"LOPIN Jacky"}]
[{"$f":"IF(DISPONIBILITE!F53=\"oui\",DISPONIBILITE!$E53,\"\")","v":"MALANDAIN Manuela"},{"$f":"IF(DISPONIBILITE!G53=\"oui\",DISPONIBILITE!$E53,\"\")","v":"MALANDAIN Manuela"},{"$f":"IF(DISPONIBILITE!H53=\"oui\",DISPONIBILITE!$E53,\"\")","v":""},{"$f":"IF(DISPONIBILITE!I53=\"oui\",DISPONIBILITE!$E53,\"\")","v":"MALANDAIN Manuela"},{"$f":"IF(DISPONIBILITE!J53=\"oui\",DISPONIBILITE!$E53,\"\")","v":"MALANDAIN Manuela"},{"$f":"IF(DISPONIBILITE!K53=\"oui\",DISPONIBILITE!$E53,\"\")","v":"MALANDAIN Manuela"},{"$f":"IF(DISPONIBILITE!L53=\"oui\",DISPONIBILITE!$E53,\"\")","v":"MALANDAIN Manuela"},{"$f":"IF(DISPONIBILITE!M53=\"oui\",DISPONIBILITE!$E53,\"\")","v":"MALANDAIN Manuela"},{"$f":"IF(DISPONIBILITE!N53=\"oui\",DISPONIBILITE!$E53,\"\")","v":""},{"$f":"IF(DISPONIBILITE!O53=\"oui\",DISPONIBILITE!$E53,\"\")","v":"MALANDAIN Manuela"},{"$f":"IF(DISPONIBILITE!P53=\"oui\",DISPONIBILITE!$E53,\"\")","v":"MALANDAIN Manuela"},{"$f":"IF(DISPONIBILITE!Q53=\"oui\",DISPONIBILITE!$E53,\"\")","v":"MALANDAIN Manuela"},{"$f":"IF(DISPONIBILITE!R53=\"oui\",DISPONIBILITE!$E53,\"\")","v":""},{"$f":"IF(DISPONIBILITE!S53=\"oui\",DISPONIBILITE!$E53,\"\")","v":""},{"$f":"IF(DISPONIBILITE!T53=\"oui\",DISPONIBILITE!$E53,\"\")","v":""},{"$f":"IF(DISPONIBILITE!U53=\"oui\",DISPONIBILITE!$E53,\"\")","v":"MALANDAIN Manuela"},{"$f":"IF(DISPONIBILITE!V53=\"oui\",DISPONIBILITE!$E53,\"\")","v":"MALANDAIN Manuela"},{"$f":"IF(DISPONIBILITE!W53=\"oui\",DISPONIBILITE!$E53,\"\")","v":"MALANDAIN Manuela"}]
[{"$f":"IF(DISPONIBILITE!F54=\"oui\",DISPONIBILITE!$E54,\"\")","v":"MARCHE Sophie"},{"$f":"IF(DISPONIBILITE!G54=\"oui\",DISPONIBILITE!$E54,\"\")","v":"MARCHE Sophie"},{"$f":"IF(DISPONIBILITE!H54=\"oui\",DISPONIBILITE!$E54,\"\")","v":"MARCHE Sophie"},{"$f":"IF(DISPONIBILITE!I54=\"oui\",DISPONIBILITE!$E54,\"\")","v":"MARCHE Sophie"},{"$f":"IF(DISPONIBILITE!J54=\"oui\",DISPONIBILITE!$E54,\"\")","v":"MARCHE Sophie"},{"$f":"IF(DISPONIBILITE!K54=\"oui\",DISPONIBILITE!$E54,\"\")","v":"MARCHE Sophie"},{"$f":"IF(DISPONIBILITE!L54=\"oui\",DISPONIBILITE!$E54,\"\")","v":"MARCHE Sophie"},{"$f":"IF(DISPONIBILITE!M54=\"oui\",DISPONIBILITE!$E54,\"\")","v":"MARCHE Sophie"},{"$f":"IF(DISPONIBILITE!N54=\"oui\",DISPONIBILITE!$E54,\"\")","v":"MARCHE Sophie"},{"$f":"IF(DISPONIBILITE!O54=\"oui\",DISPONIBILITE!$E54,\"\")","v":"MARCHE Sophie"},{"$f":"IF(DISPONIBILITE!P54=\"oui\",DISPONIBILITE!$E54,\"\")","v":"MARCHE Sophie"},{"$f":"IF(DISPONIBILITE!Q54=\"oui\",DISPONIBILITE!$E54,\"\")","v":"MARCHE Sophie"},{"$f":"IF(DISPONIBILITE!R54=\"oui\",DISPONIBILITE!$E54,\"\")","v":"MARCHE Sophie"},{"$f":"IF(DISPONIBILITE!S54=\"oui\",DISPONIBILITE!$E54,\"\")","v":"MARCHE Sophie"},{"$f":"IF(DISPONIBILITE!T54=\"oui\",DISPONIBILITE!$E54,\"\")","v":"MARCHE Sophie"},{"$f":"IF(DISPONIBILITE!U54=\"oui\",DISPONIBILITE!$E54,\"\")","v":"MARCHE Sophie"},{"$f":"IF(DISPONIBILITE!V54=\"oui\",DISPONIBILITE!$E54,\"\")","v":"MARCHE Sophie"},{"$f":"IF(DISPONIBILITE!W54=\"oui\",DISPONIBILITE!$E54,\"\")","v":"MARCHE Sophie"}]
[{"$f":"IF(DISPONIBILITE!F55=\"oui\",DISPONIBILITE!$E55,\"\")","v":""},{"$f":"IF(DISPONIBILITE!G55=\"oui\",DISPONIBILITE!$E55,\"\")","v":""},{"$f":"IF(DISPONIBILITE!H55=\"oui\",DISPONIBILITE!$E55,\"\")","v":""},{"$f":"IF(DISPONIBILITE!I55=\"oui\",DISPONIBILITE!$E55,\"\")","v":""},{"$f":"IF(DISPONIBILITE!J55=\"oui\",DISPONIBILITE!$E55,\"\")","v":""},{"$f":"IF(DISPONIBILITE!K55=\"oui\",DISPONIBILITE!$E55,\"\")","v":"MIGLIACCIO Claire"},{"$f":"IF(DISPONIBILITE!L55=\"oui\",DISPONIBILITE!$E55,\"\")","v":""},{"$f":"IF(DISPONIBILITE!M55=\"oui\",DISPONIBILITE!$E55,\"\")","v":""},{"$f":"IF(DISPONIBILITE!N55=\"oui\",DISPONIBILITE!$E55,\"\")","v":""},{"$f":"IF(DISPONIBILITE!O55=\"oui\",DISPONIBILITE!$E55,\"\")","v":""},{"$f":"IF(DISPONIBILITE!P55=\"oui\",DISPONIBILITE!$E55,\"\")","v":""},{"$f":"IF(DISPONIBILITE!Q55=\"oui\",DISPONIBILITE!$E55,\"\")","v":"MIGLIACCIO Claire"},{"$f":"IF(DISPONIBILITE!R55=\"oui\",DISPONIBILITE!$E55,\"\")","v":""},{"$f":"IF(DISPONIBILITE!S55=\"oui\",DISPONIBILITE!$E55,\"\")","v":""},{"$f":"IF(DISPONIBILITE!T55=\"oui\",DISPONIBILITE!$E55,\"\")","v":"MIGLIACCIO Claire"},{"$f":"IF(DISPONIBILITE!U55=\"oui\",DISPONIBILITE!$E55,\"\")","v":""},{"$f":"IF(DISPONIBILITE!V55=\"oui\",DISPONIBILITE!$E55,\"\")","v":"MIGLIACCIO Claire"},{"$f":"IF(DISPONIBILITE!W55=\"oui\",DISPONIBILITE!$E55,\"\")","v":"MIGLIACCIO Claire"}]
[{"$f":"IF(DISPONIBILITE!F56=\"oui\",DISPONIBILITE!$E56,\"\")","v":"MOAL Alain"},{"$f":"IF(DISPONIBILITE!G56=\"oui\",DISPONIBILITE!$E56,\"\")","v":"MOAL Alain"},{"$f":"IF(DISPONIBILITE!H56=\"oui\",DISPONIBILITE!$E56,\"\")","v":"MOAL Alain"},{"$f":"IF(DISPONIBILITE!I56=\"oui\",DISPONIBILITE!$E56,\"\")","v":"MOAL Alain"},{"$f":"IF(DISPONIBILITE!J56=\"oui\",DISPONIBILITE!$E56,\"\")","v":"MOAL Alain"},{"$f":"IF(DISPONIBILITE!K56=\"oui\",DISPONIBILITE!$E56,\"\")","v":"MOAL Alain"},{"$f":"IF(DISPONIBILITE!L56=\"oui\",DISPONIBILITE!$E56,\"\")","v":"MOAL Alain"},{"$f":"IF(DISPONIBILITE!M56=\"oui\",DISPONIBILITE!$E56,\"\")","v":"MOAL Alain"},{"$f":"IF(DISPONIBILITE!N56=\"oui\",DISPONIBILITE!$E56,\"\")","v":"MOAL Alain"},{"$f":"IF(DISPONIBILITE!O56=\"oui\",DISPONIBILITE!$E56,\"\")","v":"MOAL Alain"},{"$f":"IF(DISPONIBILITE!P56=\"oui\",DISPONIBILITE!$E56,\"\")","v":"MOAL Alain"},{"$f":"IF(DISPONIBILITE!Q56=\"oui\",DISPONIBILITE!$E56,\"\")","v":"MOAL Alain"},{"$f":"IF(DISPONIBILITE!R56=\"oui\",DISPONIBILITE!$E56,\"\")","v":"MOAL Alain"},{"$f":"IF(DISPONIBILITE!S56=\"oui\",DISPONIBILITE!$E56,\"\")","v":"MOAL Alain"},{"$f":"IF(DISPONIBILITE!T56=\"oui\",DISPONIBILITE!$E56,\"\")","v":"MOAL Alain"},{"$f":"IF(DISPONIBILITE!U56=\"oui\",DISPONIBILITE!$E56,\"\")","v":"MOAL Alain"},{"$f":"IF(DISPONIBILITE!V56=\"oui\",DISPONIBILITE!$E56,\"\")","v":"MOAL Alain"},{"$f":"IF(DISPONIBILITE!W56=\"oui\",DISPONIBILITE!$E56,\"\")","v":"MOAL Alain"}]
[{"$f":"IF(DISPONIBILITE!F57=\"oui\",DISPONIBILITE!$E57,\"\")","v":"NHEK (K) Alexandrine"},{"$f":"IF(DISPONIBILITE!G57=\"oui\",DISPONIBILITE!$E57,\"\")","v":"NHEK (K) Alexandrine"},{"$f":"IF(DISPONIBILITE!H57=\"oui\",DISPONIBILITE!$E57,\"\")","v":""},{"$f":"IF(DISPONIBILITE!I57=\"oui\",DISPONIBILITE!$E57,\"\")","v":"NHEK (K) Alexandrine"},{"$f":"IF(DISPONIBILITE!J57=\"oui\",DISPONIBILITE!$E57,\"\")","v":"NHEK (K) Alexandrine"},{"$f":"IF(DISPONIBILITE!K57=\"oui\",DISPONIBILITE!$E57,\"\")","v":""},{"$f":"IF(DISPONIBILITE!L57=\"oui\",DISPONIBILITE!$E57,\"\")","v":""},{"$f":"IF(DISPONIBILITE!M57=\"oui\",DISPONIBILITE!$E57,\"\")","v":""},{"$f":"IF(DISPONIBILITE!N57=\"oui\",DISPONIBILITE!$E57,\"\")","v":""},{"$f":"IF(DISPONIBILITE!O57=\"oui\",DISPONIBILITE!$E57,\"\")","v":"NHEK (K) Alexandrine"},{"$f":"IF(DISPONIBILITE!P57=\"oui\",DISPONIBILITE!$E57,\"\")","v":"NHEK (K) Alexandrine"},{"$f":"IF(DISPONIBILITE!Q57=\"oui\",DISPONIBILITE!$E57,\"\")","v":""},{"$f":"IF(DISPONIBILITE!R57=\"oui\",DISPONIBILITE!$E57,\"\")","v":"NHEK (K) Alexandrine"},{"$f":"IF(DISPONIBILITE!S57=\"oui\",DISPONIBILITE!$E57,\"\")","v":"NHEK (K) Alexandrine"},{"$f":"IF(DISPONIBILITE!T57=\"oui\",DISPONIBILITE!$E57,\"\")","v":""},{"$f":"IF(DISPONIBILITE!U57=\"oui\",DISPONIBILITE!$E57,\"\")","v":""},{"$f":"IF(DISPONIBILITE!V57=\"oui\",DISPONIBILITE!$E57,\"\")","v":""},{"$f":"IF(DISPONIBILITE!W57=\"oui\",DISPONIBILITE!$E57,\"\")","v":""}]
[{"$f":"IF(DISPONIBILITE!F58=\"oui\",DISPONIBILITE!$E58,\"\")","v":""},{"$f":"IF(DISPONIBILITE!G58=\"oui\",DISPONIBILITE!$E58,\"\")","v":""},{"$f":"IF(DISPONIBILITE!H58=\"oui\",DISPONIBILITE!$E58,\"\")","v":""},{"$f":"IF(DISPONIBILITE!I58=\"oui\",DISPONIBILITE!$E58,\"\")","v":""},{"$f":"IF(DISPONIBILITE!J58=\"oui\",DISPONIBILITE!$E58,\"\")","v":""},{"$f":"IF(DISPONIBILITE!K58=\"oui\",DISPONIBILITE!$E58,\"\")","v":""},{"$f":"IF(DISPONIBILITE!L58=\"oui\",DISPONIBILITE!$E58,\"\")","v":"PARISSE (THG) Amélie"},{"$f":"IF(DISPONIBILITE!M58=\"oui\",DISPONIBILITE!$E58,\"\")","v":"PARISSE (THG) Amélie"},{"$f":"IF(DISPONIBILITE!N58=\"oui\",DISPONIBILITE!$E58,\"\")","v":""},{"$f":"IF(DISPONIBILITE!O58=\"oui\",DISPONIBILITE!$E58,\"\")","v":"PARISSE (THG) Amélie"},{"$f":"IF(DISPONIBILITE!P58=\"oui\",DISPONIBILITE!$E58,\"\")","v":"PARISSE (THG) Amélie"},{"$f":"IF(DISPONIBILITE!Q58=\"oui\",DISPONIBILITE!$E58,\"\")","v":""},{"$f":"IF(DISPONIBILITE!R58=\"oui\",DISPONIBILITE!$E58,\"\")","v":""},{"$f":"IF(DISPONIBILITE!S58=\"oui\",DISPONIBILITE!$E58,\"\")","v":""},{"$f":"IF(DISPONIBILITE!T58=\"oui\",DISPONIBILITE!$E58,\"\")","v":""},{"$f":"IF(DISPONIBILITE!U58=\"oui\",DISPONIBILITE!$E58,\"\")","v":""},{"$f":"IF(DISPONIBILITE!V58=\"oui\",DISPONIBILITE!$E58,\"\")","v":""},{"$f":"IF(DISPONIBILITE!W58=\"oui\",DISPONIBILITE!$E58,\"\")","v":""}]
[{"$f":"IF(DISPONIBILITE!F59=\"oui\",DISPONIBILITE!$E59,\"\")","v":""},{"$f":"IF(DISPONIBILITE!G59=\"oui\",DISPONIBILITE!$E59,\"\")","v":"PLOUZENNEC Nadine"},{"$f":"IF(DISPONIBILITE!H59=\"oui\",DISPONIBILITE!$E59,\"\")","v":"PLOUZENNEC Nadine"},{"$f":"IF(DISPONIBILITE!I59=\"oui\",DISPONIBILITE!$E59,\"\")","v":""},{"$f":"IF(DISPONIBILITE!J59=\"oui\",DISPONIBILITE!$E59,\"\")","v":"PLOUZENNEC Nadine"},{"$f":"IF(DISPONIBILITE!K59=\"oui\",DISPONIBILITE!$E59,\"\")","v":"PLOUZENNEC Nadine"},{"$f":"IF(DISPONIBILITE!L59=\"oui\",DISPONIBILITE!$E59,\"\")","v":""},{"$f":"IF(DISPONIBILITE!M59=\"oui\",DISPONIBILITE!$E59,\"\")","v":"PLOUZENNEC Nadine"},{"$f":"IF(DISPONIBILITE!N59=\"oui\",DISPONIBILITE!$E59,\"\")","v":"PLOUZENNEC Nadine"},{"$f":"IF(DISPONIBILITE!O59=\"oui\",DISPONIBILITE!$E59,\"\")","v":""},{"$f":"IF(DISPONIBILITE!P59=\"oui\",DISPONIBILITE!$E59,\"\")","v":"PLOUZENNEC Nadine"},{"$f":"IF(DISPONIBILITE!Q59=\"oui\",DISPONIBILITE!$E59,\"\")","v":"PLOUZENNEC Nadine"},{"$f":"IF(DISPONIBILITE!R59=\"oui\",DISPONIBILITE!$E59,\"\")","v":""},{"$f":"IF(DISPONIBILITE!S59=\"oui\",DISPONIBILITE!$E59,\"\")","v":"PLOUZENNEC Nadine"},{"$f":"IF(DISPONIBILITE!T59=\"oui\",DISPONIBILITE!$E59,\"\")","v":"PLOUZENNEC Nadine"},{"$f":"IF(DISPONIBILITE!U59=\"oui\",DISPONIBILITE!$E59,\"\")","v":""},{"$f":"IF(DISPONIBILITE!V59=\"oui\",DISPONIBILITE!$E59,\"\")","v":"PLOUZENNEC Nadine"},{"$f":"IF(DISPONIBILITE!W59=\"oui\",DISPONIBILITE!$E59,\"\")","v":"PLOUZENNEC Nadine"}]
[{"$f":"IF(DISPONIBILITE!F60=\"oui\",DISPONIBILITE!$E60,\"\")","v":"RAFFO Carine"},{"$f":"IF(DISPONIBILITE!G60=\"oui\",DISPONIBILITE!$E60,\"\")","v":"RAFFO Carine"},{"$f":"IF(DISPONIBILITE!H60=\"oui\",DISPONIBILITE!$E60,\"\")","v":"RAFFO Carine"},{"$f":"IF(DISPONIBILITE!I60=\"oui\",DISPONIBILITE!$E60,\"\")","v":"RAFFO Carine"},{"$f":"IF(DISPONIBILITE!J60=\"oui\",DISPONIBILITE!$E60,\"\")","v":"RAFFO Carine"},{"$f":"IF(DISPONIBILITE!K60=\"oui\",DISPONIBILITE!$E60,\"\")","v":"RAFFO Carine"},{"$f":"IF(DISPONIBILITE!L60=\"oui\",DISPONIBILITE!$E60,\"\")","v":"RAFFO Carine"},{"$f":"IF(DISPONIBILITE!M60=\"oui\",DISPONIBILITE!$E60,\"\")","v":"RAFFO Carine"},{"$f":"IF(DISPONIBILITE!N60=\"oui\",DISPONIBILITE!$E60,\"\")","v":"RAFFO Carine"},{"$f":"IF(DISPONIBILITE!O60=\"oui\",DISPONIBILITE!$E60,\"\")","v":"RAFFO Carine"},{"$f":"IF(DISPONIBILITE!P60=\"oui\",DISPONIBILITE!$E60,\"\")","v":"RAFFO Carine"},{"$f":"IF(DISPONIBILITE!Q60=\"oui\",DISPONIBILITE!$E60,\"\")","v":"RAFFO Carine"},{"$f":"IF(DISPONIBILITE!R60=\"oui\",DISPONIBILITE!$E60,\"\")","v":"RAFFO Carine"},{"$f":"IF(DISPONIBILITE!S60=\"oui\",DISPONIBILITE!$E60,\"\")","v":"RAFFO Carine"},{"$f":"IF(DISPONIBILITE!T60=\"oui\",DISPONIBILITE!$E60,\"\")","v":"RAFFO Carine"},{"$f":"IF(DISPONIBILITE!U60=\"oui\",DISPONIBILITE!$E60,\"\")","v":"RAFFO Carine"},{"$f":"IF(DISPONIBILITE!V60=\"oui\",DISPONIBILITE!$E60,\"\")","v":"RAFFO Carine"},{"$f":"IF(DISPONIBILITE!W60=\"oui\",DISPONIBILITE!$E60,\"\")","v":"RAFFO Carine"}]
[{"$f":"IF(DISPONIBILITE!F61=\"oui\",DISPONIBILITE!$E61,\"\")","v":"RAMA (THG) Jurgen"},{"$f":"IF(DISPONIBILITE!G61=\"oui\",DISPONIBILITE!$E61,\"\")","v":"RAMA (THG) Jurgen"},{"$f":"IF(DISPONIBILITE!H61=\"oui\",DISPONIBILITE!$E61,\"\")","v":""},{"$f":"IF(DISPONIBILITE!I61=\"oui\",DISPONIBILITE!$E61,\"\")","v":"RAMA (THG) Jurgen"},{"$f":"IF(DISPONIBILITE!J61=\"oui\",DISPONIBILITE!$E61,\"\")","v":"RAMA (THG) Jurgen"},{"$f":"IF(DISPONIBILITE!K61=\"oui\",DISPONIBILITE!$E61,\"\")","v":""},{"$f":"IF(DISPONIBILITE!L61=\"oui\",DISPONIBILITE!$E61,\"\")","v":""},{"$f":"IF(DISPONIBILITE!M61=\"oui\",DISPONIBILITE!$E61,\"\")","v":""},{"$f":"IF(DISPONIBILITE!N61=\"oui\",DISPONIBILITE!$E61,\"\")","v":""},{"$f":"IF(DISPONIBILITE!O61=\"oui\",DISPONIBILITE!$E61,\"\")","v":""},{"$f":"IF(DISPONIBILITE!P61=\"oui\",DISPONIBILITE!$E61,\"\")","v":""},{"$f":"IF(DISPONIBILITE!Q61=\"oui\",DISPONIBILITE!$E61,\"\")","v":""},{"$f":"IF(DISPONIBILITE!R61=\"oui\",DISPONIBILITE!$E61,\"\")","v":""},{"$f":"IF(DISPONIBILITE!S61=\"oui\",DISPONIBILITE!$E61,\"\")","v":""},{"$f":"IF(DISPONIBILITE!T61=\"oui\",DISPONIBILITE!$E61,\"\")","v":""},{"$f":"IF(DISPONIBILITE!U61=\"oui\",DISPONIBILITE!$E61,\"\")","v":""},{"$f":"IF(DISPONIBILITE!V61=\"oui\",DISPONIBILITE!$E61,\"\")","v":""},{"$f":"IF(DISPONIBILITE!W61=\"oui\",DISPONIBILITE!$E61,\"\")","v":""}]
[{"$f":"IF(DISPONIBILITE!F62=\"oui\",DISPONIBILITE!$E62,\"\")","v":"RIHANI Mohamed"},{"$f":"IF(DISPONIBILITE!G62=\"oui\",DISPONIBILITE!$E62,\"\")","v":""},{"$f":"IF(DISPONIBILITE!H62=\"oui\",DISPONIBILITE!$E62,\"\")","v":""},{"$f":"IF(DISPONIBILITE!I62=\"oui\",DISPONIBILITE!$E62,\"\")","v":"RIHANI Mohamed"},{"$f":"IF(DISPONIBILITE!J62=\"oui\",DISPONIBILITE!$E62,\"\")","v":""},{"$f":"IF(DISPONIBILITE!K62=\"oui\",DISPONIBILITE!$E62,\"\")","v":""},{"$f":"IF(DISPONIBILITE!L62=\"oui\",DISPONIBILITE!$E62,\"\")","v":""},{"$f":"IF(DISPONIBILITE!M62=\"oui\",DISPONIBILITE!$E62,\"\")","v":""},{"$f":"IF(DISPONIBILITE!N62=\"oui\",DISPONIBILITE!$E62,\"\")","v":"RIHANI Mohamed"},{"$f":"IF(DISPONIBILITE!O62=\"oui\",DISPONIBILITE!$E62,\"\")","v":"RIHANI Mohamed"},{"$f":"IF(DISPONIBILITE!P62=\"oui\",DISPONIBILITE!$E62,\"\")","v":""},{"$f":"IF(DISPONIBILITE!Q62=\"oui\",DISPONIBILITE!$E62,\"\")","v":""},{"$f":"IF(DISPONIBILITE!R62=\"oui\",DISPONIBILITE!$E62,\"\")","v":""},{"$f":"IF(DISPONIBILITE!S62=\"oui\",DISPONIBILITE!$E62,\"\")","v":""},{"$f":"IF(DISPONIBILITE!T62=\"oui\",DISPONIBILITE!$E62,\"\")","v":"RIHANI Mohamed"},{"$f":"IF(DISPONIBILITE!U62=\"oui\",DISPONIBILITE!$E62,\"\")","v":""},{"$f":"IF(DISPONIBILITE!V62=\"oui\",DISPONIBILITE!$E62,\"\")","v":"RIHANI Mohamed"},{"$f":"IF(DISPONIBILITE!W62=\"oui\",DISPONIBILITE!$E62,\"\")","v":"RIHANI Mohamed"}]
[{"$f":"IF(DISPONIBILITE!F63=\"oui\",DISPONIBILITE!$E63,\"\")","v":""},{"$f":"IF(DISPONIBILITE!G63=\"oui\",DISPONIBILITE!$E63,\"\")","v":""},{"$f":"IF(DISPONIBILITE!H63=\"oui\",DISPONIBILITE!$E63,\"\")","v":""},{"$f":"IF(DISPONIBILITE!I63=\"oui\",DISPONIBILITE!$E63,\"\")","v":""},{"$f":"IF(DISPONIBILITE!J63=\"oui\",DISPONIBILITE!$E63,\"\")","v":""},{"$f":"IF(DISPONIBILITE!K63=\"oui\",DISPONIBILITE!$E63,\"\")","v":""},{"$f":"IF(DISPONIBILITE!L63=\"oui\",DISPONIBILITE!$E63,\"\")","v":""},{"$f":"IF(DISPONIBILITE!M63=\"oui\",DISPONIBILITE!$E63,\"\")","v":"RIVOAL Christian"},{"$f":"IF(DISPONIBILITE!N63=\"oui\",DISPONIBILITE!$E63,\"\")","v":""},{"$f":"IF(DISPONIBILITE!O63=\"oui\",DISPONIBILITE!$E63,\"\")","v":""},{"$f":"IF(DISPONIBILITE!P63=\"oui\",DISPONIBILITE!$E63,\"\")","v":""},{"$f":"IF(DISPONIBILITE!Q63=\"oui\",DISPONIBILITE!$E63,\"\")","v":""},{"$f":"IF(DISPONIBILITE!R63=\"oui\",DISPONIBILITE!$E63,\"\")","v":""},{"$f":"IF(DISPONIBILITE!S63=\"oui\",DISPONIBILITE!$E63,\"\")","v":"RIVOAL Christian"},{"$f":"IF(DISPONIBILITE!T63=\"oui\",DISPONIBILITE!$E63,\"\")","v":""},{"$f":"IF(DISPONIBILITE!U63=\"oui\",DISPONIBILITE!$E63,\"\")","v":""},{"$f":"IF(DISPONIBILITE!V63=\"oui\",DISPONIBILITE!$E63,\"\")","v":""},{"$f":"IF(DISPONIBILITE!W63=\"oui\",DISPONIBILITE!$E63,\"\")","v":"RIVOAL Christian"}]
[{"$f":"IF(DISPONIBILITE!F64=\"oui\",DISPONIBILITE!$E64,\"\")","v":"ROBERT Mireille"},{"$f":"IF(DISPONIBILITE!G64=\"oui\",DISPONIBILITE!$E64,\"\")","v":"ROBERT Mireille"},{"$f":"IF(DISPONIBILITE!H64=\"oui\",DISPONIBILITE!$E64,\"\")","v":"ROBERT Mireille"},{"$f":"IF(DISPONIBILITE!I64=\"oui\",DISPONIBILITE!$E64,\"\")","v":"ROBERT Mireille"},{"$f":"IF(DISPONIBILITE!J64=\"oui\",DISPONIBILITE!$E64,\"\")","v":"ROBERT Mireille"},{"$f":"IF(DISPONIBILITE!K64=\"oui\",DISPONIBILITE!$E64,\"\")","v":"ROBERT Mireille"},{"$f":"IF(DISPONIBILITE!L64=\"oui\",DISPONIBILITE!$E64,\"\")","v":"ROBERT Mireille"},{"$f":"IF(DISPONIBILITE!M64=\"oui\",DISPONIBILITE!$E64,\"\")","v":"ROBERT Mireille"},{"$f":"IF(DISPONIBILITE!N64=\"oui\",DISPONIBILITE!$E64,\"\")","v":"ROBERT Mireille"},{"$f":"IF(DISPONIBILITE!O64=\"oui\",DISPONIBILITE!$E64,\"\")","v":"ROBERT Mireille"},{"$f":"IF(DISPONIBILITE!P64=\"oui\",DISPONIBILITE!$E64,\"\")","v":"ROBERT Mireille"},{"$f":"IF(DISPONIBILITE!Q64=\"oui\",DISPONIBILITE!$E64,\"\")","v":"ROBERT Mireille"},{"$f":"IF(DISPONIBILITE!R64=\"oui\",DISPONIBILITE!$E64,\"\")","v":"ROBERT Mireille"},{"$f":"IF(DISPONIBILITE!S64=\"oui\",DISPONIBILITE!$E64,\"\")","v":"ROBERT Mireille"},{"$f":"IF(DISPONIBILITE!T64=\"oui\",DISPONIBILITE!$E64,\"\")","v":"ROBERT Mireille"},{"$f":"IF(DISPONIBILITE!U64=\"oui\",DISPONIBILITE!$E64,\"\")","v":"ROBERT Mireille"},{"$f":"IF(DISPONIBILITE!V64=\"oui\",DISPONIBILITE!$E64,\"\")","v":"ROBERT Mireille"},{"$f":"IF(DISPONIBILITE!W64=\"oui\",DISPONIBILITE!$E64,\"\")","v":"ROBERT Mireille"}]
[{"$f":"IF(DISPONIBILITE!F65=\"oui\",DISPONIBILITE!$E65,\"\")","v":""},{"$f":"IF(DISPONIBILITE!G65=\"oui\",DISPONIBILITE!$E65,\"\")","v":""},{"$f":"IF(DISPONIBILITE!H65=\"oui\",DISPONIBILITE!$E65,\"\")","v":"ROCHCONGAR Christelle"},{"$f":"IF(DISPONIBILITE!I65=\"oui\",DISPONIBILITE!$E65,\"\")","v":""},{"$f":"IF(DISPONIBILITE!J65=\"oui\",DISPONIBILITE!$E65,\"\")","v":""},{"$f":"IF(DISPONIBILITE!K65=\"oui\",DISPONIBILITE!$E65,\"\")","v":""},{"$f":"IF(DISPONIBILITE!L65=\"oui\",DISPONIBILITE!$E65,\"\")","v":"ROCHCONGAR Christelle"},{"$f":"IF(DISPONIBILITE!M65=\"oui\",DISPONIBILITE!$E65,\"\")","v":""},{"$f":"IF(DISPONIBILITE!N65=\"oui\",DISPONIBILITE!$E65,\"\")","v":""},{"$f":"IF(DISPONIBILITE!O65=\"oui\",DISPONIBILITE!$E65,\"\")","v":""},{"$f":"IF(DISPONIBILITE!P65=\"oui\",DISPONIBILITE!$E65,\"\")","v":""},{"$f":"IF(DISPONIBILITE!Q65=\"oui\",DISPONIBILITE!$E65,\"\")","v":""},{"$f":"IF(DISPONIBILITE!R65=\"oui\",DISPONIBILITE!$E65,\"\")","v":""},{"$f":"IF(DISPONIBILITE!S65=\"oui\",DISPONIBILITE!$E65,\"\")","v":""},{"$f":"IF(DISPONIBILITE!T65=\"oui\",DISPONIBILITE!$E65,\"\")","v":""},{"$f":"IF(DISPONIBILITE!U65=\"oui\",DISPONIBILITE!$E65,\"\")","v":""},{"$f":"IF(DISPONIBILITE!V65=\"oui\",DISPONIBILITE!$E65,\"\")","v":""},{"$f":"IF(DISPONIBILITE!W65=\"oui\",DISPONIBILITE!$E65,\"\")","v":"ROCHCONGAR Christelle"}]
[{"$f":"IF(DISPONIBILITE!F66=\"oui\",DISPONIBILITE!$E66,\"\")","v":""},{"$f":"IF(DISPONIBILITE!G66=\"oui\",DISPONIBILITE!$E66,\"\")","v":""},{"$f":"IF(DISPONIBILITE!H66=\"oui\",DISPONIBILITE!$E66,\"\")","v":"ROUAT Manon"},{"$f":"IF(DISPONIBILITE!I66=\"oui\",DISPONIBILITE!$E66,\"\")","v":""},{"$f":"IF(DISPONIBILITE!J66=\"oui\",DISPONIBILITE!$E66,\"\")","v":""},{"$f":"IF(DISPONIBILITE!K66=\"oui\",DISPONIBILITE!$E66,\"\")","v":""},{"$f":"IF(DISPONIBILITE!L66=\"oui\",DISPONIBILITE!$E66,\"\")","v":""},{"$f":"IF(DISPONIBILITE!M66=\"oui\",DISPONIBILITE!$E66,\"\")","v":""},{"$f":"IF(DISPONIBILITE!N66=\"oui\",DISPONIBILITE!$E66,\"\")","v":"ROUAT Manon"},{"$f":"IF(DISPONIBILITE!O66=\"oui\",DISPONIBILITE!$E66,\"\")","v":""},{"$f":"IF(DISPONIBILITE!P66=\"oui\",DISPONIBILITE!$E66,\"\")","v":""},{"$f":"IF(DISPONIBILITE!Q66=\"oui\",DISPONIBILITE!$E66,\"\")","v":"ROUAT Manon"},{"$f":"IF(DISPONIBILITE!R66=\"oui\",DISPONIBILITE!$E66,\"\")","v":""},{"$f":"IF(DISPONIBILITE!S66=\"oui\",DISPONIBILITE!$E66,\"\")","v":""},{"$f":"IF(DISPONIBILITE!T66=\"oui\",DISPONIBILITE!$E66,\"\")","v":"ROUAT Manon"},{"$f":"IF(DISPONIBILITE!U66=\"oui\",DISPONIBILITE!$E66,\"\")","v":""},{"$f":"IF(DISPONIBILITE!V66=\"oui\",DISPONIBILITE!$E66,\"\")","v":"ROUAT Manon"},{"$f":"IF(DISPONIBILITE!W66=\"oui\",DISPONIBILITE!$E66,\"\")","v":""}]
[{"$f":"IF(DISPONIBILITE!F67=\"oui\",DISPONIBILITE!$E67,\"\")","v":"ROUGER Olga"},{"$f":"IF(DISPONIBILITE!G67=\"oui\",DISPONIBILITE!$E67,\"\")","v":"ROUGER Olga"},{"$f":"IF(DISPONIBILITE!H67=\"oui\",DISPONIBILITE!$E67,\"\")","v":"ROUGER Olga"},{"$f":"IF(DISPONIBILITE!I67=\"oui\",DISPONIBILITE!$E67,\"\")","v":"ROUGER Olga"},{"$f":"IF(DISPONIBILITE!J67=\"oui\",DISPONIBILITE!$E67,\"\")","v":"ROUGER Olga"},{"$f":"IF(DISPONIBILITE!K67=\"oui\",DISPONIBILITE!$E67,\"\")","v":"ROUGER Olga"},{"$f":"IF(DISPONIBILITE!L67=\"oui\",DISPONIBILITE!$E67,\"\")","v":"ROUGER Olga"},{"$f":"IF(DISPONIBILITE!M67=\"oui\",DISPONIBILITE!$E67,\"\")","v":"ROUGER Olga"},{"$f":"IF(DISPONIBILITE!N67=\"oui\",DISPONIBILITE!$E67,\"\")","v":"ROUGER Olga"},{"$f":"IF(DISPONIBILITE!O67=\"oui\",DISPONIBILITE!$E67,\"\")","v":"ROUGER Olga"},{"$f":"IF(DISPONIBILITE!P67=\"oui\",DISPONIBILITE!$E67,\"\")","v":"ROUGER Olga"},{"$f":"IF(DISPONIBILITE!Q67=\"oui\",DISPONIBILITE!$E67,\"\")","v":"ROUGER Olga"},{"$f":"IF(DISPONIBILITE!R67=\"oui\",DISPONIBILITE!$E67,\"\")","v":"ROUGER Olga"},{"$f":"IF(DISPONIBILITE!S67=\"oui\",DISPONIBILITE!$E67,\"\")","v":"ROUGER Olga"},{"$f":"IF(DISPONIBILITE!T67=\"oui\",DISPONIBILITE!$E67,\"\")","v":"ROUGER Olga"},{"$f":"IF(DISPONIBILITE!U67=\"oui\",DISPONIBILITE!$E67,\"\")","v":"ROUGER Olga"},{"$f":"IF(DISPONIBILITE!V67=\"oui\",DISPONIBILITE!$E67,\"\")","v":"ROUGER Olga"},{"$f":"IF(DISPONIBILITE!W67=\"oui\",DISPONIBILITE!$E67,\"\")","v":"ROUGER Olga"}]
[{"$f":"IF(DISPONIBILITE!F68=\"oui\",DISPONIBILITE!$E68,\"\")","v":""},{"$f":"IF(DISPONIBILITE!G68=\"oui\",DISPONIBILITE!$E68,\"\")","v":""},{"$f":"IF(DISPONIBILITE!H68=\"oui\",DISPONIBILITE!$E68,\"\")","v":"SANS Loïs"},{"$f":"IF(DISPONIBILITE!I68=\"oui\",DISPONIBILITE!$E68,\"\")","v":""},{"$f":"IF(DISPONIBILITE!J68=\"oui\",DISPONIBILITE!$E68,\"\")","v":""},{"$f":"IF(DISPONIBILITE!K68=\"oui\",DISPONIBILITE!$E68,\"\")","v":""},{"$f":"IF(DISPONIBILITE!L68=\"oui\",DISPONIBILITE!$E68,\"\")","v":""},{"$f":"IF(DISPONIBILITE!M68=\"oui\",DISPONIBILITE!$E68,\"\")","v":""},{"$f":"IF(DISPONIBILITE!N68=\"oui\",DISPONIBILITE!$E68,\"\")","v":"SANS Loïs"},{"$f":"IF(DISPONIBILITE!O68=\"oui\",DISPONIBILITE!$E68,\"\")","v":""},{"$f":"IF(DISPONIBILITE!P68=\"oui\",DISPONIBILITE!$E68,\"\")","v":""},{"$f":"IF(DISPONIBILITE!Q68=\"oui\",DISPONIBILITE!$E68,\"\")","v":""},{"$f":"IF(DISPONIBILITE!R68=\"oui\",DISPONIBILITE!$E68,\"\")","v":""},{"$f":"IF(DISPONIBILITE!S68=\"oui\",DISPONIBILITE!$E68,\"\")","v":""},{"$f":"IF(DISPONIBILITE!T68=\"oui\",DISPONIBILITE!$E68,\"\")","v":"SANS Loïs"},{"$f":"IF(DISPONIBILITE!U68=\"oui\",DISPONIBILITE!$E68,\"\")","v":""},{"$f":"IF(DISPONIBILITE!V68=\"oui\",DISPONIBILITE!$E68,\"\")","v":""},{"$f":"IF(DISPONIBILITE!W68=\"oui\",DISPONIBILITE!$E68,\"\")","v":"SANS Loïs"}]
[{"$f":"IF(DISPONIBILITE!F69=\"oui\",DISPONIBILITE!$E69,\"\")","v":"STRUILLOU (K) Charlotte"},{"$f":"IF(DISPONIBILITE!G69=\"oui\",DISPONIBILITE!$E69,\"\")","v":"STRUILLOU (K) Charlotte"},{"$f":"IF(DISPONIBILITE!H69=\"oui\",DISPONIBILITE!$E69,\"\")","v":""},{"$f":"IF(DISPONIBILITE!I69=\"oui\",DISPONIBILITE!$E69,\"\")","v":"STRUILLOU (K) Charlotte"},{"$f":"IF(DISPONIBILITE!J69=\"oui\",DISPONIBILITE!$E69,\"\")","v":"STRUILLOU (K) Charlotte"},{"$f":"IF(DISPONIBILITE!K69=\"oui\",DISPONIBILITE!$E69,\"\")","v":""},{"$f":"IF(DISPONIBILITE!L69=\"oui\",DISPONIBILITE!$E69,\"\")","v":""},{"$f":"IF(DISPONIBILITE!M69=\"oui\",DISPONIBILITE!$E69,\"\")","v":""},{"$f":"IF(DISPONIBILITE!N69=\"oui\",DISPONIBILITE!$E69,\"\")","v":""},{"$f":"IF(DISPONIBILITE!O69=\"oui\",DISPONIBILITE!$E69,\"\")","v":""},{"$f":"IF(DISPONIBILITE!P69=\"oui\",DISPONIBILITE!$E69,\"\")","v":""},{"$f":"IF(DISPONIBILITE!Q69=\"oui\",DISPONIBILITE!$E69,\"\")","v":""},{"$f":"IF(DISPONIBILITE!R69=\"oui\",DISPONIBILITE!$E69,\"\")","v":""},{"$f":"IF(DISPONIBILITE!S69=\"oui\",DISPONIBILITE!$E69,\"\")","v":""},{"$f":"IF(DISPONIBILITE!T69=\"oui\",DISPONIBILITE!$E69,\"\")","v":""},{"$f":"IF(DISPONIBILITE!U69=\"oui\",DISPONIBILITE!$E69,\"\")","v":""},{"$f":"IF(DISPONIBILITE!V69=\"oui\",DISPONIBILITE!$E69,\"\")","v":""},{"$f":"IF(DISPONIBILITE!W69=\"oui\",DISPONIBILITE!$E69,\"\")","v":""}]
[{"$f":"IF(DISPONIBILITE!F70=\"oui\",DISPONIBILITE!$E70,\"\")","v":""},{"$f":"IF(DISPONIBILITE!G70=\"oui\",DISPONIBILITE!$E70,\"\")","v":""},{"$f":"IF(DISPONIBILITE!H70=\"oui\",DISPONIBILITE!$E70,\"\")","v":""},{"$f":"IF(DISPONIBILITE!I70=\"oui\",DISPONIBILITE!$E70,\"\")","v":""},{"$f":"IF(DISPONIBILITE!J70=\"oui\",DISPONIBILITE!$E70,\"\")","v":""},{"$f":"IF(DISPONIBILITE!K70=\"oui\",DISPONIBILITE!$E70,\"\")","v":""},{"$f":"IF(DISPONIBILITE!L70=\"oui\",DISPONIBILITE!$E70,\"\")","v":""},{"$f":"IF(DISPONIBILITE!M70=\"oui\",DISPONIBILITE!$E70,\"\")","v":""},{"$f":"IF(DISPONIBILITE!N70=\"oui\",DISPONIBILITE!$E70,\"\")","v":""},{"$f":"IF(DISPONIBILITE!O70=\"oui\",DISPONIBILITE!$E70,\"\")","v":""},{"$f":"IF(DISPONIBILITE!P70=\"oui\",DISPONIBILITE!$E70,\"\")","v":""},{"$f":"IF(DISPONIBILITE!Q70=\"oui\",DISPONIBILITE!$E70,\"\")","v":""},{"$f":"IF(DISPONIBILITE!R70=\"oui\",DISPONIBILITE!$E70,\"\")","v":""},{"$f":"IF(DISPONIBILITE!S70=\"oui\",DISPONIBILITE!$E70,\"\")","v":""},{"$f":"IF(DISPONIBILITE!T70=\"oui\",DISPONIBILITE!$E70,\"\")","v":"TALLEC-GORAGUER Clara"},{"$f":"IF(DISPONIBILITE!U70=\"oui\",DISPONIBILITE!$E70,\"\")","v":"TALLEC-GORAGUER Clara"},{"$f":"IF(DISPONIBILITE!V70=\"oui\",DISPONIBILITE!$E70,\"\")","v":"TALLEC-GORAGUER Clara"},{"$f":"IF(DISPONIBILITE!W70=\"oui\",DISPONIBILITE!$E70,\"\")","v":"TALLEC-GORAGUER Clara"}]
[{"$f":"IF(DISPONIBILITE!F71=\"oui\",DISPONIBILITE!$E71,\"\")","v":"TANGUY Bob"},{"$f":"IF(DISPONIBILITE!G71=\"oui\",DISPONIBILITE!$E71,\"\")","v":"TANGUY Bob"},{"$f":"IF(DISPONIBILITE!H71=\"oui\",DISPONIBILITE!$E71,\"\")","v":"TANGUY Bob"},{"$f":"IF(DISPONIBILITE!I71=\"oui\",DISPONIBILITE!$E71,\"\")","v":"TANGUY Bob"},{"$f":"IF(DISPONIBILITE!J71=\"oui\",DISPONIBILITE!$E71,\"\")","v":"TANGUY Bob"},{"$f":"IF(DISPONIBILITE!K71=\"oui\",DISPONIBILITE!$E71,\"\")","v":"TANGUY Bob"},{"$f":"IF(DISPONIBILITE!L71=\"oui\",DISPONIBILITE!$E71,\"\")","v":"TANGUY Bob"},{"$f":"IF(DISPONIBILITE!M71=\"oui\",DISPONIBILITE!$E71,\"\")","v":"TANGUY Bob"},{"$f":"IF(DISPONIBILITE!N71=\"oui\",DISPONIBILITE!$E71,\"\")","v":"TANGUY Bob"},{"$f":"IF(DISPONIBILITE!O71=\"oui\",DISPONIBILITE!$E71,\"\")","v":"TANGUY Bob"},{"$f":"IF(DISPONIBILITE!P71=\"oui\",DISPONIBILITE!$E71,\"\")","v":"TANGUY Bob"},{"$f":"IF(DISPONIBILITE!Q71=\"oui\",DISPONIBILITE!$E71,\"\")","v":"TANGUY Bob"},{"$f":"IF(DISPONIBILITE!R71=\"oui\",DISPONIBILITE!$E71,\"\")","v":""},{"$f":"IF(DISPONIBILITE!S71=\"oui\",DISPONIBILITE!$E71,\"\")","v":"TANGUY Bob"},{"$f":"IF(DISPONIBILITE!T71=\"oui\",DISPONIBILITE!$E71,\"\")","v":"TANGUY Bob"},{"$f":"IF(DISPONIBILITE!U71=\"oui\",DISPONIBILITE!$E71,\"\")","v":""},{"$f":"IF(DISPONIBILITE!V71=\"oui\",DISPONIBILITE!$E71,\"\")","v":"TANGUY Bob"},{"$f":"IF(DISPONIBILITE!W71=\"oui\",DISPONIBILITE!$E71,\"\")","v":"TANGUY Bob"}]
[{"$f":"IF(DISPONIBILITE!F72=\"oui\",DISPONIBILITE!$E72,\"\")","v":""},{"$f":"IF(DISPONIBILITE!G72=\"oui\",DISPONIBILITE!$E72,\"\")","v":""},{"$f":"IF(DISPONIBILITE!H72=\"oui\",DISPONIBILITE!$E72,\"\")","v":"TARHAN Yeliz"},{"$f":"IF(DISPONIBILITE!I72=\"oui\",DISPONIBILITE!$E72,\"\")","v":""},{"$f":"IF(DISPONIBILITE!J72=\"oui\",DISPONIBILITE!$E72,\"\")","v":""},{"$f":"IF(DISPONIBILITE!K72=\"oui\",DISPONIBILITE!$E72,\"\")","v":"TARHAN Yeliz"},{"$f":"IF(DISPONIBILITE!L72=\"oui\",DISPONIBILITE!$E72,\"\")","v":""},{"$f":"IF(DISPONIBILITE!M72=\"oui\",DISPONIBILITE!$E72,\"\")","v":""},{"$f":"IF(DISPONIBILITE!N72=\"oui\",DISPONIBILITE!$E72,\"\")","v":""},{"$f":"IF(DISPONIBILITE!O72=\"oui\",DISPONIBILITE!$E72,\"\")","v":""},{"$f":"IF(DISPONIBILITE!P72=\"oui\",DISPONIBILITE!$E72,\"\")","v":""},{"$f":"IF(DISPONIBILITE!Q72=\"oui\",DISPONIBILITE!$E72,\"\")","v":""},{"$f":"IF(DISPONIBILITE!R72=\"oui\",DISPONIBILITE!$E72,\"\")","v":""},{"$f":"IF(DISPONIBILITE!S72=\"oui\",DISPONIBILITE!$E72,\"\")","v":""},{"$f":"IF(DISPONIBILITE!T72=\"oui\",DISPONIBILITE!$E72,\"\")","v":""},{"$f":"IF(DISPONIBILITE!U72=\"oui\",DISPONIBILITE!$E72,\"\")","v":""},{"$f":"IF(DISPONIBILITE!V72=\"oui\",DISPONIBILITE!$E72,\"\")","v":"TARHAN Yeliz"},{"$f":"IF(DISPONIBILITE!W72=\"oui\",DISPONIBILITE!$E72,\"\")","v":""}]
[{"$f":"IF(DISPONIBILITE!F73=\"oui\",DISPONIBILITE!$E73,\"\")","v":"TEST La"},{"$f":"IF(DISPONIBILITE!G73=\"oui\",DISPONIBILITE!$E73,\"\")","v":"TEST La"},{"$f":"IF(DISPONIBILITE!H73=\"oui\",DISPONIBILITE!$E73,\"\")","v":"TEST La"},{"$f":"IF(DISPONIBILITE!I73=\"oui\",DISPONIBILITE!$E73,\"\")","v":"TEST La"},{"$f":"IF(DISPONIBILITE!J73=\"oui\",DISPONIBILITE!$E73,\"\")","v":"TEST La"},{"$f":"IF(DISPONIBILITE!K73=\"oui\",DISPONIBILITE!$E73,\"\")","v":"TEST La"},{"$f":"IF(DISPONIBILITE!L73=\"oui\",DISPONIBILITE!$E73,\"\")","v":"TEST La"},{"$f":"IF(DISPONIBILITE!M73=\"oui\",DISPONIBILITE!$E73,\"\")","v":"TEST La"},{"$f":"IF(DISPONIBILITE!N73=\"oui\",DISPONIBILITE!$E73,\"\")","v":"TEST La"},{"$f":"IF(DISPONIBILITE!O73=\"oui\",DISPONIBILITE!$E73,\"\")","v":"TEST La"},{"$f":"IF(DISPONIBILITE!P73=\"oui\",DISPONIBILITE!$E73,\"\")","v":"TEST La"},{"$f":"IF(DISPONIBILITE!Q73=\"oui\",DISPONIBILITE!$E73,\"\")","v":"TEST La"},{"$f":"IF(DISPONIBILITE!R73=\"oui\",DISPONIBILITE!$E73,\"\")","v":"TEST La"},{"$f":"IF(DISPONIBILITE!S73=\"oui\",DISPONIBILITE!$E73,\"\")","v":"TEST La"},{"$f":"IF(DISPONIBILITE!T73=\"oui\",DISPONIBILITE!$E73,\"\")","v":"TEST La"},{"$f":"IF(DISPONIBILITE!U73=\"oui\",DISPONIBILITE!$E73,\"\")","v":"TEST La"},{"$f":"IF(DISPONIBILITE!V73=\"oui\",DISPONIBILITE!$E73,\"\")","v":"TEST La"},{"$f":"IF(DISPONIBILITE!W73=\"oui\",DISPONIBILITE!$E73,\"\")","v":"TEST La"}]
[{"$f":"IF(DISPONIBILITE!F74=\"oui\",DISPONIBILITE!$E74,\"\")","v":""},{"$f":"IF(DISPONIBILITE!G74=\"oui\",DISPONIBILITE!$E74,\"\")","v":""},{"$f":"IF(DISPONIBILITE!H74=\"oui\",DISPONIBILITE!$E74,\"\")","v":""},{"$f":"IF(DISPONIBILITE!I74=\"oui\",DISPONIBILITE!$E74,\"\")","v":""},{"$f":"IF(DISPONIBILITE!J74=\"oui\",DISPONIBILITE!$E74,\"\")","v":""},{"$f":"IF(DISPONIBILITE!K74=\"oui\",DISPONIBILITE!$E74,\"\")","v":"THEME Sophie"},{"$f":"IF(DISPONIBILITE!L74=\"oui\",DISPONIBILITE!$E74,\"\")","v":""},{"$f":"IF(DISPONIBILITE!M74=\"oui\",DISPONIBILITE!$E74,\"\")","v":""},{"$f":"IF(DISPONIBILITE!N74=\"oui\",DISPONIBILITE!$E74,\"\")","v":""},{"$f":"IF(DISPONIBILITE!O74=\"oui\",DISPONIBILITE!$E74,\"\")","v":""},{"$f":"IF(DISPONIBILITE!P74=\"oui\",DISPONIBILITE!$E74,\"\")","v":""},{"$f":"IF(DISPONIBILITE!Q74=\"oui\",DISPONIBILITE!$E74,\"\")","v":"THEME Sophie"},{"$f":"IF(DISPONIBILITE!R74=\"oui\",DISPONIBILITE!$E74,\"\")","v":""},{"$f":"IF(DISPONIBILITE!S74=\"oui\",DISPONIBILITE!$E74,\"\")","v":""},{"$f":"IF(DISPONIBILITE!T74=\"oui\",DISPONIBILITE!$E74,\"\")","v":"THEME Sophie"},{"$f":"IF(DISPONIBILITE!U74=\"oui\",DISPONIBILITE!$E74,\"\")","v":""},{"$f":"IF(DISPONIBILITE!V74=\"oui\",DISPONIBILITE!$E74,\"\")","v":""},{"$f":"IF(DISPONIBILITE!W74=\"oui\",DISPONIBILITE!$E74,\"\")","v":""}]
[{"$f":"IF(DISPONIBILITE!F75=\"oui\",DISPONIBILITE!$E75,\"\")","v":"TROBOE Marcel"},{"$f":"IF(DISPONIBILITE!G75=\"oui\",DISPONIBILITE!$E75,\"\")","v":"TROBOE Marcel"},{"$f":"IF(DISPONIBILITE!H75=\"oui\",DISPONIBILITE!$E75,\"\")","v":""},{"$f":"IF(DISPONIBILITE!I75=\"oui\",DISPONIBILITE!$E75,\"\")","v":"TROBOE Marcel"},{"$f":"IF(DISPONIBILITE!J75=\"oui\",DISPONIBILITE!$E75,\"\")","v":"TROBOE Marcel"},{"$f":"IF(DISPONIBILITE!K75=\"oui\",DISPONIBILITE!$E75,\"\")","v":""},{"$f":"IF(DISPONIBILITE!L75=\"oui\",DISPONIBILITE!$E75,\"\")","v":"TROBOE Marcel"},{"$f":"IF(DISPONIBILITE!M75=\"oui\",DISPONIBILITE!$E75,\"\")","v":"TROBOE Marcel"},{"$f":"IF(DISPONIBILITE!N75=\"oui\",DISPONIBILITE!$E75,\"\")","v":""},{"$f":"IF(DISPONIBILITE!O75=\"oui\",DISPONIBILITE!$E75,\"\")","v":"TROBOE Marcel"},{"$f":"IF(DISPONIBILITE!P75=\"oui\",DISPONIBILITE!$E75,\"\")","v":"TROBOE Marcel"},{"$f":"IF(DISPONIBILITE!Q75=\"oui\",DISPONIBILITE!$E75,\"\")","v":""},{"$f":"IF(DISPONIBILITE!R75=\"oui\",DISPONIBILITE!$E75,\"\")","v":"TROBOE Marcel"},{"$f":"IF(DISPONIBILITE!S75=\"oui\",DISPONIBILITE!$E75,\"\")","v":"TROBOE Marcel"},{"$f":"IF(DISPONIBILITE!T75=\"oui\",DISPONIBILITE!$E75,\"\")","v":""},{"$f":"IF(DISPONIBILITE!U75=\"oui\",DISPONIBILITE!$E75,\"\")","v":"TROBOE Marcel"},{"$f":"IF(DISPONIBILITE!V75=\"oui\",DISPONIBILITE!$E75,\"\")","v":"TROBOE Marcel"},{"$f":"IF(DISPONIBILITE!W75=\"oui\",DISPONIBILITE!$E75,\"\")","v":"TROBOE Marcel"}]
[{"$f":"IF(DISPONIBILITE!F76=\"oui\",DISPONIBILITE!$E76,\"\")","v":""},{"$f":"IF(DISPONIBILITE!G76=\"oui\",DISPONIBILITE!$E76,\"\")","v":""},{"$f":"IF(DISPONIBILITE!H76=\"oui\",DISPONIBILITE!$E76,\"\")","v":""},{"$f":"IF(DISPONIBILITE!I76=\"oui\",DISPONIBILITE!$E76,\"\")","v":""},{"$f":"IF(DISPONIBILITE!J76=\"oui\",DISPONIBILITE!$E76,\"\")","v":""},{"$f":"IF(DISPONIBILITE!K76=\"oui\",DISPONIBILITE!$E76,\"\")","v":"WOJCIK Eulalie"},{"$f":"IF(DISPONIBILITE!L76=\"oui\",DISPONIBILITE!$E76,\"\")","v":""},{"$f":"IF(DISPONIBILITE!M76=\"oui\",DISPONIBILITE!$E76,\"\")","v":""},{"$f":"IF(DISPONIBILITE!N76=\"oui\",DISPONIBILITE!$E76,\"\")","v":""},{"$f":"IF(DISPONIBILITE!O76=\"oui\",DISPONIBILITE!$E76,\"\")","v":""},{"$f":"IF(DISPONIBILITE!P76=\"oui\",DISPONIBILITE!$E76,\"\")","v":""},{"$f":"IF(DISPONIBILITE!Q76=\"oui\",DISPONIBILITE!$E76,\"\")","v":"WOJCIK Eulalie"},{"$f":"IF(DISPONIBILITE!R76=\"oui\",DISPONIBILITE!$E76,\"\")","v":""},{"$f":"IF(DISPONIBILITE!S76=\"oui\",DISPONIBILITE!$E76,\"\")","v":""},{"$f":"IF(DISPONIBILITE!T76=\"oui\",DISPONIBILITE!$E76,\"\")","v":"WOJCIK Eulalie"},{"$f":"IF(DISPONIBILITE!U76=\"oui\",DISPONIBILITE!$E76,\"\")","v":""},{"$f":"IF(DISPONIBILITE!V76=\"oui\",DISPONIBILITE!$E76,\"\")","v":"WOJCIK Eulalie"},{"$f":"IF(DISPONIBILITE!W76=\"oui\",DISPONIBILITE!$E76,\"\")","v":""}]
[{"$f":"IF(DISPONIBILITE!F77=\"oui\",DISPONIBILITE!$E77,\"\")","v":""},{"$f":"IF(DISPONIBILITE!G77=\"oui\",DISPONIBILITE!$E77,\"\")","v":""},{"$f":"IF(DISPONIBILITE!H77=\"oui\",DISPONIBILITE!$E77,\"\")","v":"YANG Johanne"},{"$f":"IF(DISPONIBILITE!I77=\"oui\",DISPONIBILITE!$E77,\"\")","v":""},{"$f":"IF(DISPONIBILITE!J77=\"oui\",DISPONIBILITE!$E77,\"\")","v":""},{"$f":"IF(DISPONIBILITE!K77=\"oui\",DISPONIBILITE!$E77,\"\")","v":"YANG Johanne"},{"$f":"IF(DISPONIBILITE!L77=\"oui\",DISPONIBILITE!$E77,\"\")","v":""},{"$f":"IF(DISPONIBILITE!M77=\"oui\",DISPONIBILITE!$E77,\"\")","v":""},{"$f":"IF(DISPONIBILITE!N77=\"oui\",DISPONIBILITE!$E77,\"\")","v":""},{"$f":"IF(DISPONIBILITE!O77=\"oui\",DISPONIBILITE!$E77,\"\")","v":""},{"$f":"IF(DISPONIBILITE!P77=\"oui\",DISPONIBILITE!$E77,\"\")","v":""},{"$f":"IF(DISPONIBILITE!Q77=\"oui\",DISPONIBILITE!$E77,\"\")","v":""},{"$f":"IF(DISPONIBILITE!R77=\"oui\",DISPONIBILITE!$E77,\"\")","v":""},{"$f":"IF(DISPONIBILITE!S77=\"oui\",DISPONIBILITE!$E77,\"\")","v":""},{"$f":"IF(DISPONIBILITE!T77=\"oui\",DISPONIBILITE!$E77,\"\")","v":"YANG Johanne"},{"$f":"IF(DISPONIBILITE!U77=\"oui\",DISPONIBILITE!$E77,\"\")","v":""},{"$f":"IF(DISPONIBILITE!V77=\"oui\",DISPONIBILITE!$E77,\"\")","v":"YANG Johanne"},{"$f":"IF(DISPONIBILITE!W77=\"oui\",DISPONIBILITE!$E77,\"\")","v":""}]
[{"$f":"IF(DISPONIBILITE!F78=\"oui\",DISPONIBILITE!$E78,\"\")","v":""},{"$f":"IF(DISPONIBILITE!G78=\"oui\",DISPONIBILITE!$E78,\"\")","v":""},{"$f":"IF(DISPONIBILITE!H78=\"oui\",DISPONIBILITE!$E78,\"\")","v":""},{"$f":"IF(DISPONIBILITE!I78=\"oui\",DISPONIBILITE!$E78,\"\")","v":""},{"$f":"IF(DISPONIBILITE!J78=\"oui\",DISPONIBILITE!$E78,\"\")","v":""},{"$f":"IF(DISPONIBILITE!K78=\"oui\",DISPONIBILITE!$E78,\"\")","v":""},{"$f":"IF(DISPONIBILITE!L78=\"oui\",DISPONIBILITE!$E78,\"\")","v":""},{"$f":"IF(DISPONIBILITE!M78=\"oui\",DISPONIBILITE!$E78,\"\")","v":""},{"$f":"IF(DISPONIBILITE!N78=\"oui\",DISPONIBILITE!$E78,\"\")","v":""},{"$f":"IF(DISPONIBILITE!O78=\"oui\",DISPONIBILITE!$E78,\"\")","v":""},{"$f":"IF(DISPONIBILITE!P78=\"oui\",DISPONIBILITE!$E78,\"\")","v":""},{"$f":"IF(DISPONIBILITE!Q78=\"oui\",DISPONIBILITE!$E78,\"\")","v":""},{"$f":"IF(DISPONIBILITE!R78=\"oui\",DISPONIBILITE!$E78,\"\")","v":""},{"$f":"IF(DISPONIBILITE!S78=\"oui\",DISPONIBILITE!$E78,\"\")","v":""},{"$f":"IF(DISPONIBILITE!T78=\"oui\",DISPONIBILITE!$E78,\"\")","v":""},{"$f":"IF(DISPONIBILITE!U78=\"oui\",DISPONIBILITE!$E78,\"\")","v":""},{"$f":"IF(DISPONIBILITE!V78=\"oui\",DISPONIBILITE!$E78,\"\")","v":""},{"$f":"IF(DISPONIBILITE!W78=\"oui\",DISPONIBILITE!$E78,\"\")","v":""}]
[{"$f":"IF(DISPONIBILITE!F79=\"oui\",DISPONIBILITE!$E79,\"\")","v":""},{"$f":"IF(DISPONIBILITE!G79=\"oui\",DISPONIBILITE!$E79,\"\")","v":""},{"$f":"IF(DISPONIBILITE!H79=\"oui\",DISPONIBILITE!$E79,\"\")","v":""},{"$f":"IF(DISPONIBILITE!I79=\"oui\",DISPONIBILITE!$E79,\"\")","v":""},{"$f":"IF(DISPONIBILITE!J79=\"oui\",DISPONIBILITE!$E79,\"\")","v":""},{"$f":"IF(DISPONIBILITE!K79=\"oui\",DISPONIBILITE!$E79,\"\")","v":""},{"$f":"IF(DISPONIBILITE!L79=\"oui\",DISPONIBILITE!$E79,\"\")","v":""},{"$f":"IF(DISPONIBILITE!M79=\"oui\",DISPONIBILITE!$E79,\"\")","v":""},{"$f":"IF(DISPONIBILITE!N79=\"oui\",DISPONIBILITE!$E79,\"\")","v":""},{"$f":"IF(DISPONIBILITE!O79=\"oui\",DISPONIBILITE!$E79,\"\")","v":""},{"$f":"IF(DISPONIBILITE!P79=\"oui\",DISPONIBILITE!$E79,\"\")","v":""},{"$f":"IF(DISPONIBILITE!Q79=\"oui\",DISPONIBILITE!$E79,\"\")","v":""},{"$f":"IF(DISPONIBILITE!R79=\"oui\",DISPONIBILITE!$E79,\"\")","v":""},{"$f":"IF(DISPONIBILITE!S79=\"oui\",DISPONIBILITE!$E79,\"\")","v":""},{"$f":"IF(DISPONIBILITE!T79=\"oui\",DISPONIBILITE!$E79,\"\")","v":""},{"$f":"IF(DISPONIBILITE!U79=\"oui\",DISPONIBILITE!$E79,\"\")","v":""},{"$f":"IF(DISPONIBILITE!V79=\"oui\",DISPONIBILITE!$E79,\"\")","v":""},{"$f":"IF(DISPONIBILITE!W79=\"oui\",DISPONIBILITE!$E79,\"\")","v":""}]
[{"$f":"IF(DISPONIBILITE!F80=\"oui\",DISPONIBILITE!$E80,\"\")","v":""},{"$f":"IF(DISPONIBILITE!G80=\"oui\",DISPONIBILITE!$E80,\"\")","v":""},{"$f":"IF(DISPONIBILITE!H80=\"oui\",DISPONIBILITE!$E80,\"\")","v":""},{"$f":"IF(DISPONIBILITE!I80=\"oui\",DISPONIBILITE!$E80,\"\")","v":""},{"$f":"IF(DISPONIBILITE!J80=\"oui\",DISPONIBILITE!$E80,\"\")","v":""},{"$f":"IF(DISPONIBILITE!K80=\"oui\",DISPONIBILITE!$E80,\"\")","v":""},{"$f":"IF(DISPONIBILITE!L80=\"oui\",DISPONIBILITE!$E80,\"\")","v":""},{"$f":"IF(DISPONIBILITE!M80=\"oui\",DISPONIBILITE!$E80,\"\")","v":""},{"$f":"IF(DISPONIBILITE!N80=\"oui\",DISPONIBILITE!$E80,\"\")","v":""},{"$f":"IF(DISPONIBILITE!O80=\"oui\",DISPONIBILITE!$E80,\"\")","v":""},{"$f":"IF(DISPONIBILITE!P80=\"oui\",DISPONIBILITE!$E80,\"\")","v":""},{"$f":"IF(DISPONIBILITE!Q80=\"oui\",DISPONIBILITE!$E80,\"\")","v":""},{"$f":"IF(DISPONIBILITE!R80=\"oui\",DISPONIBILITE!$E80,\"\")","v":""},{"$f":"IF(DISPONIBILITE!S80=\"oui\",DISPONIBILITE!$E80,\"\")","v":""},{"$f":"IF(DISPONIBILITE!T80=\"oui\",DISPONIBILITE!$E80,\"\")","v":""},{"$f":"IF(DISPONIBILITE!U80=\"oui\",DISPONIBILITE!$E80,\"\")","v":""},{"$f":"IF(DISPONIBILITE!V80=\"oui\",DISPONIBILITE!$E80,\"\")","v":""},{"$f":"IF(DISPONIBILITE!W80=\"oui\",DISPONIBILITE!$E80,\"\")","v":""}]
[{"$f":"IF(DISPONIBILITE!F81=\"oui\",DISPONIBILITE!$E81,\"\")","v":""},{"$f":"IF(DISPONIBILITE!G81=\"oui\",DISPONIBILITE!$E81,\"\")","v":""},{"$f":"IF(DISPONIBILITE!H81=\"oui\",DISPONIBILITE!$E81,\"\")","v":""},{"$f":"IF(DISPONIBILITE!I81=\"oui\",DISPONIBILITE!$E81,\"\")","v":""},{"$f":"IF(DISPONIBILITE!J81=\"oui\",DISPONIBILITE!$E81,\"\")","v":""},{"$f":"IF(DISPONIBILITE!K81=\"oui\",DISPONIBILITE!$E81,\"\")","v":""},{"$f":"IF(DISPONIBILITE!L81=\"oui\",DISPONIBILITE!$E81,\"\")","v":""},{"$f":"IF(DISPONIBILITE!M81=\"oui\",DISPONIBILITE!$E81,\"\")","v":""},{"$f":"IF(DISPONIBILITE!N81=\"oui\",DISPONIBILITE!$E81,\"\")","v":""},{"$f":"IF(DISPONIBILITE!O81=\"oui\",DISPONIBILITE!$E81,\"\")","v":""},{"$f":"IF(DISPONIBILITE!P81=\"oui\",DISPONIBILITE!$E81,\"\")","v":""},{"$f":"IF(DISPONIBILITE!Q81=\"oui\",DISPONIBILITE!$E81,\"\")","v":""},{"$f":"IF(DISPONIBILITE!R81=\"oui\",DISPONIBILITE!$E81,\"\")","v":""},{"$f":"IF(DISPONIBILITE!S81=\"oui\",DISPONIBILITE!$E81,\"\")","v":""},{"$f":"IF(DISPONIBILITE!T81=\"oui\",DISPONIBILITE!$E81,\"\")","v":""},{"$f":"IF(DISPONIBILITE!U81=\"oui\",DISPONIBILITE!$E81,\"\")","v":""},{"$f":"IF(DISPONIBILITE!V81=\"oui\",DISPONIBILITE!$E81,\"\")","v":""},{"$f":"IF(DISPONIBILITE!W81=\"oui\",DISPONIBILITE!$E81,\"\")","v":""}]
[{"$f":"IF(DISPONIBILITE!F82=\"oui\",DISPONIBILITE!$E82,\"\")","v":""},{"$f":"IF(DISPONIBILITE!G82=\"oui\",DISPONIBILITE!$E82,\"\")","v":""},{"$f":"IF(DISPONIBILITE!H82=\"oui\",DISPONIBILITE!$E82,\"\")","v":""},{"$f":"IF(DISPONIBILITE!I82=\"oui\",DISPONIBILITE!$E82,\"\")","v":""},{"$f":"IF(DISPONIBILITE!J82=\"oui\",DISPONIBILITE!$E82,\"\")","v":""},{"$f":"IF(DISPONIBILITE!K82=\"oui\",DISPONIBILITE!$E82,\"\")","v":""},{"$f":"IF(DISPONIBILITE!L82=\"oui\",DISPONIBILITE!$E82,\"\")","v":""},{"$f":"IF(DISPONIBILITE!M82=\"oui\",DISPONIBILITE!$E82,\"\")","v":""},{"$f":"IF(DISPONIBILITE!N82=\"oui\",DISPONIBILITE!$E82,\"\")","v":""},{"$f":"IF(DISPONIBILITE!O82=\"oui\",DISPONIBILITE!$E82,\"\")","v":""},{"$f":"IF(DISPONIBILITE!P82=\"oui\",DISPONIBILITE!$E82,\"\")","v":""},{"$f":"IF(DISPONIBILITE!Q82=\"oui\",DISPONIBILITE!$E82,\"\")","v":""},{"$f":"IF(DISPONIBILITE!R82=\"oui\",DISPONIBILITE!$E82,\"\")","v":""},{"$f":"IF(DISPONIBILITE!S82=\"oui\",DISPONIBILITE!$E82,\"\")","v":""},{"$f":"IF(DISPONIBILITE!T82=\"oui\",DISPONIBILITE!$E82,\"\")","v":""},{"$f":"IF(DISPONIBILITE!U82=\"oui\",DISPONIBILITE!$E82,\"\")","v":""},{"$f":"IF(DISPONIBILITE!V82=\"oui\",DISPONIBILITE!$E82,\"\")","v":""},{"$f":"IF(DISPONIBILITE!W82=\"oui\",DISPONIBILITE!$E82,\"\")","v":""}]
[{"$f":"IF(DISPONIBILITE!F83=\"oui\",DISPONIBILITE!$E83,\"\")","v":""},{"$f":"IF(DISPONIBILITE!G83=\"oui\",DISPONIBILITE!$E83,\"\")","v":""},{"$f":"IF(DISPONIBILITE!H83=\"oui\",DISPONIBILITE!$E83,\"\")","v":""},{"$f":"IF(DISPONIBILITE!I83=\"oui\",DISPONIBILITE!$E83,\"\")","v":""},{"$f":"IF(DISPONIBILITE!J83=\"oui\",DISPONIBILITE!$E83,\"\")","v":""},{"$f":"IF(DISPONIBILITE!K83=\"oui\",DISPONIBILITE!$E83,\"\")","v":""},{"$f":"IF(DISPONIBILITE!L83=\"oui\",DISPONIBILITE!$E83,\"\")","v":""},{"$f":"IF(DISPONIBILITE!M83=\"oui\",DISPONIBILITE!$E83,\"\")","v":""},{"$f":"IF(DISPONIBILITE!N83=\"oui\",DISPONIBILITE!$E83,\"\")","v":""},{"$f":"IF(DISPONIBILITE!O83=\"oui\",DISPONIBILITE!$E83,\"\")","v":""},{"$f":"IF(DISPONIBILITE!P83=\"oui\",DISPONIBILITE!$E83,\"\")","v":""},{"$f":"IF(DISPONIBILITE!Q83=\"oui\",DISPONIBILITE!$E83,\"\")","v":""},{"$f":"IF(DISPONIBILITE!R83=\"oui\",DISPONIBILITE!$E83,\"\")","v":""},{"$f":"IF(DISPONIBILITE!S83=\"oui\",DISPONIBILITE!$E83,\"\")","v":""},{"$f":"IF(DISPONIBILITE!T83=\"oui\",DISPONIBILITE!$E83,\"\")","v":""},{"$f":"IF(DISPONIBILITE!U83=\"oui\",DISPONIBILITE!$E83,\"\")","v":""},{"$f":"IF(DISPONIBILITE!V83=\"oui\",DISPONIBILITE!$E83,\"\")","v":""},{"$f":"IF(DISPONIBILITE!W83=\"oui\",DISPONIBILITE!$E83,\"\")","v":""}]
[{"$f":"IF(DISPONIBILITE!F84=\"oui\",DISPONIBILITE!$E84,\"\")","v":""},{"$f":"IF(DISPONIBILITE!G84=\"oui\",DISPONIBILITE!$E84,\"\")","v":""},{"$f":"IF(DISPONIBILITE!H84=\"oui\",DISPONIBILITE!$E84,\"\")","v":""},{"$f":"IF(DISPONIBILITE!I84=\"oui\",DISPONIBILITE!$E84,\"\")","v":""},{"$f":"IF(DISPONIBILITE!J84=\"oui\",DISPONIBILITE!$E84,\"\")","v":""},{"$f":"IF(DISPONIBILITE!K84=\"oui\",DISPONIBILITE!$E84,\"\")","v":""},{"$f":"IF(DISPONIBILITE!L84=\"oui\",DISPONIBILITE!$E84,\"\")","v":""},{"$f":"IF(DISPONIBILITE!M84=\"oui\",DISPONIBILITE!$E84,\"\")","v":""},{"$f":"IF(DISPONIBILITE!N84=\"oui\",DISPONIBILITE!$E84,\"\")","v":""},{"$f":"IF(DISPONIBILITE!O84=\"oui\",DISPONIBILITE!$E84,\"\")","v":""},{"$f":"IF(DISPONIBILITE!P84=\"oui\",DISPONIBILITE!$E84,\"\")","v":""},{"$f":"IF(DISPONIBILITE!Q84=\"oui\",DISPONIBILITE!$E84,\"\")","v":""},{"$f":"IF(DISPONIBILITE!R84=\"oui\",DISPONIBILITE!$E84,\"\")","v":""},{"$f":"IF(DISPONIBILITE!S84=\"oui\",DISPONIBILITE!$E84,\"\")","v":""},{"$f":"IF(DISPONIBILITE!T84=\"oui\",DISPONIBILITE!$E84,\"\")","v":""},{"$f":"IF(DISPONIBILITE!U84=\"oui\",DISPONIBILITE!$E84,\"\")","v":""},{"$f":"IF(DISPONIBILITE!V84=\"oui\",DISPONIBILITE!$E84,\"\")","v":""},{"$f":"IF(DISPONIBILITE!W84=\"oui\",DISPONIBILITE!$E84,\"\")","v":""}]
[{"$f":"IF(DISPONIBILITE!F85=\"oui\",DISPONIBILITE!$E85,\"\")","v":""},{"$f":"IF(DISPONIBILITE!G85=\"oui\",DISPONIBILITE!$E85,\"\")","v":""},{"$f":"IF(DISPONIBILITE!H85=\"oui\",DISPONIBILITE!$E85,\"\")","v":""},{"$f":"IF(DISPONIBILITE!I85=\"oui\",DISPONIBILITE!$E85,\"\")","v":""},{"$f":"IF(DISPONIBILITE!J85=\"oui\",DISPONIBILITE!$E85,\"\")","v":""},{"$f":"IF(DISPONIBILITE!K85=\"oui\",DISPONIBILITE!$E85,\"\")","v":""},{"$f":"IF(DISPONIBILITE!L85=\"oui\",DISPONIBILITE!$E85,\"\")","v":""},{"$f":"IF(DISPONIBILITE!M85=\"oui\",DISPONIBILITE!$E85,\"\")","v":""},{"$f":"IF(DISPONIBILITE!N85=\"oui\",DISPONIBILITE!$E85,\"\")","v":""},{"$f":"IF(DISPONIBILITE!O85=\"oui\",DISPONIBILITE!$E85,\"\")","v":""},{"$f":"IF(DISPONIBILITE!P85=\"oui\",DISPONIBILITE!$E85,\"\")","v":""},{"$f":"IF(DISPONIBILITE!Q85=\"oui\",DISPONIBILITE!$E85,\"\")","v":""},{"$f":"IF(DISPONIBILITE!R85=\"oui\",DISPONIBILITE!$E85,\"\")","v":""},{"$f":"IF(DISPONIBILITE!S85=\"oui\",DISPONIBILITE!$E85,\"\")","v":""},{"$f":"IF(DISPONIBILITE!T85=\"oui\",DISPONIBILITE!$E85,\"\")","v":""},{"$f":"IF(DISPONIBILITE!U85=\"oui\",DISPONIBILITE!$E85,\"\")","v":""},{"$f":"IF(DISPONIBILITE!V85=\"oui\",DISPONIBILITE!$E85,\"\")","v":""},{"$f":"IF(DISPONIBILITE!W85=\"oui\",DISPONIBILITE!$E85,\"\")","v":""}]
[{"$f":"IF(DISPONIBILITE!F86=\"oui\",DISPONIBILITE!$E86,\"\")","v":""},{"$f":"IF(DISPONIBILITE!G86=\"oui\",DISPONIBILITE!$E86,\"\")","v":""},{"$f":"IF(DISPONIBILITE!H86=\"oui\",DISPONIBILITE!$E86,\"\")","v":""},{"$f":"IF(DISPONIBILITE!I86=\"oui\",DISPONIBILITE!$E86,\"\")","v":""},{"$f":"IF(DISPONIBILITE!J86=\"oui\",DISPONIBILITE!$E86,\"\")","v":""},{"$f":"IF(DISPONIBILITE!K86=\"oui\",DISPONIBILITE!$E86,\"\")","v":""},{"$f":"IF(DISPONIBILITE!L86=\"oui\",DISPONIBILITE!$E86,\"\")","v":""},{"$f":"IF(DISPONIBILITE!M86=\"oui\",DISPONIBILITE!$E86,\"\")","v":""},{"$f":"IF(DISPONIBILITE!N86=\"oui\",DISPONIBILITE!$E86,\"\")","v":""},{"$f":"IF(DISPONIBILITE!O86=\"oui\",DISPONIBILITE!$E86,\"\")","v":""},{"$f":"IF(DISPONIBILITE!P86=\"oui\",DISPONIBILITE!$E86,\"\")","v":""},{"$f":"IF(DISPONIBILITE!Q86=\"oui\",DISPONIBILITE!$E86,\"\")","v":""},{"$f":"IF(DISPONIBILITE!R86=\"oui\",DISPONIBILITE!$E86,\"\")","v":""},{"$f":"IF(DISPONIBILITE!S86=\"oui\",DISPONIBILITE!$E86,\"\")","v":""},{"$f":"IF(DISPONIBILITE!T86=\"oui\",DISPONIBILITE!$E86,\"\")","v":""},{"$f":"IF(DISPONIBILITE!U86=\"oui\",DISPONIBILITE!$E86,\"\")","v":""},{"$f":"IF(DISPONIBILITE!V86=\"oui\",DISPONIBILITE!$E86,\"\")","v":""},{"$f":"IF(DISPONIBILITE!W86=\"oui\",DISPONIBILITE!$E86,\"\")","v":""}]
[{"$f":"IF(DISPONIBILITE!F87=\"oui\",DISPONIBILITE!$E87,\"\")","v":""},{"$f":"IF(DISPONIBILITE!G87=\"oui\",DISPONIBILITE!$E87,\"\")","v":""},{"$f":"IF(DISPONIBILITE!H87=\"oui\",DISPONIBILITE!$E87,\"\")","v":""},{"$f":"IF(DISPONIBILITE!I87=\"oui\",DISPONIBILITE!$E87,\"\")","v":""},{"$f":"IF(DISPONIBILITE!J87=\"oui\",DISPONIBILITE!$E87,\"\")","v":""},{"$f":"IF(DISPONIBILITE!K87=\"oui\",DISPONIBILITE!$E87,\"\")","v":""},{"$f":"IF(DISPONIBILITE!L87=\"oui\",DISPONIBILITE!$E87,\"\")","v":""},{"$f":"IF(DISPONIBILITE!M87=\"oui\",DISPONIBILITE!$E87,\"\")","v":""},{"$f":"IF(DISPONIBILITE!N87=\"oui\",DISPONIBILITE!$E87,\"\")","v":""},{"$f":"IF(DISPONIBILITE!O87=\"oui\",DISPONIBILITE!$E87,\"\")","v":""},{"$f":"IF(DISPONIBILITE!P87=\"oui\",DISPONIBILITE!$E87,\"\")","v":""},{"$f":"IF(DISPONIBILITE!Q87=\"oui\",DISPONIBILITE!$E87,\"\")","v":""},{"$f":"IF(DISPONIBILITE!R87=\"oui\",DISPONIBILITE!$E87,\"\")","v":""},{"$f":"IF(DISPONIBILITE!S87=\"oui\",DISPONIBILITE!$E87,\"\")","v":""},{"$f":"IF(DISPONIBILITE!T87=\"oui\",DISPONIBILITE!$E87,\"\")","v":""},{"$f":"IF(DISPONIBILITE!U87=\"oui\",DISPONIBILITE!$E87,\"\")","v":""},{"$f":"IF(DISPONIBILITE!V87=\"oui\",DISPONIBILITE!$E87,\"\")","v":""},{"$f":"IF(DISPONIBILITE!W87=\"oui\",DISPONIBILITE!$E87,\"\")","v":""}]
[{"$f":"IF(DISPONIBILITE!F88=\"oui\",DISPONIBILITE!$E88,\"\")","v":""},{"$f":"IF(DISPONIBILITE!G88=\"oui\",DISPONIBILITE!$E88,\"\")","v":""},{"$f":"IF(DISPONIBILITE!H88=\"oui\",DISPONIBILITE!$E88,\"\")","v":""},{"$f":"IF(DISPONIBILITE!I88=\"oui\",DISPONIBILITE!$E88,\"\")","v":""},{"$f":"IF(DISPONIBILITE!J88=\"oui\",DISPONIBILITE!$E88,\"\")","v":""},{"$f":"IF(DISPONIBILITE!K88=\"oui\",DISPONIBILITE!$E88,\"\")","v":""},{"$f":"IF(DISPONIBILITE!L88=\"oui\",DISPONIBILITE!$E88,\"\")","v":""},{"$f":"IF(DISPONIBILITE!M88=\"oui\",DISPONIBILITE!$E88,\"\")","v":""},{"$f":"IF(DISPONIBILITE!N88=\"oui\",DISPONIBILITE!$E88,\"\")","v":""},{"$f":"IF(DISPONIBILITE!O88=\"oui\",DISPONIBILITE!$E88,\"\")","v":""},{"$f":"IF(DISPONIBILITE!P88=\"oui\",DISPONIBILITE!$E88,\"\")","v":""},{"$f":"IF(DISPONIBILITE!Q88=\"oui\",DISPONIBILITE!$E88,\"\")","v":""},{"$f":"IF(DISPONIBILITE!R88=\"oui\",DISPONIBILITE!$E88,\"\")","v":""},{"$f":"IF(DISPONIBILITE!S88=\"oui\",DISPONIBILITE!$E88,\"\")","v":""},{"$f":"IF(DISPONIBILITE!T88=\"oui\",DISPONIBILITE!$E88,\"\")","v":""},{"$f":"IF(DISPONIBILITE!U88=\"oui\",DISPONIBILITE!$E88,\"\")","v":""},{"$f":"IF(DISPONIBILITE!V88=\"oui\",DISPONIBILITE!$E88,\"\")","v":""},{"$f":"IF(DISPONIBILITE!W88=\"oui\",DISPONIBILITE!$E88,\"\")","v":""}]
[{"$f":"IF(DISPONIBILITE!F89=\"oui\",DISPONIBILITE!$E89,\"\")","v":""},{"$f":"IF(DISPONIBILITE!G89=\"oui\",DISPONIBILITE!$E89,\"\")","v":""},{"$f":"IF(DISPONIBILITE!H89=\"oui\",DISPONIBILITE!$E89,\"\")","v":""},{"$f":"IF(DISPONIBILITE!I89=\"oui\",DISPONIBILITE!$E89,\"\")","v":""},{"$f":"IF(DISPONIBILITE!J89=\"oui\",DISPONIBILITE!$E89,\"\")","v":""},{"$f":"IF(DISPONIBILITE!K89=\"oui\",DISPONIBILITE!$E89,\"\")","v":""},{"$f":"IF(DISPONIBILITE!L89=\"oui\",DISPONIBILITE!$E89,\"\")","v":""},{"$f":"IF(DISPONIBILITE!M89=\"oui\",DISPONIBILITE!$E89,\"\")","v":""},{"$f":"IF(DISPONIBILITE!N89=\"oui\",DISPONIBILITE!$E89,\"\")","v":""},{"$f":"IF(DISPONIBILITE!O89=\"oui\",DISPONIBILITE!$E89,\"\")","v":""},{"$f":"IF(DISPONIBILITE!P89=\"oui\",DISPONIBILITE!$E89,\"\")","v":""},{"$f":"IF(DISPONIBILITE!Q89=\"oui\",DISPONIBILITE!$E89,\"\")","v":""},{"$f":"IF(DISPONIBILITE!R89=\"oui\",DISPONIBILITE!$E89,\"\")","v":""},{"$f":"IF(DISPONIBILITE!S89=\"oui\",DISPONIBILITE!$E89,\"\")","v":""},{"$f":"IF(DISPONIBILITE!T89=\"oui\",DISPONIBILITE!$E89,\"\")","v":""},{"$f":"IF(DISPONIBILITE!U89=\"oui\",DISPONIBILITE!$E89,\"\")","v":""},{"$f":"IF(DISPONIBILITE!V89=\"oui\",DISPONIBILITE!$E89,\"\")","v":""},{"$f":"IF(DISPONIBILITE!W89=\"oui\",DISPONIBILITE!$E89,\"\")","v":""}]
[{"$f":"IF(DISPONIBILITE!F90=\"oui\",DISPONIBILITE!$E90,\"\")","v":""},{"$f":"IF(DISPONIBILITE!G90=\"oui\",DISPONIBILITE!$E90,\"\")","v":""},{"$f":"IF(DISPONIBILITE!H90=\"oui\",DISPONIBILITE!$E90,\"\")","v":""},{"$f":"IF(DISPONIBILITE!I90=\"oui\",DISPONIBILITE!$E90,\"\")","v":""},{"$f":"IF(DISPONIBILITE!J90=\"oui\",DISPONIBILITE!$E90,\"\")","v":""},{"$f":"IF(DISPONIBILITE!K90=\"oui\",DISPONIBILITE!$E90,\"\")","v":""},{"$f":"IF(DISPONIBILITE!L90=\"oui\",DISPONIBILITE!$E90,\"\")","v":""},{"$f":"IF(DISPONIBILITE!M90=\"oui\",DISPONIBILITE!$E90,\"\")","v":""},{"$f":"IF(DISPONIBILITE!N90=\"oui\",DISPONIBILITE!$E90,\"\")","v":""},{"$f":"IF(DISPONIBILITE!O90=\"oui\",DISPONIBILITE!$E90,\"\")","v":""},{"$f":"IF(DISPONIBILITE!P90=\"oui\",DISPONIBILITE!$E90,\"\")","v":""},{"$f":"IF(DISPONIBILITE!Q90=\"oui\",DISPONIBILITE!$E90,\"\")","v":""},{"$f":"IF(DISPONIBILITE!R90=\"oui\",DISPONIBILITE!$E90,\"\")","v":""},{"$f":"IF(DISPONIBILITE!S90=\"oui\",DISPONIBILITE!$E90,\"\")","v":""},{"$f":"IF(DISPONIBILITE!T90=\"oui\",DISPONIBILITE!$E90,\"\")","v":""},{"$f":"IF(DISPONIBILITE!U90=\"oui\",DISPONIBILITE!$E90,\"\")","v":""},{"$f":"IF(DISPONIBILITE!V90=\"oui\",DISPONIBILITE!$E90,\"\")","v":""},{"$f":"IF(DISPONIBILITE!W90=\"oui\",DISPONIBILITE!$E90,\"\")","v":""}]
[{"$f":"IF(DISPONIBILITE!F91=\"oui\",DISPONIBILITE!$E91,\"\")","v":""},{"$f":"IF(DISPONIBILITE!G91=\"oui\",DISPONIBILITE!$E91,\"\")","v":""},{"$f":"IF(DISPONIBILITE!H91=\"oui\",DISPONIBILITE!$E91,\"\")","v":""},{"$f":"IF(DISPONIBILITE!I91=\"oui\",DISPONIBILITE!$E91,\"\")","v":""},{"$f":"IF(DISPONIBILITE!J91=\"oui\",DISPONIBILITE!$E91,\"\")","v":""},{"$f":"IF(DISPONIBILITE!K91=\"oui\",DISPONIBILITE!$E91,\"\")","v":""},{"$f":"IF(DISPONIBILITE!L91=\"oui\",DISPONIBILITE!$E91,\"\")","v":""},{"$f":"IF(DISPONIBILITE!M91=\"oui\",DISPONIBILITE!$E91,\"\")","v":""},{"$f":"IF(DISPONIBILITE!N91=\"oui\",DISPONIBILITE!$E91,\"\")","v":""},{"$f":"IF(DISPONIBILITE!O91=\"oui\",DISPONIBILITE!$E91,\"\")","v":""},{"$f":"IF(DISPONIBILITE!P91=\"oui\",DISPONIBILITE!$E91,\"\")","v":""},{"$f":"IF(DISPONIBILITE!Q91=\"oui\",DISPONIBILITE!$E91,\"\")","v":""},{"$f":"IF(DISPONIBILITE!R91=\"oui\",DISPONIBILITE!$E91,\"\")","v":""},{"$f":"IF(DISPONIBILITE!S91=\"oui\",DISPONIBILITE!$E91,\"\")","v":""},{"$f":"IF(DISPONIBILITE!T91=\"oui\",DISPONIBILITE!$E91,\"\")","v":""},{"$f":"IF(DISPONIBILITE!U91=\"oui\",DISPONIBILITE!$E91,\"\")","v":""},{"$f":"IF(DISPONIBILITE!V91=\"oui\",DISPONIBILITE!$E91,\"\")","v":""},{"$f":"IF(DISPONIBILITE!W91=\"oui\",DISPONIBILITE!$E91,\"\")","v":""}]
[{"$f":"IF(DISPONIBILITE!F92=\"oui\",DISPONIBILITE!$E92,\"\")","v":""},{"$f":"IF(DISPONIBILITE!G92=\"oui\",DISPONIBILITE!$E92,\"\")","v":""},{"$f":"IF(DISPONIBILITE!H92=\"oui\",DISPONIBILITE!$E92,\"\")","v":""},{"$f":"IF(DISPONIBILITE!I92=\"oui\",DISPONIBILITE!$E92,\"\")","v":""},{"$f":"IF(DISPONIBILITE!J92=\"oui\",DISPONIBILITE!$E92,\"\")","v":""},{"$f":"IF(DISPONIBILITE!K92=\"oui\",DISPONIBILITE!$E92,\"\")","v":""},{"$f":"IF(DISPONIBILITE!L92=\"oui\",DISPONIBILITE!$E92,\"\")","v":""},{"$f":"IF(DISPONIBILITE!M92=\"oui\",DISPONIBILITE!$E92,\"\")","v":""},{"$f":"IF(DISPONIBILITE!N92=\"oui\",DISPONIBILITE!$E92,\"\")","v":""},{"$f":"IF(DISPONIBILITE!O92=\"oui\",DISPONIBILITE!$E92,\"\")","v":""},{"$f":"IF(DISPONIBILITE!P92=\"oui\",DISPONIBILITE!$E92,\"\")","v":""},{"$f":"IF(DISPONIBILITE!Q92=\"oui\",DISPONIBILITE!$E92,\"\")","v":""},{"$f":"IF(DISPONIBILITE!R92=\"oui\",DISPONIBILITE!$E92,\"\")","v":""},{"$f":"IF(DISPONIBILITE!S92=\"oui\",DISPONIBILITE!$E92,\"\")","v":""},{"$f":"IF(DISPONIBILITE!T92=\"oui\",DISPONIBILITE!$E92,\"\")","v":""},{"$f":"IF(DISPONIBILITE!U92=\"oui\",DISPONIBILITE!$E92,\"\")","v":""},{"$f":"IF(DISPONIBILITE!V92=\"oui\",DISPONIBILITE!$E92,\"\")","v":""},{"$f":"IF(DISPONIBILITE!W92=\"oui\",DISPONIBILITE!$E92,\"\")","v":""}]
[{"$f":"IF(DISPONIBILITE!F93=\"oui\",DISPONIBILITE!$E93,\"\")","v":""},{"$f":"IF(DISPONIBILITE!G93=\"oui\",DISPONIBILITE!$E93,\"\")","v":""},{"$f":"IF(DISPONIBILITE!H93=\"oui\",DISPONIBILITE!$E93,\"\")","v":""},{"$f":"IF(DISPONIBILITE!I93=\"oui\",DISPONIBILITE!$E93,\"\")","v":""},{"$f":"IF(DISPONIBILITE!J93=\"oui\",DISPONIBILITE!$E93,\"\")","v":""},{"$f":"IF(DISPONIBILITE!K93=\"oui\",DISPONIBILITE!$E93,\"\")","v":""},{"$f":"IF(DISPONIBILITE!L93=\"oui\",DISPONIBILITE!$E93,\"\")","v":""},{"$f":"IF(DISPONIBILITE!M93=\"oui\",DISPONIBILITE!$E93,\"\")","v":""},{"$f":"IF(DISPONIBILITE!N93=\"oui\",DISPONIBILITE!$E93,\"\")","v":""},{"$f":"IF(DISPONIBILITE!O93=\"oui\",DISPONIBILITE!$E93,\"\")","v":""},{"$f":"IF(DISPONIBILITE!P93=\"oui\",DISPONIBILITE!$E93,\"\")","v":""},{"$f":"IF(DISPONIBILITE!Q93=\"oui\",DISPONIBILITE!$E93,\"\")","v":""},{"$f":"IF(DISPONIBILITE!R93=\"oui\",DISPONIBILITE!$E93,\"\")","v":""},{"$f":"IF(DISPONIBILITE!S93=\"oui\",DISPONIBILITE!$E93,\"\")","v":""},{"$f":"IF(DISPONIBILITE!T93=\"oui\",DISPONIBILITE!$E93,\"\")","v":""},{"$f":"IF(DISPONIBILITE!U93=\"oui\",DISPONIBILITE!$E93,\"\")","v":""},{"$f":"IF(DISPONIBILITE!V93=\"oui\",DISPONIBILITE!$E93,\"\")","v":""},{"$f":"IF(DISPONIBILITE!W93=\"oui\",DISPONIBILITE!$E93,\"\")","v":""}]
[{"$f":"IF(DISPONIBILITE!F94=\"oui\",DISPONIBILITE!$E94,\"\")","v":""},{"$f":"IF(DISPONIBILITE!G94=\"oui\",DISPONIBILITE!$E94,\"\")","v":""},{"$f":"IF(DISPONIBILITE!H94=\"oui\",DISPONIBILITE!$E94,\"\")","v":""},{"$f":"IF(DISPONIBILITE!I94=\"oui\",DISPONIBILITE!$E94,\"\")","v":""},{"$f":"IF(DISPONIBILITE!J94=\"oui\",DISPONIBILITE!$E94,\"\")","v":""},{"$f":"IF(DISPONIBILITE!K94=\"oui\",DISPONIBILITE!$E94,\"\")","v":""},{"$f":"IF(DISPONIBILITE!L94=\"oui\",DISPONIBILITE!$E94,\"\")","v":""},{"$f":"IF(DISPONIBILITE!M94=\"oui\",DISPONIBILITE!$E94,\"\")","v":""},{"$f":"IF(DISPONIBILITE!N94=\"oui\",DISPONIBILITE!$E94,\"\")","v":""},{"$f":"IF(DISPONIBILITE!O94=\"oui\",DISPONIBILITE!$E94,\"\")","v":""},{"$f":"IF(DISPONIBILITE!P94=\"oui\",DISPONIBILITE!$E94,\"\")","v":""},{"$f":"IF(DISPONIBILITE!Q94=\"oui\",DISPONIBILITE!$E94,\"\")","v":""},{"$f":"IF(DISPONIBILITE!R94=\"oui\",DISPONIBILITE!$E94,\"\")","v":""},{"$f":"IF(DISPONIBILITE!S94=\"oui\",DISPONIBILITE!$E94,\"\")","v":""},{"$f":"IF(DISPONIBILITE!T94=\"oui\",DISPONIBILITE!$E94,\"\")","v":""},{"$f":"IF(DISPONIBILITE!U94=\"oui\",DISPONIBILITE!$E94,\"\")","v":""},{"$f":"IF(DISPONIBILITE!V94=\"oui\",DISPONIBILITE!$E94,\"\")","v":""},{"$f":"IF(DISPONIBILITE!W94=\"oui\",DISPONIBILITE!$E94,\"\")","v":""}]
[{"$f":"IF(DISPONIBILITE!F95=\"oui\",DISPONIBILITE!$E95,\"\")","v":""},{"$f":"IF(DISPONIBILITE!G95=\"oui\",DISPONIBILITE!$E95,\"\")","v":""},{"$f":"IF(DISPONIBILITE!H95=\"oui\",DISPONIBILITE!$E95,\"\")","v":""},{"$f":"IF(DISPONIBILITE!I95=\"oui\",DISPONIBILITE!$E95,\"\")","v":""},{"$f":"IF(DISPONIBILITE!J95=\"oui\",DISPONIBILITE!$E95,\"\")","v":""},{"$f":"IF(DISPONIBILITE!K95=\"oui\",DISPONIBILITE!$E95,\"\")","v":""},{"$f":"IF(DISPONIBILITE!L95=\"oui\",DISPONIBILITE!$E95,\"\")","v":""},{"$f":"IF(DISPONIBILITE!M95=\"oui\",DISPONIBILITE!$E95,\"\")","v":""},{"$f":"IF(DISPONIBILITE!N95=\"oui\",DISPONIBILITE!$E95,\"\")","v":""},{"$f":"IF(DISPONIBILITE!O95=\"oui\",DISPONIBILITE!$E95,\"\")","v":""},{"$f":"IF(DISPONIBILITE!P95=\"oui\",DISPONIBILITE!$E95,\"\")","v":""},{"$f":"IF(DISPONIBILITE!Q95=\"oui\",DISPONIBILITE!$E95,\"\")","v":""},{"$f":"IF(DISPONIBILITE!R95=\"oui\",DISPONIBILITE!$E95,\"\")","v":""},{"$f":"IF(DISPONIBILITE!S95=\"oui\",DISPONIBILITE!$E95,\"\")","v":""},{"$f":"IF(DISPONIBILITE!T95=\"oui\",DISPONIBILITE!$E95,\"\")","v":""},{"$f":"IF(DISPONIBILITE!U95=\"oui\",DISPONIBILITE!$E95,\"\")","v":""},{"$f":"IF(DISPONIBILITE!V95=\"oui\",DISPONIBILITE!$E95,\"\")","v":""},{"$f":"IF(DISPONIBILITE!W95=\"oui\",DISPONIBILITE!$E95,\"\")","v":""}]
[{"$f":"IF(DISPONIBILITE!F96=\"oui\",DISPONIBILITE!$E96,\"\")","v":""},{"$f":"IF(DISPONIBILITE!G96=\"oui\",DISPONIBILITE!$E96,\"\")","v":""},{"$f":"IF(DISPONIBILITE!H96=\"oui\",DISPONIBILITE!$E96,\"\")","v":""},{"$f":"IF(DISPONIBILITE!I96=\"oui\",DISPONIBILITE!$E96,\"\")","v":""},{"$f":"IF(DISPONIBILITE!J96=\"oui\",DISPONIBILITE!$E96,\"\")","v":""},{"$f":"IF(DISPONIBILITE!K96=\"oui\",DISPONIBILITE!$E96,\"\")","v":""},{"$f":"IF(DISPONIBILITE!L96=\"oui\",DISPONIBILITE!$E96,\"\")","v":""},{"$f":"IF(DISPONIBILITE!M96=\"oui\",DISPONIBILITE!$E96,\"\")","v":""},{"$f":"IF(DISPONIBILITE!N96=\"oui\",DISPONIBILITE!$E96,\"\")","v":""},{"$f":"IF(DISPONIBILITE!O96=\"oui\",DISPONIBILITE!$E96,\"\")","v":""},{"$f":"IF(DISPONIBILITE!P96=\"oui\",DISPONIBILITE!$E96,\"\")","v":""},{"$f":"IF(DISPONIBILITE!Q96=\"oui\",DISPONIBILITE!$E96,\"\")","v":""},{"$f":"IF(DISPONIBILITE!R96=\"oui\",DISPONIBILITE!$E96,\"\")","v":""},{"$f":"IF(DISPONIBILITE!S96=\"oui\",DISPONIBILITE!$E96,\"\")","v":""},{"$f":"IF(DISPONIBILITE!T96=\"oui\",DISPONIBILITE!$E96,\"\")","v":""},{"$f":"IF(DISPONIBILITE!U96=\"oui\",DISPONIBILITE!$E96,\"\")","v":""},{"$f":"IF(DISPONIBILITE!V96=\"oui\",DISPONIBILITE!$E96,\"\")","v":""},{"$f":"IF(DISPONIBILITE!W96=\"oui\",DISPONIBILITE!$E96,\"\")","v":""}]
[{"$f":"IF(DISPONIBILITE!F97=\"oui\",DISPONIBILITE!$E97,\"\")","v":""},{"$f":"IF(DISPONIBILITE!G97=\"oui\",DISPONIBILITE!$E97,\"\")","v":""},{"$f":"IF(DISPONIBILITE!H97=\"oui\",DISPONIBILITE!$E97,\"\")","v":""},{"$f":"IF(DISPONIBILITE!I97=\"oui\",DISPONIBILITE!$E97,\"\")","v":""},{"$f":"IF(DISPONIBILITE!J97=\"oui\",DISPONIBILITE!$E97,\"\")","v":""},{"$f":"IF(DISPONIBILITE!K97=\"oui\",DISPONIBILITE!$E97,\"\")","v":""},{"$f":"IF(DISPONIBILITE!L97=\"oui\",DISPONIBILITE!$E97,\"\")","v":""},{"$f":"IF(DISPONIBILITE!M97=\"oui\",DISPONIBILITE!$E97,\"\")","v":""},{"$f":"IF(DISPONIBILITE!N97=\"oui\",DISPONIBILITE!$E97,\"\")","v":""},{"$f":"IF(DISPONIBILITE!O97=\"oui\",DISPONIBILITE!$E97,\"\")","v":""},{"$f":"IF(DISPONIBILITE!P97=\"oui\",DISPONIBILITE!$E97,\"\")","v":""},{"$f":"IF(DISPONIBILITE!Q97=\"oui\",DISPONIBILITE!$E97,\"\")","v":""},{"$f":"IF(DISPONIBILITE!R97=\"oui\",DISPONIBILITE!$E97,\"\")","v":""},{"$f":"IF(DISPONIBILITE!S97=\"oui\",DISPONIBILITE!$E97,\"\")","v":""},{"$f":"IF(DISPONIBILITE!T97=\"oui\",DISPONIBILITE!$E97,\"\")","v":""},{"$f":"IF(DISPONIBILITE!U97=\"oui\",DISPONIBILITE!$E97,\"\")","v":""},{"$f":"IF(DISPONIBILITE!V97=\"oui\",DISPONIBILITE!$E97,\"\")","v":""},{"$f":"IF(DISPONIBILITE!W97=\"oui\",DISPONIBILITE!$E97,\"\")","v":""}]
[{"$f":"IF(DISPONIBILITE!F98=\"oui\",DISPONIBILITE!$E98,\"\")","v":""},{"$f":"IF(DISPONIBILITE!G98=\"oui\",DISPONIBILITE!$E98,\"\")","v":""},{"$f":"IF(DISPONIBILITE!H98=\"oui\",DISPONIBILITE!$E98,\"\")","v":""},{"$f":"IF(DISPONIBILITE!I98=\"oui\",DISPONIBILITE!$E98,\"\")","v":""},{"$f":"IF(DISPONIBILITE!J98=\"oui\",DISPONIBILITE!$E98,\"\")","v":""},{"$f":"IF(DISPONIBILITE!K98=\"oui\",DISPONIBILITE!$E98,\"\")","v":""},{"$f":"IF(DISPONIBILITE!L98=\"oui\",DISPONIBILITE!$E98,\"\")","v":""},{"$f":"IF(DISPONIBILITE!M98=\"oui\",DISPONIBILITE!$E98,\"\")","v":""},{"$f":"IF(DISPONIBILITE!N98=\"oui\",DISPONIBILITE!$E98,\"\")","v":""},{"$f":"IF(DISPONIBILITE!O98=\"oui\",DISPONIBILITE!$E98,\"\")","v":""},{"$f":"IF(DISPONIBILITE!P98=\"oui\",DISPONIBILITE!$E98,\"\")","v":""},{"$f":"IF(DISPONIBILITE!Q98=\"oui\",DISPONIBILITE!$E98,\"\")","v":""},{"$f":"IF(DISPONIBILITE!R98=\"oui\",DISPONIBILITE!$E98,\"\")","v":""},{"$f":"IF(DISPONIBILITE!S98=\"oui\",DISPONIBILITE!$E98,\"\")","v":""},{"$f":"IF(DISPONIBILITE!T98=\"oui\",DISPONIBILITE!$E98,\"\")","v":""},{"$f":"IF(DISPONIBILITE!U98=\"oui\",DISPONIBILITE!$E98,\"\")","v":""},{"$f":"IF(DISPONIBILITE!V98=\"oui\",DISPONIBILITE!$E98,\"\")","v":""},{"$f":"IF(DISPONIBILITE!W98=\"oui\",DISPONIBILITE!$E98,\"\")","v":""}]
[{"$f":"IF(DISPONIBILITE!F99=\"oui\",DISPONIBILITE!$E99,\"\")","v":""},{"$f":"IF(DISPONIBILITE!G99=\"oui\",DISPONIBILITE!$E99,\"\")","v":""},{"$f":"IF(DISPONIBILITE!H99=\"oui\",DISPONIBILITE!$E99,\"\")","v":""},{"$f":"IF(DISPONIBILITE!I99=\"oui\",DISPONIBILITE!$E99,\"\")","v":""},{"$f":"IF(DISPONIBILITE!J99=\"oui\",DISPONIBILITE!$E99,\"\")","v":""},{"$f":"IF(DISPONIBILITE!K99=\"oui\",DISPONIBILITE!$E99,\"\")","v":""},{"$f":"IF(DISPONIBILITE!L99=\"oui\",DISPONIBILITE!$E99,\"\")","v":""},{"$f":"IF(DISPONIBILITE!M99=\"oui\",DISPONIBILITE!$E99,\"\")","v":""},{"$f":"IF(DISPONIBILITE!N99=\"oui\",DISPONIBILITE!$E99,\"\")","v":""},{"$f":"IF(DISPONIBILITE!O99=\"oui\",DISPONIBILITE!$E99,\"\")","v":""},{"$f":"IF(DISPONIBILITE!P99=\"oui\",DISPONIBILITE!$E99,\"\")","v":""},{"$f":"IF(DISPONIBILITE!Q99=\"oui\",DISPONIBILITE!$E99,\"\")","v":""},{"$f":"IF(DISPONIBILITE!R99=\"oui\",DISPONIBILITE!$E99,\"\")","v":""},{"$f":"IF(DISPONIBILITE!S99=\"oui\",DISPONIBILITE!$E99,\"\")","v":""},{"$f":"IF(DISPONIBILITE!T99=\"oui\",DISPONIBILITE!$E99,\"\")","v":""},{"$f":"IF(DISPONIBILITE!U99=\"oui\",DISPONIBILITE!$E99,\"\")","v":""},{"$f":"IF(DISPONIBILITE!V99=\"oui\",DISPONIBILITE!$E99,\"\")","v":""},{"$f":"IF(DISPONIBILITE!W99=\"oui\",DISPONIBILITE!$E99,\"\")","v":""}]
[{"$f":"IF(DISPONIBILITE!F100=\"oui\",DISPONIBILITE!$E100,\"\")","v":""},{"$f":"IF(DISPONIBILITE!G100=\"oui\",DISPONIBILITE!$E100,\"\")","v":""},{"$f":"IF(DISPONIBILITE!H100=\"oui\",DISPONIBILITE!$E100,\"\")","v":""},{"$f":"IF(DISPONIBILITE!I100=\"oui\",DISPONIBILITE!$E100,\"\")","v":""},{"$f":"IF(DISPONIBILITE!J100=\"oui\",DISPONIBILITE!$E100,\"\")","v":""},{"$f":"IF(DISPONIBILITE!K100=\"oui\",DISPONIBILITE!$E100,\"\")","v":""},{"$f":"IF(DISPONIBILITE!L100=\"oui\",DISPONIBILITE!$E100,\"\")","v":""},{"$f":"IF(DISPONIBILITE!M100=\"oui\",DISPONIBILITE!$E100,\"\")","v":""},{"$f":"IF(DISPONIBILITE!N100=\"oui\",DISPONIBILITE!$E100,\"\")","v":""},{"$f":"IF(DISPONIBILITE!O100=\"oui\",DISPONIBILITE!$E100,\"\")","v":""},{"$f":"IF(DISPONIBILITE!P100=\"oui\",DISPONIBILITE!$E100,\"\")","v":""},{"$f":"IF(DISPONIBILITE!Q100=\"oui\",DISPONIBILITE!$E100,\"\")","v":""},{"$f":"IF(DISPONIBILITE!R100=\"oui\",DISPONIBILITE!$E100,\"\")","v":""},{"$f":"IF(DISPONIBILITE!S100=\"oui\",DISPONIBILITE!$E100,\"\")","v":""},{"$f":"IF(DISPONIBILITE!T100=\"oui\",DISPONIBILITE!$E100,\"\")","v":""},{"$f":"IF(DISPONIBILITE!U100=\"oui\",DISPONIBILITE!$E100,\"\")","v":""},{"$f":"IF(DISPONIBILITE!V100=\"oui\",DISPONIBILITE!$E100,\"\")","v":""},{"$f":"IF(DISPONIBILITE!W100=\"oui\",DISPONIBILITE!$E100,\"\")","v":""}]
[{"$f":"IF(DISPONIBILITE!F101=\"oui\",DISPONIBILITE!$E101,\"\")","v":""},{"$f":"IF(DISPONIBILITE!G101=\"oui\",DISPONIBILITE!$E101,\"\")","v":""},{"$f":"IF(DISPONIBILITE!H101=\"oui\",DISPONIBILITE!$E101,\"\")","v":""},{"$f":"IF(DISPONIBILITE!I101=\"oui\",DISPONIBILITE!$E101,\"\")","v":""},{"$f":"IF(DISPONIBILITE!J101=\"oui\",DISPONIBILITE!$E101,\"\")","v":""},{"$f":"IF(DISPONIBILITE!K101=\"oui\",DISPONIBILITE!$E101,\"\")","v":""},{"$f":"IF(DISPONIBILITE!L101=\"oui\",DISPONIBILITE!$E101,\"\")","v":""},{"$f":"IF(DISPONIBILITE!M101=\"oui\",DISPONIBILITE!$E101,\"\")","v":""},{"$f":"IF(DISPONIBILITE!N101=\"oui\",DISPONIBILITE!$E101,\"\")","v":""},{"$f":"IF(DISPONIBILITE!O101=\"oui\",DISPONIBILITE!$E101,\"\")","v":""},{"$f":"IF(DISPONIBILITE!P101=\"oui\",DISPONIBILITE!$E101,\"\")","v":""},{"$f":"IF(DISPONIBILITE!Q101=\"oui\",DISPONIBILITE!$E101,\"\")","v":""},{"$f":"IF(DISPONIBILITE!R101=\"oui\",DISPONIBILITE!$E101,\"\")","v":""},{"$f":"IF(DISPONIBILITE!S101=\"oui\",DISPONIBILITE!$E101,\"\")","v":""},{"$f":"IF(DISPONIBILITE!T101=\"oui\",DISPONIBILITE!$E101,\"\")","v":""},{"$f":"IF(DISPONIBILITE!U101=\"oui\",DISPONIBILITE!$E101,\"\")","v":""},{"$f":"IF(DISPONIBILITE!V101=\"oui\",DISPONIBILITE!$E101,\"\")","v":""},{"$f":"IF(DISPONIBILITE!W101=\"oui\",DISPONIBILITE!$E101,\"\")","v":""}]
[{"$f":"IF(DISPONIBILITE!F102=\"oui\",DISPONIBILITE!$E102,\"\")","v":""},{"$f":"IF(DISPONIBILITE!G102=\"oui\",DISPONIBILITE!$E102,\"\")","v":""},{"$f":"IF(DISPONIBILITE!H102=\"oui\",DISPONIBILITE!$E102,\"\")","v":""},{"$f":"IF(DISPONIBILITE!I102=\"oui\",DISPONIBILITE!$E102,\"\")","v":""},{"$f":"IF(DISPONIBILITE!J102=\"oui\",DISPONIBILITE!$E102,\"\")","v":""},{"$f":"IF(DISPONIBILITE!K102=\"oui\",DISPONIBILITE!$E102,\"\")","v":""},{"$f":"IF(DISPONIBILITE!L102=\"oui\",DISPONIBILITE!$E102,\"\")","v":""},{"$f":"IF(DISPONIBILITE!M102=\"oui\",DISPONIBILITE!$E102,\"\")","v":""},{"$f":"IF(DISPONIBILITE!N102=\"oui\",DISPONIBILITE!$E102,\"\")","v":""},{"$f":"IF(DISPONIBILITE!O102=\"oui\",DISPONIBILITE!$E102,\"\")","v":""},{"$f":"IF(DISPONIBILITE!P102=\"oui\",DISPONIBILITE!$E102,\"\")","v":""},{"$f":"IF(DISPONIBILITE!Q102=\"oui\",DISPONIBILITE!$E102,\"\")","v":""},{"$f":"IF(DISPONIBILITE!R102=\"oui\",DISPONIBILITE!$E102,\"\")","v":""},{"$f":"IF(DISPONIBILITE!S102=\"oui\",DISPONIBILITE!$E102,\"\")","v":""},{"$f":"IF(DISPONIBILITE!T102=\"oui\",DISPONIBILITE!$E102,\"\")","v":""},{"$f":"IF(DISPONIBILITE!U102=\"oui\",DISPONIBILITE!$E102,\"\")","v":""},{"$f":"IF(DISPONIBILITE!V102=\"oui\",DISPONIBILITE!$E102,\"\")","v":""},{"$f":"IF(DISPONIBILITE!W102=\"oui\",DISPONIBILITE!$E102,\"\")","v":""}]
[{"$f":"IF(DISPONIBILITE!F103=\"oui\",DISPONIBILITE!$E103,\"\")","v":""},{"$f":"IF(DISPONIBILITE!G103=\"oui\",DISPONIBILITE!$E103,\"\")","v":""},{"$f":"IF(DISPONIBILITE!H103=\"oui\",DISPONIBILITE!$E103,\"\")","v":""},{"$f":"IF(DISPONIBILITE!I103=\"oui\",DISPONIBILITE!$E103,\"\")","v":""},{"$f":"IF(DISPONIBILITE!J103=\"oui\",DISPONIBILITE!$E103,\"\")","v":""},{"$f":"IF(DISPONIBILITE!K103=\"oui\",DISPONIBILITE!$E103,\"\")","v":""},{"$f":"IF(DISPONIBILITE!L103=\"oui\",DISPONIBILITE!$E103,\"\")","v":""},{"$f":"IF(DISPONIBILITE!M103=\"oui\",DISPONIBILITE!$E103,\"\")","v":""},{"$f":"IF(DISPONIBILITE!N103=\"oui\",DISPONIBILITE!$E103,\"\")","v":""},{"$f":"IF(DISPONIBILITE!O103=\"oui\",DISPONIBILITE!$E103,\"\")","v":""},{"$f":"IF(DISPONIBILITE!P103=\"oui\",DISPONIBILITE!$E103,\"\")","v":""},{"$f":"IF(DISPONIBILITE!Q103=\"oui\",DISPONIBILITE!$E103,\"\")","v":""},{"$f":"IF(DISPONIBILITE!R103=\"oui\",DISPONIBILITE!$E103,\"\")","v":""},{"$f":"IF(DISPONIBILITE!S103=\"oui\",DISPONIBILITE!$E103,\"\")","v":""},{"$f":"IF(DISPONIBILITE!T103=\"oui\",DISPONIBILITE!$E103,\"\")","v":""},{"$f":"IF(DISPONIBILITE!U103=\"oui\",DISPONIBILITE!$E103,\"\")","v":""},{"$f":"IF(DISPONIBILITE!V103=\"oui\",DISPONIBILITE!$E103,\"\")","v":""},{"$f":"IF(DISPONIBILITE!W103=\"oui\",DISPONIBILITE!$E103,\"\")","v":""}]
[{"$f":"IF(DISPONIBILITE!F104=\"oui\",DISPONIBILITE!$E104,\"\")","v":""},{"$f":"IF(DISPONIBILITE!G104=\"oui\",DISPONIBILITE!$E104,\"\")","v":""},{"$f":"IF(DISPONIBILITE!H104=\"oui\",DISPONIBILITE!$E104,\"\")","v":""},{"$f":"IF(DISPONIBILITE!I104=\"oui\",DISPONIBILITE!$E104,\"\")","v":""},{"$f":"IF(DISPONIBILITE!J104=\"oui\",DISPONIBILITE!$E104,\"\")","v":""},{"$f":"IF(DISPONIBILITE!K104=\"oui\",DISPONIBILITE!$E104,\"\")","v":""},{"$f":"IF(DISPONIBILITE!L104=\"oui\",DISPONIBILITE!$E104,\"\")","v":""},{"$f":"IF(DISPONIBILITE!M104=\"oui\",DISPONIBILITE!$E104,\"\")","v":""},{"$f":"IF(DISPONIBILITE!N104=\"oui\",DISPONIBILITE!$E104,\"\")","v":""},{"$f":"IF(DISPONIBILITE!O104=\"oui\",DISPONIBILITE!$E104,\"\")","v":""},{"$f":"IF(DISPONIBILITE!P104=\"oui\",DISPONIBILITE!$E104,\"\")","v":""},{"$f":"IF(DISPONIBILITE!Q104=\"oui\",DISPONIBILITE!$E104,\"\")","v":""},{"$f":"IF(DISPONIBILITE!R104=\"oui\",DISPONIBILITE!$E104,\"\")","v":""},{"$f":"IF(DISPONIBILITE!S104=\"oui\",DISPONIBILITE!$E104,\"\")","v":""},{"$f":"IF(DISPONIBILITE!T104=\"oui\",DISPONIBILITE!$E104,\"\")","v":""},{"$f":"IF(DISPONIBILITE!U104=\"oui\",DISPONIBILITE!$E104,\"\")","v":""},{"$f":"IF(DISPONIBILITE!V104=\"oui\",DISPONIBILITE!$E104,\"\")","v":""},{"$f":"IF(DISPONIBILITE!W104=\"oui\",DISPONIBILITE!$E104,\"\")","v":""}]
[null,null,null,null,""]
[null,null,null,null,""]
[null,null,null,null,""]
[null,null,null,null,""]
[null,null,null,null,""]
[null,null,null,null,""]
[null,null,null,null,""]
[null,null,null,null,""]
[null,null,null,null,""]
[null,null,null,null,""]
[null,null,null,null,""]
[null,null,null,null,""]
[null,null,null,null,""]
[null,null,null,null,""]
[null,null,null,null,""]
[null,null,null,null,""]
[null,null,null,null,""]
[null,null,null,null,""]
[null,null,null,null,""]
[null,null,null,null,""]
[null,null,null,null,""]
[null,null,null,null,""]
[null,null,null,null,""]
[null,null,null,null,""]
[null,null,null,null,""]
[null,null,null,null,""]
[null,null,null,null,""]
[null,null,null,null,""]
[null,null,null,null,""]
[null,null,null,null,""]
[null,null,null,null,""]
[null,null,null,null,""]
[null,null,null,null,""]
[null,null,null,null,""]
[null,null,null,null,""]
[null,null,null,null,""]
[null,null,null,null,""]
[null,null,null,null,""]
[null,null,null,null,""]
[null,null,null,null,""]
[null,null,null,null,""]
[null,null,null,null,""]
[null,null,null,null,""]
[null,null,null,null,""]
[null,null,null,null,""]
[null,null,null,null,""]
[null,null,null,null,"BEAUGION (K) Régis"]
[null,null,null,null,"BOTHOREL Hélène"]
[null,null,null,null,"BOURGUIGNON Catherine"]
[null,null,null,null,"CAHN Didier"]
[null,null,null,null,"DANIEL Alain"]
[null,null,null,null,"DANIEL Annie France"]
[null,null,null,null,"DESECHALLIERS Carole"]
[null,null,null,null,"DESJARDINS Jean Luc"]
[null,null,null,null,"GAONACH (THG) Sarah"]
[null,null,null,null,"GUEGUEN (K) Sébastien"]
[null,null,null,null,"GUERROT (THG) Gildas"]
[null,null,null,null,"GUEZENNEC (K) Bruno"]
[null,null,null,null,"JANOT (K) Laetitia"]
[null,null,null,null,"KERLEO Anne Marie"]
[null,null,null,null,"LANDOUARD Frédéric"]
[null,null,null,null,"LE BAIL Hervé"]
[null,null,null,null,"LE BIHAN Guy"]
[null,null,null,null,"LE CORRE  Jérémy"]
[null,null,null,null,"LE ROUX Stéphanie"]
[null,null,null,null,"LE ROY  Julian"]
[null,null,null,null,"MALANDAIN Manuela"]
[null,null,null,null,"NHEK (K) Alexandrine"]
[null,null,null,null,"PLOUZENNEC Nadine"]
[null,null,null,null,"RAFFO Carine"]
[null,null,null,null,"RAMA (THG) Jurgen"]
[null,null,null,null,"ROBERT Mireille"]
[null,null,null,null,"ROUGER Olga"]
[null,null,null,null,"STRUILLOU (K) Charlotte"]
[null,null,null,null,"TANGUY Bob"]
[null,null,null,null,"TROBOE Marcel"]

{"sheet":"Présence2","index":12,"n_rows":104,"n_cols":72,"rows_kept":104,"cut":false,"hidden":false,"merged":[[0,68,0,71],[1,0,1,3],[1,4,1,7],[1,8,1,11],[1,12,1,15],[1,16,1,19],[1,20,1,23],[1,24,1,27],[1,28,1,31],[1,32,1,35],[0,0,0,10],[0,12,0,23],[0,24,0,34],[0,36,0,47],[0,48,0,58],[0,60,0,67],[1,60,1,63],[1,64,1,67],[1,68,1,71],[1,36,1,39],[1,40,1,43],[1,44,1,47],[1,48,1,51],[1,52,1,55],[1,56,1,59]]}
["Lundi",null,null,null,null,null,null,null,null,null,null,null,"Mardi",null,null,null,null,null,null,null,null,null,null,null,"Mercredi",null,null,null,null,null,null,null,null,null,null,null,"Jeudi",null,null,null,null,null,null,null,null,null,null,null,"Vendredi",null,null,null,null,null,null,null,null,null,null,null,"Samedi",null,null,null,null,null,null,null,"Dimanche"]
["09:00 - 14:00",null,null,null,"14:00 - 18:00",null,null,null,"> 18:00",null,null,null,"09:00 - 14:00",null,null,null,"14:00 - 18:00",null,null,null,"> 18:00",null,null,null,"09:00 - 14:00",null,null,null,"14:00 - 18:00",null,null,null,"> 18:00",null,null,null,"09:00 - 14:00",null,null,null,"14:00 - 18:00",null,null,null,"> 18:00",null,null,null,"09:00 - 14:00",null,null,null,"14:00 - 18:00",null,null,null,"> 18:00",null,null,null,"09:00 - 14:00",null,null,null,"14:00 - 18:00",null,null,null,"13:00 - 18:00"]
["Indice1","NOMS Source1","NOMS_LD1","NOMBRE_1","Indice2","NOMS Source2","NOMS_LD2","NOMBRE_2","Indice3","NOMS Source3","NOMS_LD3","NOMBRE_3","Indice4","NOMS Source 4","NOMS_LD4","NOMBRE_4","Indice5","NOMS Source5","NOMS_LD5","NOMBRE_5","Indice6","NOMS Source6","NOMS_LD6","NOMBRE_6","Indice7","NOMS Source7","NOMS_LD7","NOMBRE_7","Indice8","NOMS Source8","NOMS_LD8","NOMBRE_8","Indice9","NOMS Source9","NOMS_LD9","NOMBRE_9","Indice10","NOMS Source10","NOMS_LD10","NOMBRE_10","Indice11","NOMS Source11","NOMS_LD11","NOMBRE_11","Indice12","NOMS Source12","NOMS_LD12","NOMBRE_12","Indice13","NOMS Source13","NOMS_LD13","NOMBRE_13","Indice14","NOMS Source14","NOMS_LD14","NOMBRE_14","Indice15","NOMS Source15","NOMS_LD15","NOMBRE_15","Indice16","NOMS Source16","NOMS_LD16","NOMBRE_16","Indice17","NOMS Source17","NOMS_LD17","NOMBRE_17","Indice18","NOMS Source 18","NOMS_LD18","NOMBRE_18"]
[0,null,null,{"$f":"IF($C4>\"a\",1,\"\")","v":""},0,null,null,{"$f":"IF($G4>\"a\",1,\"\")","v":""},0,null,null,{"$f":"IF($K4>\"a\",1,\"\")","v":""},0,null,null,{"$f":"IF($O4>\"a\",1,\"\")","v":""},0,null,null,{"$f":"IF($S4>\"a\",1,\"\")","v":""},0,null,null,{"$f":"IF($W4>\"a\",1,\"\")","v":""},0,null,null,{"$f":"IF($AA4>\"a\",1,\"\")","v":""},0,null,null,{"$f":"IF($AE4>\"a\",1,\"\")","v":""},0,null,null,{"$f":"IF($AI4>\"a\",1,\"\")","v":""},0,null,null,{"$f":"IF($AM4>\"a\",1,\"\")","v":""},0,null,null,{"$f":"IF($AQ4>\"a\",1,\"\")","v":""},0,null,null,{"$f":"IF($AU4>\"a\",1,\"\")","v":""},0,null,null,{"$f":"IF($AY4>\"a\",1,\"\")","v":""},0,null,null,{"$f":"IF($BC4>\"a\",1,\"\")","v":""},0,null,null,{"$f":"IF($BG4>\"a\",1,\"\")","v":""},0,null,null,{"$f":"IF($BK4>\"a\",1,\"\")","v":""},0,null,null,{"$f":"IF($BO4>\"a\",1,\"\")","v":""},0,null,null,{"$f":"IF($BS4>\"a\",1,\"\")","v":""}]
[{"$f":"IF(B5=\"\",A4,IF(ISNA(MATCH(B5,'Planning Bénévoles'!C$3:C$40,0))=TRUE,A4+1,A4))","v":0},"",{"$f":"IFERROR(INDEX(B$5:B$104,MATCH(ROW()-4,A$5:A$104,0),1),\"\")","v":"BEAUGION (K) Régis"},{"$f":"IF($C5>\"a\",1,\"\")","v":1},{"$f":"IF(F5=\"\",E4,IF(ISNA(MATCH(F5,'Planning Bénévoles'!D$3:D$40,0))=TRUE,E4+1,E4))","v":0},null,{"$f":"IFERROR(INDEX(F$5:F$104,MATCH(ROW()-4,E$5:E$104,0),1),\"\")","v":"BEAUGION (K) Régis"},{"$f":"IF($G5>\"a\",1,\"\")","v":1},{"$f":"IF(J5=\"\",I4,IF(ISNA(MATCH(J5,'Planning Bénévoles'!E$3:E$40,0))=TRUE,I4+1,I4))","v":0},"",{"$f":"IFERROR(INDEX(J$5:J$104,MATCH(ROW()-4,I$5:I$104,0),1),\"\")","v":"CORNEC Lucas"},{"$f":"IF($K5>\"a\",1,\"\")","v":1},{"$f":"IF(N5=\"\",M4,IF(ISNA(MATCH(N5,'Planning Bénévoles'!F$3:F$40,0))=TRUE,M4+1,M4))","v":0},"",{"$f":"IFERROR(INDEX(N$5:N$104,MATCH(ROW()-4,M$5:M$104,0),1),\"\")","v":"DESJARDINS Jean Luc"},{"$f":"IF($O5>\"a\",1,\"\")","v":1},{"$f":"IF(R5=\"\",Q4,IF(ISNA(MATCH(R5,'Planning Bénévoles'!G$3:G$40,0))=TRUE,Q4+1,Q4))","v":0},"",{"$f":"IFERROR(INDEX(R$5:R$104,MATCH(ROW()-4,Q$5:Q$104,0),1),\"\")","v":"DUTERQUE Frédérique"},{"$f":"IF($S5>\"a\",1,\"\")","v":1},{"$f":"IF(V5=\"\",U4,IF(ISNA(MATCH(V5,'Planning Bénévoles'!H$3:H$40,0))=TRUE,U4+1,U4))","v":0},"",{"$f":"IFERROR(INDEX(V$5:V$104,MATCH(ROW()-4,U$5:U$104,0),1),\"\")","v":"HADOUZI Yasmine"},{"$f":"IF($W5>\"a\",1,\"\")","v":1},{"$f":"IF(Z5=\"\",Y4,IF(ISNA(MATCH(Z5,'Planning Bénévoles'!I$3:I$40,0))=TRUE,Y4+1,Y4))","v":0},"",{"$f":"IFERROR(INDEX(Z$5:Z$104,MATCH(ROW()-4,Y$5:Y$104,0),1),\"\")","v":"LE CORRE  Jérémy"},{"$f":"IF($AA5>\"a\",1,\"\")","v":1},{"$f":"IF(AD5=\"\",AC4,IF(ISNA(MATCH(AD5,'Planning Bénévoles'!J$3:J$40,0))=TRUE,AC4+1,AC4))","v":0},"",{"$f":"IFERROR(INDEX(AD$5:AD$104,MATCH(ROW()-4,AC$5:AC$104,0),1),\"\")","v":"BOURGEON (THG) Jérémy"},{"$f":"IF($AE5>\"a\",1,\"\")","v":1},{"$f":"IF(AH5=\"\",AG4,IF(ISNA(MATCH(AH5,'Planning Bénévoles'!K$3:K$40,0))=TRUE,AG4+1,AG4))","v":0},"",{"$f":"IFERROR(INDEX(AH$5:AH$104,MATCH(ROW()-4,AG$5:AG$104,0),1),\"\")","v":"BASTARD Chloé"},{"$f":"IF($AI5>\"a\",1,\"\")","v":1},{"$f":"IF(AL5=\"\",AK4,IF(ISNA(MATCH(AL5,'Planning Bénévoles'!L$3:L$40,0))=TRUE,AK4+1,AK4))","v":0},"",{"$f":"IFERROR(INDEX(AL$5:AL$104,MATCH(ROW()-4,AK$5:AK$104,0),1),\"\")","v":"BEAUGION (K) Régis"},{"$f":"IF($AM5>\"a\",1,\"\")","v":1},{"$f":"IF(AP5=\"\",AO4,IF(ISNA(MATCH(AP5,'Planning Bénévoles'!M$3:M$40,0))=TRUE,AO4+1,AO4))","v":0},"",{"$f":"IFERROR(INDEX(AP$5:AP$104,MATCH(ROW()-4,AO$5:AO$104,0),1),\"\")","v":"BEAUGION (K) Régis"},{"$f":"IF($AQ5>\"a\",1,\"\")","v":1},{"$f":"IF(AT5=\"\",AS4,IF(ISNA(MATCH(AT5,'Planning Bénévoles'!N$3:N$40,0))=TRUE,AS4+1,AS4))","v":0},"",{"$f":"IFERROR(INDEX(AT$5:AT$104,MATCH(ROW()-4,AS$5:AS$104,0),1),\"\")","v":"BÉNIER Alizée"},{"$f":"IF($AU5>\"a\",1,\"\")","v":1},{"$f":"IF(AX5=\"\",AW4,IF(ISNA(MATCH(AX5,'Planning Bénévoles'!O$3:O$40,0))=TRUE,AW4+1,AW4))","v":0},"BALMADIER (THG) Henri",{"$f":"IFERROR(INDEX(AX$5:AX$104,MATCH(ROW()-4,AW$5:AW$104,0),1),\"\")","v":"DESJARDINS Jean Luc"},{"$f":"IF($AY5>\"a\",1,\"\")","v":1},{"$f":"IF(BB5=\"\",BA4,IF(ISNA(MATCH(BB5,'Planning Bénévoles'!P$3:P$40,0))=TRUE,BA4+1,BA4))","v":1},"BALMADIER (THG) Henri",{"$f":"IFERROR(INDEX(BB$5:BB$104,MATCH(ROW()-4,BA$5:BA$104,0),1),\"\")","v":"BALMADIER (THG) Henri"},{"$f":"IF($BC5>\"a\",1,\"\")","v":1},{"$f":"IF(BF5=\"\",BE4,IF(ISNA(MATCH(BF5,'Planning Bénévoles'!Q$3:Q$40,0))=TRUE,BE4+1,BE4))","v":0},"",{"$f":"IFERROR(INDEX(BF$5:BF$104,MATCH(ROW()-4,BE$5:BE$104,0),1),\"\")","v":"BÉNIER Alizée"},{"$f":"IF($BG5>\"a\",1,\"\")","v":1},{"$f":"IF(BJ5=\"\",BI4,IF(ISNA(MATCH(BJ5,'Planning Bénévoles'!R$3:R$40,0))=TRUE,BI4+1,BI4))","v":0},"",{"$f":"IFERROR(INDEX(BJ$5:BJ$104,MATCH(ROW()-4,BI$5:BI$104,0),1),\"\")","v":"BEZIVIN Daniel"},1,{"$f":"IF(BN5=\"\",BM4,IF(ISNA(MATCH(BN5,'Planning Bénévoles'!S$3:S$40,0))=TRUE,BM4+1,BM4))","v":0},"",{"$f":"IFERROR(INDEX(BN$5:BN$104,MATCH(ROW()-4,BM$5:BM$104,0),1),\"\")","v":"BÉNIER Alizée"},{"$f":"IF($BO5>\"a\",1,\"\")","v":1},{"$f":"IF(BR5=\"\",BQ4,IF(ISNA(MATCH(BR5,'Planning Bénévoles'!T$3:T$40,0))=TRUE,BQ4+1,BQ4))","v":0},"",{"$f":"IFERROR(INDEX(BR$5:BR$104,MATCH(ROW()-4,BQ$5:BQ$104,0),1),\"\")","v":"BÉNIER Alizée"},{"$f":"IF($BS5>\"a\",1,\"\")","v":1}]
[{"$f":"IF(B6=\"\",A5,IF(ISNA(MATCH(B6,'Planning Bénévoles'!C$3:C$40,0))=TRUE,A5+1,A5))","v":0},"",{"$f":"IFERROR(INDEX(B$5:B$104,MATCH(ROW()-4,A$5:A$104,0),1),\"\")","v":"GAONACH (THG) Sarah"},1,{"$f":"IF(F6=\"\",E5,IF(ISNA(MATCH(F6,'Planning Bénévoles'!D$3:D$40,0))=TRUE,E5+1,E5))","v":0},"",{"$f":"IFERROR(INDEX(F$5:F$104,MATCH(ROW()-4,E$5:E$104,0),1),\"\")","v":"BEZIVIN Daniel"},1,{"$f":"IF(J6=\"\",I5,IF(ISNA(MATCH(J6,'Planning Bénévoles'!E$3:E$40,0))=TRUE,I5+1,I5))","v":0},"",{"$f":"IFERROR(INDEX(J$5:J$104,MATCH(ROW()-4,I$5:I$104,0),1),\"\")","v":"DANIEL Alain"},1,{"$f":"IF(N6=\"\",M5,IF(ISNA(MATCH(N6,'Planning Bénévoles'!F$3:F$40,0))=TRUE,M5+1,M5))","v":0},"",{"$f":"IFERROR(INDEX(N$5:N$104,MATCH(ROW()-4,M$5:M$104,0),1),\"\")","v":"LE GALL Yves"},1,{"$f":"IF(R6=\"\",Q5,IF(ISNA(MATCH(R6,'Planning Bénévoles'!G$3:G$40,0))=TRUE,Q5+1,Q5))","v":0},"",{"$f":"IFERROR(INDEX(R$5:R$104,MATCH(ROW()-4,Q$5:Q$104,0),1),\"\")","v":"GAONACH (THG) Sarah"},1,{"$f":"IF(V6=\"\",U5,IF(ISNA(MATCH(V6,'Planning Bénévoles'!H$3:H$40,0))=TRUE,U5+1,U5))","v":0},"BASTARD Chloé",{"$f":"IFERROR(INDEX(V$5:V$104,MATCH(ROW()-4,U$5:U$104,0),1),\"\")","v":"HELAC Adélie"},1,{"$f":"IF(Z6=\"\",Y5,IF(ISNA(MATCH(Z6,'Planning Bénévoles'!I$3:I$40,0))=TRUE,Y5+1,Y5))","v":0},"",{"$f":"IFERROR(INDEX(Z$5:Z$104,MATCH(ROW()-4,Y$5:Y$104,0),1),\"\")","v":"LE GALL Yves"},1,{"$f":"IF(AD6=\"\",AC5,IF(ISNA(MATCH(AD6,'Planning Bénévoles'!J$3:J$40,0))=TRUE,AC5+1,AC5))","v":0},"",{"$f":"IFERROR(INDEX(AD$5:AD$104,MATCH(ROW()-4,AC$5:AC$104,0),1),\"\")","v":"DANIEL Alain"},1,{"$f":"IF(AH6=\"\",AG5,IF(ISNA(MATCH(AH6,'Planning Bénévoles'!K$3:K$40,0))=TRUE,AG5+1,AG5))","v":1},"BASTARD Chloé",{"$f":"IFERROR(INDEX(AH$5:AH$104,MATCH(ROW()-4,AG$5:AG$104,0),1),\"\")","v":"GARCETTE Jade"},1,{"$f":"IF(AL6=\"\",AK5,IF(ISNA(MATCH(AL6,'Planning Bénévoles'!L$3:L$40,0))=TRUE,AK5+1,AK5))","v":0},"",{"$f":"IFERROR(INDEX(AL$5:AL$104,MATCH(ROW()-4,AK$5:AK$104,0),1),\"\")","v":"BOTHOREL Hélène"},1,{"$f":"IF(AP6=\"\",AO5,IF(ISNA(MATCH(AP6,'Planning Bénévoles'!M$3:M$40,0))=TRUE,AO5+1,AO5))","v":0},"",{"$f":"IFERROR(INDEX(AP$5:AP$104,MATCH(ROW()-4,AO$5:AO$104,0),1),\"\")","v":"BIENNE (K) Xavier"},1,{"$f":"IF(AT6=\"\",AS5,IF(ISNA(MATCH(AT6,'Planning Bénévoles'!N$3:N$40,0))=TRUE,AS5+1,AS5))","v":0},"",{"$f":"IFERROR(INDEX(AT$5:AT$104,MATCH(ROW()-4,AS$5:AS$104,0),1),\"\")","v":"BOTHOREL Hélène"},1,{"$f":"IF(AX6=\"\",AW5,IF(ISNA(MATCH(AX6,'Planning Bénévoles'!O$3:O$40,0))=TRUE,AW5+1,AW5))","v":0},"",{"$f":"IFERROR(INDEX(AX$5:AX$104,MATCH(ROW()-4,AW$5:AW$104,0),1),\"\")","v":"LE CORRE  Jérémy"},1,{"$f":"IF(BB6=\"\",BA5,IF(ISNA(MATCH(BB6,'Planning Bénévoles'!P$3:P$40,0))=TRUE,BA5+1,BA5))","v":1},"",{"$f":"IFERROR(INDEX(BB$5:BB$104,MATCH(ROW()-4,BA$5:BA$104,0),1),\"\")","v":"BEAUGION (K) Régis"},1,{"$f":"IF(BF6=\"\",BE5,IF(ISNA(MATCH(BF6,'Planning Bénévoles'!Q$3:Q$40,0))=TRUE,BE5+1,BE5))","v":0},"",{"$f":"IFERROR(INDEX(BF$5:BF$104,MATCH(ROW()-4,BE$5:BE$104,0),1),\"\")","v":"BOTHOREL Hélène"},1,{"$f":"IF(BJ6=\"\",BI5,IF(ISNA(MATCH(BJ6,'Planning Bénévoles'!R$3:R$40,0))=TRUE,BI5+1,BI5))","v":0},"",{"$f":"IFERROR(INDEX(BJ$5:BJ$104,MATCH(ROW()-4,BI$5:BI$104,0),1),\"\")","v":"DANGÉ Yann"},1,{"$f":"IF(BN6=\"\",BM5,IF(ISNA(MATCH(BN6,'Planning Bénévoles'!S$3:S$40,0))=TRUE,BM5+1,BM5))","v":0},"",{"$f":"IFERROR(INDEX(BN$5:BN$104,MATCH(ROW()-4,BM$5:BM$104,0),1),\"\")","v":"BEZIVIN Daniel"},1,{"$f":"IF(BR6=\"\",BQ5,IF(ISNA(MATCH(BR6,'Planning Bénévoles'!T$3:T$40,0))=TRUE,BQ5+1,BQ5))","v":0},"",{"$f":"IFERROR(INDEX(BR$5:BR$104,MATCH(ROW()-4,BQ$5:BQ$104,0),1),\"\")","v":"BOURGUIGNON Catherine"},{"$f":"IF($BS6>\"a\",1,\"\")","v":1}]
[{"$f":"IF(B7=\"\",A6,IF(ISNA(MATCH(B7,'Planning Bénévoles'!C$3:C$40,0))=TRUE,A6+1,A6))","v":1},"BEAUGION (K) Régis","GUEGUEN (K) Sébastien",1,{"$f":"IF(F7=\"\",E6,IF(ISNA(MATCH(F7,'Planning Bénévoles'!D$3:D$40,0))=TRUE,E6+1,E6))","v":1},"BEAUGION (K) Régis","DANIEL Alain",1,{"$f":"IF(J7=\"\",I6,IF(ISNA(MATCH(J7,'Planning Bénévoles'!E$3:E$40,0))=TRUE,I6+1,I6))","v":0},"","DANIEL Annie France",1,{"$f":"IF(N7=\"\",M6,IF(ISNA(MATCH(N7,'Planning Bénévoles'!F$3:F$40,0))=TRUE,M6+1,M6))","v":0},"BEAUGION (K) Régis","MARCHE Sophie",1,{"$f":"IF(R7=\"\",Q6,IF(ISNA(MATCH(R7,'Planning Bénévoles'!G$3:G$40,0))=TRUE,Q6+1,Q6))","v":0},"BEAUGION (K) Régis","GUEGUEN (K) Sébastien",1,{"$f":"IF(V7=\"\",U6,IF(ISNA(MATCH(V7,'Planning Bénévoles'!H$3:H$40,0))=TRUE,U6+1,U6))","v":0},"","MARCHE Sophie",1,{"$f":"IF(Z7=\"\",Y6,IF(ISNA(MATCH(Z7,'Planning Bénévoles'!I$3:I$40,0))=TRUE,Y6+1,Y6))","v":0},"","MARCHE Sophie",1,{"$f":"IF(AD7=\"\",AC6,IF(ISNA(MATCH(AD7,'Planning Bénévoles'!J$3:J$40,0))=TRUE,AC6+1,AC6))","v":0},"","MARCHE Sophie",1,{"$f":"IF(AH7=\"\",AG6,IF(ISNA(MATCH(AH7,'Planning Bénévoles'!K$3:K$40,0))=TRUE,AG6+1,AG6))","v":1},"","HELAC Adélie",1,{"$f":"IF(AL7=\"\",AK6,IF(ISNA(MATCH(AL7,'Planning Bénévoles'!L$3:L$40,0))=TRUE,AK6+1,AK6))","v":1},"BEAUGION (K) Régis","BOURGEON (THG) Jérémy",1,{"$f":"IF(AP7=\"\",AO6,IF(ISNA(MATCH(AP7,'Planning Bénévoles'!M$3:M$40,0))=TRUE,AO6+1,AO6))","v":1},"BEAUGION (K) Régis","BOTHOREL Hélène",1,{"$f":"IF(AT7=\"\",AS6,IF(ISNA(MATCH(AT7,'Planning Bénévoles'!N$3:N$40,0))=TRUE,AS6+1,AS6))","v":0},"","BOURGUIGNON Catherine",1,{"$f":"IF(AX7=\"\",AW6,IF(ISNA(MATCH(AX7,'Planning Bénévoles'!O$3:O$40,0))=TRUE,AW6+1,AW6))","v":0},"BEAUGION (K) Régis","","",{"$f":"IF(BB7=\"\",BA6,IF(ISNA(MATCH(BB7,'Planning Bénévoles'!P$3:P$40,0))=TRUE,BA6+1,BA6))","v":2},"BEAUGION (K) Régis","BERTIN (THG) Nicolas",1,{"$f":"IF(BF7=\"\",BE6,IF(ISNA(MATCH(BF7,'Planning Bénévoles'!Q$3:Q$40,0))=TRUE,BE6+1,BE6))","v":0},"","DANGÉ Yann",1,{"$f":"IF(BJ7=\"\",BI6,IF(ISNA(MATCH(BJ7,'Planning Bénévoles'!R$3:R$40,0))=TRUE,BI6+1,BI6))","v":0},"","DANGÉ Jean Pierre",1,{"$f":"IF(BN7=\"\",BM6,IF(ISNA(MATCH(BN7,'Planning Bénévoles'!S$3:S$40,0))=TRUE,BM6+1,BM6))","v":0},"","BOTHOREL Hélène",1,{"$f":"IF(BR7=\"\",BQ6,IF(ISNA(MATCH(BR7,'Planning Bénévoles'!T$3:T$40,0))=TRUE,BQ6+1,BQ6))","v":0},"","CAHN Didier",1]
[{"$f":"IF(B8=\"\",A7,IF(ISNA(MATCH(B8,'Planning Bénévoles'!C$3:C$40,0))=TRUE,A7+1,A7))","v":1},"","GUERROT (THG) Gildas",1,{"$f":"IF(F8=\"\",E7,IF(ISNA(MATCH(F8,'Planning Bénévoles'!D$3:D$40,0))=TRUE,E7+1,E7))","v":1},"","DUTERQUE Frédérique",1,{"$f":"IF(J8=\"\",I7,IF(ISNA(MATCH(J8,'Planning Bénévoles'!E$3:E$40,0))=TRUE,I7+1,I7))","v":0},"BÉNIER Alizée","DUTERQUE Frédérique",1,{"$f":"IF(N8=\"\",M7,IF(ISNA(MATCH(N8,'Planning Bénévoles'!F$3:F$40,0))=TRUE,M7+1,M7))","v":0},"","ROBERT Mireille",1,{"$f":"IF(R8=\"\",Q7,IF(ISNA(MATCH(R8,'Planning Bénévoles'!G$3:G$40,0))=TRUE,Q7+1,Q7))","v":0},"","GUEZENNEC (K) Bruno",1,{"$f":"IF(V8=\"\",U7,IF(ISNA(MATCH(V8,'Planning Bénévoles'!H$3:H$40,0))=TRUE,U7+1,U7))","v":0},"BÉNIER Alizée","ROBERT Mireille",1,{"$f":"IF(Z8=\"\",Y7,IF(ISNA(MATCH(Z8,'Planning Bénévoles'!I$3:I$40,0))=TRUE,Y7+1,Y7))","v":0},"","","",{"$f":"IF(AD8=\"\",AC7,IF(ISNA(MATCH(AD8,'Planning Bénévoles'!J$3:J$40,0))=TRUE,AC7+1,AC7))","v":0},"","","",{"$f":"IF(AH8=\"\",AG7,IF(ISNA(MATCH(AH8,'Planning Bénévoles'!K$3:K$40,0))=TRUE,AG7+1,AG7))","v":1},"BÉNIER Alizée","LANDOUARD Frédéric",1,{"$f":"IF(AL8=\"\",AK7,IF(ISNA(MATCH(AL8,'Planning Bénévoles'!L$3:L$40,0))=TRUE,AK7+1,AK7))","v":1},"","DANGÉ Jean Pierre",1,{"$f":"IF(AP8=\"\",AO7,IF(ISNA(MATCH(AP8,'Planning Bénévoles'!M$3:M$40,0))=TRUE,AO7+1,AO7))","v":1},"","BOURGEON (THG) Jérémy",1,{"$f":"IF(AT8=\"\",AS7,IF(ISNA(MATCH(AT8,'Planning Bénévoles'!N$3:N$40,0))=TRUE,AS7+1,AS7))","v":1},"BÉNIER Alizée","CAHN Didier",1,{"$f":"IF(AX8=\"\",AW7,IF(ISNA(MATCH(AX8,'Planning Bénévoles'!O$3:O$40,0))=TRUE,AW7+1,AW7))","v":0},"","","",{"$f":"IF(BB8=\"\",BA7,IF(ISNA(MATCH(BB8,'Planning Bénévoles'!P$3:P$40,0))=TRUE,BA7+1,BA7))","v":2},"","BEZIVIN Daniel",1,{"$f":"IF(BF8=\"\",BE7,IF(ISNA(MATCH(BF8,'Planning Bénévoles'!Q$3:Q$40,0))=TRUE,BE7+1,BE7))","v":1},"BÉNIER Alizée","DANIEL Alain",1,{"$f":"IF(BJ8=\"\",BI7,IF(ISNA(MATCH(BJ8,'Planning Bénévoles'!R$3:R$40,0))=TRUE,BI7+1,BI7))","v":0},"","DANIEL Alain",1,{"$f":"IF(BN8=\"\",BM7,IF(ISNA(MATCH(BN8,'Planning Bénévoles'!S$3:S$40,0))=TRUE,BM7+1,BM7))","v":1},"BÉNIER Alizée","CAHN Didier",1,{"$f":"IF(BR8=\"\",BQ7,IF(ISNA(MATCH(BR8,'Planning Bénévoles'!T$3:T$40,0))=TRUE,BQ7+1,BQ7))","v":1},"BÉNIER Alizée","DANGÉ Yann",1]
[{"$f":"IF(B9=\"\",A8,IF(ISNA(MATCH(B9,'Planning Bénévoles'!C$3:C$40,0))=TRUE,A8+1,A8))","v":1},"","GUEZENNEC (K) Bruno",1,{"$f":"IF(F9=\"\",E8,IF(ISNA(MATCH(F9,'Planning Bénévoles'!D$3:D$40,0))=TRUE,E8+1,E8))","v":1},"","FISSEUX Rosalina",1,{"$f":"IF(J9=\"\",I8,IF(ISNA(MATCH(J9,'Planning Bénévoles'!E$3:E$40,0))=TRUE,I8+1,I8))","v":0},"","MARCHE Sophie",1,{"$f":"IF(N9=\"\",M8,IF(ISNA(MATCH(N9,'Planning Bénévoles'!F$3:F$40,0))=TRUE,M8+1,M8))","v":0},"","","",{"$f":"IF(R9=\"\",Q8,IF(ISNA(MATCH(R9,'Planning Bénévoles'!G$3:G$40,0))=TRUE,Q8+1,Q8))","v":0},"","LE GALL Yves",1,{"$f":"IF(V9=\"\",U8,IF(ISNA(MATCH(V9,'Planning Bénévoles'!H$3:H$40,0))=TRUE,U8+1,U8))","v":0},"","ROUAT Manon",1,{"$f":"IF(Z9=\"\",Y8,IF(ISNA(MATCH(Z9,'Planning Bénévoles'!I$3:I$40,0))=TRUE,Y8+1,Y8))","v":0},"","","",{"$f":"IF(AD9=\"\",AC8,IF(ISNA(MATCH(AD9,'Planning Bénévoles'!J$3:J$40,0))=TRUE,AC8+1,AC8))","v":0},"","","",{"$f":"IF(AH9=\"\",AG8,IF(ISNA(MATCH(AH9,'Planning Bénévoles'!K$3:K$40,0))=TRUE,AG8+1,AG8))","v":1},"","MALANDAIN Manuela",1,{"$f":"IF(AL9=\"\",AK8,IF(ISNA(MATCH(AL9,'Planning Bénévoles'!L$3:L$40,0))=TRUE,AK8+1,AK8))","v":1},"","GUEGUEN (K) Sébastien",1,{"$f":"IF(AP9=\"\",AO8,IF(ISNA(MATCH(AP9,'Planning Bénévoles'!M$3:M$40,0))=TRUE,AO8+1,AO8))","v":1},"","BOURGUIGNON Catherine",1,{"$f":"IF(AT9=\"\",AS8,IF(ISNA(MATCH(AT9,'Planning Bénévoles'!N$3:N$40,0))=TRUE,AS8+1,AS8))","v":1},"","DANGÉ Yann",1,{"$f":"IF(AX9=\"\",AW8,IF(ISNA(MATCH(AX9,'Planning Bénévoles'!O$3:O$40,0))=TRUE,AW8+1,AW8))","v":0},"BERTIN (THG) Nicolas","","",{"$f":"IF(BB9=\"\",BA8,IF(ISNA(MATCH(BB9,'Planning Bénévoles'!P$3:P$40,0))=TRUE,BA8+1,BA8))","v":3},"BERTIN (THG) Nicolas","BIENNE (K) Xavier",1,{"$f":"IF(BF9=\"\",BE8,IF(ISNA(MATCH(BF9,'Planning Bénévoles'!Q$3:Q$40,0))=TRUE,BE8+1,BE8))","v":1},"","DANIEL Annie France",1,{"$f":"IF(BJ9=\"\",BI8,IF(ISNA(MATCH(BJ9,'Planning Bénévoles'!R$3:R$40,0))=TRUE,BI8+1,BI8))","v":0},"","DANIEL Annie France",1,{"$f":"IF(BN9=\"\",BM8,IF(ISNA(MATCH(BN9,'Planning Bénévoles'!S$3:S$40,0))=TRUE,BM8+1,BM8))","v":1},"","COCHOU Philippe",1,{"$f":"IF(BR9=\"\",BQ8,IF(ISNA(MATCH(BR9,'Planning Bénévoles'!T$3:T$40,0))=TRUE,BQ8+1,BQ8))","v":1},"","DANIEL Alain",1]
[{"$f":"IF(B10=\"\",A9,IF(ISNA(MATCH(B10,'Planning Bénévoles'!C$3:C$40,0))=TRUE,A9+1,A9))","v":1},"BEZIVIN Daniel","JANOT (K) Laetitia",1,{"$f":"IF(F10=\"\",E9,IF(ISNA(MATCH(F10,'Planning Bénévoles'!D$3:D$40,0))=TRUE,E9+1,E9))","v":2},"BEZIVIN Daniel","GAONACH (THG) Sarah",1,{"$f":"IF(J10=\"\",I9,IF(ISNA(MATCH(J10,'Planning Bénévoles'!E$3:E$40,0))=TRUE,I9+1,I9))","v":0},"","MIGLIACCIO Claire",1,{"$f":"IF(N10=\"\",M9,IF(ISNA(MATCH(N10,'Planning Bénévoles'!F$3:F$40,0))=TRUE,M9+1,M9))","v":0},"","","",{"$f":"IF(R10=\"\",Q9,IF(ISNA(MATCH(R10,'Planning Bénévoles'!G$3:G$40,0))=TRUE,Q9+1,Q9))","v":0},"","MARCHE Sophie",1,{"$f":"IF(V10=\"\",U9,IF(ISNA(MATCH(V10,'Planning Bénévoles'!H$3:H$40,0))=TRUE,U9+1,U9))","v":0},"","TARHAN Yeliz",1,{"$f":"IF(Z10=\"\",Y9,IF(ISNA(MATCH(Z10,'Planning Bénévoles'!I$3:I$40,0))=TRUE,Y9+1,Y9))","v":0},"BEZIVIN Daniel","","",{"$f":"IF(AD10=\"\",AC9,IF(ISNA(MATCH(AD10,'Planning Bénévoles'!J$3:J$40,0))=TRUE,AC9+1,AC9))","v":0},"BEZIVIN Daniel","","",{"$f":"IF(AH10=\"\",AG9,IF(ISNA(MATCH(AH10,'Planning Bénévoles'!K$3:K$40,0))=TRUE,AG9+1,AG9))","v":1},"","ROBERT Mireille",1,{"$f":"IF(AL10=\"\",AK9,IF(ISNA(MATCH(AL10,'Planning Bénévoles'!L$3:L$40,0))=TRUE,AK9+1,AK9))","v":1},"","JANOT (K) Laetitia",1,{"$f":"IF(AP10=\"\",AO9,IF(ISNA(MATCH(AP10,'Planning Bénévoles'!M$3:M$40,0))=TRUE,AO9+1,AO9))","v":1},"","CAHN Didier",1,{"$f":"IF(AT10=\"\",AS9,IF(ISNA(MATCH(AT10,'Planning Bénévoles'!N$3:N$40,0))=TRUE,AS9+1,AS9))","v":1},"","DANIEL Alain",1,{"$f":"IF(AX10=\"\",AW9,IF(ISNA(MATCH(AX10,'Planning Bénévoles'!O$3:O$40,0))=TRUE,AW9+1,AW9))","v":0},"BEZIVIN Daniel","","",{"$f":"IF(BB10=\"\",BA9,IF(ISNA(MATCH(BB10,'Planning Bénévoles'!P$3:P$40,0))=TRUE,BA9+1,BA9))","v":4},"BEZIVIN Daniel","BOTHOREL Hélène",1,{"$f":"IF(BF10=\"\",BE9,IF(ISNA(MATCH(BF10,'Planning Bénévoles'!Q$3:Q$40,0))=TRUE,BE9+1,BE9))","v":1},"","DENES Annick",1,{"$f":"IF(BJ10=\"\",BI9,IF(ISNA(MATCH(BJ10,'Planning Bénévoles'!R$3:R$40,0))=TRUE,BI9+1,BI9))","v":1},"BEZIVIN Daniel","DESECHALLIERS Carole",1,{"$f":"IF(BN10=\"\",BM9,IF(ISNA(MATCH(BN10,'Planning Bénévoles'!S$3:S$40,0))=TRUE,BM9+1,BM9))","v":2},"BEZIVIN Daniel","DANGÉ Yann",1,{"$f":"IF(BR10=\"\",BQ9,IF(ISNA(MATCH(BR10,'Planning Bénévoles'!T$3:T$40,0))=TRUE,BQ9+1,BQ9))","v":1},"","DANIEL Annie France",1]
[{"$f":"IF(B11=\"\",A10,IF(ISNA(MATCH(B11,'Planning Bénévoles'!C$3:C$40,0))=TRUE,A10+1,A10))","v":1},"","LE GALL Yves",1,{"$f":"IF(F11=\"\",E10,IF(ISNA(MATCH(F11,'Planning Bénévoles'!D$3:D$40,0))=TRUE,E10+1,E10))","v":2},"","GUEGUEN (K) Sébastien",1,{"$f":"IF(J11=\"\",I10,IF(ISNA(MATCH(J11,'Planning Bénévoles'!E$3:E$40,0))=TRUE,I10+1,I10))","v":0},"","","",{"$f":"IF(N11=\"\",M10,IF(ISNA(MATCH(N11,'Planning Bénévoles'!F$3:F$40,0))=TRUE,M10+1,M10))","v":0},"","","",{"$f":"IF(R11=\"\",Q10,IF(ISNA(MATCH(R11,'Planning Bénévoles'!G$3:G$40,0))=TRUE,Q10+1,Q10))","v":0},"","RAMA (THG) Jurgen",1,{"$f":"IF(V11=\"\",U10,IF(ISNA(MATCH(V11,'Planning Bénévoles'!H$3:H$40,0))=TRUE,U10+1,U10))","v":0},"","THEME Sophie",1,{"$f":"IF(Z11=\"\",Y10,IF(ISNA(MATCH(Z11,'Planning Bénévoles'!I$3:I$40,0))=TRUE,Y10+1,Y10))","v":0},"","","",{"$f":"IF(AD11=\"\",AC10,IF(ISNA(MATCH(AD11,'Planning Bénévoles'!J$3:J$40,0))=TRUE,AC10+1,AC10))","v":0},"","","",{"$f":"IF(AH11=\"\",AG10,IF(ISNA(MATCH(AH11,'Planning Bénévoles'!K$3:K$40,0))=TRUE,AG10+1,AG10))","v":1},"","TARHAN Yeliz",1,{"$f":"IF(AL11=\"\",AK10,IF(ISNA(MATCH(AL11,'Planning Bénévoles'!L$3:L$40,0))=TRUE,AK10+1,AK10))","v":1},"BIENNE (K) Xavier","MALANDAIN Manuela",1,{"$f":"IF(AP11=\"\",AO10,IF(ISNA(MATCH(AP11,'Planning Bénévoles'!M$3:M$40,0))=TRUE,AO10+1,AO10))","v":2},"BIENNE (K) Xavier","CLOAREC (K) Didier",1,{"$f":"IF(AT11=\"\",AS10,IF(ISNA(MATCH(AT11,'Planning Bénévoles'!N$3:N$40,0))=TRUE,AS10+1,AS10))","v":1},"","DANIEL Annie France",1,{"$f":"IF(AX11=\"\",AW10,IF(ISNA(MATCH(AX11,'Planning Bénévoles'!O$3:O$40,0))=TRUE,AW10+1,AW10))","v":0},"BIENNE (K) Xavier","","",{"$f":"IF(BB11=\"\",BA10,IF(ISNA(MATCH(BB11,'Planning Bénévoles'!P$3:P$40,0))=TRUE,BA10+1,BA10))","v":5},"BIENNE (K) Xavier","BOURGUIGNON Catherine",1,{"$f":"IF(BF11=\"\",BE10,IF(ISNA(MATCH(BF11,'Planning Bénévoles'!Q$3:Q$40,0))=TRUE,BE10+1,BE10))","v":1},"","DESECHALLIERS Carole",1,{"$f":"IF(BJ11=\"\",BI10,IF(ISNA(MATCH(BJ11,'Planning Bénévoles'!R$3:R$40,0))=TRUE,BI10+1,BI10))","v":1},"","DESJARDINS Jean Luc",1,{"$f":"IF(BN11=\"\",BM10,IF(ISNA(MATCH(BN11,'Planning Bénévoles'!S$3:S$40,0))=TRUE,BM10+1,BM10))","v":2},"","DANIEL Alain",1,{"$f":"IF(BR11=\"\",BQ10,IF(ISNA(MATCH(BR11,'Planning Bénévoles'!T$3:T$40,0))=TRUE,BQ10+1,BQ10))","v":1},"","DENES Annick",1]
[{"$f":"IF(B12=\"\",A11,IF(ISNA(MATCH(B12,'Planning Bénévoles'!C$3:C$40,0))=TRUE,A11+1,A11))","v":1},"","MARCHE Sophie",1,{"$f":"IF(F12=\"\",E11,IF(ISNA(MATCH(F12,'Planning Bénévoles'!D$3:D$40,0))=TRUE,E11+1,E11))","v":2},"BOTHOREL Hélène","GUERROT (THG) Gildas",1,{"$f":"IF(J12=\"\",I11,IF(ISNA(MATCH(J12,'Planning Bénévoles'!E$3:E$40,0))=TRUE,I11+1,I11))","v":0},"BOTHOREL Hélène","","",{"$f":"IF(N12=\"\",M11,IF(ISNA(MATCH(N12,'Planning Bénévoles'!F$3:F$40,0))=TRUE,M11+1,M11))","v":0},"BOTHOREL Hélène","","",{"$f":"IF(R12=\"\",Q11,IF(ISNA(MATCH(R12,'Planning Bénévoles'!G$3:G$40,0))=TRUE,Q11+1,Q11))","v":0},"BOTHOREL Hélène","ROBERT Mireille",1,{"$f":"IF(V12=\"\",U11,IF(ISNA(MATCH(V12,'Planning Bénévoles'!H$3:H$40,0))=TRUE,U11+1,U11))","v":0},"","YANG Johanne",1,{"$f":"IF(Z12=\"\",Y11,IF(ISNA(MATCH(Z12,'Planning Bénévoles'!I$3:I$40,0))=TRUE,Y11+1,Y11))","v":0},"BOTHOREL Hélène","","",{"$f":"IF(AD12=\"\",AC11,IF(ISNA(MATCH(AD12,'Planning Bénévoles'!J$3:J$40,0))=TRUE,AC11+1,AC11))","v":0},"BOTHOREL Hélène","","",{"$f":"IF(AH12=\"\",AG11,IF(ISNA(MATCH(AH12,'Planning Bénévoles'!K$3:K$40,0))=TRUE,AG11+1,AG11))","v":1},"","","",{"$f":"IF(AL12=\"\",AK11,IF(ISNA(MATCH(AL12,'Planning Bénévoles'!L$3:L$40,0))=TRUE,AK11+1,AK11))","v":2},"BOTHOREL Hélène","MARCHE Sophie",1,{"$f":"IF(AP12=\"\",AO11,IF(ISNA(MATCH(AP12,'Planning Bénévoles'!M$3:M$40,0))=TRUE,AO11+1,AO11))","v":3},"BOTHOREL Hélène","DENES Annick",1,{"$f":"IF(AT12=\"\",AS11,IF(ISNA(MATCH(AT12,'Planning Bénévoles'!N$3:N$40,0))=TRUE,AS11+1,AS11))","v":2},"BOTHOREL Hélène","DENES Annick",1,{"$f":"IF(AX12=\"\",AW11,IF(ISNA(MATCH(AX12,'Planning Bénévoles'!O$3:O$40,0))=TRUE,AW11+1,AW11))","v":0},"BOTHOREL Hélène","","",{"$f":"IF(BB12=\"\",BA11,IF(ISNA(MATCH(BB12,'Planning Bénévoles'!P$3:P$40,0))=TRUE,BA11+1,BA11))","v":6},"BOTHOREL Hélène","CAHN Didier",1,{"$f":"IF(BF12=\"\",BE11,IF(ISNA(MATCH(BF12,'Planning Bénévoles'!Q$3:Q$40,0))=TRUE,BE11+1,BE11))","v":2},"BOTHOREL Hélène","DUPUY Isabelle",1,{"$f":"IF(BJ12=\"\",BI11,IF(ISNA(MATCH(BJ12,'Planning Bénévoles'!R$3:R$40,0))=TRUE,BI11+1,BI11))","v":1},"","DUPUY Isabelle",1,{"$f":"IF(BN12=\"\",BM11,IF(ISNA(MATCH(BN12,'Planning Bénévoles'!S$3:S$40,0))=TRUE,BM11+1,BM11))","v":3},"BOTHOREL Hélène","DANIEL Annie France",1,{"$f":"IF(BR12=\"\",BQ11,IF(ISNA(MATCH(BR12,'Planning Bénévoles'!T$3:T$40,0))=TRUE,BQ11+1,BQ11))","v":1},"BOTHOREL Hélène","DESECHALLIERS Carole",1]
[{"$f":"IF(B13=\"\",A12,IF(ISNA(MATCH(B13,'Planning Bénévoles'!C$3:C$40,0))=TRUE,A12+1,A12))","v":1},"","MOAL Alain",1,{"$f":"IF(F13=\"\",E12,IF(ISNA(MATCH(F13,'Planning Bénévoles'!D$3:D$40,0))=TRUE,E12+1,E12))","v":2},"","GUEZENNEC (K) Bruno",1,{"$f":"IF(J13=\"\",I12,IF(ISNA(MATCH(J13,'Planning Bénévoles'!E$3:E$40,0))=TRUE,I12+1,I12))","v":0},"","","",{"$f":"IF(N13=\"\",M12,IF(ISNA(MATCH(N13,'Planning Bénévoles'!F$3:F$40,0))=TRUE,M12+1,M12))","v":0},"","","",{"$f":"IF(R13=\"\",Q12,IF(ISNA(MATCH(R13,'Planning Bénévoles'!G$3:G$40,0))=TRUE,Q12+1,Q12))","v":0},"","","",{"$f":"IF(V13=\"\",U12,IF(ISNA(MATCH(V13,'Planning Bénévoles'!H$3:H$40,0))=TRUE,U12+1,U12))","v":0},"","","",{"$f":"IF(Z13=\"\",Y12,IF(ISNA(MATCH(Z13,'Planning Bénévoles'!I$3:I$40,0))=TRUE,Y12+1,Y12))","v":0},"BOURGEON (THG) Jérémy","","",{"$f":"IF(AD13=\"\",AC12,IF(ISNA(MATCH(AD13,'Planning Bénévoles'!J$3:J$40,0))=TRUE,AC12+1,AC12))","v":1},"BOURGEON (THG) Jérémy","","",{"$f":"IF(AH13=\"\",AG12,IF(ISNA(MATCH(AH13,'Planning Bénévoles'!K$3:K$40,0))=TRUE,AG12+1,AG12))","v":1},"","","",{"$f":"IF(AL13=\"\",AK12,IF(ISNA(MATCH(AL13,'Planning Bénévoles'!L$3:L$40,0))=TRUE,AK12+1,AK12))","v":3},"BOURGEON (THG) Jérémy","MOAL Alain",1,{"$f":"IF(AP13=\"\",AO12,IF(ISNA(MATCH(AP13,'Planning Bénévoles'!M$3:M$40,0))=TRUE,AO12+1,AO12))","v":4},"BOURGEON (THG) Jérémy","DESJARDINS Jean Luc",1,{"$f":"IF(AT13=\"\",AS12,IF(ISNA(MATCH(AT13,'Planning Bénévoles'!N$3:N$40,0))=TRUE,AS12+1,AS12))","v":2},"","DESECHALLIERS Carole",1,{"$f":"IF(AX13=\"\",AW12,IF(ISNA(MATCH(AX13,'Planning Bénévoles'!O$3:O$40,0))=TRUE,AW12+1,AW12))","v":0},"","","",{"$f":"IF(BB13=\"\",BA12,IF(ISNA(MATCH(BB13,'Planning Bénévoles'!P$3:P$40,0))=TRUE,BA12+1,BA12))","v":6},"","CLOAREC (K) Didier",1,{"$f":"IF(BF13=\"\",BE12,IF(ISNA(MATCH(BF13,'Planning Bénévoles'!Q$3:Q$40,0))=TRUE,BE12+1,BE12))","v":2},"","FISSEUX Rosalina",1,{"$f":"IF(BJ13=\"\",BI12,IF(ISNA(MATCH(BJ13,'Planning Bénévoles'!R$3:R$40,0))=TRUE,BI12+1,BI12))","v":1},"","DUTERQUE Frédérique",1,{"$f":"IF(BN13=\"\",BM12,IF(ISNA(MATCH(BN13,'Planning Bénévoles'!S$3:S$40,0))=TRUE,BM12+1,BM12))","v":3},"","DENES Annick",1,{"$f":"IF(BR13=\"\",BQ12,IF(ISNA(MATCH(BR13,'Planning Bénévoles'!T$3:T$40,0))=TRUE,BQ12+1,BQ12))","v":1},"","DESJARDINS Jean Luc",1]
[{"$f":"IF(B14=\"\",A13,IF(ISNA(MATCH(B14,'Planning Bénévoles'!C$3:C$40,0))=TRUE,A13+1,A13))","v":1},"","NHEK (K) Alexandrine",1,{"$f":"IF(F14=\"\",E13,IF(ISNA(MATCH(F14,'Planning Bénévoles'!D$3:D$40,0))=TRUE,E13+1,E13))","v":2},"BOURGUIGNON Catherine","JANOT (K) Laetitia",1,{"$f":"IF(J14=\"\",I13,IF(ISNA(MATCH(J14,'Planning Bénévoles'!E$3:E$40,0))=TRUE,I13+1,I13))","v":0},"BOURGUIGNON Catherine","","",{"$f":"IF(N14=\"\",M13,IF(ISNA(MATCH(N14,'Planning Bénévoles'!F$3:F$40,0))=TRUE,M13+1,M13))","v":0},"","","",{"$f":"IF(R14=\"\",Q13,IF(ISNA(MATCH(R14,'Planning Bénévoles'!G$3:G$40,0))=TRUE,Q13+1,Q13))","v":0},"BOURGUIGNON Catherine","","",{"$f":"IF(V14=\"\",U13,IF(ISNA(MATCH(V14,'Planning Bénévoles'!H$3:H$40,0))=TRUE,U13+1,U13))","v":0},"BOURGUIGNON Catherine","","",{"$f":"IF(Z14=\"\",Y13,IF(ISNA(MATCH(Z14,'Planning Bénévoles'!I$3:I$40,0))=TRUE,Y13+1,Y13))","v":0},"","","",{"$f":"IF(AD14=\"\",AC13,IF(ISNA(MATCH(AD14,'Planning Bénévoles'!J$3:J$40,0))=TRUE,AC13+1,AC13))","v":1},"BOURGUIGNON Catherine","","",{"$f":"IF(AH14=\"\",AG13,IF(ISNA(MATCH(AH14,'Planning Bénévoles'!K$3:K$40,0))=TRUE,AG13+1,AG13))","v":1},"BOURGUIGNON Catherine","","",{"$f":"IF(AL14=\"\",AK13,IF(ISNA(MATCH(AL14,'Planning Bénévoles'!L$3:L$40,0))=TRUE,AK13+1,AK13))","v":3},"","NHEK (K) Alexandrine",1,{"$f":"IF(AP14=\"\",AO13,IF(ISNA(MATCH(AP14,'Planning Bénévoles'!M$3:M$40,0))=TRUE,AO13+1,AO13))","v":5},"BOURGUIGNON Catherine","DUPUY Isabelle",1,{"$f":"IF(AT14=\"\",AS13,IF(ISNA(MATCH(AT14,'Planning Bénévoles'!N$3:N$40,0))=TRUE,AS13+1,AS13))","v":3},"BOURGUIGNON Catherine","DUPUY Isabelle",1,{"$f":"IF(AX14=\"\",AW13,IF(ISNA(MATCH(AX14,'Planning Bénévoles'!O$3:O$40,0))=TRUE,AW13+1,AW13))","v":0},"","","",{"$f":"IF(BB14=\"\",BA13,IF(ISNA(MATCH(BB14,'Planning Bénévoles'!P$3:P$40,0))=TRUE,BA13+1,BA13))","v":7},"BOURGUIGNON Catherine","COCHOU Philippe",1,{"$f":"IF(BF14=\"\",BE13,IF(ISNA(MATCH(BF14,'Planning Bénévoles'!Q$3:Q$40,0))=TRUE,BE13+1,BE13))","v":2},"","GARCETTE Jade",1,{"$f":"IF(BJ14=\"\",BI13,IF(ISNA(MATCH(BJ14,'Planning Bénévoles'!R$3:R$40,0))=TRUE,BI13+1,BI13))","v":1},"","LANDOUARD Frédéric",1,{"$f":"IF(BN14=\"\",BM13,IF(ISNA(MATCH(BN14,'Planning Bénévoles'!S$3:S$40,0))=TRUE,BM13+1,BM13))","v":3},"BOURGUIGNON Catherine","DESECHALLIERS Carole",1,{"$f":"IF(BR14=\"\",BQ13,IF(ISNA(MATCH(BR14,'Planning Bénévoles'!T$3:T$40,0))=TRUE,BQ13+1,BQ13))","v":2},"BOURGUIGNON Catherine","DUPUY Isabelle",1]
[{"$f":"IF(B15=\"\",A14,IF(ISNA(MATCH(B15,'Planning Bénévoles'!C$3:C$40,0))=TRUE,A14+1,A14))","v":1},"","RAFFO Carine",1,{"$f":"IF(F15=\"\",E14,IF(ISNA(MATCH(F15,'Planning Bénévoles'!D$3:D$40,0))=TRUE,E14+1,E14))","v":2},"CAHN Didier","LE BOSSER Jean René",1,{"$f":"IF(J15=\"\",I14,IF(ISNA(MATCH(J15,'Planning Bénévoles'!E$3:E$40,0))=TRUE,I14+1,I14))","v":0},"CAHN Didier","","",{"$f":"IF(N15=\"\",M14,IF(ISNA(MATCH(N15,'Planning Bénévoles'!F$3:F$40,0))=TRUE,M14+1,M14))","v":0},"","","",{"$f":"IF(R15=\"\",Q14,IF(ISNA(MATCH(R15,'Planning Bénévoles'!G$3:G$40,0))=TRUE,Q14+1,Q14))","v":0},"CAHN Didier","","",{"$f":"IF(V15=\"\",U14,IF(ISNA(MATCH(V15,'Planning Bénévoles'!H$3:H$40,0))=TRUE,U14+1,U14))","v":0},"CAHN Didier","","",{"$f":"IF(Z15=\"\",Y14,IF(ISNA(MATCH(Z15,'Planning Bénévoles'!I$3:I$40,0))=TRUE,Y14+1,Y14))","v":0},"","","",{"$f":"IF(AD15=\"\",AC14,IF(ISNA(MATCH(AD15,'Planning Bénévoles'!J$3:J$40,0))=TRUE,AC14+1,AC14))","v":1},"CAHN Didier","","",{"$f":"IF(AH15=\"\",AG14,IF(ISNA(MATCH(AH15,'Planning Bénévoles'!K$3:K$40,0))=TRUE,AG14+1,AG14))","v":1},"CAHN Didier","","",{"$f":"IF(AL15=\"\",AK14,IF(ISNA(MATCH(AL15,'Planning Bénévoles'!L$3:L$40,0))=TRUE,AK14+1,AK14))","v":3},"","PARISSE (THG) Amélie",1,{"$f":"IF(AP15=\"\",AO14,IF(ISNA(MATCH(AP15,'Planning Bénévoles'!M$3:M$40,0))=TRUE,AO14+1,AO14))","v":6},"CAHN Didier","DUTERQUE Frédérique",1,{"$f":"IF(AT15=\"\",AS14,IF(ISNA(MATCH(AT15,'Planning Bénévoles'!N$3:N$40,0))=TRUE,AS14+1,AS14))","v":4},"CAHN Didier","DUTERQUE Frédérique",1,{"$f":"IF(AX15=\"\",AW14,IF(ISNA(MATCH(AX15,'Planning Bénévoles'!O$3:O$40,0))=TRUE,AW14+1,AW14))","v":0},"","","",{"$f":"IF(BB15=\"\",BA14,IF(ISNA(MATCH(BB15,'Planning Bénévoles'!P$3:P$40,0))=TRUE,BA14+1,BA14))","v":8},"CAHN Didier","DANIEL Alain",1,{"$f":"IF(BF15=\"\",BE14,IF(ISNA(MATCH(BF15,'Planning Bénévoles'!Q$3:Q$40,0))=TRUE,BE14+1,BE14))","v":2},"","HADOUZI Yasmine",1,{"$f":"IF(BJ15=\"\",BI14,IF(ISNA(MATCH(BJ15,'Planning Bénévoles'!R$3:R$40,0))=TRUE,BI14+1,BI14))","v":1},"","LE CORRE  Jérémy",1,{"$f":"IF(BN15=\"\",BM14,IF(ISNA(MATCH(BN15,'Planning Bénévoles'!S$3:S$40,0))=TRUE,BM14+1,BM14))","v":4},"CAHN Didier","DUPUY Isabelle",1,{"$f":"IF(BR15=\"\",BQ14,IF(ISNA(MATCH(BR15,'Planning Bénévoles'!T$3:T$40,0))=TRUE,BQ14+1,BQ14))","v":3},"CAHN Didier","DUTERQUE Frédérique",1]
[{"$f":"IF(B16=\"\",A15,IF(ISNA(MATCH(B16,'Planning Bénévoles'!C$3:C$40,0))=TRUE,A15+1,A15))","v":1},"","RAMA (THG) Jurgen",1,{"$f":"IF(F16=\"\",E15,IF(ISNA(MATCH(F16,'Planning Bénévoles'!D$3:D$40,0))=TRUE,E15+1,E15))","v":2},"","LE BOSSER Liliane",1,{"$f":"IF(J16=\"\",I15,IF(ISNA(MATCH(J16,'Planning Bénévoles'!E$3:E$40,0))=TRUE,I15+1,I15))","v":0},"","","",{"$f":"IF(N16=\"\",M15,IF(ISNA(MATCH(N16,'Planning Bénévoles'!F$3:F$40,0))=TRUE,M15+1,M15))","v":0},"","","",{"$f":"IF(R16=\"\",Q15,IF(ISNA(MATCH(R16,'Planning Bénévoles'!G$3:G$40,0))=TRUE,Q15+1,Q15))","v":0},"","","",{"$f":"IF(V16=\"\",U15,IF(ISNA(MATCH(V16,'Planning Bénévoles'!H$3:H$40,0))=TRUE,U15+1,U15))","v":0},"","","",{"$f":"IF(Z16=\"\",Y15,IF(ISNA(MATCH(Z16,'Planning Bénévoles'!I$3:I$40,0))=TRUE,Y15+1,Y15))","v":0},"","","",{"$f":"IF(AD16=\"\",AC15,IF(ISNA(MATCH(AD16,'Planning Bénévoles'!J$3:J$40,0))=TRUE,AC15+1,AC15))","v":1},"","","",{"$f":"IF(AH16=\"\",AG15,IF(ISNA(MATCH(AH16,'Planning Bénévoles'!K$3:K$40,0))=TRUE,AG15+1,AG15))","v":1},"","","",{"$f":"IF(AL16=\"\",AK15,IF(ISNA(MATCH(AL16,'Planning Bénévoles'!L$3:L$40,0))=TRUE,AK15+1,AK15))","v":3},"CLOAREC (K) Didier","RIHANI Mohamed",1,{"$f":"IF(AP16=\"\",AO15,IF(ISNA(MATCH(AP16,'Planning Bénévoles'!M$3:M$40,0))=TRUE,AO15+1,AO15))","v":7},"CLOAREC (K) Didier","FER (THG) Mélissa",1,{"$f":"IF(AT16=\"\",AS15,IF(ISNA(MATCH(AT16,'Planning Bénévoles'!N$3:N$40,0))=TRUE,AS15+1,AS15))","v":4},"","GARCETTE Jade",1,{"$f":"IF(AX16=\"\",AW15,IF(ISNA(MATCH(AX16,'Planning Bénévoles'!O$3:O$40,0))=TRUE,AW15+1,AW15))","v":0},"CLOAREC (K) Didier","","",{"$f":"IF(BB16=\"\",BA15,IF(ISNA(MATCH(BB16,'Planning Bénévoles'!P$3:P$40,0))=TRUE,BA15+1,BA15))","v":9},"CLOAREC (K) Didier","DANIEL Annie France",1,{"$f":"IF(BF16=\"\",BE15,IF(ISNA(MATCH(BF16,'Planning Bénévoles'!Q$3:Q$40,0))=TRUE,BE15+1,BE15))","v":2},"","LANDOUARD Frédéric",1,{"$f":"IF(BJ16=\"\",BI15,IF(ISNA(MATCH(BJ16,'Planning Bénévoles'!R$3:R$40,0))=TRUE,BI15+1,BI15))","v":1},"","LE GALL Yves",1,{"$f":"IF(BN16=\"\",BM15,IF(ISNA(MATCH(BN16,'Planning Bénévoles'!S$3:S$40,0))=TRUE,BM15+1,BM15))","v":4},"","DUTERQUE Frédérique",1,{"$f":"IF(BR16=\"\",BQ15,IF(ISNA(MATCH(BR16,'Planning Bénévoles'!T$3:T$40,0))=TRUE,BQ15+1,BQ15))","v":3},"","FISSEUX Rosalina",1]
[{"$f":"IF(B17=\"\",A16,IF(ISNA(MATCH(B17,'Planning Bénévoles'!C$3:C$40,0))=TRUE,A16+1,A16))","v":1},"","ROBERT Mireille",1,{"$f":"IF(F17=\"\",E16,IF(ISNA(MATCH(F17,'Planning Bénévoles'!D$3:D$40,0))=TRUE,E16+1,E16))","v":2},"COCHOU Philippe","LE GALL Yves",1,{"$f":"IF(J17=\"\",I16,IF(ISNA(MATCH(J17,'Planning Bénévoles'!E$3:E$40,0))=TRUE,I16+1,I16))","v":0},"","","",{"$f":"IF(N17=\"\",M16,IF(ISNA(MATCH(N17,'Planning Bénévoles'!F$3:F$40,0))=TRUE,M16+1,M16))","v":0},"","","",{"$f":"IF(R17=\"\",Q16,IF(ISNA(MATCH(R17,'Planning Bénévoles'!G$3:G$40,0))=TRUE,Q16+1,Q16))","v":0},"","","",{"$f":"IF(V17=\"\",U16,IF(ISNA(MATCH(V17,'Planning Bénévoles'!H$3:H$40,0))=TRUE,U16+1,U16))","v":0},"","","",{"$f":"IF(Z17=\"\",Y16,IF(ISNA(MATCH(Z17,'Planning Bénévoles'!I$3:I$40,0))=TRUE,Y16+1,Y16))","v":0},"","","",{"$f":"IF(AD17=\"\",AC16,IF(ISNA(MATCH(AD17,'Planning Bénévoles'!J$3:J$40,0))=TRUE,AC16+1,AC16))","v":1},"COCHOU Philippe","","",{"$f":"IF(AH17=\"\",AG16,IF(ISNA(MATCH(AH17,'Planning Bénévoles'!K$3:K$40,0))=TRUE,AG16+1,AG16))","v":1},"","","",{"$f":"IF(AL17=\"\",AK16,IF(ISNA(MATCH(AL17,'Planning Bénévoles'!L$3:L$40,0))=TRUE,AK16+1,AK16))","v":3},"","ROBERT Mireille",1,{"$f":"IF(AP17=\"\",AO16,IF(ISNA(MATCH(AP17,'Planning Bénévoles'!M$3:M$40,0))=TRUE,AO16+1,AO16))","v":7},"COCHOU Philippe","FISSEUX Rosalina",1,{"$f":"IF(AT17=\"\",AS16,IF(ISNA(MATCH(AT17,'Planning Bénévoles'!N$3:N$40,0))=TRUE,AS16+1,AS16))","v":4},"","HADOUZI Yasmine",1,{"$f":"IF(AX17=\"\",AW16,IF(ISNA(MATCH(AX17,'Planning Bénévoles'!O$3:O$40,0))=TRUE,AW16+1,AW16))","v":0},"","","",{"$f":"IF(BB17=\"\",BA16,IF(ISNA(MATCH(BB17,'Planning Bénévoles'!P$3:P$40,0))=TRUE,BA16+1,BA16))","v":10},"COCHOU Philippe","DENES Annick",1,{"$f":"IF(BF17=\"\",BE16,IF(ISNA(MATCH(BF17,'Planning Bénévoles'!Q$3:Q$40,0))=TRUE,BE16+1,BE16))","v":2},"","LE BIHAN Guy",1,{"$f":"IF(BJ17=\"\",BI16,IF(ISNA(MATCH(BJ17,'Planning Bénévoles'!R$3:R$40,0))=TRUE,BI16+1,BI16))","v":1},"","LE ROY  Julian",1,{"$f":"IF(BN17=\"\",BM16,IF(ISNA(MATCH(BN17,'Planning Bénévoles'!S$3:S$40,0))=TRUE,BM16+1,BM16))","v":5},"COCHOU Philippe","GARCETTE Jade",1,{"$f":"IF(BR17=\"\",BQ16,IF(ISNA(MATCH(BR17,'Planning Bénévoles'!T$3:T$40,0))=TRUE,BQ16+1,BQ16))","v":3},"","GARCETTE Jade",1]
[{"$f":"IF(B18=\"\",A17,IF(ISNA(MATCH(B18,'Planning Bénévoles'!C$3:C$40,0))=TRUE,A17+1,A17))","v":1},"","STRUILLOU (K) Charlotte",1,{"$f":"IF(F18=\"\",E17,IF(ISNA(MATCH(F18,'Planning Bénévoles'!D$3:D$40,0))=TRUE,E17+1,E17))","v":2},"","MARCHE Sophie",1,{"$f":"IF(J18=\"\",I17,IF(ISNA(MATCH(J18,'Planning Bénévoles'!E$3:E$40,0))=TRUE,I17+1,I17))","v":1},"CORNEC Lucas","","",{"$f":"IF(N18=\"\",M17,IF(ISNA(MATCH(N18,'Planning Bénévoles'!F$3:F$40,0))=TRUE,M17+1,M17))","v":0},"","","",{"$f":"IF(R18=\"\",Q17,IF(ISNA(MATCH(R18,'Planning Bénévoles'!G$3:G$40,0))=TRUE,Q17+1,Q17))","v":0},"","","",{"$f":"IF(V18=\"\",U17,IF(ISNA(MATCH(V18,'Planning Bénévoles'!H$3:H$40,0))=TRUE,U17+1,U17))","v":0},"CORNEC Lucas","","",{"$f":"IF(Z18=\"\",Y17,IF(ISNA(MATCH(Z18,'Planning Bénévoles'!I$3:I$40,0))=TRUE,Y17+1,Y17))","v":0},"","","",{"$f":"IF(AD18=\"\",AC17,IF(ISNA(MATCH(AD18,'Planning Bénévoles'!J$3:J$40,0))=TRUE,AC17+1,AC17))","v":1},"","","",{"$f":"IF(AH18=\"\",AG17,IF(ISNA(MATCH(AH18,'Planning Bénévoles'!K$3:K$40,0))=TRUE,AG17+1,AG17))","v":1},"CORNEC Lucas","","",{"$f":"IF(AL18=\"\",AK17,IF(ISNA(MATCH(AL18,'Planning Bénévoles'!L$3:L$40,0))=TRUE,AK17+1,AK17))","v":3},"","ROUGER Olga",1,{"$f":"IF(AP18=\"\",AO17,IF(ISNA(MATCH(AP18,'Planning Bénévoles'!M$3:M$40,0))=TRUE,AO17+1,AO17))","v":7},"","GUEGUEN (K) Sébastien",1,{"$f":"IF(AT18=\"\",AS17,IF(ISNA(MATCH(AT18,'Planning Bénévoles'!N$3:N$40,0))=TRUE,AS17+1,AS17))","v":4},"CORNEC Lucas","LANDOUARD Frédéric",1,{"$f":"IF(AX18=\"\",AW17,IF(ISNA(MATCH(AX18,'Planning Bénévoles'!O$3:O$40,0))=TRUE,AW17+1,AW17))","v":0},"","","",{"$f":"IF(BB18=\"\",BA17,IF(ISNA(MATCH(BB18,'Planning Bénévoles'!P$3:P$40,0))=TRUE,BA17+1,BA17))","v":10},"","DESJARDINS Jean Luc",1,{"$f":"IF(BF18=\"\",BE17,IF(ISNA(MATCH(BF18,'Planning Bénévoles'!Q$3:Q$40,0))=TRUE,BE17+1,BE17))","v":2},"CORNEC Lucas","LE CORRE  Jérémy",1,{"$f":"IF(BJ18=\"\",BI17,IF(ISNA(MATCH(BJ18,'Planning Bénévoles'!R$3:R$40,0))=TRUE,BI17+1,BI17))","v":1},"","MALANDAIN Manuela",1,{"$f":"IF(BN18=\"\",BM17,IF(ISNA(MATCH(BN18,'Planning Bénévoles'!S$3:S$40,0))=TRUE,BM17+1,BM17))","v":5},"","GERNIGON Laurence",1,{"$f":"IF(BR18=\"\",BQ17,IF(ISNA(MATCH(BR18,'Planning Bénévoles'!T$3:T$40,0))=TRUE,BQ17+1,BQ17))","v":3},"","GERNIGON Laurence",1]
[{"$f":"IF(B19=\"\",A18,IF(ISNA(MATCH(B19,'Planning Bénévoles'!C$3:C$40,0))=TRUE,A18+1,A18))","v":1},"","","",{"$f":"IF(F19=\"\",E18,IF(ISNA(MATCH(F19,'Planning Bénévoles'!D$3:D$40,0))=TRUE,E18+1,E18))","v":2},"","MIGLIACCIO Claire",1,{"$f":"IF(J19=\"\",I18,IF(ISNA(MATCH(J19,'Planning Bénévoles'!E$3:E$40,0))=TRUE,I18+1,I18))","v":1},"DANGÉ Yann","","",{"$f":"IF(N19=\"\",M18,IF(ISNA(MATCH(N19,'Planning Bénévoles'!F$3:F$40,0))=TRUE,M18+1,M18))","v":0},"","","",{"$f":"IF(R19=\"\",Q18,IF(ISNA(MATCH(R19,'Planning Bénévoles'!G$3:G$40,0))=TRUE,Q18+1,Q18))","v":0},"","","",{"$f":"IF(V19=\"\",U18,IF(ISNA(MATCH(V19,'Planning Bénévoles'!H$3:H$40,0))=TRUE,U18+1,U18))","v":0},"DANGÉ Yann","","",{"$f":"IF(Z19=\"\",Y18,IF(ISNA(MATCH(Z19,'Planning Bénévoles'!I$3:I$40,0))=TRUE,Y18+1,Y18))","v":0},"","","",{"$f":"IF(AD19=\"\",AC18,IF(ISNA(MATCH(AD19,'Planning Bénévoles'!J$3:J$40,0))=TRUE,AC18+1,AC18))","v":1},"","","",{"$f":"IF(AH19=\"\",AG18,IF(ISNA(MATCH(AH19,'Planning Bénévoles'!K$3:K$40,0))=TRUE,AG18+1,AG18))","v":1},"","","",{"$f":"IF(AL19=\"\",AK18,IF(ISNA(MATCH(AL19,'Planning Bénévoles'!L$3:L$40,0))=TRUE,AK18+1,AK18))","v":3},"","TANGUY Bob",1,{"$f":"IF(AP19=\"\",AO18,IF(ISNA(MATCH(AP19,'Planning Bénévoles'!M$3:M$40,0))=TRUE,AO18+1,AO18))","v":7},"","JANOT (K) Laetitia",1,{"$f":"IF(AT19=\"\",AS18,IF(ISNA(MATCH(AT19,'Planning Bénévoles'!N$3:N$40,0))=TRUE,AS18+1,AS18))","v":5},"DANGÉ Yann","LE BIHAN Guy",1,{"$f":"IF(AX19=\"\",AW18,IF(ISNA(MATCH(AX19,'Planning Bénévoles'!O$3:O$40,0))=TRUE,AW18+1,AW18))","v":0},"","","",{"$f":"IF(BB19=\"\",BA18,IF(ISNA(MATCH(BB19,'Planning Bénévoles'!P$3:P$40,0))=TRUE,BA18+1,BA18))","v":10},"","DUPUY Isabelle",1,{"$f":"IF(BF19=\"\",BE18,IF(ISNA(MATCH(BF19,'Planning Bénévoles'!Q$3:Q$40,0))=TRUE,BE18+1,BE18))","v":3},"DANGÉ Yann","LE ROUX Stéphanie",1,{"$f":"IF(BJ19=\"\",BI18,IF(ISNA(MATCH(BJ19,'Planning Bénévoles'!R$3:R$40,0))=TRUE,BI18+1,BI18))","v":2},"DANGÉ Yann","MARCHE Sophie",1,{"$f":"IF(BN19=\"\",BM18,IF(ISNA(MATCH(BN19,'Planning Bénévoles'!S$3:S$40,0))=TRUE,BM18+1,BM18))","v":6},"DANGÉ Yann","HADOUZI Yasmine",1,{"$f":"IF(BR19=\"\",BQ18,IF(ISNA(MATCH(BR19,'Planning Bénévoles'!T$3:T$40,0))=TRUE,BQ18+1,BQ18))","v":4},"DANGÉ Yann","HADOUZI Yasmine",1]
[{"$f":"IF(B20=\"\",A19,IF(ISNA(MATCH(B20,'Planning Bénévoles'!C$3:C$40,0))=TRUE,A19+1,A19))","v":1},"DANGÉ Jean Pierre","","",{"$f":"IF(F20=\"\",E19,IF(ISNA(MATCH(F20,'Planning Bénévoles'!D$3:D$40,0))=TRUE,E19+1,E19))","v":2},"","NHEK (K) Alexandrine",1,{"$f":"IF(J20=\"\",I19,IF(ISNA(MATCH(J20,'Planning Bénévoles'!E$3:E$40,0))=TRUE,I19+1,I19))","v":1},"","","",{"$f":"IF(N20=\"\",M19,IF(ISNA(MATCH(N20,'Planning Bénévoles'!F$3:F$40,0))=TRUE,M19+1,M19))","v":0},"DANGÉ Jean Pierre","","",{"$f":"IF(R20=\"\",Q19,IF(ISNA(MATCH(R20,'Planning Bénévoles'!G$3:G$40,0))=TRUE,Q19+1,Q19))","v":0},"","","",{"$f":"IF(V20=\"\",U19,IF(ISNA(MATCH(V20,'Planning Bénévoles'!H$3:H$40,0))=TRUE,U19+1,U19))","v":0},"","","",{"$f":"IF(Z20=\"\",Y19,IF(ISNA(MATCH(Z20,'Planning Bénévoles'!I$3:I$40,0))=TRUE,Y19+1,Y19))","v":0},"DANGÉ Jean Pierre","","",{"$f":"IF(AD20=\"\",AC19,IF(ISNA(MATCH(AD20,'Planning Bénévoles'!J$3:J$40,0))=TRUE,AC19+1,AC19))","v":1},"","","",{"$f":"IF(AH20=\"\",AG19,IF(ISNA(MATCH(AH20,'Planning Bénévoles'!K$3:K$40,0))=TRUE,AG19+1,AG19))","v":1},"","","",{"$f":"IF(AL20=\"\",AK19,IF(ISNA(MATCH(AL20,'Planning Bénévoles'!L$3:L$40,0))=TRUE,AK19+1,AK19))","v":4},"DANGÉ Jean Pierre","TROBOE Marcel",1,{"$f":"IF(AP20=\"\",AO19,IF(ISNA(MATCH(AP20,'Planning Bénévoles'!M$3:M$40,0))=TRUE,AO19+1,AO19))","v":7},"","KERVELLA (K) Virginie",1,{"$f":"IF(AT20=\"\",AS19,IF(ISNA(MATCH(AT20,'Planning Bénévoles'!N$3:N$40,0))=TRUE,AS19+1,AS19))","v":5},"","LE BOSSER Jean René",1,{"$f":"IF(AX20=\"\",AW19,IF(ISNA(MATCH(AX20,'Planning Bénévoles'!O$3:O$40,0))=TRUE,AW19+1,AW19))","v":0},"DANGÉ Jean Pierre","","",{"$f":"IF(BB20=\"\",BA19,IF(ISNA(MATCH(BB20,'Planning Bénévoles'!P$3:P$40,0))=TRUE,BA19+1,BA19))","v":10},"","GUEGUEN (K) Sébastien",1,{"$f":"IF(BF20=\"\",BE19,IF(ISNA(MATCH(BF20,'Planning Bénévoles'!Q$3:Q$40,0))=TRUE,BE19+1,BE19))","v":3},"","LE ROY  Julian",1,{"$f":"IF(BJ20=\"\",BI19,IF(ISNA(MATCH(BJ20,'Planning Bénévoles'!R$3:R$40,0))=TRUE,BI19+1,BI19))","v":3},"DANGÉ Jean Pierre","MOAL Alain",1,{"$f":"IF(BN20=\"\",BM19,IF(ISNA(MATCH(BN20,'Planning Bénévoles'!S$3:S$40,0))=TRUE,BM19+1,BM19))","v":6},"","HELAC Adélie",1,{"$f":"IF(BR20=\"\",BQ19,IF(ISNA(MATCH(BR20,'Planning Bénévoles'!T$3:T$40,0))=TRUE,BQ19+1,BQ19))","v":4},"","LANDOUARD Frédéric",1]
[{"$f":"IF(B21=\"\",A20,IF(ISNA(MATCH(B21,'Planning Bénévoles'!C$3:C$40,0))=TRUE,A20+1,A20))","v":1},"","","",{"$f":"IF(F21=\"\",E20,IF(ISNA(MATCH(F21,'Planning Bénévoles'!D$3:D$40,0))=TRUE,E20+1,E20))","v":3},"DANIEL Alain","RAMA (THG) Jurgen",1,{"$f":"IF(J21=\"\",I20,IF(ISNA(MATCH(J21,'Planning Bénévoles'!E$3:E$40,0))=TRUE,I20+1,I20))","v":2},"DANIEL Alain","","",{"$f":"IF(N21=\"\",M20,IF(ISNA(MATCH(N21,'Planning Bénévoles'!F$3:F$40,0))=TRUE,M20+1,M20))","v":0},"","","",{"$f":"IF(R21=\"\",Q20,IF(ISNA(MATCH(R21,'Planning Bénévoles'!G$3:G$40,0))=TRUE,Q20+1,Q20))","v":0},"DANIEL Alain","","",{"$f":"IF(V21=\"\",U20,IF(ISNA(MATCH(V21,'Planning Bénévoles'!H$3:H$40,0))=TRUE,U20+1,U20))","v":0},"DANIEL Alain","","",{"$f":"IF(Z21=\"\",Y20,IF(ISNA(MATCH(Z21,'Planning Bénévoles'!I$3:I$40,0))=TRUE,Y20+1,Y20))","v":0},"","","",{"$f":"IF(AD21=\"\",AC20,IF(ISNA(MATCH(AD21,'Planning Bénévoles'!J$3:J$40,0))=TRUE,AC20+1,AC20))","v":2},"DANIEL Alain","","",{"$f":"IF(AH21=\"\",AG20,IF(ISNA(MATCH(AH21,'Planning Bénévoles'!K$3:K$40,0))=TRUE,AG20+1,AG20))","v":1},"","","",{"$f":"IF(AL21=\"\",AK20,IF(ISNA(MATCH(AL21,'Planning Bénévoles'!L$3:L$40,0))=TRUE,AK20+1,AK20))","v":4},"","","",{"$f":"IF(AP21=\"\",AO20,IF(ISNA(MATCH(AP21,'Planning Bénévoles'!M$3:M$40,0))=TRUE,AO20+1,AO20))","v":7},"","LANDOUARD Frédéric",1,{"$f":"IF(AT21=\"\",AS20,IF(ISNA(MATCH(AT21,'Planning Bénévoles'!N$3:N$40,0))=TRUE,AS20+1,AS20))","v":6},"DANIEL Alain","LE BOSSER Liliane",1,{"$f":"IF(AX21=\"\",AW20,IF(ISNA(MATCH(AX21,'Planning Bénévoles'!O$3:O$40,0))=TRUE,AW20+1,AW20))","v":0},"","","",{"$f":"IF(BB21=\"\",BA20,IF(ISNA(MATCH(BB21,'Planning Bénévoles'!P$3:P$40,0))=TRUE,BA20+1,BA20))","v":11},"DANIEL Alain","JANOT (K) Laetitia",1,{"$f":"IF(BF21=\"\",BE20,IF(ISNA(MATCH(BF21,'Planning Bénévoles'!Q$3:Q$40,0))=TRUE,BE20+1,BE20))","v":4},"DANIEL Alain","MARCHE Sophie",1,{"$f":"IF(BJ21=\"\",BI20,IF(ISNA(MATCH(BJ21,'Planning Bénévoles'!R$3:R$40,0))=TRUE,BI20+1,BI20))","v":4},"DANIEL Alain","RAFFO Carine",1,{"$f":"IF(BN21=\"\",BM20,IF(ISNA(MATCH(BN21,'Planning Bénévoles'!S$3:S$40,0))=TRUE,BM20+1,BM20))","v":7},"DANIEL Alain","KERLEO Anne Marie",1,{"$f":"IF(BR21=\"\",BQ20,IF(ISNA(MATCH(BR21,'Planning Bénévoles'!T$3:T$40,0))=TRUE,BQ20+1,BQ20))","v":5},"DANIEL Alain","LE BOSSER Jean René",1]
[{"$f":"IF(B22=\"\",A21,IF(ISNA(MATCH(B22,'Planning Bénévoles'!C$3:C$40,0))=TRUE,A21+1,A21))","v":1},"","","",{"$f":"IF(F22=\"\",E21,IF(ISNA(MATCH(F22,'Planning Bénévoles'!D$3:D$40,0))=TRUE,E21+1,E21))","v":3},"","ROBERT Mireille",1,{"$f":"IF(J22=\"\",I21,IF(ISNA(MATCH(J22,'Planning Bénévoles'!E$3:E$40,0))=TRUE,I21+1,I21))","v":3},"DANIEL Annie France","","",{"$f":"IF(N22=\"\",M21,IF(ISNA(MATCH(N22,'Planning Bénévoles'!F$3:F$40,0))=TRUE,M21+1,M21))","v":0},"","","",{"$f":"IF(R22=\"\",Q21,IF(ISNA(MATCH(R22,'Planning Bénévoles'!G$3:G$40,0))=TRUE,Q21+1,Q21))","v":0},"DANIEL Annie France","","",{"$f":"IF(V22=\"\",U21,IF(ISNA(MATCH(V22,'Planning Bénévoles'!H$3:H$40,0))=TRUE,U21+1,U21))","v":0},"DANIEL Annie France","","",{"$f":"IF(Z22=\"\",Y21,IF(ISNA(MATCH(Z22,'Planning Bénévoles'!I$3:I$40,0))=TRUE,Y21+1,Y21))","v":0},"","","",{"$f":"IF(AD22=\"\",AC21,IF(ISNA(MATCH(AD22,'Planning Bénévoles'!J$3:J$40,0))=TRUE,AC21+1,AC21))","v":2},"","","",{"$f":"IF(AH22=\"\",AG21,IF(ISNA(MATCH(AH22,'Planning Bénévoles'!K$3:K$40,0))=TRUE,AG21+1,AG21))","v":1},"","","",{"$f":"IF(AL22=\"\",AK21,IF(ISNA(MATCH(AL22,'Planning Bénévoles'!L$3:L$40,0))=TRUE,AK21+1,AK21))","v":4},"","","",{"$f":"IF(AP22=\"\",AO21,IF(ISNA(MATCH(AP22,'Planning Bénévoles'!M$3:M$40,0))=TRUE,AO21+1,AO21))","v":7},"","LE CORRE  Jérémy",1,{"$f":"IF(AT22=\"\",AS21,IF(ISNA(MATCH(AT22,'Planning Bénévoles'!N$3:N$40,0))=TRUE,AS21+1,AS21))","v":7},"DANIEL Annie France","LE ROY  Julian",1,{"$f":"IF(AX22=\"\",AW21,IF(ISNA(MATCH(AX22,'Planning Bénévoles'!O$3:O$40,0))=TRUE,AW21+1,AW21))","v":0},"","","",{"$f":"IF(BB22=\"\",BA21,IF(ISNA(MATCH(BB22,'Planning Bénévoles'!P$3:P$40,0))=TRUE,BA21+1,BA21))","v":12},"DANIEL Annie France","KERLEO Anne Marie",1,{"$f":"IF(BF22=\"\",BE21,IF(ISNA(MATCH(BF22,'Planning Bénévoles'!Q$3:Q$40,0))=TRUE,BE21+1,BE21))","v":5},"DANIEL Annie France","MOAL Alain",1,{"$f":"IF(BJ22=\"\",BI21,IF(ISNA(MATCH(BJ22,'Planning Bénévoles'!R$3:R$40,0))=TRUE,BI21+1,BI21))","v":5},"DANIEL Annie France","ROBERT Mireille",1,{"$f":"IF(BN22=\"\",BM21,IF(ISNA(MATCH(BN22,'Planning Bénévoles'!S$3:S$40,0))=TRUE,BM21+1,BM21))","v":8},"DANIEL Annie France","LANDOUARD Frédéric",1,{"$f":"IF(BR22=\"\",BQ21,IF(ISNA(MATCH(BR22,'Planning Bénévoles'!T$3:T$40,0))=TRUE,BQ21+1,BQ21))","v":6},"DANIEL Annie France","LE BOSSER Liliane",1]
[{"$f":"IF(B23=\"\",A22,IF(ISNA(MATCH(B23,'Planning Bénévoles'!C$3:C$40,0))=TRUE,A22+1,A22))","v":1},"","","",{"$f":"IF(F23=\"\",E22,IF(ISNA(MATCH(F23,'Planning Bénévoles'!D$3:D$40,0))=TRUE,E22+1,E22))","v":3},"DENES Annick","STRUILLOU (K) Charlotte",1,{"$f":"IF(J23=\"\",I22,IF(ISNA(MATCH(J23,'Planning Bénévoles'!E$3:E$40,0))=TRUE,I22+1,I22))","v":3},"","","",{"$f":"IF(N23=\"\",M22,IF(ISNA(MATCH(N23,'Planning Bénévoles'!F$3:F$40,0))=TRUE,M22+1,M22))","v":0},"","","",{"$f":"IF(R23=\"\",Q22,IF(ISNA(MATCH(R23,'Planning Bénévoles'!G$3:G$40,0))=TRUE,Q22+1,Q22))","v":0},"","","",{"$f":"IF(V23=\"\",U22,IF(ISNA(MATCH(V23,'Planning Bénévoles'!H$3:H$40,0))=TRUE,U22+1,U22))","v":0},"DENES Annick","","",{"$f":"IF(Z23=\"\",Y22,IF(ISNA(MATCH(Z23,'Planning Bénévoles'!I$3:I$40,0))=TRUE,Y22+1,Y22))","v":0},"","","",{"$f":"IF(AD23=\"\",AC22,IF(ISNA(MATCH(AD23,'Planning Bénévoles'!J$3:J$40,0))=TRUE,AC22+1,AC22))","v":2},"DENES Annick","","",{"$f":"IF(AH23=\"\",AG22,IF(ISNA(MATCH(AH23,'Planning Bénévoles'!K$3:K$40,0))=TRUE,AG22+1,AG22))","v":1},"","","",{"$f":"IF(AL23=\"\",AK22,IF(ISNA(MATCH(AL23,'Planning Bénévoles'!L$3:L$40,0))=TRUE,AK22+1,AK22))","v":4},"","","",{"$f":"IF(AP23=\"\",AO22,IF(ISNA(MATCH(AP23,'Planning Bénévoles'!M$3:M$40,0))=TRUE,AO22+1,AO22))","v":8},"DENES Annick","LE ROY  Julian",1,{"$f":"IF(AT23=\"\",AS22,IF(ISNA(MATCH(AT23,'Planning Bénévoles'!N$3:N$40,0))=TRUE,AS22+1,AS22))","v":8},"DENES Annick","LECHAT Loïc",1,{"$f":"IF(AX23=\"\",AW22,IF(ISNA(MATCH(AX23,'Planning Bénévoles'!O$3:O$40,0))=TRUE,AW22+1,AW22))","v":0},"","","",{"$f":"IF(BB23=\"\",BA22,IF(ISNA(MATCH(BB23,'Planning Bénévoles'!P$3:P$40,0))=TRUE,BA22+1,BA22))","v":13},"DENES Annick","KERVELLA (K) Virginie",1,{"$f":"IF(BF23=\"\",BE22,IF(ISNA(MATCH(BF23,'Planning Bénévoles'!Q$3:Q$40,0))=TRUE,BE22+1,BE22))","v":6},"DENES Annick","PLOUZENNEC Nadine",1,{"$f":"IF(BJ23=\"\",BI22,IF(ISNA(MATCH(BJ23,'Planning Bénévoles'!R$3:R$40,0))=TRUE,BI22+1,BI22))","v":5},"","ROUGER Olga",1,{"$f":"IF(BN23=\"\",BM22,IF(ISNA(MATCH(BN23,'Planning Bénévoles'!S$3:S$40,0))=TRUE,BM22+1,BM22))","v":9},"DENES Annick","LE BOSSER Jean René",1,{"$f":"IF(BR23=\"\",BQ22,IF(ISNA(MATCH(BR23,'Planning Bénévoles'!T$3:T$40,0))=TRUE,BQ22+1,BQ22))","v":7},"DENES Annick","LE CORRE  Jérémy",1]
[{"$f":"IF(B24=\"\",A23,IF(ISNA(MATCH(B24,'Planning Bénévoles'!C$3:C$40,0))=TRUE,A23+1,A23))","v":1},"","","",{"$f":"IF(F24=\"\",E23,IF(ISNA(MATCH(F24,'Planning Bénévoles'!D$3:D$40,0))=TRUE,E23+1,E23))","v":3},"DESECHALLIERS Carole","","",{"$f":"IF(J24=\"\",I23,IF(ISNA(MATCH(J24,'Planning Bénévoles'!E$3:E$40,0))=TRUE,I23+1,I23))","v":3},"","","",{"$f":"IF(N24=\"\",M23,IF(ISNA(MATCH(N24,'Planning Bénévoles'!F$3:F$40,0))=TRUE,M23+1,M23))","v":0},"","","",{"$f":"IF(R24=\"\",Q23,IF(ISNA(MATCH(R24,'Planning Bénévoles'!G$3:G$40,0))=TRUE,Q23+1,Q23))","v":0},"DESECHALLIERS Carole","","",{"$f":"IF(V24=\"\",U23,IF(ISNA(MATCH(V24,'Planning Bénévoles'!H$3:H$40,0))=TRUE,U23+1,U23))","v":0},"","","",{"$f":"IF(Z24=\"\",Y23,IF(ISNA(MATCH(Z24,'Planning Bénévoles'!I$3:I$40,0))=TRUE,Y23+1,Y23))","v":0},"","","",{"$f":"IF(AD24=\"\",AC23,IF(ISNA(MATCH(AD24,'Planning Bénévoles'!J$3:J$40,0))=TRUE,AC23+1,AC23))","v":2},"","","",{"$f":"IF(AH24=\"\",AG23,IF(ISNA(MATCH(AH24,'Planning Bénévoles'!K$3:K$40,0))=TRUE,AG23+1,AG23))","v":1},"","","",{"$f":"IF(AL24=\"\",AK23,IF(ISNA(MATCH(AL24,'Planning Bénévoles'!L$3:L$40,0))=TRUE,AK23+1,AK23))","v":4},"","","",{"$f":"IF(AP24=\"\",AO23,IF(ISNA(MATCH(AP24,'Planning Bénévoles'!M$3:M$40,0))=TRUE,AO23+1,AO23))","v":8},"","MALANDAIN Manuela",1,{"$f":"IF(AT24=\"\",AS23,IF(ISNA(MATCH(AT24,'Planning Bénévoles'!N$3:N$40,0))=TRUE,AS23+1,AS23))","v":9},"DESECHALLIERS Carole","MALANDAIN Manuela",1,{"$f":"IF(AX24=\"\",AW23,IF(ISNA(MATCH(AX24,'Planning Bénévoles'!O$3:O$40,0))=TRUE,AW23+1,AW23))","v":0},"","","",{"$f":"IF(BB24=\"\",BA23,IF(ISNA(MATCH(BB24,'Planning Bénévoles'!P$3:P$40,0))=TRUE,BA23+1,BA23))","v":13},"","LANDOUARD Frédéric",1,{"$f":"IF(BF24=\"\",BE23,IF(ISNA(MATCH(BF24,'Planning Bénévoles'!Q$3:Q$40,0))=TRUE,BE23+1,BE23))","v":7},"DESECHALLIERS Carole","RAFFO Carine",1,{"$f":"IF(BJ24=\"\",BI23,IF(ISNA(MATCH(BJ24,'Planning Bénévoles'!R$3:R$40,0))=TRUE,BI23+1,BI23))","v":6},"DESECHALLIERS Carole","TALLEC-GORAGUER Clara",1,{"$f":"IF(BN24=\"\",BM23,IF(ISNA(MATCH(BN24,'Planning Bénévoles'!S$3:S$40,0))=TRUE,BM23+1,BM23))","v":10},"DESECHALLIERS Carole","LE BOSSER Liliane",1,{"$f":"IF(BR24=\"\",BQ23,IF(ISNA(MATCH(BR24,'Planning Bénévoles'!T$3:T$40,0))=TRUE,BQ23+1,BQ23))","v":8},"DESECHALLIERS Carole","LE GALL Yves",1]
[{"$f":"IF(B25=\"\",A24,IF(ISNA(MATCH(B25,'Planning Bénévoles'!C$3:C$40,0))=TRUE,A24+1,A24))","v":1},"DESJARDINS Jean Luc","","",{"$f":"IF(F25=\"\",E24,IF(ISNA(MATCH(F25,'Planning Bénévoles'!D$3:D$40,0))=TRUE,E24+1,E24))","v":3},"DESJARDINS Jean Luc","","",{"$f":"IF(J25=\"\",I24,IF(ISNA(MATCH(J25,'Planning Bénévoles'!E$3:E$40,0))=TRUE,I24+1,I24))","v":3},"","","",{"$f":"IF(N25=\"\",M24,IF(ISNA(MATCH(N25,'Planning Bénévoles'!F$3:F$40,0))=TRUE,M24+1,M24))","v":1},"DESJARDINS Jean Luc","","",{"$f":"IF(R25=\"\",Q24,IF(ISNA(MATCH(R25,'Planning Bénévoles'!G$3:G$40,0))=TRUE,Q24+1,Q24))","v":0},"DESJARDINS Jean Luc","","",{"$f":"IF(V25=\"\",U24,IF(ISNA(MATCH(V25,'Planning Bénévoles'!H$3:H$40,0))=TRUE,U24+1,U24))","v":0},"","","",{"$f":"IF(Z25=\"\",Y24,IF(ISNA(MATCH(Z25,'Planning Bénévoles'!I$3:I$40,0))=TRUE,Y24+1,Y24))","v":0},"DESJARDINS Jean Luc","","",{"$f":"IF(AD25=\"\",AC24,IF(ISNA(MATCH(AD25,'Planning Bénévoles'!J$3:J$40,0))=TRUE,AC24+1,AC24))","v":2},"DESJARDINS Jean Luc","","",{"$f":"IF(AH25=\"\",AG24,IF(ISNA(MATCH(AH25,'Planning Bénévoles'!K$3:K$40,0))=TRUE,AG24+1,AG24))","v":1},"","","",{"$f":"IF(AL25=\"\",AK24,IF(ISNA(MATCH(AL25,'Planning Bénévoles'!L$3:L$40,0))=TRUE,AK24+1,AK24))","v":4},"","","",{"$f":"IF(AP25=\"\",AO24,IF(ISNA(MATCH(AP25,'Planning Bénévoles'!M$3:M$40,0))=TRUE,AO24+1,AO24))","v":9},"DESJARDINS Jean Luc","MARCHE Sophie",1,{"$f":"IF(AT25=\"\",AS24,IF(ISNA(MATCH(AT25,'Planning Bénévoles'!N$3:N$40,0))=TRUE,AS24+1,AS24))","v":9},"","MARCHE Sophie",1,{"$f":"IF(AX25=\"\",AW24,IF(ISNA(MATCH(AX25,'Planning Bénévoles'!O$3:O$40,0))=TRUE,AW24+1,AW24))","v":1},"DESJARDINS Jean Luc","","",{"$f":"IF(BB25=\"\",BA24,IF(ISNA(MATCH(BB25,'Planning Bénévoles'!P$3:P$40,0))=TRUE,BA24+1,BA24))","v":14},"DESJARDINS Jean Luc","LE BOSSER Jean René",1,{"$f":"IF(BF25=\"\",BE24,IF(ISNA(MATCH(BF25,'Planning Bénévoles'!Q$3:Q$40,0))=TRUE,BE24+1,BE24))","v":7},"","RIHANI Mohamed",1,{"$f":"IF(BJ25=\"\",BI24,IF(ISNA(MATCH(BJ25,'Planning Bénévoles'!R$3:R$40,0))=TRUE,BI24+1,BI24))","v":7},"DESJARDINS Jean Luc","TROBOE Marcel",1,{"$f":"IF(BN25=\"\",BM24,IF(ISNA(MATCH(BN25,'Planning Bénévoles'!S$3:S$40,0))=TRUE,BM24+1,BM24))","v":10},"","LE CORRE  Jérémy",1,{"$f":"IF(BR25=\"\",BQ24,IF(ISNA(MATCH(BR25,'Planning Bénévoles'!T$3:T$40,0))=TRUE,BQ24+1,BQ24))","v":9},"DESJARDINS Jean Luc","LE ROY  Julian",1]
[{"$f":"IF(B26=\"\",A25,IF(ISNA(MATCH(B26,'Planning Bénévoles'!C$3:C$40,0))=TRUE,A25+1,A25))","v":1},"DUPUY Isabelle","","",{"$f":"IF(F26=\"\",E25,IF(ISNA(MATCH(F26,'Planning Bénévoles'!D$3:D$40,0))=TRUE,E25+1,E25))","v":3},"DUPUY Isabelle","","",{"$f":"IF(J26=\"\",I25,IF(ISNA(MATCH(J26,'Planning Bénévoles'!E$3:E$40,0))=TRUE,I25+1,I25))","v":3},"DUPUY Isabelle","","",{"$f":"IF(N26=\"\",M25,IF(ISNA(MATCH(N26,'Planning Bénévoles'!F$3:F$40,0))=TRUE,M25+1,M25))","v":1},"DUPUY Isabelle","","",{"$f":"IF(R26=\"\",Q25,IF(ISNA(MATCH(R26,'Planning Bénévoles'!G$3:G$40,0))=TRUE,Q25+1,Q25))","v":0},"","","",{"$f":"IF(V26=\"\",U25,IF(ISNA(MATCH(V26,'Planning Bénévoles'!H$3:H$40,0))=TRUE,U25+1,U25))","v":0},"","","",{"$f":"IF(Z26=\"\",Y25,IF(ISNA(MATCH(Z26,'Planning Bénévoles'!I$3:I$40,0))=TRUE,Y25+1,Y25))","v":0},"","","",{"$f":"IF(AD26=\"\",AC25,IF(ISNA(MATCH(AD26,'Planning Bénévoles'!J$3:J$40,0))=TRUE,AC25+1,AC25))","v":2},"","","",{"$f":"IF(AH26=\"\",AG25,IF(ISNA(MATCH(AH26,'Planning Bénévoles'!K$3:K$40,0))=TRUE,AG25+1,AG25))","v":1},"","","",{"$f":"IF(AL26=\"\",AK25,IF(ISNA(MATCH(AL26,'Planning Bénévoles'!L$3:L$40,0))=TRUE,AK25+1,AK25))","v":4},"DUPUY Isabelle","","",{"$f":"IF(AP26=\"\",AO25,IF(ISNA(MATCH(AP26,'Planning Bénévoles'!M$3:M$40,0))=TRUE,AO25+1,AO25))","v":10},"DUPUY Isabelle","MOAL Alain",1,{"$f":"IF(AT26=\"\",AS25,IF(ISNA(MATCH(AT26,'Planning Bénévoles'!N$3:N$40,0))=TRUE,AS25+1,AS25))","v":10},"DUPUY Isabelle","MIGLIACCIO Claire",1,{"$f":"IF(AX26=\"\",AW25,IF(ISNA(MATCH(AX26,'Planning Bénévoles'!O$3:O$40,0))=TRUE,AW25+1,AW25))","v":1},"DUPUY Isabelle","","",{"$f":"IF(BB26=\"\",BA25,IF(ISNA(MATCH(BB26,'Planning Bénévoles'!P$3:P$40,0))=TRUE,BA25+1,BA25))","v":15},"DUPUY Isabelle","LE BOSSER Liliane",1,{"$f":"IF(BF26=\"\",BE25,IF(ISNA(MATCH(BF26,'Planning Bénévoles'!Q$3:Q$40,0))=TRUE,BE25+1,BE25))","v":8},"DUPUY Isabelle","ROBERT Mireille",1,{"$f":"IF(BJ26=\"\",BI25,IF(ISNA(MATCH(BJ26,'Planning Bénévoles'!R$3:R$40,0))=TRUE,BI25+1,BI25))","v":8},"DUPUY Isabelle","","",{"$f":"IF(BN26=\"\",BM25,IF(ISNA(MATCH(BN26,'Planning Bénévoles'!S$3:S$40,0))=TRUE,BM25+1,BM25))","v":11},"DUPUY Isabelle","LE GALL Yves",1,{"$f":"IF(BR26=\"\",BQ25,IF(ISNA(MATCH(BR26,'Planning Bénévoles'!T$3:T$40,0))=TRUE,BQ25+1,BQ25))","v":10},"DUPUY Isabelle","MALANDAIN Manuela",1]
[{"$f":"IF(B27=\"\",A26,IF(ISNA(MATCH(B27,'Planning Bénévoles'!C$3:C$40,0))=TRUE,A26+1,A26))","v":1},"","","",{"$f":"IF(F27=\"\",E26,IF(ISNA(MATCH(F27,'Planning Bénévoles'!D$3:D$40,0))=TRUE,E26+1,E26))","v":4},"DUTERQUE Frédérique","","",{"$f":"IF(J27=\"\",I26,IF(ISNA(MATCH(J27,'Planning Bénévoles'!E$3:E$40,0))=TRUE,I26+1,I26))","v":4},"DUTERQUE Frédérique","","",{"$f":"IF(N27=\"\",M26,IF(ISNA(MATCH(N27,'Planning Bénévoles'!F$3:F$40,0))=TRUE,M26+1,M26))","v":1},"","","",{"$f":"IF(R27=\"\",Q26,IF(ISNA(MATCH(R27,'Planning Bénévoles'!G$3:G$40,0))=TRUE,Q26+1,Q26))","v":1},"DUTERQUE Frédérique","","",{"$f":"IF(V27=\"\",U26,IF(ISNA(MATCH(V27,'Planning Bénévoles'!H$3:H$40,0))=TRUE,U26+1,U26))","v":0},"DUTERQUE Frédérique","","",{"$f":"IF(Z27=\"\",Y26,IF(ISNA(MATCH(Z27,'Planning Bénévoles'!I$3:I$40,0))=TRUE,Y26+1,Y26))","v":0},"","","",{"$f":"IF(AD27=\"\",AC26,IF(ISNA(MATCH(AD27,'Planning Bénévoles'!J$3:J$40,0))=TRUE,AC26+1,AC26))","v":2},"","","",{"$f":"IF(AH27=\"\",AG26,IF(ISNA(MATCH(AH27,'Planning Bénévoles'!K$3:K$40,0))=TRUE,AG26+1,AG26))","v":1},"","","",{"$f":"IF(AL27=\"\",AK26,IF(ISNA(MATCH(AL27,'Planning Bénévoles'!L$3:L$40,0))=TRUE,AK26+1,AK26))","v":4},"","","",{"$f":"IF(AP27=\"\",AO26,IF(ISNA(MATCH(AP27,'Planning Bénévoles'!M$3:M$40,0))=TRUE,AO26+1,AO26))","v":11},"DUTERQUE Frédérique","NHEK (K) Alexandrine",1,{"$f":"IF(AT27=\"\",AS26,IF(ISNA(MATCH(AT27,'Planning Bénévoles'!N$3:N$40,0))=TRUE,AS26+1,AS26))","v":11},"DUTERQUE Frédérique","MOAL Alain",1,{"$f":"IF(AX27=\"\",AW26,IF(ISNA(MATCH(AX27,'Planning Bénévoles'!O$3:O$40,0))=TRUE,AW26+1,AW26))","v":1},"","","",{"$f":"IF(BB27=\"\",BA26,IF(ISNA(MATCH(BB27,'Planning Bénévoles'!P$3:P$40,0))=TRUE,BA26+1,BA26))","v":15},"","LE CORRE  Jérémy",1,{"$f":"IF(BF27=\"\",BE26,IF(ISNA(MATCH(BF27,'Planning Bénévoles'!Q$3:Q$40,0))=TRUE,BE26+1,BE26))","v":8},"","ROUAT Manon",1,{"$f":"IF(BJ27=\"\",BI26,IF(ISNA(MATCH(BJ27,'Planning Bénévoles'!R$3:R$40,0))=TRUE,BI26+1,BI26))","v":9},"DUTERQUE Frédérique","","",{"$f":"IF(BN27=\"\",BM26,IF(ISNA(MATCH(BN27,'Planning Bénévoles'!S$3:S$40,0))=TRUE,BM26+1,BM26))","v":12},"DUTERQUE Frédérique","LE ROY  Julian",1,{"$f":"IF(BR27=\"\",BQ26,IF(ISNA(MATCH(BR27,'Planning Bénévoles'!T$3:T$40,0))=TRUE,BQ26+1,BQ26))","v":11},"DUTERQUE Frédérique","MARCHE Sophie",1]
[{"$f":"IF(B28=\"\",A27,IF(ISNA(MATCH(B28,'Planning Bénévoles'!C$3:C$40,0))=TRUE,A27+1,A27))","v":1},"","","",{"$f":"IF(F28=\"\",E27,IF(ISNA(MATCH(F28,'Planning Bénévoles'!D$3:D$40,0))=TRUE,E27+1,E27))","v":4},"","","",{"$f":"IF(J28=\"\",I27,IF(ISNA(MATCH(J28,'Planning Bénévoles'!E$3:E$40,0))=TRUE,I27+1,I27))","v":4},"","","",{"$f":"IF(N28=\"\",M27,IF(ISNA(MATCH(N28,'Planning Bénévoles'!F$3:F$40,0))=TRUE,M27+1,M27))","v":1},"","","",{"$f":"IF(R28=\"\",Q27,IF(ISNA(MATCH(R28,'Planning Bénévoles'!G$3:G$40,0))=TRUE,Q27+1,Q27))","v":1},"","","",{"$f":"IF(V28=\"\",U27,IF(ISNA(MATCH(V28,'Planning Bénévoles'!H$3:H$40,0))=TRUE,U27+1,U27))","v":0},"","","",{"$f":"IF(Z28=\"\",Y27,IF(ISNA(MATCH(Z28,'Planning Bénévoles'!I$3:I$40,0))=TRUE,Y27+1,Y27))","v":0},"FER (THG) Mélissa","","",{"$f":"IF(AD28=\"\",AC27,IF(ISNA(MATCH(AD28,'Planning Bénévoles'!J$3:J$40,0))=TRUE,AC27+1,AC27))","v":2},"FER (THG) Mélissa","","",{"$f":"IF(AH28=\"\",AG27,IF(ISNA(MATCH(AH28,'Planning Bénévoles'!K$3:K$40,0))=TRUE,AG27+1,AG27))","v":1},"","","",{"$f":"IF(AL28=\"\",AK27,IF(ISNA(MATCH(AL28,'Planning Bénévoles'!L$3:L$40,0))=TRUE,AK27+1,AK27))","v":4},"FER (THG) Mélissa","","",{"$f":"IF(AP28=\"\",AO27,IF(ISNA(MATCH(AP28,'Planning Bénévoles'!M$3:M$40,0))=TRUE,AO27+1,AO27))","v":12},"FER (THG) Mélissa","PARISSE (THG) Amélie",1,{"$f":"IF(AT28=\"\",AS27,IF(ISNA(MATCH(AT28,'Planning Bénévoles'!N$3:N$40,0))=TRUE,AS27+1,AS27))","v":11},"","PLOUZENNEC Nadine",1,{"$f":"IF(AX28=\"\",AW27,IF(ISNA(MATCH(AX28,'Planning Bénévoles'!O$3:O$40,0))=TRUE,AW27+1,AW27))","v":1},"","","",{"$f":"IF(BB28=\"\",BA27,IF(ISNA(MATCH(BB28,'Planning Bénévoles'!P$3:P$40,0))=TRUE,BA27+1,BA27))","v":15},"","LE GALL Yves",1,{"$f":"IF(BF28=\"\",BE27,IF(ISNA(MATCH(BF28,'Planning Bénévoles'!Q$3:Q$40,0))=TRUE,BE27+1,BE27))","v":8},"","ROUGER Olga",1,{"$f":"IF(BJ28=\"\",BI27,IF(ISNA(MATCH(BJ28,'Planning Bénévoles'!R$3:R$40,0))=TRUE,BI27+1,BI27))","v":9},"","","",{"$f":"IF(BN28=\"\",BM27,IF(ISNA(MATCH(BN28,'Planning Bénévoles'!S$3:S$40,0))=TRUE,BM27+1,BM27))","v":12},"","LECHAT Loïc",1,{"$f":"IF(BR28=\"\",BQ27,IF(ISNA(MATCH(BR28,'Planning Bénévoles'!T$3:T$40,0))=TRUE,BQ27+1,BQ27))","v":11},"","MIGLIACCIO Claire",1]
[{"$f":"IF(B29=\"\",A28,IF(ISNA(MATCH(B29,'Planning Bénévoles'!C$3:C$40,0))=TRUE,A28+1,A28))","v":1},"","","",{"$f":"IF(F29=\"\",E28,IF(ISNA(MATCH(F29,'Planning Bénévoles'!D$3:D$40,0))=TRUE,E28+1,E28))","v":5},"FISSEUX Rosalina","","",{"$f":"IF(J29=\"\",I28,IF(ISNA(MATCH(J29,'Planning Bénévoles'!E$3:E$40,0))=TRUE,I28+1,I28))","v":4},"","","",{"$f":"IF(N29=\"\",M28,IF(ISNA(MATCH(N29,'Planning Bénévoles'!F$3:F$40,0))=TRUE,M28+1,M28))","v":1},"","","",{"$f":"IF(R29=\"\",Q28,IF(ISNA(MATCH(R29,'Planning Bénévoles'!G$3:G$40,0))=TRUE,Q28+1,Q28))","v":1},"","","",{"$f":"IF(V29=\"\",U28,IF(ISNA(MATCH(V29,'Planning Bénévoles'!H$3:H$40,0))=TRUE,U28+1,U28))","v":0},"","","",{"$f":"IF(Z29=\"\",Y28,IF(ISNA(MATCH(Z29,'Planning Bénévoles'!I$3:I$40,0))=TRUE,Y28+1,Y28))","v":0},"FISSEUX Rosalina","","",{"$f":"IF(AD29=\"\",AC28,IF(ISNA(MATCH(AD29,'Planning Bénévoles'!J$3:J$40,0))=TRUE,AC28+1,AC28))","v":2},"","","",{"$f":"IF(AH29=\"\",AG28,IF(ISNA(MATCH(AH29,'Planning Bénévoles'!K$3:K$40,0))=TRUE,AG28+1,AG28))","v":1},"","","",{"$f":"IF(AL29=\"\",AK28,IF(ISNA(MATCH(AL29,'Planning Bénévoles'!L$3:L$40,0))=TRUE,AK28+1,AK28))","v":4},"","","",{"$f":"IF(AP29=\"\",AO28,IF(ISNA(MATCH(AP29,'Planning Bénévoles'!M$3:M$40,0))=TRUE,AO28+1,AO28))","v":13},"FISSEUX Rosalina","PLOUZENNEC Nadine",1,{"$f":"IF(AT29=\"\",AS28,IF(ISNA(MATCH(AT29,'Planning Bénévoles'!N$3:N$40,0))=TRUE,AS28+1,AS28))","v":11},"","RAFFO Carine",1,{"$f":"IF(AX29=\"\",AW28,IF(ISNA(MATCH(AX29,'Planning Bénévoles'!O$3:O$40,0))=TRUE,AW28+1,AW28))","v":1},"","","",{"$f":"IF(BB29=\"\",BA28,IF(ISNA(MATCH(BB29,'Planning Bénévoles'!P$3:P$40,0))=TRUE,BA28+1,BA28))","v":15},"","LE ROUX Stéphanie",1,{"$f":"IF(BF29=\"\",BE28,IF(ISNA(MATCH(BF29,'Planning Bénévoles'!Q$3:Q$40,0))=TRUE,BE28+1,BE28))","v":9},"FISSEUX Rosalina","SANS Loïs",1,{"$f":"IF(BJ29=\"\",BI28,IF(ISNA(MATCH(BJ29,'Planning Bénévoles'!R$3:R$40,0))=TRUE,BI28+1,BI28))","v":9},"","","",{"$f":"IF(BN29=\"\",BM28,IF(ISNA(MATCH(BN29,'Planning Bénévoles'!S$3:S$40,0))=TRUE,BM28+1,BM28))","v":12},"","MALANDAIN Manuela",1,{"$f":"IF(BR29=\"\",BQ28,IF(ISNA(MATCH(BR29,'Planning Bénévoles'!T$3:T$40,0))=TRUE,BQ28+1,BQ28))","v":12},"FISSEUX Rosalina","MOAL Alain",1]
[{"$f":"IF(B30=\"\",A29,IF(ISNA(MATCH(B30,'Planning Bénévoles'!C$3:C$40,0))=TRUE,A29+1,A29))","v":1},"FLOCH Philippe","","",{"$f":"IF(F30=\"\",E29,IF(ISNA(MATCH(F30,'Planning Bénévoles'!D$3:D$40,0))=TRUE,E29+1,E29))","v":5},"","","",{"$f":"IF(J30=\"\",I29,IF(ISNA(MATCH(J30,'Planning Bénévoles'!E$3:E$40,0))=TRUE,I29+1,I29))","v":4},"","","",{"$f":"IF(N30=\"\",M29,IF(ISNA(MATCH(N30,'Planning Bénévoles'!F$3:F$40,0))=TRUE,M29+1,M29))","v":1},"FLOCH Philippe","","",{"$f":"IF(R30=\"\",Q29,IF(ISNA(MATCH(R30,'Planning Bénévoles'!G$3:G$40,0))=TRUE,Q29+1,Q29))","v":1},"","","",{"$f":"IF(V30=\"\",U29,IF(ISNA(MATCH(V30,'Planning Bénévoles'!H$3:H$40,0))=TRUE,U29+1,U29))","v":0},"","","",{"$f":"IF(Z30=\"\",Y29,IF(ISNA(MATCH(Z30,'Planning Bénévoles'!I$3:I$40,0))=TRUE,Y29+1,Y29))","v":0},"FLOCH Philippe","","",{"$f":"IF(AD30=\"\",AC29,IF(ISNA(MATCH(AD30,'Planning Bénévoles'!J$3:J$40,0))=TRUE,AC29+1,AC29))","v":2},"","","",{"$f":"IF(AH30=\"\",AG29,IF(ISNA(MATCH(AH30,'Planning Bénévoles'!K$3:K$40,0))=TRUE,AG29+1,AG29))","v":1},"","","",{"$f":"IF(AL30=\"\",AK29,IF(ISNA(MATCH(AL30,'Planning Bénévoles'!L$3:L$40,0))=TRUE,AK29+1,AK29))","v":4},"FLOCH Philippe","","",{"$f":"IF(AP30=\"\",AO29,IF(ISNA(MATCH(AP30,'Planning Bénévoles'!M$3:M$40,0))=TRUE,AO29+1,AO29))","v":13},"","RAFFO Carine",1,{"$f":"IF(AT30=\"\",AS29,IF(ISNA(MATCH(AT30,'Planning Bénévoles'!N$3:N$40,0))=TRUE,AS29+1,AS29))","v":11},"","ROBERT Mireille",1,{"$f":"IF(AX30=\"\",AW29,IF(ISNA(MATCH(AX30,'Planning Bénévoles'!O$3:O$40,0))=TRUE,AW29+1,AW29))","v":1},"FLOCH Philippe","","",{"$f":"IF(BB30=\"\",BA29,IF(ISNA(MATCH(BB30,'Planning Bénévoles'!P$3:P$40,0))=TRUE,BA29+1,BA29))","v":15},"","LE ROY  Julian",1,{"$f":"IF(BF30=\"\",BE29,IF(ISNA(MATCH(BF30,'Planning Bénévoles'!Q$3:Q$40,0))=TRUE,BE29+1,BE29))","v":9},"","TALLEC-GORAGUER Clara",1,{"$f":"IF(BJ30=\"\",BI29,IF(ISNA(MATCH(BJ30,'Planning Bénévoles'!R$3:R$40,0))=TRUE,BI29+1,BI29))","v":9},"","","",{"$f":"IF(BN30=\"\",BM29,IF(ISNA(MATCH(BN30,'Planning Bénévoles'!S$3:S$40,0))=TRUE,BM29+1,BM29))","v":12},"","MARCHE Sophie",1,{"$f":"IF(BR30=\"\",BQ29,IF(ISNA(MATCH(BR30,'Planning Bénévoles'!T$3:T$40,0))=TRUE,BQ29+1,BQ29))","v":12},"","PLOUZENNEC Nadine",1]
[{"$f":"IF(B31=\"\",A30,IF(ISNA(MATCH(B31,'Planning Bénévoles'!C$3:C$40,0))=TRUE,A30+1,A30))","v":2},"GAONACH (THG) Sarah","","",{"$f":"IF(F31=\"\",E30,IF(ISNA(MATCH(F31,'Planning Bénévoles'!D$3:D$40,0))=TRUE,E30+1,E30))","v":6},"GAONACH (THG) Sarah","","",{"$f":"IF(J31=\"\",I30,IF(ISNA(MATCH(J31,'Planning Bénévoles'!E$3:E$40,0))=TRUE,I30+1,I30))","v":4},"","","",{"$f":"IF(N31=\"\",M30,IF(ISNA(MATCH(N31,'Planning Bénévoles'!F$3:F$40,0))=TRUE,M30+1,M30))","v":1},"GAONACH (THG) Sarah","","",{"$f":"IF(R31=\"\",Q30,IF(ISNA(MATCH(R31,'Planning Bénévoles'!G$3:G$40,0))=TRUE,Q30+1,Q30))","v":2},"GAONACH (THG) Sarah","","",{"$f":"IF(V31=\"\",U30,IF(ISNA(MATCH(V31,'Planning Bénévoles'!H$3:H$40,0))=TRUE,U30+1,U30))","v":0},"","","",{"$f":"IF(Z31=\"\",Y30,IF(ISNA(MATCH(Z31,'Planning Bénévoles'!I$3:I$40,0))=TRUE,Y30+1,Y30))","v":0},"","","",{"$f":"IF(AD31=\"\",AC30,IF(ISNA(MATCH(AD31,'Planning Bénévoles'!J$3:J$40,0))=TRUE,AC30+1,AC30))","v":2},"","","",{"$f":"IF(AH31=\"\",AG30,IF(ISNA(MATCH(AH31,'Planning Bénévoles'!K$3:K$40,0))=TRUE,AG30+1,AG30))","v":1},"","","",{"$f":"IF(AL31=\"\",AK30,IF(ISNA(MATCH(AL31,'Planning Bénévoles'!L$3:L$40,0))=TRUE,AK30+1,AK30))","v":4},"","","",{"$f":"IF(AP31=\"\",AO30,IF(ISNA(MATCH(AP31,'Planning Bénévoles'!M$3:M$40,0))=TRUE,AO30+1,AO30))","v":13},"","ROBERT Mireille",1,{"$f":"IF(AT31=\"\",AS30,IF(ISNA(MATCH(AT31,'Planning Bénévoles'!N$3:N$40,0))=TRUE,AS30+1,AS30))","v":11},"","ROUAT Manon",1,{"$f":"IF(AX31=\"\",AW30,IF(ISNA(MATCH(AX31,'Planning Bénévoles'!O$3:O$40,0))=TRUE,AW30+1,AW30))","v":1},"","","",{"$f":"IF(BB31=\"\",BA30,IF(ISNA(MATCH(BB31,'Planning Bénévoles'!P$3:P$40,0))=TRUE,BA30+1,BA30))","v":15},"","LE ROY (THG) Christelle",1,{"$f":"IF(BF31=\"\",BE30,IF(ISNA(MATCH(BF31,'Planning Bénévoles'!Q$3:Q$40,0))=TRUE,BE30+1,BE30))","v":9},"","TANGUY Bob",1,{"$f":"IF(BJ31=\"\",BI30,IF(ISNA(MATCH(BJ31,'Planning Bénévoles'!R$3:R$40,0))=TRUE,BI30+1,BI30))","v":9},"","","",{"$f":"IF(BN31=\"\",BM30,IF(ISNA(MATCH(BN31,'Planning Bénévoles'!S$3:S$40,0))=TRUE,BM30+1,BM30))","v":12},"","MIGLIACCIO Claire",1,{"$f":"IF(BR31=\"\",BQ30,IF(ISNA(MATCH(BR31,'Planning Bénévoles'!T$3:T$40,0))=TRUE,BQ30+1,BQ30))","v":12},"","RAFFO Carine",1]
[{"$f":"IF(B32=\"\",A31,IF(ISNA(MATCH(B32,'Planning Bénévoles'!C$3:C$40,0))=TRUE,A31+1,A31))","v":2},"","","",{"$f":"IF(F32=\"\",E31,IF(ISNA(MATCH(F32,'Planning Bénévoles'!D$3:D$40,0))=TRUE,E31+1,E31))","v":6},"","","",{"$f":"IF(J32=\"\",I31,IF(ISNA(MATCH(J32,'Planning Bénévoles'!E$3:E$40,0))=TRUE,I31+1,I31))","v":4},"GARCETTE Jade","","",{"$f":"IF(N32=\"\",M31,IF(ISNA(MATCH(N32,'Planning Bénévoles'!F$3:F$40,0))=TRUE,M31+1,M31))","v":1},"","","",{"$f":"IF(R32=\"\",Q31,IF(ISNA(MATCH(R32,'Planning Bénévoles'!G$3:G$40,0))=TRUE,Q31+1,Q31))","v":2},"","","",{"$f":"IF(V32=\"\",U31,IF(ISNA(MATCH(V32,'Planning Bénévoles'!H$3:H$40,0))=TRUE,U31+1,U31))","v":0},"GARCETTE Jade","","",{"$f":"IF(Z32=\"\",Y31,IF(ISNA(MATCH(Z32,'Planning Bénévoles'!I$3:I$40,0))=TRUE,Y31+1,Y31))","v":0},"","","",{"$f":"IF(AD32=\"\",AC31,IF(ISNA(MATCH(AD32,'Planning Bénévoles'!J$3:J$40,0))=TRUE,AC31+1,AC31))","v":2},"","","",{"$f":"IF(AH32=\"\",AG31,IF(ISNA(MATCH(AH32,'Planning Bénévoles'!K$3:K$40,0))=TRUE,AG31+1,AG31))","v":2},"GARCETTE Jade","","",{"$f":"IF(AL32=\"\",AK31,IF(ISNA(MATCH(AL32,'Planning Bénévoles'!L$3:L$40,0))=TRUE,AK31+1,AK31))","v":4},"","","",{"$f":"IF(AP32=\"\",AO31,IF(ISNA(MATCH(AP32,'Planning Bénévoles'!M$3:M$40,0))=TRUE,AO31+1,AO31))","v":13},"","ROUGER Olga",1,{"$f":"IF(AT32=\"\",AS31,IF(ISNA(MATCH(AT32,'Planning Bénévoles'!N$3:N$40,0))=TRUE,AS31+1,AS31))","v":12},"GARCETTE Jade","ROUGER Olga",1,{"$f":"IF(AX32=\"\",AW31,IF(ISNA(MATCH(AX32,'Planning Bénévoles'!O$3:O$40,0))=TRUE,AW31+1,AW31))","v":1},"","","",{"$f":"IF(BB32=\"\",BA31,IF(ISNA(MATCH(BB32,'Planning Bénévoles'!P$3:P$40,0))=TRUE,BA31+1,BA31))","v":15},"","MARCHE Sophie",1,{"$f":"IF(BF32=\"\",BE31,IF(ISNA(MATCH(BF32,'Planning Bénévoles'!Q$3:Q$40,0))=TRUE,BE31+1,BE31))","v":10},"GARCETTE Jade","THEME Sophie",1,{"$f":"IF(BJ32=\"\",BI31,IF(ISNA(MATCH(BJ32,'Planning Bénévoles'!R$3:R$40,0))=TRUE,BI31+1,BI31))","v":9},"","","",{"$f":"IF(BN32=\"\",BM31,IF(ISNA(MATCH(BN32,'Planning Bénévoles'!S$3:S$40,0))=TRUE,BM31+1,BM31))","v":13},"GARCETTE Jade","MOAL Alain",1,{"$f":"IF(BR32=\"\",BQ31,IF(ISNA(MATCH(BR32,'Planning Bénévoles'!T$3:T$40,0))=TRUE,BQ31+1,BQ31))","v":13},"GARCETTE Jade","RIHANI Mohamed",1]
[{"$f":"IF(B33=\"\",A32,IF(ISNA(MATCH(B33,'Planning Bénévoles'!C$3:C$40,0))=TRUE,A32+1,A32))","v":2},"","","",{"$f":"IF(F33=\"\",E32,IF(ISNA(MATCH(F33,'Planning Bénévoles'!D$3:D$40,0))=TRUE,E32+1,E32))","v":6},"","","",{"$f":"IF(J33=\"\",I32,IF(ISNA(MATCH(J33,'Planning Bénévoles'!E$3:E$40,0))=TRUE,I32+1,I32))","v":4},"","","",{"$f":"IF(N33=\"\",M32,IF(ISNA(MATCH(N33,'Planning Bénévoles'!F$3:F$40,0))=TRUE,M32+1,M32))","v":1},"","","",{"$f":"IF(R33=\"\",Q32,IF(ISNA(MATCH(R33,'Planning Bénévoles'!G$3:G$40,0))=TRUE,Q32+1,Q32))","v":2},"","","",{"$f":"IF(V33=\"\",U32,IF(ISNA(MATCH(V33,'Planning Bénévoles'!H$3:H$40,0))=TRUE,U32+1,U32))","v":0},"","","",{"$f":"IF(Z33=\"\",Y32,IF(ISNA(MATCH(Z33,'Planning Bénévoles'!I$3:I$40,0))=TRUE,Y32+1,Y32))","v":0},"","","",{"$f":"IF(AD33=\"\",AC32,IF(ISNA(MATCH(AD33,'Planning Bénévoles'!J$3:J$40,0))=TRUE,AC32+1,AC32))","v":2},"","","",{"$f":"IF(AH33=\"\",AG32,IF(ISNA(MATCH(AH33,'Planning Bénévoles'!K$3:K$40,0))=TRUE,AG32+1,AG32))","v":2},"","","",{"$f":"IF(AL33=\"\",AK32,IF(ISNA(MATCH(AL33,'Planning Bénévoles'!L$3:L$40,0))=TRUE,AK32+1,AK32))","v":4},"","","",{"$f":"IF(AP33=\"\",AO32,IF(ISNA(MATCH(AP33,'Planning Bénévoles'!M$3:M$40,0))=TRUE,AO32+1,AO32))","v":13},"","TANGUY Bob",1,{"$f":"IF(AT33=\"\",AS32,IF(ISNA(MATCH(AT33,'Planning Bénévoles'!N$3:N$40,0))=TRUE,AS32+1,AS32))","v":12},"","TANGUY Bob",1,{"$f":"IF(AX33=\"\",AW32,IF(ISNA(MATCH(AX33,'Planning Bénévoles'!O$3:O$40,0))=TRUE,AW32+1,AW32))","v":1},"","","",{"$f":"IF(BB33=\"\",BA32,IF(ISNA(MATCH(BB33,'Planning Bénévoles'!P$3:P$40,0))=TRUE,BA32+1,BA32))","v":15},"","MOAL Alain",1,{"$f":"IF(BF33=\"\",BE32,IF(ISNA(MATCH(BF33,'Planning Bénévoles'!Q$3:Q$40,0))=TRUE,BE32+1,BE32))","v":10},"","WOJCIK Eulalie",1,{"$f":"IF(BJ33=\"\",BI32,IF(ISNA(MATCH(BJ33,'Planning Bénévoles'!R$3:R$40,0))=TRUE,BI32+1,BI32))","v":9},"","","",{"$f":"IF(BN33=\"\",BM32,IF(ISNA(MATCH(BN33,'Planning Bénévoles'!S$3:S$40,0))=TRUE,BM32+1,BM32))","v":14},"GERNIGON Laurence","PLOUZENNEC Nadine",1,{"$f":"IF(BR33=\"\",BQ32,IF(ISNA(MATCH(BR33,'Planning Bénévoles'!T$3:T$40,0))=TRUE,BQ32+1,BQ32))","v":14},"GERNIGON Laurence","ROBERT Mireille",1]
[{"$f":"IF(B34=\"\",A33,IF(ISNA(MATCH(B34,'Planning Bénévoles'!C$3:C$40,0))=TRUE,A33+1,A33))","v":3},"GUEGUEN (K) Sébastien","","",{"$f":"IF(F34=\"\",E33,IF(ISNA(MATCH(F34,'Planning Bénévoles'!D$3:D$40,0))=TRUE,E33+1,E33))","v":7},"GUEGUEN (K) Sébastien","","",{"$f":"IF(J34=\"\",I33,IF(ISNA(MATCH(J34,'Planning Bénévoles'!E$3:E$40,0))=TRUE,I33+1,I33))","v":4},"","","",{"$f":"IF(N34=\"\",M33,IF(ISNA(MATCH(N34,'Planning Bénévoles'!F$3:F$40,0))=TRUE,M33+1,M33))","v":1},"GUEGUEN (K) Sébastien","","",{"$f":"IF(R34=\"\",Q33,IF(ISNA(MATCH(R34,'Planning Bénévoles'!G$3:G$40,0))=TRUE,Q33+1,Q33))","v":3},"GUEGUEN (K) Sébastien","","",{"$f":"IF(V34=\"\",U33,IF(ISNA(MATCH(V34,'Planning Bénévoles'!H$3:H$40,0))=TRUE,U33+1,U33))","v":0},"","","",{"$f":"IF(Z34=\"\",Y33,IF(ISNA(MATCH(Z34,'Planning Bénévoles'!I$3:I$40,0))=TRUE,Y33+1,Y33))","v":0},"","","",{"$f":"IF(AD34=\"\",AC33,IF(ISNA(MATCH(AD34,'Planning Bénévoles'!J$3:J$40,0))=TRUE,AC33+1,AC33))","v":2},"","","",{"$f":"IF(AH34=\"\",AG33,IF(ISNA(MATCH(AH34,'Planning Bénévoles'!K$3:K$40,0))=TRUE,AG33+1,AG33))","v":2},"","","",{"$f":"IF(AL34=\"\",AK33,IF(ISNA(MATCH(AL34,'Planning Bénévoles'!L$3:L$40,0))=TRUE,AK33+1,AK33))","v":5},"GUEGUEN (K) Sébastien","","",{"$f":"IF(AP34=\"\",AO33,IF(ISNA(MATCH(AP34,'Planning Bénévoles'!M$3:M$40,0))=TRUE,AO33+1,AO33))","v":14},"GUEGUEN (K) Sébastien","TROBOE Marcel",1,{"$f":"IF(AT34=\"\",AS33,IF(ISNA(MATCH(AT34,'Planning Bénévoles'!N$3:N$40,0))=TRUE,AS33+1,AS33))","v":12},"","THEME Sophie",1,{"$f":"IF(AX34=\"\",AW33,IF(ISNA(MATCH(AX34,'Planning Bénévoles'!O$3:O$40,0))=TRUE,AW33+1,AW33))","v":1},"GUEGUEN (K) Sébastien","","",{"$f":"IF(BB34=\"\",BA33,IF(ISNA(MATCH(BB34,'Planning Bénévoles'!P$3:P$40,0))=TRUE,BA33+1,BA33))","v":16},"GUEGUEN (K) Sébastien","NHEK (K) Alexandrine",1,{"$f":"IF(BF34=\"\",BE33,IF(ISNA(MATCH(BF34,'Planning Bénévoles'!Q$3:Q$40,0))=TRUE,BE33+1,BE33))","v":10},"","YANG Johanne",1,{"$f":"IF(BJ34=\"\",BI33,IF(ISNA(MATCH(BJ34,'Planning Bénévoles'!R$3:R$40,0))=TRUE,BI33+1,BI33))","v":9},"","","",{"$f":"IF(BN34=\"\",BM33,IF(ISNA(MATCH(BN34,'Planning Bénévoles'!S$3:S$40,0))=TRUE,BM33+1,BM33))","v":14},"","RAFFO Carine",1,{"$f":"IF(BR34=\"\",BQ33,IF(ISNA(MATCH(BR34,'Planning Bénévoles'!T$3:T$40,0))=TRUE,BQ33+1,BQ33))","v":14},"","ROCHCONGAR Christelle",1]
[{"$f":"IF(B35=\"\",A34,IF(ISNA(MATCH(B35,'Planning Bénévoles'!C$3:C$40,0))=TRUE,A34+1,A34))","v":4},"GUERROT (THG) Gildas","","",{"$f":"IF(F35=\"\",E34,IF(ISNA(MATCH(F35,'Planning Bénévoles'!D$3:D$40,0))=TRUE,E34+1,E34))","v":8},"GUERROT (THG) Gildas","","",{"$f":"IF(J35=\"\",I34,IF(ISNA(MATCH(J35,'Planning Bénévoles'!E$3:E$40,0))=TRUE,I34+1,I34))","v":4},"","","",{"$f":"IF(N35=\"\",M34,IF(ISNA(MATCH(N35,'Planning Bénévoles'!F$3:F$40,0))=TRUE,M34+1,M34))","v":1},"GUERROT (THG) Gildas","","",{"$f":"IF(R35=\"\",Q34,IF(ISNA(MATCH(R35,'Planning Bénévoles'!G$3:G$40,0))=TRUE,Q34+1,Q34))","v":3},"GUERROT (THG) Gildas","","",{"$f":"IF(V35=\"\",U34,IF(ISNA(MATCH(V35,'Planning Bénévoles'!H$3:H$40,0))=TRUE,U34+1,U34))","v":0},"","","",{"$f":"IF(Z35=\"\",Y34,IF(ISNA(MATCH(Z35,'Planning Bénévoles'!I$3:I$40,0))=TRUE,Y34+1,Y34))","v":0},"","","",{"$f":"IF(AD35=\"\",AC34,IF(ISNA(MATCH(AD35,'Planning Bénévoles'!J$3:J$40,0))=TRUE,AC34+1,AC34))","v":2},"","","",{"$f":"IF(AH35=\"\",AG34,IF(ISNA(MATCH(AH35,'Planning Bénévoles'!K$3:K$40,0))=TRUE,AG34+1,AG34))","v":2},"","","",{"$f":"IF(AL35=\"\",AK34,IF(ISNA(MATCH(AL35,'Planning Bénévoles'!L$3:L$40,0))=TRUE,AK34+1,AK34))","v":5},"","","",{"$f":"IF(AP35=\"\",AO34,IF(ISNA(MATCH(AP35,'Planning Bénévoles'!M$3:M$40,0))=TRUE,AO34+1,AO34))","v":14},"","","",{"$f":"IF(AT35=\"\",AS34,IF(ISNA(MATCH(AT35,'Planning Bénévoles'!N$3:N$40,0))=TRUE,AS34+1,AS34))","v":12},"","WOJCIK Eulalie",1,{"$f":"IF(AX35=\"\",AW34,IF(ISNA(MATCH(AX35,'Planning Bénévoles'!O$3:O$40,0))=TRUE,AW34+1,AW34))","v":1},"","","",{"$f":"IF(BB35=\"\",BA34,IF(ISNA(MATCH(BB35,'Planning Bénévoles'!P$3:P$40,0))=TRUE,BA34+1,BA34))","v":16},"","PLOUZENNEC Nadine",1,{"$f":"IF(BF35=\"\",BE34,IF(ISNA(MATCH(BF35,'Planning Bénévoles'!Q$3:Q$40,0))=TRUE,BE34+1,BE34))","v":10},"","","",{"$f":"IF(BJ35=\"\",BI34,IF(ISNA(MATCH(BJ35,'Planning Bénévoles'!R$3:R$40,0))=TRUE,BI34+1,BI34))","v":9},"","","",{"$f":"IF(BN35=\"\",BM34,IF(ISNA(MATCH(BN35,'Planning Bénévoles'!S$3:S$40,0))=TRUE,BM34+1,BM34))","v":14},"","RIHANI Mohamed",1,{"$f":"IF(BR35=\"\",BQ34,IF(ISNA(MATCH(BR35,'Planning Bénévoles'!T$3:T$40,0))=TRUE,BQ34+1,BQ34))","v":14},"","ROUGER Olga",1]
[{"$f":"IF(B36=\"\",A35,IF(ISNA(MATCH(B36,'Planning Bénévoles'!C$3:C$40,0))=TRUE,A35+1,A35))","v":5},"GUEZENNEC (K) Bruno","","",{"$f":"IF(F36=\"\",E35,IF(ISNA(MATCH(F36,'Planning Bénévoles'!D$3:D$40,0))=TRUE,E35+1,E35))","v":9},"GUEZENNEC (K) Bruno","","",{"$f":"IF(J36=\"\",I35,IF(ISNA(MATCH(J36,'Planning Bénévoles'!E$3:E$40,0))=TRUE,I35+1,I35))","v":4},"","","",{"$f":"IF(N36=\"\",M35,IF(ISNA(MATCH(N36,'Planning Bénévoles'!F$3:F$40,0))=TRUE,M35+1,M35))","v":1},"GUEZENNEC (K) Bruno","","",{"$f":"IF(R36=\"\",Q35,IF(ISNA(MATCH(R36,'Planning Bénévoles'!G$3:G$40,0))=TRUE,Q35+1,Q35))","v":4},"GUEZENNEC (K) Bruno","","",{"$f":"IF(V36=\"\",U35,IF(ISNA(MATCH(V36,'Planning Bénévoles'!H$3:H$40,0))=TRUE,U35+1,U35))","v":0},"","","",{"$f":"IF(Z36=\"\",Y35,IF(ISNA(MATCH(Z36,'Planning Bénévoles'!I$3:I$40,0))=TRUE,Y35+1,Y35))","v":0},"","","",{"$f":"IF(AD36=\"\",AC35,IF(ISNA(MATCH(AD36,'Planning Bénévoles'!J$3:J$40,0))=TRUE,AC35+1,AC35))","v":2},"","","",{"$f":"IF(AH36=\"\",AG35,IF(ISNA(MATCH(AH36,'Planning Bénévoles'!K$3:K$40,0))=TRUE,AG35+1,AG35))","v":2},"","","",{"$f":"IF(AL36=\"\",AK35,IF(ISNA(MATCH(AL36,'Planning Bénévoles'!L$3:L$40,0))=TRUE,AK35+1,AK35))","v":5},"","","",{"$f":"IF(AP36=\"\",AO35,IF(ISNA(MATCH(AP36,'Planning Bénévoles'!M$3:M$40,0))=TRUE,AO35+1,AO35))","v":14},"","","",{"$f":"IF(AT36=\"\",AS35,IF(ISNA(MATCH(AT36,'Planning Bénévoles'!N$3:N$40,0))=TRUE,AS35+1,AS35))","v":12},"","YANG Johanne",1,{"$f":"IF(AX36=\"\",AW35,IF(ISNA(MATCH(AX36,'Planning Bénévoles'!O$3:O$40,0))=TRUE,AW35+1,AW35))","v":1},"","","",{"$f":"IF(BB36=\"\",BA35,IF(ISNA(MATCH(BB36,'Planning Bénévoles'!P$3:P$40,0))=TRUE,BA35+1,BA35))","v":16},"","RAFFO Carine",1,{"$f":"IF(BF36=\"\",BE35,IF(ISNA(MATCH(BF36,'Planning Bénévoles'!Q$3:Q$40,0))=TRUE,BE35+1,BE35))","v":10},"","","",{"$f":"IF(BJ36=\"\",BI35,IF(ISNA(MATCH(BJ36,'Planning Bénévoles'!R$3:R$40,0))=TRUE,BI35+1,BI35))","v":9},"","","",{"$f":"IF(BN36=\"\",BM35,IF(ISNA(MATCH(BN36,'Planning Bénévoles'!S$3:S$40,0))=TRUE,BM35+1,BM35))","v":14},"","ROBERT Mireille",1,{"$f":"IF(BR36=\"\",BQ35,IF(ISNA(MATCH(BR36,'Planning Bénévoles'!T$3:T$40,0))=TRUE,BQ35+1,BQ35))","v":14},"","TALLEC-GORAGUER Clara",1]
[{"$f":"IF(B37=\"\",A36,IF(ISNA(MATCH(B37,'Planning Bénévoles'!C$3:C$40,0))=TRUE,A36+1,A36))","v":5},"","","",{"$f":"IF(F37=\"\",E36,IF(ISNA(MATCH(F37,'Planning Bénévoles'!D$3:D$40,0))=TRUE,E36+1,E36))","v":9},"","","",{"$f":"IF(J37=\"\",I36,IF(ISNA(MATCH(J37,'Planning Bénévoles'!E$3:E$40,0))=TRUE,I36+1,I36))","v":4},"","","",{"$f":"IF(N37=\"\",M36,IF(ISNA(MATCH(N37,'Planning Bénévoles'!F$3:F$40,0))=TRUE,M36+1,M36))","v":1},"","","",{"$f":"IF(R37=\"\",Q36,IF(ISNA(MATCH(R37,'Planning Bénévoles'!G$3:G$40,0))=TRUE,Q36+1,Q36))","v":4},"","","",{"$f":"IF(V37=\"\",U36,IF(ISNA(MATCH(V37,'Planning Bénévoles'!H$3:H$40,0))=TRUE,U36+1,U36))","v":0},"GUTIERREZ Valentina","","",{"$f":"IF(Z37=\"\",Y36,IF(ISNA(MATCH(Z37,'Planning Bénévoles'!I$3:I$40,0))=TRUE,Y36+1,Y36))","v":0},"","","",{"$f":"IF(AD37=\"\",AC36,IF(ISNA(MATCH(AD37,'Planning Bénévoles'!J$3:J$40,0))=TRUE,AC36+1,AC36))","v":2},"","","",{"$f":"IF(AH37=\"\",AG36,IF(ISNA(MATCH(AH37,'Planning Bénévoles'!K$3:K$40,0))=TRUE,AG36+1,AG36))","v":2},"GUTIERREZ Valentina","","",{"$f":"IF(AL37=\"\",AK36,IF(ISNA(MATCH(AL37,'Planning Bénévoles'!L$3:L$40,0))=TRUE,AK36+1,AK36))","v":5},"","","",{"$f":"IF(AP37=\"\",AO36,IF(ISNA(MATCH(AP37,'Planning Bénévoles'!M$3:M$40,0))=TRUE,AO36+1,AO36))","v":14},"","","",{"$f":"IF(AT37=\"\",AS36,IF(ISNA(MATCH(AT37,'Planning Bénévoles'!N$3:N$40,0))=TRUE,AS36+1,AS36))","v":12},"","","",{"$f":"IF(AX37=\"\",AW36,IF(ISNA(MATCH(AX37,'Planning Bénévoles'!O$3:O$40,0))=TRUE,AW36+1,AW36))","v":1},"","","",{"$f":"IF(BB37=\"\",BA36,IF(ISNA(MATCH(BB37,'Planning Bénévoles'!P$3:P$40,0))=TRUE,BA36+1,BA36))","v":16},"","ROBERT Mireille",1,{"$f":"IF(BF37=\"\",BE36,IF(ISNA(MATCH(BF37,'Planning Bénévoles'!Q$3:Q$40,0))=TRUE,BE36+1,BE36))","v":10},"","","",{"$f":"IF(BJ37=\"\",BI36,IF(ISNA(MATCH(BJ37,'Planning Bénévoles'!R$3:R$40,0))=TRUE,BI36+1,BI36))","v":9},"","","",{"$f":"IF(BN37=\"\",BM36,IF(ISNA(MATCH(BN37,'Planning Bénévoles'!S$3:S$40,0))=TRUE,BM36+1,BM36))","v":14},"","ROUGER Olga",1,{"$f":"IF(BR37=\"\",BQ36,IF(ISNA(MATCH(BR37,'Planning Bénévoles'!T$3:T$40,0))=TRUE,BQ36+1,BQ36))","v":14},"","TANGUY Bob",1]
[{"$f":"IF(B38=\"\",A37,IF(ISNA(MATCH(B38,'Planning Bénévoles'!C$3:C$40,0))=TRUE,A37+1,A37))","v":5},"","","",{"$f":"IF(F38=\"\",E37,IF(ISNA(MATCH(F38,'Planning Bénévoles'!D$3:D$40,0))=TRUE,E37+1,E37))","v":9},"","","",{"$f":"IF(J38=\"\",I37,IF(ISNA(MATCH(J38,'Planning Bénévoles'!E$3:E$40,0))=TRUE,I37+1,I37))","v":4},"HADOUZI Yasmine","","",{"$f":"IF(N38=\"\",M37,IF(ISNA(MATCH(N38,'Planning Bénévoles'!F$3:F$40,0))=TRUE,M37+1,M37))","v":1},"","","",{"$f":"IF(R38=\"\",Q37,IF(ISNA(MATCH(R38,'Planning Bénévoles'!G$3:G$40,0))=TRUE,Q37+1,Q37))","v":4},"","","",{"$f":"IF(V38=\"\",U37,IF(ISNA(MATCH(V38,'Planning Bénévoles'!H$3:H$40,0))=TRUE,U37+1,U37))","v":1},"HADOUZI Yasmine","","",{"$f":"IF(Z38=\"\",Y37,IF(ISNA(MATCH(Z38,'Planning Bénévoles'!I$3:I$40,0))=TRUE,Y37+1,Y37))","v":0},"","","",{"$f":"IF(AD38=\"\",AC37,IF(ISNA(MATCH(AD38,'Planning Bénévoles'!J$3:J$40,0))=TRUE,AC37+1,AC37))","v":2},"","","",{"$f":"IF(AH38=\"\",AG37,IF(ISNA(MATCH(AH38,'Planning Bénévoles'!K$3:K$40,0))=TRUE,AG37+1,AG37))","v":2},"HADOUZI Yasmine","","",{"$f":"IF(AL38=\"\",AK37,IF(ISNA(MATCH(AL38,'Planning Bénévoles'!L$3:L$40,0))=TRUE,AK37+1,AK37))","v":5},"","","",{"$f":"IF(AP38=\"\",AO37,IF(ISNA(MATCH(AP38,'Planning Bénévoles'!M$3:M$40,0))=TRUE,AO37+1,AO37))","v":14},"","","",{"$f":"IF(AT38=\"\",AS37,IF(ISNA(MATCH(AT38,'Planning Bénévoles'!N$3:N$40,0))=TRUE,AS37+1,AS37))","v":13},"HADOUZI Yasmine","","",{"$f":"IF(AX38=\"\",AW37,IF(ISNA(MATCH(AX38,'Planning Bénévoles'!O$3:O$40,0))=TRUE,AW37+1,AW37))","v":1},"","","",{"$f":"IF(BB38=\"\",BA37,IF(ISNA(MATCH(BB38,'Planning Bénévoles'!P$3:P$40,0))=TRUE,BA37+1,BA37))","v":16},"","ROUGER Olga",1,{"$f":"IF(BF38=\"\",BE37,IF(ISNA(MATCH(BF38,'Planning Bénévoles'!Q$3:Q$40,0))=TRUE,BE37+1,BE37))","v":11},"HADOUZI Yasmine","","",{"$f":"IF(BJ38=\"\",BI37,IF(ISNA(MATCH(BJ38,'Planning Bénévoles'!R$3:R$40,0))=TRUE,BI37+1,BI37))","v":9},"","","",{"$f":"IF(BN38=\"\",BM37,IF(ISNA(MATCH(BN38,'Planning Bénévoles'!S$3:S$40,0))=TRUE,BM37+1,BM37))","v":15},"HADOUZI Yasmine","TALLEC-GORAGUER Clara",1,{"$f":"IF(BR38=\"\",BQ37,IF(ISNA(MATCH(BR38,'Planning Bénévoles'!T$3:T$40,0))=TRUE,BQ37+1,BQ37))","v":15},"HADOUZI Yasmine","TROBOE Marcel",1]
[{"$f":"IF(B39=\"\",A38,IF(ISNA(MATCH(B39,'Planning Bénévoles'!C$3:C$40,0))=TRUE,A38+1,A38))","v":5},"","","",{"$f":"IF(F39=\"\",E38,IF(ISNA(MATCH(F39,'Planning Bénévoles'!D$3:D$40,0))=TRUE,E38+1,E38))","v":9},"","","",{"$f":"IF(J39=\"\",I38,IF(ISNA(MATCH(J39,'Planning Bénévoles'!E$3:E$40,0))=TRUE,I38+1,I38))","v":4},"","","",{"$f":"IF(N39=\"\",M38,IF(ISNA(MATCH(N39,'Planning Bénévoles'!F$3:F$40,0))=TRUE,M38+1,M38))","v":1},"","","",{"$f":"IF(R39=\"\",Q38,IF(ISNA(MATCH(R39,'Planning Bénévoles'!G$3:G$40,0))=TRUE,Q38+1,Q38))","v":4},"","","",{"$f":"IF(V39=\"\",U38,IF(ISNA(MATCH(V39,'Planning Bénévoles'!H$3:H$40,0))=TRUE,U38+1,U38))","v":2},"HELAC Adélie","","",{"$f":"IF(Z39=\"\",Y38,IF(ISNA(MATCH(Z39,'Planning Bénévoles'!I$3:I$40,0))=TRUE,Y38+1,Y38))","v":0},"","","",{"$f":"IF(AD39=\"\",AC38,IF(ISNA(MATCH(AD39,'Planning Bénévoles'!J$3:J$40,0))=TRUE,AC38+1,AC38))","v":2},"","","",{"$f":"IF(AH39=\"\",AG38,IF(ISNA(MATCH(AH39,'Planning Bénévoles'!K$3:K$40,0))=TRUE,AG38+1,AG38))","v":3},"HELAC Adélie","","",{"$f":"IF(AL39=\"\",AK38,IF(ISNA(MATCH(AL39,'Planning Bénévoles'!L$3:L$40,0))=TRUE,AK38+1,AK38))","v":5},"","","",{"$f":"IF(AP39=\"\",AO38,IF(ISNA(MATCH(AP39,'Planning Bénévoles'!M$3:M$40,0))=TRUE,AO38+1,AO38))","v":14},"","","",{"$f":"IF(AT39=\"\",AS38,IF(ISNA(MATCH(AT39,'Planning Bénévoles'!N$3:N$40,0))=TRUE,AS38+1,AS38))","v":13},"","","",{"$f":"IF(AX39=\"\",AW38,IF(ISNA(MATCH(AX39,'Planning Bénévoles'!O$3:O$40,0))=TRUE,AW38+1,AW38))","v":1},"","","",{"$f":"IF(BB39=\"\",BA38,IF(ISNA(MATCH(BB39,'Planning Bénévoles'!P$3:P$40,0))=TRUE,BA38+1,BA38))","v":16},"","TANGUY Bob",1,{"$f":"IF(BF39=\"\",BE38,IF(ISNA(MATCH(BF39,'Planning Bénévoles'!Q$3:Q$40,0))=TRUE,BE38+1,BE38))","v":11},"","","",{"$f":"IF(BJ39=\"\",BI38,IF(ISNA(MATCH(BJ39,'Planning Bénévoles'!R$3:R$40,0))=TRUE,BI38+1,BI38))","v":9},"","","",{"$f":"IF(BN39=\"\",BM38,IF(ISNA(MATCH(BN39,'Planning Bénévoles'!S$3:S$40,0))=TRUE,BM38+1,BM38))","v":16},"HELAC Adélie","TANGUY Bob",1,{"$f":"IF(BR39=\"\",BQ38,IF(ISNA(MATCH(BR39,'Planning Bénévoles'!T$3:T$40,0))=TRUE,BQ38+1,BQ38))","v":15},"","YANG Johanne",1]
[{"$f":"IF(B40=\"\",A39,IF(ISNA(MATCH(B40,'Planning Bénévoles'!C$3:C$40,0))=TRUE,A39+1,A39))","v":6},"JANOT (K) Laetitia","","",{"$f":"IF(F40=\"\",E39,IF(ISNA(MATCH(F40,'Planning Bénévoles'!D$3:D$40,0))=TRUE,E39+1,E39))","v":10},"JANOT (K) Laetitia","","",{"$f":"IF(J40=\"\",I39,IF(ISNA(MATCH(J40,'Planning Bénévoles'!E$3:E$40,0))=TRUE,I39+1,I39))","v":4},"","","",{"$f":"IF(N40=\"\",M39,IF(ISNA(MATCH(N40,'Planning Bénévoles'!F$3:F$40,0))=TRUE,M39+1,M39))","v":1},"JANOT (K) Laetitia","","",{"$f":"IF(R40=\"\",Q39,IF(ISNA(MATCH(R40,'Planning Bénévoles'!G$3:G$40,0))=TRUE,Q39+1,Q39))","v":4},"JANOT (K) Laetitia","","",{"$f":"IF(V40=\"\",U39,IF(ISNA(MATCH(V40,'Planning Bénévoles'!H$3:H$40,0))=TRUE,U39+1,U39))","v":2},"","","",{"$f":"IF(Z40=\"\",Y39,IF(ISNA(MATCH(Z40,'Planning Bénévoles'!I$3:I$40,0))=TRUE,Y39+1,Y39))","v":0},"","","",{"$f":"IF(AD40=\"\",AC39,IF(ISNA(MATCH(AD40,'Planning Bénévoles'!J$3:J$40,0))=TRUE,AC39+1,AC39))","v":2},"","","",{"$f":"IF(AH40=\"\",AG39,IF(ISNA(MATCH(AH40,'Planning Bénévoles'!K$3:K$40,0))=TRUE,AG39+1,AG39))","v":3},"","","",{"$f":"IF(AL40=\"\",AK39,IF(ISNA(MATCH(AL40,'Planning Bénévoles'!L$3:L$40,0))=TRUE,AK39+1,AK39))","v":6},"JANOT (K) Laetitia","","",{"$f":"IF(AP40=\"\",AO39,IF(ISNA(MATCH(AP40,'Planning Bénévoles'!M$3:M$40,0))=TRUE,AO39+1,AO39))","v":15},"JANOT (K) Laetitia","","",{"$f":"IF(AT40=\"\",AS39,IF(ISNA(MATCH(AT40,'Planning Bénévoles'!N$3:N$40,0))=TRUE,AS39+1,AS39))","v":13},"","","",{"$f":"IF(AX40=\"\",AW39,IF(ISNA(MATCH(AX40,'Planning Bénévoles'!O$3:O$40,0))=TRUE,AW39+1,AW39))","v":1},"JANOT (K) Laetitia","","",{"$f":"IF(BB40=\"\",BA39,IF(ISNA(MATCH(BB40,'Planning Bénévoles'!P$3:P$40,0))=TRUE,BA39+1,BA39))","v":17},"JANOT (K) Laetitia","TROBOE Marcel",1,{"$f":"IF(BF40=\"\",BE39,IF(ISNA(MATCH(BF40,'Planning Bénévoles'!Q$3:Q$40,0))=TRUE,BE39+1,BE39))","v":11},"","","",{"$f":"IF(BJ40=\"\",BI39,IF(ISNA(MATCH(BJ40,'Planning Bénévoles'!R$3:R$40,0))=TRUE,BI39+1,BI39))","v":9},"","","",{"$f":"IF(BN40=\"\",BM39,IF(ISNA(MATCH(BN40,'Planning Bénévoles'!S$3:S$40,0))=TRUE,BM39+1,BM39))","v":16},"","TROBOE Marcel",1,{"$f":"IF(BR40=\"\",BQ39,IF(ISNA(MATCH(BR40,'Planning Bénévoles'!T$3:T$40,0))=TRUE,BQ39+1,BQ39))","v":15},"","",""]
[{"$f":"IF(B41=\"\",A40,IF(ISNA(MATCH(B41,'Planning Bénévoles'!C$3:C$40,0))=TRUE,A40+1,A40))","v":6},"","","",{"$f":"IF(F41=\"\",E40,IF(ISNA(MATCH(F41,'Planning Bénévoles'!D$3:D$40,0))=TRUE,E40+1,E40))","v":10},"","","",{"$f":"IF(J41=\"\",I40,IF(ISNA(MATCH(J41,'Planning Bénévoles'!E$3:E$40,0))=TRUE,I40+1,I40))","v":4},"","","",{"$f":"IF(N41=\"\",M40,IF(ISNA(MATCH(N41,'Planning Bénévoles'!F$3:F$40,0))=TRUE,M40+1,M40))","v":1},"","","",{"$f":"IF(R41=\"\",Q40,IF(ISNA(MATCH(R41,'Planning Bénévoles'!G$3:G$40,0))=TRUE,Q40+1,Q40))","v":4},"KERLEO Anne Marie","","",{"$f":"IF(V41=\"\",U40,IF(ISNA(MATCH(V41,'Planning Bénévoles'!H$3:H$40,0))=TRUE,U40+1,U40))","v":2},"","","",{"$f":"IF(Z41=\"\",Y40,IF(ISNA(MATCH(Z41,'Planning Bénévoles'!I$3:I$40,0))=TRUE,Y40+1,Y40))","v":0},"","","",{"$f":"IF(AD41=\"\",AC40,IF(ISNA(MATCH(AD41,'Planning Bénévoles'!J$3:J$40,0))=TRUE,AC40+1,AC40))","v":2},"","","",{"$f":"IF(AH41=\"\",AG40,IF(ISNA(MATCH(AH41,'Planning Bénévoles'!K$3:K$40,0))=TRUE,AG40+1,AG40))","v":3},"","","",{"$f":"IF(AL41=\"\",AK40,IF(ISNA(MATCH(AL41,'Planning Bénévoles'!L$3:L$40,0))=TRUE,AK40+1,AK40))","v":6},"","","",{"$f":"IF(AP41=\"\",AO40,IF(ISNA(MATCH(AP41,'Planning Bénévoles'!M$3:M$40,0))=TRUE,AO40+1,AO40))","v":15},"KERLEO Anne Marie","","",{"$f":"IF(AT41=\"\",AS40,IF(ISNA(MATCH(AT41,'Planning Bénévoles'!N$3:N$40,0))=TRUE,AS40+1,AS40))","v":13},"","","",{"$f":"IF(AX41=\"\",AW40,IF(ISNA(MATCH(AX41,'Planning Bénévoles'!O$3:O$40,0))=TRUE,AW40+1,AW40))","v":1},"","","",{"$f":"IF(BB41=\"\",BA40,IF(ISNA(MATCH(BB41,'Planning Bénévoles'!P$3:P$40,0))=TRUE,BA40+1,BA40))","v":18},"KERLEO Anne Marie","","",{"$f":"IF(BF41=\"\",BE40,IF(ISNA(MATCH(BF41,'Planning Bénévoles'!Q$3:Q$40,0))=TRUE,BE40+1,BE40))","v":11},"","","",{"$f":"IF(BJ41=\"\",BI40,IF(ISNA(MATCH(BJ41,'Planning Bénévoles'!R$3:R$40,0))=TRUE,BI40+1,BI40))","v":9},"","","",{"$f":"IF(BN41=\"\",BM40,IF(ISNA(MATCH(BN41,'Planning Bénévoles'!S$3:S$40,0))=TRUE,BM40+1,BM40))","v":17},"KERLEO Anne Marie","WOJCIK Eulalie",1,{"$f":"IF(BR41=\"\",BQ40,IF(ISNA(MATCH(BR41,'Planning Bénévoles'!T$3:T$40,0))=TRUE,BQ40+1,BQ40))","v":15},"","",""]
[{"$f":"IF(B42=\"\",A41,IF(ISNA(MATCH(B42,'Planning Bénévoles'!C$3:C$40,0))=TRUE,A41+1,A41))","v":6},"","","",{"$f":"IF(F42=\"\",E41,IF(ISNA(MATCH(F42,'Planning Bénévoles'!D$3:D$40,0))=TRUE,E41+1,E41))","v":10},"","","",{"$f":"IF(J42=\"\",I41,IF(ISNA(MATCH(J42,'Planning Bénévoles'!E$3:E$40,0))=TRUE,I41+1,I41))","v":4},"","","",{"$f":"IF(N42=\"\",M41,IF(ISNA(MATCH(N42,'Planning Bénévoles'!F$3:F$40,0))=TRUE,M41+1,M41))","v":1},"","","",{"$f":"IF(R42=\"\",Q41,IF(ISNA(MATCH(R42,'Planning Bénévoles'!G$3:G$40,0))=TRUE,Q41+1,Q41))","v":4},"","","",{"$f":"IF(V42=\"\",U41,IF(ISNA(MATCH(V42,'Planning Bénévoles'!H$3:H$40,0))=TRUE,U41+1,U41))","v":2},"","","",{"$f":"IF(Z42=\"\",Y41,IF(ISNA(MATCH(Z42,'Planning Bénévoles'!I$3:I$40,0))=TRUE,Y41+1,Y41))","v":0},"","","",{"$f":"IF(AD42=\"\",AC41,IF(ISNA(MATCH(AD42,'Planning Bénévoles'!J$3:J$40,0))=TRUE,AC41+1,AC41))","v":2},"","","",{"$f":"IF(AH42=\"\",AG41,IF(ISNA(MATCH(AH42,'Planning Bénévoles'!K$3:K$40,0))=TRUE,AG41+1,AG41))","v":3},"","","",{"$f":"IF(AL42=\"\",AK41,IF(ISNA(MATCH(AL42,'Planning Bénévoles'!L$3:L$40,0))=TRUE,AK41+1,AK41))","v":6},"KERVELLA (K) Virginie","","",{"$f":"IF(AP42=\"\",AO41,IF(ISNA(MATCH(AP42,'Planning Bénévoles'!M$3:M$40,0))=TRUE,AO41+1,AO41))","v":16},"KERVELLA (K) Virginie","","",{"$f":"IF(AT42=\"\",AS41,IF(ISNA(MATCH(AT42,'Planning Bénévoles'!N$3:N$40,0))=TRUE,AS41+1,AS41))","v":13},"","","",{"$f":"IF(AX42=\"\",AW41,IF(ISNA(MATCH(AX42,'Planning Bénévoles'!O$3:O$40,0))=TRUE,AW41+1,AW41))","v":1},"KERVELLA (K) Virginie","","",{"$f":"IF(BB42=\"\",BA41,IF(ISNA(MATCH(BB42,'Planning Bénévoles'!P$3:P$40,0))=TRUE,BA41+1,BA41))","v":19},"KERVELLA (K) Virginie","","",{"$f":"IF(BF42=\"\",BE41,IF(ISNA(MATCH(BF42,'Planning Bénévoles'!Q$3:Q$40,0))=TRUE,BE41+1,BE41))","v":11},"","","",{"$f":"IF(BJ42=\"\",BI41,IF(ISNA(MATCH(BJ42,'Planning Bénévoles'!R$3:R$40,0))=TRUE,BI41+1,BI41))","v":9},"","","",{"$f":"IF(BN42=\"\",BM41,IF(ISNA(MATCH(BN42,'Planning Bénévoles'!S$3:S$40,0))=TRUE,BM41+1,BM41))","v":17},"","YANG Johanne",1,{"$f":"IF(BR42=\"\",BQ41,IF(ISNA(MATCH(BR42,'Planning Bénévoles'!T$3:T$40,0))=TRUE,BQ41+1,BQ41))","v":15},"","",""]
[{"$f":"IF(B43=\"\",A42,IF(ISNA(MATCH(B43,'Planning Bénévoles'!C$3:C$40,0))=TRUE,A42+1,A42))","v":6},"LANDOUARD Frédéric","","",{"$f":"IF(F43=\"\",E42,IF(ISNA(MATCH(F43,'Planning Bénévoles'!D$3:D$40,0))=TRUE,E42+1,E42))","v":10},"LANDOUARD Frédéric","","",{"$f":"IF(J43=\"\",I42,IF(ISNA(MATCH(J43,'Planning Bénévoles'!E$3:E$40,0))=TRUE,I42+1,I42))","v":4},"LANDOUARD Frédéric","","",{"$f":"IF(N43=\"\",M42,IF(ISNA(MATCH(N43,'Planning Bénévoles'!F$3:F$40,0))=TRUE,M42+1,M42))","v":1},"LANDOUARD Frédéric","","",{"$f":"IF(R43=\"\",Q42,IF(ISNA(MATCH(R43,'Planning Bénévoles'!G$3:G$40,0))=TRUE,Q42+1,Q42))","v":4},"LANDOUARD Frédéric","","",{"$f":"IF(V43=\"\",U42,IF(ISNA(MATCH(V43,'Planning Bénévoles'!H$3:H$40,0))=TRUE,U42+1,U42))","v":2},"LANDOUARD Frédéric","","",{"$f":"IF(Z43=\"\",Y42,IF(ISNA(MATCH(Z43,'Planning Bénévoles'!I$3:I$40,0))=TRUE,Y42+1,Y42))","v":0},"LANDOUARD Frédéric","","",{"$f":"IF(AD43=\"\",AC42,IF(ISNA(MATCH(AD43,'Planning Bénévoles'!J$3:J$40,0))=TRUE,AC42+1,AC42))","v":2},"LANDOUARD Frédéric","","",{"$f":"IF(AH43=\"\",AG42,IF(ISNA(MATCH(AH43,'Planning Bénévoles'!K$3:K$40,0))=TRUE,AG42+1,AG42))","v":4},"LANDOUARD Frédéric","","",{"$f":"IF(AL43=\"\",AK42,IF(ISNA(MATCH(AL43,'Planning Bénévoles'!L$3:L$40,0))=TRUE,AK42+1,AK42))","v":6},"LANDOUARD Frédéric","","",{"$f":"IF(AP43=\"\",AO42,IF(ISNA(MATCH(AP43,'Planning Bénévoles'!M$3:M$40,0))=TRUE,AO42+1,AO42))","v":17},"LANDOUARD Frédéric","","",{"$f":"IF(AT43=\"\",AS42,IF(ISNA(MATCH(AT43,'Planning Bénévoles'!N$3:N$40,0))=TRUE,AS42+1,AS42))","v":14},"LANDOUARD Frédéric","","",{"$f":"IF(AX43=\"\",AW42,IF(ISNA(MATCH(AX43,'Planning Bénévoles'!O$3:O$40,0))=TRUE,AW42+1,AW42))","v":1},"LANDOUARD Frédéric","","",{"$f":"IF(BB43=\"\",BA42,IF(ISNA(MATCH(BB43,'Planning Bénévoles'!P$3:P$40,0))=TRUE,BA42+1,BA42))","v":20},"LANDOUARD Frédéric","","",{"$f":"IF(BF43=\"\",BE42,IF(ISNA(MATCH(BF43,'Planning Bénévoles'!Q$3:Q$40,0))=TRUE,BE42+1,BE42))","v":12},"LANDOUARD Frédéric","","",{"$f":"IF(BJ43=\"\",BI42,IF(ISNA(MATCH(BJ43,'Planning Bénévoles'!R$3:R$40,0))=TRUE,BI42+1,BI42))","v":10},"LANDOUARD Frédéric","","",{"$f":"IF(BN43=\"\",BM42,IF(ISNA(MATCH(BN43,'Planning Bénévoles'!S$3:S$40,0))=TRUE,BM42+1,BM42))","v":18},"LANDOUARD Frédéric","","",{"$f":"IF(BR43=\"\",BQ42,IF(ISNA(MATCH(BR43,'Planning Bénévoles'!T$3:T$40,0))=TRUE,BQ42+1,BQ42))","v":16},"LANDOUARD Frédéric","",""]
[{"$f":"IF(B44=\"\",A43,IF(ISNA(MATCH(B44,'Planning Bénévoles'!C$3:C$40,0))=TRUE,A43+1,A43))","v":6},"LE BIHAN Guy","","",{"$f":"IF(F44=\"\",E43,IF(ISNA(MATCH(F44,'Planning Bénévoles'!D$3:D$40,0))=TRUE,E43+1,E43))","v":10},"","","",{"$f":"IF(J44=\"\",I43,IF(ISNA(MATCH(J44,'Planning Bénévoles'!E$3:E$40,0))=TRUE,I43+1,I43))","v":4},"","","",{"$f":"IF(N44=\"\",M43,IF(ISNA(MATCH(N44,'Planning Bénévoles'!F$3:F$40,0))=TRUE,M43+1,M43))","v":1},"","","",{"$f":"IF(R44=\"\",Q43,IF(ISNA(MATCH(R44,'Planning Bénévoles'!G$3:G$40,0))=TRUE,Q43+1,Q43))","v":4},"LE BIHAN Guy","","",{"$f":"IF(V44=\"\",U43,IF(ISNA(MATCH(V44,'Planning Bénévoles'!H$3:H$40,0))=TRUE,U43+1,U43))","v":2},"LE BIHAN Guy","","",{"$f":"IF(Z44=\"\",Y43,IF(ISNA(MATCH(Z44,'Planning Bénévoles'!I$3:I$40,0))=TRUE,Y43+1,Y43))","v":0},"LE BIHAN Guy","","",{"$f":"IF(AD44=\"\",AC43,IF(ISNA(MATCH(AD44,'Planning Bénévoles'!J$3:J$40,0))=TRUE,AC43+1,AC43))","v":2},"","","",{"$f":"IF(AH44=\"\",AG43,IF(ISNA(MATCH(AH44,'Planning Bénévoles'!K$3:K$40,0))=TRUE,AG43+1,AG43))","v":4},"LE BIHAN Guy","","",{"$f":"IF(AL44=\"\",AK43,IF(ISNA(MATCH(AL44,'Planning Bénévoles'!L$3:L$40,0))=TRUE,AK43+1,AK43))","v":6},"","","",{"$f":"IF(AP44=\"\",AO43,IF(ISNA(MATCH(AP44,'Planning Bénévoles'!M$3:M$40,0))=TRUE,AO43+1,AO43))","v":17},"LE BIHAN Guy","","",{"$f":"IF(AT44=\"\",AS43,IF(ISNA(MATCH(AT44,'Planning Bénévoles'!N$3:N$40,0))=TRUE,AS43+1,AS43))","v":15},"LE BIHAN Guy","","",{"$f":"IF(AX44=\"\",AW43,IF(ISNA(MATCH(AX44,'Planning Bénévoles'!O$3:O$40,0))=TRUE,AW43+1,AW43))","v":1},"","","",{"$f":"IF(BB44=\"\",BA43,IF(ISNA(MATCH(BB44,'Planning Bénévoles'!P$3:P$40,0))=TRUE,BA43+1,BA43))","v":20},"","","",{"$f":"IF(BF44=\"\",BE43,IF(ISNA(MATCH(BF44,'Planning Bénévoles'!Q$3:Q$40,0))=TRUE,BE43+1,BE43))","v":13},"LE BIHAN Guy","","",{"$f":"IF(BJ44=\"\",BI43,IF(ISNA(MATCH(BJ44,'Planning Bénévoles'!R$3:R$40,0))=TRUE,BI43+1,BI43))","v":10},"","","",{"$f":"IF(BN44=\"\",BM43,IF(ISNA(MATCH(BN44,'Planning Bénévoles'!S$3:S$40,0))=TRUE,BM43+1,BM43))","v":18},"","","",{"$f":"IF(BR44=\"\",BQ43,IF(ISNA(MATCH(BR44,'Planning Bénévoles'!T$3:T$40,0))=TRUE,BQ43+1,BQ43))","v":16},"","",""]
[{"$f":"IF(B45=\"\",A44,IF(ISNA(MATCH(B45,'Planning Bénévoles'!C$3:C$40,0))=TRUE,A44+1,A44))","v":6},"","","",{"$f":"IF(F45=\"\",E44,IF(ISNA(MATCH(F45,'Planning Bénévoles'!D$3:D$40,0))=TRUE,E44+1,E44))","v":11},"LE BOSSER Jean René","","",{"$f":"IF(J45=\"\",I44,IF(ISNA(MATCH(J45,'Planning Bénévoles'!E$3:E$40,0))=TRUE,I44+1,I44))","v":4},"","","",{"$f":"IF(N45=\"\",M44,IF(ISNA(MATCH(N45,'Planning Bénévoles'!F$3:F$40,0))=TRUE,M44+1,M44))","v":1},"","","",{"$f":"IF(R45=\"\",Q44,IF(ISNA(MATCH(R45,'Planning Bénévoles'!G$3:G$40,0))=TRUE,Q44+1,Q44))","v":4},"","","",{"$f":"IF(V45=\"\",U44,IF(ISNA(MATCH(V45,'Planning Bénévoles'!H$3:H$40,0))=TRUE,U44+1,U44))","v":2},"","","",{"$f":"IF(Z45=\"\",Y44,IF(ISNA(MATCH(Z45,'Planning Bénévoles'!I$3:I$40,0))=TRUE,Y44+1,Y44))","v":0},"","","",{"$f":"IF(AD45=\"\",AC44,IF(ISNA(MATCH(AD45,'Planning Bénévoles'!J$3:J$40,0))=TRUE,AC44+1,AC44))","v":2},"LE BOSSER Jean René","","",{"$f":"IF(AH45=\"\",AG44,IF(ISNA(MATCH(AH45,'Planning Bénévoles'!K$3:K$40,0))=TRUE,AG44+1,AG44))","v":4},"","","",{"$f":"IF(AL45=\"\",AK44,IF(ISNA(MATCH(AL45,'Planning Bénévoles'!L$3:L$40,0))=TRUE,AK44+1,AK44))","v":6},"","","",{"$f":"IF(AP45=\"\",AO44,IF(ISNA(MATCH(AP45,'Planning Bénévoles'!M$3:M$40,0))=TRUE,AO44+1,AO44))","v":17},"","","",{"$f":"IF(AT45=\"\",AS44,IF(ISNA(MATCH(AT45,'Planning Bénévoles'!N$3:N$40,0))=TRUE,AS44+1,AS44))","v":16},"LE BOSSER Jean René","","",{"$f":"IF(AX45=\"\",AW44,IF(ISNA(MATCH(AX45,'Planning Bénévoles'!O$3:O$40,0))=TRUE,AW44+1,AW44))","v":1},"","","",{"$f":"IF(BB45=\"\",BA44,IF(ISNA(MATCH(BB45,'Planning Bénévoles'!P$3:P$40,0))=TRUE,BA44+1,BA44))","v":21},"LE BOSSER Jean René","","",{"$f":"IF(BF45=\"\",BE44,IF(ISNA(MATCH(BF45,'Planning Bénévoles'!Q$3:Q$40,0))=TRUE,BE44+1,BE44))","v":13},"","","",{"$f":"IF(BJ45=\"\",BI44,IF(ISNA(MATCH(BJ45,'Planning Bénévoles'!R$3:R$40,0))=TRUE,BI44+1,BI44))","v":10},"","","",{"$f":"IF(BN45=\"\",BM44,IF(ISNA(MATCH(BN45,'Planning Bénévoles'!S$3:S$40,0))=TRUE,BM44+1,BM44))","v":19},"LE BOSSER Jean René","","",{"$f":"IF(BR45=\"\",BQ44,IF(ISNA(MATCH(BR45,'Planning Bénévoles'!T$3:T$40,0))=TRUE,BQ44+1,BQ44))","v":17},"LE BOSSER Jean René","",""]
[{"$f":"IF(B46=\"\",A45,IF(ISNA(MATCH(B46,'Planning Bénévoles'!C$3:C$40,0))=TRUE,A45+1,A45))","v":6},"","","",{"$f":"IF(F46=\"\",E45,IF(ISNA(MATCH(F46,'Planning Bénévoles'!D$3:D$40,0))=TRUE,E45+1,E45))","v":12},"LE BOSSER Liliane","","",{"$f":"IF(J46=\"\",I45,IF(ISNA(MATCH(J46,'Planning Bénévoles'!E$3:E$40,0))=TRUE,I45+1,I45))","v":4},"","","",{"$f":"IF(N46=\"\",M45,IF(ISNA(MATCH(N46,'Planning Bénévoles'!F$3:F$40,0))=TRUE,M45+1,M45))","v":1},"","","",{"$f":"IF(R46=\"\",Q45,IF(ISNA(MATCH(R46,'Planning Bénévoles'!G$3:G$40,0))=TRUE,Q45+1,Q45))","v":4},"","","",{"$f":"IF(V46=\"\",U45,IF(ISNA(MATCH(V46,'Planning Bénévoles'!H$3:H$40,0))=TRUE,U45+1,U45))","v":2},"","","",{"$f":"IF(Z46=\"\",Y45,IF(ISNA(MATCH(Z46,'Planning Bénévoles'!I$3:I$40,0))=TRUE,Y45+1,Y45))","v":0},"","","",{"$f":"IF(AD46=\"\",AC45,IF(ISNA(MATCH(AD46,'Planning Bénévoles'!J$3:J$40,0))=TRUE,AC45+1,AC45))","v":2},"LE BOSSER Liliane","","",{"$f":"IF(AH46=\"\",AG45,IF(ISNA(MATCH(AH46,'Planning Bénévoles'!K$3:K$40,0))=TRUE,AG45+1,AG45))","v":4},"","","",{"$f":"IF(AL46=\"\",AK45,IF(ISNA(MATCH(AL46,'Planning Bénévoles'!L$3:L$40,0))=TRUE,AK45+1,AK45))","v":6},"","","",{"$f":"IF(AP46=\"\",AO45,IF(ISNA(MATCH(AP46,'Planning Bénévoles'!M$3:M$40,0))=TRUE,AO45+1,AO45))","v":17},"","","",{"$f":"IF(AT46=\"\",AS45,IF(ISNA(MATCH(AT46,'Planning Bénévoles'!N$3:N$40,0))=TRUE,AS45+1,AS45))","v":17},"LE BOSSER Liliane","","",{"$f":"IF(AX46=\"\",AW45,IF(ISNA(MATCH(AX46,'Planning Bénévoles'!O$3:O$40,0))=TRUE,AW45+1,AW45))","v":1},"","","",{"$f":"IF(BB46=\"\",BA45,IF(ISNA(MATCH(BB46,'Planning Bénévoles'!P$3:P$40,0))=TRUE,BA45+1,BA45))","v":22},"LE BOSSER Liliane","","",{"$f":"IF(BF46=\"\",BE45,IF(ISNA(MATCH(BF46,'Planning Bénévoles'!Q$3:Q$40,0))=TRUE,BE45+1,BE45))","v":13},"","","",{"$f":"IF(BJ46=\"\",BI45,IF(ISNA(MATCH(BJ46,'Planning Bénévoles'!R$3:R$40,0))=TRUE,BI45+1,BI45))","v":10},"","","",{"$f":"IF(BN46=\"\",BM45,IF(ISNA(MATCH(BN46,'Planning Bénévoles'!S$3:S$40,0))=TRUE,BM45+1,BM45))","v":20},"LE BOSSER Liliane","","",{"$f":"IF(BR46=\"\",BQ45,IF(ISNA(MATCH(BR46,'Planning Bénévoles'!T$3:T$40,0))=TRUE,BQ45+1,BQ45))","v":18},"LE BOSSER Liliane","",""]
[{"$f":"IF(B47=\"\",A46,IF(ISNA(MATCH(B47,'Planning Bénévoles'!C$3:C$40,0))=TRUE,A46+1,A46))","v":6},"LE CORRE  Jérémy","","",{"$f":"IF(F47=\"\",E46,IF(ISNA(MATCH(F47,'Planning Bénévoles'!D$3:D$40,0))=TRUE,E46+1,E46))","v":12},"LE CORRE  Jérémy","","",{"$f":"IF(J47=\"\",I46,IF(ISNA(MATCH(J47,'Planning Bénévoles'!E$3:E$40,0))=TRUE,I46+1,I46))","v":4},"LE CORRE  Jérémy","","",{"$f":"IF(N47=\"\",M46,IF(ISNA(MATCH(N47,'Planning Bénévoles'!F$3:F$40,0))=TRUE,M46+1,M46))","v":1},"LE CORRE  Jérémy","","",{"$f":"IF(R47=\"\",Q46,IF(ISNA(MATCH(R47,'Planning Bénévoles'!G$3:G$40,0))=TRUE,Q46+1,Q46))","v":4},"LE CORRE  Jérémy","","",{"$f":"IF(V47=\"\",U46,IF(ISNA(MATCH(V47,'Planning Bénévoles'!H$3:H$40,0))=TRUE,U46+1,U46))","v":2},"LE CORRE  Jérémy","","",{"$f":"IF(Z47=\"\",Y46,IF(ISNA(MATCH(Z47,'Planning Bénévoles'!I$3:I$40,0))=TRUE,Y46+1,Y46))","v":1},"LE CORRE  Jérémy","","",{"$f":"IF(AD47=\"\",AC46,IF(ISNA(MATCH(AD47,'Planning Bénévoles'!J$3:J$40,0))=TRUE,AC46+1,AC46))","v":2},"LE CORRE  Jérémy","","",{"$f":"IF(AH47=\"\",AG46,IF(ISNA(MATCH(AH47,'Planning Bénévoles'!K$3:K$40,0))=TRUE,AG46+1,AG46))","v":4},"LE CORRE  Jérémy","","",{"$f":"IF(AL47=\"\",AK46,IF(ISNA(MATCH(AL47,'Planning Bénévoles'!L$3:L$40,0))=TRUE,AK46+1,AK46))","v":6},"LE CORRE  Jérémy","","",{"$f":"IF(AP47=\"\",AO46,IF(ISNA(MATCH(AP47,'Planning Bénévoles'!M$3:M$40,0))=TRUE,AO46+1,AO46))","v":18},"LE CORRE  Jérémy","","",{"$f":"IF(AT47=\"\",AS46,IF(ISNA(MATCH(AT47,'Planning Bénévoles'!N$3:N$40,0))=TRUE,AS46+1,AS46))","v":17},"LE CORRE  Jérémy","","",{"$f":"IF(AX47=\"\",AW46,IF(ISNA(MATCH(AX47,'Planning Bénévoles'!O$3:O$40,0))=TRUE,AW46+1,AW46))","v":2},"LE CORRE  Jérémy","","",{"$f":"IF(BB47=\"\",BA46,IF(ISNA(MATCH(BB47,'Planning Bénévoles'!P$3:P$40,0))=TRUE,BA46+1,BA46))","v":23},"LE CORRE  Jérémy","","",{"$f":"IF(BF47=\"\",BE46,IF(ISNA(MATCH(BF47,'Planning Bénévoles'!Q$3:Q$40,0))=TRUE,BE46+1,BE46))","v":14},"LE CORRE  Jérémy","","",{"$f":"IF(BJ47=\"\",BI46,IF(ISNA(MATCH(BJ47,'Planning Bénévoles'!R$3:R$40,0))=TRUE,BI46+1,BI46))","v":11},"LE CORRE  Jérémy","","",{"$f":"IF(BN47=\"\",BM46,IF(ISNA(MATCH(BN47,'Planning Bénévoles'!S$3:S$40,0))=TRUE,BM46+1,BM46))","v":21},"LE CORRE  Jérémy","","",{"$f":"IF(BR47=\"\",BQ46,IF(ISNA(MATCH(BR47,'Planning Bénévoles'!T$3:T$40,0))=TRUE,BQ46+1,BQ46))","v":19},"LE CORRE  Jérémy","",""]
[{"$f":"IF(B48=\"\",A47,IF(ISNA(MATCH(B48,'Planning Bénévoles'!C$3:C$40,0))=TRUE,A47+1,A47))","v":7},"LE GALL Yves","","",{"$f":"IF(F48=\"\",E47,IF(ISNA(MATCH(F48,'Planning Bénévoles'!D$3:D$40,0))=TRUE,E47+1,E47))","v":13},"LE GALL Yves","","",{"$f":"IF(J48=\"\",I47,IF(ISNA(MATCH(J48,'Planning Bénévoles'!E$3:E$40,0))=TRUE,I47+1,I47))","v":4},"","","",{"$f":"IF(N48=\"\",M47,IF(ISNA(MATCH(N48,'Planning Bénévoles'!F$3:F$40,0))=TRUE,M47+1,M47))","v":2},"LE GALL Yves","","",{"$f":"IF(R48=\"\",Q47,IF(ISNA(MATCH(R48,'Planning Bénévoles'!G$3:G$40,0))=TRUE,Q47+1,Q47))","v":5},"LE GALL Yves","","",{"$f":"IF(V48=\"\",U47,IF(ISNA(MATCH(V48,'Planning Bénévoles'!H$3:H$40,0))=TRUE,U47+1,U47))","v":2},"","","",{"$f":"IF(Z48=\"\",Y47,IF(ISNA(MATCH(Z48,'Planning Bénévoles'!I$3:I$40,0))=TRUE,Y47+1,Y47))","v":2},"LE GALL Yves","","",{"$f":"IF(AD48=\"\",AC47,IF(ISNA(MATCH(AD48,'Planning Bénévoles'!J$3:J$40,0))=TRUE,AC47+1,AC47))","v":2},"LE GALL Yves","","",{"$f":"IF(AH48=\"\",AG47,IF(ISNA(MATCH(AH48,'Planning Bénévoles'!K$3:K$40,0))=TRUE,AG47+1,AG47))","v":4},"","","",{"$f":"IF(AL48=\"\",AK47,IF(ISNA(MATCH(AL48,'Planning Bénévoles'!L$3:L$40,0))=TRUE,AK47+1,AK47))","v":6},"","","",{"$f":"IF(AP48=\"\",AO47,IF(ISNA(MATCH(AP48,'Planning Bénévoles'!M$3:M$40,0))=TRUE,AO47+1,AO47))","v":18},"","","",{"$f":"IF(AT48=\"\",AS47,IF(ISNA(MATCH(AT48,'Planning Bénévoles'!N$3:N$40,0))=TRUE,AS47+1,AS47))","v":17},"","","",{"$f":"IF(AX48=\"\",AW47,IF(ISNA(MATCH(AX48,'Planning Bénévoles'!O$3:O$40,0))=TRUE,AW47+1,AW47))","v":2},"LE GALL Yves","","",{"$f":"IF(BB48=\"\",BA47,IF(ISNA(MATCH(BB48,'Planning Bénévoles'!P$3:P$40,0))=TRUE,BA47+1,BA47))","v":24},"LE GALL Yves","","",{"$f":"IF(BF48=\"\",BE47,IF(ISNA(MATCH(BF48,'Planning Bénévoles'!Q$3:Q$40,0))=TRUE,BE47+1,BE47))","v":14},"","","",{"$f":"IF(BJ48=\"\",BI47,IF(ISNA(MATCH(BJ48,'Planning Bénévoles'!R$3:R$40,0))=TRUE,BI47+1,BI47))","v":12},"LE GALL Yves","","",{"$f":"IF(BN48=\"\",BM47,IF(ISNA(MATCH(BN48,'Planning Bénévoles'!S$3:S$40,0))=TRUE,BM47+1,BM47))","v":22},"LE GALL Yves","","",{"$f":"IF(BR48=\"\",BQ47,IF(ISNA(MATCH(BR48,'Planning Bénévoles'!T$3:T$40,0))=TRUE,BQ47+1,BQ47))","v":20},"LE GALL Yves","",""]
[{"$f":"IF(B49=\"\",A48,IF(ISNA(MATCH(B49,'Planning Bénévoles'!C$3:C$40,0))=TRUE,A48+1,A48))","v":7},"LE ROUX Stéphanie","","",{"$f":"IF(F49=\"\",E48,IF(ISNA(MATCH(F49,'Planning Bénévoles'!D$3:D$40,0))=TRUE,E48+1,E48))","v":13},"","","",{"$f":"IF(J49=\"\",I48,IF(ISNA(MATCH(J49,'Planning Bénévoles'!E$3:E$40,0))=TRUE,I48+1,I48))","v":4},"","","",{"$f":"IF(N49=\"\",M48,IF(ISNA(MATCH(N49,'Planning Bénévoles'!F$3:F$40,0))=TRUE,M48+1,M48))","v":2},"","","",{"$f":"IF(R49=\"\",Q48,IF(ISNA(MATCH(R49,'Planning Bénévoles'!G$3:G$40,0))=TRUE,Q48+1,Q48))","v":5},"LE ROUX Stéphanie","","",{"$f":"IF(V49=\"\",U48,IF(ISNA(MATCH(V49,'Planning Bénévoles'!H$3:H$40,0))=TRUE,U48+1,U48))","v":2},"LE ROUX Stéphanie","","",{"$f":"IF(Z49=\"\",Y48,IF(ISNA(MATCH(Z49,'Planning Bénévoles'!I$3:I$40,0))=TRUE,Y48+1,Y48))","v":2},"","","",{"$f":"IF(AD49=\"\",AC48,IF(ISNA(MATCH(AD49,'Planning Bénévoles'!J$3:J$40,0))=TRUE,AC48+1,AC48))","v":2},"","","",{"$f":"IF(AH49=\"\",AG48,IF(ISNA(MATCH(AH49,'Planning Bénévoles'!K$3:K$40,0))=TRUE,AG48+1,AG48))","v":4},"","","",{"$f":"IF(AL49=\"\",AK48,IF(ISNA(MATCH(AL49,'Planning Bénévoles'!L$3:L$40,0))=TRUE,AK48+1,AK48))","v":6},"","","",{"$f":"IF(AP49=\"\",AO48,IF(ISNA(MATCH(AP49,'Planning Bénévoles'!M$3:M$40,0))=TRUE,AO48+1,AO48))","v":18},"","","",{"$f":"IF(AT49=\"\",AS48,IF(ISNA(MATCH(AT49,'Planning Bénévoles'!N$3:N$40,0))=TRUE,AS48+1,AS48))","v":17},"","","",{"$f":"IF(AX49=\"\",AW48,IF(ISNA(MATCH(AX49,'Planning Bénévoles'!O$3:O$40,0))=TRUE,AW48+1,AW48))","v":2},"","","",{"$f":"IF(BB49=\"\",BA48,IF(ISNA(MATCH(BB49,'Planning Bénévoles'!P$3:P$40,0))=TRUE,BA48+1,BA48))","v":25},"LE ROUX Stéphanie","","",{"$f":"IF(BF49=\"\",BE48,IF(ISNA(MATCH(BF49,'Planning Bénévoles'!Q$3:Q$40,0))=TRUE,BE48+1,BE48))","v":15},"LE ROUX Stéphanie","","",{"$f":"IF(BJ49=\"\",BI48,IF(ISNA(MATCH(BJ49,'Planning Bénévoles'!R$3:R$40,0))=TRUE,BI48+1,BI48))","v":12},"","","",{"$f":"IF(BN49=\"\",BM48,IF(ISNA(MATCH(BN49,'Planning Bénévoles'!S$3:S$40,0))=TRUE,BM48+1,BM48))","v":22},"","","",{"$f":"IF(BR49=\"\",BQ48,IF(ISNA(MATCH(BR49,'Planning Bénévoles'!T$3:T$40,0))=TRUE,BQ48+1,BQ48))","v":20},"","",""]
[{"$f":"IF(B50=\"\",A49,IF(ISNA(MATCH(B50,'Planning Bénévoles'!C$3:C$40,0))=TRUE,A49+1,A49))","v":7},"","","",{"$f":"IF(F50=\"\",E49,IF(ISNA(MATCH(F50,'Planning Bénévoles'!D$3:D$40,0))=TRUE,E49+1,E49))","v":13},"LE ROY  Julian","","",{"$f":"IF(J50=\"\",I49,IF(ISNA(MATCH(J50,'Planning Bénévoles'!E$3:E$40,0))=TRUE,I49+1,I49))","v":4},"LE ROY  Julian","","",{"$f":"IF(N50=\"\",M49,IF(ISNA(MATCH(N50,'Planning Bénévoles'!F$3:F$40,0))=TRUE,M49+1,M49))","v":2},"","","",{"$f":"IF(R50=\"\",Q49,IF(ISNA(MATCH(R50,'Planning Bénévoles'!G$3:G$40,0))=TRUE,Q49+1,Q49))","v":5},"LE ROY  Julian","","",{"$f":"IF(V50=\"\",U49,IF(ISNA(MATCH(V50,'Planning Bénévoles'!H$3:H$40,0))=TRUE,U49+1,U49))","v":2},"LE ROY  Julian","","",{"$f":"IF(Z50=\"\",Y49,IF(ISNA(MATCH(Z50,'Planning Bénévoles'!I$3:I$40,0))=TRUE,Y49+1,Y49))","v":2},"","","",{"$f":"IF(AD50=\"\",AC49,IF(ISNA(MATCH(AD50,'Planning Bénévoles'!J$3:J$40,0))=TRUE,AC49+1,AC49))","v":2},"LE ROY  Julian","","",{"$f":"IF(AH50=\"\",AG49,IF(ISNA(MATCH(AH50,'Planning Bénévoles'!K$3:K$40,0))=TRUE,AG49+1,AG49))","v":4},"LE ROY  Julian","","",{"$f":"IF(AL50=\"\",AK49,IF(ISNA(MATCH(AL50,'Planning Bénévoles'!L$3:L$40,0))=TRUE,AK49+1,AK49))","v":6},"","","",{"$f":"IF(AP50=\"\",AO49,IF(ISNA(MATCH(AP50,'Planning Bénévoles'!M$3:M$40,0))=TRUE,AO49+1,AO49))","v":19},"LE ROY  Julian","","",{"$f":"IF(AT50=\"\",AS49,IF(ISNA(MATCH(AT50,'Planning Bénévoles'!N$3:N$40,0))=TRUE,AS49+1,AS49))","v":18},"LE ROY  Julian","","",{"$f":"IF(AX50=\"\",AW49,IF(ISNA(MATCH(AX50,'Planning Bénévoles'!O$3:O$40,0))=TRUE,AW49+1,AW49))","v":2},"","","",{"$f":"IF(BB50=\"\",BA49,IF(ISNA(MATCH(BB50,'Planning Bénévoles'!P$3:P$40,0))=TRUE,BA49+1,BA49))","v":26},"LE ROY  Julian","","",{"$f":"IF(BF50=\"\",BE49,IF(ISNA(MATCH(BF50,'Planning Bénévoles'!Q$3:Q$40,0))=TRUE,BE49+1,BE49))","v":16},"LE ROY  Julian","","",{"$f":"IF(BJ50=\"\",BI49,IF(ISNA(MATCH(BJ50,'Planning Bénévoles'!R$3:R$40,0))=TRUE,BI49+1,BI49))","v":13},"LE ROY  Julian","","",{"$f":"IF(BN50=\"\",BM49,IF(ISNA(MATCH(BN50,'Planning Bénévoles'!S$3:S$40,0))=TRUE,BM49+1,BM49))","v":23},"LE ROY  Julian","","",{"$f":"IF(BR50=\"\",BQ49,IF(ISNA(MATCH(BR50,'Planning Bénévoles'!T$3:T$40,0))=TRUE,BQ49+1,BQ49))","v":21},"LE ROY  Julian","",""]
[{"$f":"IF(B51=\"\",A50,IF(ISNA(MATCH(B51,'Planning Bénévoles'!C$3:C$40,0))=TRUE,A50+1,A50))","v":7},"","","",{"$f":"IF(F51=\"\",E50,IF(ISNA(MATCH(F51,'Planning Bénévoles'!D$3:D$40,0))=TRUE,E50+1,E50))","v":13},"","","",{"$f":"IF(J51=\"\",I50,IF(ISNA(MATCH(J51,'Planning Bénévoles'!E$3:E$40,0))=TRUE,I50+1,I50))","v":4},"","","",{"$f":"IF(N51=\"\",M50,IF(ISNA(MATCH(N51,'Planning Bénévoles'!F$3:F$40,0))=TRUE,M50+1,M50))","v":2},"","","",{"$f":"IF(R51=\"\",Q50,IF(ISNA(MATCH(R51,'Planning Bénévoles'!G$3:G$40,0))=TRUE,Q50+1,Q50))","v":5},"","","",{"$f":"IF(V51=\"\",U50,IF(ISNA(MATCH(V51,'Planning Bénévoles'!H$3:H$40,0))=TRUE,U50+1,U50))","v":2},"","","",{"$f":"IF(Z51=\"\",Y50,IF(ISNA(MATCH(Z51,'Planning Bénévoles'!I$3:I$40,0))=TRUE,Y50+1,Y50))","v":2},"","","",{"$f":"IF(AD51=\"\",AC50,IF(ISNA(MATCH(AD51,'Planning Bénévoles'!J$3:J$40,0))=TRUE,AC50+1,AC50))","v":2},"","","",{"$f":"IF(AH51=\"\",AG50,IF(ISNA(MATCH(AH51,'Planning Bénévoles'!K$3:K$40,0))=TRUE,AG50+1,AG50))","v":4},"","","",{"$f":"IF(AL51=\"\",AK50,IF(ISNA(MATCH(AL51,'Planning Bénévoles'!L$3:L$40,0))=TRUE,AK50+1,AK50))","v":6},"","","",{"$f":"IF(AP51=\"\",AO50,IF(ISNA(MATCH(AP51,'Planning Bénévoles'!M$3:M$40,0))=TRUE,AO50+1,AO50))","v":19},"","","",{"$f":"IF(AT51=\"\",AS50,IF(ISNA(MATCH(AT51,'Planning Bénévoles'!N$3:N$40,0))=TRUE,AS50+1,AS50))","v":18},"","","",{"$f":"IF(AX51=\"\",AW50,IF(ISNA(MATCH(AX51,'Planning Bénévoles'!O$3:O$40,0))=TRUE,AW50+1,AW50))","v":2},"LE ROY (THG) Christelle","","",{"$f":"IF(BB51=\"\",BA50,IF(ISNA(MATCH(BB51,'Planning Bénévoles'!P$3:P$40,0))=TRUE,BA50+1,BA50))","v":27},"LE ROY (THG) Christelle","","",{"$f":"IF(BF51=\"\",BE50,IF(ISNA(MATCH(BF51,'Planning Bénévoles'!Q$3:Q$40,0))=TRUE,BE50+1,BE50))","v":16},"","","",{"$f":"IF(BJ51=\"\",BI50,IF(ISNA(MATCH(BJ51,'Planning Bénévoles'!R$3:R$40,0))=TRUE,BI50+1,BI50))","v":13},"","","",{"$f":"IF(BN51=\"\",BM50,IF(ISNA(MATCH(BN51,'Planning Bénévoles'!S$3:S$40,0))=TRUE,BM50+1,BM50))","v":23},"","","",{"$f":"IF(BR51=\"\",BQ50,IF(ISNA(MATCH(BR51,'Planning Bénévoles'!T$3:T$40,0))=TRUE,BQ50+1,BQ50))","v":21},"","",""]
[{"$f":"IF(B52=\"\",A51,IF(ISNA(MATCH(B52,'Planning Bénévoles'!C$3:C$40,0))=TRUE,A51+1,A51))","v":7},"","","",{"$f":"IF(F52=\"\",E51,IF(ISNA(MATCH(F52,'Planning Bénévoles'!D$3:D$40,0))=TRUE,E51+1,E51))","v":13},"","","",{"$f":"IF(J52=\"\",I51,IF(ISNA(MATCH(J52,'Planning Bénévoles'!E$3:E$40,0))=TRUE,I51+1,I51))","v":4},"","","",{"$f":"IF(N52=\"\",M51,IF(ISNA(MATCH(N52,'Planning Bénévoles'!F$3:F$40,0))=TRUE,M51+1,M51))","v":2},"LECHAT Loïc","","",{"$f":"IF(R52=\"\",Q51,IF(ISNA(MATCH(R52,'Planning Bénévoles'!G$3:G$40,0))=TRUE,Q51+1,Q51))","v":5},"","","",{"$f":"IF(V52=\"\",U51,IF(ISNA(MATCH(V52,'Planning Bénévoles'!H$3:H$40,0))=TRUE,U51+1,U51))","v":2},"","","",{"$f":"IF(Z52=\"\",Y51,IF(ISNA(MATCH(Z52,'Planning Bénévoles'!I$3:I$40,0))=TRUE,Y51+1,Y51))","v":2},"","","",{"$f":"IF(AD52=\"\",AC51,IF(ISNA(MATCH(AD52,'Planning Bénévoles'!J$3:J$40,0))=TRUE,AC51+1,AC51))","v":2},"","","",{"$f":"IF(AH52=\"\",AG51,IF(ISNA(MATCH(AH52,'Planning Bénévoles'!K$3:K$40,0))=TRUE,AG51+1,AG51))","v":4},"","","",{"$f":"IF(AL52=\"\",AK51,IF(ISNA(MATCH(AL52,'Planning Bénévoles'!L$3:L$40,0))=TRUE,AK51+1,AK51))","v":6},"","","",{"$f":"IF(AP52=\"\",AO51,IF(ISNA(MATCH(AP52,'Planning Bénévoles'!M$3:M$40,0))=TRUE,AO51+1,AO51))","v":19},"","","",{"$f":"IF(AT52=\"\",AS51,IF(ISNA(MATCH(AT52,'Planning Bénévoles'!N$3:N$40,0))=TRUE,AS51+1,AS51))","v":19},"LECHAT Loïc","","",{"$f":"IF(AX52=\"\",AW51,IF(ISNA(MATCH(AX52,'Planning Bénévoles'!O$3:O$40,0))=TRUE,AW51+1,AW51))","v":2},"","","",{"$f":"IF(BB52=\"\",BA51,IF(ISNA(MATCH(BB52,'Planning Bénévoles'!P$3:P$40,0))=TRUE,BA51+1,BA51))","v":27},"","","",{"$f":"IF(BF52=\"\",BE51,IF(ISNA(MATCH(BF52,'Planning Bénévoles'!Q$3:Q$40,0))=TRUE,BE51+1,BE51))","v":16},"","","",{"$f":"IF(BJ52=\"\",BI51,IF(ISNA(MATCH(BJ52,'Planning Bénévoles'!R$3:R$40,0))=TRUE,BI51+1,BI51))","v":13},"","","",{"$f":"IF(BN52=\"\",BM51,IF(ISNA(MATCH(BN52,'Planning Bénévoles'!S$3:S$40,0))=TRUE,BM51+1,BM51))","v":24},"LECHAT Loïc","","",{"$f":"IF(BR52=\"\",BQ51,IF(ISNA(MATCH(BR52,'Planning Bénévoles'!T$3:T$40,0))=TRUE,BQ51+1,BQ51))","v":21},"","",""]
[{"$f":"IF(B53=\"\",A52,IF(ISNA(MATCH(B53,'Planning Bénévoles'!C$3:C$40,0))=TRUE,A52+1,A52))","v":7},"MALANDAIN Manuela","","",{"$f":"IF(F53=\"\",E52,IF(ISNA(MATCH(F53,'Planning Bénévoles'!D$3:D$40,0))=TRUE,E52+1,E52))","v":13},"MALANDAIN Manuela","","",{"$f":"IF(J53=\"\",I52,IF(ISNA(MATCH(J53,'Planning Bénévoles'!E$3:E$40,0))=TRUE,I52+1,I52))","v":4},"","","",{"$f":"IF(N53=\"\",M52,IF(ISNA(MATCH(N53,'Planning Bénévoles'!F$3:F$40,0))=TRUE,M52+1,M52))","v":2},"MALANDAIN Manuela","","",{"$f":"IF(R53=\"\",Q52,IF(ISNA(MATCH(R53,'Planning Bénévoles'!G$3:G$40,0))=TRUE,Q52+1,Q52))","v":5},"MALANDAIN Manuela","","",{"$f":"IF(V53=\"\",U52,IF(ISNA(MATCH(V53,'Planning Bénévoles'!H$3:H$40,0))=TRUE,U52+1,U52))","v":2},"MALANDAIN Manuela","","",{"$f":"IF(Z53=\"\",Y52,IF(ISNA(MATCH(Z53,'Planning Bénévoles'!I$3:I$40,0))=TRUE,Y52+1,Y52))","v":2},"MALANDAIN Manuela","","",{"$f":"IF(AD53=\"\",AC52,IF(ISNA(MATCH(AD53,'Planning Bénévoles'!J$3:J$40,0))=TRUE,AC52+1,AC52))","v":2},"MALANDAIN Manuela","","",{"$f":"IF(AH53=\"\",AG52,IF(ISNA(MATCH(AH53,'Planning Bénévoles'!K$3:K$40,0))=TRUE,AG52+1,AG52))","v":5},"MALANDAIN Manuela","","",{"$f":"IF(AL53=\"\",AK52,IF(ISNA(MATCH(AL53,'Planning Bénévoles'!L$3:L$40,0))=TRUE,AK52+1,AK52))","v":7},"MALANDAIN Manuela","","",{"$f":"IF(AP53=\"\",AO52,IF(ISNA(MATCH(AP53,'Planning Bénévoles'!M$3:M$40,0))=TRUE,AO52+1,AO52))","v":20},"MALANDAIN Manuela","","",{"$f":"IF(AT53=\"\",AS52,IF(ISNA(MATCH(AT53,'Planning Bénévoles'!N$3:N$40,0))=TRUE,AS52+1,AS52))","v":20},"MALANDAIN Manuela","","",{"$f":"IF(AX53=\"\",AW52,IF(ISNA(MATCH(AX53,'Planning Bénévoles'!O$3:O$40,0))=TRUE,AW52+1,AW52))","v":2},"","","",{"$f":"IF(BB53=\"\",BA52,IF(ISNA(MATCH(BB53,'Planning Bénévoles'!P$3:P$40,0))=TRUE,BA52+1,BA52))","v":27},"","","",{"$f":"IF(BF53=\"\",BE52,IF(ISNA(MATCH(BF53,'Planning Bénévoles'!Q$3:Q$40,0))=TRUE,BE52+1,BE52))","v":16},"","","",{"$f":"IF(BJ53=\"\",BI52,IF(ISNA(MATCH(BJ53,'Planning Bénévoles'!R$3:R$40,0))=TRUE,BI52+1,BI52))","v":14},"MALANDAIN Manuela","","",{"$f":"IF(BN53=\"\",BM52,IF(ISNA(MATCH(BN53,'Planning Bénévoles'!S$3:S$40,0))=TRUE,BM52+1,BM52))","v":25},"MALANDAIN Manuela","","",{"$f":"IF(BR53=\"\",BQ52,IF(ISNA(MATCH(BR53,'Planning Bénévoles'!T$3:T$40,0))=TRUE,BQ52+1,BQ52))","v":22},"MALANDAIN Manuela","",""]
[{"$f":"IF(B54=\"\",A53,IF(ISNA(MATCH(B54,'Planning Bénévoles'!C$3:C$40,0))=TRUE,A53+1,A53))","v":8},"MARCHE Sophie","","",{"$f":"IF(F54=\"\",E53,IF(ISNA(MATCH(F54,'Planning Bénévoles'!D$3:D$40,0))=TRUE,E53+1,E53))","v":14},"MARCHE Sophie","","",{"$f":"IF(J54=\"\",I53,IF(ISNA(MATCH(J54,'Planning Bénévoles'!E$3:E$40,0))=TRUE,I53+1,I53))","v":5},"MARCHE Sophie","","",{"$f":"IF(N54=\"\",M53,IF(ISNA(MATCH(N54,'Planning Bénévoles'!F$3:F$40,0))=TRUE,M53+1,M53))","v":3},"MARCHE Sophie","","",{"$f":"IF(R54=\"\",Q53,IF(ISNA(MATCH(R54,'Planning Bénévoles'!G$3:G$40,0))=TRUE,Q53+1,Q53))","v":6},"MARCHE Sophie","","",{"$f":"IF(V54=\"\",U53,IF(ISNA(MATCH(V54,'Planning Bénévoles'!H$3:H$40,0))=TRUE,U53+1,U53))","v":3},"MARCHE Sophie","","",{"$f":"IF(Z54=\"\",Y53,IF(ISNA(MATCH(Z54,'Planning Bénévoles'!I$3:I$40,0))=TRUE,Y53+1,Y53))","v":3},"MARCHE Sophie","","",{"$f":"IF(AD54=\"\",AC53,IF(ISNA(MATCH(AD54,'Planning Bénévoles'!J$3:J$40,0))=TRUE,AC53+1,AC53))","v":3},"MARCHE Sophie","","",{"$f":"IF(AH54=\"\",AG53,IF(ISNA(MATCH(AH54,'Planning Bénévoles'!K$3:K$40,0))=TRUE,AG53+1,AG53))","v":5},"MARCHE Sophie","","",{"$f":"IF(AL54=\"\",AK53,IF(ISNA(MATCH(AL54,'Planning Bénévoles'!L$3:L$40,0))=TRUE,AK53+1,AK53))","v":8},"MARCHE Sophie","","",{"$f":"IF(AP54=\"\",AO53,IF(ISNA(MATCH(AP54,'Planning Bénévoles'!M$3:M$40,0))=TRUE,AO53+1,AO53))","v":21},"MARCHE Sophie","","",{"$f":"IF(AT54=\"\",AS53,IF(ISNA(MATCH(AT54,'Planning Bénévoles'!N$3:N$40,0))=TRUE,AS53+1,AS53))","v":21},"MARCHE Sophie","","",{"$f":"IF(AX54=\"\",AW53,IF(ISNA(MATCH(AX54,'Planning Bénévoles'!O$3:O$40,0))=TRUE,AW53+1,AW53))","v":2},"MARCHE Sophie","","",{"$f":"IF(BB54=\"\",BA53,IF(ISNA(MATCH(BB54,'Planning Bénévoles'!P$3:P$40,0))=TRUE,BA53+1,BA53))","v":28},"MARCHE Sophie","","",{"$f":"IF(BF54=\"\",BE53,IF(ISNA(MATCH(BF54,'Planning Bénévoles'!Q$3:Q$40,0))=TRUE,BE53+1,BE53))","v":17},"MARCHE Sophie","","",{"$f":"IF(BJ54=\"\",BI53,IF(ISNA(MATCH(BJ54,'Planning Bénévoles'!R$3:R$40,0))=TRUE,BI53+1,BI53))","v":15},"MARCHE Sophie","","",{"$f":"IF(BN54=\"\",BM53,IF(ISNA(MATCH(BN54,'Planning Bénévoles'!S$3:S$40,0))=TRUE,BM53+1,BM53))","v":26},"MARCHE Sophie","","",{"$f":"IF(BR54=\"\",BQ53,IF(ISNA(MATCH(BR54,'Planning Bénévoles'!T$3:T$40,0))=TRUE,BQ53+1,BQ53))","v":23},"MARCHE Sophie","",""]
[{"$f":"IF(B55=\"\",A54,IF(ISNA(MATCH(B55,'Planning Bénévoles'!C$3:C$40,0))=TRUE,A54+1,A54))","v":8},"","","",{"$f":"IF(F55=\"\",E54,IF(ISNA(MATCH(F55,'Planning Bénévoles'!D$3:D$40,0))=TRUE,E54+1,E54))","v":15},"MIGLIACCIO Claire","","",{"$f":"IF(J55=\"\",I54,IF(ISNA(MATCH(J55,'Planning Bénévoles'!E$3:E$40,0))=TRUE,I54+1,I54))","v":6},"MIGLIACCIO Claire","","",{"$f":"IF(N55=\"\",M54,IF(ISNA(MATCH(N55,'Planning Bénévoles'!F$3:F$40,0))=TRUE,M54+1,M54))","v":3},"","","",{"$f":"IF(R55=\"\",Q54,IF(ISNA(MATCH(R55,'Planning Bénévoles'!G$3:G$40,0))=TRUE,Q54+1,Q54))","v":6},"","","",{"$f":"IF(V55=\"\",U54,IF(ISNA(MATCH(V55,'Planning Bénévoles'!H$3:H$40,0))=TRUE,U54+1,U54))","v":3},"MIGLIACCIO Claire","","",{"$f":"IF(Z55=\"\",Y54,IF(ISNA(MATCH(Z55,'Planning Bénévoles'!I$3:I$40,0))=TRUE,Y54+1,Y54))","v":3},"","","",{"$f":"IF(AD55=\"\",AC54,IF(ISNA(MATCH(AD55,'Planning Bénévoles'!J$3:J$40,0))=TRUE,AC54+1,AC54))","v":3},"","","",{"$f":"IF(AH55=\"\",AG54,IF(ISNA(MATCH(AH55,'Planning Bénévoles'!K$3:K$40,0))=TRUE,AG54+1,AG54))","v":5},"","","",{"$f":"IF(AL55=\"\",AK54,IF(ISNA(MATCH(AL55,'Planning Bénévoles'!L$3:L$40,0))=TRUE,AK54+1,AK54))","v":8},"","","",{"$f":"IF(AP55=\"\",AO54,IF(ISNA(MATCH(AP55,'Planning Bénévoles'!M$3:M$40,0))=TRUE,AO54+1,AO54))","v":21},"","","",{"$f":"IF(AT55=\"\",AS54,IF(ISNA(MATCH(AT55,'Planning Bénévoles'!N$3:N$40,0))=TRUE,AS54+1,AS54))","v":22},"MIGLIACCIO Claire","","",{"$f":"IF(AX55=\"\",AW54,IF(ISNA(MATCH(AX55,'Planning Bénévoles'!O$3:O$40,0))=TRUE,AW54+1,AW54))","v":2},"","","",{"$f":"IF(BB55=\"\",BA54,IF(ISNA(MATCH(BB55,'Planning Bénévoles'!P$3:P$40,0))=TRUE,BA54+1,BA54))","v":28},"","","",{"$f":"IF(BF55=\"\",BE54,IF(ISNA(MATCH(BF55,'Planning Bénévoles'!Q$3:Q$40,0))=TRUE,BE54+1,BE54))","v":17},"MIGLIACCIO Claire","","",{"$f":"IF(BJ55=\"\",BI54,IF(ISNA(MATCH(BJ55,'Planning Bénévoles'!R$3:R$40,0))=TRUE,BI54+1,BI54))","v":15},"","","",{"$f":"IF(BN55=\"\",BM54,IF(ISNA(MATCH(BN55,'Planning Bénévoles'!S$3:S$40,0))=TRUE,BM54+1,BM54))","v":27},"MIGLIACCIO Claire","","",{"$f":"IF(BR55=\"\",BQ54,IF(ISNA(MATCH(BR55,'Planning Bénévoles'!T$3:T$40,0))=TRUE,BQ54+1,BQ54))","v":24},"MIGLIACCIO Claire","",""]
[{"$f":"IF(B56=\"\",A55,IF(ISNA(MATCH(B56,'Planning Bénévoles'!C$3:C$40,0))=TRUE,A55+1,A55))","v":9},"MOAL Alain","","",{"$f":"IF(F56=\"\",E55,IF(ISNA(MATCH(F56,'Planning Bénévoles'!D$3:D$40,0))=TRUE,E55+1,E55))","v":15},"MOAL Alain","","",{"$f":"IF(J56=\"\",I55,IF(ISNA(MATCH(J56,'Planning Bénévoles'!E$3:E$40,0))=TRUE,I55+1,I55))","v":6},"MOAL Alain","","",{"$f":"IF(N56=\"\",M55,IF(ISNA(MATCH(N56,'Planning Bénévoles'!F$3:F$40,0))=TRUE,M55+1,M55))","v":3},"MOAL Alain","","",{"$f":"IF(R56=\"\",Q55,IF(ISNA(MATCH(R56,'Planning Bénévoles'!G$3:G$40,0))=TRUE,Q55+1,Q55))","v":6},"MOAL Alain","","",{"$f":"IF(V56=\"\",U55,IF(ISNA(MATCH(V56,'Planning Bénévoles'!H$3:H$40,0))=TRUE,U55+1,U55))","v":3},"MOAL Alain","","",{"$f":"IF(Z56=\"\",Y55,IF(ISNA(MATCH(Z56,'Planning Bénévoles'!I$3:I$40,0))=TRUE,Y55+1,Y55))","v":3},"MOAL Alain","","",{"$f":"IF(AD56=\"\",AC55,IF(ISNA(MATCH(AD56,'Planning Bénévoles'!J$3:J$40,0))=TRUE,AC55+1,AC55))","v":3},"MOAL Alain","","",{"$f":"IF(AH56=\"\",AG55,IF(ISNA(MATCH(AH56,'Planning Bénévoles'!K$3:K$40,0))=TRUE,AG55+1,AG55))","v":5},"MOAL Alain","","",{"$f":"IF(AL56=\"\",AK55,IF(ISNA(MATCH(AL56,'Planning Bénévoles'!L$3:L$40,0))=TRUE,AK55+1,AK55))","v":9},"MOAL Alain","","",{"$f":"IF(AP56=\"\",AO55,IF(ISNA(MATCH(AP56,'Planning Bénévoles'!M$3:M$40,0))=TRUE,AO55+1,AO55))","v":22},"MOAL Alain","","",{"$f":"IF(AT56=\"\",AS55,IF(ISNA(MATCH(AT56,'Planning Bénévoles'!N$3:N$40,0))=TRUE,AS55+1,AS55))","v":23},"MOAL Alain","","",{"$f":"IF(AX56=\"\",AW55,IF(ISNA(MATCH(AX56,'Planning Bénévoles'!O$3:O$40,0))=TRUE,AW55+1,AW55))","v":2},"MOAL Alain","","",{"$f":"IF(BB56=\"\",BA55,IF(ISNA(MATCH(BB56,'Planning Bénévoles'!P$3:P$40,0))=TRUE,BA55+1,BA55))","v":29},"MOAL Alain","","",{"$f":"IF(BF56=\"\",BE55,IF(ISNA(MATCH(BF56,'Planning Bénévoles'!Q$3:Q$40,0))=TRUE,BE55+1,BE55))","v":18},"MOAL Alain","","",{"$f":"IF(BJ56=\"\",BI55,IF(ISNA(MATCH(BJ56,'Planning Bénévoles'!R$3:R$40,0))=TRUE,BI55+1,BI55))","v":16},"MOAL Alain","","",{"$f":"IF(BN56=\"\",BM55,IF(ISNA(MATCH(BN56,'Planning Bénévoles'!S$3:S$40,0))=TRUE,BM55+1,BM55))","v":28},"MOAL Alain","","",{"$f":"IF(BR56=\"\",BQ55,IF(ISNA(MATCH(BR56,'Planning Bénévoles'!T$3:T$40,0))=TRUE,BQ55+1,BQ55))","v":25},"MOAL Alain","",""]
[{"$f":"IF(B57=\"\",A56,IF(ISNA(MATCH(B57,'Planning Bénévoles'!C$3:C$40,0))=TRUE,A56+1,A56))","v":10},"NHEK (K) Alexandrine","","",{"$f":"IF(F57=\"\",E56,IF(ISNA(MATCH(F57,'Planning Bénévoles'!D$3:D$40,0))=TRUE,E56+1,E56))","v":16},"NHEK (K) Alexandrine","","",{"$f":"IF(J57=\"\",I56,IF(ISNA(MATCH(J57,'Planning Bénévoles'!E$3:E$40,0))=TRUE,I56+1,I56))","v":6},"","","",{"$f":"IF(N57=\"\",M56,IF(ISNA(MATCH(N57,'Planning Bénévoles'!F$3:F$40,0))=TRUE,M56+1,M56))","v":3},"NHEK (K) Alexandrine","","",{"$f":"IF(R57=\"\",Q56,IF(ISNA(MATCH(R57,'Planning Bénévoles'!G$3:G$40,0))=TRUE,Q56+1,Q56))","v":6},"NHEK (K) Alexandrine","","",{"$f":"IF(V57=\"\",U56,IF(ISNA(MATCH(V57,'Planning Bénévoles'!H$3:H$40,0))=TRUE,U56+1,U56))","v":3},"","","",{"$f":"IF(Z57=\"\",Y56,IF(ISNA(MATCH(Z57,'Planning Bénévoles'!I$3:I$40,0))=TRUE,Y56+1,Y56))","v":3},"","","",{"$f":"IF(AD57=\"\",AC56,IF(ISNA(MATCH(AD57,'Planning Bénévoles'!J$3:J$40,0))=TRUE,AC56+1,AC56))","v":3},"","","",{"$f":"IF(AH57=\"\",AG56,IF(ISNA(MATCH(AH57,'Planning Bénévoles'!K$3:K$40,0))=TRUE,AG56+1,AG56))","v":5},"","","",{"$f":"IF(AL57=\"\",AK56,IF(ISNA(MATCH(AL57,'Planning Bénévoles'!L$3:L$40,0))=TRUE,AK56+1,AK56))","v":10},"NHEK (K) Alexandrine","","",{"$f":"IF(AP57=\"\",AO56,IF(ISNA(MATCH(AP57,'Planning Bénévoles'!M$3:M$40,0))=TRUE,AO56+1,AO56))","v":23},"NHEK (K) Alexandrine","","",{"$f":"IF(AT57=\"\",AS56,IF(ISNA(MATCH(AT57,'Planning Bénévoles'!N$3:N$40,0))=TRUE,AS56+1,AS56))","v":23},"","","",{"$f":"IF(AX57=\"\",AW56,IF(ISNA(MATCH(AX57,'Planning Bénévoles'!O$3:O$40,0))=TRUE,AW56+1,AW56))","v":2},"NHEK (K) Alexandrine","","",{"$f":"IF(BB57=\"\",BA56,IF(ISNA(MATCH(BB57,'Planning Bénévoles'!P$3:P$40,0))=TRUE,BA56+1,BA56))","v":30},"NHEK (K) Alexandrine","","",{"$f":"IF(BF57=\"\",BE56,IF(ISNA(MATCH(BF57,'Planning Bénévoles'!Q$3:Q$40,0))=TRUE,BE56+1,BE56))","v":18},"","","",{"$f":"IF(BJ57=\"\",BI56,IF(ISNA(MATCH(BJ57,'Planning Bénévoles'!R$3:R$40,0))=TRUE,BI56+1,BI56))","v":16},"","","",{"$f":"IF(BN57=\"\",BM56,IF(ISNA(MATCH(BN57,'Planning Bénévoles'!S$3:S$40,0))=TRUE,BM56+1,BM56))","v":28},"","","",{"$f":"IF(BR57=\"\",BQ56,IF(ISNA(MATCH(BR57,'Planning Bénévoles'!T$3:T$40,0))=TRUE,BQ56+1,BQ56))","v":25},"","",""]
[{"$f":"IF(B58=\"\",A57,IF(ISNA(MATCH(B58,'Planning Bénévoles'!C$3:C$40,0))=TRUE,A57+1,A57))","v":10},"","","",{"$f":"IF(F58=\"\",E57,IF(ISNA(MATCH(F58,'Planning Bénévoles'!D$3:D$40,0))=TRUE,E57+1,E57))","v":16},"","","",{"$f":"IF(J58=\"\",I57,IF(ISNA(MATCH(J58,'Planning Bénévoles'!E$3:E$40,0))=TRUE,I57+1,I57))","v":6},"","","",{"$f":"IF(N58=\"\",M57,IF(ISNA(MATCH(N58,'Planning Bénévoles'!F$3:F$40,0))=TRUE,M57+1,M57))","v":3},"","","",{"$f":"IF(R58=\"\",Q57,IF(ISNA(MATCH(R58,'Planning Bénévoles'!G$3:G$40,0))=TRUE,Q57+1,Q57))","v":6},"","","",{"$f":"IF(V58=\"\",U57,IF(ISNA(MATCH(V58,'Planning Bénévoles'!H$3:H$40,0))=TRUE,U57+1,U57))","v":3},"","","",{"$f":"IF(Z58=\"\",Y57,IF(ISNA(MATCH(Z58,'Planning Bénévoles'!I$3:I$40,0))=TRUE,Y57+1,Y57))","v":3},"PARISSE (THG) Amélie","","",{"$f":"IF(AD58=\"\",AC57,IF(ISNA(MATCH(AD58,'Planning Bénévoles'!J$3:J$40,0))=TRUE,AC57+1,AC57))","v":3},"PARISSE (THG) Amélie","","",{"$f":"IF(AH58=\"\",AG57,IF(ISNA(MATCH(AH58,'Planning Bénévoles'!K$3:K$40,0))=TRUE,AG57+1,AG57))","v":5},"","","",{"$f":"IF(AL58=\"\",AK57,IF(ISNA(MATCH(AL58,'Planning Bénévoles'!L$3:L$40,0))=TRUE,AK57+1,AK57))","v":11},"PARISSE (THG) Amélie","","",{"$f":"IF(AP58=\"\",AO57,IF(ISNA(MATCH(AP58,'Planning Bénévoles'!M$3:M$40,0))=TRUE,AO57+1,AO57))","v":24},"PARISSE (THG) Amélie","","",{"$f":"IF(AT58=\"\",AS57,IF(ISNA(MATCH(AT58,'Planning Bénévoles'!N$3:N$40,0))=TRUE,AS57+1,AS57))","v":23},"","","",{"$f":"IF(AX58=\"\",AW57,IF(ISNA(MATCH(AX58,'Planning Bénévoles'!O$3:O$40,0))=TRUE,AW57+1,AW57))","v":2},"","","",{"$f":"IF(BB58=\"\",BA57,IF(ISNA(MATCH(BB58,'Planning Bénévoles'!P$3:P$40,0))=TRUE,BA57+1,BA57))","v":30},"","","",{"$f":"IF(BF58=\"\",BE57,IF(ISNA(MATCH(BF58,'Planning Bénévoles'!Q$3:Q$40,0))=TRUE,BE57+1,BE57))","v":18},"","","",{"$f":"IF(BJ58=\"\",BI57,IF(ISNA(MATCH(BJ58,'Planning Bénévoles'!R$3:R$40,0))=TRUE,BI57+1,BI57))","v":16},"","","",{"$f":"IF(BN58=\"\",BM57,IF(ISNA(MATCH(BN58,'Planning Bénévoles'!S$3:S$40,0))=TRUE,BM57+1,BM57))","v":28},"","","",{"$f":"IF(BR58=\"\",BQ57,IF(ISNA(MATCH(BR58,'Planning Bénévoles'!T$3:T$40,0))=TRUE,BQ57+1,BQ57))","v":25},"","",""]
[{"$f":"IF(B59=\"\",A58,IF(ISNA(MATCH(B59,'Planning Bénévoles'!C$3:C$40,0))=TRUE,A58+1,A58))","v":10},"","","",{"$f":"IF(F59=\"\",E58,IF(ISNA(MATCH(F59,'Planning Bénévoles'!D$3:D$40,0))=TRUE,E58+1,E58))","v":16},"PLOUZENNEC Nadine","","",{"$f":"IF(J59=\"\",I58,IF(ISNA(MATCH(J59,'Planning Bénévoles'!E$3:E$40,0))=TRUE,I58+1,I58))","v":6},"PLOUZENNEC Nadine","","",{"$f":"IF(N59=\"\",M58,IF(ISNA(MATCH(N59,'Planning Bénévoles'!F$3:F$40,0))=TRUE,M58+1,M58))","v":3},"","","",{"$f":"IF(R59=\"\",Q58,IF(ISNA(MATCH(R59,'Planning Bénévoles'!G$3:G$40,0))=TRUE,Q58+1,Q58))","v":6},"PLOUZENNEC Nadine","","",{"$f":"IF(V59=\"\",U58,IF(ISNA(MATCH(V59,'Planning Bénévoles'!H$3:H$40,0))=TRUE,U58+1,U58))","v":3},"PLOUZENNEC Nadine","","",{"$f":"IF(Z59=\"\",Y58,IF(ISNA(MATCH(Z59,'Planning Bénévoles'!I$3:I$40,0))=TRUE,Y58+1,Y58))","v":3},"","","",{"$f":"IF(AD59=\"\",AC58,IF(ISNA(MATCH(AD59,'Planning Bénévoles'!J$3:J$40,0))=TRUE,AC58+1,AC58))","v":3},"PLOUZENNEC Nadine","","",{"$f":"IF(AH59=\"\",AG58,IF(ISNA(MATCH(AH59,'Planning Bénévoles'!K$3:K$40,0))=TRUE,AG58+1,AG58))","v":5},"PLOUZENNEC Nadine","","",{"$f":"IF(AL59=\"\",AK58,IF(ISNA(MATCH(AL59,'Planning Bénévoles'!L$3:L$40,0))=TRUE,AK58+1,AK58))","v":11},"","","",{"$f":"IF(AP59=\"\",AO58,IF(ISNA(MATCH(AP59,'Planning Bénévoles'!M$3:M$40,0))=TRUE,AO58+1,AO58))","v":25},"PLOUZENNEC Nadine","","",{"$f":"IF(AT59=\"\",AS58,IF(ISNA(MATCH(AT59,'Planning Bénévoles'!N$3:N$40,0))=TRUE,AS58+1,AS58))","v":24},"PLOUZENNEC Nadine","","",{"$f":"IF(AX59=\"\",AW58,IF(ISNA(MATCH(AX59,'Planning Bénévoles'!O$3:O$40,0))=TRUE,AW58+1,AW58))","v":2},"","","",{"$f":"IF(BB59=\"\",BA58,IF(ISNA(MATCH(BB59,'Planning Bénévoles'!P$3:P$40,0))=TRUE,BA58+1,BA58))","v":31},"PLOUZENNEC Nadine","","",{"$f":"IF(BF59=\"\",BE58,IF(ISNA(MATCH(BF59,'Planning Bénévoles'!Q$3:Q$40,0))=TRUE,BE58+1,BE58))","v":19},"PLOUZENNEC Nadine","","",{"$f":"IF(BJ59=\"\",BI58,IF(ISNA(MATCH(BJ59,'Planning Bénévoles'!R$3:R$40,0))=TRUE,BI58+1,BI58))","v":16},"","","",{"$f":"IF(BN59=\"\",BM58,IF(ISNA(MATCH(BN59,'Planning Bénévoles'!S$3:S$40,0))=TRUE,BM58+1,BM58))","v":29},"PLOUZENNEC Nadine","","",{"$f":"IF(BR59=\"\",BQ58,IF(ISNA(MATCH(BR59,'Planning Bénévoles'!T$3:T$40,0))=TRUE,BQ58+1,BQ58))","v":26},"PLOUZENNEC Nadine","",""]
[{"$f":"IF(B60=\"\",A59,IF(ISNA(MATCH(B60,'Planning Bénévoles'!C$3:C$40,0))=TRUE,A59+1,A59))","v":11},"RAFFO Carine","","",{"$f":"IF(F60=\"\",E59,IF(ISNA(MATCH(F60,'Planning Bénévoles'!D$3:D$40,0))=TRUE,E59+1,E59))","v":16},"RAFFO Carine","","",{"$f":"IF(J60=\"\",I59,IF(ISNA(MATCH(J60,'Planning Bénévoles'!E$3:E$40,0))=TRUE,I59+1,I59))","v":6},"RAFFO Carine","","",{"$f":"IF(N60=\"\",M59,IF(ISNA(MATCH(N60,'Planning Bénévoles'!F$3:F$40,0))=TRUE,M59+1,M59))","v":3},"RAFFO Carine","","",{"$f":"IF(R60=\"\",Q59,IF(ISNA(MATCH(R60,'Planning Bénévoles'!G$3:G$40,0))=TRUE,Q59+1,Q59))","v":6},"RAFFO Carine","","",{"$f":"IF(V60=\"\",U59,IF(ISNA(MATCH(V60,'Planning Bénévoles'!H$3:H$40,0))=TRUE,U59+1,U59))","v":3},"RAFFO Carine","","",{"$f":"IF(Z60=\"\",Y59,IF(ISNA(MATCH(Z60,'Planning Bénévoles'!I$3:I$40,0))=TRUE,Y59+1,Y59))","v":3},"RAFFO Carine","","",{"$f":"IF(AD60=\"\",AC59,IF(ISNA(MATCH(AD60,'Planning Bénévoles'!J$3:J$40,0))=TRUE,AC59+1,AC59))","v":3},"RAFFO Carine","","",{"$f":"IF(AH60=\"\",AG59,IF(ISNA(MATCH(AH60,'Planning Bénévoles'!K$3:K$40,0))=TRUE,AG59+1,AG59))","v":5},"RAFFO Carine","","",{"$f":"IF(AL60=\"\",AK59,IF(ISNA(MATCH(AL60,'Planning Bénévoles'!L$3:L$40,0))=TRUE,AK59+1,AK59))","v":11},"RAFFO Carine","","",{"$f":"IF(AP60=\"\",AO59,IF(ISNA(MATCH(AP60,'Planning Bénévoles'!M$3:M$40,0))=TRUE,AO59+1,AO59))","v":26},"RAFFO Carine","","",{"$f":"IF(AT60=\"\",AS59,IF(ISNA(MATCH(AT60,'Planning Bénévoles'!N$3:N$40,0))=TRUE,AS59+1,AS59))","v":25},"RAFFO Carine","","",{"$f":"IF(AX60=\"\",AW59,IF(ISNA(MATCH(AX60,'Planning Bénévoles'!O$3:O$40,0))=TRUE,AW59+1,AW59))","v":2},"RAFFO Carine","","",{"$f":"IF(BB60=\"\",BA59,IF(ISNA(MATCH(BB60,'Planning Bénévoles'!P$3:P$40,0))=TRUE,BA59+1,BA59))","v":32},"RAFFO Carine","","",{"$f":"IF(BF60=\"\",BE59,IF(ISNA(MATCH(BF60,'Planning Bénévoles'!Q$3:Q$40,0))=TRUE,BE59+1,BE59))","v":20},"RAFFO Carine","","",{"$f":"IF(BJ60=\"\",BI59,IF(ISNA(MATCH(BJ60,'Planning Bénévoles'!R$3:R$40,0))=TRUE,BI59+1,BI59))","v":17},"RAFFO Carine","","",{"$f":"IF(BN60=\"\",BM59,IF(ISNA(MATCH(BN60,'Planning Bénévoles'!S$3:S$40,0))=TRUE,BM59+1,BM59))","v":30},"RAFFO Carine","","",{"$f":"IF(BR60=\"\",BQ59,IF(ISNA(MATCH(BR60,'Planning Bénévoles'!T$3:T$40,0))=TRUE,BQ59+1,BQ59))","v":27},"RAFFO Carine","",""]
[{"$f":"IF(B61=\"\",A60,IF(ISNA(MATCH(B61,'Planning Bénévoles'!C$3:C$40,0))=TRUE,A60+1,A60))","v":12},"RAMA (THG) Jurgen","","",{"$f":"IF(F61=\"\",E60,IF(ISNA(MATCH(F61,'Planning Bénévoles'!D$3:D$40,0))=TRUE,E60+1,E60))","v":17},"RAMA (THG) Jurgen","","",{"$f":"IF(J61=\"\",I60,IF(ISNA(MATCH(J61,'Planning Bénévoles'!E$3:E$40,0))=TRUE,I60+1,I60))","v":6},"","","",{"$f":"IF(N61=\"\",M60,IF(ISNA(MATCH(N61,'Planning Bénévoles'!F$3:F$40,0))=TRUE,M60+1,M60))","v":3},"RAMA (THG) Jurgen","","",{"$f":"IF(R61=\"\",Q60,IF(ISNA(MATCH(R61,'Planning Bénévoles'!G$3:G$40,0))=TRUE,Q60+1,Q60))","v":7},"RAMA (THG) Jurgen","","",{"$f":"IF(V61=\"\",U60,IF(ISNA(MATCH(V61,'Planning Bénévoles'!H$3:H$40,0))=TRUE,U60+1,U60))","v":3},"","","",{"$f":"IF(Z61=\"\",Y60,IF(ISNA(MATCH(Z61,'Planning Bénévoles'!I$3:I$40,0))=TRUE,Y60+1,Y60))","v":3},"","","",{"$f":"IF(AD61=\"\",AC60,IF(ISNA(MATCH(AD61,'Planning Bénévoles'!J$3:J$40,0))=TRUE,AC60+1,AC60))","v":3},"","","",{"$f":"IF(AH61=\"\",AG60,IF(ISNA(MATCH(AH61,'Planning Bénévoles'!K$3:K$40,0))=TRUE,AG60+1,AG60))","v":5},"","","",{"$f":"IF(AL61=\"\",AK60,IF(ISNA(MATCH(AL61,'Planning Bénévoles'!L$3:L$40,0))=TRUE,AK60+1,AK60))","v":11},"","","",{"$f":"IF(AP61=\"\",AO60,IF(ISNA(MATCH(AP61,'Planning Bénévoles'!M$3:M$40,0))=TRUE,AO60+1,AO60))","v":26},"","","",{"$f":"IF(AT61=\"\",AS60,IF(ISNA(MATCH(AT61,'Planning Bénévoles'!N$3:N$40,0))=TRUE,AS60+1,AS60))","v":25},"","","",{"$f":"IF(AX61=\"\",AW60,IF(ISNA(MATCH(AX61,'Planning Bénévoles'!O$3:O$40,0))=TRUE,AW60+1,AW60))","v":2},"","","",{"$f":"IF(BB61=\"\",BA60,IF(ISNA(MATCH(BB61,'Planning Bénévoles'!P$3:P$40,0))=TRUE,BA60+1,BA60))","v":32},"","","",{"$f":"IF(BF61=\"\",BE60,IF(ISNA(MATCH(BF61,'Planning Bénévoles'!Q$3:Q$40,0))=TRUE,BE60+1,BE60))","v":20},"","","",{"$f":"IF(BJ61=\"\",BI60,IF(ISNA(MATCH(BJ61,'Planning Bénévoles'!R$3:R$40,0))=TRUE,BI60+1,BI60))","v":17},"","","",{"$f":"IF(BN61=\"\",BM60,IF(ISNA(MATCH(BN61,'Planning Bénévoles'!S$3:S$40,0))=TRUE,BM60+1,BM60))","v":30},"","","",{"$f":"IF(BR61=\"\",BQ60,IF(ISNA(MATCH(BR61,'Planning Bénévoles'!T$3:T$40,0))=TRUE,BQ60+1,BQ60))","v":27},"","",""]
[{"$f":"IF(B62=\"\",A61,IF(ISNA(MATCH(B62,'Planning Bénévoles'!C$3:C$40,0))=TRUE,A61+1,A61))","v":12},"RIHANI Mohamed","","",{"$f":"IF(F62=\"\",E61,IF(ISNA(MATCH(F62,'Planning Bénévoles'!D$3:D$40,0))=TRUE,E61+1,E61))","v":17},"","","",{"$f":"IF(J62=\"\",I61,IF(ISNA(MATCH(J62,'Planning Bénévoles'!E$3:E$40,0))=TRUE,I61+1,I61))","v":6},"","","",{"$f":"IF(N62=\"\",M61,IF(ISNA(MATCH(N62,'Planning Bénévoles'!F$3:F$40,0))=TRUE,M61+1,M61))","v":3},"RIHANI Mohamed","","",{"$f":"IF(R62=\"\",Q61,IF(ISNA(MATCH(R62,'Planning Bénévoles'!G$3:G$40,0))=TRUE,Q61+1,Q61))","v":7},"","","",{"$f":"IF(V62=\"\",U61,IF(ISNA(MATCH(V62,'Planning Bénévoles'!H$3:H$40,0))=TRUE,U61+1,U61))","v":3},"","","",{"$f":"IF(Z62=\"\",Y61,IF(ISNA(MATCH(Z62,'Planning Bénévoles'!I$3:I$40,0))=TRUE,Y61+1,Y61))","v":3},"","","",{"$f":"IF(AD62=\"\",AC61,IF(ISNA(MATCH(AD62,'Planning Bénévoles'!J$3:J$40,0))=TRUE,AC61+1,AC61))","v":3},"","","",{"$f":"IF(AH62=\"\",AG61,IF(ISNA(MATCH(AH62,'Planning Bénévoles'!K$3:K$40,0))=TRUE,AG61+1,AG61))","v":5},"RIHANI Mohamed","","",{"$f":"IF(AL62=\"\",AK61,IF(ISNA(MATCH(AL62,'Planning Bénévoles'!L$3:L$40,0))=TRUE,AK61+1,AK61))","v":12},"RIHANI Mohamed","","",{"$f":"IF(AP62=\"\",AO61,IF(ISNA(MATCH(AP62,'Planning Bénévoles'!M$3:M$40,0))=TRUE,AO61+1,AO61))","v":26},"","","",{"$f":"IF(AT62=\"\",AS61,IF(ISNA(MATCH(AT62,'Planning Bénévoles'!N$3:N$40,0))=TRUE,AS61+1,AS61))","v":25},"","","",{"$f":"IF(AX62=\"\",AW61,IF(ISNA(MATCH(AX62,'Planning Bénévoles'!O$3:O$40,0))=TRUE,AW61+1,AW61))","v":2},"","","",{"$f":"IF(BB62=\"\",BA61,IF(ISNA(MATCH(BB62,'Planning Bénévoles'!P$3:P$40,0))=TRUE,BA61+1,BA61))","v":32},"","","",{"$f":"IF(BF62=\"\",BE61,IF(ISNA(MATCH(BF62,'Planning Bénévoles'!Q$3:Q$40,0))=TRUE,BE61+1,BE61))","v":21},"RIHANI Mohamed","","",{"$f":"IF(BJ62=\"\",BI61,IF(ISNA(MATCH(BJ62,'Planning Bénévoles'!R$3:R$40,0))=TRUE,BI61+1,BI61))","v":17},"","","",{"$f":"IF(BN62=\"\",BM61,IF(ISNA(MATCH(BN62,'Planning Bénévoles'!S$3:S$40,0))=TRUE,BM61+1,BM61))","v":31},"RIHANI Mohamed","","",{"$f":"IF(BR62=\"\",BQ61,IF(ISNA(MATCH(BR62,'Planning Bénévoles'!T$3:T$40,0))=TRUE,BQ61+1,BQ61))","v":28},"RIHANI Mohamed","",""]
[{"$f":"IF(B63=\"\",A62,IF(ISNA(MATCH(B63,'Planning Bénévoles'!C$3:C$40,0))=TRUE,A62+1,A62))","v":13},"ROBERT Mireille","","",{"$f":"IF(F63=\"\",E62,IF(ISNA(MATCH(F63,'Planning Bénévoles'!D$3:D$40,0))=TRUE,E62+1,E62))","v":18},"ROBERT Mireille","","",{"$f":"IF(J63=\"\",I62,IF(ISNA(MATCH(J63,'Planning Bénévoles'!E$3:E$40,0))=TRUE,I62+1,I62))","v":6},"ROBERT Mireille","","",{"$f":"IF(N63=\"\",M62,IF(ISNA(MATCH(N63,'Planning Bénévoles'!F$3:F$40,0))=TRUE,M62+1,M62))","v":4},"ROBERT Mireille","","",{"$f":"IF(R63=\"\",Q62,IF(ISNA(MATCH(R63,'Planning Bénévoles'!G$3:G$40,0))=TRUE,Q62+1,Q62))","v":8},"ROBERT Mireille","","",{"$f":"IF(V63=\"\",U62,IF(ISNA(MATCH(V63,'Planning Bénévoles'!H$3:H$40,0))=TRUE,U62+1,U62))","v":4},"ROBERT Mireille","","",{"$f":"IF(Z63=\"\",Y62,IF(ISNA(MATCH(Z63,'Planning Bénévoles'!I$3:I$40,0))=TRUE,Y62+1,Y62))","v":3},"ROBERT Mireille","","",{"$f":"IF(AD63=\"\",AC62,IF(ISNA(MATCH(AD63,'Planning Bénévoles'!J$3:J$40,0))=TRUE,AC62+1,AC62))","v":3},"ROBERT Mireille","","",{"$f":"IF(AH63=\"\",AG62,IF(ISNA(MATCH(AH63,'Planning Bénévoles'!K$3:K$40,0))=TRUE,AG62+1,AG62))","v":6},"ROBERT Mireille","","",{"$f":"IF(AL63=\"\",AK62,IF(ISNA(MATCH(AL63,'Planning Bénévoles'!L$3:L$40,0))=TRUE,AK62+1,AK62))","v":13},"ROBERT Mireille","","",{"$f":"IF(AP63=\"\",AO62,IF(ISNA(MATCH(AP63,'Planning Bénévoles'!M$3:M$40,0))=TRUE,AO62+1,AO62))","v":27},"ROBERT Mireille","","",{"$f":"IF(AT63=\"\",AS62,IF(ISNA(MATCH(AT63,'Planning Bénévoles'!N$3:N$40,0))=TRUE,AS62+1,AS62))","v":26},"ROBERT Mireille","","",{"$f":"IF(AX63=\"\",AW62,IF(ISNA(MATCH(AX63,'Planning Bénévoles'!O$3:O$40,0))=TRUE,AW62+1,AW62))","v":2},"ROBERT Mireille","","",{"$f":"IF(BB63=\"\",BA62,IF(ISNA(MATCH(BB63,'Planning Bénévoles'!P$3:P$40,0))=TRUE,BA62+1,BA62))","v":33},"ROBERT Mireille","","",{"$f":"IF(BF63=\"\",BE62,IF(ISNA(MATCH(BF63,'Planning Bénévoles'!Q$3:Q$40,0))=TRUE,BE62+1,BE62))","v":22},"ROBERT Mireille","","",{"$f":"IF(BJ63=\"\",BI62,IF(ISNA(MATCH(BJ63,'Planning Bénévoles'!R$3:R$40,0))=TRUE,BI62+1,BI62))","v":18},"ROBERT Mireille","","",{"$f":"IF(BN63=\"\",BM62,IF(ISNA(MATCH(BN63,'Planning Bénévoles'!S$3:S$40,0))=TRUE,BM62+1,BM62))","v":32},"ROBERT Mireille","","",{"$f":"IF(BR63=\"\",BQ62,IF(ISNA(MATCH(BR63,'Planning Bénévoles'!T$3:T$40,0))=TRUE,BQ62+1,BQ62))","v":29},"ROBERT Mireille","",""]
[{"$f":"IF(B64=\"\",A63,IF(ISNA(MATCH(B64,'Planning Bénévoles'!C$3:C$40,0))=TRUE,A63+1,A63))","v":13},"","","",{"$f":"IF(F64=\"\",E63,IF(ISNA(MATCH(F64,'Planning Bénévoles'!D$3:D$40,0))=TRUE,E63+1,E63))","v":18},"","","",{"$f":"IF(J64=\"\",I63,IF(ISNA(MATCH(J64,'Planning Bénévoles'!E$3:E$40,0))=TRUE,I63+1,I63))","v":6},"ROCHCONGAR Christelle","","",{"$f":"IF(N64=\"\",M63,IF(ISNA(MATCH(N64,'Planning Bénévoles'!F$3:F$40,0))=TRUE,M63+1,M63))","v":4},"","","",{"$f":"IF(R64=\"\",Q63,IF(ISNA(MATCH(R64,'Planning Bénévoles'!G$3:G$40,0))=TRUE,Q63+1,Q63))","v":8},"","","",{"$f":"IF(V64=\"\",U63,IF(ISNA(MATCH(V64,'Planning Bénévoles'!H$3:H$40,0))=TRUE,U63+1,U63))","v":4},"","","",{"$f":"IF(Z64=\"\",Y63,IF(ISNA(MATCH(Z64,'Planning Bénévoles'!I$3:I$40,0))=TRUE,Y63+1,Y63))","v":3},"ROCHCONGAR Christelle","","",{"$f":"IF(AD64=\"\",AC63,IF(ISNA(MATCH(AD64,'Planning Bénévoles'!J$3:J$40,0))=TRUE,AC63+1,AC63))","v":3},"","","",{"$f":"IF(AH64=\"\",AG63,IF(ISNA(MATCH(AH64,'Planning Bénévoles'!K$3:K$40,0))=TRUE,AG63+1,AG63))","v":6},"","","",{"$f":"IF(AL64=\"\",AK63,IF(ISNA(MATCH(AL64,'Planning Bénévoles'!L$3:L$40,0))=TRUE,AK63+1,AK63))","v":13},"","","",{"$f":"IF(AP64=\"\",AO63,IF(ISNA(MATCH(AP64,'Planning Bénévoles'!M$3:M$40,0))=TRUE,AO63+1,AO63))","v":27},"","","",{"$f":"IF(AT64=\"\",AS63,IF(ISNA(MATCH(AT64,'Planning Bénévoles'!N$3:N$40,0))=TRUE,AS63+1,AS63))","v":26},"","","",{"$f":"IF(AX64=\"\",AW63,IF(ISNA(MATCH(AX64,'Planning Bénévoles'!O$3:O$40,0))=TRUE,AW63+1,AW63))","v":2},"","","",{"$f":"IF(BB64=\"\",BA63,IF(ISNA(MATCH(BB64,'Planning Bénévoles'!P$3:P$40,0))=TRUE,BA63+1,BA63))","v":33},"","","",{"$f":"IF(BF64=\"\",BE63,IF(ISNA(MATCH(BF64,'Planning Bénévoles'!Q$3:Q$40,0))=TRUE,BE63+1,BE63))","v":22},"","","",{"$f":"IF(BJ64=\"\",BI63,IF(ISNA(MATCH(BJ64,'Planning Bénévoles'!R$3:R$40,0))=TRUE,BI63+1,BI63))","v":18},"","","",{"$f":"IF(BN64=\"\",BM63,IF(ISNA(MATCH(BN64,'Planning Bénévoles'!S$3:S$40,0))=TRUE,BM63+1,BM63))","v":32},"","","",{"$f":"IF(BR64=\"\",BQ63,IF(ISNA(MATCH(BR64,'Planning Bénévoles'!T$3:T$40,0))=TRUE,BQ63+1,BQ63))","v":30},"ROCHCONGAR Christelle","",""]
[{"$f":"IF(B65=\"\",A64,IF(ISNA(MATCH(B65,'Planning Bénévoles'!C$3:C$40,0))=TRUE,A64+1,A64))","v":13},"","","",{"$f":"IF(F65=\"\",E64,IF(ISNA(MATCH(F65,'Planning Bénévoles'!D$3:D$40,0))=TRUE,E64+1,E64))","v":18},"","","",{"$f":"IF(J65=\"\",I64,IF(ISNA(MATCH(J65,'Planning Bénévoles'!E$3:E$40,0))=TRUE,I64+1,I64))","v":6},"","","",{"$f":"IF(N65=\"\",M64,IF(ISNA(MATCH(N65,'Planning Bénévoles'!F$3:F$40,0))=TRUE,M64+1,M64))","v":4},"","","",{"$f":"IF(R65=\"\",Q64,IF(ISNA(MATCH(R65,'Planning Bénévoles'!G$3:G$40,0))=TRUE,Q64+1,Q64))","v":8},"","","",{"$f":"IF(V65=\"\",U64,IF(ISNA(MATCH(V65,'Planning Bénévoles'!H$3:H$40,0))=TRUE,U64+1,U64))","v":5},"ROUAT Manon","","",{"$f":"IF(Z65=\"\",Y64,IF(ISNA(MATCH(Z65,'Planning Bénévoles'!I$3:I$40,0))=TRUE,Y64+1,Y64))","v":3},"","","",{"$f":"IF(AD65=\"\",AC64,IF(ISNA(MATCH(AD65,'Planning Bénévoles'!J$3:J$40,0))=TRUE,AC64+1,AC64))","v":3},"","","",{"$f":"IF(AH65=\"\",AG64,IF(ISNA(MATCH(AH65,'Planning Bénévoles'!K$3:K$40,0))=TRUE,AG64+1,AG64))","v":6},"","","",{"$f":"IF(AL65=\"\",AK64,IF(ISNA(MATCH(AL65,'Planning Bénévoles'!L$3:L$40,0))=TRUE,AK64+1,AK64))","v":13},"","","",{"$f":"IF(AP65=\"\",AO64,IF(ISNA(MATCH(AP65,'Planning Bénévoles'!M$3:M$40,0))=TRUE,AO64+1,AO64))","v":27},"","","",{"$f":"IF(AT65=\"\",AS64,IF(ISNA(MATCH(AT65,'Planning Bénévoles'!N$3:N$40,0))=TRUE,AS64+1,AS64))","v":27},"ROUAT Manon","","",{"$f":"IF(AX65=\"\",AW64,IF(ISNA(MATCH(AX65,'Planning Bénévoles'!O$3:O$40,0))=TRUE,AW64+1,AW64))","v":2},"","","",{"$f":"IF(BB65=\"\",BA64,IF(ISNA(MATCH(BB65,'Planning Bénévoles'!P$3:P$40,0))=TRUE,BA64+1,BA64))","v":33},"","","",{"$f":"IF(BF65=\"\",BE64,IF(ISNA(MATCH(BF65,'Planning Bénévoles'!Q$3:Q$40,0))=TRUE,BE64+1,BE64))","v":23},"ROUAT Manon","","",{"$f":"IF(BJ65=\"\",BI64,IF(ISNA(MATCH(BJ65,'Planning Bénévoles'!R$3:R$40,0))=TRUE,BI64+1,BI64))","v":18},"","","",{"$f":"IF(BN65=\"\",BM64,IF(ISNA(MATCH(BN65,'Planning Bénévoles'!S$3:S$40,0))=TRUE,BM64+1,BM64))","v":32},"","","",{"$f":"IF(BR65=\"\",BQ64,IF(ISNA(MATCH(BR65,'Planning Bénévoles'!T$3:T$40,0))=TRUE,BQ64+1,BQ64))","v":30},"","",""]
[{"$f":"IF(B66=\"\",A65,IF(ISNA(MATCH(B66,'Planning Bénévoles'!C$3:C$40,0))=TRUE,A65+1,A65))","v":13},"ROUGER Olga","","",{"$f":"IF(F66=\"\",E65,IF(ISNA(MATCH(F66,'Planning Bénévoles'!D$3:D$40,0))=TRUE,E65+1,E65))","v":18},"ROUGER Olga","","",{"$f":"IF(J66=\"\",I65,IF(ISNA(MATCH(J66,'Planning Bénévoles'!E$3:E$40,0))=TRUE,I65+1,I65))","v":6},"ROUGER Olga","","",{"$f":"IF(N66=\"\",M65,IF(ISNA(MATCH(N66,'Planning Bénévoles'!F$3:F$40,0))=TRUE,M65+1,M65))","v":4},"ROUGER Olga","","",{"$f":"IF(R66=\"\",Q65,IF(ISNA(MATCH(R66,'Planning Bénévoles'!G$3:G$40,0))=TRUE,Q65+1,Q65))","v":8},"ROUGER Olga","","",{"$f":"IF(V66=\"\",U65,IF(ISNA(MATCH(V66,'Planning Bénévoles'!H$3:H$40,0))=TRUE,U65+1,U65))","v":5},"ROUGER Olga","","",{"$f":"IF(Z66=\"\",Y65,IF(ISNA(MATCH(Z66,'Planning Bénévoles'!I$3:I$40,0))=TRUE,Y65+1,Y65))","v":3},"ROUGER Olga","","",{"$f":"IF(AD66=\"\",AC65,IF(ISNA(MATCH(AD66,'Planning Bénévoles'!J$3:J$40,0))=TRUE,AC65+1,AC65))","v":3},"ROUGER Olga","","",{"$f":"IF(AH66=\"\",AG65,IF(ISNA(MATCH(AH66,'Planning Bénévoles'!K$3:K$40,0))=TRUE,AG65+1,AG65))","v":6},"ROUGER Olga","","",{"$f":"IF(AL66=\"\",AK65,IF(ISNA(MATCH(AL66,'Planning Bénévoles'!L$3:L$40,0))=TRUE,AK65+1,AK65))","v":14},"ROUGER Olga","","",{"$f":"IF(AP66=\"\",AO65,IF(ISNA(MATCH(AP66,'Planning Bénévoles'!M$3:M$40,0))=TRUE,AO65+1,AO65))","v":28},"ROUGER Olga","","",{"$f":"IF(AT66=\"\",AS65,IF(ISNA(MATCH(AT66,'Planning Bénévoles'!N$3:N$40,0))=TRUE,AS65+1,AS65))","v":28},"ROUGER Olga","","",{"$f":"IF(AX66=\"\",AW65,IF(ISNA(MATCH(AX66,'Planning Bénévoles'!O$3:O$40,0))=TRUE,AW65+1,AW65))","v":2},"ROUGER Olga","","",{"$f":"IF(BB66=\"\",BA65,IF(ISNA(MATCH(BB66,'Planning Bénévoles'!P$3:P$40,0))=TRUE,BA65+1,BA65))","v":34},"ROUGER Olga","","",{"$f":"IF(BF66=\"\",BE65,IF(ISNA(MATCH(BF66,'Planning Bénévoles'!Q$3:Q$40,0))=TRUE,BE65+1,BE65))","v":24},"ROUGER Olga","","",{"$f":"IF(BJ66=\"\",BI65,IF(ISNA(MATCH(BJ66,'Planning Bénévoles'!R$3:R$40,0))=TRUE,BI65+1,BI65))","v":19},"ROUGER Olga","","",{"$f":"IF(BN66=\"\",BM65,IF(ISNA(MATCH(BN66,'Planning Bénévoles'!S$3:S$40,0))=TRUE,BM65+1,BM65))","v":33},"ROUGER Olga","","",{"$f":"IF(BR66=\"\",BQ65,IF(ISNA(MATCH(BR66,'Planning Bénévoles'!T$3:T$40,0))=TRUE,BQ65+1,BQ65))","v":31},"ROUGER Olga","",""]
[{"$f":"IF(B67=\"\",A66,IF(ISNA(MATCH(B67,'Planning Bénévoles'!C$3:C$40,0))=TRUE,A66+1,A66))","v":13},"","","",{"$f":"IF(F67=\"\",E66,IF(ISNA(MATCH(F67,'Planning Bénévoles'!D$3:D$40,0))=TRUE,E66+1,E66))","v":18},"","","",{"$f":"IF(J67=\"\",I66,IF(ISNA(MATCH(J67,'Planning Bénévoles'!E$3:E$40,0))=TRUE,I66+1,I66))","v":6},"SANS Loïs","","",{"$f":"IF(N67=\"\",M66,IF(ISNA(MATCH(N67,'Planning Bénévoles'!F$3:F$40,0))=TRUE,M66+1,M66))","v":4},"","","",{"$f":"IF(R67=\"\",Q66,IF(ISNA(MATCH(R67,'Planning Bénévoles'!G$3:G$40,0))=TRUE,Q66+1,Q66))","v":8},"","","",{"$f":"IF(V67=\"\",U66,IF(ISNA(MATCH(V67,'Planning Bénévoles'!H$3:H$40,0))=TRUE,U66+1,U66))","v":5},"","","",{"$f":"IF(Z67=\"\",Y66,IF(ISNA(MATCH(Z67,'Planning Bénévoles'!I$3:I$40,0))=TRUE,Y66+1,Y66))","v":3},"","","",{"$f":"IF(AD67=\"\",AC66,IF(ISNA(MATCH(AD67,'Planning Bénévoles'!J$3:J$40,0))=TRUE,AC66+1,AC66))","v":3},"","","",{"$f":"IF(AH67=\"\",AG66,IF(ISNA(MATCH(AH67,'Planning Bénévoles'!K$3:K$40,0))=TRUE,AG66+1,AG66))","v":6},"SANS Loïs","","",{"$f":"IF(AL67=\"\",AK66,IF(ISNA(MATCH(AL67,'Planning Bénévoles'!L$3:L$40,0))=TRUE,AK66+1,AK66))","v":14},"","","",{"$f":"IF(AP67=\"\",AO66,IF(ISNA(MATCH(AP67,'Planning Bénévoles'!M$3:M$40,0))=TRUE,AO66+1,AO66))","v":28},"","","",{"$f":"IF(AT67=\"\",AS66,IF(ISNA(MATCH(AT67,'Planning Bénévoles'!N$3:N$40,0))=TRUE,AS66+1,AS66))","v":28},"","","",{"$f":"IF(AX67=\"\",AW66,IF(ISNA(MATCH(AX67,'Planning Bénévoles'!O$3:O$40,0))=TRUE,AW66+1,AW66))","v":2},"","","",{"$f":"IF(BB67=\"\",BA66,IF(ISNA(MATCH(BB67,'Planning Bénévoles'!P$3:P$40,0))=TRUE,BA66+1,BA66))","v":34},"","","",{"$f":"IF(BF67=\"\",BE66,IF(ISNA(MATCH(BF67,'Planning Bénévoles'!Q$3:Q$40,0))=TRUE,BE66+1,BE66))","v":25},"SANS Loïs","","",{"$f":"IF(BJ67=\"\",BI66,IF(ISNA(MATCH(BJ67,'Planning Bénévoles'!R$3:R$40,0))=TRUE,BI66+1,BI66))","v":19},"","","",{"$f":"IF(BN67=\"\",BM66,IF(ISNA(MATCH(BN67,'Planning Bénévoles'!S$3:S$40,0))=TRUE,BM66+1,BM66))","v":33},"","","",{"$f":"IF(BR67=\"\",BQ66,IF(ISNA(MATCH(BR67,'Planning Bénévoles'!T$3:T$40,0))=TRUE,BQ66+1,BQ66))","v":31},"","",""]
[{"$f":"IF(B68=\"\",A67,IF(ISNA(MATCH(B68,'Planning Bénévoles'!C$3:C$40,0))=TRUE,A67+1,A67))","v":14},"STRUILLOU (K) Charlotte","","",{"$f":"IF(F68=\"\",E67,IF(ISNA(MATCH(F68,'Planning Bénévoles'!D$3:D$40,0))=TRUE,E67+1,E67))","v":19},"STRUILLOU (K) Charlotte","","",{"$f":"IF(J68=\"\",I67,IF(ISNA(MATCH(J68,'Planning Bénévoles'!E$3:E$40,0))=TRUE,I67+1,I67))","v":6},"","","",{"$f":"IF(N68=\"\",M67,IF(ISNA(MATCH(N68,'Planning Bénévoles'!F$3:F$40,0))=TRUE,M67+1,M67))","v":4},"STRUILLOU (K) Charlotte","","",{"$f":"IF(R68=\"\",Q67,IF(ISNA(MATCH(R68,'Planning Bénévoles'!G$3:G$40,0))=TRUE,Q67+1,Q67))","v":8},"STRUILLOU (K) Charlotte","","",{"$f":"IF(V68=\"\",U67,IF(ISNA(MATCH(V68,'Planning Bénévoles'!H$3:H$40,0))=TRUE,U67+1,U67))","v":5},"","","",{"$f":"IF(Z68=\"\",Y67,IF(ISNA(MATCH(Z68,'Planning Bénévoles'!I$3:I$40,0))=TRUE,Y67+1,Y67))","v":3},"","","",{"$f":"IF(AD68=\"\",AC67,IF(ISNA(MATCH(AD68,'Planning Bénévoles'!J$3:J$40,0))=TRUE,AC67+1,AC67))","v":3},"","","",{"$f":"IF(AH68=\"\",AG67,IF(ISNA(MATCH(AH68,'Planning Bénévoles'!K$3:K$40,0))=TRUE,AG67+1,AG67))","v":6},"","","",{"$f":"IF(AL68=\"\",AK67,IF(ISNA(MATCH(AL68,'Planning Bénévoles'!L$3:L$40,0))=TRUE,AK67+1,AK67))","v":14},"","","",{"$f":"IF(AP68=\"\",AO67,IF(ISNA(MATCH(AP68,'Planning Bénévoles'!M$3:M$40,0))=TRUE,AO67+1,AO67))","v":28},"","","",{"$f":"IF(AT68=\"\",AS67,IF(ISNA(MATCH(AT68,'Planning Bénévoles'!N$3:N$40,0))=TRUE,AS67+1,AS67))","v":28},"","","",{"$f":"IF(AX68=\"\",AW67,IF(ISNA(MATCH(AX68,'Planning Bénévoles'!O$3:O$40,0))=TRUE,AW67+1,AW67))","v":2},"","","",{"$f":"IF(BB68=\"\",BA67,IF(ISNA(MATCH(BB68,'Planning Bénévoles'!P$3:P$40,0))=TRUE,BA67+1,BA67))","v":34},"","","",{"$f":"IF(BF68=\"\",BE67,IF(ISNA(MATCH(BF68,'Planning Bénévoles'!Q$3:Q$40,0))=TRUE,BE67+1,BE67))","v":25},"","","",{"$f":"IF(BJ68=\"\",BI67,IF(ISNA(MATCH(BJ68,'Planning Bénévoles'!R$3:R$40,0))=TRUE,BI67+1,BI67))","v":19},"","",{"$f":"IF($BK68>\"a\",1,\"\")","v":""},{"$f":"IF(BN68=\"\",BM67,IF(ISNA(MATCH(BN68,'Planning Bénévoles'!S$3:S$40,0))=TRUE,BM67+1,BM67))","v":33},"","","",{"$f":"IF(BR68=\"\",BQ67,IF(ISNA(MATCH(BR68,'Planning Bénévoles'!T$3:T$40,0))=TRUE,BQ67+1,BQ67))","v":31},"","",""]
[{"$f":"IF(B69=\"\",A68,IF(ISNA(MATCH(B69,'Planning Bénévoles'!C$3:C$40,0))=TRUE,A68+1,A68))","v":14},"","",{"$f":"IF($C69>\"a\",1,\"\")","v":""},{"$f":"IF(F69=\"\",E68,IF(ISNA(MATCH(F69,'Planning Bénévoles'!D$3:D$40,0))=TRUE,E68+1,E68))","v":19},"","",{"$f":"IF($G69>\"a\",1,\"\")","v":""},{"$f":"IF(J69=\"\",I68,IF(ISNA(MATCH(J69,'Planning Bénévoles'!E$3:E$40,0))=TRUE,I68+1,I68))","v":6},"","",{"$f":"IF($K69>\"a\",1,\"\")","v":""},{"$f":"IF(N69=\"\",M68,IF(ISNA(MATCH(N69,'Planning Bénévoles'!F$3:F$40,0))=TRUE,M68+1,M68))","v":4},"","",{"$f":"IF($O69>\"a\",1,\"\")","v":""},{"$f":"IF(R69=\"\",Q68,IF(ISNA(MATCH(R69,'Planning Bénévoles'!G$3:G$40,0))=TRUE,Q68+1,Q68))","v":8},"","",{"$f":"IF($S69>\"a\",1,\"\")","v":""},{"$f":"IF(V69=\"\",U68,IF(ISNA(MATCH(V69,'Planning Bénévoles'!H$3:H$40,0))=TRUE,U68+1,U68))","v":5},"","",{"$f":"IF($W69>\"a\",1,\"\")","v":""},{"$f":"IF(Z69=\"\",Y68,IF(ISNA(MATCH(Z69,'Planning Bénévoles'!I$3:I$40,0))=TRUE,Y68+1,Y68))","v":3},"","",{"$f":"IF($AA69>\"a\",1,\"\")","v":""},{"$f":"IF(AD69=\"\",AC68,IF(ISNA(MATCH(AD69,'Planning Bénévoles'!J$3:J$40,0))=TRUE,AC68+1,AC68))","v":3},"","",{"$f":"IF($AE69>\"a\",1,\"\")","v":""},{"$f":"IF(AH69=\"\",AG68,IF(ISNA(MATCH(AH69,'Planning Bénévoles'!K$3:K$40,0))=TRUE,AG68+1,AG68))","v":6},"","",{"$f":"IF($AI69>\"a\",1,\"\")","v":""},{"$f":"IF(AL69=\"\",AK68,IF(ISNA(MATCH(AL69,'Planning Bénévoles'!L$3:L$40,0))=TRUE,AK68+1,AK68))","v":14},"","",{"$f":"IF($AM69>\"a\",1,\"\")","v":""},{"$f":"IF(AP69=\"\",AO68,IF(ISNA(MATCH(AP69,'Planning Bénévoles'!M$3:M$40,0))=TRUE,AO68+1,AO68))","v":28},"","",{"$f":"IF($AQ69>\"a\",1,\"\")","v":""},{"$f":"IF(AT69=\"\",AS68,IF(ISNA(MATCH(AT69,'Planning Bénévoles'!N$3:N$40,0))=TRUE,AS68+1,AS68))","v":28},"","",{"$f":"IF($AU69>\"a\",1,\"\")","v":""},{"$f":"IF(AX69=\"\",AW68,IF(ISNA(MATCH(AX69,'Planning Bénévoles'!O$3:O$40,0))=TRUE,AW68+1,AW68))","v":2},"","",{"$f":"IF($AY69>\"a\",1,\"\")","v":""},{"$f":"IF(BB69=\"\",BA68,IF(ISNA(MATCH(BB69,'Planning Bénévoles'!P$3:P$40,0))=TRUE,BA68+1,BA68))","v":34},"","",{"$f":"IF($BC69>\"a\",1,\"\")","v":""},{"$f":"IF(BF69=\"\",BE68,IF(ISNA(MATCH(BF69,'Planning Bénévoles'!Q$3:Q$40,0))=TRUE,BE68+1,BE68))","v":26},"TALLEC-GORAGUER Clara","",{"$f":"IF($BG69>\"a\",1,\"\")","v":""},{"$f":"IF(BJ69=\"\",BI68,IF(ISNA(MATCH(BJ69,'Planning Bénévoles'!R$3:R$40,0))=TRUE,BI68+1,BI68))","v":20},"TALLEC-GORAGUER Clara","","",{"$f":"IF(BN69=\"\",BM68,IF(ISNA(MATCH(BN69,'Planning Bénévoles'!S$3:S$40,0))=TRUE,BM68+1,BM68))","v":34},"TALLEC-GORAGUER Clara","",{"$f":"IF($BO69>\"a\",1,\"\")","v":""},{"$f":"IF(BR69=\"\",BQ68,IF(ISNA(MATCH(BR69,'Planning Bénévoles'!T$3:T$40,0))=TRUE,BQ68+1,BQ68))","v":32},"TALLEC-GORAGUER Clara","",""]
[{"$f":"IF(B70=\"\",A69,IF(ISNA(MATCH(B70,'Planning Bénévoles'!C$3:C$40,0))=TRUE,A69+1,A69))","v":14},"TANGUY Bob",{"$f":"IFERROR(INDEX(B$5:B$104,MATCH(ROW()-4,A$5:A$104,0),1),\"\")","v":""},"",{"$f":"IF(F70=\"\",E69,IF(ISNA(MATCH(F70,'Planning Bénévoles'!D$3:D$40,0))=TRUE,E69+1,E69))","v":19},"TANGUY Bob",{"$f":"IFERROR(INDEX(F$5:F$104,MATCH(ROW()-4,E$5:E$104,0),1),\"\")","v":""},"",{"$f":"IF(J70=\"\",I69,IF(ISNA(MATCH(J70,'Planning Bénévoles'!E$3:E$40,0))=TRUE,I69+1,I69))","v":6},"TANGUY Bob",{"$f":"IFERROR(INDEX(J$5:J$104,MATCH(ROW()-4,I$5:I$104,0),1),\"\")","v":""},"",{"$f":"IF(N70=\"\",M69,IF(ISNA(MATCH(N70,'Planning Bénévoles'!F$3:F$40,0))=TRUE,M69+1,M69))","v":4},"TANGUY Bob",{"$f":"IFERROR(INDEX(N$5:N$104,MATCH(ROW()-4,M$5:M$104,0),1),\"\")","v":""},"",{"$f":"IF(R70=\"\",Q69,IF(ISNA(MATCH(R70,'Planning Bénévoles'!G$3:G$40,0))=TRUE,Q69+1,Q69))","v":8},"TANGUY Bob",{"$f":"IFERROR(INDEX(R$5:R$104,MATCH(ROW()-4,Q$5:Q$104,0),1),\"\")","v":""},"",{"$f":"IF(V70=\"\",U69,IF(ISNA(MATCH(V70,'Planning Bénévoles'!H$3:H$40,0))=TRUE,U69+1,U69))","v":5},"TANGUY Bob",{"$f":"IFERROR(INDEX(V$5:V$104,MATCH(ROW()-4,U$5:U$104,0),1),\"\")","v":""},"",{"$f":"IF(Z70=\"\",Y69,IF(ISNA(MATCH(Z70,'Planning Bénévoles'!I$3:I$40,0))=TRUE,Y69+1,Y69))","v":3},"TANGUY Bob",{"$f":"IFERROR(INDEX(Z$5:Z$104,MATCH(ROW()-4,Y$5:Y$104,0),1),\"\")","v":""},"",{"$f":"IF(AD70=\"\",AC69,IF(ISNA(MATCH(AD70,'Planning Bénévoles'!J$3:J$40,0))=TRUE,AC69+1,AC69))","v":3},"TANGUY Bob",{"$f":"IFERROR(INDEX(AD$5:AD$104,MATCH(ROW()-4,AC$5:AC$104,0),1),\"\")","v":""},"",{"$f":"IF(AH70=\"\",AG69,IF(ISNA(MATCH(AH70,'Planning Bénévoles'!K$3:K$40,0))=TRUE,AG69+1,AG69))","v":6},"TANGUY Bob",{"$f":"IFERROR(INDEX(AH$5:AH$104,MATCH(ROW()-4,AG$5:AG$104,0),1),\"\")","v":""},"",{"$f":"IF(AL70=\"\",AK69,IF(ISNA(MATCH(AL70,'Planning Bénévoles'!L$3:L$40,0))=TRUE,AK69+1,AK69))","v":15},"TANGUY Bob",{"$f":"IFERROR(INDEX(AL$5:AL$104,MATCH(ROW()-4,AK$5:AK$104,0),1),\"\")","v":""},"",{"$f":"IF(AP70=\"\",AO69,IF(ISNA(MATCH(AP70,'Planning Bénévoles'!M$3:M$40,0))=TRUE,AO69+1,AO69))","v":29},"TANGUY Bob",{"$f":"IFERROR(INDEX(AP$5:AP$104,MATCH(ROW()-4,AO$5:AO$104,0),1),\"\")","v":""},"",{"$f":"IF(AT70=\"\",AS69,IF(ISNA(MATCH(AT70,'Planning Bénévoles'!N$3:N$40,0))=TRUE,AS69+1,AS69))","v":29},"TANGUY Bob",{"$f":"IFERROR(INDEX(AT$5:AT$104,MATCH(ROW()-4,AS$5:AS$104,0),1),\"\")","v":""},"",{"$f":"IF(AX70=\"\",AW69,IF(ISNA(MATCH(AX70,'Planning Bénévoles'!O$3:O$40,0))=TRUE,AW69+1,AW69))","v":2},"",{"$f":"IFERROR(INDEX(AX$5:AX$104,MATCH(ROW()-4,AW$5:AW$104,0),1),\"\")","v":""},"",{"$f":"IF(BB70=\"\",BA69,IF(ISNA(MATCH(BB70,'Planning Bénévoles'!P$3:P$40,0))=TRUE,BA69+1,BA69))","v":35},"TANGUY Bob",{"$f":"IFERROR(INDEX(BB$5:BB$104,MATCH(ROW()-4,BA$5:BA$104,0),1),\"\")","v":""},"",{"$f":"IF(BF70=\"\",BE69,IF(ISNA(MATCH(BF70,'Planning Bénévoles'!Q$3:Q$40,0))=TRUE,BE69+1,BE69))","v":27},"TANGUY Bob",{"$f":"IFERROR(INDEX(BF$5:BF$104,MATCH(ROW()-4,BE$5:BE$104,0),1),\"\")","v":""},"",{"$f":"IF(BJ70=\"\",BI69,IF(ISNA(MATCH(BJ70,'Planning Bénévoles'!R$3:R$40,0))=TRUE,BI69+1,BI69))","v":20},"",{"$f":"IFERROR(INDEX(BJ$5:BJ$104,MATCH(ROW()-4,BI$5:BI$104,0),1),\"\")","v":""},"",{"$f":"IF(BN70=\"\",BM69,IF(ISNA(MATCH(BN70,'Planning Bénévoles'!S$3:S$40,0))=TRUE,BM69+1,BM69))","v":35},"TANGUY Bob",{"$f":"IFERROR(INDEX(BN$5:BN$104,MATCH(ROW()-4,BM$5:BM$104,0),1),\"\")","v":""},"",{"$f":"IF(BR70=\"\",BQ69,IF(ISNA(MATCH(BR70,'Planning Bénévoles'!T$3:T$40,0))=TRUE,BQ69+1,BQ69))","v":33},"TANGUY Bob",{"$f":"IFERROR(INDEX(BR$5:BR$104,MATCH(ROW()-4,BQ$5:BQ$104,0),1),\"\")","v":""},{"$f":"IF($BS70>\"a\",1,\"\")","v":""}]
[{"$f":"IF(B71=\"\",A70,IF(ISNA(MATCH(B71,'Planning Bénévoles'!C$3:C$40,0))=TRUE,A70+1,A70))","v":14},"","","",{"$f":"IF(F71=\"\",E70,IF(ISNA(MATCH(F71,'Planning Bénévoles'!D$3:D$40,0))=TRUE,E70+1,E70))","v":19},"","","",{"$f":"IF(J71=\"\",I70,IF(ISNA(MATCH(J71,'Planning Bénévoles'!E$3:E$40,0))=TRUE,I70+1,I70))","v":6},"","","",{"$f":"IF(N71=\"\",M70,IF(ISNA(MATCH(N71,'Planning Bénévoles'!F$3:F$40,0))=TRUE,M70+1,M70))","v":4},"","","",{"$f":"IF(R71=\"\",Q70,IF(ISNA(MATCH(R71,'Planning Bénévoles'!G$3:G$40,0))=TRUE,Q70+1,Q70))","v":8},"","","",{"$f":"IF(V71=\"\",U70,IF(ISNA(MATCH(V71,'Planning Bénévoles'!H$3:H$40,0))=TRUE,U70+1,U70))","v":6},"TARHAN Yeliz","","",{"$f":"IF(Z71=\"\",Y70,IF(ISNA(MATCH(Z71,'Planning Bénévoles'!I$3:I$40,0))=TRUE,Y70+1,Y70))","v":3},"","","",{"$f":"IF(AD71=\"\",AC70,IF(ISNA(MATCH(AD71,'Planning Bénévoles'!J$3:J$40,0))=TRUE,AC70+1,AC70))","v":3},"","","",{"$f":"IF(AH71=\"\",AG70,IF(ISNA(MATCH(AH71,'Planning Bénévoles'!K$3:K$40,0))=TRUE,AG70+1,AG70))","v":7},"TARHAN Yeliz","","",{"$f":"IF(AL71=\"\",AK70,IF(ISNA(MATCH(AL71,'Planning Bénévoles'!L$3:L$40,0))=TRUE,AK70+1,AK70))","v":15},"","","",{"$f":"IF(AP71=\"\",AO70,IF(ISNA(MATCH(AP71,'Planning Bénévoles'!M$3:M$40,0))=TRUE,AO70+1,AO70))","v":29},"","","",{"$f":"IF(AT71=\"\",AS70,IF(ISNA(MATCH(AT71,'Planning Bénévoles'!N$3:N$40,0))=TRUE,AS70+1,AS70))","v":29},"","","",{"$f":"IF(AX71=\"\",AW70,IF(ISNA(MATCH(AX71,'Planning Bénévoles'!O$3:O$40,0))=TRUE,AW70+1,AW70))","v":2},"","","",{"$f":"IF(BB71=\"\",BA70,IF(ISNA(MATCH(BB71,'Planning Bénévoles'!P$3:P$40,0))=TRUE,BA70+1,BA70))","v":35},"","","",{"$f":"IF(BF71=\"\",BE70,IF(ISNA(MATCH(BF71,'Planning Bénévoles'!Q$3:Q$40,0))=TRUE,BE70+1,BE70))","v":27},"","","",{"$f":"IF(BJ71=\"\",BI70,IF(ISNA(MATCH(BJ71,'Planning Bénévoles'!R$3:R$40,0))=TRUE,BI70+1,BI70))","v":20},"","","",{"$f":"IF(BN71=\"\",BM70,IF(ISNA(MATCH(BN71,'Planning Bénévoles'!S$3:S$40,0))=TRUE,BM70+1,BM70))","v":35},"","","",{"$f":"IF(BR71=\"\",BQ70,IF(ISNA(MATCH(BR71,'Planning Bénévoles'!T$3:T$40,0))=TRUE,BQ70+1,BQ70))","v":33},"","",""]
[{"$f":"IF(B72=\"\",A71,IF(ISNA(MATCH(B72,'Planning Bénévoles'!C$3:C$40,0))=TRUE,A71+1,A71))","v":14},"","","",{"$f":"IF(F72=\"\",E71,IF(ISNA(MATCH(F72,'Planning Bénévoles'!D$3:D$40,0))=TRUE,E71+1,E71))","v":19},"","","",{"$f":"IF(J72=\"\",I71,IF(ISNA(MATCH(J72,'Planning Bénévoles'!E$3:E$40,0))=TRUE,I71+1,I71))","v":6},"","","",{"$f":"IF(N72=\"\",M71,IF(ISNA(MATCH(N72,'Planning Bénévoles'!F$3:F$40,0))=TRUE,M71+1,M71))","v":4},"","","",{"$f":"IF(R72=\"\",Q71,IF(ISNA(MATCH(R72,'Planning Bénévoles'!G$3:G$40,0))=TRUE,Q71+1,Q71))","v":8},"","","",{"$f":"IF(V72=\"\",U71,IF(ISNA(MATCH(V72,'Planning Bénévoles'!H$3:H$40,0))=TRUE,U71+1,U71))","v":7},"THEME Sophie","","",{"$f":"IF(Z72=\"\",Y71,IF(ISNA(MATCH(Z72,'Planning Bénévoles'!I$3:I$40,0))=TRUE,Y71+1,Y71))","v":3},"","","",{"$f":"IF(AD72=\"\",AC71,IF(ISNA(MATCH(AD72,'Planning Bénévoles'!J$3:J$40,0))=TRUE,AC71+1,AC71))","v":3},"","","",{"$f":"IF(AH72=\"\",AG71,IF(ISNA(MATCH(AH72,'Planning Bénévoles'!K$3:K$40,0))=TRUE,AG71+1,AG71))","v":7},"","","",{"$f":"IF(AL72=\"\",AK71,IF(ISNA(MATCH(AL72,'Planning Bénévoles'!L$3:L$40,0))=TRUE,AK71+1,AK71))","v":15},"","","",{"$f":"IF(AP72=\"\",AO71,IF(ISNA(MATCH(AP72,'Planning Bénévoles'!M$3:M$40,0))=TRUE,AO71+1,AO71))","v":29},"","","",{"$f":"IF(AT72=\"\",AS71,IF(ISNA(MATCH(AT72,'Planning Bénévoles'!N$3:N$40,0))=TRUE,AS71+1,AS71))","v":30},"THEME Sophie","","",{"$f":"IF(AX72=\"\",AW71,IF(ISNA(MATCH(AX72,'Planning Bénévoles'!O$3:O$40,0))=TRUE,AW71+1,AW71))","v":2},"","","",{"$f":"IF(BB72=\"\",BA71,IF(ISNA(MATCH(BB72,'Planning Bénévoles'!P$3:P$40,0))=TRUE,BA71+1,BA71))","v":35},"","","",{"$f":"IF(BF72=\"\",BE71,IF(ISNA(MATCH(BF72,'Planning Bénévoles'!Q$3:Q$40,0))=TRUE,BE71+1,BE71))","v":28},"THEME Sophie","","",{"$f":"IF(BJ72=\"\",BI71,IF(ISNA(MATCH(BJ72,'Planning Bénévoles'!R$3:R$40,0))=TRUE,BI71+1,BI71))","v":20},"","","",{"$f":"IF(BN72=\"\",BM71,IF(ISNA(MATCH(BN72,'Planning Bénévoles'!S$3:S$40,0))=TRUE,BM71+1,BM71))","v":35},"","","",{"$f":"IF(BR72=\"\",BQ71,IF(ISNA(MATCH(BR72,'Planning Bénévoles'!T$3:T$40,0))=TRUE,BQ71+1,BQ71))","v":33},"","",""]
[{"$f":"IF(B73=\"\",A72,IF(ISNA(MATCH(B73,'Planning Bénévoles'!C$3:C$40,0))=TRUE,A72+1,A72))","v":14},"TROBOE Marcel","","",{"$f":"IF(F73=\"\",E72,IF(ISNA(MATCH(F73,'Planning Bénévoles'!D$3:D$40,0))=TRUE,E72+1,E72))","v":19},"TROBOE Marcel","","",{"$f":"IF(J73=\"\",I72,IF(ISNA(MATCH(J73,'Planning Bénévoles'!E$3:E$40,0))=TRUE,I72+1,I72))","v":6},"","","",{"$f":"IF(N73=\"\",M72,IF(ISNA(MATCH(N73,'Planning Bénévoles'!F$3:F$40,0))=TRUE,M72+1,M72))","v":4},"TROBOE Marcel","","",{"$f":"IF(R73=\"\",Q72,IF(ISNA(MATCH(R73,'Planning Bénévoles'!G$3:G$40,0))=TRUE,Q72+1,Q72))","v":8},"TROBOE Marcel","","",{"$f":"IF(V73=\"\",U72,IF(ISNA(MATCH(V73,'Planning Bénévoles'!H$3:H$40,0))=TRUE,U72+1,U72))","v":7},"","","",{"$f":"IF(Z73=\"\",Y72,IF(ISNA(MATCH(Z73,'Planning Bénévoles'!I$3:I$40,0))=TRUE,Y72+1,Y72))","v":3},"TROBOE Marcel","","",{"$f":"IF(AD73=\"\",AC72,IF(ISNA(MATCH(AD73,'Planning Bénévoles'!J$3:J$40,0))=TRUE,AC72+1,AC72))","v":3},"TROBOE Marcel","","",{"$f":"IF(AH73=\"\",AG72,IF(ISNA(MATCH(AH73,'Planning Bénévoles'!K$3:K$40,0))=TRUE,AG72+1,AG72))","v":7},"","","",{"$f":"IF(AL73=\"\",AK72,IF(ISNA(MATCH(AL73,'Planning Bénévoles'!L$3:L$40,0))=TRUE,AK72+1,AK72))","v":16},"TROBOE Marcel","","",{"$f":"IF(AP73=\"\",AO72,IF(ISNA(MATCH(AP73,'Planning Bénévoles'!M$3:M$40,0))=TRUE,AO72+1,AO72))","v":30},"TROBOE Marcel","","",{"$f":"IF(AT73=\"\",AS72,IF(ISNA(MATCH(AT73,'Planning Bénévoles'!N$3:N$40,0))=TRUE,AS72+1,AS72))","v":30},"","","",{"$f":"IF(AX73=\"\",AW72,IF(ISNA(MATCH(AX73,'Planning Bénévoles'!O$3:O$40,0))=TRUE,AW72+1,AW72))","v":2},"TROBOE Marcel","","",{"$f":"IF(BB73=\"\",BA72,IF(ISNA(MATCH(BB73,'Planning Bénévoles'!P$3:P$40,0))=TRUE,BA72+1,BA72))","v":36},"TROBOE Marcel","","",{"$f":"IF(BF73=\"\",BE72,IF(ISNA(MATCH(BF73,'Planning Bénévoles'!Q$3:Q$40,0))=TRUE,BE72+1,BE72))","v":28},"","","",{"$f":"IF(BJ73=\"\",BI72,IF(ISNA(MATCH(BJ73,'Planning Bénévoles'!R$3:R$40,0))=TRUE,BI72+1,BI72))","v":21},"TROBOE Marcel","","",{"$f":"IF(BN73=\"\",BM72,IF(ISNA(MATCH(BN73,'Planning Bénévoles'!S$3:S$40,0))=TRUE,BM72+1,BM72))","v":36},"TROBOE Marcel","","",{"$f":"IF(BR73=\"\",BQ72,IF(ISNA(MATCH(BR73,'Planning Bénévoles'!T$3:T$40,0))=TRUE,BQ72+1,BQ72))","v":34},"TROBOE Marcel","",""]
[{"$f":"IF(B74=\"\",A73,IF(ISNA(MATCH(B74,'Planning Bénévoles'!C$3:C$40,0))=TRUE,A73+1,A73))","v":14},"","","",{"$f":"IF(F74=\"\",E73,IF(ISNA(MATCH(F74,'Planning Bénévoles'!D$3:D$40,0))=TRUE,E73+1,E73))","v":19},"","","",{"$f":"IF(J74=\"\",I73,IF(ISNA(MATCH(J74,'Planning Bénévoles'!E$3:E$40,0))=TRUE,I73+1,I73))","v":6},"","","",{"$f":"IF(N74=\"\",M73,IF(ISNA(MATCH(N74,'Planning Bénévoles'!F$3:F$40,0))=TRUE,M73+1,M73))","v":4},"","","",{"$f":"IF(R74=\"\",Q73,IF(ISNA(MATCH(R74,'Planning Bénévoles'!G$3:G$40,0))=TRUE,Q73+1,Q73))","v":8},"","","",{"$f":"IF(V74=\"\",U73,IF(ISNA(MATCH(V74,'Planning Bénévoles'!H$3:H$40,0))=TRUE,U73+1,U73))","v":7},"WOJCIK Eulalie","","",{"$f":"IF(Z74=\"\",Y73,IF(ISNA(MATCH(Z74,'Planning Bénévoles'!I$3:I$40,0))=TRUE,Y73+1,Y73))","v":3},"","","",{"$f":"IF(AD74=\"\",AC73,IF(ISNA(MATCH(AD74,'Planning Bénévoles'!J$3:J$40,0))=TRUE,AC73+1,AC73))","v":3},"","","",{"$f":"IF(AH74=\"\",AG73,IF(ISNA(MATCH(AH74,'Planning Bénévoles'!K$3:K$40,0))=TRUE,AG73+1,AG73))","v":7},"","","",{"$f":"IF(AL74=\"\",AK73,IF(ISNA(MATCH(AL74,'Planning Bénévoles'!L$3:L$40,0))=TRUE,AK73+1,AK73))","v":16},"","","",{"$f":"IF(AP74=\"\",AO73,IF(ISNA(MATCH(AP74,'Planning Bénévoles'!M$3:M$40,0))=TRUE,AO73+1,AO73))","v":30},"","","",{"$f":"IF(AT74=\"\",AS73,IF(ISNA(MATCH(AT74,'Planning Bénévoles'!N$3:N$40,0))=TRUE,AS73+1,AS73))","v":31},"WOJCIK Eulalie","","",{"$f":"IF(AX74=\"\",AW73,IF(ISNA(MATCH(AX74,'Planning Bénévoles'!O$3:O$40,0))=TRUE,AW73+1,AW73))","v":2},"","","",{"$f":"IF(BB74=\"\",BA73,IF(ISNA(MATCH(BB74,'Planning Bénévoles'!P$3:P$40,0))=TRUE,BA73+1,BA73))","v":36},"","","",{"$f":"IF(BF74=\"\",BE73,IF(ISNA(MATCH(BF74,'Planning Bénévoles'!Q$3:Q$40,0))=TRUE,BE73+1,BE73))","v":29},"WOJCIK Eulalie","","",{"$f":"IF(BJ74=\"\",BI73,IF(ISNA(MATCH(BJ74,'Planning Bénévoles'!R$3:R$40,0))=TRUE,BI73+1,BI73))","v":21},"","","",{"$f":"IF(BN74=\"\",BM73,IF(ISNA(MATCH(BN74,'Planning Bénévoles'!S$3:S$40,0))=TRUE,BM73+1,BM73))","v":37},"WOJCIK Eulalie","","",{"$f":"IF(BR74=\"\",BQ73,IF(ISNA(MATCH(BR74,'Planning Bénévoles'!T$3:T$40,0))=TRUE,BQ73+1,BQ73))","v":34},"","",""]
[{"$f":"IF(B75=\"\",A74,IF(ISNA(MATCH(B75,'Planning Bénévoles'!C$3:C$40,0))=TRUE,A74+1,A74))","v":14},"","","",{"$f":"IF(F75=\"\",E74,IF(ISNA(MATCH(F75,'Planning Bénévoles'!D$3:D$40,0))=TRUE,E74+1,E74))","v":19},"","","",{"$f":"IF(J75=\"\",I74,IF(ISNA(MATCH(J75,'Planning Bénévoles'!E$3:E$40,0))=TRUE,I74+1,I74))","v":6},"YANG Johanne","","",{"$f":"IF(N75=\"\",M74,IF(ISNA(MATCH(N75,'Planning Bénévoles'!F$3:F$40,0))=TRUE,M74+1,M74))","v":4},"","","",{"$f":"IF(R75=\"\",Q74,IF(ISNA(MATCH(R75,'Planning Bénévoles'!G$3:G$40,0))=TRUE,Q74+1,Q74))","v":8},"","","",{"$f":"IF(V75=\"\",U74,IF(ISNA(MATCH(V75,'Planning Bénévoles'!H$3:H$40,0))=TRUE,U74+1,U74))","v":8},"YANG Johanne","","",{"$f":"IF(Z75=\"\",Y74,IF(ISNA(MATCH(Z75,'Planning Bénévoles'!I$3:I$40,0))=TRUE,Y74+1,Y74))","v":3},"","","",{"$f":"IF(AD75=\"\",AC74,IF(ISNA(MATCH(AD75,'Planning Bénévoles'!J$3:J$40,0))=TRUE,AC74+1,AC74))","v":3},"","","",{"$f":"IF(AH75=\"\",AG74,IF(ISNA(MATCH(AH75,'Planning Bénévoles'!K$3:K$40,0))=TRUE,AG74+1,AG74))","v":7},"YANG Johanne","","",{"$f":"IF(AL75=\"\",AK74,IF(ISNA(MATCH(AL75,'Planning Bénévoles'!L$3:L$40,0))=TRUE,AK74+1,AK74))","v":16},"","","",{"$f":"IF(AP75=\"\",AO74,IF(ISNA(MATCH(AP75,'Planning Bénévoles'!M$3:M$40,0))=TRUE,AO74+1,AO74))","v":30},"","","",{"$f":"IF(AT75=\"\",AS74,IF(ISNA(MATCH(AT75,'Planning Bénévoles'!N$3:N$40,0))=TRUE,AS74+1,AS74))","v":32},"YANG Johanne","","",{"$f":"IF(AX75=\"\",AW74,IF(ISNA(MATCH(AX75,'Planning Bénévoles'!O$3:O$40,0))=TRUE,AW74+1,AW74))","v":2},"","","",{"$f":"IF(BB75=\"\",BA74,IF(ISNA(MATCH(BB75,'Planning Bénévoles'!P$3:P$40,0))=TRUE,BA74+1,BA74))","v":36},"","","",{"$f":"IF(BF75=\"\",BE74,IF(ISNA(MATCH(BF75,'Planning Bénévoles'!Q$3:Q$40,0))=TRUE,BE74+1,BE74))","v":30},"YANG Johanne","","",{"$f":"IF(BJ75=\"\",BI74,IF(ISNA(MATCH(BJ75,'Planning Bénévoles'!R$3:R$40,0))=TRUE,BI74+1,BI74))","v":21},"","","",{"$f":"IF(BN75=\"\",BM74,IF(ISNA(MATCH(BN75,'Planning Bénévoles'!S$3:S$40,0))=TRUE,BM74+1,BM74))","v":38},"YANG Johanne","","",{"$f":"IF(BR75=\"\",BQ74,IF(ISNA(MATCH(BR75,'Planning Bénévoles'!T$3:T$40,0))=TRUE,BQ74+1,BQ74))","v":35},"YANG Johanne","",""]
[{"$f":"IF(B76=\"\",A75,IF(ISNA(MATCH(B76,'Planning Bénévoles'!C$3:C$40,0))=TRUE,A75+1,A75))","v":14},"","","",{"$f":"IF(F76=\"\",E75,IF(ISNA(MATCH(F76,'Planning Bénévoles'!D$3:D$40,0))=TRUE,E75+1,E75))","v":19},"","","",{"$f":"IF(J76=\"\",I75,IF(ISNA(MATCH(J76,'Planning Bénévoles'!E$3:E$40,0))=TRUE,I75+1,I75))","v":6},"","","",{"$f":"IF(N76=\"\",M75,IF(ISNA(MATCH(N76,'Planning Bénévoles'!F$3:F$40,0))=TRUE,M75+1,M75))","v":4},"","","",{"$f":"IF(R76=\"\",Q75,IF(ISNA(MATCH(R76,'Planning Bénévoles'!G$3:G$40,0))=TRUE,Q75+1,Q75))","v":8},"","","",{"$f":"IF(V76=\"\",U75,IF(ISNA(MATCH(V76,'Planning Bénévoles'!H$3:H$40,0))=TRUE,U75+1,U75))","v":8},"","","",{"$f":"IF(Z76=\"\",Y75,IF(ISNA(MATCH(Z76,'Planning Bénévoles'!I$3:I$40,0))=TRUE,Y75+1,Y75))","v":3},"","","",{"$f":"IF(AD76=\"\",AC75,IF(ISNA(MATCH(AD76,'Planning Bénévoles'!J$3:J$40,0))=TRUE,AC75+1,AC75))","v":3},"","","",{"$f":"IF(AH76=\"\",AG75,IF(ISNA(MATCH(AH76,'Planning Bénévoles'!K$3:K$40,0))=TRUE,AG75+1,AG75))","v":7},"","","",{"$f":"IF(AL76=\"\",AK75,IF(ISNA(MATCH(AL76,'Planning Bénévoles'!L$3:L$40,0))=TRUE,AK75+1,AK75))","v":16},"","","",{"$f":"IF(AP76=\"\",AO75,IF(ISNA(MATCH(AP76,'Planning Bénévoles'!M$3:M$40,0))=TRUE,AO75+1,AO75))","v":30},"","","",{"$f":"IF(AT76=\"\",AS75,IF(ISNA(MATCH(AT76,'Planning Bénévoles'!N$3:N$40,0))=TRUE,AS75+1,AS75))","v":32},"","","",{"$f":"IF(AX76=\"\",AW75,IF(ISNA(MATCH(AX76,'Planning Bénévoles'!O$3:O$40,0))=TRUE,AW75+1,AW75))","v":2},"","","",{"$f":"IF(BB76=\"\",BA75,IF(ISNA(MATCH(BB76,'Planning Bénévoles'!P$3:P$40,0))=TRUE,BA75+1,BA75))","v":36},"","","",{"$f":"IF(BF76=\"\",BE75,IF(ISNA(MATCH(BF76,'Planning Bénévoles'!Q$3:Q$40,0))=TRUE,BE75+1,BE75))","v":30},"","","",{"$f":"IF(BJ76=\"\",BI75,IF(ISNA(MATCH(BJ76,'Planning Bénévoles'!R$3:R$40,0))=TRUE,BI75+1,BI75))","v":21},"","","",{"$f":"IF(BN76=\"\",BM75,IF(ISNA(MATCH(BN76,'Planning Bénévoles'!S$3:S$40,0))=TRUE,BM75+1,BM75))","v":38},"","","",{"$f":"IF(BR76=\"\",BQ75,IF(ISNA(MATCH(BR76,'Planning Bénévoles'!T$3:T$40,0))=TRUE,BQ75+1,BQ75))","v":35},"","",""]
[{"$f":"IF(B77=\"\",A76,IF(ISNA(MATCH(B77,'Planning Bénévoles'!C$3:C$40,0))=TRUE,A76+1,A76))","v":14},"","","",{"$f":"IF(F77=\"\",E76,IF(ISNA(MATCH(F77,'Planning Bénévoles'!D$3:D$40,0))=TRUE,E76+1,E76))","v":19},"","","",{"$f":"IF(J77=\"\",I76,IF(ISNA(MATCH(J77,'Planning Bénévoles'!E$3:E$40,0))=TRUE,I76+1,I76))","v":6},"","","",{"$f":"IF(N77=\"\",M76,IF(ISNA(MATCH(N77,'Planning Bénévoles'!F$3:F$40,0))=TRUE,M76+1,M76))","v":4},"","","",{"$f":"IF(R77=\"\",Q76,IF(ISNA(MATCH(R77,'Planning Bénévoles'!G$3:G$40,0))=TRUE,Q76+1,Q76))","v":8},"","","",{"$f":"IF(V77=\"\",U76,IF(ISNA(MATCH(V77,'Planning Bénévoles'!H$3:H$40,0))=TRUE,U76+1,U76))","v":8},"","","",{"$f":"IF(Z77=\"\",Y76,IF(ISNA(MATCH(Z77,'Planning Bénévoles'!I$3:I$40,0))=TRUE,Y76+1,Y76))","v":3},"","","",{"$f":"IF(AD77=\"\",AC76,IF(ISNA(MATCH(AD77,'Planning Bénévoles'!J$3:J$40,0))=TRUE,AC76+1,AC76))","v":3},"","","",{"$f":"IF(AH77=\"\",AG76,IF(ISNA(MATCH(AH77,'Planning Bénévoles'!K$3:K$40,0))=TRUE,AG76+1,AG76))","v":7},"","","",{"$f":"IF(AL77=\"\",AK76,IF(ISNA(MATCH(AL77,'Planning Bénévoles'!L$3:L$40,0))=TRUE,AK76+1,AK76))","v":16},"","","",{"$f":"IF(AP77=\"\",AO76,IF(ISNA(MATCH(AP77,'Planning Bénévoles'!M$3:M$40,0))=TRUE,AO76+1,AO76))","v":30},"","","",{"$f":"IF(AT77=\"\",AS76,IF(ISNA(MATCH(AT77,'Planning Bénévoles'!N$3:N$40,0))=TRUE,AS76+1,AS76))","v":32},"","","",{"$f":"IF(AX77=\"\",AW76,IF(ISNA(MATCH(AX77,'Planning Bénévoles'!O$3:O$40,0))=TRUE,AW76+1,AW76))","v":2},"","","",{"$f":"IF(BB77=\"\",BA76,IF(ISNA(MATCH(BB77,'Planning Bénévoles'!P$3:P$40,0))=TRUE,BA76+1,BA76))","v":36},"","","",{"$f":"IF(BF77=\"\",BE76,IF(ISNA(MATCH(BF77,'Planning Bénévoles'!Q$3:Q$40,0))=TRUE,BE76+1,BE76))","v":30},"","","",{"$f":"IF(BJ77=\"\",BI76,IF(ISNA(MATCH(BJ77,'Planning Bénévoles'!R$3:R$40,0))=TRUE,BI76+1,BI76))","v":21},"","","",{"$f":"IF(BN77=\"\",BM76,IF(ISNA(MATCH(BN77,'Planning Bénévoles'!S$3:S$40,0))=TRUE,BM76+1,BM76))","v":38},"","","",{"$f":"IF(BR77=\"\",BQ76,IF(ISNA(MATCH(BR77,'Planning Bénévoles'!T$3:T$40,0))=TRUE,BQ76+1,BQ76))","v":35},"","",""]
[{"$f":"IF(B78=\"\",A77,IF(ISNA(MATCH(B78,'Planning Bénévoles'!C$3:C$40,0))=TRUE,A77+1,A77))","v":14},"","","",{"$f":"IF(F78=\"\",E77,IF(ISNA(MATCH(F78,'Planning Bénévoles'!D$3:D$40,0))=TRUE,E77+1,E77))","v":19},"","","",{"$f":"IF(J78=\"\",I77,IF(ISNA(MATCH(J78,'Planning Bénévoles'!E$3:E$40,0))=TRUE,I77+1,I77))","v":6},"","","",{"$f":"IF(N78=\"\",M77,IF(ISNA(MATCH(N78,'Planning Bénévoles'!F$3:F$40,0))=TRUE,M77+1,M77))","v":4},"","","",{"$f":"IF(R78=\"\",Q77,IF(ISNA(MATCH(R78,'Planning Bénévoles'!G$3:G$40,0))=TRUE,Q77+1,Q77))","v":8},"","","",{"$f":"IF(V78=\"\",U77,IF(ISNA(MATCH(V78,'Planning Bénévoles'!H$3:H$40,0))=TRUE,U77+1,U77))","v":8},"","","",{"$f":"IF(Z78=\"\",Y77,IF(ISNA(MATCH(Z78,'Planning Bénévoles'!I$3:I$40,0))=TRUE,Y77+1,Y77))","v":3},"","","",{"$f":"IF(AD78=\"\",AC77,IF(ISNA(MATCH(AD78,'Planning Bénévoles'!J$3:J$40,0))=TRUE,AC77+1,AC77))","v":3},"","","",{"$f":"IF(AH78=\"\",AG77,IF(ISNA(MATCH(AH78,'Planning Bénévoles'!K$3:K$40,0))=TRUE,AG77+1,AG77))","v":7},"","","",{"$f":"IF(AL78=\"\",AK77,IF(ISNA(MATCH(AL78,'Planning Bénévoles'!L$3:L$40,0))=TRUE,AK77+1,AK77))","v":16},"","","",{"$f":"IF(AP78=\"\",AO77,IF(ISNA(MATCH(AP78,'Planning Bénévoles'!M$3:M$40,0))=TRUE,AO77+1,AO77))","v":30},"","","",{"$f":"IF(AT78=\"\",AS77,IF(ISNA(MATCH(AT78,'Planning Bénévoles'!N$3:N$40,0))=TRUE,AS77+1,AS77))","v":32},"","","",{"$f":"IF(AX78=\"\",AW77,IF(ISNA(MATCH(AX78,'Planning Bénévoles'!O$3:O$40,0))=TRUE,AW77+1,AW77))","v":2},"","","",{"$f":"IF(BB78=\"\",BA77,IF(ISNA(MATCH(BB78,'Planning Bénévoles'!P$3:P$40,0))=TRUE,BA77+1,BA77))","v":36},"","","",{"$f":"IF(BF78=\"\",BE77,IF(ISNA(MATCH(BF78,'Planning Bénévoles'!Q$3:Q$40,0))=TRUE,BE77+1,BE77))","v":30},"","","",{"$f":"IF(BJ78=\"\",BI77,IF(ISNA(MATCH(BJ78,'Planning Bénévoles'!R$3:R$40,0))=TRUE,BI77+1,BI77))","v":21},"","","",{"$f":"IF(BN78=\"\",BM77,IF(ISNA(MATCH(BN78,'Planning Bénévoles'!S$3:S$40,0))=TRUE,BM77+1,BM77))","v":38},"","","",{"$f":"IF(BR78=\"\",BQ77,IF(ISNA(MATCH(BR78,'Planning Bénévoles'!T$3:T$40,0))=TRUE,BQ77+1,BQ77))","v":35},"","",""]
[{"$f":"IF(B79=\"\",A78,IF(ISNA(MATCH(B79,'Planning Bénévoles'!C$3:C$40,0))=TRUE,A78+1,A78))","v":14},"","","",{"$f":"IF(F79=\"\",E78,IF(ISNA(MATCH(F79,'Planning Bénévoles'!D$3:D$40,0))=TRUE,E78+1,E78))","v":19},"","","",{"$f":"IF(J79=\"\",I78,IF(ISNA(MATCH(J79,'Planning Bénévoles'!E$3:E$40,0))=TRUE,I78+1,I78))","v":6},"","","",{"$f":"IF(N79=\"\",M78,IF(ISNA(MATCH(N79,'Planning Bénévoles'!F$3:F$40,0))=TRUE,M78+1,M78))","v":4},"","","",{"$f":"IF(R79=\"\",Q78,IF(ISNA(MATCH(R79,'Planning Bénévoles'!G$3:G$40,0))=TRUE,Q78+1,Q78))","v":8},"","","",{"$f":"IF(V79=\"\",U78,IF(ISNA(MATCH(V79,'Planning Bénévoles'!H$3:H$40,0))=TRUE,U78+1,U78))","v":8},"","","",{"$f":"IF(Z79=\"\",Y78,IF(ISNA(MATCH(Z79,'Planning Bénévoles'!I$3:I$40,0))=TRUE,Y78+1,Y78))","v":3},"","","",{"$f":"IF(AD79=\"\",AC78,IF(ISNA(MATCH(AD79,'Planning Bénévoles'!J$3:J$40,0))=TRUE,AC78+1,AC78))","v":3},"","","",{"$f":"IF(AH79=\"\",AG78,IF(ISNA(MATCH(AH79,'Planning Bénévoles'!K$3:K$40,0))=TRUE,AG78+1,AG78))","v":7},"","","",{"$f":"IF(AL79=\"\",AK78,IF(ISNA(MATCH(AL79,'Planning Bénévoles'!L$3:L$40,0))=TRUE,AK78+1,AK78))","v":16},"","","",{"$f":"IF(AP79=\"\",AO78,IF(ISNA(MATCH(AP79,'Planning Bénévoles'!M$3:M$40,0))=TRUE,AO78+1,AO78))","v":30},"","","",{"$f":"IF(AT79=\"\",AS78,IF(ISNA(MATCH(AT79,'Planning Bénévoles'!N$3:N$40,0))=TRUE,AS78+1,AS78))","v":32},"","","",{"$f":"IF(AX79=\"\",AW78,IF(ISNA(MATCH(AX79,'Planning Bénévoles'!O$3:O$40,0))=TRUE,AW78+1,AW78))","v":2},"","","",{"$f":"IF(BB79=\"\",BA78,IF(ISNA(MATCH(BB79,'Planning Bénévoles'!P$3:P$40,0))=TRUE,BA78+1,BA78))","v":36},"","","",{"$f":"IF(BF79=\"\",BE78,IF(ISNA(MATCH(BF79,'Planning Bénévoles'!Q$3:Q$40,0))=TRUE,BE78+1,BE78))","v":30},"","","",{"$f":"IF(BJ79=\"\",BI78,IF(ISNA(MATCH(BJ79,'Planning Bénévoles'!R$3:R$40,0))=TRUE,BI78+1,BI78))","v":21},"","","",{"$f":"IF(BN79=\"\",BM78,IF(ISNA(MATCH(BN79,'Planning Bénévoles'!S$3:S$40,0))=TRUE,BM78+1,BM78))","v":38},"","","",{"$f":"IF(BR79=\"\",BQ78,IF(ISNA(MATCH(BR79,'Planning Bénévoles'!T$3:T$40,0))=TRUE,BQ78+1,BQ78))","v":35},"","",""]
[{"$f":"IF(B80=\"\",A79,IF(ISNA(MATCH(B80,'Planning Bénévoles'!C$3:C$40,0))=TRUE,A79+1,A79))","v":14},"","","",{"$f":"IF(F80=\"\",E79,IF(ISNA(MATCH(F80,'Planning Bénévoles'!D$3:D$40,0))=TRUE,E79+1,E79))","v":19},"","","",{"$f":"IF(J80=\"\",I79,IF(ISNA(MATCH(J80,'Planning Bénévoles'!E$3:E$40,0))=TRUE,I79+1,I79))","v":6},"","","",{"$f":"IF(N80=\"\",M79,IF(ISNA(MATCH(N80,'Planning Bénévoles'!F$3:F$40,0))=TRUE,M79+1,M79))","v":4},"","","",{"$f":"IF(R80=\"\",Q79,IF(ISNA(MATCH(R80,'Planning Bénévoles'!G$3:G$40,0))=TRUE,Q79+1,Q79))","v":8},"","","",{"$f":"IF(V80=\"\",U79,IF(ISNA(MATCH(V80,'Planning Bénévoles'!H$3:H$40,0))=TRUE,U79+1,U79))","v":8},"","","",{"$f":"IF(Z80=\"\",Y79,IF(ISNA(MATCH(Z80,'Planning Bénévoles'!I$3:I$40,0))=TRUE,Y79+1,Y79))","v":3},"","","",{"$f":"IF(AD80=\"\",AC79,IF(ISNA(MATCH(AD80,'Planning Bénévoles'!J$3:J$40,0))=TRUE,AC79+1,AC79))","v":3},"","","",{"$f":"IF(AH80=\"\",AG79,IF(ISNA(MATCH(AH80,'Planning Bénévoles'!K$3:K$40,0))=TRUE,AG79+1,AG79))","v":7},"","","",{"$f":"IF(AL80=\"\",AK79,IF(ISNA(MATCH(AL80,'Planning Bénévoles'!L$3:L$40,0))=TRUE,AK79+1,AK79))","v":16},"","","",{"$f":"IF(AP80=\"\",AO79,IF(ISNA(MATCH(AP80,'Planning Bénévoles'!M$3:M$40,0))=TRUE,AO79+1,AO79))","v":30},"","","",{"$f":"IF(AT80=\"\",AS79,IF(ISNA(MATCH(AT80,'Planning Bénévoles'!N$3:N$40,0))=TRUE,AS79+1,AS79))","v":32},"","","",{"$f":"IF(AX80=\"\",AW79,IF(ISNA(MATCH(AX80,'Planning Bénévoles'!O$3:O$40,0))=TRUE,AW79+1,AW79))","v":2},"","","",{"$f":"IF(BB80=\"\",BA79,IF(ISNA(MATCH(BB80,'Planning Bénévoles'!P$3:P$40,0))=TRUE,BA79+1,BA79))","v":36},"","","",{"$f":"IF(BF80=\"\",BE79,IF(ISNA(MATCH(BF80,'Planning Bénévoles'!Q$3:Q$40,0))=TRUE,BE79+1,BE79))","v":30},"","","",{"$f":"IF(BJ80=\"\",BI79,IF(ISNA(MATCH(BJ80,'Planning Bénévoles'!R$3:R$40,0))=TRUE,BI79+1,BI79))","v":21},"","","",{"$f":"IF(BN80=\"\",BM79,IF(ISNA(MATCH(BN80,'Planning Bénévoles'!S$3:S$40,0))=TRUE,BM79+1,BM79))","v":38},"","","",{"$f":"IF(BR80=\"\",BQ79,IF(ISNA(MATCH(BR80,'Planning Bénévoles'!T$3:T$40,0))=TRUE,BQ79+1,BQ79))","v":35},"","",""]
[{"$f":"IF(B81=\"\",A80,IF(ISNA(MATCH(B81,'Planning Bénévoles'!C$3:C$40,0))=TRUE,A80+1,A80))","v":14},"","","",{"$f":"IF(F81=\"\",E80,IF(ISNA(MATCH(F81,'Planning Bénévoles'!D$3:D$40,0))=TRUE,E80+1,E80))","v":19},"","","",{"$f":"IF(J81=\"\",I80,IF(ISNA(MATCH(J81,'Planning Bénévoles'!E$3:E$40,0))=TRUE,I80+1,I80))","v":6},"","","",{"$f":"IF(N81=\"\",M80,IF(ISNA(MATCH(N81,'Planning Bénévoles'!F$3:F$40,0))=TRUE,M80+1,M80))","v":4},"","","",{"$f":"IF(R81=\"\",Q80,IF(ISNA(MATCH(R81,'Planning Bénévoles'!G$3:G$40,0))=TRUE,Q80+1,Q80))","v":8},"","","",{"$f":"IF(V81=\"\",U80,IF(ISNA(MATCH(V81,'Planning Bénévoles'!H$3:H$40,0))=TRUE,U80+1,U80))","v":8},"","","",{"$f":"IF(Z81=\"\",Y80,IF(ISNA(MATCH(Z81,'Planning Bénévoles'!I$3:I$40,0))=TRUE,Y80+1,Y80))","v":3},"","","",{"$f":"IF(AD81=\"\",AC80,IF(ISNA(MATCH(AD81,'Planning Bénévoles'!J$3:J$40,0))=TRUE,AC80+1,AC80))","v":3},"","","",{"$f":"IF(AH81=\"\",AG80,IF(ISNA(MATCH(AH81,'Planning Bénévoles'!K$3:K$40,0))=TRUE,AG80+1,AG80))","v":7},"","","",{"$f":"IF(AL81=\"\",AK80,IF(ISNA(MATCH(AL81,'Planning Bénévoles'!L$3:L$40,0))=TRUE,AK80+1,AK80))","v":16},"","","",{"$f":"IF(AP81=\"\",AO80,IF(ISNA(MATCH(AP81,'Planning Bénévoles'!M$3:M$40,0))=TRUE,AO80+1,AO80))","v":30},"","","",{"$f":"IF(AT81=\"\",AS80,IF(ISNA(MATCH(AT81,'Planning Bénévoles'!N$3:N$40,0))=TRUE,AS80+1,AS80))","v":32},"","","",{"$f":"IF(AX81=\"\",AW80,IF(ISNA(MATCH(AX81,'Planning Bénévoles'!O$3:O$40,0))=TRUE,AW80+1,AW80))","v":2},"","","",{"$f":"IF(BB81=\"\",BA80,IF(ISNA(MATCH(BB81,'Planning Bénévoles'!P$3:P$40,0))=TRUE,BA80+1,BA80))","v":36},"","","",{"$f":"IF(BF81=\"\",BE80,IF(ISNA(MATCH(BF81,'Planning Bénévoles'!Q$3:Q$40,0))=TRUE,BE80+1,BE80))","v":30},"","","",{"$f":"IF(BJ81=\"\",BI80,IF(ISNA(MATCH(BJ81,'Planning Bénévoles'!R$3:R$40,0))=TRUE,BI80+1,BI80))","v":21},"","","",{"$f":"IF(BN81=\"\",BM80,IF(ISNA(MATCH(BN81,'Planning Bénévoles'!S$3:S$40,0))=TRUE,BM80+1,BM80))","v":38},"","","",{"$f":"IF(BR81=\"\",BQ80,IF(ISNA(MATCH(BR81,'Planning Bénévoles'!T$3:T$40,0))=TRUE,BQ80+1,BQ80))","v":35},"","",""]
[{"$f":"IF(B82=\"\",A81,IF(ISNA(MATCH(B82,'Planning Bénévoles'!C$3:C$40,0))=TRUE,A81+1,A81))","v":14},"","","",{"$f":"IF(F82=\"\",E81,IF(ISNA(MATCH(F82,'Planning Bénévoles'!D$3:D$40,0))=TRUE,E81+1,E81))","v":19},"","","",{"$f":"IF(J82=\"\",I81,IF(ISNA(MATCH(J82,'Planning Bénévoles'!E$3:E$40,0))=TRUE,I81+1,I81))","v":6},"","","",{"$f":"IF(N82=\"\",M81,IF(ISNA(MATCH(N82,'Planning Bénévoles'!F$3:F$40,0))=TRUE,M81+1,M81))","v":4},"","","",{"$f":"IF(R82=\"\",Q81,IF(ISNA(MATCH(R82,'Planning Bénévoles'!G$3:G$40,0))=TRUE,Q81+1,Q81))","v":8},"","","",{"$f":"IF(V82=\"\",U81,IF(ISNA(MATCH(V82,'Planning Bénévoles'!H$3:H$40,0))=TRUE,U81+1,U81))","v":8},"","","",{"$f":"IF(Z82=\"\",Y81,IF(ISNA(MATCH(Z82,'Planning Bénévoles'!I$3:I$40,0))=TRUE,Y81+1,Y81))","v":3},"","","",{"$f":"IF(AD82=\"\",AC81,IF(ISNA(MATCH(AD82,'Planning Bénévoles'!J$3:J$40,0))=TRUE,AC81+1,AC81))","v":3},"","","",{"$f":"IF(AH82=\"\",AG81,IF(ISNA(MATCH(AH82,'Planning Bénévoles'!K$3:K$40,0))=TRUE,AG81+1,AG81))","v":7},"","","",{"$f":"IF(AL82=\"\",AK81,IF(ISNA(MATCH(AL82,'Planning Bénévoles'!L$3:L$40,0))=TRUE,AK81+1,AK81))","v":16},"","","",{"$f":"IF(AP82=\"\",AO81,IF(ISNA(MATCH(AP82,'Planning Bénévoles'!M$3:M$40,0))=TRUE,AO81+1,AO81))","v":30},"","","",{"$f":"IF(AT82=\"\",AS81,IF(ISNA(MATCH(AT82,'Planning Bénévoles'!N$3:N$40,0))=TRUE,AS81+1,AS81))","v":32},"","","",{"$f":"IF(AX82=\"\",AW81,IF(ISNA(MATCH(AX82,'Planning Bénévoles'!O$3:O$40,0))=TRUE,AW81+1,AW81))","v":2},"","","",{"$f":"IF(BB82=\"\",BA81,IF(ISNA(MATCH(BB82,'Planning Bénévoles'!P$3:P$40,0))=TRUE,BA81+1,BA81))","v":36},"","","",{"$f":"IF(BF82=\"\",BE81,IF(ISNA(MATCH(BF82,'Planning Bénévoles'!Q$3:Q$40,0))=TRUE,BE81+1,BE81))","v":30},"","","",{"$f":"IF(BJ82=\"\",BI81,IF(ISNA(MATCH(BJ82,'Planning Bénévoles'!R$3:R$40,0))=TRUE,BI81+1,BI81))","v":21},"","","",{"$f":"IF(BN82=\"\",BM81,IF(ISNA(MATCH(BN82,'Planning Bénévoles'!S$3:S$40,0))=TRUE,BM81+1,BM81))","v":38},"","","",{"$f":"IF(BR82=\"\",BQ81,IF(ISNA(MATCH(BR82,'Planning Bénévoles'!T$3:T$40,0))=TRUE,BQ81+1,BQ81))","v":35},"","",""]
[{"$f":"IF(B83=\"\",A82,IF(ISNA(MATCH(B83,'Planning Bénévoles'!C$3:C$40,0))=TRUE,A82+1,A82))","v":14},"","","",{"$f":"IF(F83=\"\",E82,IF(ISNA(MATCH(F83,'Planning Bénévoles'!D$3:D$40,0))=TRUE,E82+1,E82))","v":19},"","","",{"$f":"IF(J83=\"\",I82,IF(ISNA(MATCH(J83,'Planning Bénévoles'!E$3:E$40,0))=TRUE,I82+1,I82))","v":6},"","","",{"$f":"IF(N83=\"\",M82,IF(ISNA(MATCH(N83,'Planning Bénévoles'!F$3:F$40,0))=TRUE,M82+1,M82))","v":4},"","","",{"$f":"IF(R83=\"\",Q82,IF(ISNA(MATCH(R83,'Planning Bénévoles'!G$3:G$40,0))=TRUE,Q82+1,Q82))","v":8},"","","",{"$f":"IF(V83=\"\",U82,IF(ISNA(MATCH(V83,'Planning Bénévoles'!H$3:H$40,0))=TRUE,U82+1,U82))","v":8},"","","",{"$f":"IF(Z83=\"\",Y82,IF(ISNA(MATCH(Z83,'Planning Bénévoles'!I$3:I$40,0))=TRUE,Y82+1,Y82))","v":3},"","","",{"$f":"IF(AD83=\"\",AC82,IF(ISNA(MATCH(AD83,'Planning Bénévoles'!J$3:J$40,0))=TRUE,AC82+1,AC82))","v":3},"","","",{"$f":"IF(AH83=\"\",AG82,IF(ISNA(MATCH(AH83,'Planning Bénévoles'!K$3:K$40,0))=TRUE,AG82+1,AG82))","v":7},"","","",{"$f":"IF(AL83=\"\",AK82,IF(ISNA(MATCH(AL83,'Planning Bénévoles'!L$3:L$40,0))=TRUE,AK82+1,AK82))","v":16},"","","",{"$f":"IF(AP83=\"\",AO82,IF(ISNA(MATCH(AP83,'Planning Bénévoles'!M$3:M$40,0))=TRUE,AO82+1,AO82))","v":30},"","","",{"$f":"IF(AT83=\"\",AS82,IF(ISNA(MATCH(AT83,'Planning Bénévoles'!N$3:N$40,0))=TRUE,AS82+1,AS82))","v":32},"","","",{"$f":"IF(AX83=\"\",AW82,IF(ISNA(MATCH(AX83,'Planning Bénévoles'!O$3:O$40,0))=TRUE,AW82+1,AW82))","v":2},"","","",{"$f":"IF(BB83=\"\",BA82,IF(ISNA(MATCH(BB83,'Planning Bénévoles'!P$3:P$40,0))=TRUE,BA82+1,BA82))","v":36},"","","",{"$f":"IF(BF83=\"\",BE82,IF(ISNA(MATCH(BF83,'Planning Bénévoles'!Q$3:Q$40,0))=TRUE,BE82+1,BE82))","v":30},"","","",{"$f":"IF(BJ83=\"\",BI82,IF(ISNA(MATCH(BJ83,'Planning Bénévoles'!R$3:R$40,0))=TRUE,BI82+1,BI82))","v":21},"","","",{"$f":"IF(BN83=\"\",BM82,IF(ISNA(MATCH(BN83,'Planning Bénévoles'!S$3:S$40,0))=TRUE,BM82+1,BM82))","v":38},"","","",{"$f":"IF(BR83=\"\",BQ82,IF(ISNA(MATCH(BR83,'Planning Bénévoles'!T$3:T$40,0))=TRUE,BQ82+1,BQ82))","v":35},"","",""]
[{"$f":"IF(B84=\"\",A83,IF(ISNA(MATCH(B84,'Planning Bénévoles'!C$3:C$40,0))=TRUE,A83+1,A83))","v":14},"","","",{"$f":"IF(F84=\"\",E83,IF(ISNA(MATCH(F84,'Planning Bénévoles'!D$3:D$40,0))=TRUE,E83+1,E83))","v":19},"","","",{"$f":"IF(J84=\"\",I83,IF(ISNA(MATCH(J84,'Planning Bénévoles'!E$3:E$40,0))=TRUE,I83+1,I83))","v":6},"","","",{"$f":"IF(N84=\"\",M83,IF(ISNA(MATCH(N84,'Planning Bénévoles'!F$3:F$40,0))=TRUE,M83+1,M83))","v":4},"","","",{"$f":"IF(R84=\"\",Q83,IF(ISNA(MATCH(R84,'Planning Bénévoles'!G$3:G$40,0))=TRUE,Q83+1,Q83))","v":8},"","","",{"$f":"IF(V84=\"\",U83,IF(ISNA(MATCH(V84,'Planning Bénévoles'!H$3:H$40,0))=TRUE,U83+1,U83))","v":8},"","","",{"$f":"IF(Z84=\"\",Y83,IF(ISNA(MATCH(Z84,'Planning Bénévoles'!I$3:I$40,0))=TRUE,Y83+1,Y83))","v":3},"","","",{"$f":"IF(AD84=\"\",AC83,IF(ISNA(MATCH(AD84,'Planning Bénévoles'!J$3:J$40,0))=TRUE,AC83+1,AC83))","v":3},"","","",{"$f":"IF(AH84=\"\",AG83,IF(ISNA(MATCH(AH84,'Planning Bénévoles'!K$3:K$40,0))=TRUE,AG83+1,AG83))","v":7},"","","",{"$f":"IF(AL84=\"\",AK83,IF(ISNA(MATCH(AL84,'Planning Bénévoles'!L$3:L$40,0))=TRUE,AK83+1,AK83))","v":16},"","","",{"$f":"IF(AP84=\"\",AO83,IF(ISNA(MATCH(AP84,'Planning Bénévoles'!M$3:M$40,0))=TRUE,AO83+1,AO83))","v":30},"","","",{"$f":"IF(AT84=\"\",AS83,IF(ISNA(MATCH(AT84,'Planning Bénévoles'!N$3:N$40,0))=TRUE,AS83+1,AS83))","v":32},"","","",{"$f":"IF(AX84=\"\",AW83,IF(ISNA(MATCH(AX84,'Planning Bénévoles'!O$3:O$40,0))=TRUE,AW83+1,AW83))","v":2},"","","",{"$f":"IF(BB84=\"\",BA83,IF(ISNA(MATCH(BB84,'Planning Bénévoles'!P$3:P$40,0))=TRUE,BA83+1,BA83))","v":36},"","","",{"$f":"IF(BF84=\"\",BE83,IF(ISNA(MATCH(BF84,'Planning Bénévoles'!Q$3:Q$40,0))=TRUE,BE83+1,BE83))","v":30},"","","",{"$f":"IF(BJ84=\"\",BI83,IF(ISNA(MATCH(BJ84,'Planning Bénévoles'!R$3:R$40,0))=TRUE,BI83+1,BI83))","v":21},"","","",{"$f":"IF(BN84=\"\",BM83,IF(ISNA(MATCH(BN84,'Planning Bénévoles'!S$3:S$40,0))=TRUE,BM83+1,BM83))","v":38},"","","",{"$f":"IF(BR84=\"\",BQ83,IF(ISNA(MATCH(BR84,'Planning Bénévoles'!T$3:T$40,0))=TRUE,BQ83+1,BQ83))","v":35},"","",""]
[{"$f":"IF(B85=\"\",A84,IF(ISNA(MATCH(B85,'Planning Bénévoles'!C$3:C$40,0))=TRUE,A84+1,A84))","v":14},"","","",{"$f":"IF(F85=\"\",E84,IF(ISNA(MATCH(F85,'Planning Bénévoles'!D$3:D$40,0))=TRUE,E84+1,E84))","v":19},"","","",{"$f":"IF(J85=\"\",I84,IF(ISNA(MATCH(J85,'Planning Bénévoles'!E$3:E$40,0))=TRUE,I84+1,I84))","v":6},"","","",{"$f":"IF(N85=\"\",M84,IF(ISNA(MATCH(N85,'Planning Bénévoles'!F$3:F$40,0))=TRUE,M84+1,M84))","v":4},"","","",{"$f":"IF(R85=\"\",Q84,IF(ISNA(MATCH(R85,'Planning Bénévoles'!G$3:G$40,0))=TRUE,Q84+1,Q84))","v":8},"","","",{"$f":"IF(V85=\"\",U84,IF(ISNA(MATCH(V85,'Planning Bénévoles'!H$3:H$40,0))=TRUE,U84+1,U84))","v":8},"","","",{"$f":"IF(Z85=\"\",Y84,IF(ISNA(MATCH(Z85,'Planning Bénévoles'!I$3:I$40,0))=TRUE,Y84+1,Y84))","v":3},"","","",{"$f":"IF(AD85=\"\",AC84,IF(ISNA(MATCH(AD85,'Planning Bénévoles'!J$3:J$40,0))=TRUE,AC84+1,AC84))","v":3},"","","",{"$f":"IF(AH85=\"\",AG84,IF(ISNA(MATCH(AH85,'Planning Bénévoles'!K$3:K$40,0))=TRUE,AG84+1,AG84))","v":7},"","","",{"$f":"IF(AL85=\"\",AK84,IF(ISNA(MATCH(AL85,'Planning Bénévoles'!L$3:L$40,0))=TRUE,AK84+1,AK84))","v":16},"","","",{"$f":"IF(AP85=\"\",AO84,IF(ISNA(MATCH(AP85,'Planning Bénévoles'!M$3:M$40,0))=TRUE,AO84+1,AO84))","v":30},"","","",{"$f":"IF(AT85=\"\",AS84,IF(ISNA(MATCH(AT85,'Planning Bénévoles'!N$3:N$40,0))=TRUE,AS84+1,AS84))","v":32},"","","",{"$f":"IF(AX85=\"\",AW84,IF(ISNA(MATCH(AX85,'Planning Bénévoles'!O$3:O$40,0))=TRUE,AW84+1,AW84))","v":2},"","","",{"$f":"IF(BB85=\"\",BA84,IF(ISNA(MATCH(BB85,'Planning Bénévoles'!P$3:P$40,0))=TRUE,BA84+1,BA84))","v":36},"","","",{"$f":"IF(BF85=\"\",BE84,IF(ISNA(MATCH(BF85,'Planning Bénévoles'!Q$3:Q$40,0))=TRUE,BE84+1,BE84))","v":30},"","","",{"$f":"IF(BJ85=\"\",BI84,IF(ISNA(MATCH(BJ85,'Planning Bénévoles'!R$3:R$40,0))=TRUE,BI84+1,BI84))","v":21},"","","",{"$f":"IF(BN85=\"\",BM84,IF(ISNA(MATCH(BN85,'Planning Bénévoles'!S$3:S$40,0))=TRUE,BM84+1,BM84))","v":38},"","","",{"$f":"IF(BR85=\"\",BQ84,IF(ISNA(MATCH(BR85,'Planning Bénévoles'!T$3:T$40,0))=TRUE,BQ84+1,BQ84))","v":35},"","",""]
[{"$f":"IF(B86=\"\",A85,IF(ISNA(MATCH(B86,'Planning Bénévoles'!C$3:C$40,0))=TRUE,A85+1,A85))","v":14},"","","",{"$f":"IF(F86=\"\",E85,IF(ISNA(MATCH(F86,'Planning Bénévoles'!D$3:D$40,0))=TRUE,E85+1,E85))","v":19},"","","",{"$f":"IF(J86=\"\",I85,IF(ISNA(MATCH(J86,'Planning Bénévoles'!E$3:E$40,0))=TRUE,I85+1,I85))","v":6},"","","",{"$f":"IF(N86=\"\",M85,IF(ISNA(MATCH(N86,'Planning Bénévoles'!F$3:F$40,0))=TRUE,M85+1,M85))","v":4},"","","",{"$f":"IF(R86=\"\",Q85,IF(ISNA(MATCH(R86,'Planning Bénévoles'!G$3:G$40,0))=TRUE,Q85+1,Q85))","v":8},"","","",{"$f":"IF(V86=\"\",U85,IF(ISNA(MATCH(V86,'Planning Bénévoles'!H$3:H$40,0))=TRUE,U85+1,U85))","v":8},"","","",{"$f":"IF(Z86=\"\",Y85,IF(ISNA(MATCH(Z86,'Planning Bénévoles'!I$3:I$40,0))=TRUE,Y85+1,Y85))","v":3},"","","",{"$f":"IF(AD86=\"\",AC85,IF(ISNA(MATCH(AD86,'Planning Bénévoles'!J$3:J$40,0))=TRUE,AC85+1,AC85))","v":3},"","","",{"$f":"IF(AH86=\"\",AG85,IF(ISNA(MATCH(AH86,'Planning Bénévoles'!K$3:K$40,0))=TRUE,AG85+1,AG85))","v":7},"","","",{"$f":"IF(AL86=\"\",AK85,IF(ISNA(MATCH(AL86,'Planning Bénévoles'!L$3:L$40,0))=TRUE,AK85+1,AK85))","v":16},"","","",{"$f":"IF(AP86=\"\",AO85,IF(ISNA(MATCH(AP86,'Planning Bénévoles'!M$3:M$40,0))=TRUE,AO85+1,AO85))","v":30},"","","",{"$f":"IF(AT86=\"\",AS85,IF(ISNA(MATCH(AT86,'Planning Bénévoles'!N$3:N$40,0))=TRUE,AS85+1,AS85))","v":32},"","","",{"$f":"IF(AX86=\"\",AW85,IF(ISNA(MATCH(AX86,'Planning Bénévoles'!O$3:O$40,0))=TRUE,AW85+1,AW85))","v":2},"","","",{"$f":"IF(BB86=\"\",BA85,IF(ISNA(MATCH(BB86,'Planning Bénévoles'!P$3:P$40,0))=TRUE,BA85+1,BA85))","v":36},"","","",{"$f":"IF(BF86=\"\",BE85,IF(ISNA(MATCH(BF86,'Planning Bénévoles'!Q$3:Q$40,0))=TRUE,BE85+1,BE85))","v":30},"","","",{"$f":"IF(BJ86=\"\",BI85,IF(ISNA(MATCH(BJ86,'Planning Bénévoles'!R$3:R$40,0))=TRUE,BI85+1,BI85))","v":21},"","","",{"$f":"IF(BN86=\"\",BM85,IF(ISNA(MATCH(BN86,'Planning Bénévoles'!S$3:S$40,0))=TRUE,BM85+1,BM85))","v":38},"","","",{"$f":"IF(BR86=\"\",BQ85,IF(ISNA(MATCH(BR86,'Planning Bénévoles'!T$3:T$40,0))=TRUE,BQ85+1,BQ85))","v":35},"","",""]
[{"$f":"IF(B87=\"\",A86,IF(ISNA(MATCH(B87,'Planning Bénévoles'!C$3:C$40,0))=TRUE,A86+1,A86))","v":14},"","","",{"$f":"IF(F87=\"\",E86,IF(ISNA(MATCH(F87,'Planning Bénévoles'!D$3:D$40,0))=TRUE,E86+1,E86))","v":19},"","","",{"$f":"IF(J87=\"\",I86,IF(ISNA(MATCH(J87,'Planning Bénévoles'!E$3:E$40,0))=TRUE,I86+1,I86))","v":6},"","","",{"$f":"IF(N87=\"\",M86,IF(ISNA(MATCH(N87,'Planning Bénévoles'!F$3:F$40,0))=TRUE,M86+1,M86))","v":4},"","","",{"$f":"IF(R87=\"\",Q86,IF(ISNA(MATCH(R87,'Planning Bénévoles'!G$3:G$40,0))=TRUE,Q86+1,Q86))","v":8},"","","",{"$f":"IF(V87=\"\",U86,IF(ISNA(MATCH(V87,'Planning Bénévoles'!H$3:H$40,0))=TRUE,U86+1,U86))","v":8},"","","",{"$f":"IF(Z87=\"\",Y86,IF(ISNA(MATCH(Z87,'Planning Bénévoles'!I$3:I$40,0))=TRUE,Y86+1,Y86))","v":3},"","","",{"$f":"IF(AD87=\"\",AC86,IF(ISNA(MATCH(AD87,'Planning Bénévoles'!J$3:J$40,0))=TRUE,AC86+1,AC86))","v":3},"","","",{"$f":"IF(AH87=\"\",AG86,IF(ISNA(MATCH(AH87,'Planning Bénévoles'!K$3:K$40,0))=TRUE,AG86+1,AG86))","v":7},"","","",{"$f":"IF(AL87=\"\",AK86,IF(ISNA(MATCH(AL87,'Planning Bénévoles'!L$3:L$40,0))=TRUE,AK86+1,AK86))","v":16},"","","",{"$f":"IF(AP87=\"\",AO86,IF(ISNA(MATCH(AP87,'Planning Bénévoles'!M$3:M$40,0))=TRUE,AO86+1,AO86))","v":30},"","","",{"$f":"IF(AT87=\"\",AS86,IF(ISNA(MATCH(AT87,'Planning Bénévoles'!N$3:N$40,0))=TRUE,AS86+1,AS86))","v":32},"","","",{"$f":"IF(AX87=\"\",AW86,IF(ISNA(MATCH(AX87,'Planning Bénévoles'!O$3:O$40,0))=TRUE,AW86+1,AW86))","v":2},"","","",{"$f":"IF(BB87=\"\",BA86,IF(ISNA(MATCH(BB87,'Planning Bénévoles'!P$3:P$40,0))=TRUE,BA86+1,BA86))","v":36},"","","",{"$f":"IF(BF87=\"\",BE86,IF(ISNA(MATCH(BF87,'Planning Bénévoles'!Q$3:Q$40,0))=TRUE,BE86+1,BE86))","v":30},"","","",{"$f":"IF(BJ87=\"\",BI86,IF(ISNA(MATCH(BJ87,'Planning Bénévoles'!R$3:R$40,0))=TRUE,BI86+1,BI86))","v":21},"","","",{"$f":"IF(BN87=\"\",BM86,IF(ISNA(MATCH(BN87,'Planning Bénévoles'!S$3:S$40,0))=TRUE,BM86+1,BM86))","v":38},"","","",{"$f":"IF(BR87=\"\",BQ86,IF(ISNA(MATCH(BR87,'Planning Bénévoles'!T$3:T$40,0))=TRUE,BQ86+1,BQ86))","v":35},"","",""]
[{"$f":"IF(B88=\"\",A87,IF(ISNA(MATCH(B88,'Planning Bénévoles'!C$3:C$40,0))=TRUE,A87+1,A87))","v":14},"","","",{"$f":"IF(F88=\"\",E87,IF(ISNA(MATCH(F88,'Planning Bénévoles'!D$3:D$40,0))=TRUE,E87+1,E87))","v":19},"","","",{"$f":"IF(J88=\"\",I87,IF(ISNA(MATCH(J88,'Planning Bénévoles'!E$3:E$40,0))=TRUE,I87+1,I87))","v":6},"","","",{"$f":"IF(N88=\"\",M87,IF(ISNA(MATCH(N88,'Planning Bénévoles'!F$3:F$40,0))=TRUE,M87+1,M87))","v":4},"","","",{"$f":"IF(R88=\"\",Q87,IF(ISNA(MATCH(R88,'Planning Bénévoles'!G$3:G$40,0))=TRUE,Q87+1,Q87))","v":8},"","","",{"$f":"IF(V88=\"\",U87,IF(ISNA(MATCH(V88,'Planning Bénévoles'!H$3:H$40,0))=TRUE,U87+1,U87))","v":8},"","","",{"$f":"IF(Z88=\"\",Y87,IF(ISNA(MATCH(Z88,'Planning Bénévoles'!I$3:I$40,0))=TRUE,Y87+1,Y87))","v":3},"","","",{"$f":"IF(AD88=\"\",AC87,IF(ISNA(MATCH(AD88,'Planning Bénévoles'!J$3:J$40,0))=TRUE,AC87+1,AC87))","v":3},"","","",{"$f":"IF(AH88=\"\",AG87,IF(ISNA(MATCH(AH88,'Planning Bénévoles'!K$3:K$40,0))=TRUE,AG87+1,AG87))","v":7},"","","",{"$f":"IF(AL88=\"\",AK87,IF(ISNA(MATCH(AL88,'Planning Bénévoles'!L$3:L$40,0))=TRUE,AK87+1,AK87))","v":16},"","","",{"$f":"IF(AP88=\"\",AO87,IF(ISNA(MATCH(AP88,'Planning Bénévoles'!M$3:M$40,0))=TRUE,AO87+1,AO87))","v":30},"","","",{"$f":"IF(AT88=\"\",AS87,IF(ISNA(MATCH(AT88,'Planning Bénévoles'!N$3:N$40,0))=TRUE,AS87+1,AS87))","v":32},"","","",{"$f":"IF(AX88=\"\",AW87,IF(ISNA(MATCH(AX88,'Planning Bénévoles'!O$3:O$40,0))=TRUE,AW87+1,AW87))","v":2},"","","",{"$f":"IF(BB88=\"\",BA87,IF(ISNA(MATCH(BB88,'Planning Bénévoles'!P$3:P$40,0))=TRUE,BA87+1,BA87))","v":36},"","","",{"$f":"IF(BF88=\"\",BE87,IF(ISNA(MATCH(BF88,'Planning Bénévoles'!Q$3:Q$40,0))=TRUE,BE87+1,BE87))","v":30},"","","",{"$f":"IF(BJ88=\"\",BI87,IF(ISNA(MATCH(BJ88,'Planning Bénévoles'!R$3:R$40,0))=TRUE,BI87+1,BI87))","v":21},"","","",{"$f":"IF(BN88=\"\",BM87,IF(ISNA(MATCH(BN88,'Planning Bénévoles'!S$3:S$40,0))=TRUE,BM87+1,BM87))","v":38},"","","",{"$f":"IF(BR88=\"\",BQ87,IF(ISNA(MATCH(BR88,'Planning Bénévoles'!T$3:T$40,0))=TRUE,BQ87+1,BQ87))","v":35},"","",""]
[{"$f":"IF(B89=\"\",A88,IF(ISNA(MATCH(B89,'Planning Bénévoles'!C$3:C$40,0))=TRUE,A88+1,A88))","v":14},"","","",{"$f":"IF(F89=\"\",E88,IF(ISNA(MATCH(F89,'Planning Bénévoles'!D$3:D$40,0))=TRUE,E88+1,E88))","v":19},"","","",{"$f":"IF(J89=\"\",I88,IF(ISNA(MATCH(J89,'Planning Bénévoles'!E$3:E$40,0))=TRUE,I88+1,I88))","v":6},"","","",{"$f":"IF(N89=\"\",M88,IF(ISNA(MATCH(N89,'Planning Bénévoles'!F$3:F$40,0))=TRUE,M88+1,M88))","v":4},"","","",{"$f":"IF(R89=\"\",Q88,IF(ISNA(MATCH(R89,'Planning Bénévoles'!G$3:G$40,0))=TRUE,Q88+1,Q88))","v":8},"","","",{"$f":"IF(V89=\"\",U88,IF(ISNA(MATCH(V89,'Planning Bénévoles'!H$3:H$40,0))=TRUE,U88+1,U88))","v":8},"","","",{"$f":"IF(Z89=\"\",Y88,IF(ISNA(MATCH(Z89,'Planning Bénévoles'!I$3:I$40,0))=TRUE,Y88+1,Y88))","v":3},"","","",{"$f":"IF(AD89=\"\",AC88,IF(ISNA(MATCH(AD89,'Planning Bénévoles'!J$3:J$40,0))=TRUE,AC88+1,AC88))","v":3},"","","",{"$f":"IF(AH89=\"\",AG88,IF(ISNA(MATCH(AH89,'Planning Bénévoles'!K$3:K$40,0))=TRUE,AG88+1,AG88))","v":7},"","","",{"$f":"IF(AL89=\"\",AK88,IF(ISNA(MATCH(AL89,'Planning Bénévoles'!L$3:L$40,0))=TRUE,AK88+1,AK88))","v":16},"","","",{"$f":"IF(AP89=\"\",AO88,IF(ISNA(MATCH(AP89,'Planning Bénévoles'!M$3:M$40,0))=TRUE,AO88+1,AO88))","v":30},"","","",{"$f":"IF(AT89=\"\",AS88,IF(ISNA(MATCH(AT89,'Planning Bénévoles'!N$3:N$40,0))=TRUE,AS88+1,AS88))","v":32},"","","",{"$f":"IF(AX89=\"\",AW88,IF(ISNA(MATCH(AX89,'Planning Bénévoles'!O$3:O$40,0))=TRUE,AW88+1,AW88))","v":2},"","","",{"$f":"IF(BB89=\"\",BA88,IF(ISNA(MATCH(BB89,'Planning Bénévoles'!P$3:P$40,0))=TRUE,BA88+1,BA88))","v":36},"","","",{"$f":"IF(BF89=\"\",BE88,IF(ISNA(MATCH(BF89,'Planning Bénévoles'!Q$3:Q$40,0))=TRUE,BE88+1,BE88))","v":30},"","","",{"$f":"IF(BJ89=\"\",BI88,IF(ISNA(MATCH(BJ89,'Planning Bénévoles'!R$3:R$40,0))=TRUE,BI88+1,BI88))","v":21},"","","",{"$f":"IF(BN89=\"\",BM88,IF(ISNA(MATCH(BN89,'Planning Bénévoles'!S$3:S$40,0))=TRUE,BM88+1,BM88))","v":38},"","","",{"$f":"IF(BR89=\"\",BQ88,IF(ISNA(MATCH(BR89,'Planning Bénévoles'!T$3:T$40,0))=TRUE,BQ88+1,BQ88))","v":35},"","",""]
[{"$f":"IF(B90=\"\",A89,IF(ISNA(MATCH(B90,'Planning Bénévoles'!C$3:C$40,0))=TRUE,A89+1,A89))","v":14},"","","",{"$f":"IF(F90=\"\",E89,IF(ISNA(MATCH(F90,'Planning Bénévoles'!D$3:D$40,0))=TRUE,E89+1,E89))","v":19},"","","",{"$f":"IF(J90=\"\",I89,IF(ISNA(MATCH(J90,'Planning Bénévoles'!E$3:E$40,0))=TRUE,I89+1,I89))","v":6},"","","",{"$f":"IF(N90=\"\",M89,IF(ISNA(MATCH(N90,'Planning Bénévoles'!F$3:F$40,0))=TRUE,M89+1,M89))","v":4},"","","",{"$f":"IF(R90=\"\",Q89,IF(ISNA(MATCH(R90,'Planning Bénévoles'!G$3:G$40,0))=TRUE,Q89+1,Q89))","v":8},"","","",{"$f":"IF(V90=\"\",U89,IF(ISNA(MATCH(V90,'Planning Bénévoles'!H$3:H$40,0))=TRUE,U89+1,U89))","v":8},"","","",{"$f":"IF(Z90=\"\",Y89,IF(ISNA(MATCH(Z90,'Planning Bénévoles'!I$3:I$40,0))=TRUE,Y89+1,Y89))","v":3},"","","",{"$f":"IF(AD90=\"\",AC89,IF(ISNA(MATCH(AD90,'Planning Bénévoles'!J$3:J$40,0))=TRUE,AC89+1,AC89))","v":3},"","","",{"$f":"IF(AH90=\"\",AG89,IF(ISNA(MATCH(AH90,'Planning Bénévoles'!K$3:K$40,0))=TRUE,AG89+1,AG89))","v":7},"","","",{"$f":"IF(AL90=\"\",AK89,IF(ISNA(MATCH(AL90,'Planning Bénévoles'!L$3:L$40,0))=TRUE,AK89+1,AK89))","v":16},"","","",{"$f":"IF(AP90=\"\",AO89,IF(ISNA(MATCH(AP90,'Planning Bénévoles'!M$3:M$40,0))=TRUE,AO89+1,AO89))","v":30},"","","",{"$f":"IF(AT90=\"\",AS89,IF(ISNA(MATCH(AT90,'Planning Bénévoles'!N$3:N$40,0))=TRUE,AS89+1,AS89))","v":32},"","","",{"$f":"IF(AX90=\"\",AW89,IF(ISNA(MATCH(AX90,'Planning Bénévoles'!O$3:O$40,0))=TRUE,AW89+1,AW89))","v":2},"","","",{"$f":"IF(BB90=\"\",BA89,IF(ISNA(MATCH(BB90,'Planning Bénévoles'!P$3:P$40,0))=TRUE,BA89+1,BA89))","v":36},"","","",{"$f":"IF(BF90=\"\",BE89,IF(ISNA(MATCH(BF90,'Planning Bénévoles'!Q$3:Q$40,0))=TRUE,BE89+1,BE89))","v":30},"","","",{"$f":"IF(BJ90=\"\",BI89,IF(ISNA(MATCH(BJ90,'Planning Bénévoles'!R$3:R$40,0))=TRUE,BI89+1,BI89))","v":21},"","","",{"$f":"IF(BN90=\"\",BM89,IF(ISNA(MATCH(BN90,'Planning Bénévoles'!S$3:S$40,0))=TRUE,BM89+1,BM89))","v":38},"","","",{"$f":"IF(BR90=\"\",BQ89,IF(ISNA(MATCH(BR90,'Planning Bénévoles'!T$3:T$40,0))=TRUE,BQ89+1,BQ89))","v":35},"","",""]
[{"$f":"IF(B91=\"\",A90,IF(ISNA(MATCH(B91,'Planning Bénévoles'!C$3:C$40,0))=TRUE,A90+1,A90))","v":14},"","","",{"$f":"IF(F91=\"\",E90,IF(ISNA(MATCH(F91,'Planning Bénévoles'!D$3:D$40,0))=TRUE,E90+1,E90))","v":19},"","","",{"$f":"IF(J91=\"\",I90,IF(ISNA(MATCH(J91,'Planning Bénévoles'!E$3:E$40,0))=TRUE,I90+1,I90))","v":6},"","","",{"$f":"IF(N91=\"\",M90,IF(ISNA(MATCH(N91,'Planning Bénévoles'!F$3:F$40,0))=TRUE,M90+1,M90))","v":4},"","","",{"$f":"IF(R91=\"\",Q90,IF(ISNA(MATCH(R91,'Planning Bénévoles'!G$3:G$40,0))=TRUE,Q90+1,Q90))","v":8},"","","",{"$f":"IF(V91=\"\",U90,IF(ISNA(MATCH(V91,'Planning Bénévoles'!H$3:H$40,0))=TRUE,U90+1,U90))","v":8},"","","",{"$f":"IF(Z91=\"\",Y90,IF(ISNA(MATCH(Z91,'Planning Bénévoles'!I$3:I$40,0))=TRUE,Y90+1,Y90))","v":3},"","","",{"$f":"IF(AD91=\"\",AC90,IF(ISNA(MATCH(AD91,'Planning Bénévoles'!J$3:J$40,0))=TRUE,AC90+1,AC90))","v":3},"","","",{"$f":"IF(AH91=\"\",AG90,IF(ISNA(MATCH(AH91,'Planning Bénévoles'!K$3:K$40,0))=TRUE,AG90+1,AG90))","v":7},"","","",{"$f":"IF(AL91=\"\",AK90,IF(ISNA(MATCH(AL91,'Planning Bénévoles'!L$3:L$40,0))=TRUE,AK90+1,AK90))","v":16},"","","",{"$f":"IF(AP91=\"\",AO90,IF(ISNA(MATCH(AP91,'Planning Bénévoles'!M$3:M$40,0))=TRUE,AO90+1,AO90))","v":30},"","","",{"$f":"IF(AT91=\"\",AS90,IF(ISNA(MATCH(AT91,'Planning Bénévoles'!N$3:N$40,0))=TRUE,AS90+1,AS90))","v":32},"","","",{"$f":"IF(AX91=\"\",AW90,IF(ISNA(MATCH(AX91,'Planning Bénévoles'!O$3:O$40,0))=TRUE,AW90+1,AW90))","v":2},"","","",{"$f":"IF(BB91=\"\",BA90,IF(ISNA(MATCH(BB91,'Planning Bénévoles'!P$3:P$40,0))=TRUE,BA90+1,BA90))","v":36},"","","",{"$f":"IF(BF91=\"\",BE90,IF(ISNA(MATCH(BF91,'Planning Bénévoles'!Q$3:Q$40,0))=TRUE,BE90+1,BE90))","v":30},"","","",{"$f":"IF(BJ91=\"\",BI90,IF(ISNA(MATCH(BJ91,'Planning Bénévoles'!R$3:R$40,0))=TRUE,BI90+1,BI90))","v":21},"","","",{"$f":"IF(BN91=\"\",BM90,IF(ISNA(MATCH(BN91,'Planning Bénévoles'!S$3:S$40,0))=TRUE,BM90+1,BM90))","v":38},"","","",{"$f":"IF(BR91=\"\",BQ90,IF(ISNA(MATCH(BR91,'Planning Bénévoles'!T$3:T$40,0))=TRUE,BQ90+1,BQ90))","v":35},"","",""]
[{"$f":"IF(B92=\"\",A91,IF(ISNA(MATCH(B92,'Planning Bénévoles'!C$3:C$40,0))=TRUE,A91+1,A91))","v":14},"","","",{"$f":"IF(F92=\"\",E91,IF(ISNA(MATCH(F92,'Planning Bénévoles'!D$3:D$40,0))=TRUE,E91+1,E91))","v":19},"","","",{"$f":"IF(J92=\"\",I91,IF(ISNA(MATCH(J92,'Planning Bénévoles'!E$3:E$40,0))=TRUE,I91+1,I91))","v":6},"","","",{"$f":"IF(N92=\"\",M91,IF(ISNA(MATCH(N92,'Planning Bénévoles'!F$3:F$40,0))=TRUE,M91+1,M91))","v":4},"","","",{"$f":"IF(R92=\"\",Q91,IF(ISNA(MATCH(R92,'Planning Bénévoles'!G$3:G$40,0))=TRUE,Q91+1,Q91))","v":8},"","","",{"$f":"IF(V92=\"\",U91,IF(ISNA(MATCH(V92,'Planning Bénévoles'!H$3:H$40,0))=TRUE,U91+1,U91))","v":8},"","","",{"$f":"IF(Z92=\"\",Y91,IF(ISNA(MATCH(Z92,'Planning Bénévoles'!I$3:I$40,0))=TRUE,Y91+1,Y91))","v":3},"","","",{"$f":"IF(AD92=\"\",AC91,IF(ISNA(MATCH(AD92,'Planning Bénévoles'!J$3:J$40,0))=TRUE,AC91+1,AC91))","v":3},"","","",{"$f":"IF(AH92=\"\",AG91,IF(ISNA(MATCH(AH92,'Planning Bénévoles'!K$3:K$40,0))=TRUE,AG91+1,AG91))","v":7},"","","",{"$f":"IF(AL92=\"\",AK91,IF(ISNA(MATCH(AL92,'Planning Bénévoles'!L$3:L$40,0))=TRUE,AK91+1,AK91))","v":16},"","","",{"$f":"IF(AP92=\"\",AO91,IF(ISNA(MATCH(AP92,'Planning Bénévoles'!M$3:M$40,0))=TRUE,AO91+1,AO91))","v":30},"","","",{"$f":"IF(AT92=\"\",AS91,IF(ISNA(MATCH(AT92,'Planning Bénévoles'!N$3:N$40,0))=TRUE,AS91+1,AS91))","v":32},"","","",{"$f":"IF(AX92=\"\",AW91,IF(ISNA(MATCH(AX92,'Planning Bénévoles'!O$3:O$40,0))=TRUE,AW91+1,AW91))","v":2},"","","",{"$f":"IF(BB92=\"\",BA91,IF(ISNA(MATCH(BB92,'Planning Bénévoles'!P$3:P$40,0))=TRUE,BA91+1,BA91))","v":36},"","","",{"$f":"IF(BF92=\"\",BE91,IF(ISNA(MATCH(BF92,'Planning Bénévoles'!Q$3:Q$40,0))=TRUE,BE91+1,BE91))","v":30},"","","",{"$f":"IF(BJ92=\"\",BI91,IF(ISNA(MATCH(BJ92,'Planning Bénévoles'!R$3:R$40,0))=TRUE,BI91+1,BI91))","v":21},"","","",{"$f":"IF(BN92=\"\",BM91,IF(ISNA(MATCH(BN92,'Planning Bénévoles'!S$3:S$40,0))=TRUE,BM91+1,BM91))","v":38},"","","",{"$f":"IF(BR92=\"\",BQ91,IF(ISNA(MATCH(BR92,'Planning Bénévoles'!T$3:T$40,0))=TRUE,BQ91+1,BQ91))","v":35},"","",""]
[{"$f":"IF(B93=\"\",A92,IF(ISNA(MATCH(B93,'Planning Bénévoles'!C$3:C$40,0))=TRUE,A92+1,A92))","v":14},"","","",{"$f":"IF(F93=\"\",E92,IF(ISNA(MATCH(F93,'Planning Bénévoles'!D$3:D$40,0))=TRUE,E92+1,E92))","v":19},"","","",{"$f":"IF(J93=\"\",I92,IF(ISNA(MATCH(J93,'Planning Bénévoles'!E$3:E$40,0))=TRUE,I92+1,I92))","v":6},"","","",{"$f":"IF(N93=\"\",M92,IF(ISNA(MATCH(N93,'Planning Bénévoles'!F$3:F$40,0))=TRUE,M92+1,M92))","v":4},"","","",{"$f":"IF(R93=\"\",Q92,IF(ISNA(MATCH(R93,'Planning Bénévoles'!G$3:G$40,0))=TRUE,Q92+1,Q92))","v":8},"","","",{"$f":"IF(V93=\"\",U92,IF(ISNA(MATCH(V93,'Planning Bénévoles'!H$3:H$40,0))=TRUE,U92+1,U92))","v":8},"","","",{"$f":"IF(Z93=\"\",Y92,IF(ISNA(MATCH(Z93,'Planning Bénévoles'!I$3:I$40,0))=TRUE,Y92+1,Y92))","v":3},"","","",{"$f":"IF(AD93=\"\",AC92,IF(ISNA(MATCH(AD93,'Planning Bénévoles'!J$3:J$40,0))=TRUE,AC92+1,AC92))","v":3},"","","",{"$f":"IF(AH93=\"\",AG92,IF(ISNA(MATCH(AH93,'Planning Bénévoles'!K$3:K$40,0))=TRUE,AG92+1,AG92))","v":7},"","","",{"$f":"IF(AL93=\"\",AK92,IF(ISNA(MATCH(AL93,'Planning Bénévoles'!L$3:L$40,0))=TRUE,AK92+1,AK92))","v":16},"","","",{"$f":"IF(AP93=\"\",AO92,IF(ISNA(MATCH(AP93,'Planning Bénévoles'!M$3:M$40,0))=TRUE,AO92+1,AO92))","v":30},"","","",{"$f":"IF(AT93=\"\",AS92,IF(ISNA(MATCH(AT93,'Planning Bénévoles'!N$3:N$40,0))=TRUE,AS92+1,AS92))","v":32},"","","",{"$f":"IF(AX93=\"\",AW92,IF(ISNA(MATCH(AX93,'Planning Bénévoles'!O$3:O$40,0))=TRUE,AW92+1,AW92))","v":2},"","","",{"$f":"IF(BB93=\"\",BA92,IF(ISNA(MATCH(BB93,'Planning Bénévoles'!P$3:P$40,0))=TRUE,BA92+1,BA92))","v":36},"","","",{"$f":"IF(BF93=\"\",BE92,IF(ISNA(MATCH(BF93,'Planning Bénévoles'!Q$3:Q$40,0))=TRUE,BE92+1,BE92))","v":30},"","","",{"$f":"IF(BJ93=\"\",BI92,IF(ISNA(MATCH(BJ93,'Planning Bénévoles'!R$3:R$40,0))=TRUE,BI92+1,BI92))","v":21},"","","",{"$f":"IF(BN93=\"\",BM92,IF(ISNA(MATCH(BN93,'Planning Bénévoles'!S$3:S$40,0))=TRUE,BM92+1,BM92))","v":38},"","","",{"$f":"IF(BR93=\"\",BQ92,IF(ISNA(MATCH(BR93,'Planning Bénévoles'!T$3:T$40,0))=TRUE,BQ92+1,BQ92))","v":35},"","",""]
[{"$f":"IF(B94=\"\",A93,IF(ISNA(MATCH(B94,'Planning Bénévoles'!C$3:C$40,0))=TRUE,A93+1,A93))","v":14},"","","",{"$f":"IF(F94=\"\",E93,IF(ISNA(MATCH(F94,'Planning Bénévoles'!D$3:D$40,0))=TRUE,E93+1,E93))","v":19},"","","",{"$f":"IF(J94=\"\",I93,IF(ISNA(MATCH(J94,'Planning Bénévoles'!E$3:E$40,0))=TRUE,I93+1,I93))","v":6},"","","",{"$f":"IF(N94=\"\",M93,IF(ISNA(MATCH(N94,'Planning Bénévoles'!F$3:F$40,0))=TRUE,M93+1,M93))","v":4},"","","",{"$f":"IF(R94=\"\",Q93,IF(ISNA(MATCH(R94,'Planning Bénévoles'!G$3:G$40,0))=TRUE,Q93+1,Q93))","v":8},"","","",{"$f":"IF(V94=\"\",U93,IF(ISNA(MATCH(V94,'Planning Bénévoles'!H$3:H$40,0))=TRUE,U93+1,U93))","v":8},"","","",{"$f":"IF(Z94=\"\",Y93,IF(ISNA(MATCH(Z94,'Planning Bénévoles'!I$3:I$40,0))=TRUE,Y93+1,Y93))","v":3},"","","",{"$f":"IF(AD94=\"\",AC93,IF(ISNA(MATCH(AD94,'Planning Bénévoles'!J$3:J$40,0))=TRUE,AC93+1,AC93))","v":3},"","","",{"$f":"IF(AH94=\"\",AG93,IF(ISNA(MATCH(AH94,'Planning Bénévoles'!K$3:K$40,0))=TRUE,AG93+1,AG93))","v":7},"","","",{"$f":"IF(AL94=\"\",AK93,IF(ISNA(MATCH(AL94,'Planning Bénévoles'!L$3:L$40,0))=TRUE,AK93+1,AK93))","v":16},"","","",{"$f":"IF(AP94=\"\",AO93,IF(ISNA(MATCH(AP94,'Planning Bénévoles'!M$3:M$40,0))=TRUE,AO93+1,AO93))","v":30},"","","",{"$f":"IF(AT94=\"\",AS93,IF(ISNA(MATCH(AT94,'Planning Bénévoles'!N$3:N$40,0))=TRUE,AS93+1,AS93))","v":32},"","","",{"$f":"IF(AX94=\"\",AW93,IF(ISNA(MATCH(AX94,'Planning Bénévoles'!O$3:O$40,0))=TRUE,AW93+1,AW93))","v":2},"","","",{"$f":"IF(BB94=\"\",BA93,IF(ISNA(MATCH(BB94,'Planning Bénévoles'!P$3:P$40,0))=TRUE,BA93+1,BA93))","v":36},"","","",{"$f":"IF(BF94=\"\",BE93,IF(ISNA(MATCH(BF94,'Planning Bénévoles'!Q$3:Q$40,0))=TRUE,BE93+1,BE93))","v":30},"","","",{"$f":"IF(BJ94=\"\",BI93,IF(ISNA(MATCH(BJ94,'Planning Bénévoles'!R$3:R$40,0))=TRUE,BI93+1,BI93))","v":21},"","","",{"$f":"IF(BN94=\"\",BM93,IF(ISNA(MATCH(BN94,'Planning Bénévoles'!S$3:S$40,0))=TRUE,BM93+1,BM93))","v":38},"","","",{"$f":"IF(BR94=\"\",BQ93,IF(ISNA(MATCH(BR94,'Planning Bénévoles'!T$3:T$40,0))=TRUE,BQ93+1,BQ93))","v":35},"","",""]
[{"$f":"IF(B95=\"\",A94,IF(ISNA(MATCH(B95,'Planning Bénévoles'!C$3:C$40,0))=TRUE,A94+1,A94))","v":14},"","","",{"$f":"IF(F95=\"\",E94,IF(ISNA(MATCH(F95,'Planning Bénévoles'!D$3:D$40,0))=TRUE,E94+1,E94))","v":19},"","","",{"$f":"IF(J95=\"\",I94,IF(ISNA(MATCH(J95,'Planning Bénévoles'!E$3:E$40,0))=TRUE,I94+1,I94))","v":6},"","","",{"$f":"IF(N95=\"\",M94,IF(ISNA(MATCH(N95,'Planning Bénévoles'!F$3:F$40,0))=TRUE,M94+1,M94))","v":4},"","","",{"$f":"IF(R95=\"\",Q94,IF(ISNA(MATCH(R95,'Planning Bénévoles'!G$3:G$40,0))=TRUE,Q94+1,Q94))","v":8},"","","",{"$f":"IF(V95=\"\",U94,IF(ISNA(MATCH(V95,'Planning Bénévoles'!H$3:H$40,0))=TRUE,U94+1,U94))","v":8},"","","",{"$f":"IF(Z95=\"\",Y94,IF(ISNA(MATCH(Z95,'Planning Bénévoles'!I$3:I$40,0))=TRUE,Y94+1,Y94))","v":3},"","","",{"$f":"IF(AD95=\"\",AC94,IF(ISNA(MATCH(AD95,'Planning Bénévoles'!J$3:J$40,0))=TRUE,AC94+1,AC94))","v":3},"","","",{"$f":"IF(AH95=\"\",AG94,IF(ISNA(MATCH(AH95,'Planning Bénévoles'!K$3:K$40,0))=TRUE,AG94+1,AG94))","v":7},"","","",{"$f":"IF(AL95=\"\",AK94,IF(ISNA(MATCH(AL95,'Planning Bénévoles'!L$3:L$40,0))=TRUE,AK94+1,AK94))","v":16},"","","",{"$f":"IF(AP95=\"\",AO94,IF(ISNA(MATCH(AP95,'Planning Bénévoles'!M$3:M$40,0))=TRUE,AO94+1,AO94))","v":30},"","","",{"$f":"IF(AT95=\"\",AS94,IF(ISNA(MATCH(AT95,'Planning Bénévoles'!N$3:N$40,0))=TRUE,AS94+1,AS94))","v":32},"","","",{"$f":"IF(AX95=\"\",AW94,IF(ISNA(MATCH(AX95,'Planning Bénévoles'!O$3:O$40,0))=TRUE,AW94+1,AW94))","v":2},"","","",{"$f":"IF(BB95=\"\",BA94,IF(ISNA(MATCH(BB95,'Planning Bénévoles'!P$3:P$40,0))=TRUE,BA94+1,BA94))","v":36},"","","",{"$f":"IF(BF95=\"\",BE94,IF(ISNA(MATCH(BF95,'Planning Bénévoles'!Q$3:Q$40,0))=TRUE,BE94+1,BE94))","v":30},"","","",{"$f":"IF(BJ95=\"\",BI94,IF(ISNA(MATCH(BJ95,'Planning Bénévoles'!R$3:R$40,0))=TRUE,BI94+1,BI94))","v":21},"","","",{"$f":"IF(BN95=\"\",BM94,IF(ISNA(MATCH(BN95,'Planning Bénévoles'!S$3:S$40,0))=TRUE,BM94+1,BM94))","v":38},"","","",{"$f":"IF(BR95=\"\",BQ94,IF(ISNA(MATCH(BR95,'Planning Bénévoles'!T$3:T$40,0))=TRUE,BQ94+1,BQ94))","v":35},"","",""]
[{"$f":"IF(B96=\"\",A95,IF(ISNA(MATCH(B96,'Planning Bénévoles'!C$3:C$40,0))=TRUE,A95+1,A95))","v":14},"","","",{"$f":"IF(F96=\"\",E95,IF(ISNA(MATCH(F96,'Planning Bénévoles'!D$3:D$40,0))=TRUE,E95+1,E95))","v":19},"","","",{"$f":"IF(J96=\"\",I95,IF(ISNA(MATCH(J96,'Planning Bénévoles'!E$3:E$40,0))=TRUE,I95+1,I95))","v":6},"","","",{"$f":"IF(N96=\"\",M95,IF(ISNA(MATCH(N96,'Planning Bénévoles'!F$3:F$40,0))=TRUE,M95+1,M95))","v":4},"","","",{"$f":"IF(R96=\"\",Q95,IF(ISNA(MATCH(R96,'Planning Bénévoles'!G$3:G$40,0))=TRUE,Q95+1,Q95))","v":8},"","","",{"$f":"IF(V96=\"\",U95,IF(ISNA(MATCH(V96,'Planning Bénévoles'!H$3:H$40,0))=TRUE,U95+1,U95))","v":8},"","","",{"$f":"IF(Z96=\"\",Y95,IF(ISNA(MATCH(Z96,'Planning Bénévoles'!I$3:I$40,0))=TRUE,Y95+1,Y95))","v":3},"","","",{"$f":"IF(AD96=\"\",AC95,IF(ISNA(MATCH(AD96,'Planning Bénévoles'!J$3:J$40,0))=TRUE,AC95+1,AC95))","v":3},"","","",{"$f":"IF(AH96=\"\",AG95,IF(ISNA(MATCH(AH96,'Planning Bénévoles'!K$3:K$40,0))=TRUE,AG95+1,AG95))","v":7},"","","",{"$f":"IF(AL96=\"\",AK95,IF(ISNA(MATCH(AL96,'Planning Bénévoles'!L$3:L$40,0))=TRUE,AK95+1,AK95))","v":16},"","","",{"$f":"IF(AP96=\"\",AO95,IF(ISNA(MATCH(AP96,'Planning Bénévoles'!M$3:M$40,0))=TRUE,AO95+1,AO95))","v":30},"","","",{"$f":"IF(AT96=\"\",AS95,IF(ISNA(MATCH(AT96,'Planning Bénévoles'!N$3:N$40,0))=TRUE,AS95+1,AS95))","v":32},"","","",{"$f":"IF(AX96=\"\",AW95,IF(ISNA(MATCH(AX96,'Planning Bénévoles'!O$3:O$40,0))=TRUE,AW95+1,AW95))","v":2},"","","",{"$f":"IF(BB96=\"\",BA95,IF(ISNA(MATCH(BB96,'Planning Bénévoles'!P$3:P$40,0))=TRUE,BA95+1,BA95))","v":36},"","","",{"$f":"IF(BF96=\"\",BE95,IF(ISNA(MATCH(BF96,'Planning Bénévoles'!Q$3:Q$40,0))=TRUE,BE95+1,BE95))","v":30},"","","",{"$f":"IF(BJ96=\"\",BI95,IF(ISNA(MATCH(BJ96,'Planning Bénévoles'!R$3:R$40,0))=TRUE,BI95+1,BI95))","v":21},"","","",{"$f":"IF(BN96=\"\",BM95,IF(ISNA(MATCH(BN96,'Planning Bénévoles'!S$3:S$40,0))=TRUE,BM95+1,BM95))","v":38},"","","",{"$f":"IF(BR96=\"\",BQ95,IF(ISNA(MATCH(BR96,'Planning Bénévoles'!T$3:T$40,0))=TRUE,BQ95+1,BQ95))","v":35},"","",""]
[{"$f":"IF(B97=\"\",A96,IF(ISNA(MATCH(B97,'Planning Bénévoles'!C$3:C$40,0))=TRUE,A96+1,A96))","v":14},"","","",{"$f":"IF(F97=\"\",E96,IF(ISNA(MATCH(F97,'Planning Bénévoles'!D$3:D$40,0))=TRUE,E96+1,E96))","v":19},"","","",{"$f":"IF(J97=\"\",I96,IF(ISNA(MATCH(J97,'Planning Bénévoles'!E$3:E$40,0))=TRUE,I96+1,I96))","v":6},"","","",{"$f":"IF(N97=\"\",M96,IF(ISNA(MATCH(N97,'Planning Bénévoles'!F$3:F$40,0))=TRUE,M96+1,M96))","v":4},"","","",{"$f":"IF(R97=\"\",Q96,IF(ISNA(MATCH(R97,'Planning Bénévoles'!G$3:G$40,0))=TRUE,Q96+1,Q96))","v":8},"","","",{"$f":"IF(V97=\"\",U96,IF(ISNA(MATCH(V97,'Planning Bénévoles'!H$3:H$40,0))=TRUE,U96+1,U96))","v":8},"","","",{"$f":"IF(Z97=\"\",Y96,IF(ISNA(MATCH(Z97,'Planning Bénévoles'!I$3:I$40,0))=TRUE,Y96+1,Y96))","v":3},"","","",{"$f":"IF(AD97=\"\",AC96,IF(ISNA(MATCH(AD97,'Planning Bénévoles'!J$3:J$40,0))=TRUE,AC96+1,AC96))","v":3},"","","",{"$f":"IF(AH97=\"\",AG96,IF(ISNA(MATCH(AH97,'Planning Bénévoles'!K$3:K$40,0))=TRUE,AG96+1,AG96))","v":7},"","","",{"$f":"IF(AL97=\"\",AK96,IF(ISNA(MATCH(AL97,'Planning Bénévoles'!L$3:L$40,0))=TRUE,AK96+1,AK96))","v":16},"","","",{"$f":"IF(AP97=\"\",AO96,IF(ISNA(MATCH(AP97,'Planning Bénévoles'!M$3:M$40,0))=TRUE,AO96+1,AO96))","v":30},"","","",{"$f":"IF(AT97=\"\",AS96,IF(ISNA(MATCH(AT97,'Planning Bénévoles'!N$3:N$40,0))=TRUE,AS96+1,AS96))","v":32},"","","",{"$f":"IF(AX97=\"\",AW96,IF(ISNA(MATCH(AX97,'Planning Bénévoles'!O$3:O$40,0))=TRUE,AW96+1,AW96))","v":2},"","","",{"$f":"IF(BB97=\"\",BA96,IF(ISNA(MATCH(BB97,'Planning Bénévoles'!P$3:P$40,0))=TRUE,BA96+1,BA96))","v":36},"","","",{"$f":"IF(BF97=\"\",BE96,IF(ISNA(MATCH(BF97,'Planning Bénévoles'!Q$3:Q$40,0))=TRUE,BE96+1,BE96))","v":30},"","","",{"$f":"IF(BJ97=\"\",BI96,IF(ISNA(MATCH(BJ97,'Planning Bénévoles'!R$3:R$40,0))=TRUE,BI96+1,BI96))","v":21},"","","",{"$f":"IF(BN97=\"\",BM96,IF(ISNA(MATCH(BN97,'Planning Bénévoles'!S$3:S$40,0))=TRUE,BM96+1,BM96))","v":38},"","","",{"$f":"IF(BR97=\"\",BQ96,IF(ISNA(MATCH(BR97,'Planning Bénévoles'!T$3:T$40,0))=TRUE,BQ96+1,BQ96))","v":35},"","",""]
[{"$f":"IF(B98=\"\",A97,IF(ISNA(MATCH(B98,'Planning Bénévoles'!C$3:C$40,0))=TRUE,A97+1,A97))","v":14},"","","",{"$f":"IF(F98=\"\",E97,IF(ISNA(MATCH(F98,'Planning Bénévoles'!D$3:D$40,0))=TRUE,E97+1,E97))","v":19},"","","",{"$f":"IF(J98=\"\",I97,IF(ISNA(MATCH(J98,'Planning Bénévoles'!E$3:E$40,0))=TRUE,I97+1,I97))","v":6},"","","",{"$f":"IF(N98=\"\",M97,IF(ISNA(MATCH(N98,'Planning Bénévoles'!F$3:F$40,0))=TRUE,M97+1,M97))","v":4},"","","",{"$f":"IF(R98=\"\",Q97,IF(ISNA(MATCH(R98,'Planning Bénévoles'!G$3:G$40,0))=TRUE,Q97+1,Q97))","v":8},"","","",{"$f":"IF(V98=\"\",U97,IF(ISNA(MATCH(V98,'Planning Bénévoles'!H$3:H$40,0))=TRUE,U97+1,U97))","v":8},"","","",{"$f":"IF(Z98=\"\",Y97,IF(ISNA(MATCH(Z98,'Planning Bénévoles'!I$3:I$40,0))=TRUE,Y97+1,Y97))","v":3},"","","",{"$f":"IF(AD98=\"\",AC97,IF(ISNA(MATCH(AD98,'Planning Bénévoles'!J$3:J$40,0))=TRUE,AC97+1,AC97))","v":3},"","","",{"$f":"IF(AH98=\"\",AG97,IF(ISNA(MATCH(AH98,'Planning Bénévoles'!K$3:K$40,0))=TRUE,AG97+1,AG97))","v":7},"","","",{"$f":"IF(AL98=\"\",AK97,IF(ISNA(MATCH(AL98,'Planning Bénévoles'!L$3:L$40,0))=TRUE,AK97+1,AK97))","v":16},"","","",{"$f":"IF(AP98=\"\",AO97,IF(ISNA(MATCH(AP98,'Planning Bénévoles'!M$3:M$40,0))=TRUE,AO97+1,AO97))","v":30},"","","",{"$f":"IF(AT98=\"\",AS97,IF(ISNA(MATCH(AT98,'Planning Bénévoles'!N$3:N$40,0))=TRUE,AS97+1,AS97))","v":32},"","","",{"$f":"IF(AX98=\"\",AW97,IF(ISNA(MATCH(AX98,'Planning Bénévoles'!O$3:O$40,0))=TRUE,AW97+1,AW97))","v":2},"","","",{"$f":"IF(BB98=\"\",BA97,IF(ISNA(MATCH(BB98,'Planning Bénévoles'!P$3:P$40,0))=TRUE,BA97+1,BA97))","v":36},"","","",{"$f":"IF(BF98=\"\",BE97,IF(ISNA(MATCH(BF98,'Planning Bénévoles'!Q$3:Q$40,0))=TRUE,BE97+1,BE97))","v":30},"","","",{"$f":"IF(BJ98=\"\",BI97,IF(ISNA(MATCH(BJ98,'Planning Bénévoles'!R$3:R$40,0))=TRUE,BI97+1,BI97))","v":21},"","","",{"$f":"IF(BN98=\"\",BM97,IF(ISNA(MATCH(BN98,'Planning Bénévoles'!S$3:S$40,0))=TRUE,BM97+1,BM97))","v":38},"","","",{"$f":"IF(BR98=\"\",BQ97,IF(ISNA(MATCH(BR98,'Planning Bénévoles'!T$3:T$40,0))=TRUE,BQ97+1,BQ97))","v":35},"","",""]
[{"$f":"IF(B99=\"\",A98,IF(ISNA(MATCH(B99,'Planning Bénévoles'!C$3:C$40,0))=TRUE,A98+1,A98))","v":14},"","","",{"$f":"IF(F99=\"\",E98,IF(ISNA(MATCH(F99,'Planning Bénévoles'!D$3:D$40,0))=TRUE,E98+1,E98))","v":19},"","","",{"$f":"IF(J99=\"\",I98,IF(ISNA(MATCH(J99,'Planning Bénévoles'!E$3:E$40,0))=TRUE,I98+1,I98))","v":6},"","","",{"$f":"IF(N99=\"\",M98,IF(ISNA(MATCH(N99,'Planning Bénévoles'!F$3:F$40,0))=TRUE,M98+1,M98))","v":4},"","","",{"$f":"IF(R99=\"\",Q98,IF(ISNA(MATCH(R99,'Planning Bénévoles'!G$3:G$40,0))=TRUE,Q98+1,Q98))","v":8},"","","",{"$f":"IF(V99=\"\",U98,IF(ISNA(MATCH(V99,'Planning Bénévoles'!H$3:H$40,0))=TRUE,U98+1,U98))","v":8},"","","",{"$f":"IF(Z99=\"\",Y98,IF(ISNA(MATCH(Z99,'Planning Bénévoles'!I$3:I$40,0))=TRUE,Y98+1,Y98))","v":3},"","","",{"$f":"IF(AD99=\"\",AC98,IF(ISNA(MATCH(AD99,'Planning Bénévoles'!J$3:J$40,0))=TRUE,AC98+1,AC98))","v":3},"","","",{"$f":"IF(AH99=\"\",AG98,IF(ISNA(MATCH(AH99,'Planning Bénévoles'!K$3:K$40,0))=TRUE,AG98+1,AG98))","v":7},"","","",{"$f":"IF(AL99=\"\",AK98,IF(ISNA(MATCH(AL99,'Planning Bénévoles'!L$3:L$40,0))=TRUE,AK98+1,AK98))","v":16},"","","",{"$f":"IF(AP99=\"\",AO98,IF(ISNA(MATCH(AP99,'Planning Bénévoles'!M$3:M$40,0))=TRUE,AO98+1,AO98))","v":30},"","","",{"$f":"IF(AT99=\"\",AS98,IF(ISNA(MATCH(AT99,'Planning Bénévoles'!N$3:N$40,0))=TRUE,AS98+1,AS98))","v":32},"","","",{"$f":"IF(AX99=\"\",AW98,IF(ISNA(MATCH(AX99,'Planning Bénévoles'!O$3:O$40,0))=TRUE,AW98+1,AW98))","v":2},"","","",{"$f":"IF(BB99=\"\",BA98,IF(ISNA(MATCH(BB99,'Planning Bénévoles'!P$3:P$40,0))=TRUE,BA98+1,BA98))","v":36},"","","",{"$f":"IF(BF99=\"\",BE98,IF(ISNA(MATCH(BF99,'Planning Bénévoles'!Q$3:Q$40,0))=TRUE,BE98+1,BE98))","v":30},"","","",{"$f":"IF(BJ99=\"\",BI98,IF(ISNA(MATCH(BJ99,'Planning Bénévoles'!R$3:R$40,0))=TRUE,BI98+1,BI98))","v":21},"","","",{"$f":"IF(BN99=\"\",BM98,IF(ISNA(MATCH(BN99,'Planning Bénévoles'!S$3:S$40,0))=TRUE,BM98+1,BM98))","v":38},"","","",{"$f":"IF(BR99=\"\",BQ98,IF(ISNA(MATCH(BR99,'Planning Bénévoles'!T$3:T$40,0))=TRUE,BQ98+1,BQ98))","v":35},"","",""]
[{"$f":"IF(B100=\"\",A99,IF(ISNA(MATCH(B100,'Planning Bénévoles'!C$3:C$40,0))=TRUE,A99+1,A99))","v":14},"","","",{"$f":"IF(F100=\"\",E99,IF(ISNA(MATCH(F100,'Planning Bénévoles'!D$3:D$40,0))=TRUE,E99+1,E99))","v":19},"","","",{"$f":"IF(J100=\"\",I99,IF(ISNA(MATCH(J100,'Planning Bénévoles'!E$3:E$40,0))=TRUE,I99+1,I99))","v":6},"","","",{"$f":"IF(N100=\"\",M99,IF(ISNA(MATCH(N100,'Planning Bénévoles'!F$3:F$40,0))=TRUE,M99+1,M99))","v":4},"","","",{"$f":"IF(R100=\"\",Q99,IF(ISNA(MATCH(R100,'Planning Bénévoles'!G$3:G$40,0))=TRUE,Q99+1,Q99))","v":8},"","","",{"$f":"IF(V100=\"\",U99,IF(ISNA(MATCH(V100,'Planning Bénévoles'!H$3:H$40,0))=TRUE,U99+1,U99))","v":8},"","","",{"$f":"IF(Z100=\"\",Y99,IF(ISNA(MATCH(Z100,'Planning Bénévoles'!I$3:I$40,0))=TRUE,Y99+1,Y99))","v":3},"","","",{"$f":"IF(AD100=\"\",AC99,IF(ISNA(MATCH(AD100,'Planning Bénévoles'!J$3:J$40,0))=TRUE,AC99+1,AC99))","v":3},"","","",{"$f":"IF(AH100=\"\",AG99,IF(ISNA(MATCH(AH100,'Planning Bénévoles'!K$3:K$40,0))=TRUE,AG99+1,AG99))","v":7},"","","",{"$f":"IF(AL100=\"\",AK99,IF(ISNA(MATCH(AL100,'Planning Bénévoles'!L$3:L$40,0))=TRUE,AK99+1,AK99))","v":16},"","","",{"$f":"IF(AP100=\"\",AO99,IF(ISNA(MATCH(AP100,'Planning Bénévoles'!M$3:M$40,0))=TRUE,AO99+1,AO99))","v":30},"","","",{"$f":"IF(AT100=\"\",AS99,IF(ISNA(MATCH(AT100,'Planning Bénévoles'!N$3:N$40,0))=TRUE,AS99+1,AS99))","v":32},"","","",{"$f":"IF(AX100=\"\",AW99,IF(ISNA(MATCH(AX100,'Planning Bénévoles'!O$3:O$40,0))=TRUE,AW99+1,AW99))","v":2},"","","",{"$f":"IF(BB100=\"\",BA99,IF(ISNA(MATCH(BB100,'Planning Bénévoles'!P$3:P$40,0))=TRUE,BA99+1,BA99))","v":36},"","","",{"$f":"IF(BF100=\"\",BE99,IF(ISNA(MATCH(BF100,'Planning Bénévoles'!Q$3:Q$40,0))=TRUE,BE99+1,BE99))","v":30},"","","",{"$f":"IF(BJ100=\"\",BI99,IF(ISNA(MATCH(BJ100,'Planning Bénévoles'!R$3:R$40,0))=TRUE,BI99+1,BI99))","v":21},"","","",{"$f":"IF(BN100=\"\",BM99,IF(ISNA(MATCH(BN100,'Planning Bénévoles'!S$3:S$40,0))=TRUE,BM99+1,BM99))","v":38},"","","",{"$f":"IF(BR100=\"\",BQ99,IF(ISNA(MATCH(BR100,'Planning Bénévoles'!T$3:T$40,0))=TRUE,BQ99+1,BQ99))","v":35},"","",""]
[{"$f":"IF(B101=\"\",A100,IF(ISNA(MATCH(B101,'Planning Bénévoles'!C$3:C$40,0))=TRUE,A100+1,A100))","v":14},"","","",{"$f":"IF(F101=\"\",E100,IF(ISNA(MATCH(F101,'Planning Bénévoles'!D$3:D$40,0))=TRUE,E100+1,E100))","v":19},"","","",{"$f":"IF(J101=\"\",I100,IF(ISNA(MATCH(J101,'Planning Bénévoles'!E$3:E$40,0))=TRUE,I100+1,I100))","v":6},"","","",{"$f":"IF(N101=\"\",M100,IF(ISNA(MATCH(N101,'Planning Bénévoles'!F$3:F$40,0))=TRUE,M100+1,M100))","v":4},"","","",{"$f":"IF(R101=\"\",Q100,IF(ISNA(MATCH(R101,'Planning Bénévoles'!G$3:G$40,0))=TRUE,Q100+1,Q100))","v":8},"","","",{"$f":"IF(V101=\"\",U100,IF(ISNA(MATCH(V101,'Planning Bénévoles'!H$3:H$40,0))=TRUE,U100+1,U100))","v":8},"","","",{"$f":"IF(Z101=\"\",Y100,IF(ISNA(MATCH(Z101,'Planning Bénévoles'!I$3:I$40,0))=TRUE,Y100+1,Y100))","v":3},"","","",{"$f":"IF(AD101=\"\",AC100,IF(ISNA(MATCH(AD101,'Planning Bénévoles'!J$3:J$40,0))=TRUE,AC100+1,AC100))","v":3},"","","",{"$f":"IF(AH101=\"\",AG100,IF(ISNA(MATCH(AH101,'Planning Bénévoles'!K$3:K$40,0))=TRUE,AG100+1,AG100))","v":7},"","","",{"$f":"IF(AL101=\"\",AK100,IF(ISNA(MATCH(AL101,'Planning Bénévoles'!L$3:L$40,0))=TRUE,AK100+1,AK100))","v":16},"","","",{"$f":"IF(AP101=\"\",AO100,IF(ISNA(MATCH(AP101,'Planning Bénévoles'!M$3:M$40,0))=TRUE,AO100+1,AO100))","v":30},"","","",{"$f":"IF(AT101=\"\",AS100,IF(ISNA(MATCH(AT101,'Planning Bénévoles'!N$3:N$40,0))=TRUE,AS100+1,AS100))","v":32},"","","",{"$f":"IF(AX101=\"\",AW100,IF(ISNA(MATCH(AX101,'Planning Bénévoles'!O$3:O$40,0))=TRUE,AW100+1,AW100))","v":2},"","","",{"$f":"IF(BB101=\"\",BA100,IF(ISNA(MATCH(BB101,'Planning Bénévoles'!P$3:P$40,0))=TRUE,BA100+1,BA100))","v":36},"","","",{"$f":"IF(BF101=\"\",BE100,IF(ISNA(MATCH(BF101,'Planning Bénévoles'!Q$3:Q$40,0))=TRUE,BE100+1,BE100))","v":30},"","","",{"$f":"IF(BJ101=\"\",BI100,IF(ISNA(MATCH(BJ101,'Planning Bénévoles'!R$3:R$40,0))=TRUE,BI100+1,BI100))","v":21},"","","",{"$f":"IF(BN101=\"\",BM100,IF(ISNA(MATCH(BN101,'Planning Bénévoles'!S$3:S$40,0))=TRUE,BM100+1,BM100))","v":38},"","","",{"$f":"IF(BR101=\"\",BQ100,IF(ISNA(MATCH(BR101,'Planning Bénévoles'!T$3:T$40,0))=TRUE,BQ100+1,BQ100))","v":35},"","",""]
[{"$f":"IF(B102=\"\",A101,IF(ISNA(MATCH(B102,'Planning Bénévoles'!C$3:C$40,0))=TRUE,A101+1,A101))","v":14},"","","",{"$f":"IF(F102=\"\",E101,IF(ISNA(MATCH(F102,'Planning Bénévoles'!D$3:D$40,0))=TRUE,E101+1,E101))","v":19},"","","",{"$f":"IF(J102=\"\",I101,IF(ISNA(MATCH(J102,'Planning Bénévoles'!E$3:E$40,0))=TRUE,I101+1,I101))","v":6},"","","",{"$f":"IF(N102=\"\",M101,IF(ISNA(MATCH(N102,'Planning Bénévoles'!F$3:F$40,0))=TRUE,M101+1,M101))","v":4},"","","",{"$f":"IF(R102=\"\",Q101,IF(ISNA(MATCH(R102,'Planning Bénévoles'!G$3:G$40,0))=TRUE,Q101+1,Q101))","v":8},"","","",{"$f":"IF(V102=\"\",U101,IF(ISNA(MATCH(V102,'Planning Bénévoles'!H$3:H$40,0))=TRUE,U101+1,U101))","v":8},"","","",{"$f":"IF(Z102=\"\",Y101,IF(ISNA(MATCH(Z102,'Planning Bénévoles'!I$3:I$40,0))=TRUE,Y101+1,Y101))","v":3},"","","",{"$f":"IF(AD102=\"\",AC101,IF(ISNA(MATCH(AD102,'Planning Bénévoles'!J$3:J$40,0))=TRUE,AC101+1,AC101))","v":3},"","","",{"$f":"IF(AH102=\"\",AG101,IF(ISNA(MATCH(AH102,'Planning Bénévoles'!K$3:K$40,0))=TRUE,AG101+1,AG101))","v":7},"","","",{"$f":"IF(AL102=\"\",AK101,IF(ISNA(MATCH(AL102,'Planning Bénévoles'!L$3:L$40,0))=TRUE,AK101+1,AK101))","v":16},"","","",{"$f":"IF(AP102=\"\",AO101,IF(ISNA(MATCH(AP102,'Planning Bénévoles'!M$3:M$40,0))=TRUE,AO101+1,AO101))","v":30},"","","",{"$f":"IF(AT102=\"\",AS101,IF(ISNA(MATCH(AT102,'Planning Bénévoles'!N$3:N$40,0))=TRUE,AS101+1,AS101))","v":32},"","","",{"$f":"IF(AX102=\"\",AW101,IF(ISNA(MATCH(AX102,'Planning Bénévoles'!O$3:O$40,0))=TRUE,AW101+1,AW101))","v":2},"","","",{"$f":"IF(BB102=\"\",BA101,IF(ISNA(MATCH(BB102,'Planning Bénévoles'!P$3:P$40,0))=TRUE,BA101+1,BA101))","v":36},"","","",{"$f":"IF(BF102=\"\",BE101,IF(ISNA(MATCH(BF102,'Planning Bénévoles'!Q$3:Q$40,0))=TRUE,BE101+1,BE101))","v":30},"","","",{"$f":"IF(BJ102=\"\",BI101,IF(ISNA(MATCH(BJ102,'Planning Bénévoles'!R$3:R$40,0))=TRUE,BI101+1,BI101))","v":21},"","","",{"$f":"IF(BN102=\"\",BM101,IF(ISNA(MATCH(BN102,'Planning Bénévoles'!S$3:S$40,0))=TRUE,BM101+1,BM101))","v":38},"","","",{"$f":"IF(BR102=\"\",BQ101,IF(ISNA(MATCH(BR102,'Planning Bénévoles'!T$3:T$40,0))=TRUE,BQ101+1,BQ101))","v":35},"","",""]
[{"$f":"IF(B103=\"\",A102,IF(ISNA(MATCH(B103,'Planning Bénévoles'!C$3:C$40,0))=TRUE,A102+1,A102))","v":14},"","","",{"$f":"IF(F103=\"\",E102,IF(ISNA(MATCH(F103,'Planning Bénévoles'!D$3:D$40,0))=TRUE,E102+1,E102))","v":19},"","","",{"$f":"IF(J103=\"\",I102,IF(ISNA(MATCH(J103,'Planning Bénévoles'!E$3:E$40,0))=TRUE,I102+1,I102))","v":6},"","","",{"$f":"IF(N103=\"\",M102,IF(ISNA(MATCH(N103,'Planning Bénévoles'!F$3:F$40,0))=TRUE,M102+1,M102))","v":4},"","","",{"$f":"IF(R103=\"\",Q102,IF(ISNA(MATCH(R103,'Planning Bénévoles'!G$3:G$40,0))=TRUE,Q102+1,Q102))","v":8},"","","",{"$f":"IF(V103=\"\",U102,IF(ISNA(MATCH(V103,'Planning Bénévoles'!H$3:H$40,0))=TRUE,U102+1,U102))","v":8},"","","",{"$f":"IF(Z103=\"\",Y102,IF(ISNA(MATCH(Z103,'Planning Bénévoles'!I$3:I$40,0))=TRUE,Y102+1,Y102))","v":3},"","","",{"$f":"IF(AD103=\"\",AC102,IF(ISNA(MATCH(AD103,'Planning Bénévoles'!J$3:J$40,0))=TRUE,AC102+1,AC102))","v":3},"","","",{"$f":"IF(AH103=\"\",AG102,IF(ISNA(MATCH(AH103,'Planning Bénévoles'!K$3:K$40,0))=TRUE,AG102+1,AG102))","v":7},"","","",{"$f":"IF(AL103=\"\",AK102,IF(ISNA(MATCH(AL103,'Planning Bénévoles'!L$3:L$40,0))=TRUE,AK102+1,AK102))","v":16},"","","",{"$f":"IF(AP103=\"\",AO102,IF(ISNA(MATCH(AP103,'Planning Bénévoles'!M$3:M$40,0))=TRUE,AO102+1,AO102))","v":30},"","","",{"$f":"IF(AT103=\"\",AS102,IF(ISNA(MATCH(AT103,'Planning Bénévoles'!N$3:N$40,0))=TRUE,AS102+1,AS102))","v":32},"","","",{"$f":"IF(AX103=\"\",AW102,IF(ISNA(MATCH(AX103,'Planning Bénévoles'!O$3:O$40,0))=TRUE,AW102+1,AW102))","v":2},"","","",{"$f":"IF(BB103=\"\",BA102,IF(ISNA(MATCH(BB103,'Planning Bénévoles'!P$3:P$40,0))=TRUE,BA102+1,BA102))","v":36},"","","",{"$f":"IF(BF103=\"\",BE102,IF(ISNA(MATCH(BF103,'Planning Bénévoles'!Q$3:Q$40,0))=TRUE,BE102+1,BE102))","v":30},"","","",{"$f":"IF(BJ103=\"\",BI102,IF(ISNA(MATCH(BJ103,'Planning Bénévoles'!R$3:R$40,0))=TRUE,BI102+1,BI102))","v":21},"","","",{"$f":"IF(BN103=\"\",BM102,IF(ISNA(MATCH(BN103,'Planning Bénévoles'!S$3:S$40,0))=TRUE,BM102+1,BM102))","v":38},"","","",{"$f":"IF(BR103=\"\",BQ102,IF(ISNA(MATCH(BR103,'Planning Bénévoles'!T$3:T$40,0))=TRUE,BQ102+1,BQ102))","v":35},"","",""]
[{"$f":"IF(B104=\"\",A103,IF(ISNA(MATCH(B104,'Planning Bénévoles'!C$3:C$40,0))=TRUE,A103+1,A103))","v":14},"","","",{"$f":"IF(F104=\"\",E103,IF(ISNA(MATCH(F104,'Planning Bénévoles'!D$3:D$40,0))=TRUE,E103+1,E103))","v":19},"","","",{"$f":"IF(J104=\"\",I103,IF(ISNA(MATCH(J104,'Planning Bénévoles'!E$3:E$40,0))=TRUE,I103+1,I103))","v":6},"","","",{"$f":"IF(N104=\"\",M103,IF(ISNA(MATCH(N104,'Planning Bénévoles'!F$3:F$40,0))=TRUE,M103+1,M103))","v":4},"","","",{"$f":"IF(R104=\"\",Q103,IF(ISNA(MATCH(R104,'Planning Bénévoles'!G$3:G$40,0))=TRUE,Q103+1,Q103))","v":8},"","","",{"$f":"IF(V104=\"\",U103,IF(ISNA(MATCH(V104,'Planning Bénévoles'!H$3:H$40,0))=TRUE,U103+1,U103))","v":8},"","","",{"$f":"IF(Z104=\"\",Y103,IF(ISNA(MATCH(Z104,'Planning Bénévoles'!I$3:I$40,0))=TRUE,Y103+1,Y103))","v":3},"","","",{"$f":"IF(AD104=\"\",AC103,IF(ISNA(MATCH(AD104,'Planning Bénévoles'!J$3:J$40,0))=TRUE,AC103+1,AC103))","v":3},"","","",{"$f":"IF(AH104=\"\",AG103,IF(ISNA(MATCH(AH104,'Planning Bénévoles'!K$3:K$40,0))=TRUE,AG103+1,AG103))","v":7},"","","",{"$f":"IF(AL104=\"\",AK103,IF(ISNA(MATCH(AL104,'Planning Bénévoles'!L$3:L$40,0))=TRUE,AK103+1,AK103))","v":16},"","","",{"$f":"IF(AP104=\"\",AO103,IF(ISNA(MATCH(AP104,'Planning Bénévoles'!M$3:M$40,0))=TRUE,AO103+1,AO103))","v":30},"","","",{"$f":"IF(AT104=\"\",AS103,IF(ISNA(MATCH(AT104,'Planning Bénévoles'!N$3:N$40,0))=TRUE,AS103+1,AS103))","v":32},"","","",{"$f":"IF(AX104=\"\",AW103,IF(ISNA(MATCH(AX104,'Planning Bénévoles'!O$3:O$40,0))=TRUE,AW103+1,AW103))","v":2},"","","",{"$f":"IF(BB104=\"\",BA103,IF(ISNA(MATCH(BB104,'Planning Bénévoles'!P$3:P$40,0))=TRUE,BA103+1,BA103))","v":36},"","","",{"$f":"IF(BF104=\"\",BE103,IF(ISNA(MATCH(BF104,'Planning Bénévoles'!Q$3:Q$40,0))=TRUE,BE103+1,BE103))","v":30},"","","",{"$f":"IF(BJ104=\"\",BI103,IF(ISNA(MATCH(BJ104,'Planning Bénévoles'!R$3:R$40,0))=TRUE,BI103+1,BI103))","v":21},"","","",{"$f":"IF(BN104=\"\",BM103,IF(ISNA(MATCH(BN104,'Planning Bénévoles'!S$3:S$40,0))=TRUE,BM103+1,BM103))","v":38},"","","",{"$f":"IF(BR104=\"\",BQ103,IF(ISNA(MATCH(BR104,'Planning Bénévoles'!T$3:T$40,0))=TRUE,BQ103+1,BQ103))","v":35},"","",""]

{"sheet":"Repas","index":13,"n_rows":18,"n_cols":12,"rows_kept":18,"cut":false,"hidden":false,"merged":[[0,9,0,10],[0,1,0,2],[0,3,0,4],[0,5,0,6],[0,7,0,8]]}
[null,"LUNDI 23",null,"MARDI 24",null,"MERCREDI 25",null,"JEUDI 26",null,"VENDREDI 27",null,"SAMEDI 28"]
[null,"Midi","Soir","Midi","Soir","Midi","Soir","Midi","Soir","Midi","Soir","Midi"]
["BÉNÉVOLES",{"$f":"SUM(LUNDI!B3:B40)","v":14},{"$f":"SUM(LUNDI!C3:C40)","v":20},{"$f":"SUM(MARDI!B3:B40)","v":24},{"$f":"SUM(MARDI!C3:C40)","v":25},{"$f":"SUM(MERCREDI!B3:B40)","v":20},{"$f":"SUM(MERCREDI!C3:C40)","v":20},{"$f":"SUM(JEUDI!B3:B40)","v":10},{"$f":"SUM(JEUDI!C3:C40)","v":2},{"$f":"SUM(VENDREDI!B3:B40)","v":23},{"$f":"SUM(VENDREDI!C3:C40)","v":2},{"$f":"SUM(SAMEDI!B3:B40)","v":0}]
["ARBITRES, JUGES DE LIGNE, SUPERVISEUR"]
["ATP"]
["CHAUFFEURS"]
["CORDEURS"]
["KINE ET MEDECIN"]
["PLAYER DESK"]
["RAMASSEURS"]
["REGIE TECHNIQUE"]
["RESPONSABLE ARBITRE"]
["RESPONSABLES RAMASSEURS"]
["SCORING"]
["SPEAKER"]
["STAFF"]
["STREAMING"]
["TOTAL",{"$f":"SUM(B3:B17)","v":14},20,24,25,20,20,10,2,23,2,0]

{"sheet":"CHAUFFEURS","index":14,"n_rows":17,"n_cols":30,"rows_kept":17,"cut":false,"hidden":false,"merged":[[0,2,1,2],[0,0,1,0],[0,1,1,1],[0,3,1,3],[0,25,1,25],[0,16,0,18],[0,19,0,21],[0,22,0,24],[0,4,0,6],[0,7,0,9],[0,10,0,12],[0,13,0,15]]}
["NOM","PRÉNOM","SEXE","TÉLÉPHONE","LUNDI 20",null,null,"MARDI 21",null,null,"MERCREDI 22",null,null,"JEUDI 23",null,null,"VENDREDI 24",null,null,"SAMEDI 25",null,null,"DIMANCHE 26",null,null,"TAILLE"]
[null,null,null,null,"9h00-14h00","14h00-18h00",">18h00","9h00-14h00","14h00-18h00",">18h00","9h00-14h00","14h00-18h00",">18h00","9h00-14h00","14h00-18h00",">18h00","9h00-14h00","14h00-18h00",">18h00","9h00-14h00","14h00-18h00",">18h00","9h00-14h00","14h00-18h00",">18h00",null,null,null,"HOMMES","FEMMES"]
["AVE","Yvon","H",674737077,"oui","oui","oui","oui","oui","oui","oui","oui","oui","oui","oui","oui","oui","oui","oui","oui","oui","oui","oui","oui","oui","XXL"]
["CASTRIC","Pierre","H",619772954,null,"oui","oui","oui","oui","oui","oui","oui","oui","oui","oui","oui","oui","oui","oui","oui","oui","oui","oui","oui","oui","M",null,"XS",{"$f":"COUNTIFS($C$3:$C$17,\"H\",$Z$3:$Z$17,$AB4)","v":0},{"$f":"COUNTIFS($C$3:$C$17,\"F\",$Z$3:$Z$17,$AB4)","v":0}]
["CORRÉ","Jacques","H",626793594,"oui",null,null,"oui",null,null,"oui",null,null,"oui",null,null,"oui",null,null,"oui",null,null,"oui",null,null,"XL",null,"S",0,0]
["FRESNEAU","Michel","H",680879145,"oui","oui","oui","oui","oui","oui","oui","oui","oui","oui","oui","oui","oui","oui","oui","oui","oui","oui","oui","oui","oui","XXL",null,"M",2,0]
["GALLAIS","Daniel","H",661997044,"oui","oui","oui","oui","oui","oui","oui","oui","oui","oui","oui","oui","oui","oui","oui","oui","oui","oui",null,null,null,"XXL",null,"L",1,0]
["KERCHROM","Claude","H",787488985,"oui","???????",null,"oui",null,null,"oui",null,null,"oui",null,null,"oui",null,null,"oui",null,null,"oui",null,null,"XXL",null,"XL",4,1]
["LE CORRE ","Fred","H",663043138,"oui","???????",null,"oui",null,null,"oui",null,null,"oui",null,null,"oui",null,null,"oui",null,null,"oui",null,null,"XXL",null,"XXL",7,0]
["LE FLOCH","Bruno","H",618827734,null,"oui","oui",null,"oui","oui",null,"oui","oui",null,"oui","oui",null,"oui","oui",null,"oui","oui",null,"oui","oui","XXL"]
["LE MAO","Michel","H",676237819,"oui",null,null,"oui",null,null,"oui",null,null,"oui",null,null,"oui",null,null,"oui",null,null,null,null,null,"M",null,"TOTAL",{"$f":"SUM(AC6:AC10)","v":14},{"$f":"SUM(AD6:AD10)","v":1}]
["LEMARIE","Henry","H",660860621,"?????","oui","oui",null,"oui","oui",null,"oui","oui",null,"oui","oui",null,"oui","oui",null,"oui","oui",null,"oui","oui","XXL"]
["MAILLARD","Frédéric","H",681487936,null,"oui",null,null,"oui","oui",null,"oui","oui",null,"oui",null,null,"oui","oui",null,"oui",null,null,null,null,"XL"]
["MINGUY","Sophie","F",674145166,"oui","oui","oui","oui","oui","oui",null,null,null,"oui","oui","oui","oui","oui","oui","oui","oui",null,"oui","oui",null,"XL"]
["PLOUZENNEC","Roland","H",666172650,null,"oui","oui",null,"oui","oui",null,"oui","oui",null,"oui","oui",null,"oui","oui",null,"oui","oui",null,"oui","oui","L"]
["SIRET","Christophe","H",660059606,"oui","oui",null,"oui","oui",null,"oui","oui",null,"oui","oui",null,"oui","oui",null,null,null,null,null,null,null,"XL"]
["VINCOT","Yvon","H",678537917,null,"oui","oui",null,"oui","oui",null,"oui","oui",null,"oui","oui",null,"oui","oui",null,"oui","oui",null,"oui","oui","XL"]

{"sheet":"Planning Responsables","index":15,"n_rows":30,"n_cols":17,"rows_kept":30,"cut":false,"hidden":false,"merged":[[0,10,0,11],[0,12,0,13],[0,14,0,15],[0,0,1,0],[0,1,1,1],[0,2,1,2],[0,4,0,5],[0,6,0,7],[0,8,0,9]]}
["QUALITE","NOM","PRENOM",null,"LUNDI",null,"MARDI",null,"MERCREDI",null,"JEUDI",null,"VENDREDI",null,"SAMEDI",null,"DIMANCHE"]
[null,null,null,null,"MIDI","SOIR","MIDI","SOIR","MIDI","SOIR","MIDI","SOIR","MIDI","SOIR","MIDI","SOIR","MIDI"]
["DIRECTEUR"]
["CO DIRECTEUR"]
["HOTESSES"]
["OPEN CLUB"]
["Bar GP"]
["ACCUEIL VIP HALL"]
["ACCUEIL SCOLAIRE"]
["CHAUFFEURS"]
["IUT Action COM"]
["Cordeur"]
["KINE ET MEDECIN"]
["RESPONSABLE COM"]
["RESPONSABLE RP"]
["RESPONSABLE ARBITRE"]
["RESPONSABLE BENEVOLES"]
["RESPONSABLE CHAUFFEURS & HEBERGEMENT"]
["PLAYER DESK"]
["RESPONSABLE RAMASSEURS"]
["SPEAKER"]
["SUPERVISEUR"]
["SCORING"]
["STAGIAIRES d'ARZEL"]
["STREAMING"]
["REGIE TECHNIQUE"]
["JUGE ARBITRE"]
["ARBITRES"]
["JUGES DE LIGNES"]
["RAMASSEURS"]