{"text_format":"1","workbook":"xlsx","n_sheets":29,"sheets":["ACCUEIL","bon de réception","Lettre de voiture Retour","Bon de retour","Étiquette colis Retour","Courrier litige Transporteur","Bon de commande","BL fournisseur","Lettre Voiture livraison fourn","Transporteurs","Étiquette colis fournisseur","Filtrage","Facture fournisseur","Filtre","BL fournisseur 6","Ancien Fichier stock","ClientsFournisseurs","Stock","Étiquettes","Cde client","Traitement Cde","bon de préparation","Bon de livraison","Étiquette colis EXPÉ","Lettre de voiture expé","Facture client","fiche d'inventaire","Gestion identité","Rapport sur la compatibilité"],"not_rendered":{"charts":0,"images":47,"macros":1,"external_links":1,"defined_names":41,"comments":0,"pivot_tables":0},"unopened":[],"bounds":{"document_bytes":16777216,"sheet_cells":100000,"rows_first":2000,"rows_last":500,"rows_between":2000,"halvings":0,"cell_chars":16384,"cell_head_chars":4096},"cells_cut":0,"cells_raw":0,"read":"whole","date_system":"1900"}

{"sheet":"ACCUEIL","index":0,"n_rows":21,"n_cols":31,"rows_kept":21,"cut":false,"hidden":false,"merged":[[6,2,6,6],[0,0,0,33],[8,26,9,26],[8,2,9,2],[10,14,11,14],[8,18,9,18],[8,22,9,22],[17,2,17,6],[14,2,15,2],[14,6,15,6],[14,10,15,10],[12,2,12,6],[20,10,20,14],[8,30,9,30],[20,26,20,30],[13,26,13,30],[18,10,18,14],[17,18,17,22],[17,26,17,30]]}
["B.S.L ÉLEC"]
[]
[]
[]
[]
[]
[null,null,"COMMANDE FOURNISSEUR",null,null,null,null,null,null,null,"ARTICLES",null,null,null,null,null,null,null,"PRÉPARATION DE COMMANDES",null,null,null,null,null,null,null,"FOURNISSEURS"]
[]
{"$rows_left_out":14}
{"sheet":"bon de réception","index":1,"n_rows":35,"n_cols":9,"rows_kept":35,"cut":false,"hidden":false,"merged":[[36,2,39,5],[29,3,29,5],[30,3,30,5],[25,3,25,5],[26,3,26,5],[27,3,27,5],[28,3,28,5],[6,6,6,8],[7,6,7,8],[8,6,8,8],[9,6,9,8],[35,6,36,8],[12,4,12,6],[20,3,20,5],[15,3,15,5],[16,3,16,5],[17,3,17,5],[18,3,18,5],[19,3,19,5],[21,3,21,5],[22,3,22,5],[23,3,23,5],[24,3,24,5]]}
[]
[null,null,null,null,null,null,"BON DE RECEPTION"]
[null,null,{"$f":"'Gestion identité'!C5","v":"B.S.L ÉLEC"}]
[null,null,{"$f":"'Gestion identité'!C6","v":"5, rue Ste Anne"},null,null,null,"N°"]
[null,null,{"$f":"'Gestion identité'!C7","v":"54340 Pompey"}]
[null,null,null,null,null,null,"Fournisseur :"]
[null,null,"Notre commande N° :",null,null,null,{"$f":"IF($I$14=\"\",\"\",VLOOKUP($I$14,carnetadresse,2,FALSE))","v":""}]
[null,null,"Du:",null,null,null,{"$f":"IF($I$14=\"\",\"\",VLOOKUP($I$14,carnetadresse,3,FALSE))","v":""}]
{"$rows_left_out":28}
{"sheet":"Lettre de voiture Retour","index":2,"n_rows":22,"n_cols":14,"rows_kept":22,"cut":false,"hidden":false,"merged":[[20,2,20,5],[21,2,21,5],[17,10,17,13],[19,2,19,5],[13,10,15,13],[13,4,14,4],[13,5,15,6],[13,7,15,7],[18,2,18,5],[6,4,6,6],[6,8,6,9],[6,11,6,13],[8,5,8,6],[8,8,8,9],[8,10,8,11],[8,12,8,13],[9,8,11,11],[9,12,10,13],[7,4,7,6],[13,8,15,9],[10,2,12,2],[9,4,11,7],[10,3,12,3]]}
[]
[]
[null,null,null,null,"Lettre de voiture retour colis"]
[]
[]
[null,null,"EXPEDITEUR",null,"DESTINATAIRE",null,null,"Nbre colis","Port Payé H.T",null,"T.V.A 20 %","Contre Remoursement"]
[null,null,{"$f":"'Gestion identité'!C5","v":"B.S.L ÉLEC"},null,{"$f":"IF('Bon de retour'!$K$1=\"\",\"\",'Bon de retour'!H11)","v":""},null,null,{"$f":"IF('Bon de retour'!$K$1=\"\",\"\",'Bon de retour'!E34)","v":""}]
[null,null,{"$f":"'Gestion identité'!C6","v":"5, rue Ste Anne"},null,{"$f":"IF('Bon de retour'!$K$1=\"\",\"\",'Bon de retour'!H12)","v":""},null,null,"Poids en Kg","Port dû \nH.T",null,"Débours Assignés",null,"Total à Encaisser"]
{"$rows_left_out":15}
{"sheet":"Bon de retour","index":3,"n_rows":36,"n_cols":10,"rows_kept":36,"cut":false,"hidden":false,"merged":[[37,3,41,8],[15,4,15,5],[15,2,15,3],[7,2,7,3],[9,2,9,3],[10,2,10,3],[12,2,12,3],[13,2,13,3]]}
[]
[null,null,null,null,null,null,null,null,"BON DE RETOUR"]
[]
[null,null,{"$f":"'Gestion identité'!C5","v":"B.S.L ÉLEC"},null,null,null,null,"N° :"]
[null,null,{"$f":"'Gestion identité'!C6","v":"5, rue Ste Anne"}]
[null,null,{"$f":"'Gestion identité'!C7","v":"54340 Pompey"},null,null,null,null,"Du :"]
[]
[null,null,{"$f":"'Gestion identité'!C8","v":"03.83.49.11.94"},null,null,null,null,"FOURNISSEUR"]
{"$rows_left_out":29}
{"sheet":"Étiquette colis Retour","index":4,"n_rows":51,"n_cols":7,"rows_kept":51,"cut":false,"hidden":false,"merged":[[31,1,31,5],[32,6,34,6],[32,1,32,5],[33,1,33,5],[34,1,34,5],[37,1,41,1],[37,2,38,4],[37,5,38,5],[37,6,38,6],[40,2,41,4],[39,6,41,6],[39,5,41,5],[47,1,47,5],[48,1,48,5],[48,6,50,6],[49,1,49,5],[50,1,50,5],[42,1,46,1],[42,2,42,5],[43,2,43,5],[43,6,46,6],[44,2,44,5],[45,2,45,5],[46,2,46,5],[28,2,28,5],[29,2,29,5],[30,2,30,5],[27,6,30,6],[21,1,25,1],[21,5,22,5],[26,1,30,1],[26,2,26,5],[27,2,27,5],[5,1,9,1],[12,2,12,5],[13,2,13,5],[11,6,14,6],[5,5,6,5],[5,6,6,6],[10,1,14,1],[14,2,14,5],[10,2,10,5],[11,2,11,5],[7,5,9,5],[7,6,9,6],[15,1,15,5],[16,6,18,6],[21,6,22,6],[21,2,22,4],[24,2,25,4],[23,6,25,6],[23,5,25,5]]}
[]
[]
[]
[]
[]
[null,"Expéditeur",null,null,null,"Date d’expédition :",{"$f":"IF('Bon de retour'!I6=\"\",\"\",'Bon de retour'!I6)","v":""}]
[null,null,{"$f":"'Gestion identité'!C5","v":"B.S.L ÉLEC"}]
[null,null,{"$f":"'Gestion identité'!C6","v":"5, rue Ste Anne"},null,null,"N° de Bon du Retour :",{"$f":"IF('Bon de retour'!$K$1=\"\",\"\",'Bon de retour'!I4)","v":""}]
{"$rows_left_out":44}
{"sheet":"Courrier litige Transporteur","index":5,"n_rows":57,"n_cols":12,"rows_kept":57,"cut":false,"hidden":false,"merged":[[36,2,38,6],[47,2,49,6],[43,2,43,7],[39,4,39,7]]}
[null,null,null,null,null,null,null,null,null,null,null,"transporteur"]
[null,null,null,null,null,null,null,null,null,null,null,"fournisseur"]
[]
[null,{"$f":"'Gestion identité'!C5","v":"B.S.L ÉLEC"}]
[null,{"$f":"'Gestion identité'!C6","v":"5, rue Ste Anne"}]
[null,{"$f":"'Gestion identité'!C7","v":"54340 Pompey"},null,null,null,"Transporteur"]
[]
[null,{"$f":"'Gestion identité'!C8","v":"03.83.49.11.94"},null,null,null,{"$f":"IF($K$1=\"\",\"\",VLOOKUP($K$1,listetransporteur,2,FALSE))","v":""}]
{"$rows_left_out":50}
{"sheet":"Bon de commande","index":6,"n_rows":39,"n_cols":9,"rows_kept":39,"cut":false,"hidden":false,"merged":[[8,2,8,3],[9,6,9,7]]}
[]
[]
[]
[]
[null,null,{"$f":"'Gestion identité'!C5","v":"B.S.L ÉLEC"},null,null,null,"BON DE COMMANDE"]
[null,null,{"$f":"'Gestion identité'!C6","v":"5, rue Ste Anne"}]
[null,null,{"$f":"'Gestion identité'!C7","v":"54340 Pompey"},null,null,null,"N° :"]
[null,null,null,null,null,null,"Du :"]
{"$rows_left_out":32}
{"sheet":"BL fournisseur","index":7,"n_rows":37,"n_cols":7,"rows_kept":37,"cut":false,"hidden":false,"merged":[[38,2,39,6],[4,2,4,3],[5,2,5,3],[8,4,8,6],[9,4,9,6],[10,4,10,6],[7,4,7,6],[15,5,15,6]]}
[]
[]
[]
[]
[null,null,{"$f":"IF($G$14=\"\",\"\",VLOOKUP($G$14,carnetadresse,2,FALSE))","v":""},null,null,"BON DE LIVRAISON"]
[null,null,{"$f":"IF($G$14=\"\",\"\",VLOOKUP($G$14,carnetadresse,3,FALSE))","v":""},null,"N° :"]
[null,null,{"$f":"IF($G$14=\"\",\"\",VLOOKUP($G$14,carnetadresse,4,FALSE))","v":""},{"$f":"IF($G$14=\"\",\"\",VLOOKUP($G$14,carnetadresse,5,FALSE))","v":""},"Date  :"]
[null,null,"Tél :",{"$f":"IF($G$14=\"\",\"\",VLOOKUP($G$14,carnetadresse,6,FALSE))","v":""},"Destinataire"]
{"$rows_left_out":30}
{"sheet":"Lettre Voiture livraison fourn","index":8,"n_rows":22,"n_cols":14,"rows_kept":22,"cut":false,"hidden":false,"merged":[[17,10,17,13],[18,2,18,5],[19,2,19,5],[20,2,20,5],[21,2,21,5],[9,4,11,7],[9,8,11,11],[9,12,10,13],[10,2,12,2],[10,3,12,3],[13,4,14,4],[13,5,15,6],[13,7,15,7],[13,8,15,9],[13,10,15,13],[6,8,6,9],[6,11,6,13],[8,8,8,9],[8,10,8,11],[8,12,8,13]]}
[]
[]
[null,null,null,null,"Lettre de voiture livraison fournisseur"]
[]
[]
[null,null,"EXPEDITEUR",null,"DESTINATAIRE",null,null,"Nbre colis","Port Payé H.T",null,"T.V.A 20 %","Contre Remoursement"]
[null,null,{"$f":"IF('BL fournisseur'!$C$5=\"\",\"\",'BL fournisseur'!$C$5)","v":""},null,{"$f":"'Gestion identité'!C5","v":"B.S.L ÉLEC"},null,null,{"$f":"IF('BL fournisseur'!$D$34=\"\",\"\",'BL fournisseur'!D34)","v":""}]
[null,null,{"$f":"IF('BL fournisseur'!$C$6=\"\",\"\",'BL fournisseur'!$C$6)","v":""},null,{"$f":"'Gestion identité'!C6","v":"5, rue Ste Anne"},null,null,"Poids en Kg","Port dû \nH.T",null,"Débours Assignés",null,"Total à Encaisser"]
{"$rows_left_out":15}
{"sheet":"Transporteurs","index":9,"n_rows":1560,"n_cols":7,"rows_kept":1560,"cut":false,"hidden":false,"merged":[]}
["N°","Nom","Adresse","Code postal","Ville","Téléphone","Émail"]
[1,"BERTRAND","ZI Sud",54000,"Nancy","03.83.24.58.66",{"$f":"IF(B2=\"\",\"\",(LOWER(B2&\".\"&E2&\"@\"&B2&\".com\")))","v":"bertrand.nancy@bertrand.com"}]
[{"$f":"A2+1","v":2},"DUPUISLOG","ZAC Nord",57000,"Metz","03.87.54.85.96","dupuislog.metz@dupuislog.com"]
[3,"LACOSTRANSPORT","14,rue de Lorient","56000","Vannes","05.56.65.65.85","lacostransport.vannes@lacostransport.com"]
[4,"ANDRÉ","87, avenue Clément Ader","45000","Orléans","06.54.21.02.32","andré.orléans@andré.com"]
[5,"GILBERT","ZAC de Fermeille","85600","La Roche sur Yon","02.33.36.69.36","gilbert.la roche sur yon@gilbert.com"]
[6,"MUSTAPHA","41, avenue Foch","68000","COLMAR","03.89.54.52.25","mustapha.colmar@mustapha.com"]
[7,"ESTEBAN","41 Rue des vignerons","16000","COGNAC","06.55.85.57.41",{"$f":"IF(B8=\"\",\"\",(LOWER(B8&\".\"&E8&\"@\"&B8&\".com\")))","v":"esteban.cognac@esteban.com"}]
{"$rows_left_out":1553}
{"sheet":"Étiquette colis fournisseur","index":10,"n_rows":50,"n_cols":6,"rows_kept":50,"cut":false,"hidden":false,"merged":[[46,1,46,4],[47,1,47,4],[47,5,49,5],[48,1,48,4],[49,1,49,4],[36,1,40,1],[36,4,37,4],[36,5,37,5],[38,4,40,4],[38,5,40,5],[41,1,45,1],[41,2,41,4],[42,2,42,4],[42,5,45,5],[43,2,43,4],[45,2,45,4],[30,1,30,4],[31,1,31,4],[31,5,33,5],[32,1,32,4],[33,1,33,4],[25,1,29,1],[25,2,25,4],[26,2,26,4],[26,5,29,5],[27,2,27,4],[29,2,29,4],[14,1,14,4],[15,5,17,5],[20,1,24,1],[20,4,21,4],[20,5,21,5],[22,4,24,4],[22,5,24,5],[6,10,12,15],[9,1,13,1],[9,2,9,4],[10,5,13,5],[4,1,8,1],[4,4,5,4],[4,5,5,5],[13,2,13,4],[6,4,8,4],[6,5,8,5]]}
[]
[]
[]
[]
[null,"Expéditeur",null,null,"Date d’expédition :",{"$f":"IF('BL fournisseur'!$F$7=\"\",\"\",'BL fournisseur'!$F$7)","v":""}]
[null,null,{"$f":"IF('BL fournisseur'!$C$5=\"\",\"\",'BL fournisseur'!C5)","v":""}]
[null,null,{"$f":"IF('BL fournisseur'!$C$5=\"\",\"\",'BL fournisseur'!C6)","v":""},null,"N° de Bon de livraison :",{"$f":"IF('BL fournisseur'!F6=\"\",\"\",'BL fournisseur'!F6)","v":""}]
[null,null,{"$f":"IF('BL fournisseur'!$C$5=\"\",\"\",'BL fournisseur'!C7)","v":""},{"$f":"IF('BL fournisseur'!$C$5=\"\",\"\",'BL fournisseur'!D7)","v":""}]
{"$rows_left_out":43}
{"sheet":"Filtrage","index":11,"n_rows":7,"n_cols":11,"rows_kept":7,"cut":false,"hidden":true,"merged":[]}
["N°","Nom","Adresse","Code postal","Ville","Téléphone","Émail",null,null,null,"Ville"]
[6,"MUSTAPHA","41, avenue Foch","68000","COLMAR","03.89.54.52.25","mustapha.colmar@mustapha.com",null,null,null,"c*"]
[7,"ESTEBAN","41 Rue des vignerons","16000","COGNAC","06.55.85.57.41","esteban.cognac@esteban.com"]
[83,"TG EXPRESS","14 Allée Corderie ","16100","COGNAC","08.90.21.51.57 ","tg express.cognac@tg express.com"]
[93,"BORSATO","20 rue de la Sucharde ","21800","CHEVIGNY SAINT SAUVEUR","08.90.21.51.29","borsato.chevigny saint sauveur@borsato.com"]
[147,"LLD LOGISTIC","6, Avenue M.Pagnol","55200","Commercy","07.54.68.77.40","lld logistic.commercy@lld logistic.com"]
[153,"TransMartin","44, rue Pasteur","56850","Caudan","02.97.22.54.54","transmartin.caudan@transmartin.com"]

{"sheet":"Facture fournisseur","index":12,"n_rows":35,"n_cols":6,"rows_kept":35,"cut":false,"hidden":false,"merged":[[31,3,31,4],[33,3,33,4],[34,3,34,4]]}
[]
[null,{"$f":"IF('BL fournisseur'!C5=\"\",\"\",'BL fournisseur'!C5)","v":""},null,null,"Facture"]
[]
[null,{"$f":"IF('BL fournisseur'!C6=\"\",\"\",'BL fournisseur'!C6)","v":""},null,null,"N° de client :","54-P6"]
[null,{"$f":"IF('BL fournisseur'!C7=\"\",\"\",'BL fournisseur'!C7)","v":""},{"$f":"IF('BL fournisseur'!D7=\"\",\"\",'BL fournisseur'!D7)","v":""}]
[null,null,null,null,"N° de facture :",{"$f":"F8","v":""}]
[null,"Email",{"$f":"IF('BL fournisseur'!G14=\"\",\"\",VLOOKUP('BL fournisseur'!G14,Client,7,FALSE))","v":""}]
[null,"Téléphone",{"$f":"IF('BL fournisseur'!D8=\"\",\"\",'BL fournisseur'!D8)","v":""},null,"Date de facture :",{"$f":"IF('BL fournisseur'!E14=\"\",\"\",1+'BL fournisseur'!E14)","v":""}]
{"$rows_left_out":28}
{"sheet":"Filtre","index":13,"n_rows":0,"n_cols":0,"rows_kept":0,"cut":false,"hidden":true,"merged":[]}

{"sheet":"BL fournisseur 6","index":14,"n_rows":33,"n_cols":10,"rows_kept":33,"cut":false,"hidden":true,"merged":[[8,4,8,6],[9,4,9,6],[10,4,10,6],[14,2,14,3],[4,1,4,2],[4,4,4,6],[5,1,5,2],[5,3,6,3],[5,4,6,4],[5,5,6,5],[5,6,6,6]]}
[null,"Heure début :",null,null,"Candidat :"]
[null,"Heure fin :"]
[]
[null,null,null,null,null,null,null,null,null,"N° du Fournisseur"]
[null,{"$f":"IF($J$5=\"\",\"\",VLOOKUP($J$5,carnetadresse,2,FALSE))","v":"Kasy (SARL) "},null,null,"BON DE LIVRAISON",null,null,null,null,145]
[null,{"$f":"IF($J$5=\"\",\"\",VLOOKUP($J$5,carnetadresse,3,FALSE))","v":"Rn 91"},null,"Date: ",null,"N° "]
[null,{"$f":"IF($J$5=\"\",\"\",VLOOKUP($J$5,carnetadresse,4,FALSE))","v":"05320"},{"$f":"IF($J$5=\"\",\"\",VLOOKUP($J$5,carnetadresse,5,FALSE))","v":"La Grave"}]
[]
{"$rows_left_out":26}
{"sheet":"Ancien Fichier stock","index":15,"n_rows":217,"n_cols":13,"rows_kept":217,"cut":false,"hidden":true,"merged":[]}
[]
[" ","E1/2"]
[1010102,"D3/2","voyant orange Legrand",".",1,5,3.57,{"$f":"G3*F3","v":17.849999999999998},null,{"$f":"IF(F3<I3,1,\"\")","v":""},null,1010102,2]
[1010104,"C3/3","stater Mazda","S2",1,28,2.41,67.48,null,"",null,1010104,3]
[1015101,"E2/2","Starter mazda S2",null,1,4,2.5099999999999998,10.039999999999999,null,"",null,1015101,4]
[1015102,"E2/2","Compteur 127V220V",null,1,1,49.5,49.5,null,"",null,1015102,5]
[1020101,"A4/4","clips de fixation","A10",1,14,1.5,21,null,"",null,1020101,6]
[1020102,"E3/3","clips de fixation","A20",1,77,1.5,115.5,null,"",null,1020102,7]
{"$rows_left_out":210}
{"sheet":"ClientsFournisseurs","index":16,"n_rows":1729,"n_cols":8,"rows_kept":1729,"cut":false,"hidden":false,"merged":[]}
["N° ","Nom","Adresse","code postal","Ville","Téléphone","Email","Dép"]
[1,"Vulin","25 rue charles robin","01000","Bourg-en-bresse","04.69.36.36.35",{"$f":"IF(B2=\"\",\"\",(LOWER(B2&\".\"&E2&\"@\"&B2&\".com\")))","v":"vulin.bourg-en-bresse@vulin.com"},{"$f":"LEFT(D2, 2)","v":"01"}]
[{"$f":"A2+1","v":2},"Trans'faire ","4 rue docteur nodet","01000","Bourg-en-bresse","04.69.20.25.24","trans'faire .bourg-en-bresse@trans'faire .com","01"]
[3,"Les Pins","Avenue amedee mercier","01000","Bourg-en-bresse","04.69.87.52.52","les pins.bourg-en-bresse@les pins.com","01"]
[4,"CALGARY ","Rue francois rochaix","01100","Arbent","04.69.21.21.24","calgary .arbent@calgary .com","01"]
[5,"2LC1 ","3 route de groissiat","01100","Bellignat","04.68.02.02.25","2lc1 .bellignat@2lc1 .com","01"]
[6,"HARMEL ","10 rue de l orme","01100","Oyonnax","04.69.35.24.17","harmel .oyonnax@harmel .com","01"]
[7,"Euromotor ","30 rue de la roche samuel","01110","Brénod","04.69.36.36.98","euromotor .brénod@euromotor .com","01"]
{"$rows_left_out":1722}
{"sheet":"Stock","index":17,"n_rows":568,"n_cols":13,"rows_kept":568,"cut":false,"hidden":false,"merged":[]}
["Référence","DÉSIGNATION","COMPLÉMENT","ADRESSE","U.V","Stock","Prix de Vente","Valeur","Stock Mini","Stock Maxi","Alerte"]
[10001,"Projecteur EPSON EB-675 wi",null,"A-1-1",1,3,1350,{"$f":"IF(G2=\"\",\"\",G2*F2)","v":4050},1,3,{"$f":"IF(F2<=I2,J2-F2,IF(F2>I2,J2-F2))","v":0}]
[10002,"Projecteur EPSON EB-675 wi",null,"A-1-2",1,2,1350,2700,1,2,0]
[10003,"Plaque GAZ",null,"A-1-3",1,9,455,4095,2,9,0]
[10004,"Ordinateur AM09",null,"A-1-4",1,4,645,2580,2,4,0]
[10005,"Projecteur EPSON EB-675 wi",null,"A-2-1",1,3,1350,4050,1,3,0]
[10006,"Écran Philips B Line 22\"",null,"A-2-2",1,3,320,960,1,3,0]
[10007,"Projecteur EPSON EB-685 wi",null,"A-2-3",1,1,1450,1450,1,1,0]
{"$rows_left_out":561}
{"sheet":"Étiquettes","index":18,"n_rows":64,"n_cols":4,"rows_kept":64,"cut":false,"hidden":false,"merged":[[56,0,56,1],[56,2,56,3],[59,0,59,1],[59,2,59,3],[62,0,62,1],[62,2,62,3],[53,0,53,1],[53,2,53,3],[50,2,50,3],[35,0,35,1],[35,2,35,3],[38,0,38,1],[38,2,38,3],[41,0,41,1],[41,2,41,3],[44,0,44,1],[44,2,44,3],[47,0,47,1],[47,2,47,3],[50,0,50,1],[22,0,22,1],[22,2,22,3],[25,0,25,1],[25,2,25,3],[28,0,28,1],[28,2,28,3],[19,0,19,1],[19,2,19,3],[16,2,16,3],[1,0,1,1],[1,2,1,3],[4,0,4,1],[4,2,4,3],[7,0,7,1],[7,2,7,3],[10,2,10,3],[10,0,10,1],[13,0,13,1],[13,2,13,3],[16,0,16,1]]}
["Référence",null,"Référence"]
[{"$f":"IF(B1=\"\",\"\",VLOOKUP(B1,stock,2))","v":""},null,{"$f":"IF(D1=\"\",\"\",VLOOKUP(D1,stock,2))","v":""}]
["Adresse",{"$f":"IF(B1=\"\",\"\",VLOOKUP(B1,stock,4))","v":""},"Adresse",{"$f":"IF(D1=\"\",\"\",VLOOKUP(D1,stock,4))","v":""}]
["Référence",null,"Référence"]
[{"$f":"IF(B4=\"\",\"\",VLOOKUP(B4,stock,2))","v":""},null,{"$f":"IF(D4=\"\",\"\",VLOOKUP(D4,stock,2))","v":""}]
["Adresse",{"$f":"IF(B4=\"\",\"\",VLOOKUP(B4,stock,4))","v":""},"Adresse",{"$f":"IF(D4=\"\",\"\",VLOOKUP(D4,stock,4))","v":""}]
["Référence",null,"Référence"]
[{"$f":"IF(B7=\"\",\"\",VLOOKUP(B7,stock,2))","v":""},null,{"$f":"IF(D7=\"\",\"\",VLOOKUP(D7,stock,2))","v":""}]
{"$rows_left_out":57}
{"sheet":"Cde client","index":19,"n_rows":42,"n_cols":8,"rows_kept":42,"cut":false,"hidden":false,"merged":[[41,3,43,7]]}
[]
[]
[]
[]
[]
[null,null,{"$f":"IF($D$13=\"\",\"\",VLOOKUP($D$13,carnetadresse,2,FALSE))","v":""},null,null,"BON DE COMMANDE"]
[null,null,{"$f":"IF($D$13=\"\",\"\",VLOOKUP($D$13,carnetadresse,3,FALSE))","v":""}]
[null,null,{"$f":"IF($D$13=\"\",\"\",VLOOKUP($D$13,carnetadresse,4,FALSE))","v":""},{"$f":"IF($D$13=\"\",\"\",VLOOKUP($D$13,carnetadresse,5,FALSE))","v":""},null,"N° :"]
{"$rows_left_out":35}
{"sheet":"Traitement Cde","index":20,"n_rows":39,"n_cols":7,"rows_kept":39,"cut":false,"hidden":false,"merged":[[38,4,40,6]]}
[]
[]
[]
[]
[null,null,null,"TRAITEMENT DE LA COMMANDE CLIENT"]
[]
[null,null,null,{"$f":"IF($E$13=\"\",\"\",VLOOKUP($E$13,carnetadresse,2,FALSE))","v":""},null,"N° Cde :"]
[null,null,null,{"$f":"IF($E$13=\"\",\"\",VLOOKUP($E$13,carnetadresse,3,FALSE))","v":""}]
{"$rows_left_out":32}
{"sheet":"bon de préparation","index":21,"n_rows":29,"n_cols":10,"rows_kept":29,"cut":false,"hidden":false,"merged":[[11,8,11,9],[4,8,4,9],[7,5,7,6],[4,1,4,3]]}
[]
[]
[null,{"$f":"'Gestion identité'!C5","v":"B.S.L ÉLEC"}]
[null,{"$f":"'Gestion identité'!C6","v":"5, rue Ste Anne"},null,null,"BON DE PRÉPARATION N°",null,null,null,"CLIENT :"]
[null,{"$f":"'Gestion identité'!C7","v":"54340 Pompey"}]
[null,null,null,"N° Client :",null,null,null,null,{"$f":"IF($E$6=\"\",\"\",VLOOKUP($E$6,carnetadresse,2,FALSE))","v":""}]
[null,null,null,"Concerne la commande du :",null,"N° :",null,null,{"$f":"IF($E$6=\"\",\"\",VLOOKUP($E$6,carnetadresse,3,FALSE))","v":""}]
[null,"Date d'expédition :",null,null,"Date de livraison : ",null,null,null,{"$f":"IF($E$6=\"\",\"\",VLOOKUP($E$6,carnetadresse,4,FALSE))","v":""},{"$f":"IF($E$6=\"\",\"\",VLOOKUP($E$6,carnetadresse,5,FALSE))","v":""}]
{"$rows_left_out":22}
{"sheet":"Bon de livraison","index":22,"n_rows":35,"n_cols":6,"rows_kept":35,"cut":false,"hidden":false,"merged":[[33,2,34,3]]}
[]
[]
[]
[]
[null,null,{"$f":"'Gestion identité'!C5","v":"B.S.L ÉLEC"},null,"BON DE LIVRAISON"]
[null,null,{"$f":"'Gestion identité'!C6","v":"5, rue Ste Anne"},null,"N°",{"$f":"IF('bon de préparation'!G4=\"\",\"\",48+'bon de préparation'!G4)","v":""}]
[null,null,{"$f":"'Gestion identité'!C7","v":"54340 Pompey"}]
[null,null,null,null,"CLIENT :"]
{"$rows_left_out":28}
{"sheet":"Étiquette colis EXPÉ","index":23,"n_rows":46,"n_cols":8,"rows_kept":46,"cut":false,"hidden":false,"merged":[[23,2,26,2],[23,3,23,5],[24,6,26,7],[28,5,30,6],[28,7,30,7],[18,2,22,2],[18,5,19,5],[18,6,19,7],[20,5,22,5],[20,6,22,7],[13,5,15,6],[13,7,15,7],[8,2,11,2],[8,3,8,5],[9,6,11,7],[3,2,7,2],[3,5,4,5],[3,6,4,7],[5,5,7,5],[5,6,7,7],[33,2,37,2],[33,5,34,5],[33,6,34,7],[35,5,37,5],[35,6,37,7],[38,2,41,2],[38,3,38,5],[39,6,41,7],[43,5,45,6],[43,7,45,7]]}
[]
[null,null,"ÉTIQUETTE D'EXPÉDITION"]
[]
[null,null,"Expéditeur",null,null,"Date d’expédition :",{"$f":"IF('bon de préparation'!D8=\"\",\"\",'bon de préparation'!D8)","v":""}]
[null,null,null,{"$f":"'Gestion identité'!C5","v":"B.S.L ÉLEC"}]
[null,null,null,{"$f":"'Gestion identité'!C6","v":"5, rue Ste Anne"},null,"N° de B.L:",{"$f":"IF('Bon de livraison'!F6=\"\",\"\",'Bon de livraison'!F6)","v":""}]
[null,null,null,{"$f":"'Gestion identité'!C7","v":"54340 Pompey"}]
[]
{"$rows_left_out":39}
{"sheet":"Lettre de voiture expé","index":24,"n_rows":18,"n_cols":13,"rows_kept":18,"cut":false,"hidden":false,"merged":[[17,1,17,4],[13,1,14,4],[13,9,13,12],[13,5,13,8],[14,10,14,12],[14,6,14,8],[15,1,16,4],[6,1,8,1],[6,2,8,2],[9,1,10,2],[9,3,10,3],[9,4,11,5],[2,7,2,8],[2,10,2,12],[3,11,3,12],[9,9,11,12],[5,3,7,6],[5,7,7,10],[5,11,6,12],[4,4,4,5],[4,7,4,8],[4,9,4,10],[4,11,4,12],[9,6,11,6],[9,7,11,8]]}
[]
[null,"EXPEDITEUR",null,"DESTINATAIRE",null,null,"Nbre colis","Port Payé H.T",null,"T.V.A 20 %","Contre Remoursement"]
[null,{"$f":"'Gestion identité'!C5","v":"B.S.L ÉLEC"},null,{"$f":"IF('bon de préparation'!E6=\"\",\"\",'bon de préparation'!I6)","v":""},null,null,{"$f":"IF('bon de préparation'!E6=\"\",\"\",'bon de préparation'!D29)","v":""}]
[null,{"$f":"'Gestion identité'!C6","v":"5, rue Ste Anne"},null,{"$f":"IF('bon de préparation'!E6=\"\",\"\",'bon de préparation'!I7)","v":""},null,null,"Poids en Kg","Port dû \nH.T",null,"Débours Assignés"]
[null,{"$f":"'Gestion identité'!C7","v":"54340 Pompey"},null,{"$f":"IF('bon de préparation'!E6=\"\",\"\",'bon de préparation'!I8)","v":""},{"$f":"IF('bon de préparation'!E6=\"\",\"\",'bon de préparation'!J8)","v":""},null,{"$f":"IF('bon de préparation'!E6=\"\",\"\",'bon de préparation'!F29)","v":""}]
[null,"Date d'exp",{"$f":"IF('bon de préparation'!D8=\"\",\"\",'bon de préparation'!D8)","v":""},"Matériel électronique",null,null,null,null,null,null,null,"L'expédition contient des matières\ndangereuses selon\nRTMD/RD/ADR DECLARATION OBLIGATOIRE"]
[null,"Lettre de voiture N°","W25127"]
[null,null,null,null,null,null,null,null,null,null,null,"oui","non"]
{"$rows_left_out":11}
{"sheet":"Facture client","index":25,"n_rows":37,"n_cols":7,"rows_kept":37,"cut":false,"hidden":false,"merged":[[33,4,33,5],[35,4,35,5],[36,4,36,5]]}
[]
[null,{"$f":"'Gestion identité'!C5","v":"B.S.L ÉLEC"},null,null,null,"Facture"]
[]
[null,{"$f":"'Gestion identité'!C6","v":"5, rue Ste Anne"},null,null,null,"N° de client :",{"$f":"IF('bon de préparation'!E6=\"\",\"\",('bon de préparation'!E6))","v":""}]
[null,{"$f":"'Gestion identité'!C7","v":"54340 Pompey"}]
[null,"Email",{"$f":"'Gestion identité'!C9","v":"B.S.L Élec@orange.fr"},null,null,"N° de facture :",{"$f":"IF('bon de préparation'!D8=\"\",\"\",'bon de préparation'!D8)","v":""}]
[null,"Téléphone",{"$f":"'Gestion identité'!C8","v":"03.83.49.11.94"}]
[null,null,null,null,null,"Date de facture :",{"$f":"IF(G10=\"\",\"\",G10)","v":""}]
{"$rows_left_out":30}
{"sheet":"fiche d'inventaire","index":26,"n_rows":27,"n_cols":12,"rows_kept":27,"cut":false,"hidden":false,"merged":[[8,11,9,11],[8,3,9,3],[8,4,9,4],[8,5,9,6],[8,7,9,7],[8,8,9,8],[8,9,8,10]]}
[]
[]
[]
[null,null,null,null,null,null,null,"Fiche d'inventaire"]
[]
[null,null,null,null,null,null,null,"Date:"]
[]
[]
{"$rows_left_out":20}
{"sheet":"Gestion identité","index":27,"n_rows":11,"n_cols":6,"rows_kept":11,"cut":false,"hidden":false,"merged":[]}
[]
[]
[null,null,null,null,null,"Oui"]
[null,null,"Identité de l'entreprise",null,null,"Non"]
[null,"Identité","B.S.L ÉLEC"]
[null,"Adresse","5, rue Ste Anne"]
[null,"code et ville","54340 Pompey"]
[null,"Tél","03.83.49.11.94"]
{"$rows_left_out":4}
{"sheet":"Rapport sur la compatibilité","index":28,"n_rows":15,"n_cols":6,"rows_kept":15,"cut":false,"hidden":false,"merged":[]}
[null,"Rapport sur la compatibilité concernant MAGASIN LOG.xls"]
[null,"Exécuté le 24/08/2015 08:00"]
[]
[null,"Les fonctionnalités suivantes de ce classeur ne sont pas prises en charge dans les versions antérieures d’Excel. Ces fonctionnalités seront peut-être perdues ou dégradées si vous ouvrez le classeur dans une version antérieure du programme ou si vous l’enregistrez dans un format de fichier antérieur."]
[]
[null,"Perte significative de fonctionnalité",null,null,"Nb d'occurrences","Version"]
[]
[null,"Tout effet appliqué à ce graphique va être supprimé. Tout texte en dehors des limites du graphique va être tronqué.",null,null,2]
{"$rows_left_out":7}