{"text_format":"1","workbook":"xlsx","n_sheets":9,"sheets":["Accueil","Listes","BD articles menus","Propositions MMR","Propositions MJ","Propositions MVMWE","Propositions MMR f","Propositions MJ f","Propositions MVMWE f"],"not_rendered":{"charts":0,"images":0,"macros":1,"external_links":1,"defined_names":16,"comments":0,"pivot_tables":0},"unopened":[],"bounds":{"document_bytes":16777216,"sheet_cells":100000,"rows_first":2000,"rows_last":500,"rows_between":2000,"halvings":0,"cell_chars":16384,"cell_head_chars":4096},"cells_cut":0,"cells_raw":0,"read":"whole","date_system":"1900"}

{"sheet":"Accueil","index":0,"n_rows":134,"n_cols":11,"rows_kept":134,"cut":false,"hidden":false,"merged":[]}
[null,null,null,null,null,null,2024,null,null,"Open","Save"]
[null,null,null,null,null,null,null,null,null,"2024-10-15T18:26:13","2024-10-15T11:34:50"]
[null,null,null,null,null,null,null,null,null,"2024-10-16T12:00:47","2024-10-15T11:39:16"]
[null,null,null,null,null,null,null,null,null,"2024-10-16T16:39:44","2024-10-15T21:43:16"]
[null,null,null,null,null,null,null,null,null,"2024-10-16T17:12:32","2024-10-15T21:51:39"]
[null,null,null,null,null,null,null,null,null,"2024-10-16T17:51:15","2024-10-16T14:30:19"]
[null,null,null,null,null,null,null,null,null,"2024-10-16T21:03:28","2024-10-16T17:05:36"]
[null,null,null,null,null,null,null,null,null,"2024-10-17T10:53:02","2024-10-16T17:10:34"]
[null,null,null,null,null,null,null,null,null,"2024-10-17T16:14:32","2024-10-16T17:11:23"]
[null,null,null,null,null,null,null,null,null,"2024-10-17T21:28:03","2024-10-16T17:36:38"]
[null,null,null,null,null,null,null,null,null,"2024-10-17T21:41:34","2024-10-16T17:38:16"]
[null,null,null,null,null,null,null,null,null,"2024-10-18T16:37:12","2024-10-16T17:54:53"]
[null,null,null,null,null,null,null,null,null,"2024-10-18T17:46:14","2024-10-16T18:02:11"]
[null,null,null,null,null,null,null,null,null,"2024-10-18T19:19:28","2024-10-16T21:56:07"]
[null,null,null,null,null,null,null,null,null,"2024-10-19T11:48:51","2024-10-17T13:44:05"]
{"$rows_left_out":120}
{"sheet":"Listes","index":1,"n_rows":34,"n_cols":54,"rows_kept":34,"cut":false,"hidden":false,"merged":[[2,30,2,31],[2,52,2,53],[2,0,2,1],[2,39,2,40],[2,42,2,43],[2,45,2,46],[2,3,2,4],[2,6,2,7],[2,9,2,10],[2,12,2,13],[2,15,2,16],[2,33,2,34],[2,36,2,37],[2,18,2,19],[2,21,2,22],[2,24,2,25],[2,27,2,28]]}
["Listes.",null,null,null,null,null,null,null,null,null,null,null,null,null,null,null,null,null,null,null,null,null,null,null,null,null,null,null,null,null,null,null,null,null,null,null,null,null,null,null,null,null,null,null,null,null,null,null,null,null,null,null,null,{"$f":"Accueil!$G$1","v":2024}]
[]
["TabNatureCréation",null,null,"TabCatégorie",null,null,"TabDMR",null,null,"TabDS",null,null,"TabDWE",null,null,"TabLMR",null,null,"TabLSLM",null,null,"TabLSMJ",null,null,"TabLSV",null,null,"TabLWES",null,null,"TabLWED",null,null,"TabVMR",null,null,"TabVMWE",null,null,"TabVS",null,null,"TabPAM",null,null,"TabCAM",null,null,"TabPMVWE",null,"TabMois",null,"TabJF"]
["Nature création","Code nature création",null,"Catégorie","Code catégorie",null,"Dessert DMR","Code dessert DMR",null,"Dessert soir","Code dessert soir",null,"Desserts weekend","Code desserts weekend",null,"Légumes midi retraite","Code légumes midi retraite",null,"Légumes soirs lundi mardi","Code légumes soirs lundi mardi",null,"Légumes soirs mercredi jeudi","Code légumes soirs mercredi jeudi",null,"Légumes soirs vendredi","Code légumes soirs vendredi",null,"Légumes weekend samedi","Code légumes weekend samedi",null,"Légumes weekend dimanche","Code légumes weekend dimanche",null,"Viandes midi retraite","Code viandes midi retraite",null,"Viandes midi weekend","Code viandes midi weekend",null,"Viandes soirs","Code viandes soirs",null,"Période articles menus","Code période articlesmenus",null,"Conditionnement articles menus","Code conditionnement articles menus",null,"Période menu viande weekend",null,"Mois",null,"Jour férié","Date jour férié"]
["Création articles menus","CAM",null,"Dessert midi retraite","DMR",null,"Pomme","DMR01",null,"Pomme","DS01",null,"Ananas","DWE01",null,"Asperges","LMR01",null,"Cassoulet","LSLM01",null,"Macédoine de légumes","LSMJ01",null,"Asperges","LSV01",null,"Pâtes à la sauce tomates weekend samedi","LWES01",null,"Asperges","LWED01",null,"Rôti d'agneau","VMR01",null,"Agneau","VMWE01",null,"Bifteck haché de bœuf","VS01",null,"Dimanche midi","PAM01",null,"1 boîte de 2 pour 2 repas (Avocats, Gâteaux samedi dimanche)","CAM01",null,"Premier semestre 2024",null,{"$f":"\"Janvier \"&Accueil!$G$1","v":"Janvier 2024"},null,"Jour de l'an",{"$f":"DATE($BB$1,1,1)","v":"2024-01-01"}]
["Création menus midi retraite","CMMR",null,"Dessert soir","DS",null,null,null,null,null,null,null,"Autres fruits","DWE02",null,"Avocat","LMR02",null,"Choucroute","LSLM02",null,"Petits pois","LSMJ02",null,"Avocat","LSV02",null,"Pâtes au beurre weekend samedi","LWES02",null,"Chips","LWED02",null,"Rôti de bœuf","VMR02",null,"Bœuf","VMWE02",null,"Bifteck haché de cheval","VS02",null,"Dimanche midi et soir","PAM02",null,"1 boîte de 2, 4 ou 6 œufs. 1, 2 ou 3 œufs pour 1 repas","CAM02",null,"Deuxième semestre 2024",null,{"$f":"\"Février \"&Accueil!$G$1","v":"Février 2024"},null,"Pâques",{"$f":"DATE(YEAR(BB5),3,29.56+0.979*MOD(204-11*MOD(YEAR(BB5),19),30)-WEEKDAY(DATE(YEAR(BB5),3,28.56+0.979*MOD(204-11*MOD(YEAR(BB5),19),30))))","v":"2024-03-31"}]
["Création menus journaliers","CMJ",null,"Desserts weekend","DWE",null,null,null,null,null,null,null,"Avocats","DWE03",null,"Carottes","LMR03",null,"Chou-fleur","LSLM03",null,"Petits pois et jeunes carottes","LSMJ03",null,"Betteraves rouges","LSV03",null,"Pâtes au fromage râpé weekend samedi","LWES03",null,"Frites","LWED03",null,"Rôti de cheval","VMR03",null,"Cheval","VMWE03",null,"Bifteck haché de veau","VS03",null,"Dimanche soir","PAM03",null,"1 boîte de 8. 1 pour 1 repas (Quiche lorraine)","CAM03",null,null,null,{"$f":"\"Mars \"&Accueil!$G$1","v":"Mars 2024"},null,"Lundi de Pâques",{"$f":"BB6+1","v":"2024-04-01"}]
["Création menus viande midi weekend","CMVMWE",null,"Légumes midi retraite","LMR",null,null,null,null,null,null,null,"Bananes","DWE04",null,"Céleri","LMR04",null,"Choux de Bruxelles","LSLM04",null,"Ratatouille","LSMJ04",null,"Carottes","LSV04",null,null,null,null,"Haricots verts","LWED04",null,"Rôti de porc","VMR04",null,"Dinde","VMWE04",null,"Bouchées à la reine","VS04",null,"Lundi à dimanche soirs","PAM04",null,"1 boîte pour 1 repas (Champignons, Salsifis, Thon)","CAM04",null,null,null,{"$f":"\"Avril \"&Accueil!$G$1","v":"Avril 2024"},null,"Fête du travail",{"$f":"DATE($BB$1,5,1)","v":"2024-05-01"}]
[null,null,null,"Légumes soirs lundi mardi","LSLM",null,null,null,null,null,null,null,"Clémentines","DWE05",null,"Champignons","LMR05",null,"Couscous","LSLM05",null,"Raviolis","LSMJ05",null,"Céleri","LSV05",null,null,null,null,null,null,null,"Rôti de veau","VMR05",null,"Poisson","VMWE05",null,"Boudin","VS05",null,"Lundi à vendredi midis","PAM05",null,"1 boîte pour 2 repas (Fruits au sirop, Bouchées à la reine, Croque-monsieur)","CAM05",null,null,null,{"$f":"\"Mai \"&Accueil!$G$1","v":"Mai 2024"},null,"Victoire 1945",{"$f":"DATE($BB$1,5,8)","v":"2024-05-08"}]
[null,null,null,"Légumes soirs mercredi jeudi","LSMJ",null,null,null,null,null,null,null,"Crème","DWE06",null,"Concombre","LMR06",null,"Endives","LSLM06",null,"Tomates pelées","LSMJ06",null,"Champignons","LSV06",null,null,null,null,null,null,null,null,null,null,"Porc","VMWE06",null,"Cervelas","VS06",null,"Lundi à vendredi soirs","PAM06",null,"1 morceau pour 5 repas (Rôti d'agneau, Rôti de bœuf, Rôti de cheval, Rôti de porc, Rôti de cheval)","CAM06",null,null,null,{"$f":"\"Juin \"&Accueil!$G$1","v":"Juin 2024"},null,"Jeudi de l'ascension",{"$f":"BB7+38","v":"2024-05-09"}]
[null,null,null,"Légumes soirs vendredi","LSV",null,null,null,null,null,null,null,"Dattes","DWE07",null,"Couscous","LMR07",null,"Haricots verts","LSLM07",null,null,null,null,"Concombre","LSV07",null,null,null,null,null,null,null,null,null,null,"Veau","VMWE07",null,"Cœur","VS07",null,"Lundi et mardi soirs","PAM07",null,"1 pack de 4 pots pour le weekend. 1 pot pour 1 repas (Crème, Fromage blanc, Gâteau de riz, Gâteau de semoule, Mousse au chocolat, Riz au lait, Yaourts dessert )","CAM07",null,null,null,{"$f":"\"Juillet \"&Accueil!$G$1","v":"Juillet 2024"},null,"Pentecôte",{"$f":"BB6+49","v":"2024-05-19"}]
[null,null,null,"Légumes weekend dimanche","LWED",null,null,null,null,null,null,null,"Figues","DWE08",null,"Maïs","LMR08",null,"Maïs","LSLM08",null,null,null,null,"Radis vendredi soir","LSV08",null,null,null,null,null,null,null,null,null,null,null,null,null,"Croque-monsieur","VS08",null,"Mercredi et jeudi soirs","PAM08",null,"1 pack de 6 pots pour la journée. 3 pots pour 1 repas (Petits suisses)","CAM08",null,null,null,{"$f":"\"Août \"&Accueil!$G$1","v":"Août 2024"},null,"Lundi de Pentecôte",{"$f":"BB11+1","v":"2024-05-20"}]
[null,null,null,"Légumes weekend samedi","LWES",null,null,null,null,null,null,null,"Fromage blanc","DWE09",null,"Pâtes à la sauce tomates midi retraite","LMR09",null,"Paella","LSLM09",null,null,null,null,"Salsifis","LSV09",null,null,null,null,null,null,null,null,null,null,null,null,null,"Foie","VS09",null,"Samedi et dimanche midis","PAM09",null,"1 paquet pour 2 repas (Bifteck haché de bœuf, Bifteck haché de veau, Cœur, Foie, Jambon, Mortadelle, Pizza, Salami, Saucisses)","CAM09",null,null,null,{"$f":"\"Septembre \"&Accueil!$G$1","v":"Septembre 2024"},null,"Fête nationale",{"$f":"DATE(BB1,7,14)","v":"2024-07-14"}]
[null,null,null,"Viandes midi retraite","VMR",null,null,null,null,null,null,null,"Fruits au sirop","DWE10",null,"Pâtes au beurre midi retraite","LMR10",null,"Poireau","LSLM10",null,null,null,null,"Salade","LSV10",null,null,null,null,null,null,null,null,null,null,null,null,null,"Fromage de tête","VS10",null,"Samedi et dimanche midis et soirs","PAM10",null,"1 paquet pour 5 repas (Betteraves rouges)","CAM10",null,null,null,{"$f":"\"Octobre \"&Accueil!$G$1","v":"Octobre 2024"},null,"Assomption",{"$f":"DATE(BB1,8,15)","v":"2024-08-15"}]
[null,null,null,"Viandes midi weekend","VMWE",null,null,null,null,null,null,null,"Fruits de saison","DWE11",null,"Poireau","LMR11",null,"Pomme de terre","LSLM11",null,null,null,null,"Tomates","LSV11",null,null,null,null,null,null,null,null,null,null,null,null,null,"Jambon","VS11",null,"Samedi midi et soir","PAM11",null,"1 pot pour 1 repas (Asperges)","CAM11",null,null,null,{"$f":"\"Novembre \"&Accueil!$G$1","v":"Novembre 2024"},null,"Toussaint",{"$f":"DATE(BB1,11,1)","v":"2024-11-01"}]
{"$rows_left_out":20}
{"sheet":"BD articles menus","index":2,"n_rows":5,"n_cols":15,"rows_kept":5,"cut":false,"hidden":false,"merged":[[0,0,0,14],[2,0,2,14]]}
["BD articles menus."]
[]
["TabBDArticlesMenus"]
["Nature création","Code nature création","Catégorie","Code catégorie","Articles","Code articles","Période","Code période","Conditionnement","Code conditionnement","Quantité pour un repas","Quantité pour la journée","Date création","Numéro création","Clé article"]
["Création articles menus","CAM","Dessert midi retraite","DMR","Pomme","DMR01",null,null,null,null,null,null,null,null,{"$f":"TabBDArticlesMenus[[#This Row],[Code articles]]&\" \"&TabBDArticlesMenus[[#This Row],[Articles]]","v":"DMR01 Pomme"}]

{"sheet":"Propositions MMR","index":3,"n_rows":532,"n_cols":8,"rows_kept":532,"cut":false,"hidden":false,"merged":[[70,0,70,7],[0,0,0,7],[14,0,14,7],[28,0,28,7],[42,0,42,7],[56,0,56,7],[238,0,238,7],[84,0,84,7],[98,0,98,7],[112,0,112,7],[126,0,126,7],[140,0,140,7],[154,0,154,7],[168,0,168,7],[182,0,182,7],[196,0,196,7],[210,0,210,7],[224,0,224,7],[406,0,406,7],[252,0,252,7],[266,0,266,7],[280,0,280,7],[294,0,294,7],[308,0,308,7],[322,0,322,7],[336,0,336,7],[350,0,350,7],[364,0,364,7],[378,0,378,7],[392,0,392,7],[504,0,504,7],[518,0,518,3],[420,0,420,7],[434,0,434,7],[448,0,448,7],[462,0,462,7],[476,0,476,7],[490,0,490,7]]}
["Proposition menus midi retraite."]
["Numéro du menu","MMR01","MMR02","MMR03","MMR04","MMR05","MMR06","MMR07"]
["Date du menu","2024-01-01","2024-01-02","2024-01-03","2024-01-04","2024-01-05","2024-01-08","2024-01-09"]
["Référence légume","LMR","LMR","LMR","LMR","LMR","LMR","LMR"]
["Légume"]
["Quantité légume"]
["Référence viande","VMR","VMR","VMR","VMR","VMR","VMR","VMR"]
["Viande"]
["Quantité viande",100,100,100,100,100,100,100]
["Référence dessert","DMR01","DMR01","DMR01","DMR01","DMR01","DMR01","DMR01"]
["Dessert","Pomme","Pomme","Pomme","Pomme","Pomme","Pomme","Pomme"]
["Quantité dessert",1,1,1,1,1,1,1]
["Référence jour férié","JF01"]
["Jour férié","Jour de l'an"]
["Proposition menus midi retraite."]
{"$rows_left_out":518}
{"sheet":"Propositions MJ","index":4,"n_rows":901,"n_cols":8,"rows_kept":901,"cut":false,"hidden":false,"merged":[[187,0,187,7],[0,0,0,7],[17,0,17,7],[34,0,34,7],[51,0,51,7],[68,0,68,7],[85,0,85,7],[102,0,102,7],[119,0,119,7],[136,0,136,7],[153,0,153,7],[170,0,170,7],[391,0,391,7],[204,0,204,7],[221,0,221,7],[238,0,238,7],[255,0,255,7],[272,0,272,7],[289,0,289,7],[306,0,306,7],[323,0,323,7],[340,0,340,7],[357,0,357,7],[374,0,374,7],[595,0,595,7],[408,0,408,7],[425,0,425,7],[442,0,442,7],[459,0,459,7],[476,0,476,7],[493,0,493,7],[510,0,510,7],[527,0,527,7],[544,0,544,7],[561,0,561,7],[578,0,578,7],[799,0,799,7],[612,0,612,7],[629,0,629,7],[646,0,646,7],[663,0,663,7],[680,0,680,7],[697,0,697,7],[714,0,714,7],[731,0,731,7],[748,0,748,7],[765,0,765,7],[782,0,782,7],[816,0,816,7],[833,0,833,7],[850,0,850,7],[867,0,867,7],[884,0,884,2]]}
["Proposition menus journaliers."]
["Numéro du menu","MJ01","MJ02","MJ03","MJ04","MJ05","MJ06","MJ07"]
["Date du menu","2024-01-01","2024-01-02","2024-01-03","2024-01-04","2024-01-05","2024-01-06","2024-01-07"]
["Référence légume","LSLM","LSLM","LSMJ","LSMJ","LSV","LWES","LWED"]
["Légume"]
["Quantité légume"]
["Référence légume 2"]
["Légume 2"]
["Quantité légume 2"]
["Référence viande","VS","VS","VS","VS","VS","VS","VS"]
["Viande"]
["Quantité viande"]
["Référence dessert","DS01","DS01","DS01","DS01","DS01","DWE","DWE"]
["Dessert","Pomme","Pomme","Pomme","Pomme","Pomme"]
["Quantité dessert",1,1,1,1,1]
{"$rows_left_out":887}
{"sheet":"Propositions MVMWE","index":5,"n_rows":128,"n_cols":8,"rows_kept":128,"cut":false,"hidden":false,"merged":[[120,0,120,1],[40,0,40,7],[0,0,0,7],[8,0,8,7],[16,0,16,7],[24,0,24,7],[32,0,32,7],[112,0,112,7],[96,0,96,7],[104,0,104,7],[48,0,48,7],[56,0,56,7],[64,0,64,7],[72,0,72,7],[80,0,80,7],[88,0,88,7]]}
["Proposition menus viandes midi weekend."]
["Numéro du menu","MVMWE01","MVMWE02","MVMWE03","MVMWE04","MVMWE05","MVMWE06","MVMWE07"]
["Date du menu","2025-01-04","2025-01-05","2025-01-11","2025-01-12","2025-01-18","2025-01-19","2025-01-25"]
["Référence viande","VMWE","VMWE","VMWE","VMWE","VMWE","VMWE","VMWE"]
["Viande"]
["Quantité viande",1,1,1,1,1,1,1]
["Référence jour férié"]
["Jour férié"]
["Proposition menus viandes midi weekend."]
["Numéro du menu","MVMWE08","MVMWE09","MVMWE10","MVMWE11","MVMWE12","MVMWE13","MVMWE14"]
["Date du menu","2025-01-26","2025-02-01","2025-02-02","2025-02-08","2025-02-09","2025-02-15","2025-02-16"]
["Référence viande","VMWE","VMWE","VMWE","VMWE","VMWE","VMWE","VMWE"]
["Viande"]
["Quantité viande",1,1,1,1,1,1,1]
["Référence jour férié"]
{"$rows_left_out":114}
{"sheet":"Propositions MMR f","index":6,"n_rows":532,"n_cols":8,"rows_kept":532,"cut":false,"hidden":false,"merged":[[504,0,504,7],[518,0,518,3],[420,0,420,7],[434,0,434,7],[448,0,448,7],[462,0,462,7],[476,0,476,7],[490,0,490,7],[406,0,406,7],[252,0,252,7],[266,0,266,7],[280,0,280,7],[294,0,294,7],[308,0,308,7],[322,0,322,7],[336,0,336,7],[350,0,350,7],[364,0,364,7],[378,0,378,7],[392,0,392,7],[238,0,238,7],[84,0,84,7],[98,0,98,7],[112,0,112,7],[126,0,126,7],[140,0,140,7],[154,0,154,7],[168,0,168,7],[182,0,182,7],[196,0,196,7],[210,0,210,7],[224,0,224,7],[70,0,70,7],[0,0,0,7],[14,0,14,7],[28,0,28,7],[42,0,42,7],[56,0,56,7]]}
["Proposition menus midi retraite."]
["Numéro du menu","MMR01","MMR02","MMR03","MMR04","MMR05","MMR06","MMR07"]
["Date du menu",{"$f":"WORKDAY(DATE(Accueil!$G$1,1,1)-1,1)","v":"2024-01-01"},{"$f":"WORKDAY(B3,1)","v":"2024-01-02"},{"$f":"WORKDAY(C3,1)","v":"2024-01-03"},"2024-01-04","2024-01-05","2024-01-08","2024-01-09"]
["Référence légume","LMR","LMR","LMR","LMR","LMR","LMR","LMR"]
["Légume"]
["Quantité légume"]
["Référence viande","VMR","VMR","VMR","VMR","VMR","VMR","VMR"]
["Viande"]
["Quantité viande",100,100,100,100,100,100,100]
["Référence dessert","DMR01","DMR01","DMR01","DMR01","DMR01","DMR01","DMR01"]
["Dessert","Pomme","Pomme","Pomme","Pomme","Pomme","Pomme","Pomme"]
["Quantité dessert",1,1,1,1,1,1,1]
["Référence jour férié",{"$f":"IFERROR(\"JF\"&TEXT(MATCH(B3,TabJoursFériés[Date jour férié],0),\"00\"),\"\")","v":"JF01"},{"$f":"IFERROR(\"JF\"&TEXT(MATCH(C3,TabJoursFériés[Date jour férié],0),\"00\"),\"\")","v":""},{"$f":"IFERROR(\"JF\"&TEXT(MATCH(D3,TabJoursFériés[Date jour férié],0),\"00\"),\"\")","v":""},{"$f":"IFERROR(\"JF\"&TEXT(MATCH(E3,TabJoursFériés[Date jour férié],0),\"00\"),\"\")","v":""},{"$f":"IFERROR(\"JF\"&TEXT(MATCH(F3,TabJoursFériés[Date jour férié],0),\"00\"),\"\")","v":""},{"$f":"IFERROR(\"JF\"&TEXT(MATCH(G3,TabJoursFériés[Date jour férié],0),\"00\"),\"\")","v":""},{"$f":"IFERROR(\"JF\"&TEXT(MATCH(H3,TabJoursFériés[Date jour férié],0),\"00\"),\"\")","v":""}]
["Jour férié",{"$f":"IFERROR(INDEX(TabJoursFériés[Jour férié],MATCH(B3,TabJoursFériés[Date jour férié],0)),\"\")","v":"Jour de l'an"},{"$f":"IFERROR(INDEX(TabJoursFériés[Jour férié],MATCH(C3,TabJoursFériés[Date jour férié],0)),\"\")","v":""},{"$f":"IFERROR(INDEX(TabJoursFériés[Jour férié],MATCH(D3,TabJoursFériés[Date jour férié],0)),\"\")","v":""},{"$f":"IFERROR(INDEX(TabJoursFériés[Jour férié],MATCH(E3,TabJoursFériés[Date jour férié],0)),\"\")","v":""},{"$f":"IFERROR(INDEX(TabJoursFériés[Jour férié],MATCH(F3,TabJoursFériés[Date jour férié],0)),\"\")","v":""},{"$f":"IFERROR(INDEX(TabJoursFériés[Jour férié],MATCH(G3,TabJoursFériés[Date jour férié],0)),\"\")","v":""},{"$f":"IFERROR(INDEX(TabJoursFériés[Jour férié],MATCH(H3,TabJoursFériés[Date jour férié],0)),\"\")","v":""}]
["Proposition menus midi retraite."]
{"$rows_left_out":518}
{"sheet":"Propositions MJ f","index":7,"n_rows":902,"n_cols":8,"rows_kept":902,"cut":false,"hidden":false,"merged":[[816,0,816,7],[833,0,833,7],[850,0,850,7],[867,0,867,7],[884,0,884,2],[799,0,799,7],[612,0,612,7],[629,0,629,7],[646,0,646,7],[663,0,663,7],[680,0,680,7],[697,0,697,7],[714,0,714,7],[731,0,731,7],[748,0,748,7],[765,0,765,7],[782,0,782,7],[595,0,595,7],[408,0,408,7],[425,0,425,7],[442,0,442,7],[459,0,459,7],[476,0,476,7],[493,0,493,7],[510,0,510,7],[527,0,527,7],[544,0,544,7],[561,0,561,7],[578,0,578,7],[391,0,391,7],[204,0,204,7],[221,0,221,7],[238,0,238,7],[255,0,255,7],[272,0,272,7],[289,0,289,7],[306,0,306,7],[323,0,323,7],[340,0,340,7],[357,0,357,7],[374,0,374,7],[187,0,187,7],[0,0,0,7],[17,0,17,7],[34,0,34,7],[51,0,51,7],[68,0,68,7],[85,0,85,7],[102,0,102,7],[119,0,119,7],[136,0,136,7],[153,0,153,7],[170,0,170,7]]}
["Proposition menus journaliers."]
["Numéro du menu","MJ01","MJ02","MJ03","MJ04","MJ05","MJ06","MJ07"]
["Date du menu",{"$f":"DATE(Accueil!$G$1,1,1)","v":"2024-01-01"},{"$f":"B3+1","v":"2024-01-02"},{"$f":"C3+1","v":"2024-01-03"},"2024-01-04","2024-01-05","2024-01-06","2024-01-07"]
["Référence légume",{"$f":"CHOOSE(WEEKDAY(B3,2),\"LSLM\",\"LSLM\",\"LSMJ\",\"LSMJ\",\"LSV\",\"LWES\",\"LWED\")","v":"LSLM"},{"$f":"CHOOSE(WEEKDAY(C3,2),\"LSLM\",\"LSLM\",\"LSMJ\",\"LSMJ\",\"LSV\",\"LWES\",\"LWED\")","v":"LSLM"},"LSMJ","LSMJ","LSV","LWES","LWED"]
["Légume"]
["Quantité légume"]
["Référence légume 2"]
["Légume 2"]
["Quantité légume 2"]
["Référence viande","VS","VS","VS","VS","VS","VS","VS"]
["Viande"]
["Quantité viande"]
["Référence dessert",{"$f":"IF(WEEKDAY(B3,2)<6,\"DS01\",\"DWE\")","v":"DS01"},{"$f":"IF(WEEKDAY(C3,2)<6,\"DS01\",\"DWE\")","v":"DS01"},"DS01","DS01","DS01","DWE","DWE"]
["Dessert",{"$f":"IF(WEEKDAY(B3,2)<6,\"Pomme\",\"\")","v":"Pomme"},{"$f":"IF(WEEKDAY(C3,2)<6,\"Pomme\",\"\")","v":"Pomme"},"Pomme","Pomme","Pomme","",""]
["Quantité dessert",{"$f":"IF(WEEKDAY(B3,2)<6,1,\"\")","v":1},{"$f":"IF(WEEKDAY(C3,2)<6,1,\"\")","v":1},1,1,1,"",""]
{"$rows_left_out":888}
{"sheet":"Propositions MVMWE f","index":8,"n_rows":128,"n_cols":8,"rows_kept":128,"cut":false,"hidden":false,"merged":[[96,0,96,7],[104,0,104,7],[112,0,112,7],[48,0,48,7],[56,0,56,7],[64,0,64,7],[72,0,72,7],[80,0,80,7],[88,0,88,7],[40,0,40,7],[0,0,0,7],[8,0,8,7],[16,0,16,7],[24,0,24,7],[32,0,32,7]]}
["Proposition menus viandes midi weekend."]
["Numéro du menu","MVMWE01","MVMWE02","MVMWE03","MVMWE04","MVMWE05","MVMWE06","MVMWE07"]
["Date du menu","2024-01-06","2024-01-07",{"$f":"WORKDAY.INTL(#REF!,1,\"1111100\")","v":{"$error":"#NAME?"}},{"$f":"WORKDAY.INTL(D3,1,\"1111100\")","v":{"$error":"#NAME?"}},{"$error":"#NAME?"},{"$error":"#NAME?"},{"$error":"#NAME?"}]
["Référence viande",null,"VMWE","VMWE","VMWE","VMWE","VMWE","VMWE"]
["Viande"]
["Quantité viande",1,1,1,1,1,1,1]
["Référence jour férié",{"$f":"IFERROR(\"JF\"&TEXT(MATCH(B3,TabJoursFériés[Date jour férié],0),\"00\"),\"\")","v":""},{"$f":"IFERROR(\"JF\"&TEXT(MATCH(#REF!,TabJoursFériés[Date jour férié],0),\"00\"),\"\")","v":""},{"$f":"IFERROR(\"JF\"&TEXT(MATCH(D3,TabJoursFériés[Date jour férié],0),\"00\"),\"\")","v":""},{"$f":"IFERROR(\"JF\"&TEXT(MATCH(E3,TabJoursFériés[Date jour férié],0),\"00\"),\"\")","v":""},{"$f":"IFERROR(\"JF\"&TEXT(MATCH(F3,TabJoursFériés[Date jour férié],0),\"00\"),\"\")","v":""},{"$f":"IFERROR(\"JF\"&TEXT(MATCH(G3,TabJoursFériés[Date jour férié],0),\"00\"),\"\")","v":""},{"$f":"IFERROR(\"JF\"&TEXT(MATCH(H3,TabJoursFériés[Date jour férié],0),\"00\"),\"\")","v":""}]
["Jour férié",{"$f":"IFERROR(INDEX(TabJoursFériés[Jour férié],MATCH(B3,TabJoursFériés[Date jour férié],0)),\"\")","v":""},{"$f":"IFERROR(INDEX(TabJoursFériés[Jour férié],MATCH(#REF!,TabJoursFériés[Date jour férié],0)),\"\")","v":""},{"$f":"IFERROR(INDEX(TabJoursFériés[Jour férié],MATCH(D3,TabJoursFériés[Date jour férié],0)),\"\")","v":""},{"$f":"IFERROR(INDEX(TabJoursFériés[Jour férié],MATCH(E3,TabJoursFériés[Date jour férié],0)),\"\")","v":""},{"$f":"IFERROR(INDEX(TabJoursFériés[Jour férié],MATCH(F3,TabJoursFériés[Date jour férié],0)),\"\")","v":""},{"$f":"IFERROR(INDEX(TabJoursFériés[Jour férié],MATCH(G3,TabJoursFériés[Date jour férié],0)),\"\")","v":""},{"$f":"IFERROR(INDEX(TabJoursFériés[Jour férié],MATCH(H3,TabJoursFériés[Date jour férié],0)),\"\")","v":""}]
["Proposition menus viandes midi weekend."]
["Numéro du menu","MVMWE08","MVMWE09","MVMWE10","MVMWE11","MVMWE12","MVMWE13","MVMWE14"]
["Date du menu",{"$f":"WORKDAY.INTL(H3,1,\"1111100\")","v":{"$error":"#NAME?"}},{"$f":"WORKDAY.INTL(B11,1,\"1111100\")","v":{"$error":"#NAME?"}},{"$f":"WORKDAY.INTL(C11,1,\"1111100\")","v":{"$error":"#NAME?"}},{"$error":"#NAME?"},{"$error":"#NAME?"},{"$error":"#NAME?"},{"$error":"#NAME?"}]
["Référence viande","VMWE","VMWE","VMWE","VMWE","VMWE","VMWE","VMWE"]
["Viande"]
["Quantité viande",1,1,1,1,1,1,1]
["Référence jour férié",{"$f":"IFERROR(\"JF\"&TEXT(MATCH(B11,TabJoursFériés[Date jour férié],0),\"00\"),\"\")","v":""},{"$f":"IFERROR(\"JF\"&TEXT(MATCH(C11,TabJoursFériés[Date jour férié],0),\"00\"),\"\")","v":""},{"$f":"IFERROR(\"JF\"&TEXT(MATCH(D11,TabJoursFériés[Date jour férié],0),\"00\"),\"\")","v":""},{"$f":"IFERROR(\"JF\"&TEXT(MATCH(E11,TabJoursFériés[Date jour férié],0),\"00\"),\"\")","v":""},{"$f":"IFERROR(\"JF\"&TEXT(MATCH(F11,TabJoursFériés[Date jour férié],0),\"00\"),\"\")","v":""},{"$f":"IFERROR(\"JF\"&TEXT(MATCH(G11,TabJoursFériés[Date jour férié],0),\"00\"),\"\")","v":""},{"$f":"IFERROR(\"JF\"&TEXT(MATCH(H11,TabJoursFériés[Date jour férié],0),\"00\"),\"\")","v":""}]
{"$rows_left_out":113}