{"text_format":"1","workbook":"xlsx","n_sheets":13,"sheets":["Inscriptions","Tirage","Tournoi","Photos","Classement Général","Journée1","Journée2","Journée3","Journée4","Journée5","Journée6","Journée7","Journée8"],"not_rendered":{"charts":0,"images":54,"macros":1,"external_links":0,"defined_names":5,"comments":0,"pivot_tables":0},"unopened":[],"bounds":{"document_bytes":16777216,"sheet_cells":100000,"rows_first":2000,"rows_last":500,"rows_between":2000,"halvings":0,"cell_chars":16384,"cell_head_chars":4096},"cells_cut":0,"cells_raw":0,"read":"whole","date_system":"1900"}

{"sheet":"Inscriptions","index":0,"n_rows":28,"n_cols":21,"rows_kept":28,"cut":false,"hidden":false,"merged":[[16,12,16,14],[17,12,17,14],[0,0,0,2],[1,0,1,2],[0,4,0,6],[1,4,1,6],[0,8,0,10],[1,8,1,10],[16,0,16,2],[17,0,17,2],[16,4,16,6],[17,4,17,6],[16,8,16,10],[17,8,17,10],[0,20,3,23],[8,16,9,23],[6,16,7,23],[4,16,5,23],[0,12,0,14],[1,12,1,14]]}
["Journée1",null,null,null,"Journée2",null,null,null,"Journée3",null,null,null,"Journée4",null,null,null,null,null,null,null,"Avant d'éffacer les noms  veuillez effacer les scores de toutes les journées"]
["Noms des équipes ",null,null,null,"Noms des équipes ",null,null,null,"Noms des équipes ",null,null,null,"Noms des équipes "]
[1,"Dark Legion",1,null,1,null,1,null,1,null,1,null,1,null,1]
[2,"Les Fracasser",2,null,2,null,2,null,2,null,2,null,2,null,2]
[3,"Les Touristes",3,null,3,null,3,null,3,null,3,null,3,null,3,null,"ATTENTION Vous ne devez pas supprimer les noms avant la fin de saison sinon tout est perdu"]
[4,"Frelon",4,null,4,null,4,null,4,null,4,null,4,null,4]
[5,"REPTILES",5,null,5,null,5,null,5,null,5,null,5,null,5,null,"Quand vous avez supprimé les noms des équipes veuillez mettre à jour le classement général"]
[6,"Raptkulls",6,null,6,null,6,null,6,null,6,null,6,null,6]
[7,"JEAN",7,null,7,null,7,null,7,null,7,null,7,null,7,null,"Quand vous avez rentré les noms des équipes ,n'oubliez pas de valider la journée .Bouton bleu"]
[8,"PAUL",8,null,8,null,8,null,8,null,8,null,8,null,8]
[9,"MARC",9,null,9,null,9,null,9,null,9,null,9,null,9]
[10,"JOSE",10,null,10,null,10,null,10,null,10,null,10,null,10]
[]
[]
[]
[]
["Journée5",null,null,null,"Journée6",null,null,null,"Journée7",null,null,null,"Journée8"]
["Noms des équipes ",null,null,null,"Noms des équipes ",null,null,null,"Noms des équipes ",null,null,null,"Noms des équipes "]
[1,null,1,null,1,null,1,null,1,null,1,null,1,null,1]
[2,null,2,null,2,null,2,null,2,null,2,null,2,null,2]
[3,null,3,null,3,null,3,null,3,null,3,null,3,null,3]
[4,null,4,null,4,null,4,null,4,null,4,null,4,null,4]
[5,null,5,null,5,null,5,null,5,null,5,null,5,null,5]
[6,null,6,null,6,null,6,null,6,null,6,null,6,null,6]
[7,null,7,null,7,null,7,null,7,null,7,null,7,null,7]
[8,null,8,null,8,null,8,null,8,null,8,null,8,null,8]
[9,null,9,null,9,null,9,null,9,null,9,null,9,null,9]
[10,null,10,null,10,null,10,null,10,null,10,null,10,null,10]

{"sheet":"Tirage","index":1,"n_rows":13,"n_cols":25,"rows_kept":13,"cut":false,"hidden":true,"merged":[[9,20,9,24],[11,24,11,25]]}
[]
[]
[null,null,null,"                                                                                    Vous devez appuyer uniquement sur le bouton tirage"]
[]
[null,10," joueurs",null,9," manches"]
[]
[null,{"$f":"\"Manche \"&COLUMN()/2","v":"Manche 1"},null,{"$f":"\"Manche \"&COLUMN()/2","v":"Manche 2"},null,"Manche 3",null,{"$f":"\"Manche \"&COLUMN()/2","v":"Manche 4"},null,{"$f":"\"Manche \"&COLUMN()/2","v":"Manche 5"},null,{"$f":"\"Manche \"&COLUMN()/2","v":"Manche 6"},null,{"$f":"\"Manche \"&COLUMN()/2","v":"Manche 7"},null,{"$f":"\"Manche \"&COLUMN()/2","v":"Manche 8"},null,{"$f":"\"Manche \"&COLUMN()/2","v":"Manche 9"}]
[null,"Joueur"," Advers","Joueur"," Advers","Joueur"," Advers","Joueur"," Advers","Joueur"," Advers","Joueur"," Advers","Joueur"," Advers","Joueur"," Advers","Joueur"," Advers"]
[null,7,10,3,9,10,2,6,10,1,6,9,6,3,10,2,9,6,8]
[null,3,5,2,1,4,7,5,9,7,5,3,1,8,1,8,5,7,9,null,"Quand le tirage est fait cliquer sur cette croix"]
[null,6,2,8,7,8,9,4,3,4,2,2,7,4,9,7,3,4,1]
[null,9,1,5,6,1,5,8,2,3,8,10,8,7,6,4,6,10,5,null,null,null,null,null,"Ensuite cliquer ici"]
[null,8,4,4,10,3,6,1,7,10,9,4,5,5,2,10,1,3,2]

{"sheet":"Tournoi","index":2,"n_rows":15,"n_cols":4,"rows_kept":15,"cut":false,"hidden":false,"merged":[[12,3,12,10],[14,3,14,10],[10,3,10,10]]}
[]
[null,null,1]
[null,null,2]
[null,null,3]
[null,null,4]
[null,null,5]
[null,null,6]
[null,null,7]
[null,null,8]
[null,null,9]
[null,null,10,"ATTENTION SI UN TIRAGE EST FAIT , NE LE REFAITE PAS , CELA FAUSSERAIT LES RESULTATS."]
[]
[null,null,null,"Avec les boutons ci-dessus on appelle  les feuilles que l'on a besoin"]
[]
[null,null,null,"Sur chaque feuille il y a un bouton pour revenir sur cette feuille"]

{"sheet":"Photos","index":3,"n_rows":6,"n_cols":2,"rows_kept":6,"cut":false,"hidden":false,"merged":[]}
[null,"DARK LEGION"]
[null,"Les FRACASSER"]
[null,"FRELONS"]
[null,"LES TOURISTES"]
[null,"Raptskulls"]
[null,"REPTILES"]

{"sheet":"Classement Général","index":4,"n_rows":22,"n_cols":16,"rows_kept":22,"cut":false,"hidden":false,"merged":[[0,4,0,7],[3,0,11,3],[3,11,3,12],[3,15,3,16],[3,13,3,14],[2,13,2,14],[4,11,4,12],[4,15,4,16]]}
[null,null,null,null,"CLASSEMENT GENERAL"]
[null,null,null,null,"PLACE","LOGO","EQUIPE","POINTS"]
[null,null,null,null,1,null,"JEAN",{"$f":"IFERROR(VLOOKUP(G3,Journée1!$M$29:$N$38,2,0)*1,0)+IFERROR(VLOOKUP(G3,Journée2!$M$29:$N$38,2,0)*1,0)+IFERROR(VLOOKUP(G3,Journée3!$M$29:$N$38,2,0)*1,0)+IFERROR(VLOOKUP(G3,Journée4!$M$29:$N$38,2,0)*1,0)+IFERROR(VLOOKUP(G3,Journée5!$M$29:$N$38,2,0)*1,0)+IFERROR(VLOOKUP(G3,Journée6!$M$29:$N$38,2,0)*1,0)+IFERROR(VLOOKUP(G3,Journée7!$M$29:$N$38,2,0)*1,0)+IFERROR(VLOOKUP(G3,Journée8!$M$29:$N$38,2,0)*1,0)","v":20},{"$f":"IF(H3=0,-100,H3)","v":20},null,null,null,null,{"$f":"IF(G3=\"\",\"\",G3)","v":"JEAN"}]
[null,null,null,null,2,null,"Raptskulls",null,-100,null,null,{"$f":"IF(G4=0,\"\",G4)","v":"Raptskulls"},null,1,null,{"$f":"IF(G5=\"\",\"\",G5)","v":"Les Touristes"}]
[null,null,null,null,3,null,"Les Touristes",{"$f":"IFERROR(VLOOKUP(G5,Journée1!$M$29:$N$38,2,0)*1,0)+IFERROR(VLOOKUP(G5,Journée2!$M$29:$N$38,2,0)*1,0)+IFERROR(VLOOKUP(G5,Journée3!$M$29:$N$38,2,0)*1,0)+IFERROR(VLOOKUP(G5,Journée4!$M$29:$N$38,2,0)*1,0)+IFERROR(VLOOKUP(G5,Journée5!$M$29:$N$38,2,0)*1,0)+IFERROR(VLOOKUP(G5,Journée6!$M$29:$N$38,2,0)*1,0)+IFERROR(VLOOKUP(G5,Journée7!$M$29:$N$38,2,0)*1,0)+IFERROR(VLOOKUP(G5,Journée8!$M$29:$N$38,2,0)*1,0)","v":11},11,null,null,2,null,null,null,3]
[null,null,null,null,4,null,"PAUL",{"$f":"IFERROR(VLOOKUP(G6,Journée1!$M$29:$N$38,2,0)*1,0)+IFERROR(VLOOKUP(G6,Journée2!$M$29:$N$38,2,0)*1,0)+IFERROR(VLOOKUP(G6,Journée3!$M$29:$N$38,2,0)*1,0)+IFERROR(VLOOKUP(G6,Journée4!$M$29:$N$38,2,0)*1,0)+IFERROR(VLOOKUP(G6,Journée5!$M$29:$N$38,2,0)*1,0)+IFERROR(VLOOKUP(G6,Journée6!$M$29:$N$38,2,0)*1,0)+IFERROR(VLOOKUP(G6,Journée7!$M$29:$N$38,2,0)*1,0)+IFERROR(VLOOKUP(G6,Journée8!$M$29:$N$38,2,0)*1,0)","v":11},11]
[null,null,null,null,5,null,"REPTILES",{"$f":"IFERROR(VLOOKUP(G7,Journée1!$M$29:$N$38,2,0)*1,0)+IFERROR(VLOOKUP(G7,Journée2!$M$29:$N$38,2,0)*1,0)+IFERROR(VLOOKUP(G7,Journée3!$M$29:$N$38,2,0)*1,0)+IFERROR(VLOOKUP(G7,Journée4!$M$29:$N$38,2,0)*1,0)+IFERROR(VLOOKUP(G7,Journée5!$M$29:$N$38,2,0)*1,0)+IFERROR(VLOOKUP(G7,Journée6!$M$29:$N$38,2,0)*1,0)+IFERROR(VLOOKUP(G7,Journée7!$M$29:$N$38,2,0)*1,0)+IFERROR(VLOOKUP(G7,Journée8!$M$29:$N$38,2,0)*1,0)","v":11},11]
[null,null,null,null,6,null,"Les Fracasser",{"$f":"IFERROR(VLOOKUP(G8,Journée1!$M$29:$N$38,2,0)*1,0)+IFERROR(VLOOKUP(G8,Journée2!$M$29:$N$38,2,0)*1,0)+IFERROR(VLOOKUP(G8,Journée3!$M$29:$N$38,2,0)*1,0)+IFERROR(VLOOKUP(G8,Journée4!$M$29:$N$38,2,0)*1,0)+IFERROR(VLOOKUP(G8,Journée5!$M$29:$N$38,2,0)*1,0)+IFERROR(VLOOKUP(G8,Journée6!$M$29:$N$38,2,0)*1,0)+IFERROR(VLOOKUP(G8,Journée7!$M$29:$N$38,2,0)*1,0)+IFERROR(VLOOKUP(G8,Journée8!$M$29:$N$38,2,0)*1,0)","v":11},11]
[null,null,null,null,7,null,"Frelon",{"$f":"IFERROR(VLOOKUP(G9,Journée1!$M$29:$N$38,2,0)*1,0)+IFERROR(VLOOKUP(G9,Journée2!$M$29:$N$38,2,0)*1,0)+IFERROR(VLOOKUP(G9,Journée3!$M$29:$N$38,2,0)*1,0)+IFERROR(VLOOKUP(G9,Journée4!$M$29:$N$38,2,0)*1,0)+IFERROR(VLOOKUP(G9,Journée5!$M$29:$N$38,2,0)*1,0)+IFERROR(VLOOKUP(G9,Journée6!$M$29:$N$38,2,0)*1,0)+IFERROR(VLOOKUP(G9,Journée7!$M$29:$N$38,2,0)*1,0)+IFERROR(VLOOKUP(G9,Journée8!$M$29:$N$38,2,0)*1,0)","v":11},11]
[null,null,null,null,8,null,"Dark Legion",{"$f":"IFERROR(VLOOKUP(G10,Journée1!$M$29:$N$38,2,0)*1,0)+IFERROR(VLOOKUP(G10,Journée2!$M$29:$N$38,2,0)*1,0)+IFERROR(VLOOKUP(G10,Journée3!$M$29:$N$38,2,0)*1,0)+IFERROR(VLOOKUP(G10,Journée4!$M$29:$N$38,2,0)*1,0)+IFERROR(VLOOKUP(G10,Journée5!$M$29:$N$38,2,0)*1,0)+IFERROR(VLOOKUP(G10,Journée6!$M$29:$N$38,2,0)*1,0)+IFERROR(VLOOKUP(G10,Journée7!$M$29:$N$38,2,0)*1,0)+IFERROR(VLOOKUP(G10,Journée8!$M$29:$N$38,2,0)*1,0)","v":10},10]
[null,null,null,null,9,null,"JOSE",{"$f":"IFERROR(VLOOKUP(G11,Journée1!$M$29:$N$38,2,0)*1,0)+IFERROR(VLOOKUP(G11,Journée2!$M$29:$N$38,2,0)*1,0)+IFERROR(VLOOKUP(G11,Journée3!$M$29:$N$38,2,0)*1,0)+IFERROR(VLOOKUP(G11,Journée4!$M$29:$N$38,2,0)*1,0)+IFERROR(VLOOKUP(G11,Journée5!$M$29:$N$38,2,0)*1,0)+IFERROR(VLOOKUP(G11,Journée6!$M$29:$N$38,2,0)*1,0)+IFERROR(VLOOKUP(G11,Journée7!$M$29:$N$38,2,0)*1,0)+IFERROR(VLOOKUP(G11,Journée8!$M$29:$N$38,2,0)*1,0)","v":2},2]
[null,null,null,null,10,null,"MARC",{"$f":"IFERROR(VLOOKUP(G12,Journée1!$M$29:$N$38,2,0)*1,0)+IFERROR(VLOOKUP(G12,Journée2!$M$29:$N$38,2,0)*1,0)+IFERROR(VLOOKUP(G12,Journée3!$M$29:$N$38,2,0)*1,0)+IFERROR(VLOOKUP(G12,Journée4!$M$29:$N$38,2,0)*1,0)+IFERROR(VLOOKUP(G12,Journée5!$M$29:$N$38,2,0)*1,0)+IFERROR(VLOOKUP(G12,Journée6!$M$29:$N$38,2,0)*1,0)+IFERROR(VLOOKUP(G12,Journée7!$M$29:$N$38,2,0)*1,0)+IFERROR(VLOOKUP(G12,Journée8!$M$29:$N$38,2,0)*1,0)","v":1},1]
[null,null,null,null,11,null,0,{"$f":"IFERROR(VLOOKUP(G13,Journée1!$M$29:$N$38,2,0)*1,0)+IFERROR(VLOOKUP(G13,Journée2!$M$29:$N$38,2,0)*1,0)+IFERROR(VLOOKUP(G13,Journée3!$M$29:$N$38,2,0)*1,0)+IFERROR(VLOOKUP(G13,Journée4!$M$29:$N$38,2,0)*1,0)+IFERROR(VLOOKUP(G13,Journée5!$M$29:$N$38,2,0)*1,0)+IFERROR(VLOOKUP(G13,Journée6!$M$29:$N$38,2,0)*1,0)+IFERROR(VLOOKUP(G13,Journée7!$M$29:$N$38,2,0)*1,0)+IFERROR(VLOOKUP(G13,Journée8!$M$29:$N$38,2,0)*1,0)","v":0},-100]
[null,null,null,null,12,null,null,{"$f":"IFERROR(VLOOKUP(G14,Journée1!$M$29:$N$38,2,0)*1,0)+IFERROR(VLOOKUP(G14,Journée2!$M$29:$N$38,2,0)*1,0)+IFERROR(VLOOKUP(G14,Journée3!$M$29:$N$38,2,0)*1,0)+IFERROR(VLOOKUP(G14,Journée4!$M$29:$N$38,2,0)*1,0)+IFERROR(VLOOKUP(G14,Journée5!$M$29:$N$38,2,0)*1,0)+IFERROR(VLOOKUP(G14,Journée6!$M$29:$N$38,2,0)*1,0)+IFERROR(VLOOKUP(G14,Journée7!$M$29:$N$38,2,0)*1,0)+IFERROR(VLOOKUP(G14,Journée8!$M$29:$N$38,2,0)*1,0)","v":0},-100]
[null,null,null,null,13,null,null,{"$f":"IFERROR(VLOOKUP(G15,Journée1!$M$29:$N$38,2,0)*1,0)+IFERROR(VLOOKUP(G15,Journée2!$M$29:$N$38,2,0)*1,0)+IFERROR(VLOOKUP(G15,Journée3!$M$29:$N$38,2,0)*1,0)+IFERROR(VLOOKUP(G15,Journée4!$M$29:$N$38,2,0)*1,0)+IFERROR(VLOOKUP(G15,Journée5!$M$29:$N$38,2,0)*1,0)+IFERROR(VLOOKUP(G15,Journée6!$M$29:$N$38,2,0)*1,0)+IFERROR(VLOOKUP(G15,Journée7!$M$29:$N$38,2,0)*1,0)+IFERROR(VLOOKUP(G15,Journée8!$M$29:$N$38,2,0)*1,0)","v":0},-100]
[null,null,null,null,14,null,null,{"$f":"IFERROR(VLOOKUP(G16,Journée1!$M$29:$N$38,2,0)*1,0)+IFERROR(VLOOKUP(G16,Journée2!$M$29:$N$38,2,0)*1,0)+IFERROR(VLOOKUP(G16,Journée3!$M$29:$N$38,2,0)*1,0)+IFERROR(VLOOKUP(G16,Journée4!$M$29:$N$38,2,0)*1,0)+IFERROR(VLOOKUP(G16,Journée5!$M$29:$N$38,2,0)*1,0)+IFERROR(VLOOKUP(G16,Journée6!$M$29:$N$38,2,0)*1,0)+IFERROR(VLOOKUP(G16,Journée7!$M$29:$N$38,2,0)*1,0)+IFERROR(VLOOKUP(G16,Journée8!$M$29:$N$38,2,0)*1,0)","v":0},-100]
[null,null,null,null,15,null,null,{"$f":"IFERROR(VLOOKUP(G17,Journée1!$M$29:$N$38,2,0)*1,0)+IFERROR(VLOOKUP(G17,Journée2!$M$29:$N$38,2,0)*1,0)+IFERROR(VLOOKUP(G17,Journée3!$M$29:$N$38,2,0)*1,0)+IFERROR(VLOOKUP(G17,Journée4!$M$29:$N$38,2,0)*1,0)+IFERROR(VLOOKUP(G17,Journée5!$M$29:$N$38,2,0)*1,0)+IFERROR(VLOOKUP(G17,Journée6!$M$29:$N$38,2,0)*1,0)+IFERROR(VLOOKUP(G17,Journée7!$M$29:$N$38,2,0)*1,0)+IFERROR(VLOOKUP(G17,Journée8!$M$29:$N$38,2,0)*1,0)","v":0},-100]
[null,null,null,null,16,null,null,{"$f":"IFERROR(VLOOKUP(G18,Journée1!$M$29:$N$38,2,0)*1,0)+IFERROR(VLOOKUP(G18,Journée2!$M$29:$N$38,2,0)*1,0)+IFERROR(VLOOKUP(G18,Journée3!$M$29:$N$38,2,0)*1,0)+IFERROR(VLOOKUP(G18,Journée4!$M$29:$N$38,2,0)*1,0)+IFERROR(VLOOKUP(G18,Journée5!$M$29:$N$38,2,0)*1,0)+IFERROR(VLOOKUP(G18,Journée6!$M$29:$N$38,2,0)*1,0)+IFERROR(VLOOKUP(G18,Journée7!$M$29:$N$38,2,0)*1,0)+IFERROR(VLOOKUP(G18,Journée8!$M$29:$N$38,2,0)*1,0)","v":0}]
[null,null,null,null,17,null,null,{"$f":"IFERROR(VLOOKUP(G19,Journée1!$M$29:$N$38,2,0)*1,0)+IFERROR(VLOOKUP(G19,Journée2!$M$29:$N$38,2,0)*1,0)+IFERROR(VLOOKUP(G19,Journée3!$M$29:$N$38,2,0)*1,0)+IFERROR(VLOOKUP(G19,Journée4!$M$29:$N$38,2,0)*1,0)+IFERROR(VLOOKUP(G19,Journée5!$M$29:$N$38,2,0)*1,0)+IFERROR(VLOOKUP(G19,Journée6!$M$29:$N$38,2,0)*1,0)+IFERROR(VLOOKUP(G19,Journée7!$M$29:$N$38,2,0)*1,0)+IFERROR(VLOOKUP(G19,Journée8!$M$29:$N$38,2,0)*1,0)","v":0}]
[null,null,null,null,18,null,null,{"$f":"IFERROR(VLOOKUP(G20,Journée1!$M$29:$N$38,2,0)*1,0)+IFERROR(VLOOKUP(G20,Journée2!$M$29:$N$38,2,0)*1,0)+IFERROR(VLOOKUP(G20,Journée3!$M$29:$N$38,2,0)*1,0)+IFERROR(VLOOKUP(G20,Journée4!$M$29:$N$38,2,0)*1,0)+IFERROR(VLOOKUP(G20,Journée5!$M$29:$N$38,2,0)*1,0)+IFERROR(VLOOKUP(G20,Journée6!$M$29:$N$38,2,0)*1,0)+IFERROR(VLOOKUP(G20,Journée7!$M$29:$N$38,2,0)*1,0)+IFERROR(VLOOKUP(G20,Journée8!$M$29:$N$38,2,0)*1,0)","v":0}]
[null,null,null,null,19,null,null,{"$f":"IFERROR(VLOOKUP(G21,Journée1!$M$29:$N$38,2,0)*1,0)+IFERROR(VLOOKUP(G21,Journée2!$M$29:$N$38,2,0)*1,0)+IFERROR(VLOOKUP(G21,Journée3!$M$29:$N$38,2,0)*1,0)+IFERROR(VLOOKUP(G21,Journée4!$M$29:$N$38,2,0)*1,0)+IFERROR(VLOOKUP(G21,Journée5!$M$29:$N$38,2,0)*1,0)+IFERROR(VLOOKUP(G21,Journée6!$M$29:$N$38,2,0)*1,0)+IFERROR(VLOOKUP(G21,Journée7!$M$29:$N$38,2,0)*1,0)+IFERROR(VLOOKUP(G21,Journée8!$M$29:$N$38,2,0)*1,0)","v":0}]
[null,null,null,null,20,null,null,{"$f":"IFERROR(VLOOKUP(G22,Journée1!$M$29:$N$38,2,0)*1,0)+IFERROR(VLOOKUP(G22,Journée2!$M$29:$N$38,2,0)*1,0)+IFERROR(VLOOKUP(G22,Journée3!$M$29:$N$38,2,0)*1,0)+IFERROR(VLOOKUP(G22,Journée4!$M$29:$N$38,2,0)*1,0)+IFERROR(VLOOKUP(G22,Journée5!$M$29:$N$38,2,0)*1,0)+IFERROR(VLOOKUP(G22,Journée6!$M$29:$N$38,2,0)*1,0)+IFERROR(VLOOKUP(G22,Journée7!$M$29:$N$38,2,0)*1,0)+IFERROR(VLOOKUP(G22,Journée8!$M$29:$N$38,2,0)*1,0)","v":0}]

{"sheet":"Journée1","index":5,"n_rows":123,"n_cols":64,"rows_kept":123,"cut":false,"hidden":true,"merged":[[8,55,8,56],[7,55,7,56],[8,27,8,28],[8,34,8,35],[8,41,8,42],[7,48,7,49],[8,48,8,49],[7,62,7,63],[7,6,7,7],[7,13,7,14],[7,20,7,21],[7,27,7,28],[7,34,7,35],[0,3,1,3],[0,10,1,10],[0,17,1,17],[0,25,0,28],[26,3,26,5],[26,10,26,11],[26,12,26,13],[24,12,24,13],[0,24,1,24],[10,4,10,7],[10,11,10,14],[10,18,10,21],[8,12,9,14],[10,25,10,28],[8,6,8,7],[8,20,8,21],[9,34,9,61],[0,60,0,63],[0,4,0,7],[0,11,0,14],[0,18,0,21],[0,59,1,59],[0,31,1,31],[0,38,1,38],[0,45,1,45],[0,52,1,52],[0,46,0,49],[0,53,0,56],[0,32,0,35],[0,39,0,42],[8,62,8,63],[7,41,7,42],[10,60,10,63],[10,32,10,35],[10,39,10,42],[10,53,10,56],[10,46,10,49]]}
[null,null,null,"Arbitre","TOUR 1",null,null,null,null,null,"Arbitre","TOUR 2",null,null,null,null,null,"Arbitre","TOUR 3",null,null,null,null,null,"Arbitre","TOUR 4",null,null,null,null,null,"Arbitre","TOUR 5",null,null,null,null,null,"Arbitre","TOUR 6",null,null,null,null,null,"Arbitre","TOUR 7",null,null,null,null,null,"Arbitre","TOUR 8",null,null,null,null,null,"Arbitre","TOUR 9"]
[null,null,null,null,"Equipe 1","Equipe 2","Score 1","Score 2",null,null,null,"Equipe 1","Equipe 2","Score 1","Score 2",null,null,null,"Equipe 1","Equipe 2","Score 1","Score 2",null,null,null,"Equipe 1","Equipe 2","Score 1","Score 2",null,null,null,"Equipe 1","Equipe 2","Score 1","Score 2",null,null,null,"Equipe 1","Equipe 2","Score 1","Score 2",null,null,null,"Equipe 1","Equipe 2","Score 1","Score 2",null,null,null,"Equipe 1","Equipe 2","Score 1","Score 2",null,null,null,"Equipe 1","Equipe 2","Score 1","Score 2"]
[null,{"$f":"Tirage!$B9","v":7},{"$f":"Tirage!$C9","v":10},{"$f":"B7","v":8},{"$f":"VLOOKUP(B3,Inscriptions!$A$3:$B$12,2,FALSE)","v":"JEAN"},{"$f":"VLOOKUP(C3,Inscriptions!$A$3:$B$12,2,FALSE)","v":"JOSE"},2,0,{"$f":"Tirage!D9","v":3},{"$f":"Tirage!E9","v":9},{"$f":"I7","v":4},{"$f":"VLOOKUP(I3,Inscriptions!$A$3:$B$12,2,FALSE)","v":"Les Touristes"},{"$f":"VLOOKUP(J3,Inscriptions!$A$3:$B$12,2,FALSE)","v":"MARC"},1,0,{"$f":"Tirage!$F9","v":10},{"$f":"Tirage!$G9","v":2},{"$f":"P7","v":3},{"$f":"VLOOKUP(P3,Inscriptions!$A$3:$B$12,2,FALSE)","v":"JOSE"},{"$f":"VLOOKUP(Q3,Inscriptions!$A$3:$B$12,2,FALSE)","v":"Les Fracasser"},null,null,{"$f":"Tirage!$H9","v":6},{"$f":"Tirage!$I9","v":10},{"$f":"W7","v":1},{"$f":"VLOOKUP(W3,Inscriptions!$A$3:$B$12,2,FALSE)","v":"Raptkulls"},{"$f":"VLOOKUP(X3,Inscriptions!$A$3:$B$12,2,FALSE)","v":"JOSE"},null,null,{"$f":"Tirage!$J9","v":1},{"$f":"Tirage!$K9","v":6},{"$f":"AD7","v":10},{"$f":"VLOOKUP(AD3,Inscriptions!$A$3:$B$12,2,FALSE)","v":"Dark Legion"},{"$f":"VLOOKUP(AE3,Inscriptions!$A$3:$B$12,2,FALSE)","v":"Raptkulls"},null,null,{"$f":"Tirage!$L9","v":9},{"$f":"Tirage!$M9","v":6},{"$f":"AK7","v":4},{"$f":"VLOOKUP(AK3,Inscriptions!$A$3:$B$12,2,FALSE)","v":"MARC"},{"$f":"VLOOKUP(AL3,Inscriptions!$A$3:$B$12,2,FALSE)","v":"Raptkulls"},null,null,{"$f":"Tirage!$N9","v":3},{"$f":"Tirage!$O9","v":10},{"$f":"AR7","v":5},{"$f":"VLOOKUP(AR3,Inscriptions!$A$3:$B$12,2,FALSE)","v":"Les Touristes"},{"$f":"VLOOKUP(AS3,Inscriptions!$A$3:$B$12,2,FALSE)","v":"JOSE"},null,null,{"$f":"Tirage!$P9","v":2},{"$f":"Tirage!$Q9","v":9},{"$f":"AY7","v":10},{"$f":"VLOOKUP(AY3,Inscriptions!$A$3:$B$12,2,FALSE)","v":"Les Fracasser"},{"$f":"VLOOKUP(AZ3,Inscriptions!$A$3:$B$12,2,FALSE)","v":"MARC"},null,null,{"$f":"Tirage!$R9","v":6},{"$f":"Tirage!$S9","v":8},{"$f":"BF7","v":3},{"$f":"VLOOKUP(BF3,Inscriptions!$A$3:$B$12,2,FALSE)","v":"Raptkulls"},{"$f":"VLOOKUP(BG3,Inscriptions!$A$3:$B$12,2,FALSE)","v":"PAUL"}]
[null,{"$f":"Tirage!$B10","v":3},{"$f":"Tirage!$C10","v":5},{"$f":"C7","v":4},{"$f":"VLOOKUP(B4,Inscriptions!$A$3:$B$12,2,FALSE)","v":"Les Touristes"},{"$f":"VLOOKUP(C4,Inscriptions!$A$3:$B$12,2,FALSE)","v":"REPTILES"},1,2,{"$f":"Tirage!D10","v":2},{"$f":"Tirage!E10","v":1},{"$f":"J7","v":10},{"$f":"VLOOKUP(I4,Inscriptions!$A$3:$B$12,2,FALSE)","v":"Les Fracasser"},{"$f":"VLOOKUP(J4,Inscriptions!$A$3:$B$12,2,FALSE)","v":"Dark Legion"},2,"ab",{"$f":"Tirage!$F10","v":4},{"$f":"Tirage!$G10","v":7},{"$f":"Q7","v":6},{"$f":"VLOOKUP(P4,Inscriptions!$A$3:$B$12,2,FALSE)","v":"Frelon"},{"$f":"VLOOKUP(Q4,Inscriptions!$A$3:$B$12,2,FALSE)","v":"JEAN"},null,null,{"$f":"Tirage!$H10","v":5},{"$f":"Tirage!$I10","v":9},{"$f":"X7","v":7},{"$f":"VLOOKUP(W4,Inscriptions!$A$3:$B$12,2,FALSE)","v":"REPTILES"},{"$f":"VLOOKUP(X4,Inscriptions!$A$3:$B$12,2,FALSE)","v":"MARC"},null,null,{"$f":"Tirage!$J10","v":7},{"$f":"Tirage!$K10","v":5},{"$f":"AE7","v":9},{"$f":"VLOOKUP(AD4,Inscriptions!$A$3:$B$12,2,FALSE)","v":"JEAN"},{"$f":"VLOOKUP(AE4,Inscriptions!$A$3:$B$12,2,FALSE)","v":"REPTILES"},null,null,{"$f":"Tirage!$L10","v":3},{"$f":"Tirage!$M10","v":1},{"$f":"AL7","v":5},{"$f":"VLOOKUP(AK4,Inscriptions!$A$3:$B$12,2,FALSE)","v":"Les Touristes"},{"$f":"VLOOKUP(AL4,Inscriptions!$A$3:$B$12,2,FALSE)","v":"Dark Legion"},null,null,{"$f":"Tirage!$N10","v":8},{"$f":"Tirage!$O10","v":1},{"$f":"AS7","v":2},{"$f":"VLOOKUP(AR4,Inscriptions!$A$3:$B$12,2,FALSE)","v":"PAUL"},{"$f":"VLOOKUP(AS4,Inscriptions!$A$3:$B$12,2,FALSE)","v":"Dark Legion"},null,null,{"$f":"Tirage!$P10","v":8},{"$f":"Tirage!$Q10","v":5},{"$f":"AZ7","v":1},{"$f":"VLOOKUP(AY4,Inscriptions!$A$3:$B$12,2,FALSE)","v":"PAUL"},{"$f":"VLOOKUP(AZ4,Inscriptions!$A$3:$B$12,2,FALSE)","v":"REPTILES"},null,null,{"$f":"Tirage!$R10","v":7},{"$f":"Tirage!$S10","v":9},{"$f":"BG7","v":2},{"$f":"VLOOKUP(BF4,Inscriptions!$A$3:$B$12,2,FALSE)","v":"JEAN"},{"$f":"VLOOKUP(BG4,Inscriptions!$A$3:$B$12,2,FALSE)","v":"MARC"}]
[null,{"$f":"Tirage!$B11","v":6},{"$f":"Tirage!$C11","v":2},{"$f":"B6","v":9},{"$f":"VLOOKUP(B5,Inscriptions!$A$3:$B$12,2,FALSE)","v":"Raptkulls"},{"$f":"VLOOKUP(C5,Inscriptions!$A$3:$B$12,2,FALSE)","v":"Les Fracasser"},2,1,{"$f":"Tirage!D11","v":8},{"$f":"Tirage!E11","v":7},{"$f":"I6","v":5},{"$f":"VLOOKUP(I5,Inscriptions!$A$3:$B$12,2,FALSE)","v":"PAUL"},{"$f":"VLOOKUP(J5,Inscriptions!$A$3:$B$12,2,FALSE)","v":"JEAN"},1,2,{"$f":"Tirage!$F11","v":8},{"$f":"Tirage!$G11","v":9},{"$f":"P6","v":1},{"$f":"VLOOKUP(P5,Inscriptions!$A$3:$B$12,2,FALSE)","v":"PAUL"},{"$f":"VLOOKUP(Q5,Inscriptions!$A$3:$B$12,2,FALSE)","v":"MARC"},null,null,{"$f":"Tirage!$H11","v":4},{"$f":"Tirage!$I11","v":3},{"$f":"W6","v":8},{"$f":"VLOOKUP(W5,Inscriptions!$A$3:$B$12,2,FALSE)","v":"Frelon"},{"$f":"VLOOKUP(X5,Inscriptions!$A$3:$B$12,2,FALSE)","v":"Les Touristes"},null,null,{"$f":"Tirage!$J11","v":4},{"$f":"Tirage!$K11","v":2},{"$f":"AD6","v":3},{"$f":"VLOOKUP(AD5,Inscriptions!$A$3:$B$12,2,FALSE)","v":"Frelon"},{"$f":"VLOOKUP(AE5,Inscriptions!$A$3:$B$12,2,FALSE)","v":"Les Fracasser"},null,null,{"$f":"Tirage!$L11","v":2},{"$f":"Tirage!$M11","v":7},{"$f":"AK6","v":10},{"$f":"VLOOKUP(AK5,Inscriptions!$A$3:$B$12,2,FALSE)","v":"Les Fracasser"},{"$f":"VLOOKUP(AL5,Inscriptions!$A$3:$B$12,2,FALSE)","v":"JEAN"},null,null,{"$f":"Tirage!$N11","v":4},{"$f":"Tirage!$O11","v":9},{"$f":"AR6","v":7},{"$f":"VLOOKUP(AR5,Inscriptions!$A$3:$B$12,2,FALSE)","v":"Frelon"},{"$f":"VLOOKUP(AS5,Inscriptions!$A$3:$B$12,2,FALSE)","v":"MARC"},null,null,{"$f":"Tirage!$P11","v":7},{"$f":"Tirage!$Q11","v":3},{"$f":"AY6","v":4},{"$f":"VLOOKUP(AY5,Inscriptions!$A$3:$B$12,2,FALSE)","v":"JEAN"},{"$f":"VLOOKUP(AZ5,Inscriptions!$A$3:$B$12,2,FALSE)","v":"Les Touristes"},null,null,{"$f":"Tirage!$R11","v":4},{"$f":"Tirage!$S11","v":1},{"$f":"BF6","v":10},{"$f":"VLOOKUP(BF5,Inscriptions!$A$3:$B$12,2,FALSE)","v":"Frelon"},{"$f":"VLOOKUP(BG5,Inscriptions!$A$3:$B$12,2,FALSE)","v":"Dark Legion"}]
[null,{"$f":"Tirage!$B12","v":9},{"$f":"Tirage!$C12","v":1},{"$f":"B3","v":7},{"$f":"VLOOKUP(B6,Inscriptions!$A$3:$B$12,2,FALSE)","v":"MARC"},{"$f":"VLOOKUP(C6,Inscriptions!$A$3:$B$12,2,FALSE)","v":"Dark Legion"},"ab",1,{"$f":"Tirage!D12","v":5},{"$f":"Tirage!E12","v":6},{"$f":"I3","v":3},{"$f":"VLOOKUP(I6,Inscriptions!$A$3:$B$12,2,FALSE)","v":"REPTILES"},{"$f":"VLOOKUP(J6,Inscriptions!$A$3:$B$12,2,FALSE)","v":"Raptkulls"},0,2,{"$f":"Tirage!$F12","v":1},{"$f":"Tirage!$G12","v":5},{"$f":"Q3","v":2},{"$f":"VLOOKUP(P6,Inscriptions!$A$3:$B$12,2,FALSE)","v":"Dark Legion"},{"$f":"VLOOKUP(Q6,Inscriptions!$A$3:$B$12,2,FALSE)","v":"REPTILES"},null,null,{"$f":"Tirage!$H12","v":8},{"$f":"Tirage!$I12","v":2},{"$f":"X3","v":10},{"$f":"VLOOKUP(W6,Inscriptions!$A$3:$B$12,2,FALSE)","v":"PAUL"},{"$f":"VLOOKUP(X6,Inscriptions!$A$3:$B$12,2,FALSE)","v":"Les Fracasser"},null,null,{"$f":"Tirage!$J12","v":3},{"$f":"Tirage!$K12","v":8},{"$f":"AD4","v":7},{"$f":"VLOOKUP(AD6,Inscriptions!$A$3:$B$12,2,FALSE)","v":"Les Touristes"},{"$f":"VLOOKUP(AE6,Inscriptions!$A$3:$B$12,2,FALSE)","v":"PAUL"},null,null,{"$f":"Tirage!$L12","v":10},{"$f":"Tirage!$M12","v":8},{"$f":"AL3","v":6},{"$f":"VLOOKUP(AK6,Inscriptions!$A$3:$B$12,2,FALSE)","v":"JOSE"},{"$f":"VLOOKUP(AL6,Inscriptions!$A$3:$B$12,2,FALSE)","v":"PAUL"},null,null,{"$f":"Tirage!$N12","v":7},{"$f":"Tirage!$O12","v":6},{"$f":"AS4","v":1},{"$f":"VLOOKUP(AR6,Inscriptions!$A$3:$B$12,2,FALSE)","v":"JEAN"},{"$f":"VLOOKUP(AS6,Inscriptions!$A$3:$B$12,2,FALSE)","v":"Raptkulls"},null,null,{"$f":"Tirage!$P12","v":4},{"$f":"Tirage!$Q12","v":6},{"$f":"AY3","v":2},{"$f":"VLOOKUP(AY6,Inscriptions!$A$3:$B$12,2,FALSE)","v":"Frelon"},{"$f":"VLOOKUP(AZ6,Inscriptions!$A$3:$B$12,2,FALSE)","v":"Raptkulls"},null,null,{"$f":"Tirage!$R12","v":10},{"$f":"Tirage!$S12","v":5},{"$f":"BF3","v":6},{"$f":"VLOOKUP(BF6,Inscriptions!$A$3:$B$12,2,FALSE)","v":"JOSE"},{"$f":"VLOOKUP(BG6,Inscriptions!$A$3:$B$12,2,FALSE)","v":"REPTILES"}]
[null,{"$f":"Tirage!$B13","v":8},{"$f":"Tirage!$C13","v":4},{"$f":"B5","v":6},{"$f":"VLOOKUP(B7,Inscriptions!$A$3:$B$12,2,FALSE)","v":"PAUL"},{"$f":"VLOOKUP(C7,Inscriptions!$A$3:$B$12,2,FALSE)","v":"Frelon"},2,1,{"$f":"Tirage!D13","v":4},{"$f":"Tirage!E13","v":10},{"$f":"J3","v":9},{"$f":"VLOOKUP(I7,Inscriptions!$A$3:$B$12,2,FALSE)","v":"Frelon"},{"$f":"VLOOKUP(J7,Inscriptions!$A$3:$B$12,2,FALSE)","v":"JOSE"},2,1,{"$f":"Tirage!$F13","v":3},{"$f":"Tirage!$G13","v":6},{"$f":"P5","v":8},{"$f":"VLOOKUP(P7,Inscriptions!$A$3:$B$12,2,FALSE)","v":"Les Touristes"},{"$f":"VLOOKUP(Q7,Inscriptions!$A$3:$B$12,2,FALSE)","v":"Raptkulls"},null,null,{"$f":"Tirage!$H13","v":1},{"$f":"Tirage!$I13","v":7},{"$f":"W5","v":4},{"$f":"VLOOKUP(W7,Inscriptions!$A$3:$B$12,2,FALSE)","v":"Dark Legion"},{"$f":"VLOOKUP(X7,Inscriptions!$A$3:$B$12,2,FALSE)","v":"JEAN"},null,null,{"$f":"Tirage!$J13","v":10},{"$f":"Tirage!$K13","v":9},{"$f":"AD5","v":4},{"$f":"VLOOKUP(AD7,Inscriptions!$A$3:$B$12,2,FALSE)","v":"JOSE"},{"$f":"VLOOKUP(AE7,Inscriptions!$A$3:$B$12,2,FALSE)","v":"MARC"},null,null,{"$f":"Tirage!$L13","v":4},{"$f":"Tirage!$M13","v":5},{"$f":"AK5","v":2},{"$f":"VLOOKUP(AK7,Inscriptions!$A$3:$B$12,2,FALSE)","v":"Frelon"},{"$f":"VLOOKUP(AL7,Inscriptions!$A$3:$B$12,2,FALSE)","v":"REPTILES"},null,null,{"$f":"Tirage!$N13","v":5},{"$f":"Tirage!$O13","v":2},{"$f":"AR5","v":4},{"$f":"VLOOKUP(AR7,Inscriptions!$A$3:$B$12,2,FALSE)","v":"REPTILES"},{"$f":"VLOOKUP(AS7,Inscriptions!$A$3:$B$12,2,FALSE)","v":"Les Fracasser"},null,null,{"$f":"Tirage!$P13","v":10},{"$f":"Tirage!$Q13","v":1},{"$f":"AY5","v":7},{"$f":"VLOOKUP(AY7,Inscriptions!$A$3:$B$12,2,FALSE)","v":"JOSE"},{"$f":"VLOOKUP(AZ7,Inscriptions!$A$3:$B$12,2,FALSE)","v":"Dark Legion"},null,null,{"$f":"Tirage!$R13","v":3},{"$f":"Tirage!$S13","v":2},{"$f":"BG3","v":8},{"$f":"VLOOKUP(BF7,Inscriptions!$A$3:$B$12,2,FALSE)","v":"Les Touristes"},{"$f":"VLOOKUP(BG7,Inscriptions!$A$3:$B$12,2,FALSE)","v":"Les Fracasser"}]
[null,null,null,null,null,null,"Mettre ab pour abandon",null,null,null,null,null,null,"Mettre ab pour abandon",null,null,null,null,null,null,"Mettre ab pour abandon",null,null,null,null,null,null,"Mettre ab pour abandon",null,null,null,null,null,null,"Mettre ab pour abandon",null,null,null,null,null,null,"Mettre ab pour abandon",null,null,null,null,null,null,"Mettre ab pour abandon",null,null,null,null,null,null,"Mettre ab pour abandon",null,null,null,null,null,null,"Mettre ab pour abandon"]
[null,null,null,null,null,null,null,null,null,null,null,null,"JOURNEE 1"]
[null,null,null,null,null,null,null,null,null,null,null,null,null,null,null,null,null,null,null,null,null,null,null,null,null,null,null,null,null,null,null,null,null,null,"RESULTATS APRES CHAQUE TOUR"]
[null,null,null,null,"TOUR 1",null,null,null,null,null,null,"TOUR 2",null,null,null,null,null,null,"TOUR 3",null,null,null,null,null,null,"TOUR 4",null,null,null,null,null,null,"TOUR 5",null,null,null,null,null,null,"TOUR 6",null,null,null,null,null,null,"TOUR 7",null,null,null,null,null,null,"TOUR 8",null,null,null,null,null,null,"TOUR 9"]
[]
[null,null,null,null,"Equipe","Score pour","Score contre","Pts ",null,null,null,"Equipe","Score pour","Score contre","Pts ",null,null,null,"Equipe","Score pour","Score contre","Pts ",null,null,null,"Equipe","Score pour","Score contre","Pts ",null,null,null,"Equipe","Score pour","Score contre","Pts ",null,null,null,"Equipe","Score pour","Score contre","Pts ",null,null,null,"Equipe","Score pour","Score contre","Pts ",null,null,null,"Equipe","Score pour","Score contre","Pts ",null,null,null,"Equipe","Score pour","Score contre","Pts "]
[null,{"$f":"Tirage!$B9","v":7},null,null,{"$f":"VLOOKUP(B14,Inscriptions!$A$3:$B$12,2,FALSE)","v":"JEAN"},{"$f":"IFERROR(VLOOKUP(E14,$E$3:$G$7,3,0),\"\")&IFERROR(VLOOKUP(E14,$F$3:$H$7,3,0),\"\")","v":"2"},{"$f":"IFERROR(VLOOKUP(E14,$E$3:$H$7,4,0),\"\")&IFERROR(VLOOKUP(E14,$F$3:$H$7,2,0),\"\")","v":"0"},{"$f":"IF(COUNTBLANK(F14:G14),\"\",VLOOKUP(F14&G14,CHOOSE({1,2},tPts3[Score 1]&tPts3[Score 2],tPts3[Pts]),2,0))","v":10},{"$f":"I3","v":3},null,null,{"$f":"VLOOKUP(I14,Inscriptions!$A$2:$B$12,2,FALSE)","v":"Les Touristes"},{"$f":"IFERROR(VLOOKUP(L14,$L$3:$N$7,3,0),\"\")&IFERROR(VLOOKUP(L14,$M$3:$O$7,3,0),\"\")","v":"1"},{"$f":"IFERROR(VLOOKUP(L14,$L$3:$O$7,4,0),\"\")&IFERROR(VLOOKUP(L14,$M$3:$O$7,2,0),\"\")","v":"0"},{"$f":"IF(COUNTBLANK(M14:N14),\"\",VLOOKUP(M14&N14,CHOOSE({1,2},tPts3[Score 1]&tPts3[Score 2],tPts3[Pts]),2,0))","v":10},{"$f":"Tirage!$F9","v":10},null,null,{"$f":"VLOOKUP(P14,Inscriptions!$A$2:$B$12,2,FALSE)","v":"JOSE"},{"$f":"IFERROR(VLOOKUP(S14,$S$3:$U$7,3,0),\"\")&IFERROR(VLOOKUP(S14,$T$3:$V$7,3,0),\"\")","v":""},{"$f":"IFERROR(VLOOKUP(S14,$S$3:$V$7,4,0),\"\")&IFERROR(VLOOKUP(S14,$T$3:$V$7,2,0),\"\")","v":""},{"$f":"IF(COUNTBLANK(T14:U14),\"\",VLOOKUP(T14&U14,CHOOSE({1,2},tPts3[Score 1]&tPts3[Score 2],tPts3[Pts]),2,0))","v":""},{"$f":"W3","v":6},null,null,{"$f":"VLOOKUP(W14,Inscriptions!$A$3:$B$12,2,FALSE)","v":"Raptkulls"},{"$f":"IFERROR(VLOOKUP(Z14,$Z$3:$AB$7,3,0),\"\")&IFERROR(VLOOKUP(Z14,$AA$3:$AC$7,3,0),\"\")","v":""},{"$f":"IFERROR(VLOOKUP(Z14,$Z$3:$AC$7,4,0),\"\")&IFERROR(VLOOKUP(Z14,$AA$3:$AC$7,2,0),\"\")","v":""},{"$f":"IF(COUNTBLANK(AA14:AB14),\"\",VLOOKUP(AA14&AB14,CHOOSE({1,2},tPts3[Score 1]&tPts3[Score 2],tPts3[Pts]),2,0))","v":""},{"$f":"Tirage!$J9","v":1},null,null,{"$f":"VLOOKUP(AD14,Inscriptions!$A$3:$B$12,2,FALSE)","v":"Dark Legion"},{"$f":"IFERROR(VLOOKUP(AG14,$AG$3:$AI$7,3,0),\"\")&IFERROR(VLOOKUP(AG14,$AH$3:$AJ$7,3,0),\"\")","v":""},{"$f":"IFERROR(VLOOKUP(AG14,$AG$3:$AJ$7,4,0),\"\")&IFERROR(VLOOKUP(AG14,$AH$3:$AJ$7,2,0),\"\")","v":""},{"$f":"IF(COUNTBLANK(AH14:AI14),\"\",VLOOKUP(AH14&AI14,CHOOSE({1,2},tPts3[Score 1]&tPts3[Score 2],tPts3[Pts]),2,0))","v":""},{"$f":"Tirage!$L9","v":9},null,null,{"$f":"VLOOKUP(AK14,Inscriptions!$A$3:$B$12,2,FALSE)","v":"MARC"},{"$f":"IFERROR(VLOOKUP(AN14,$AN$3:$AP$7,3,0),\"\")&IFERROR(VLOOKUP(AN14,$AO$3:$AQ$7,3,0),\"\")","v":""},{"$f":"IFERROR(VLOOKUP(AN14,$AN$3:$AQ$7,4,0),\"\")&IFERROR(VLOOKUP(AN14,$AO$3:$AQ$7,2,0),\"\")","v":""},{"$f":"IF(COUNTBLANK(AO14:AP14),\"\",VLOOKUP(AO14&AP14,CHOOSE({1,2},tPts3[Score 1]&tPts3[Score 2],tPts3[Pts]),2,0))","v":""},{"$f":"Tirage!$N9","v":3},null,null,{"$f":"VLOOKUP(AR14,Inscriptions!$A$3:$B$12,2,FALSE)","v":"Les Touristes"},{"$f":"IFERROR(VLOOKUP(AU14,AU$3:AW$7,3,0),\"\")&IFERROR(VLOOKUP(AU14,AV$3:AX$7,3,0),\"\")","v":""},{"$f":"IFERROR(VLOOKUP(AU14,AU$3:AX$7,4,0),\"\")&IFERROR(VLOOKUP(AU14,AV$3:AX$7,2,0),\"\")","v":""},{"$f":"IF(COUNTBLANK(AV14:AW14),\"\",VLOOKUP(AV14&AW14,CHOOSE({1,2},tPts3[Score 1]&tPts3[Score 2],tPts3[Pts]),2,0))","v":""},{"$f":"Tirage!$P9","v":2},null,null,{"$f":"VLOOKUP(AY14,Inscriptions!$A$3:$B$12,2,FALSE)","v":"Les Fracasser"},{"$f":"IFERROR(VLOOKUP(BB14,$BB$3:BD$7,3,0),\"\")&IFERROR(VLOOKUP(BB14,$BC$3:$BE$7,3,0),\"\")","v":""},{"$f":"IFERROR(VLOOKUP(BB14,$BB$3:$BE$7,4,0),\"\")&IFERROR(VLOOKUP(BB14,$BC$3:$BE$7,2,0),\"\")","v":""},{"$f":"IF(COUNTBLANK(BC14:BD14),\"\",VLOOKUP(BC14&BD14,CHOOSE({1,2},tPts3[Score 1]&tPts3[Score 2],tPts3[Pts]),2,0))","v":""},{"$f":"Tirage!$R9","v":6},null,null,{"$f":"VLOOKUP(BF14,Inscriptions!$A$3:$B$12,2,FALSE)","v":"Raptkulls"},{"$f":"IFERROR(VLOOKUP(BI14,$BI$3:BK$7,3,0),\"\")&IFERROR(VLOOKUP(BI14,$BJ$3:$BL$7,3,0),\"\")","v":""},{"$f":"IFERROR(VLOOKUP(BI14,$BI$3:$BL$7,4,0),\"\")&IFERROR(VLOOKUP(BI14,$BJ$3:$BL$7,2,0),\"\")","v":""},{"$f":"IF(COUNTBLANK(BJ14:BK14),\"\",VLOOKUP(BJ14&BK14,CHOOSE({1,2},tPts3[Score 1]&tPts3[Score 2],tPts3[Pts]),2,0))","v":""}]
[null,{"$f":"Tirage!$B10","v":3},null,null,{"$f":"VLOOKUP(B15,Inscriptions!$A$3:$B$12,2,FALSE)","v":"Les Touristes"},{"$f":"IFERROR(VLOOKUP(E15,$E$3:$G$7,3,0),\"\")&IFERROR(VLOOKUP(E15,$F$3:$H$7,3,0),\"\")","v":"1"},{"$f":"IFERROR(VLOOKUP(E15,$E$3:$H$7,4,0),\"\")&IFERROR(VLOOKUP(E15,$F$3:$H$7,2,0),\"\")","v":"2"},{"$f":"IF(COUNTBLANK(F15:G15),\"\",VLOOKUP(F15&G15,CHOOSE({1,2},tPts3[Score 1]&tPts3[Score 2],tPts3[Pts]),2,0))","v":1},{"$f":"I4","v":2},null,null,{"$f":"VLOOKUP(I15,Inscriptions!$A$2:$B$12,2,FALSE)","v":"Les Fracasser"},{"$f":"IFERROR(VLOOKUP(L15,$L$3:$N$7,3,0),\"\")&IFERROR(VLOOKUP(L15,$M$3:$O$7,3,0),\"\")","v":"2"},{"$f":"IFERROR(VLOOKUP(L15,$L$3:$O$7,4,0),\"\")&IFERROR(VLOOKUP(L15,$M$3:$O$7,2,0),\"\")","v":"ab"},{"$f":"IF(COUNTBLANK(M15:N15),\"\",VLOOKUP(M15&N15,CHOOSE({1,2},tPts3[Score 1]&tPts3[Score 2],tPts3[Pts]),2,0))","v":10},{"$f":"Tirage!$F10","v":4},null,null,{"$f":"VLOOKUP(P15,Inscriptions!$A$2:$B$12,2,FALSE)","v":"Frelon"},{"$f":"IFERROR(VLOOKUP(S15,$S$3:$U$7,3,0),\"\")&IFERROR(VLOOKUP(S15,$T$3:$V$7,3,0),\"\")","v":""},{"$f":"IFERROR(VLOOKUP(S15,$S$3:$V$7,4,0),\"\")&IFERROR(VLOOKUP(S15,$T$3:$V$7,2,0),\"\")","v":""},{"$f":"IF(COUNTBLANK(T15:U15),\"\",VLOOKUP(T15&U15,CHOOSE({1,2},tPts3[Score 1]&tPts3[Score 2],tPts3[Pts]),2,0))","v":""},{"$f":"W4","v":5},null,null,{"$f":"VLOOKUP(W15,Inscriptions!$A$3:$B$12,2,FALSE)","v":"REPTILES"},{"$f":"IFERROR(VLOOKUP(Z15,$Z$3:$AB$7,3,0),\"\")&IFERROR(VLOOKUP(Z15,$AA$3:$AC$7,3,0),\"\")","v":""},{"$f":"IFERROR(VLOOKUP(Z15,$Z$3:$AC$7,4,0),\"\")&IFERROR(VLOOKUP(Z15,$AA$3:$AC$7,2,0),\"\")","v":""},{"$f":"IF(COUNTBLANK(AA15:AB15),\"\",VLOOKUP(AA15&AB15,CHOOSE({1,2},tPts3[Score 1]&tPts3[Score 2],tPts3[Pts]),2,0))","v":""},{"$f":"Tirage!$J10","v":7},null,null,{"$f":"VLOOKUP(AD15,Inscriptions!$A$3:$B$12,2,FALSE)","v":"JEAN"},{"$f":"IFERROR(VLOOKUP(AG15,$AG$3:$AI$7,3,0),\"\")&IFERROR(VLOOKUP(AG15,$AH$3:$AJ$7,3,0),\"\")","v":""},{"$f":"IFERROR(VLOOKUP(AG15,$AG$3:$AJ$7,4,0),\"\")&IFERROR(VLOOKUP(AG15,$AH$3:$AJ$7,2,0),\"\")","v":""},{"$f":"IF(COUNTBLANK(AH15:AI15),\"\",VLOOKUP(AH15&AI15,CHOOSE({1,2},tPts3[Score 1]&tPts3[Score 2],tPts3[Pts]),2,0))","v":""},{"$f":"Tirage!$L10","v":3},null,null,{"$f":"VLOOKUP(AK15,Inscriptions!$A$3:$B$12,2,FALSE)","v":"Les Touristes"},{"$f":"IFERROR(VLOOKUP(AN15,$AN$3:$AP$7,3,0),\"\")&IFERROR(VLOOKUP(AN15,$AO$3:$AQ$7,3,0),\"\")","v":""},{"$f":"IFERROR(VLOOKUP(AN15,$AN$3:$AQ$7,4,0),\"\")&IFERROR(VLOOKUP(AN15,$AO$3:$AQ$7,2,0),\"\")","v":""},{"$f":"IF(COUNTBLANK(AO15:AP15),\"\",VLOOKUP(AO15&AP15,CHOOSE({1,2},tPts3[Score 1]&tPts3[Score 2],tPts3[Pts]),2,0))","v":""},{"$f":"Tirage!$N10","v":8},null,null,{"$f":"VLOOKUP(AR15,Inscriptions!$A$3:$B$12,2,FALSE)","v":"PAUL"},{"$f":"IFERROR(VLOOKUP(AU15,AU$3:AW$7,3,0),\"\")&IFERROR(VLOOKUP(AU15,AV$3:AX$7,3,0),\"\")","v":""},{"$f":"IFERROR(VLOOKUP(AU15,AU$3:AX$7,4,0),\"\")&IFERROR(VLOOKUP(AU15,AV$3:AX$7,2,0),\"\")","v":""},{"$f":"IF(COUNTBLANK(AV15:AW15),\"\",VLOOKUP(AV15&AW15,CHOOSE({1,2},tPts3[Score 1]&tPts3[Score 2],tPts3[Pts]),2,0))","v":""},{"$f":"Tirage!$P10","v":8},null,null,{"$f":"VLOOKUP(AY15,Inscriptions!$A$3:$B$12,2,FALSE)","v":"PAUL"},{"$f":"IFERROR(VLOOKUP(BB15,$BB$3:BD$7,3,0),\"\")&IFERROR(VLOOKUP(BB15,$BC$3:$BE$7,3,0),\"\")","v":""},{"$f":"IFERROR(VLOOKUP(BB15,$BB$3:$BE$7,4,0),\"\")&IFERROR(VLOOKUP(BB15,$BC$3:$BE$7,2,0),\"\")","v":""},{"$f":"IF(COUNTBLANK(BC15:BD15),\"\",VLOOKUP(BC15&BD15,CHOOSE({1,2},tPts3[Score 1]&tPts3[Score 2],tPts3[Pts]),2,0))","v":""},{"$f":"Tirage!$R10","v":7},null,null,{"$f":"VLOOKUP(BF15,Inscriptions!$A$3:$B$12,2,FALSE)","v":"JEAN"},{"$f":"IFERROR(VLOOKUP(BI15,$BI$3:BK$7,3,0),\"\")&IFERROR(VLOOKUP(BI15,$BJ$3:$BL$7,3,0),\"\")","v":""},{"$f":"IFERROR(VLOOKUP(BI15,$BI$3:$BL$7,4,0),\"\")&IFERROR(VLOOKUP(BI15,$BJ$3:$BL$7,2,0),\"\")","v":""},{"$f":"IF(COUNTBLANK(BJ15:BK15),\"\",VLOOKUP(BJ15&BK15,CHOOSE({1,2},tPts3[Score 1]&tPts3[Score 2],tPts3[Pts]),2,0))","v":""}]
[null,{"$f":"Tirage!$B11","v":6},null,null,{"$f":"VLOOKUP(B16,Inscriptions!$A$3:$B$12,2,FALSE)","v":"Raptkulls"},"2","1",{"$f":"IF(COUNTBLANK(F16:G16),\"\",VLOOKUP(F16&G16,CHOOSE({1,2},tPts3[Score 1]&tPts3[Score 2],tPts3[Pts]),2,0))","v":10},8,null,null,{"$f":"VLOOKUP(I16,Inscriptions!$A$2:$B$12,2,FALSE)","v":"PAUL"},"1","2",{"$f":"IF(COUNTBLANK(M16:N16),\"\",VLOOKUP(M16&N16,CHOOSE({1,2},tPts3[Score 1]&tPts3[Score 2],tPts3[Pts]),2,0))","v":1},{"$f":"Tirage!$F11","v":8},null,null,{"$f":"VLOOKUP(P16,Inscriptions!$A$2:$B$12,2,FALSE)","v":"PAUL"},"","",{"$f":"IF(COUNTBLANK(T16:U16),\"\",VLOOKUP(T16&U16,CHOOSE({1,2},tPts3[Score 1]&tPts3[Score 2],tPts3[Pts]),2,0))","v":""},{"$f":"W5","v":4},null,null,{"$f":"VLOOKUP(W16,Inscriptions!$A$3:$B$12,2,FALSE)","v":"Frelon"},"","",{"$f":"IF(COUNTBLANK(AA16:AB16),\"\",VLOOKUP(AA16&AB16,CHOOSE({1,2},tPts3[Score 1]&tPts3[Score 2],tPts3[Pts]),2,0))","v":""},{"$f":"Tirage!$J11","v":4},null,null,{"$f":"VLOOKUP(AD16,Inscriptions!$A$3:$B$12,2,FALSE)","v":"Frelon"},"","",{"$f":"IF(COUNTBLANK(AH16:AI16),\"\",VLOOKUP(AH16&AI16,CHOOSE({1,2},tPts3[Score 1]&tPts3[Score 2],tPts3[Pts]),2,0))","v":""},{"$f":"Tirage!$L11","v":2},null,null,{"$f":"VLOOKUP(AK16,Inscriptions!$A$3:$B$12,2,FALSE)","v":"Les Fracasser"},"","",{"$f":"IF(COUNTBLANK(AO16:AP16),\"\",VLOOKUP(AO16&AP16,CHOOSE({1,2},tPts3[Score 1]&tPts3[Score 2],tPts3[Pts]),2,0))","v":""},{"$f":"Tirage!$N11","v":4},null,null,{"$f":"VLOOKUP(AR16,Inscriptions!$A$3:$B$12,2,FALSE)","v":"Frelon"},"","",{"$f":"IF(COUNTBLANK(AV16:AW16),\"\",VLOOKUP(AV16&AW16,CHOOSE({1,2},tPts3[Score 1]&tPts3[Score 2],tPts3[Pts]),2,0))","v":""},{"$f":"Tirage!$P11","v":7},null,null,{"$f":"VLOOKUP(AY16,Inscriptions!$A$3:$B$12,2,FALSE)","v":"JEAN"},{"$f":"IFERROR(VLOOKUP(BB16,$BB$3:BD$7,3,0),\"\")&IFERROR(VLOOKUP(BB16,$BC$3:$BE$7,3,0),\"\")","v":""},"",{"$f":"IF(COUNTBLANK(BC16:BD16),\"\",VLOOKUP(BC16&BD16,CHOOSE({1,2},tPts3[Score 1]&tPts3[Score 2],tPts3[Pts]),2,0))","v":""},{"$f":"Tirage!$R11","v":4},null,null,{"$f":"VLOOKUP(BF16,Inscriptions!$A$3:$B$12,2,FALSE)","v":"Frelon"},{"$f":"IFERROR(VLOOKUP(BI16,$BI$3:BK$7,3,0),\"\")&IFERROR(VLOOKUP(BI16,$BJ$3:$BL$7,3,0),\"\")","v":""},"",{"$f":"IF(COUNTBLANK(BJ16:BK16),\"\",VLOOKUP(BJ16&BK16,CHOOSE({1,2},tPts3[Score 1]&tPts3[Score 2],tPts3[Pts]),2,0))","v":""}]
[null,{"$f":"Tirage!$B12","v":9},null,null,{"$f":"VLOOKUP(B17,Inscriptions!$A$3:$B$12,2,FALSE)","v":"MARC"},"ab","1",{"$f":"IF(COUNTBLANK(F17:G17),\"\",VLOOKUP(F17&G17,CHOOSE({1,2},tPts3[Score 1]&tPts3[Score 2],tPts3[Pts]),2,0))","v":0},5,null,null,{"$f":"VLOOKUP(I17,Inscriptions!$A$2:$B$12,2,FALSE)","v":"REPTILES"},"0","2",{"$f":"IF(COUNTBLANK(M17:N17),\"\",VLOOKUP(M17&N17,CHOOSE({1,2},tPts3[Score 1]&tPts3[Score 2],tPts3[Pts]),2,0))","v":1},{"$f":"Tirage!$F12","v":1},null,null,{"$f":"VLOOKUP(P17,Inscriptions!$A$2:$B$12,2,FALSE)","v":"Dark Legion"},"","",{"$f":"IF(COUNTBLANK(T17:U17),\"\",VLOOKUP(T17&U17,CHOOSE({1,2},tPts3[Score 1]&tPts3[Score 2],tPts3[Pts]),2,0))","v":""},{"$f":"W6","v":8},null,null,{"$f":"VLOOKUP(W17,Inscriptions!$A$3:$B$12,2,FALSE)","v":"PAUL"},"","",{"$f":"IF(COUNTBLANK(AA17:AB17),\"\",VLOOKUP(AA17&AB17,CHOOSE({1,2},tPts3[Score 1]&tPts3[Score 2],tPts3[Pts]),2,0))","v":""},{"$f":"Tirage!$J12","v":3},null,null,{"$f":"VLOOKUP(AD17,Inscriptions!$A$3:$B$12,2,FALSE)","v":"Les Touristes"},"","",{"$f":"IF(COUNTBLANK(AH17:AI17),\"\",VLOOKUP(AH17&AI17,CHOOSE({1,2},tPts3[Score 1]&tPts3[Score 2],tPts3[Pts]),2,0))","v":""},{"$f":"Tirage!$L12","v":10},null,null,{"$f":"VLOOKUP(AK17,Inscriptions!$A$3:$B$12,2,FALSE)","v":"JOSE"},"","",{"$f":"IF(COUNTBLANK(AO17:AP17),\"\",VLOOKUP(AO17&AP17,CHOOSE({1,2},tPts3[Score 1]&tPts3[Score 2],tPts3[Pts]),2,0))","v":""},{"$f":"Tirage!$N12","v":7},null,null,{"$f":"VLOOKUP(AR17,Inscriptions!$A$3:$B$12,2,FALSE)","v":"JEAN"},"","",{"$f":"IF(COUNTBLANK(AV17:AW17),\"\",VLOOKUP(AV17&AW17,CHOOSE({1,2},tPts3[Score 1]&tPts3[Score 2],tPts3[Pts]),2,0))","v":""},{"$f":"Tirage!$P12","v":4},null,null,{"$f":"VLOOKUP(AY17,Inscriptions!$A$3:$B$12,2,FALSE)","v":"Frelon"},{"$f":"IFERROR(VLOOKUP(BB17,$BB$3:BD$7,3,0),\"\")&IFERROR(VLOOKUP(BB17,$BC$3:$BE$7,3,0),\"\")","v":""},"",{"$f":"IF(COUNTBLANK(BC17:BD17),\"\",VLOOKUP(BC17&BD17,CHOOSE({1,2},tPts3[Score 1]&tPts3[Score 2],tPts3[Pts]),2,0))","v":""},{"$f":"Tirage!$R12","v":10},null,null,{"$f":"VLOOKUP(BF17,Inscriptions!$A$3:$B$12,2,FALSE)","v":"JOSE"},{"$f":"IFERROR(VLOOKUP(BI17,$BI$3:BK$7,3,0),\"\")&IFERROR(VLOOKUP(BI17,$BJ$3:$BL$7,3,0),\"\")","v":""},"",{"$f":"IF(COUNTBLANK(BJ17:BK17),\"\",VLOOKUP(BJ17&BK17,CHOOSE({1,2},tPts3[Score 1]&tPts3[Score 2],tPts3[Pts]),2,0))","v":""}]
[null,{"$f":"Tirage!$B13","v":8},null,null,{"$f":"VLOOKUP(B18,Inscriptions!$A$3:$B$12,2,FALSE)","v":"PAUL"},"2","1",{"$f":"IF(COUNTBLANK(F18:G18),\"\",VLOOKUP(F18&G18,CHOOSE({1,2},tPts3[Score 1]&tPts3[Score 2],tPts3[Pts]),2,0))","v":10},4,null,null,{"$f":"VLOOKUP(I18,Inscriptions!$A$2:$B$12,2,FALSE)","v":"Frelon"},"2","1",{"$f":"IF(COUNTBLANK(M18:N18),\"\",VLOOKUP(M18&N18,CHOOSE({1,2},tPts3[Score 1]&tPts3[Score 2],tPts3[Pts]),2,0))","v":10},{"$f":"Tirage!$F13","v":3},null,null,{"$f":"VLOOKUP(P18,Inscriptions!$A$2:$B$12,2,FALSE)","v":"Les Touristes"},"","",{"$f":"IF(COUNTBLANK(T18:U18),\"\",VLOOKUP(T18&U18,CHOOSE({1,2},tPts3[Score 1]&tPts3[Score 2],tPts3[Pts]),2,0))","v":""},{"$f":"W7","v":1},null,null,{"$f":"VLOOKUP(W18,Inscriptions!$A$3:$B$12,2,FALSE)","v":"Dark Legion"},"","",{"$f":"IF(COUNTBLANK(AA18:AB18),\"\",VLOOKUP(AA18&AB18,CHOOSE({1,2},tPts3[Score 1]&tPts3[Score 2],tPts3[Pts]),2,0))","v":""},{"$f":"Tirage!$J13","v":10},null,null,{"$f":"VLOOKUP(AD18,Inscriptions!$A$3:$B$12,2,FALSE)","v":"JOSE"},"","",{"$f":"IF(COUNTBLANK(AH18:AI18),\"\",VLOOKUP(AH18&AI18,CHOOSE({1,2},tPts3[Score 1]&tPts3[Score 2],tPts3[Pts]),2,0))","v":""},{"$f":"Tirage!$L13","v":4},null,null,{"$f":"VLOOKUP(AK18,Inscriptions!$A$3:$B$12,2,FALSE)","v":"Frelon"},"","",{"$f":"IF(COUNTBLANK(AO18:AP18),\"\",VLOOKUP(AO18&AP18,CHOOSE({1,2},tPts3[Score 1]&tPts3[Score 2],tPts3[Pts]),2,0))","v":""},{"$f":"Tirage!$N13","v":5},null,null,{"$f":"VLOOKUP(AR18,Inscriptions!$A$3:$B$12,2,FALSE)","v":"REPTILES"},"","",{"$f":"IF(COUNTBLANK(AV18:AW18),\"\",VLOOKUP(AV18&AW18,CHOOSE({1,2},tPts3[Score 1]&tPts3[Score 2],tPts3[Pts]),2,0))","v":""},{"$f":"Tirage!$P13","v":10},null,null,{"$f":"VLOOKUP(AY18,Inscriptions!$A$3:$B$12,2,FALSE)","v":"JOSE"},{"$f":"IFERROR(VLOOKUP(BB18,$BB$3:BD$7,3,0),\"\")&IFERROR(VLOOKUP(BB18,$BC$3:$BE$7,3,0),\"\")","v":""},"",{"$f":"IF(COUNTBLANK(BC18:BD18),\"\",VLOOKUP(BC18&BD18,CHOOSE({1,2},tPts3[Score 1]&tPts3[Score 2],tPts3[Pts]),2,0))","v":""},{"$f":"Tirage!$R13","v":3},null,null,{"$f":"VLOOKUP(BF18,Inscriptions!$A$3:$B$12,2,FALSE)","v":"Les Touristes"},{"$f":"IFERROR(VLOOKUP(BI18,$BI$3:BK$7,3,0),\"\")&IFERROR(VLOOKUP(BI18,$BJ$3:$BL$7,3,0),\"\")","v":""},"",{"$f":"IF(COUNTBLANK(BJ18:BK18),\"\",VLOOKUP(BJ18&BK18,CHOOSE({1,2},tPts3[Score 1]&tPts3[Score 2],tPts3[Pts]),2,0))","v":""}]
[null,{"$f":"Tirage!$C9","v":10},null,null,{"$f":"VLOOKUP(B19,Inscriptions!$A$3:$B$12,2,FALSE)","v":"JOSE"},"0","2",{"$f":"IF(COUNTBLANK(F19:G19),\"\",VLOOKUP(F19&G19,CHOOSE({1,2},tPts3[Score 1]&tPts3[Score 2],tPts3[Pts]),2,0))","v":1},{"$f":"J3","v":9},null,null,{"$f":"VLOOKUP(I19,Inscriptions!$A$2:$B$12,2,FALSE)","v":"MARC"},"0","1",{"$f":"IF(COUNTBLANK(M19:N19),\"\",VLOOKUP(M19&N19,CHOOSE({1,2},tPts3[Score 1]&tPts3[Score 2],tPts3[Pts]),2,0))","v":1},{"$f":"Tirage!$G9","v":2},null,null,{"$f":"VLOOKUP(P19,Inscriptions!$A$2:$B$12,2,FALSE)","v":"Les Fracasser"},"","",{"$f":"IF(COUNTBLANK(T19:U19),\"\",VLOOKUP(T19&U19,CHOOSE({1,2},tPts3[Score 1]&tPts3[Score 2],tPts3[Pts]),2,0))","v":""},{"$f":"X3","v":10},null,null,{"$f":"VLOOKUP(W19,Inscriptions!$A$3:$B$12,2,FALSE)","v":"JOSE"},"","",{"$f":"IF(COUNTBLANK(AA19:AB19),\"\",VLOOKUP(AA19&AB19,CHOOSE({1,2},tPts3[Score 1]&tPts3[Score 2],tPts3[Pts]),2,0))","v":""},{"$f":"Tirage!$K9","v":6},null,null,{"$f":"VLOOKUP(AD19,Inscriptions!$A$3:$B$12,2,FALSE)","v":"Raptkulls"},"","",{"$f":"IF(COUNTBLANK(AH19:AI19),\"\",VLOOKUP(AH19&AI19,CHOOSE({1,2},tPts3[Score 1]&tPts3[Score 2],tPts3[Pts]),2,0))","v":""},{"$f":"Tirage!$M9","v":6},null,null,{"$f":"VLOOKUP(AK19,Inscriptions!$A$3:$B$12,2,FALSE)","v":"Raptkulls"},"","",{"$f":"IF(COUNTBLANK(AO19:AP19),\"\",VLOOKUP(AO19&AP19,CHOOSE({1,2},tPts3[Score 1]&tPts3[Score 2],tPts3[Pts]),2,0))","v":""},{"$f":"Tirage!$O9","v":10},null,null,{"$f":"VLOOKUP(AR19,Inscriptions!$A$3:$B$12,2,FALSE)","v":"JOSE"},"","",{"$f":"IF(COUNTBLANK(AV19:AW19),\"\",VLOOKUP(AV19&AW19,CHOOSE({1,2},tPts3[Score 1]&tPts3[Score 2],tPts3[Pts]),2,0))","v":""},{"$f":"Tirage!$Q9","v":9},null,null,{"$f":"VLOOKUP(AY19,Inscriptions!$A$3:$B$12,2,FALSE)","v":"MARC"},{"$f":"IFERROR(VLOOKUP(BB19,$BB$3:BD$7,3,0),\"\")&IFERROR(VLOOKUP(BB19,$BC$3:$BE$7,3,0),\"\")","v":""},"",{"$f":"IF(COUNTBLANK(BC19:BD19),\"\",VLOOKUP(BC19&BD19,CHOOSE({1,2},tPts3[Score 1]&tPts3[Score 2],tPts3[Pts]),2,0))","v":""},{"$f":"Tirage!$S9","v":8},null,null,{"$f":"VLOOKUP(BF19,Inscriptions!$A$3:$B$12,2,FALSE)","v":"PAUL"},{"$f":"IFERROR(VLOOKUP(BI19,$BI$3:BK$7,3,0),\"\")&IFERROR(VLOOKUP(BI19,$BJ$3:$BL$7,3,0),\"\")","v":""},"",{"$f":"IF(COUNTBLANK(BJ19:BK19),\"\",VLOOKUP(BJ19&BK19,CHOOSE({1,2},tPts3[Score 1]&tPts3[Score 2],tPts3[Pts]),2,0))","v":""}]
[null,{"$f":"Tirage!$C10","v":5},null,null,{"$f":"VLOOKUP(B20,Inscriptions!$A$3:$B$12,2,FALSE)","v":"REPTILES"},"2","1",{"$f":"IF(COUNTBLANK(F20:G20),\"\",VLOOKUP(F20&G20,CHOOSE({1,2},tPts3[Score 1]&tPts3[Score 2],tPts3[Pts]),2,0))","v":10},{"$f":"J4","v":1},null,null,{"$f":"VLOOKUP(I20,Inscriptions!$A$2:$B$12,2,FALSE)","v":"Dark Legion"},"ab","2",{"$f":"IF(COUNTBLANK(M20:N20),\"\",VLOOKUP(M20&N20,CHOOSE({1,2},tPts3[Score 1]&tPts3[Score 2],tPts3[Pts]),2,0))","v":0},{"$f":"Tirage!$G10","v":7},null,null,{"$f":"VLOOKUP(P20,Inscriptions!$A$2:$B$12,2,FALSE)","v":"JEAN"},"","",{"$f":"IF(COUNTBLANK(T20:U20),\"\",VLOOKUP(T20&U20,CHOOSE({1,2},tPts3[Score 1]&tPts3[Score 2],tPts3[Pts]),2,0))","v":""},{"$f":"X4","v":9},null,null,{"$f":"VLOOKUP(W20,Inscriptions!$A$3:$B$12,2,FALSE)","v":"MARC"},"","",{"$f":"IF(COUNTBLANK(AA20:AB20),\"\",VLOOKUP(AA20&AB20,CHOOSE({1,2},tPts3[Score 1]&tPts3[Score 2],tPts3[Pts]),2,0))","v":""},{"$f":"Tirage!$K10","v":5},null,null,{"$f":"VLOOKUP(AD20,Inscriptions!$A$3:$B$12,2,FALSE)","v":"REPTILES"},"","",{"$f":"IF(COUNTBLANK(AH20:AI20),\"\",VLOOKUP(AH20&AI20,CHOOSE({1,2},tPts3[Score 1]&tPts3[Score 2],tPts3[Pts]),2,0))","v":""},{"$f":"Tirage!$M10","v":1},null,null,{"$f":"VLOOKUP(AK20,Inscriptions!$A$3:$B$12,2,FALSE)","v":"Dark Legion"},"","",{"$f":"IF(COUNTBLANK(AO20:AP20),\"\",VLOOKUP(AO20&AP20,CHOOSE({1,2},tPts3[Score 1]&tPts3[Score 2],tPts3[Pts]),2,0))","v":""},{"$f":"Tirage!$O10","v":1},null,null,{"$f":"VLOOKUP(AR20,Inscriptions!$A$3:$B$12,2,FALSE)","v":"Dark Legion"},"","",{"$f":"IF(COUNTBLANK(AV20:AW20),\"\",VLOOKUP(AV20&AW20,CHOOSE({1,2},tPts3[Score 1]&tPts3[Score 2],tPts3[Pts]),2,0))","v":""},{"$f":"Tirage!$Q10","v":5},null,null,{"$f":"VLOOKUP(AY20,Inscriptions!$A$3:$B$12,2,FALSE)","v":"REPTILES"},{"$f":"IFERROR(VLOOKUP(BB20,$BB$3:BD$7,3,0),\"\")&IFERROR(VLOOKUP(BB20,$BC$3:$BE$7,3,0),\"\")","v":""},"",{"$f":"IF(COUNTBLANK(BC20:BD20),\"\",VLOOKUP(BC20&BD20,CHOOSE({1,2},tPts3[Score 1]&tPts3[Score 2],tPts3[Pts]),2,0))","v":""},{"$f":"Tirage!$S10","v":9},null,null,{"$f":"VLOOKUP(BF20,Inscriptions!$A$3:$B$12,2,FALSE)","v":"MARC"},{"$f":"IFERROR(VLOOKUP(BI20,$BI$3:BK$7,3,0),\"\")&IFERROR(VLOOKUP(BI20,$BJ$3:$BL$7,3,0),\"\")","v":""},"",{"$f":"IF(COUNTBLANK(BJ20:BK20),\"\",VLOOKUP(BJ20&BK20,CHOOSE({1,2},tPts3[Score 1]&tPts3[Score 2],tPts3[Pts]),2,0))","v":""}]
[null,{"$f":"Tirage!$C11","v":2},null,null,{"$f":"VLOOKUP(B21,Inscriptions!$A$3:$B$12,2,FALSE)","v":"Les Fracasser"},"1","2",{"$f":"IF(COUNTBLANK(F21:G21),\"\",VLOOKUP(F21&G21,CHOOSE({1,2},tPts3[Score 1]&tPts3[Score 2],tPts3[Pts]),2,0))","v":1},7,null,null,{"$f":"VLOOKUP(I21,Inscriptions!$A$2:$B$12,2,FALSE)","v":"JEAN"},"2","1",{"$f":"IF(COUNTBLANK(M21:N21),\"\",VLOOKUP(M21&N21,CHOOSE({1,2},tPts3[Score 1]&tPts3[Score 2],tPts3[Pts]),2,0))","v":10},{"$f":"Tirage!$G11","v":9},null,null,{"$f":"VLOOKUP(P21,Inscriptions!$A$2:$B$12,2,FALSE)","v":"MARC"},"","",{"$f":"IF(COUNTBLANK(T21:U21),\"\",VLOOKUP(T21&U21,CHOOSE({1,2},tPts3[Score 1]&tPts3[Score 2],tPts3[Pts]),2,0))","v":""},{"$f":"X5","v":3},null,null,{"$f":"VLOOKUP(W21,Inscriptions!$A$3:$B$12,2,FALSE)","v":"Les Touristes"},"","",{"$f":"IF(COUNTBLANK(AA21:AB21),\"\",VLOOKUP(AA21&AB21,CHOOSE({1,2},tPts3[Score 1]&tPts3[Score 2],tPts3[Pts]),2,0))","v":""},{"$f":"Tirage!$K11","v":2},null,null,{"$f":"VLOOKUP(AD21,Inscriptions!$A$3:$B$12,2,FALSE)","v":"Les Fracasser"},"","",{"$f":"IF(COUNTBLANK(AH21:AI21),\"\",VLOOKUP(AH21&AI21,CHOOSE({1,2},tPts3[Score 1]&tPts3[Score 2],tPts3[Pts]),2,0))","v":""},{"$f":"Tirage!$M11","v":7},null,null,{"$f":"VLOOKUP(AK21,Inscriptions!$A$3:$B$12,2,FALSE)","v":"JEAN"},"","",{"$f":"IF(COUNTBLANK(AO21:AP21),\"\",VLOOKUP(AO21&AP21,CHOOSE({1,2},tPts3[Score 1]&tPts3[Score 2],tPts3[Pts]),2,0))","v":""},{"$f":"Tirage!$O11","v":9},null,null,{"$f":"VLOOKUP(AR21,Inscriptions!$A$3:$B$12,2,FALSE)","v":"MARC"},"","",{"$f":"IF(COUNTBLANK(AV21:AW21),\"\",VLOOKUP(AV21&AW21,CHOOSE({1,2},tPts3[Score 1]&tPts3[Score 2],tPts3[Pts]),2,0))","v":""},{"$f":"Tirage!$Q11","v":3},null,null,{"$f":"VLOOKUP(AY21,Inscriptions!$A$3:$B$12,2,FALSE)","v":"Les Touristes"},{"$f":"IFERROR(VLOOKUP(BB21,$BB$3:BD$7,3,0),\"\")&IFERROR(VLOOKUP(BB21,$BC$3:$BE$7,3,0),\"\")","v":""},"",{"$f":"IF(COUNTBLANK(BC21:BD21),\"\",VLOOKUP(BC21&BD21,CHOOSE({1,2},tPts3[Score 1]&tPts3[Score 2],tPts3[Pts]),2,0))","v":""},{"$f":"Tirage!$S11","v":1},null,null,{"$f":"VLOOKUP(BF21,Inscriptions!$A$3:$B$12,2,FALSE)","v":"Dark Legion"},{"$f":"IFERROR(VLOOKUP(BI21,$BI$3:BK$7,3,0),\"\")&IFERROR(VLOOKUP(BI21,$BJ$3:$BL$7,3,0),\"\")","v":""},"",{"$f":"IF(COUNTBLANK(BJ21:BK21),\"\",VLOOKUP(BJ21&BK21,CHOOSE({1,2},tPts3[Score 1]&tPts3[Score 2],tPts3[Pts]),2,0))","v":""}]
[null,{"$f":"Tirage!$C12","v":1},null,null,{"$f":"VLOOKUP(B22,Inscriptions!$A$3:$B$12,2,FALSE)","v":"Dark Legion"},"1","ab",{"$f":"IF(COUNTBLANK(F22:G22),\"\",VLOOKUP(F22&G22,CHOOSE({1,2},tPts3[Score 1]&tPts3[Score 2],tPts3[Pts]),2,0))","v":10},6,null,null,{"$f":"VLOOKUP(I22,Inscriptions!$A$2:$B$12,2,FALSE)","v":"Raptkulls"},"2","0",{"$f":"IF(COUNTBLANK(M22:N22),\"\",VLOOKUP(M22&N22,CHOOSE({1,2},tPts3[Score 1]&tPts3[Score 2],tPts3[Pts]),2,0))","v":10},{"$f":"Tirage!$G12","v":5},null,null,{"$f":"VLOOKUP(P22,Inscriptions!$A$2:$B$12,2,FALSE)","v":"REPTILES"},"","",{"$f":"IF(COUNTBLANK(T22:U22),\"\",VLOOKUP(T22&U22,CHOOSE({1,2},tPts3[Score 1]&tPts3[Score 2],tPts3[Pts]),2,0))","v":""},{"$f":"X6","v":2},null,null,{"$f":"VLOOKUP(W22,Inscriptions!$A$3:$B$12,2,FALSE)","v":"Les Fracasser"},"","",{"$f":"IF(COUNTBLANK(AA22:AB22),\"\",VLOOKUP(AA22&AB22,CHOOSE({1,2},tPts3[Score 1]&tPts3[Score 2],tPts3[Pts]),2,0))","v":""},{"$f":"Tirage!$K12","v":8},null,null,{"$f":"VLOOKUP(AD22,Inscriptions!$A$3:$B$12,2,FALSE)","v":"PAUL"},"","",{"$f":"IF(COUNTBLANK(AH22:AI22),\"\",VLOOKUP(AH22&AI22,CHOOSE({1,2},tPts3[Score 1]&tPts3[Score 2],tPts3[Pts]),2,0))","v":""},{"$f":"Tirage!$M12","v":8},null,null,{"$f":"VLOOKUP(AK22,Inscriptions!$A$3:$B$12,2,FALSE)","v":"PAUL"},"","",{"$f":"IF(COUNTBLANK(AO22:AP22),\"\",VLOOKUP(AO22&AP22,CHOOSE({1,2},tPts3[Score 1]&tPts3[Score 2],tPts3[Pts]),2,0))","v":""},{"$f":"Tirage!$O12","v":6},null,null,{"$f":"VLOOKUP(AR22,Inscriptions!$A$3:$B$12,2,FALSE)","v":"Raptkulls"},"","",{"$f":"IF(COUNTBLANK(AV22:AW22),\"\",VLOOKUP(AV22&AW22,CHOOSE({1,2},tPts3[Score 1]&tPts3[Score 2],tPts3[Pts]),2,0))","v":""},{"$f":"Tirage!$Q12","v":6},null,null,{"$f":"VLOOKUP(AY22,Inscriptions!$A$3:$B$12,2,FALSE)","v":"Raptkulls"},{"$f":"IFERROR(VLOOKUP(BB22,$BB$3:BD$7,3,0),\"\")&IFERROR(VLOOKUP(BB22,$BC$3:$BE$7,3,0),\"\")","v":""},"",{"$f":"IF(COUNTBLANK(BC22:BD22),\"\",VLOOKUP(BC22&BD22,CHOOSE({1,2},tPts3[Score 1]&tPts3[Score 2],tPts3[Pts]),2,0))","v":""},{"$f":"Tirage!$S12","v":5},null,null,{"$f":"VLOOKUP(BF22,Inscriptions!$A$3:$B$12,2,FALSE)","v":"REPTILES"},{"$f":"IFERROR(VLOOKUP(BI22,$BI$3:BK$7,3,0),\"\")&IFERROR(VLOOKUP(BI22,$BJ$3:$BL$7,3,0),\"\")","v":""},"",{"$f":"IF(COUNTBLANK(BJ22:BK22),\"\",VLOOKUP(BJ22&BK22,CHOOSE({1,2},tPts3[Score 1]&tPts3[Score 2],tPts3[Pts]),2,0))","v":""}]
[null,{"$f":"Tirage!$C13","v":4},null,null,{"$f":"VLOOKUP(B23,Inscriptions!$A$3:$B$12,2,FALSE)","v":"Frelon"},"1","2",{"$f":"IF(COUNTBLANK(F23:G23),\"\",VLOOKUP(F23&G23,CHOOSE({1,2},tPts3[Score 1]&tPts3[Score 2],tPts3[Pts]),2,0))","v":1},10,null,null,{"$f":"VLOOKUP(I23,Inscriptions!$A$2:$B$12,2,FALSE)","v":"JOSE"},"1","2",{"$f":"IF(COUNTBLANK(M23:N23),\"\",VLOOKUP(M23&N23,CHOOSE({1,2},tPts3[Score 1]&tPts3[Score 2],tPts3[Pts]),2,0))","v":1},{"$f":"Tirage!$G13","v":6},null,null,{"$f":"VLOOKUP(P23,Inscriptions!$A$2:$B$12,2,FALSE)","v":"Raptkulls"},"","",{"$f":"IF(COUNTBLANK(T23:U23),\"\",VLOOKUP(T23&U23,CHOOSE({1,2},tPts3[Score 1]&tPts3[Score 2],tPts3[Pts]),2,0))","v":""},{"$f":"X7","v":7},null,null,{"$f":"VLOOKUP(W23,Inscriptions!$A$3:$B$12,2,FALSE)","v":"JEAN"},"","",{"$f":"IF(COUNTBLANK(AA23:AB23),\"\",VLOOKUP(AA23&AB23,CHOOSE({1,2},tPts3[Score 1]&tPts3[Score 2],tPts3[Pts]),2,0))","v":""},{"$f":"Tirage!$K13","v":9},null,null,{"$f":"VLOOKUP(AD23,Inscriptions!$A$3:$B$12,2,FALSE)","v":"MARC"},"","",{"$f":"IF(COUNTBLANK(AH23:AI23),\"\",VLOOKUP(AH23&AI23,CHOOSE({1,2},tPts3[Score 1]&tPts3[Score 2],tPts3[Pts]),2,0))","v":""},{"$f":"Tirage!$M13","v":5},null,null,{"$f":"VLOOKUP(AK23,Inscriptions!$A$3:$B$12,2,FALSE)","v":"REPTILES"},{"$f":"IFERROR(VLOOKUP(AN23,$AN$3:$AP$7,3,0),\"\")&IFERROR(VLOOKUP(AN23,$AO$3:$AQ$7,3,0),\"\")","v":""},{"$f":"IFERROR(VLOOKUP(AN23,$AN$3:$AQ$7,4,0),\"\")&IFERROR(VLOOKUP(AN23,$AO$3:$AQ$7,2,0),\"\")","v":""},{"$f":"IF(COUNTBLANK(AO23:AP23),\"\",VLOOKUP(AO23&AP23,CHOOSE({1,2},tPts3[Score 1]&tPts3[Score 2],tPts3[Pts]),2,0))","v":""},{"$f":"Tirage!$O13","v":2},null,null,{"$f":"VLOOKUP(AR23,Inscriptions!$A$3:$B$12,2,FALSE)","v":"Les Fracasser"},"","",{"$f":"IF(COUNTBLANK(AV23:AW23),\"\",VLOOKUP(AV23&AW23,CHOOSE({1,2},tPts3[Score 1]&tPts3[Score 2],tPts3[Pts]),2,0))","v":""},{"$f":"Tirage!$Q13","v":1},null,null,{"$f":"VLOOKUP(AY23,Inscriptions!$A$3:$B$12,2,FALSE)","v":"Dark Legion"},{"$f":"IFERROR(VLOOKUP(BB23,$BB$3:BD$7,3,0),\"\")&IFERROR(VLOOKUP(BB23,$BC$3:$BE$7,3,0),\"\")","v":""},"",{"$f":"IF(COUNTBLANK(BC23:BD23),\"\",VLOOKUP(BC23&BD23,CHOOSE({1,2},tPts3[Score 1]&tPts3[Score 2],tPts3[Pts]),2,0))","v":""},{"$f":"Tirage!$S13","v":2},null,null,{"$f":"VLOOKUP(BF23,Inscriptions!$A$3:$B$12,2,FALSE)","v":"Les Fracasser"},{"$f":"IFERROR(VLOOKUP(BI23,$BI$3:BK$7,3,0),\"\")&IFERROR(VLOOKUP(BI23,$BJ$3:$BL$7,3,0),\"\")","v":""},"",{"$f":"IF(COUNTBLANK(BJ23:BK23),\"\",VLOOKUP(BJ23&BK23,CHOOSE({1,2},tPts3[Score 1]&tPts3[Score 2],tPts3[Pts]),2,0))","v":""}]
[]
[]
[]
[null,null,null,"Grille des points",null,null,null,null,null,null,null,null,"Classement Général journée 1"]
[null,null,null,"Score 1","Score 2","Pts",null,null,null,"Place",null,"Place","Equipe","Total Pts"]
[null,null,null,0,0,3,null,null,null,1,null,1,"Raptkulls",{"$f":"IFERROR(VLOOKUP(M29,$E$14:$H$23,4,0)*1,0)\n+IFERROR(VLOOKUP(M29,$L$14:$O$23,4,0)*1,0)\n+IFERROR(VLOOKUP(M29,$S$14:$V$23,4,0)*1,0)\n+IFERROR(VLOOKUP(M29,$Z$14:$AC$23,4,0)*1,0)\n+IFERROR(VLOOKUP(M29,$AG$14:$AJ$23,4,0)*1,0)\n+IFERROR(VLOOKUP(M29,$AN$14:$AQ$23,4,0)*1,0)\n+IFERROR(VLOOKUP(M29,$AU$14:$AX$23,4,0)*1,0\n+IFERROR(VLOOKUP(M29,$BB$14:$BE$23,4,0)*1,0)\n+IFERROR(VLOOKUP(M29,$BI$14:$BL$23,4,0)*1,0))","v":20},{"$f":"IF(N29=\"\",-100,N29)","v":20},1]
[null,null,null,0,1,1,null,null,null,2,null,2,"JEAN",20,20,2]
[null,null,null,0,2,1,null,null,null,3,null,3,"REPTILES",11,11,3]
[null,null,null,1,0,10,null,null,null,4,null,4,"PAUL",11,11,4]
[null,null,null,1,1,3,null,null,null,5,null,5,"Les Fracasser",11,11,5]
[null,null,null,1,2,1,null,null,null,6,null,6,"Les Touristes",11,11,6]
[null,null,null,2,0,10,null,null,null,7,null,7,"Frelon",11,11,7]
[null,null,null,2,1,10,null,null,null,8,null,8,"Dark Legion",10,10,8]
[null,null,null,2,2,3,null,null,null,9,null,9,"JOSE",2,2,9]
[null,null,null,2,"ab",10,null,null,null,10,null,10,"MARC",1,1,10]
[null,null,null,"ab",2,0,null,null,null,11,null,null,null,null,null,11]
[null,null,null,1,"ab",10,null,null,null,12,null,null,null,null,null,12]
[null,null,null,"ab",1,0,null,null,null,13,null,null,null,null,null,13]
[null,null,null,null,null,null,null,null,null,14,null,null,null,null,null,14]
[null,null,null,null,null,null,null,null,null,null,null,null,null,null,null,15]
[null,null,null,null,null,null,null,null,null,null,null,null,null,null,null,16]
[null,null,null,null,null,null,null,null,null,null,null,null,null,null,null,17]
[null,null,null,null,null,null,null,null,null,null,null,null,null,null,null,18]
[null,null,null,null,null,null,null,null,null,null,null,null,null,null,null,19]
[null,null,null,null,null,null,null,null,null,null,null,null,null,null,null,20]
[null,null,null,null,null,null,null,null,null,null,null,null,null,null,null,21]
[null,null,null,null,null,null,null,null,null,null,null,null,null,null,null,22]
[null,null,null,null,null,null,null,null,null,null,null,null,null,null,null,23]
[null,null,null,null,null,null,null,null,null,null,null,null,null,null,null,24]
[null,null,null,null,null,null,null,null,null,null,null,null,null,null,null,25]
[null,null,null,null,null,null,null,null,null,null,null,null,null,null,null,26]
[null,null,null,null,null,null,null,null,null,null,null,null,null,null,null,27]
[null,null,null,null,null,null,null,null,null,null,null,null,null,null,null,28]
[null,null,null,null,null,null,null,null,null,null,null,null,null,null,null,29]
[null,null,null,null,null,null,null,null,null,null,null,null,null,null,null,30]
[null,null,null,null,null,null,null,null,null,null,null,null,null,null,null,31]
[null,null,null,null,null,null,null,null,null,null,null,null,null,null,null,32]
[null,null,null,null,null,null,null,null,null,null,null,null,null,null,null,33]
[null,null,null,null,null,null,null,null,null,null,null,null,null,null,null,34]
[null,null,null,null,null,null,null,null,null,null,null,null,null,null,null,35]
[null,null,null,null,null,null,null,null,null,null,null,null,null,null,null,36]
[null,null,null,null,null,null,null,null,null,null,null,null,null,null,null,37]
[null,null,null,null,null,null,null,null,null,null,null,null,null,null,null,38]
[null,null,null,null,null,null,null,null,null,null,null,null,null,null,null,39]
[null,null,null,null,null,null,null,null,null,null,null,null,null,null,null,40]
[null,null,null,null,null,null,null,null,null,null,null,null,null,null,null,41]
[null,null,null,null,null,null,null,null,null,null,null,null,null,null,null,42]
[null,null,null,null,null,null,null,null,null,null,null,null,null,null,null,43]
[null,null,null,null,null,null,null,null,null,null,null,null,null,null,null,44]
[null,null,null,null,null,null,null,null,null,null,null,null,null,null,null,45]
[null,null,null,null,null,null,null,null,null,null,null,null,null,null,null,46]
[null,null,null,null,null,null,null,null,null,null,null,null,null,null,null,47]
[null,null,null,null,null,null,null,null,null,null,null,null,null,null,null,48]
[null,null,null,null,null,null,null,null,null,null,null,null,null,null,null,49]
[null,null,null,null,null,null,null,null,null,null,null,null,null,null,null,50]
[null,null,null,null,null,null,null,null,null,null,null,null,null,null,null,51]
[null,null,null,null,null,null,null,null,null,null,null,null,null,null,null,52]
[null,null,null,null,null,null,null,null,null,null,null,null,null,null,null,53]
[null,null,null,null,null,null,null,null,null,null,null,null,null,null,null,54]
[null,null,null,null,null,null,null,null,null,null,null,null,null,null,null,55]
[null,null,null,null,null,null,null,null,null,null,null,null,null,null,null,56]
[null,null,null,null,null,null,null,null,null,null,null,null,null,null,null,57]
[null,null,null,null,null,null,null,null,null,null,null,null,null,null,null,58]
[null,null,null,null,null,null,null,null,null,null,null,null,null,null,null,59]
[null,null,null,null,null,null,null,null,null,null,null,null,null,null,null,60]
[null,null,null,null,null,null,null,null,null,null,null,null,null,null,null,61]
[null,null,null,null,null,null,null,null,null,null,null,null,null,null,null,62]
[null,null,null,null,null,null,null,null,null,null,null,null,null,null,null,63]
[null,null,null,null,null,null,null,null,null,null,null,null,null,null,null,64]
[null,null,null,null,null,null,null,null,null,null,null,null,null,null,null,65]
[null,null,null,null,null,null,null,null,null,null,null,null,null,null,null,66]
[null,null,null,null,null,null,null,null,null,null,null,null,null,null,null,67]
[null,null,null,null,null,null,null,null,null,null,null,null,null,null,null,68]
[null,null,null,null,null,null,null,null,null,null,null,null,null,null,null,69]
[null,null,null,null,null,null,null,null,null,null,null,null,null,null,null,70]
[null,null,null,null,null,null,null,null,null,null,null,null,null,null,null,71]
[null,null,null,null,null,null,null,null,null,null,null,null,null,null,null,72]
[null,null,null,null,null,null,null,null,null,null,null,null,null,null,null,73]
[null,null,null,null,null,null,null,null,null,null,null,null,null,null,null,74]
[null,null,null,null,null,null,null,null,null,null,null,null,null,null,null,75]
[null,null,null,null,null,null,null,null,null,null,null,null,null,null,null,76]
[null,null,null,null,null,null,null,null,null,null,null,null,null,null,null,77]
[null,null,null,null,null,null,null,null,null,null,null,null,null,null,null,78]
[null,null,null,null,null,null,null,null,null,null,null,null,null,null,null,79]
[null,null,null,null,null,null,null,null,null,null,null,null,null,null,null,80]
[null,null,null,null,null,null,null,null,null,null,null,null,null,null,null,81]
[null,null,null,null,null,null,null,null,null,null,null,null,null,null,null,82]
[null,null,null,null,null,null,null,null,null,null,null,null,null,null,null,83]
[null,null,null,null,null,null,null,null,null,null,null,null,null,null,null,84]
[null,null,null,null,null,null,null,null,null,null,null,null,null,null,null,85]
[null,null,null,null,null,null,null,null,null,null,null,null,null,null,null,86]
[null,null,null,null,null,null,null,null,null,null,null,null,null,null,null,87]
[null,null,null,null,null,null,null,null,null,null,null,null,null,null,null,88]
[null,null,null,null,null,null,null,null,null,null,null,null,null,null,null,89]
[null,null,null,null,null,null,null,null,null,null,null,null,null,null,null,90]
[null,null,null,null,null,null,null,null,null,null,null,null,null,null,null,91]
[null,null,null,null,null,null,null,null,null,null,null,null,null,null,null,92]
[null,null,null,null,null,null,null,null,null,null,null,null,null,null,null,93]
[null,null,null,null,null,null,null,null,null,null,null,null,null,null,null,94]
[null,null,null,null,null,null,null,null,null,null,null,null,null,null,null,95]

{"sheet":"Journée2","index":6,"n_rows":41,"n_cols":64,"rows_kept":41,"cut":false,"hidden":true,"merged":[[0,18,0,21],[0,3,1,3],[0,4,0,7],[0,10,1,10],[0,11,0,14],[0,17,1,17],[0,60,0,63],[0,24,1,24],[0,25,0,28],[0,31,1,31],[0,32,0,35],[0,38,1,38],[0,39,0,42],[0,45,1,45],[0,46,0,49],[0,52,1,52],[0,53,0,56],[0,59,1,59],[7,48,7,49],[7,55,7,56],[7,62,7,63],[8,27,8,28],[8,34,8,35],[8,41,8,42],[8,48,8,49],[7,41,7,42],[7,6,7,7],[7,13,7,14],[7,20,7,21],[7,27,7,28],[7,34,7,35],[26,3,26,5],[26,10,26,11],[26,12,26,13],[8,55,8,56],[8,62,8,63],[9,34,9,61],[10,4,10,7],[10,11,10,14],[10,18,10,21],[10,25,10,28],[10,32,10,35],[10,39,10,42],[8,12,9,14],[30,15,30,16],[10,46,10,49],[10,53,10,56],[10,60,10,63],[25,12,25,13]]}
[null,null,null,"Arbitre","TOUR 1",null,null,null,null,null,"Arbitre","TOUR 2",null,null,null,null,null,"Arbitre","TOUR 3",null,null,null,null,null,"Arbitre","TOUR 4",null,null,null,null,null,"Arbitre","TOUR 5",null,null,null,null,null,"Arbitre","TOUR 6",null,null,null,null,null,"Arbitre","TOUR 7",null,null,null,null,null,"Arbitre","TOUR 8",null,null,null,null,null,"Arbitre","TOUR 9"]
[null,null,null,null,"Equipe 1","Equipe 2","Score 1","Score 2",null,null,null,"Equipe 1","Equipe 2","Score 1","Score 2",null,null,null,"Equipe 1","Equipe 2","Score 1","Score 2",null,null,null,"Equipe 1","Equipe 2","Score 1","Score 2",null,null,null,"Equipe 1","Equipe 2","Score 1","Score 2",null,null,null,"Equipe 1","Equipe 2","Score 1","Score 2",null,null,null,"Equipe 1","Equipe 2","Score 1","Score 2",null,null,null,"Equipe 1","Equipe 2","Score 1","Score 2",null,null,null,"Equipe 1","Equipe 2","Score 1","Score 2"]
[null,{"$f":"Tirage!$B9","v":7},{"$f":"Tirage!$C9","v":10},{"$f":"B7","v":8},{"$f":"VLOOKUP(B3,Inscriptions!$E$3:$F$12,2,FALSE)","v":0},{"$f":"VLOOKUP(C3,Inscriptions!$E$3:$F$12,2,FALSE)","v":0},null,null,{"$f":"Tirage!D9","v":3},{"$f":"Tirage!E9","v":9},{"$f":"I7","v":4},{"$f":"VLOOKUP(I3,Inscriptions!$E$3:$F$12,2,FALSE)","v":0},{"$f":"VLOOKUP(J3,Inscriptions!$E$3:$F$12,2,FALSE)","v":0},null,null,{"$f":"Tirage!$F9","v":10},{"$f":"Tirage!$G9","v":2},{"$f":"P7","v":3},{"$f":"VLOOKUP(P3,Inscriptions!$E$3:$F$12,2,FALSE)","v":0},{"$f":"VLOOKUP(Q3,Inscriptions!$E$3:$F$12,2,FALSE)","v":0},null,null,{"$f":"Tirage!$H9","v":6},{"$f":"Tirage!$I9","v":10},{"$f":"W7","v":1},{"$f":"VLOOKUP(W3,Inscriptions!$E$3:$F$12,2,FALSE)","v":0},{"$f":"VLOOKUP(X3,Inscriptions!$E$3:$F$12,2,FALSE)","v":0},null,null,{"$f":"Tirage!$J9","v":1},{"$f":"Tirage!$K9","v":6},{"$f":"AD7","v":10},{"$f":"VLOOKUP(AD3,Inscriptions!$E$3:$F$12,2,FALSE)","v":0},{"$f":"VLOOKUP(AE3,Inscriptions!$E$3:$F$12,2,FALSE)","v":0},null,null,{"$f":"Tirage!$L9","v":9},{"$f":"Tirage!$M9","v":6},{"$f":"AK7","v":4},{"$f":"VLOOKUP(AK3,Inscriptions!$E$3:$F$12,2,FALSE)","v":0},{"$f":"VLOOKUP(AL3,Inscriptions!$E$3:$F$12,2,FALSE)","v":0},null,null,{"$f":"Tirage!$N9","v":3},{"$f":"Tirage!$O9","v":10},{"$f":"AR7","v":5},{"$f":"VLOOKUP(AR3,Inscriptions!$E$3:$F$12,2,FALSE)","v":0},{"$f":"VLOOKUP(AS3,Inscriptions!$E$3:$F$12,2,FALSE)","v":0},null,null,{"$f":"Tirage!$P9","v":2},{"$f":"Tirage!$Q9","v":9},{"$f":"AY7","v":10},{"$f":"VLOOKUP(AY3,Inscriptions!$E$3:$F$12,2,FALSE)","v":0},{"$f":"VLOOKUP(AZ3,Inscriptions!$E$3:$F$12,2,FALSE)","v":0},null,null,{"$f":"Tirage!$R9","v":6},{"$f":"Tirage!$S9","v":8},{"$f":"BF7","v":3},{"$f":"VLOOKUP(BF3,Inscriptions!$E$3:$F$12,2,FALSE)","v":0},{"$f":"VLOOKUP(BG3,Inscriptions!$E$3:$F$12,2,FALSE)","v":0}]
[null,{"$f":"Tirage!$B10","v":3},{"$f":"Tirage!$C10","v":5},{"$f":"C7","v":4},{"$f":"VLOOKUP(B4,Inscriptions!$E$3:$F$12,2,FALSE)","v":0},{"$f":"VLOOKUP(C4,Inscriptions!$E$3:$F$12,2,FALSE)","v":0},null,null,{"$f":"Tirage!D10","v":2},{"$f":"Tirage!E10","v":1},{"$f":"J7","v":10},{"$f":"VLOOKUP(I4,Inscriptions!$E$3:$F$12,2,FALSE)","v":0},{"$f":"VLOOKUP(J4,Inscriptions!$E$3:$F$12,2,FALSE)","v":0},null,null,{"$f":"Tirage!$F10","v":4},{"$f":"Tirage!$G10","v":7},{"$f":"Q7","v":6},{"$f":"VLOOKUP(P4,Inscriptions!$E$3:$F$12,2,FALSE)","v":0},{"$f":"VLOOKUP(Q4,Inscriptions!$E$3:$F$12,2,FALSE)","v":0},null,null,{"$f":"Tirage!$H10","v":5},{"$f":"Tirage!$I10","v":9},{"$f":"X7","v":7},{"$f":"VLOOKUP(W4,Inscriptions!$E$3:$F$12,2,FALSE)","v":0},{"$f":"VLOOKUP(X4,Inscriptions!$E$3:$F$12,2,FALSE)","v":0},null,null,{"$f":"Tirage!$J10","v":7},{"$f":"Tirage!$K10","v":5},{"$f":"AE7","v":9},{"$f":"VLOOKUP(AD4,Inscriptions!$E$3:$F$12,2,FALSE)","v":0},{"$f":"VLOOKUP(AE4,Inscriptions!$E$3:$F$12,2,FALSE)","v":0},null,null,{"$f":"Tirage!$L10","v":3},{"$f":"Tirage!$M10","v":1},{"$f":"AL7","v":5},{"$f":"VLOOKUP(AK4,Inscriptions!$E$3:$F$12,2,FALSE)","v":0},{"$f":"VLOOKUP(AL4,Inscriptions!$E$3:$F$12,2,FALSE)","v":0},null,null,{"$f":"Tirage!$N10","v":8},{"$f":"Tirage!$O10","v":1},{"$f":"AS7","v":2},{"$f":"VLOOKUP(AR4,Inscriptions!$E$3:$F$12,2,FALSE)","v":0},{"$f":"VLOOKUP(AS4,Inscriptions!$E$3:$F$12,2,FALSE)","v":0},null,null,{"$f":"Tirage!$P10","v":8},{"$f":"Tirage!$Q10","v":5},{"$f":"AZ7","v":1},{"$f":"VLOOKUP(AY4,Inscriptions!$E$3:$F$12,2,FALSE)","v":0},{"$f":"VLOOKUP(AZ4,Inscriptions!$E$3:$F$12,2,FALSE)","v":0},null,null,{"$f":"Tirage!$R10","v":7},{"$f":"Tirage!$S10","v":9},{"$f":"BG7","v":2},{"$f":"VLOOKUP(BF4,Inscriptions!$E$3:$F$12,2,FALSE)","v":0},{"$f":"VLOOKUP(BG4,Inscriptions!$E$3:$F$12,2,FALSE)","v":0}]
[null,{"$f":"Tirage!$B11","v":6},{"$f":"Tirage!$C11","v":2},{"$f":"B6","v":9},{"$f":"VLOOKUP(B5,Inscriptions!$E$3:$F$12,2,FALSE)","v":0},{"$f":"VLOOKUP(C5,Inscriptions!$E$3:$F$12,2,FALSE)","v":0},null,null,{"$f":"Tirage!D11","v":8},{"$f":"Tirage!E11","v":7},{"$f":"I6","v":5},{"$f":"VLOOKUP(I5,Inscriptions!$E$3:$F$12,2,FALSE)","v":0},{"$f":"VLOOKUP(J5,Inscriptions!$E$3:$F$12,2,FALSE)","v":0},null,null,{"$f":"Tirage!$F11","v":8},{"$f":"Tirage!$G11","v":9},{"$f":"P6","v":1},{"$f":"VLOOKUP(P5,Inscriptions!$E$3:$F$12,2,FALSE)","v":0},{"$f":"VLOOKUP(Q5,Inscriptions!$E$3:$F$12,2,FALSE)","v":0},null,null,{"$f":"Tirage!$H11","v":4},{"$f":"Tirage!$I11","v":3},{"$f":"W6","v":8},{"$f":"VLOOKUP(W5,Inscriptions!$E$3:$F$12,2,FALSE)","v":0},{"$f":"VLOOKUP(X5,Inscriptions!$E$3:$F$12,2,FALSE)","v":0},null,null,{"$f":"Tirage!$J11","v":4},{"$f":"Tirage!$K11","v":2},{"$f":"AD6","v":3},{"$f":"VLOOKUP(AD5,Inscriptions!$E$3:$F$12,2,FALSE)","v":0},{"$f":"VLOOKUP(AE5,Inscriptions!$E$3:$F$12,2,FALSE)","v":0},null,null,{"$f":"Tirage!$L11","v":2},{"$f":"Tirage!$M11","v":7},{"$f":"AK6","v":10},{"$f":"VLOOKUP(AK5,Inscriptions!$E$3:$F$12,2,FALSE)","v":0},{"$f":"VLOOKUP(AL5,Inscriptions!$E$3:$F$12,2,FALSE)","v":0},null,null,{"$f":"Tirage!$N11","v":4},{"$f":"Tirage!$O11","v":9},{"$f":"AR6","v":7},{"$f":"VLOOKUP(AR5,Inscriptions!$E$3:$F$12,2,FALSE)","v":0},{"$f":"VLOOKUP(AS5,Inscriptions!$E$3:$F$12,2,FALSE)","v":0},null,null,{"$f":"Tirage!$P11","v":7},{"$f":"Tirage!$Q11","v":3},{"$f":"AY6","v":4},{"$f":"VLOOKUP(AY5,Inscriptions!$E$3:$F$12,2,FALSE)","v":0},{"$f":"VLOOKUP(AZ5,Inscriptions!$E$3:$F$12,2,FALSE)","v":0},null,null,{"$f":"Tirage!$R11","v":4},{"$f":"Tirage!$S11","v":1},{"$f":"BF6","v":10},{"$f":"VLOOKUP(BF5,Inscriptions!$E$3:$F$12,2,FALSE)","v":0},{"$f":"VLOOKUP(BG5,Inscriptions!$E$3:$F$12,2,FALSE)","v":0}]
[null,{"$f":"Tirage!$B12","v":9},{"$f":"Tirage!$C12","v":1},{"$f":"B3","v":7},{"$f":"VLOOKUP(B6,Inscriptions!$E$3:$F$12,2,FALSE)","v":0},{"$f":"VLOOKUP(C6,Inscriptions!$E$3:$F$12,2,FALSE)","v":0},null,null,{"$f":"Tirage!D12","v":5},{"$f":"Tirage!E12","v":6},{"$f":"I3","v":3},{"$f":"VLOOKUP(I6,Inscriptions!$E$3:$F$12,2,FALSE)","v":0},{"$f":"VLOOKUP(J6,Inscriptions!$E$3:$F$12,2,FALSE)","v":0},null,null,{"$f":"Tirage!$F12","v":1},{"$f":"Tirage!$G12","v":5},{"$f":"Q3","v":2},{"$f":"VLOOKUP(P6,Inscriptions!$E$3:$F$12,2,FALSE)","v":0},{"$f":"VLOOKUP(Q6,Inscriptions!$E$3:$F$12,2,FALSE)","v":0},null,null,{"$f":"Tirage!$H12","v":8},{"$f":"Tirage!$I12","v":2},{"$f":"X3","v":10},{"$f":"VLOOKUP(W6,Inscriptions!$E$3:$F$12,2,FALSE)","v":0},{"$f":"VLOOKUP(X6,Inscriptions!$E$3:$F$12,2,FALSE)","v":0},null,null,{"$f":"Tirage!$J12","v":3},{"$f":"Tirage!$K12","v":8},{"$f":"AD4","v":7},{"$f":"VLOOKUP(AD6,Inscriptions!$E$3:$F$12,2,FALSE)","v":0},{"$f":"VLOOKUP(AE6,Inscriptions!$E$3:$F$12,2,FALSE)","v":0},null,null,{"$f":"Tirage!$L12","v":10},{"$f":"Tirage!$M12","v":8},{"$f":"AL3","v":6},{"$f":"VLOOKUP(AK6,Inscriptions!$E$3:$F$12,2,FALSE)","v":0},{"$f":"VLOOKUP(AL6,Inscriptions!$E$3:$F$12,2,FALSE)","v":0},null,null,{"$f":"Tirage!$N12","v":7},{"$f":"Tirage!$O12","v":6},{"$f":"AS4","v":1},{"$f":"VLOOKUP(AR6,Inscriptions!$E$3:$F$12,2,FALSE)","v":0},{"$f":"VLOOKUP(AS6,Inscriptions!$E$3:$F$12,2,FALSE)","v":0},null,null,{"$f":"Tirage!$P12","v":4},{"$f":"Tirage!$Q12","v":6},{"$f":"AY3","v":2},{"$f":"VLOOKUP(AY6,Inscriptions!$E$3:$F$12,2,FALSE)","v":0},{"$f":"VLOOKUP(AZ6,Inscriptions!$E$3:$F$12,2,FALSE)","v":0},null,null,{"$f":"Tirage!$R12","v":10},{"$f":"Tirage!$S12","v":5},{"$f":"BF3","v":6},{"$f":"VLOOKUP(BF6,Inscriptions!$E$3:$F$12,2,FALSE)","v":0},{"$f":"VLOOKUP(BG6,Inscriptions!$E$3:$F$12,2,FALSE)","v":0}]
[null,{"$f":"Tirage!$B13","v":8},{"$f":"Tirage!$C13","v":4},{"$f":"B5","v":6},{"$f":"VLOOKUP(B7,Inscriptions!$E$3:$F$12,2,FALSE)","v":0},{"$f":"VLOOKUP(C7,Inscriptions!$E$3:$F$12,2,FALSE)","v":0},null,null,{"$f":"Tirage!D13","v":4},{"$f":"Tirage!E13","v":10},{"$f":"J3","v":9},{"$f":"VLOOKUP(I7,Inscriptions!$E$3:$F$12,2,FALSE)","v":0},{"$f":"VLOOKUP(J7,Inscriptions!$E$3:$F$12,2,FALSE)","v":0},null,null,{"$f":"Tirage!$F13","v":3},{"$f":"Tirage!$G13","v":6},{"$f":"P5","v":8},{"$f":"VLOOKUP(P7,Inscriptions!$E$3:$F$12,2,FALSE)","v":0},{"$f":"VLOOKUP(Q7,Inscriptions!$E$3:$F$12,2,FALSE)","v":0},null,null,{"$f":"Tirage!$H13","v":1},{"$f":"Tirage!$I13","v":7},{"$f":"W5","v":4},{"$f":"VLOOKUP(W7,Inscriptions!$E$3:$F$12,2,FALSE)","v":0},{"$f":"VLOOKUP(X7,Inscriptions!$E$3:$F$12,2,FALSE)","v":0},null,null,{"$f":"Tirage!$J13","v":10},{"$f":"Tirage!$K13","v":9},{"$f":"AD5","v":4},{"$f":"VLOOKUP(AD7,Inscriptions!$E$3:$F$12,2,FALSE)","v":0},{"$f":"VLOOKUP(AE7,Inscriptions!$E$3:$F$12,2,FALSE)","v":0},null,null,{"$f":"Tirage!$L13","v":4},{"$f":"Tirage!$M13","v":5},{"$f":"AK5","v":2},{"$f":"VLOOKUP(AK7,Inscriptions!$E$3:$F$12,2,FALSE)","v":0},{"$f":"VLOOKUP(AL7,Inscriptions!$E$3:$F$12,2,FALSE)","v":0},null,null,{"$f":"Tirage!$N13","v":5},{"$f":"Tirage!$O13","v":2},{"$f":"AR5","v":4},{"$f":"VLOOKUP(AR7,Inscriptions!$E$3:$F$12,2,FALSE)","v":0},{"$f":"VLOOKUP(AS7,Inscriptions!$E$3:$F$12,2,FALSE)","v":0},null,null,{"$f":"Tirage!$P13","v":10},{"$f":"Tirage!$Q13","v":1},{"$f":"AY5","v":7},{"$f":"VLOOKUP(AY7,Inscriptions!$E$3:$F$12,2,FALSE)","v":0},{"$f":"VLOOKUP(AZ7,Inscriptions!$E$3:$F$12,2,FALSE)","v":0},null,null,{"$f":"Tirage!$R13","v":3},{"$f":"Tirage!$S13","v":2},{"$f":"BG3","v":8},{"$f":"VLOOKUP(BF7,Inscriptions!$E$3:$F$12,2,FALSE)","v":0},{"$f":"VLOOKUP(BG7,Inscriptions!$E$3:$F$12,2,FALSE)","v":0}]
[null,null,null,null,null,null,"Mettre ab pour abandon",null,null,null,null,null,null,"Mettre ab pour abandon",null,null,null,null,null,null,"Mettre ab pour abandon",null,null,null,null,null,null,"Mettre ab pour abandon",null,null,null,null,null,null,"Mettre ab pour abandon",null,null,null,null,null,null,"Mettre ab pour abandon",null,null,null,null,null,null,"Mettre ab pour abandon",null,null,null,null,null,null,"Mettre ab pour abandon",null,null,null,null,null,null,"Mettre ab pour abandon"]
[null,null,null,null,null,null,null,null,null,null,null,null,"JOURNEE 2"]
[]
[null,null,null,null,"TOUR 1",null,null,null,null,null,null,"TOUR 2",null,null,null,null,null,null,"TOUR 3",null,null,null,null,null,null,"TOUR 4",null,null,null,null,null,null,"TOUR 5",null,null,null,null,null,null,"TOUR 6",null,null,null,null,null,null,"TOUR 7",null,null,null,null,null,null,"TOUR 8",null,null,null,null,null,null,"TOUR 9"]
[]
[null,null,null,null,"Equipes","Score pour","Score contre","Pts ",null,null,null,"Equipes","Score pour","Score contre","Pts ",null,null,null,"Equipes","Score pour","Score contre","Pts ",null,null,null,"Equipes","Score pour","Score contre","Pts ",null,null,null,"Equipes","Score pour","Score contre","Pts ",null,null,null,"Equipes","Score pour","Score contre","Pts ",null,null,null,"Equipes","Score pour","Score contre","Pts ",null,null,null,"Equipes","Score pour","Score contre","Pts ",null,null,null,"Equipes","Score pour","Score contre","Pts "]
[null,{"$f":"Tirage!$B9","v":7},null,null,{"$f":"VLOOKUP(B14,Inscriptions!$E$3:$F$12,2,FALSE)","v":0},{"$f":"IFERROR(VLOOKUP(E14,$E$3:$G$7,3,0),\"\")&IFERROR(VLOOKUP(E14,$F$3:$H$7,3,0),\"\")","v":""},{"$f":"IFERROR(VLOOKUP(E14,$E$3:$H$7,4,0),\"\")&IFERROR(VLOOKUP(E14,$F$3:$H$7,2,0),\"\")","v":""},{"$f":"IF(E14=0,0,IF(COUNTBLANK(F14:G14),\"\",VLOOKUP(F14&G14,CHOOSE({1,2},tPts32[Score 1]&tPts32[Score 2],tPts32[Pts]),2,0)))","v":0},{"$f":"I3","v":3},null,null,{"$f":"VLOOKUP(I14,Inscriptions!$E$3:$F$12,2,FALSE)","v":0},{"$f":"IFERROR(VLOOKUP(L14,$L$3:$N$7,3,0),\"\")&IFERROR(VLOOKUP(L14,$M$3:$O$7,3,0),\"\")","v":""},{"$f":"IFERROR(VLOOKUP(L14,$L$3:$O$7,4,0),\"\")&IFERROR(VLOOKUP(L14,$M$3:$O$7,2,0),\"\")","v":""},{"$f":"IF(L14=0,0,IF(COUNTBLANK(M14:N14),\"\",VLOOKUP(M14&N14,CHOOSE({1,2},tPts32[Score 1]&tPts32[Score 2],tPts32[Pts]),2,0)))","v":0},{"$f":"Tirage!$F9","v":10},null,null,{"$f":"VLOOKUP(P14,Inscriptions!$E$3:$F$12,2,FALSE)","v":0},{"$f":"IFERROR(VLOOKUP(S14,$S$3:$U$7,3,0),\"\")&IFERROR(VLOOKUP(S14,$T$3:$V$7,3,0),\"\")","v":""},{"$f":"IFERROR(VLOOKUP(S14,$S$3:$V$7,4,0),\"\")&IFERROR(VLOOKUP(S14,$T$3:$V$7,2,0),\"\")","v":""},{"$f":"IF(COUNTBLANK(T14:U14),\"\",VLOOKUP(T14&U14,CHOOSE({1,2},tPts32[Score 1]&tPts32[Score 2],tPts32[Pts]),2,0))","v":""},{"$f":"W3","v":6},null,null,{"$f":"VLOOKUP(W14,Inscriptions!$E$3:$F$12,2,FALSE)","v":0},{"$f":"IFERROR(VLOOKUP(Z14,$Z$3:$AB$7,3,0),\"\")&IFERROR(VLOOKUP(Z14,$AA$3:$AC$7,3,0),\"\")","v":""},{"$f":"IFERROR(VLOOKUP(Z14,$Z$3:$AC$7,4,0),\"\")&IFERROR(VLOOKUP(Z14,$AA$3:$AC$7,2,0),\"\")","v":""},{"$f":"IF(COUNTBLANK(AA14:AB14),\"\",VLOOKUP(AA14&AB14,CHOOSE({1,2},tPts32[Score 1]&tPts32[Score 2],tPts32[Pts]),2,0))","v":""},{"$f":"Tirage!$J9","v":1},null,null,{"$f":"VLOOKUP(AD14,Inscriptions!$E$3:$F$12,2,FALSE)","v":0},{"$f":"IFERROR(VLOOKUP(AG14,$AG$3:$AI$7,3,0),\"\")&IFERROR(VLOOKUP(AG14,$AH$3:$AJ$7,3,0),\"\")","v":""},{"$f":"IFERROR(VLOOKUP(AG14,$AG$3:$AJ$7,4,0),\"\")&IFERROR(VLOOKUP(AG14,$AH$3:$AJ$7,2,0),\"\")","v":""},{"$f":"IF(COUNTBLANK(AH14:AI14),\"\",VLOOKUP(AH14&AI14,CHOOSE({1,2},tPts32[Score 1]&tPts32[Score 2],tPts32[Pts]),2,0))","v":""},{"$f":"Tirage!$L9","v":9},null,null,{"$f":"VLOOKUP(AK14,Inscriptions!$E$3:$F$12,2,FALSE)","v":0},{"$f":"IFERROR(VLOOKUP(AN14,$AN$3:$AP$7,3,0),\"\")&IFERROR(VLOOKUP(AN14,$AO$3:$AQ$7,3,0),\"\")","v":""},{"$f":"IFERROR(VLOOKUP(AN14,$AN$3:$AQ$7,4,0),\"\")&IFERROR(VLOOKUP(AN14,$AO$3:$AQ$7,2,0),\"\")","v":""},{"$f":"IF(COUNTBLANK(AO14:AP14),\"\",VLOOKUP(AO14&AP14,CHOOSE({1,2},tPts32[Score 1]&tPts32[Score 2],tPts32[Pts]),2,0))","v":""},{"$f":"Tirage!$N9","v":3},null,null,{"$f":"VLOOKUP(AR14,Inscriptions!$E$3:$F$12,2,FALSE)","v":0},{"$f":"IFERROR(VLOOKUP(AU14,AU$3:AW$7,3,0),\"\")&IFERROR(VLOOKUP(AU14,AV$3:AX$7,3,0),\"\")","v":""},{"$f":"IFERROR(VLOOKUP(AU14,AU$3:AX$7,4,0),\"\")&IFERROR(VLOOKUP(AU14,AV$3:AX$7,2,0),\"\")","v":""},{"$f":"IF(COUNTBLANK(AV14:AW14),\"\",VLOOKUP(AV14&AW14,CHOOSE({1,2},tPts32[Score 1]&tPts32[Score 2],tPts32[Pts]),2,0))","v":""},{"$f":"Tirage!$P9","v":2},null,null,{"$f":"VLOOKUP(AY14,Inscriptions!$E$3:$F$12,2,FALSE)","v":0},{"$f":"IFERROR(VLOOKUP(BB14,$BB$3:BD$7,3,0),\"\")&IFERROR(VLOOKUP(BB14,$BC$3:$BE$7,3,0),\"\")","v":""},{"$f":"IFERROR(VLOOKUP(BB14,$BB$3:$BE$7,4,0),\"\")&IFERROR(VLOOKUP(BB14,$BC$3:$BE$7,2,0),\"\")","v":""},{"$f":"IF(COUNTBLANK(BC14:BD14),\"\",VLOOKUP(BC14&BD14,CHOOSE({1,2},tPts32[Score 1]&tPts32[Score 2],tPts32[Pts]),2,0))","v":""},{"$f":"Tirage!$R9","v":6},null,null,{"$f":"VLOOKUP(BF14,Inscriptions!$E$3:$F$12,2,FALSE)","v":0},{"$f":"IFERROR(VLOOKUP(BI14,$BI$3:BK$7,3,0),\"\")&IFERROR(VLOOKUP(BI14,$BJ$3:$BL$7,3,0),\"\")","v":""},{"$f":"IFERROR(VLOOKUP(BI14,$BI$3:$BL$7,4,0),\"\")&IFERROR(VLOOKUP(BI14,$BJ$3:$BL$7,2,0),\"\")","v":""},{"$f":"IF(COUNTBLANK(BJ14:BK14),\"\",VLOOKUP(BJ14&BK14,CHOOSE({1,2},tPts32[Score 1]&tPts32[Score 2],tPts32[Pts]),2,0))","v":""}]
[null,{"$f":"Tirage!$B10","v":3},null,null,{"$f":"VLOOKUP(B15,Inscriptions!$E$3:$F$12,2,FALSE)","v":0},{"$f":"IFERROR(VLOOKUP(E15,$E$3:$G$7,3,0),\"\")&IFERROR(VLOOKUP(E15,$F$3:$H$7,3,0),\"\")","v":""},{"$f":"IFERROR(VLOOKUP(E15,$E$3:$H$7,4,0),\"\")&IFERROR(VLOOKUP(E15,$F$3:H$7,2,0),\"\")","v":""},{"$f":"IF(E15=0,0,IF(COUNTBLANK(F15:G15),\"\",VLOOKUP(F15&G15,CHOOSE({1,2},tPts32[Score 1]&tPts32[Score 2],tPts32[Pts]),2,0)))","v":0},{"$f":"I4","v":2},null,null,{"$f":"VLOOKUP(I15,Inscriptions!$E$3:$F$12,2,FALSE)","v":0},{"$f":"IFERROR(VLOOKUP(L15,$L$3:$N$7,3,0),\"\")&IFERROR(VLOOKUP(L15,$M$3:$O$7,3,0),\"\")","v":""},{"$f":"IFERROR(VLOOKUP(L15,$L$3:$O$7,4,0),\"\")&IFERROR(VLOOKUP(L15,$M$3:$O$7,2,0),\"\")","v":""},{"$f":"IF(L15=0,0,IF(COUNTBLANK(M15:N15),\"\",VLOOKUP(M15&N15,CHOOSE({1,2},tPts32[Score 1]&tPts32[Score 2],tPts32[Pts]),2,0)))","v":0},{"$f":"Tirage!$F10","v":4},null,null,{"$f":"VLOOKUP(P15,Inscriptions!$E$3:$F$12,2,FALSE)","v":0},{"$f":"IFERROR(VLOOKUP(S15,$S$3:$U$7,3,0),\"\")&IFERROR(VLOOKUP(S15,$T$3:$V$7,3,0),\"\")","v":""},{"$f":"IFERROR(VLOOKUP(S15,$S$3:$V$7,4,0),\"\")&IFERROR(VLOOKUP(S15,$T$3:$V$7,2,0),\"\")","v":""},{"$f":"IF(COUNTBLANK(T15:U15),\"\",VLOOKUP(T15&U15,CHOOSE({1,2},tPts32[Score 1]&tPts32[Score 2],tPts32[Pts]),2,0))","v":""},{"$f":"W4","v":5},null,null,{"$f":"VLOOKUP(W15,Inscriptions!$E$3:$F$12,2,FALSE)","v":0},{"$f":"IFERROR(VLOOKUP(Z15,$Z$3:$AB$7,3,0),\"\")&IFERROR(VLOOKUP(Z15,$AA$3:$AC$7,3,0),\"\")","v":""},{"$f":"IFERROR(VLOOKUP(Z15,$Z$3:$AC$7,4,0),\"\")&IFERROR(VLOOKUP(Z15,$AA$3:$AC$7,2,0),\"\")","v":""},{"$f":"IF(COUNTBLANK(AA15:AB15),\"\",VLOOKUP(AA15&AB15,CHOOSE({1,2},tPts32[Score 1]&tPts32[Score 2],tPts32[Pts]),2,0))","v":""},{"$f":"Tirage!$J10","v":7},null,null,{"$f":"VLOOKUP(AD15,Inscriptions!$E$3:$F$12,2,FALSE)","v":0},{"$f":"IFERROR(VLOOKUP(AG15,$AG$3:$AI$7,3,0),\"\")&IFERROR(VLOOKUP(AG15,$AH$3:$AJ$7,3,0),\"\")","v":""},{"$f":"IFERROR(VLOOKUP(AG15,$AG$3:$AJ$7,4,0),\"\")&IFERROR(VLOOKUP(AG15,$AH$3:$AJ$7,2,0),\"\")","v":""},{"$f":"IF(COUNTBLANK(AH15:AI15),\"\",VLOOKUP(AH15&AI15,CHOOSE({1,2},tPts32[Score 1]&tPts32[Score 2],tPts32[Pts]),2,0))","v":""},{"$f":"Tirage!$L10","v":3},null,null,{"$f":"VLOOKUP(AK15,Inscriptions!$E$3:$F$12,2,FALSE)","v":0},{"$f":"IFERROR(VLOOKUP(AN15,$AN$3:$AP$7,3,0),\"\")&IFERROR(VLOOKUP(AN15,$AO$3:$AQ$7,3,0),\"\")","v":""},{"$f":"IFERROR(VLOOKUP(AN15,$AN$3:$AQ$7,4,0),\"\")&IFERROR(VLOOKUP(AN15,$AO$3:$AQ$7,2,0),\"\")","v":""},{"$f":"IF(COUNTBLANK(AO15:AP15),\"\",VLOOKUP(AO15&AP15,CHOOSE({1,2},tPts32[Score 1]&tPts32[Score 2],tPts32[Pts]),2,0))","v":""},{"$f":"Tirage!$N10","v":8},null,null,{"$f":"VLOOKUP(AR15,Inscriptions!$E$3:$F$12,2,FALSE)","v":0},{"$f":"IFERROR(VLOOKUP(AU15,AU$3:AW$7,3,0),\"\")&IFERROR(VLOOKUP(AU15,AV$3:AX$7,3,0),\"\")","v":""},{"$f":"IFERROR(VLOOKUP(AU15,AU$3:AX$7,4,0),\"\")&IFERROR(VLOOKUP(AU15,AV$3:AX$7,2,0),\"\")","v":""},{"$f":"IF(COUNTBLANK(AV15:AW15),\"\",VLOOKUP(AV15&AW15,CHOOSE({1,2},tPts32[Score 1]&tPts32[Score 2],tPts32[Pts]),2,0))","v":""},{"$f":"Tirage!$P10","v":8},null,null,{"$f":"VLOOKUP(AY15,Inscriptions!$E$3:$F$12,2,FALSE)","v":0},{"$f":"IFERROR(VLOOKUP(BB15,$BB$3:BD$7,3,0),\"\")&IFERROR(VLOOKUP(BB15,$BC$3:$BE$7,3,0),\"\")","v":""},{"$f":"IFERROR(VLOOKUP(BB15,$BB$3:$BE$7,4,0),\"\")&IFERROR(VLOOKUP(BB15,$BC$3:$BE$7,2,0),\"\")","v":""},{"$f":"IF(COUNTBLANK(BC15:BD15),\"\",VLOOKUP(BC15&BD15,CHOOSE({1,2},tPts32[Score 1]&tPts32[Score 2],tPts32[Pts]),2,0))","v":""},{"$f":"Tirage!$R10","v":7},null,null,{"$f":"VLOOKUP(BF15,Inscriptions!$E$3:$F$12,2,FALSE)","v":0},{"$f":"IFERROR(VLOOKUP(BI15,$BI$3:BK$7,3,0),\"\")&IFERROR(VLOOKUP(BI15,$BJ$3:$BL$7,3,0),\"\")","v":""},{"$f":"IFERROR(VLOOKUP(BI15,$BI$3:$BL$7,4,0),\"\")&IFERROR(VLOOKUP(BI15,$BJ$3:$BL$7,2,0),\"\")","v":""},{"$f":"IF(COUNTBLANK(BJ15:BK15),\"\",VLOOKUP(BJ15&BK15,CHOOSE({1,2},tPts32[Score 1]&tPts32[Score 2],tPts32[Pts]),2,0))","v":""}]
[null,{"$f":"Tirage!$B11","v":6},null,null,{"$f":"VLOOKUP(B16,Inscriptions!$E$3:$F$12,2,FALSE)","v":0},"",{"$f":"IFERROR(VLOOKUP(E16,$E$3:$H$7,4,0),\"\")&IFERROR(VLOOKUP(E16,$F$3:H$7,2,0),\"\")","v":""},{"$f":"IF(E16=0,0,IF(COUNTBLANK(F16:G16),\"\",VLOOKUP(F16&G16,CHOOSE({1,2},tPts32[Score 1]&tPts32[Score 2],tPts32[Pts]),2,0)))","v":0},8,null,null,{"$f":"VLOOKUP(I16,Inscriptions!$E$3:$F$12,2,FALSE)","v":0},"","",{"$f":"IF(L16=0,0,IF(COUNTBLANK(M16:N16),\"\",VLOOKUP(M16&N16,CHOOSE({1,2},tPts32[Score 1]&tPts32[Score 2],tPts32[Pts]),2,0)))","v":0},{"$f":"Tirage!$F11","v":8},null,null,{"$f":"VLOOKUP(P16,Inscriptions!$E$3:$F$12,2,FALSE)","v":0},"","",{"$f":"IF(COUNTBLANK(T16:U16),\"\",VLOOKUP(T16&U16,CHOOSE({1,2},tPts32[Score 1]&tPts32[Score 2],tPts32[Pts]),2,0))","v":""},{"$f":"W5","v":4},null,null,{"$f":"VLOOKUP(W16,Inscriptions!$E$3:$F$12,2,FALSE)","v":0},"","",{"$f":"IF(COUNTBLANK(AA16:AB16),\"\",VLOOKUP(AA16&AB16,CHOOSE({1,2},tPts32[Score 1]&tPts32[Score 2],tPts32[Pts]),2,0))","v":""},{"$f":"Tirage!$J11","v":4},null,null,{"$f":"VLOOKUP(AD16,Inscriptions!$E$3:$F$12,2,FALSE)","v":0},"","",{"$f":"IF(COUNTBLANK(AH16:AI16),\"\",VLOOKUP(AH16&AI16,CHOOSE({1,2},tPts32[Score 1]&tPts32[Score 2],tPts32[Pts]),2,0))","v":""},{"$f":"Tirage!$L11","v":2},null,null,{"$f":"VLOOKUP(AK16,Inscriptions!$E$3:$F$12,2,FALSE)","v":0},"","",{"$f":"IF(COUNTBLANK(AO16:AP16),\"\",VLOOKUP(AO16&AP16,CHOOSE({1,2},tPts32[Score 1]&tPts32[Score 2],tPts32[Pts]),2,0))","v":""},{"$f":"Tirage!$N11","v":4},null,null,{"$f":"VLOOKUP(AR16,Inscriptions!$E$3:$F$12,2,FALSE)","v":0},"","",{"$f":"IF(COUNTBLANK(AV16:AW16),\"\",VLOOKUP(AV16&AW16,CHOOSE({1,2},tPts32[Score 1]&tPts32[Score 2],tPts32[Pts]),2,0))","v":""},{"$f":"Tirage!$P11","v":7},null,null,{"$f":"VLOOKUP(AY16,Inscriptions!$E$3:$F$12,2,FALSE)","v":0},{"$f":"IFERROR(VLOOKUP(BB16,$BB$3:BD$7,3,0),\"\")&IFERROR(VLOOKUP(BB16,$BC$3:$BE$7,3,0),\"\")","v":""},"",{"$f":"IF(COUNTBLANK(BC16:BD16),\"\",VLOOKUP(BC16&BD16,CHOOSE({1,2},tPts32[Score 1]&tPts32[Score 2],tPts32[Pts]),2,0))","v":""},{"$f":"Tirage!$R11","v":4},null,null,{"$f":"VLOOKUP(BF16,Inscriptions!$E$3:$F$12,2,FALSE)","v":0},{"$f":"IFERROR(VLOOKUP(BI16,$BI$3:BK$7,3,0),\"\")&IFERROR(VLOOKUP(BI16,$BJ$3:$BL$7,3,0),\"\")","v":""},"",{"$f":"IF(COUNTBLANK(BJ16:BK16),\"\",VLOOKUP(BJ16&BK16,CHOOSE({1,2},tPts32[Score 1]&tPts32[Score 2],tPts32[Pts]),2,0))","v":""}]
[null,{"$f":"Tirage!$B12","v":9},null,null,{"$f":"VLOOKUP(B17,Inscriptions!$E$3:$F$12,2,FALSE)","v":0},"",{"$f":"IFERROR(VLOOKUP(E17,$E$3:$H$7,4,0),\"\")&IFERROR(VLOOKUP(E17,$F$3:H$7,2,0),\"\")","v":""},{"$f":"IF(E17=0,0,IF(COUNTBLANK(F17:G17),\"\",VLOOKUP(F17&G17,CHOOSE({1,2},tPts32[Score 1]&tPts32[Score 2],tPts32[Pts]),2,0)))","v":0},5,null,null,{"$f":"VLOOKUP(I17,Inscriptions!$E$3:$F$12,2,FALSE)","v":0},"","",{"$f":"IF(L17=0,0,IF(COUNTBLANK(M17:N17),\"\",VLOOKUP(M17&N17,CHOOSE({1,2},tPts32[Score 1]&tPts32[Score 2],tPts32[Pts]),2,0)))","v":0},{"$f":"Tirage!$F12","v":1},null,null,{"$f":"VLOOKUP(P17,Inscriptions!$E$3:$F$12,2,FALSE)","v":0},"","",{"$f":"IF(COUNTBLANK(T17:U17),\"\",VLOOKUP(T17&U17,CHOOSE({1,2},tPts32[Score 1]&tPts32[Score 2],tPts32[Pts]),2,0))","v":""},{"$f":"W6","v":8},null,null,{"$f":"VLOOKUP(W17,Inscriptions!$E$3:$F$12,2,FALSE)","v":0},"","",{"$f":"IF(COUNTBLANK(AA17:AB17),\"\",VLOOKUP(AA17&AB17,CHOOSE({1,2},tPts32[Score 1]&tPts32[Score 2],tPts32[Pts]),2,0))","v":""},{"$f":"Tirage!$J12","v":3},null,null,{"$f":"VLOOKUP(AD17,Inscriptions!$E$3:$F$12,2,FALSE)","v":0},"","",{"$f":"IF(COUNTBLANK(AH17:AI17),\"\",VLOOKUP(AH17&AI17,CHOOSE({1,2},tPts32[Score 1]&tPts32[Score 2],tPts32[Pts]),2,0))","v":""},{"$f":"Tirage!$L12","v":10},null,null,{"$f":"VLOOKUP(AK17,Inscriptions!$E$3:$F$12,2,FALSE)","v":0},"","",{"$f":"IF(COUNTBLANK(AO17:AP17),\"\",VLOOKUP(AO17&AP17,CHOOSE({1,2},tPts32[Score 1]&tPts32[Score 2],tPts32[Pts]),2,0))","v":""},{"$f":"Tirage!$N12","v":7},null,null,{"$f":"VLOOKUP(AR17,Inscriptions!$E$3:$F$12,2,FALSE)","v":0},"","",{"$f":"IF(COUNTBLANK(AV17:AW17),\"\",VLOOKUP(AV17&AW17,CHOOSE({1,2},tPts32[Score 1]&tPts32[Score 2],tPts32[Pts]),2,0))","v":""},{"$f":"Tirage!$P12","v":4},null,null,{"$f":"VLOOKUP(AY17,Inscriptions!$E$3:$F$12,2,FALSE)","v":0},{"$f":"IFERROR(VLOOKUP(BB17,$BB$3:BD$7,3,0),\"\")&IFERROR(VLOOKUP(BB17,$BC$3:$BE$7,3,0),\"\")","v":""},"",{"$f":"IF(COUNTBLANK(BC17:BD17),\"\",VLOOKUP(BC17&BD17,CHOOSE({1,2},tPts32[Score 1]&tPts32[Score 2],tPts32[Pts]),2,0))","v":""},{"$f":"Tirage!$R12","v":10},null,null,{"$f":"VLOOKUP(BF17,Inscriptions!$E$3:$F$12,2,FALSE)","v":0},{"$f":"IFERROR(VLOOKUP(BI17,$BI$3:BK$7,3,0),\"\")&IFERROR(VLOOKUP(BI17,$BJ$3:$BL$7,3,0),\"\")","v":""},"",{"$f":"IF(COUNTBLANK(BJ17:BK17),\"\",VLOOKUP(BJ17&BK17,CHOOSE({1,2},tPts32[Score 1]&tPts32[Score 2],tPts32[Pts]),2,0))","v":""}]
[null,{"$f":"Tirage!$B13","v":8},null,null,{"$f":"VLOOKUP(B18,Inscriptions!$E$3:$F$12,2,FALSE)","v":0},"",{"$f":"IFERROR(VLOOKUP(E18,$E$3:$H$7,4,0),\"\")&IFERROR(VLOOKUP(E18,$F$3:H$7,2,0),\"\")","v":""},{"$f":"IF(E18=0,0,IF(COUNTBLANK(F18:G18),\"\",VLOOKUP(F18&G18,CHOOSE({1,2},tPts32[Score 1]&tPts32[Score 2],tPts32[Pts]),2,0)))","v":0},4,null,null,{"$f":"VLOOKUP(I18,Inscriptions!$E$3:$F$12,2,FALSE)","v":0},"","",{"$f":"IF(L18=0,0,IF(COUNTBLANK(M18:N18),\"\",VLOOKUP(M18&N18,CHOOSE({1,2},tPts32[Score 1]&tPts32[Score 2],tPts32[Pts]),2,0)))","v":0},{"$f":"Tirage!$F13","v":3},null,null,{"$f":"VLOOKUP(P18,Inscriptions!$E$3:$F$12,2,FALSE)","v":0},"","",{"$f":"IF(COUNTBLANK(T18:U18),\"\",VLOOKUP(T18&U18,CHOOSE({1,2},tPts32[Score 1]&tPts32[Score 2],tPts32[Pts]),2,0))","v":""},{"$f":"W7","v":1},null,null,{"$f":"VLOOKUP(W18,Inscriptions!$E$3:$F$12,2,FALSE)","v":0},"","",{"$f":"IF(COUNTBLANK(AA18:AB18),\"\",VLOOKUP(AA18&AB18,CHOOSE({1,2},tPts32[Score 1]&tPts32[Score 2],tPts32[Pts]),2,0))","v":""},{"$f":"Tirage!$J13","v":10},null,null,{"$f":"VLOOKUP(AD18,Inscriptions!$E$3:$F$12,2,FALSE)","v":0},"","",{"$f":"IF(COUNTBLANK(AH18:AI18),\"\",VLOOKUP(AH18&AI18,CHOOSE({1,2},tPts32[Score 1]&tPts32[Score 2],tPts32[Pts]),2,0))","v":""},{"$f":"Tirage!$L13","v":4},null,null,{"$f":"VLOOKUP(AK18,Inscriptions!$E$3:$F$12,2,FALSE)","v":0},"","",{"$f":"IF(COUNTBLANK(AO18:AP18),\"\",VLOOKUP(AO18&AP18,CHOOSE({1,2},tPts32[Score 1]&tPts32[Score 2],tPts32[Pts]),2,0))","v":""},{"$f":"Tirage!$N13","v":5},null,null,{"$f":"VLOOKUP(AR18,Inscriptions!$E$3:$F$12,2,FALSE)","v":0},"","",{"$f":"IF(COUNTBLANK(AV18:AW18),\"\",VLOOKUP(AV18&AW18,CHOOSE({1,2},tPts32[Score 1]&tPts32[Score 2],tPts32[Pts]),2,0))","v":""},{"$f":"Tirage!$P13","v":10},null,null,{"$f":"VLOOKUP(AY18,Inscriptions!$E$3:$F$12,2,FALSE)","v":0},{"$f":"IFERROR(VLOOKUP(BB18,$BB$3:BD$7,3,0),\"\")&IFERROR(VLOOKUP(BB18,$BC$3:$BE$7,3,0),\"\")","v":""},"",{"$f":"IF(COUNTBLANK(BC18:BD18),\"\",VLOOKUP(BC18&BD18,CHOOSE({1,2},tPts32[Score 1]&tPts32[Score 2],tPts32[Pts]),2,0))","v":""},{"$f":"Tirage!$R13","v":3},null,null,{"$f":"VLOOKUP(BF18,Inscriptions!$E$3:$F$12,2,FALSE)","v":0},{"$f":"IFERROR(VLOOKUP(BI18,$BI$3:BK$7,3,0),\"\")&IFERROR(VLOOKUP(BI18,$BJ$3:$BL$7,3,0),\"\")","v":""},"",{"$f":"IF(COUNTBLANK(BJ18:BK18),\"\",VLOOKUP(BJ18&BK18,CHOOSE({1,2},tPts32[Score 1]&tPts32[Score 2],tPts32[Pts]),2,0))","v":""}]
[null,{"$f":"Tirage!$C9","v":10},null,null,{"$f":"VLOOKUP(B19,Inscriptions!$E$3:$F$12,2,FALSE)","v":0},"",{"$f":"IFERROR(VLOOKUP(E19,$E$3:$H$7,4,0),\"\")&IFERROR(VLOOKUP(E19,$F$3:H$7,2,0),\"\")","v":""},{"$f":"IF(E19=0,0,IF(COUNTBLANK(F19:G19),\"\",VLOOKUP(F19&G19,CHOOSE({1,2},tPts32[Score 1]&tPts32[Score 2],tPts32[Pts]),2,0)))","v":0},{"$f":"J3","v":9},null,null,{"$f":"VLOOKUP(I19,Inscriptions!$E$3:$F$12,2,FALSE)","v":0},"","",{"$f":"IF(L19=0,0,IF(COUNTBLANK(M19:N19),\"\",VLOOKUP(M19&N19,CHOOSE({1,2},tPts32[Score 1]&tPts32[Score 2],tPts32[Pts]),2,0)))","v":0},{"$f":"Tirage!$G9","v":2},null,null,{"$f":"VLOOKUP(P19,Inscriptions!$E$3:$F$12,2,FALSE)","v":0},"","",{"$f":"IF(COUNTBLANK(T19:U19),\"\",VLOOKUP(T19&U19,CHOOSE({1,2},tPts32[Score 1]&tPts32[Score 2],tPts32[Pts]),2,0))","v":""},{"$f":"X3","v":10},null,null,{"$f":"VLOOKUP(W19,Inscriptions!$E$3:$F$12,2,FALSE)","v":0},"","",{"$f":"IF(COUNTBLANK(AA19:AB19),\"\",VLOOKUP(AA19&AB19,CHOOSE({1,2},tPts32[Score 1]&tPts32[Score 2],tPts32[Pts]),2,0))","v":""},{"$f":"Tirage!$K9","v":6},null,null,{"$f":"VLOOKUP(AD19,Inscriptions!$E$3:$F$12,2,FALSE)","v":0},"","",{"$f":"IF(COUNTBLANK(AH19:AI19),\"\",VLOOKUP(AH19&AI19,CHOOSE({1,2},tPts32[Score 1]&tPts32[Score 2],tPts32[Pts]),2,0))","v":""},{"$f":"Tirage!$M9","v":6},null,null,{"$f":"VLOOKUP(AK19,Inscriptions!$E$3:$F$12,2,FALSE)","v":0},"","",{"$f":"IF(COUNTBLANK(AO19:AP19),\"\",VLOOKUP(AO19&AP19,CHOOSE({1,2},tPts32[Score 1]&tPts32[Score 2],tPts32[Pts]),2,0))","v":""},{"$f":"Tirage!$O9","v":10},null,null,{"$f":"VLOOKUP(AR19,Inscriptions!$E$3:$F$12,2,FALSE)","v":0},"","",{"$f":"IF(COUNTBLANK(AV19:AW19),\"\",VLOOKUP(AV19&AW19,CHOOSE({1,2},tPts32[Score 1]&tPts32[Score 2],tPts32[Pts]),2,0))","v":""},{"$f":"Tirage!$Q9","v":9},null,null,{"$f":"VLOOKUP(AY19,Inscriptions!$E$3:$F$12,2,FALSE)","v":0},{"$f":"IFERROR(VLOOKUP(BB19,$BB$3:BD$7,3,0),\"\")&IFERROR(VLOOKUP(BB19,$BC$3:$BE$7,3,0),\"\")","v":""},"",{"$f":"IF(COUNTBLANK(BC19:BD19),\"\",VLOOKUP(BC19&BD19,CHOOSE({1,2},tPts32[Score 1]&tPts32[Score 2],tPts32[Pts]),2,0))","v":""},{"$f":"Tirage!$S9","v":8},null,null,{"$f":"VLOOKUP(BF19,Inscriptions!$E$3:$F$12,2,FALSE)","v":0},{"$f":"IFERROR(VLOOKUP(BI19,$BI$3:BK$7,3,0),\"\")&IFERROR(VLOOKUP(BI19,$BJ$3:$BL$7,3,0),\"\")","v":""},"",{"$f":"IF(COUNTBLANK(BJ19:BK19),\"\",VLOOKUP(BJ19&BK19,CHOOSE({1,2},tPts32[Score 1]&tPts32[Score 2],tPts32[Pts]),2,0))","v":""}]
[null,{"$f":"Tirage!$C10","v":5},null,null,{"$f":"VLOOKUP(B20,Inscriptions!$E$3:$F$12,2,FALSE)","v":0},"",{"$f":"IFERROR(VLOOKUP(E20,$E$3:$H$7,4,0),\"\")&IFERROR(VLOOKUP(E20,$F$3:H$7,2,0),\"\")","v":""},{"$f":"IF(E20=0,0,IF(COUNTBLANK(F20:G20),\"\",VLOOKUP(F20&G20,CHOOSE({1,2},tPts32[Score 1]&tPts32[Score 2],tPts32[Pts]),2,0)))","v":0},{"$f":"J4","v":1},null,null,{"$f":"VLOOKUP(I20,Inscriptions!$E$3:$F$12,2,FALSE)","v":0},"","",{"$f":"IF(L20=0,0,IF(COUNTBLANK(M20:N20),\"\",VLOOKUP(M20&N20,CHOOSE({1,2},tPts32[Score 1]&tPts32[Score 2],tPts32[Pts]),2,0)))","v":0},{"$f":"Tirage!$G10","v":7},null,null,{"$f":"VLOOKUP(P20,Inscriptions!$E$3:$F$12,2,FALSE)","v":0},"","",{"$f":"IF(COUNTBLANK(T20:U20),\"\",VLOOKUP(T20&U20,CHOOSE({1,2},tPts32[Score 1]&tPts32[Score 2],tPts32[Pts]),2,0))","v":""},{"$f":"X4","v":9},null,null,{"$f":"VLOOKUP(W20,Inscriptions!$E$3:$F$12,2,FALSE)","v":0},"","",{"$f":"IF(COUNTBLANK(AA20:AB20),\"\",VLOOKUP(AA20&AB20,CHOOSE({1,2},tPts32[Score 1]&tPts32[Score 2],tPts32[Pts]),2,0))","v":""},{"$f":"Tirage!$K10","v":5},null,null,{"$f":"VLOOKUP(AD20,Inscriptions!$E$3:$F$12,2,FALSE)","v":0},"","",{"$f":"IF(COUNTBLANK(AH20:AI20),\"\",VLOOKUP(AH20&AI20,CHOOSE({1,2},tPts32[Score 1]&tPts32[Score 2],tPts32[Pts]),2,0))","v":""},{"$f":"Tirage!$M10","v":1},null,null,{"$f":"VLOOKUP(AK20,Inscriptions!$E$3:$F$12,2,FALSE)","v":0},"","",{"$f":"IF(COUNTBLANK(AO20:AP20),\"\",VLOOKUP(AO20&AP20,CHOOSE({1,2},tPts32[Score 1]&tPts32[Score 2],tPts32[Pts]),2,0))","v":""},{"$f":"Tirage!$O10","v":1},null,null,{"$f":"VLOOKUP(AR20,Inscriptions!$E$3:$F$12,2,FALSE)","v":0},"","",{"$f":"IF(COUNTBLANK(AV20:AW20),\"\",VLOOKUP(AV20&AW20,CHOOSE({1,2},tPts32[Score 1]&tPts32[Score 2],tPts32[Pts]),2,0))","v":""},{"$f":"Tirage!$Q10","v":5},null,null,{"$f":"VLOOKUP(AY20,Inscriptions!$E$3:$F$12,2,FALSE)","v":0},{"$f":"IFERROR(VLOOKUP(BB20,$BB$3:BD$7,3,0),\"\")&IFERROR(VLOOKUP(BB20,$BC$3:$BE$7,3,0),\"\")","v":""},"",{"$f":"IF(COUNTBLANK(BC20:BD20),\"\",VLOOKUP(BC20&BD20,CHOOSE({1,2},tPts32[Score 1]&tPts32[Score 2],tPts32[Pts]),2,0))","v":""},{"$f":"Tirage!$S10","v":9},null,null,{"$f":"VLOOKUP(BF20,Inscriptions!$E$3:$F$12,2,FALSE)","v":0},{"$f":"IFERROR(VLOOKUP(BI20,$BI$3:BK$7,3,0),\"\")&IFERROR(VLOOKUP(BI20,$BJ$3:$BL$7,3,0),\"\")","v":""},"",{"$f":"IF(COUNTBLANK(BJ20:BK20),\"\",VLOOKUP(BJ20&BK20,CHOOSE({1,2},tPts32[Score 1]&tPts32[Score 2],tPts32[Pts]),2,0))","v":""}]
[null,{"$f":"Tirage!$C11","v":2},null,null,{"$f":"VLOOKUP(B21,Inscriptions!$E$3:$F$12,2,FALSE)","v":0},"",{"$f":"IFERROR(VLOOKUP(E21,$E$3:$H$7,4,0),\"\")&IFERROR(VLOOKUP(E21,$F$3:H$7,2,0),\"\")","v":""},{"$f":"IF(E21=0,0,IF(COUNTBLANK(F21:G21),\"\",VLOOKUP(F21&G21,CHOOSE({1,2},tPts32[Score 1]&tPts32[Score 2],tPts32[Pts]),2,0)))","v":0},7,null,null,{"$f":"VLOOKUP(I21,Inscriptions!$E$3:$F$12,2,FALSE)","v":0},"","",{"$f":"IF(L21=0,0,IF(COUNTBLANK(M21:N21),\"\",VLOOKUP(M21&N21,CHOOSE({1,2},tPts32[Score 1]&tPts32[Score 2],tPts32[Pts]),2,0)))","v":0},{"$f":"Tirage!$G11","v":9},null,null,{"$f":"VLOOKUP(P21,Inscriptions!$E$3:$F$12,2,FALSE)","v":0},"","",{"$f":"IF(COUNTBLANK(T21:U21),\"\",VLOOKUP(T21&U21,CHOOSE({1,2},tPts32[Score 1]&tPts32[Score 2],tPts32[Pts]),2,0))","v":""},{"$f":"X5","v":3},null,null,{"$f":"VLOOKUP(W21,Inscriptions!$E$3:$F$12,2,FALSE)","v":0},"","",{"$f":"IF(COUNTBLANK(AA21:AB21),\"\",VLOOKUP(AA21&AB21,CHOOSE({1,2},tPts32[Score 1]&tPts32[Score 2],tPts32[Pts]),2,0))","v":""},{"$f":"Tirage!$K11","v":2},null,null,{"$f":"VLOOKUP(AD21,Inscriptions!$E$3:$F$12,2,FALSE)","v":0},"","",{"$f":"IF(COUNTBLANK(AH21:AI21),\"\",VLOOKUP(AH21&AI21,CHOOSE({1,2},tPts32[Score 1]&tPts32[Score 2],tPts32[Pts]),2,0))","v":""},{"$f":"Tirage!$M11","v":7},null,null,{"$f":"VLOOKUP(AK21,Inscriptions!$E$3:$F$12,2,FALSE)","v":0},"","",{"$f":"IF(COUNTBLANK(AO21:AP21),\"\",VLOOKUP(AO21&AP21,CHOOSE({1,2},tPts32[Score 1]&tPts32[Score 2],tPts32[Pts]),2,0))","v":""},{"$f":"Tirage!$O11","v":9},null,null,{"$f":"VLOOKUP(AR21,Inscriptions!$E$3:$F$12,2,FALSE)","v":0},"","",{"$f":"IF(COUNTBLANK(AV21:AW21),\"\",VLOOKUP(AV21&AW21,CHOOSE({1,2},tPts32[Score 1]&tPts32[Score 2],tPts32[Pts]),2,0))","v":""},{"$f":"Tirage!$Q11","v":3},null,null,{"$f":"VLOOKUP(AY21,Inscriptions!$E$3:$F$12,2,FALSE)","v":0},{"$f":"IFERROR(VLOOKUP(BB21,$BB$3:BD$7,3,0),\"\")&IFERROR(VLOOKUP(BB21,$BC$3:$BE$7,3,0),\"\")","v":""},"",{"$f":"IF(COUNTBLANK(BC21:BD21),\"\",VLOOKUP(BC21&BD21,CHOOSE({1,2},tPts32[Score 1]&tPts32[Score 2],tPts32[Pts]),2,0))","v":""},{"$f":"Tirage!$S11","v":1},null,null,{"$f":"VLOOKUP(BF21,Inscriptions!$E$3:$F$12,2,FALSE)","v":0},{"$f":"IFERROR(VLOOKUP(BI21,$BI$3:BK$7,3,0),\"\")&IFERROR(VLOOKUP(BI21,$BJ$3:$BL$7,3,0),\"\")","v":""},"",{"$f":"IF(COUNTBLANK(BJ21:BK21),\"\",VLOOKUP(BJ21&BK21,CHOOSE({1,2},tPts32[Score 1]&tPts32[Score 2],tPts32[Pts]),2,0))","v":""}]
[null,{"$f":"Tirage!$C12","v":1},null,null,{"$f":"VLOOKUP(B22,Inscriptions!$E$3:$F$12,2,FALSE)","v":0},"",{"$f":"IFERROR(VLOOKUP(E22,$E$3:$H$7,4,0),\"\")&IFERROR(VLOOKUP(E22,$F$3:H$7,2,0),\"\")","v":""},{"$f":"IF(E22=0,0,IF(COUNTBLANK(F22:G22),\"\",VLOOKUP(F22&G22,CHOOSE({1,2},tPts32[Score 1]&tPts32[Score 2],tPts32[Pts]),2,0)))","v":0},6,null,null,{"$f":"VLOOKUP(I22,Inscriptions!$E$3:$F$12,2,FALSE)","v":0},"","",{"$f":"IF(L22=0,0,IF(COUNTBLANK(M22:N22),\"\",VLOOKUP(M22&N22,CHOOSE({1,2},tPts32[Score 1]&tPts32[Score 2],tPts32[Pts]),2,0)))","v":0},{"$f":"Tirage!$G12","v":5},null,null,{"$f":"VLOOKUP(P22,Inscriptions!$E$3:$F$12,2,FALSE)","v":0},"","",{"$f":"IF(COUNTBLANK(T22:U22),\"\",VLOOKUP(T22&U22,CHOOSE({1,2},tPts32[Score 1]&tPts32[Score 2],tPts32[Pts]),2,0))","v":""},{"$f":"X6","v":2},null,null,{"$f":"VLOOKUP(W22,Inscriptions!$E$3:$F$12,2,FALSE)","v":0},"","",{"$f":"IF(COUNTBLANK(AA22:AB22),\"\",VLOOKUP(AA22&AB22,CHOOSE({1,2},tPts32[Score 1]&tPts32[Score 2],tPts32[Pts]),2,0))","v":""},{"$f":"Tirage!$K12","v":8},null,null,{"$f":"VLOOKUP(AD22,Inscriptions!$E$3:$F$12,2,FALSE)","v":0},"","",{"$f":"IF(COUNTBLANK(AH22:AI22),\"\",VLOOKUP(AH22&AI22,CHOOSE({1,2},tPts32[Score 1]&tPts32[Score 2],tPts32[Pts]),2,0))","v":""},{"$f":"Tirage!$M12","v":8},null,null,{"$f":"VLOOKUP(AK22,Inscriptions!$E$3:$F$12,2,FALSE)","v":0},"","",{"$f":"IF(COUNTBLANK(AO22:AP22),\"\",VLOOKUP(AO22&AP22,CHOOSE({1,2},tPts32[Score 1]&tPts32[Score 2],tPts32[Pts]),2,0))","v":""},{"$f":"Tirage!$O12","v":6},null,null,{"$f":"VLOOKUP(AR22,Inscriptions!$E$3:$F$12,2,FALSE)","v":0},"","",{"$f":"IF(COUNTBLANK(AV22:AW22),\"\",VLOOKUP(AV22&AW22,CHOOSE({1,2},tPts32[Score 1]&tPts32[Score 2],tPts32[Pts]),2,0))","v":""},{"$f":"Tirage!$Q12","v":6},null,null,{"$f":"VLOOKUP(AY22,Inscriptions!$E$3:$F$12,2,FALSE)","v":0},{"$f":"IFERROR(VLOOKUP(BB22,$BB$3:BD$7,3,0),\"\")&IFERROR(VLOOKUP(BB22,$BC$3:$BE$7,3,0),\"\")","v":""},"",{"$f":"IF(COUNTBLANK(BC22:BD22),\"\",VLOOKUP(BC22&BD22,CHOOSE({1,2},tPts32[Score 1]&tPts32[Score 2],tPts32[Pts]),2,0))","v":""},{"$f":"Tirage!$S12","v":5},null,null,{"$f":"VLOOKUP(BF22,Inscriptions!$E$3:$F$12,2,FALSE)","v":0},{"$f":"IFERROR(VLOOKUP(BI22,$BI$3:BK$7,3,0),\"\")&IFERROR(VLOOKUP(BI22,$BJ$3:$BL$7,3,0),\"\")","v":""},"",{"$f":"IF(COUNTBLANK(BJ22:BK22),\"\",VLOOKUP(BJ22&BK22,CHOOSE({1,2},tPts32[Score 1]&tPts32[Score 2],tPts32[Pts]),2,0))","v":""}]
[null,{"$f":"Tirage!$C13","v":4},null,null,{"$f":"VLOOKUP(B23,Inscriptions!$E$3:$F$12,2,FALSE)","v":0},"",{"$f":"IFERROR(VLOOKUP(E23,$E$3:$H$7,4,0),\"\")&IFERROR(VLOOKUP(E23,$F$3:H$7,2,0),\"\")","v":""},{"$f":"IF(E23=0,0,IF(COUNTBLANK(F23:G23),\"\",VLOOKUP(F23&G23,CHOOSE({1,2},tPts32[Score 1]&tPts32[Score 2],tPts32[Pts]),2,0)))","v":0},10,null,null,{"$f":"VLOOKUP(I23,Inscriptions!$E$3:$F$12,2,FALSE)","v":0},"","",{"$f":"IF(L23=0,0,IF(COUNTBLANK(M23:N23),\"\",VLOOKUP(M23&N23,CHOOSE({1,2},tPts32[Score 1]&tPts32[Score 2],tPts32[Pts]),2,0)))","v":0},{"$f":"Tirage!$G13","v":6},null,null,{"$f":"VLOOKUP(P23,Inscriptions!$E$3:$F$12,2,FALSE)","v":0},"","",{"$f":"IF(COUNTBLANK(T23:U23),\"\",VLOOKUP(T23&U23,CHOOSE({1,2},tPts32[Score 1]&tPts32[Score 2],tPts32[Pts]),2,0))","v":""},{"$f":"X7","v":7},null,null,{"$f":"VLOOKUP(W23,Inscriptions!$E$3:$F$12,2,FALSE)","v":0},"","",{"$f":"IF(COUNTBLANK(AA23:AB23),\"\",VLOOKUP(AA23&AB23,CHOOSE({1,2},tPts32[Score 1]&tPts32[Score 2],tPts32[Pts]),2,0))","v":""},{"$f":"Tirage!$K13","v":9},null,null,{"$f":"VLOOKUP(AD23,Inscriptions!$E$3:$F$12,2,FALSE)","v":0},"","",{"$f":"IF(COUNTBLANK(AH23:AI23),\"\",VLOOKUP(AH23&AI23,CHOOSE({1,2},tPts32[Score 1]&tPts32[Score 2],tPts32[Pts]),2,0))","v":""},{"$f":"Tirage!$M13","v":5},null,null,{"$f":"VLOOKUP(AK23,Inscriptions!$E$3:$F$12,2,FALSE)","v":0},{"$f":"IFERROR(VLOOKUP(AN23,$AN$3:$AP$7,3,0),\"\")&IFERROR(VLOOKUP(AN23,$AO$3:$AQ$7,3,0),\"\")","v":""},{"$f":"IFERROR(VLOOKUP(AN23,$AN$3:$AQ$7,4,0),\"\")&IFERROR(VLOOKUP(AN23,$AO$3:$AQ$7,2,0),\"\")","v":""},{"$f":"IF(COUNTBLANK(AO23:AP23),\"\",VLOOKUP(AO23&AP23,CHOOSE({1,2},tPts32[Score 1]&tPts32[Score 2],tPts32[Pts]),2,0))","v":""},{"$f":"Tirage!$O13","v":2},null,null,{"$f":"VLOOKUP(AR23,Inscriptions!$E$3:$F$12,2,FALSE)","v":0},"","",{"$f":"IF(COUNTBLANK(AV23:AW23),\"\",VLOOKUP(AV23&AW23,CHOOSE({1,2},tPts32[Score 1]&tPts32[Score 2],tPts32[Pts]),2,0))","v":""},{"$f":"Tirage!$Q13","v":1},null,null,{"$f":"VLOOKUP(AY23,Inscriptions!$E$3:$F$12,2,FALSE)","v":0},{"$f":"IFERROR(VLOOKUP(BB23,$BB$3:BD$7,3,0),\"\")&IFERROR(VLOOKUP(BB23,$BC$3:$BE$7,3,0),\"\")","v":""},"",{"$f":"IF(COUNTBLANK(BC23:BD23),\"\",VLOOKUP(BC23&BD23,CHOOSE({1,2},tPts32[Score 1]&tPts32[Score 2],tPts32[Pts]),2,0))","v":""},{"$f":"Tirage!$S13","v":2},null,null,{"$f":"VLOOKUP(BF23,Inscriptions!$E$3:$F$12,2,FALSE)","v":0},{"$f":"IFERROR(VLOOKUP(BI23,$BI$3:BK$7,3,0),\"\")&IFERROR(VLOOKUP(BI23,$BJ$3:$BL$7,3,0),\"\")","v":""},"",{"$f":"IF(COUNTBLANK(BJ23:BK23),\"\",VLOOKUP(BJ23&BK23,CHOOSE({1,2},tPts32[Score 1]&tPts32[Score 2],tPts32[Pts]),2,0))","v":""}]
[]
[]
[]
[null,null,null,"Grille des points",null,null,null,null,null,null,null,null,"Classement Général journée 2"]
[null,null,null,"Score 1","Score 2","Pts",null,null,null,"Place",null,"Place","Equipes","Total Pts"]
[null,null,null,0,0,0,null,null,null,1,null,1,null,{"$f":"IFERROR(VLOOKUP(M29,$E$14:$H$23,4,0)*1,0)\n+IFERROR(VLOOKUP(M29,$L$14:$O$23,4,0)*1,0)\n+IFERROR(VLOOKUP(M29,$S$14:$V$23,4,0)*1,0)\n+IFERROR(VLOOKUP(M29,$Z$14:$AC$23,4,0)*1,0)\n+IFERROR(VLOOKUP(M29,$AG$14:$AJ$23,4,0)*1,0)\n+IFERROR(VLOOKUP(M29,$AN$14:$AQ$23,4,0)*1,0)\n+IFERROR(VLOOKUP(M29,$AU$14:$AX$23,4,0)*1,0\n+IFERROR(VLOOKUP(M29,$BB$14:$BE$23,4,0)*1,0)\n+IFERROR(VLOOKUP(M29,$BI$14:$BL$23,4,0)*1,0))","v":0},{"$f":"IF(N29=0,-100,N29)","v":-100}]
[null,null,null,0,1,1,null,null,null,2,null,2,null,0,-100]
[null,null,null,0,2,1,null,null,null,3,null,3,null,0,-100]
[null,null,null,1,0,10,null,null,null,4,null,4,null,0,-100]
[null,null,null,1,1,3,null,null,null,5,null,5,null,0,-100]
[null,null,null,1,2,1,null,null,null,6,null,6,null,0,-100]
[null,null,null,2,0,10,null,null,null,7,null,7,null,0,-100]
[null,null,null,2,1,10,null,null,null,8,null,8,null,0,-100]
[null,null,null,2,2,3,null,null,null,9,null,9,null,0,-100]
[null,null,null,2,"ab",10,null,null,null,10,null,10,null,0,-100]
[null,null,null,"ab",2,0,null,null,null,11]
[null,null,null,1,"ab",10,null,null,null,12]
[null,null,null,"ab",1,0,null,null,null,13]

{"sheet":"Journée3","index":7,"n_rows":41,"n_cols":64,"rows_kept":41,"cut":false,"hidden":true,"merged":[[0,18,0,21],[8,12,9,14],[0,3,1,3],[0,4,0,7],[0,10,1,10],[0,11,0,14],[0,17,1,17],[7,6,7,7],[7,13,7,14],[7,20,7,21],[0,60,0,63],[0,24,1,24],[0,25,0,28],[0,31,1,31],[0,32,0,35],[0,38,1,38],[0,39,0,42],[0,45,1,45],[0,46,0,49],[0,52,1,52],[0,53,0,56],[0,59,1,59],[7,48,7,49],[7,55,7,56],[7,62,7,63],[8,27,8,28],[8,34,8,35],[8,41,8,42],[8,48,8,49],[7,27,7,28],[7,34,7,35],[7,41,7,42],[26,3,26,5],[26,10,26,11],[26,12,26,13],[8,55,8,56],[8,62,8,63],[9,34,9,61],[10,4,10,7],[10,11,10,14],[10,18,10,21],[10,25,10,28],[10,32,10,35],[10,39,10,42],[30,15,30,16],[10,46,10,49],[10,53,10,56],[10,60,10,63],[25,12,25,13]]}
[null,null,null,"Arbitre","TOUR 1",null,null,null,null,null,"Arbitre","TOUR 2",null,null,null,null,null,"Arbitre","TOUR 3",null,null,null,null,null,"Arbitre","TOUR 4",null,null,null,null,null,"Arbitre","TOUR 5",null,null,null,null,null,"Arbitre","TOUR 6",null,null,null,null,null,"Arbitre","TOUR 7",null,null,null,null,null,"Arbitre","TOUR 8",null,null,null,null,null,"Arbitre","TOUR 9"]
[null,null,null,null,"Equipe 1","Equipe 2","Score 1","Score 2",null,null,null,"Equipe 1","Equipe 2","Score 1","Score 2",null,null,null,"Equipe 1","Equipe 2","Score 1","Score 2",null,null,null,"Equipe 1","Equipe 2","Score 1","Score 2",null,null,null,"Equipe 1","Equipe 2","Score 1","Score 2",null,null,null,"Equipe 1","Equipe 2","Score 1","Score 2",null,null,null,"Equipe 1","Equipe 2","Score 1","Score 2",null,null,null,"Equipe 1","Equipe 2","Score 1","Score 2",null,null,null,"Equipe 1","Equipe 2","Score 1","Score 2"]
[null,{"$f":"Tirage!$B9","v":7},{"$f":"Tirage!$C9","v":10},{"$f":"B7","v":8},{"$f":"VLOOKUP(B3,Inscriptions!$I$3:$J$12,2,FALSE)","v":0},{"$f":"VLOOKUP(C3,Inscriptions!$I$3:$J$12,2,FALSE)","v":0},null,null,{"$f":"Tirage!D9","v":3},{"$f":"Tirage!E9","v":9},{"$f":"I7","v":4},{"$f":"VLOOKUP(I3,Inscriptions!$I$3:$J$12,2,FALSE)","v":0},{"$f":"VLOOKUP(J3,Inscriptions!$I$3:$J$12,2,FALSE)","v":0},null,null,{"$f":"Tirage!$F9","v":10},{"$f":"Tirage!$G9","v":2},{"$f":"P7","v":3},{"$f":"VLOOKUP(P3,Inscriptions!$I$3:$J$12,2,FALSE)","v":0},{"$f":"VLOOKUP(Q3,Inscriptions!$I$3:$J$12,2,FALSE)","v":0},null,null,{"$f":"Tirage!$H9","v":6},{"$f":"Tirage!$I9","v":10},{"$f":"W7","v":1},{"$f":"VLOOKUP(W3,Inscriptions!$I$3:$J$12,2,FALSE)","v":0},{"$f":"VLOOKUP(X3,Inscriptions!$I$3:$J$12,2,FALSE)","v":0},null,null,{"$f":"Tirage!$J9","v":1},{"$f":"Tirage!$K9","v":6},{"$f":"AD7","v":10},{"$f":"VLOOKUP(AD3,Inscriptions!$I$3:$J$12,2,FALSE)","v":0},{"$f":"VLOOKUP(AE3,Inscriptions!$I$3:$J$12,2,FALSE)","v":0},null,null,{"$f":"Tirage!$L9","v":9},{"$f":"Tirage!$M9","v":6},{"$f":"AK7","v":4},{"$f":"VLOOKUP(AK3,Inscriptions!$I$3:$J$12,2,FALSE)","v":0},{"$f":"VLOOKUP(AL3,Inscriptions!$I$3:$J$12,2,FALSE)","v":0},null,null,{"$f":"Tirage!$N9","v":3},{"$f":"Tirage!$O9","v":10},{"$f":"AR7","v":5},{"$f":"VLOOKUP(AR3,Inscriptions!$I$3:$J$12,2,FALSE)","v":0},{"$f":"VLOOKUP(AS3,Inscriptions!$I$3:$J$12,2,FALSE)","v":0},null,null,{"$f":"Tirage!$P9","v":2},{"$f":"Tirage!$Q9","v":9},{"$f":"AY7","v":10},{"$f":"VLOOKUP(AY3,Inscriptions!$I$3:$J$12,2,FALSE)","v":0},{"$f":"VLOOKUP(AZ3,Inscriptions!$I$3:$J$12,2,FALSE)","v":0},null,null,{"$f":"Tirage!$R9","v":6},{"$f":"Tirage!$S9","v":8},{"$f":"BF7","v":3},{"$f":"VLOOKUP(BF3,Inscriptions!$I$3:$J$12,2,FALSE)","v":0},{"$f":"VLOOKUP(BG3,Inscriptions!$I$3:$J$12,2,FALSE)","v":0}]
[null,{"$f":"Tirage!$B10","v":3},{"$f":"Tirage!$C10","v":5},{"$f":"C7","v":4},{"$f":"VLOOKUP(B4,Inscriptions!$I$3:$J$12,2,FALSE)","v":0},{"$f":"VLOOKUP(C4,Inscriptions!$I$3:$J$12,2,FALSE)","v":0},null,null,{"$f":"Tirage!D10","v":2},{"$f":"Tirage!E10","v":1},{"$f":"J7","v":10},{"$f":"VLOOKUP(I4,Inscriptions!$I$3:$J$12,2,FALSE)","v":0},{"$f":"VLOOKUP(J4,Inscriptions!$I$3:$J$12,2,FALSE)","v":0},null,null,{"$f":"Tirage!$F10","v":4},{"$f":"Tirage!$G10","v":7},{"$f":"Q7","v":6},{"$f":"VLOOKUP(P4,Inscriptions!$I$3:$J$12,2,FALSE)","v":0},{"$f":"VLOOKUP(Q4,Inscriptions!$I$3:$J$12,2,FALSE)","v":0},null,null,{"$f":"Tirage!$H10","v":5},{"$f":"Tirage!$I10","v":9},{"$f":"X7","v":7},{"$f":"VLOOKUP(W4,Inscriptions!$I$3:$J$12,2,FALSE)","v":0},{"$f":"VLOOKUP(X4,Inscriptions!$I$3:$J$12,2,FALSE)","v":0},null,null,{"$f":"Tirage!$J10","v":7},{"$f":"Tirage!$K10","v":5},{"$f":"AE7","v":9},{"$f":"VLOOKUP(AD4,Inscriptions!$I$3:$J$12,2,FALSE)","v":0},{"$f":"VLOOKUP(AE4,Inscriptions!$I$3:$J$12,2,FALSE)","v":0},null,null,{"$f":"Tirage!$L10","v":3},{"$f":"Tirage!$M10","v":1},{"$f":"AL7","v":5},{"$f":"VLOOKUP(AK4,Inscriptions!$I$3:$J$12,2,FALSE)","v":0},{"$f":"VLOOKUP(AL4,Inscriptions!$I$3:$J$12,2,FALSE)","v":0},null,null,{"$f":"Tirage!$N10","v":8},{"$f":"Tirage!$O10","v":1},{"$f":"AS7","v":2},{"$f":"VLOOKUP(AR4,Inscriptions!$I$3:$J$12,2,FALSE)","v":0},{"$f":"VLOOKUP(AS4,Inscriptions!$I$3:$J$12,2,FALSE)","v":0},null,null,{"$f":"Tirage!$P10","v":8},{"$f":"Tirage!$Q10","v":5},{"$f":"AZ7","v":1},{"$f":"VLOOKUP(AY4,Inscriptions!$I$3:$J$12,2,FALSE)","v":0},{"$f":"VLOOKUP(AZ4,Inscriptions!$I$3:$J$12,2,FALSE)","v":0},null,null,{"$f":"Tirage!$R10","v":7},{"$f":"Tirage!$S10","v":9},{"$f":"BG7","v":2},{"$f":"VLOOKUP(BF4,Inscriptions!$I$3:$J$12,2,FALSE)","v":0},{"$f":"VLOOKUP(BG4,Inscriptions!$I$3:$J$12,2,FALSE)","v":0}]
[null,{"$f":"Tirage!$B11","v":6},{"$f":"Tirage!$C11","v":2},{"$f":"B6","v":9},{"$f":"VLOOKUP(B5,Inscriptions!$I$3:$J$12,2,FALSE)","v":0},{"$f":"VLOOKUP(C5,Inscriptions!$I$3:$J$12,2,FALSE)","v":0},null,null,{"$f":"Tirage!D11","v":8},{"$f":"Tirage!E11","v":7},{"$f":"I6","v":5},{"$f":"VLOOKUP(I5,Inscriptions!$I$3:$J$12,2,FALSE)","v":0},{"$f":"VLOOKUP(J5,Inscriptions!$I$3:$J$12,2,FALSE)","v":0},null,null,{"$f":"Tirage!$F11","v":8},{"$f":"Tirage!$G11","v":9},{"$f":"P6","v":1},{"$f":"VLOOKUP(P5,Inscriptions!$I$3:$J$12,2,FALSE)","v":0},{"$f":"VLOOKUP(Q5,Inscriptions!$I$3:$J$12,2,FALSE)","v":0},null,null,{"$f":"Tirage!$H11","v":4},{"$f":"Tirage!$I11","v":3},{"$f":"W6","v":8},{"$f":"VLOOKUP(W5,Inscriptions!$I$3:$J$12,2,FALSE)","v":0},{"$f":"VLOOKUP(X5,Inscriptions!$I$3:$J$12,2,FALSE)","v":0},null,null,{"$f":"Tirage!$J11","v":4},{"$f":"Tirage!$K11","v":2},{"$f":"AD6","v":3},{"$f":"VLOOKUP(AD5,Inscriptions!$I$3:$J$12,2,FALSE)","v":0},{"$f":"VLOOKUP(AE5,Inscriptions!$I$3:$J$12,2,FALSE)","v":0},null,null,{"$f":"Tirage!$L11","v":2},{"$f":"Tirage!$M11","v":7},{"$f":"AK6","v":10},{"$f":"VLOOKUP(AK5,Inscriptions!$I$3:$J$12,2,FALSE)","v":0},{"$f":"VLOOKUP(AL5,Inscriptions!$I$3:$J$12,2,FALSE)","v":0},null,null,{"$f":"Tirage!$N11","v":4},{"$f":"Tirage!$O11","v":9},{"$f":"AR6","v":7},{"$f":"VLOOKUP(AR5,Inscriptions!$I$3:$J$12,2,FALSE)","v":0},{"$f":"VLOOKUP(AS5,Inscriptions!$I$3:$J$12,2,FALSE)","v":0},null,null,{"$f":"Tirage!$P11","v":7},{"$f":"Tirage!$Q11","v":3},{"$f":"AY6","v":4},{"$f":"VLOOKUP(AY5,Inscriptions!$I$3:$J$12,2,FALSE)","v":0},{"$f":"VLOOKUP(AZ5,Inscriptions!$I$3:$J$12,2,FALSE)","v":0},null,null,{"$f":"Tirage!$R11","v":4},{"$f":"Tirage!$S11","v":1},{"$f":"BF6","v":10},{"$f":"VLOOKUP(BF5,Inscriptions!$I$3:$J$12,2,FALSE)","v":0},{"$f":"VLOOKUP(BG5,Inscriptions!$I$3:$J$12,2,FALSE)","v":0}]
[null,{"$f":"Tirage!$B12","v":9},{"$f":"Tirage!$C12","v":1},{"$f":"B3","v":7},{"$f":"VLOOKUP(B6,Inscriptions!$I$3:$J$12,2,FALSE)","v":0},{"$f":"VLOOKUP(C6,Inscriptions!$I$3:$J$12,2,FALSE)","v":0},null,null,{"$f":"Tirage!D12","v":5},{"$f":"Tirage!E12","v":6},{"$f":"I3","v":3},{"$f":"VLOOKUP(I6,Inscriptions!$I$3:$J$12,2,FALSE)","v":0},{"$f":"VLOOKUP(J6,Inscriptions!$I$3:$J$12,2,FALSE)","v":0},null,null,{"$f":"Tirage!$F12","v":1},{"$f":"Tirage!$G12","v":5},{"$f":"Q3","v":2},{"$f":"VLOOKUP(P6,Inscriptions!$I$3:$J$12,2,FALSE)","v":0},{"$f":"VLOOKUP(Q6,Inscriptions!$I$3:$J$12,2,FALSE)","v":0},null,null,{"$f":"Tirage!$H12","v":8},{"$f":"Tirage!$I12","v":2},{"$f":"X3","v":10},{"$f":"VLOOKUP(W6,Inscriptions!$I$3:$J$12,2,FALSE)","v":0},{"$f":"VLOOKUP(X6,Inscriptions!$I$3:$J$12,2,FALSE)","v":0},null,null,{"$f":"Tirage!$J12","v":3},{"$f":"Tirage!$K12","v":8},{"$f":"AD4","v":7},{"$f":"VLOOKUP(AD6,Inscriptions!$I$3:$J$12,2,FALSE)","v":0},{"$f":"VLOOKUP(AE6,Inscriptions!$I$3:$J$12,2,FALSE)","v":0},null,null,{"$f":"Tirage!$L12","v":10},{"$f":"Tirage!$M12","v":8},{"$f":"AL3","v":6},{"$f":"VLOOKUP(AK6,Inscriptions!$I$3:$J$12,2,FALSE)","v":0},{"$f":"VLOOKUP(AL6,Inscriptions!$I$3:$J$12,2,FALSE)","v":0},null,null,{"$f":"Tirage!$N12","v":7},{"$f":"Tirage!$O12","v":6},{"$f":"AS4","v":1},{"$f":"VLOOKUP(AR6,Inscriptions!$I$3:$J$12,2,FALSE)","v":0},{"$f":"VLOOKUP(AS6,Inscriptions!$I$3:$J$12,2,FALSE)","v":0},null,null,{"$f":"Tirage!$P12","v":4},{"$f":"Tirage!$Q12","v":6},{"$f":"AY3","v":2},{"$f":"VLOOKUP(AY6,Inscriptions!$I$3:$J$12,2,FALSE)","v":0},{"$f":"VLOOKUP(AZ6,Inscriptions!$I$3:$J$12,2,FALSE)","v":0},null,null,{"$f":"Tirage!$R12","v":10},{"$f":"Tirage!$S12","v":5},{"$f":"BF3","v":6},{"$f":"VLOOKUP(BF6,Inscriptions!$I$3:$J$12,2,FALSE)","v":0},{"$f":"VLOOKUP(BG6,Inscriptions!$I$3:$J$12,2,FALSE)","v":0}]
[null,{"$f":"Tirage!$B13","v":8},{"$f":"Tirage!$C13","v":4},{"$f":"B5","v":6},{"$f":"VLOOKUP(B7,Inscriptions!$I$3:$J$12,2,FALSE)","v":0},{"$f":"VLOOKUP(C7,Inscriptions!$I$3:$J$12,2,FALSE)","v":0},null,null,{"$f":"Tirage!D13","v":4},{"$f":"Tirage!E13","v":10},{"$f":"J3","v":9},{"$f":"VLOOKUP(I7,Inscriptions!$I$3:$J$12,2,FALSE)","v":0},{"$f":"VLOOKUP(J7,Inscriptions!$I$3:$J$12,2,FALSE)","v":0},null,null,{"$f":"Tirage!$F13","v":3},{"$f":"Tirage!$G13","v":6},{"$f":"P5","v":8},{"$f":"VLOOKUP(P7,Inscriptions!$I$3:$J$12,2,FALSE)","v":0},{"$f":"VLOOKUP(Q7,Inscriptions!$I$3:$J$12,2,FALSE)","v":0},null,null,{"$f":"Tirage!$H13","v":1},{"$f":"Tirage!$I13","v":7},{"$f":"W5","v":4},{"$f":"VLOOKUP(W7,Inscriptions!$I$3:$J$12,2,FALSE)","v":0},{"$f":"VLOOKUP(X7,Inscriptions!$I$3:$J$12,2,FALSE)","v":0},null,null,{"$f":"Tirage!$J13","v":10},{"$f":"Tirage!$K13","v":9},{"$f":"AD5","v":4},{"$f":"VLOOKUP(AD7,Inscriptions!$I$3:$J$12,2,FALSE)","v":0},{"$f":"VLOOKUP(AE7,Inscriptions!$I$3:$J$12,2,FALSE)","v":0},null,null,{"$f":"Tirage!$L13","v":4},{"$f":"Tirage!$M13","v":5},{"$f":"AK5","v":2},{"$f":"VLOOKUP(AK7,Inscriptions!$I$3:$J$12,2,FALSE)","v":0},{"$f":"VLOOKUP(AL7,Inscriptions!$I$3:$J$12,2,FALSE)","v":0},null,null,{"$f":"Tirage!$N13","v":5},{"$f":"Tirage!$O13","v":2},{"$f":"AR5","v":4},{"$f":"VLOOKUP(AR7,Inscriptions!$I$3:$J$12,2,FALSE)","v":0},{"$f":"VLOOKUP(AS7,Inscriptions!$I$3:$J$12,2,FALSE)","v":0},null,null,{"$f":"Tirage!$P13","v":10},{"$f":"Tirage!$Q13","v":1},{"$f":"AY5","v":7},{"$f":"VLOOKUP(AY7,Inscriptions!$I$3:$J$12,2,FALSE)","v":0},{"$f":"VLOOKUP(AZ7,Inscriptions!$I$3:$J$12,2,FALSE)","v":0},null,null,{"$f":"Tirage!$R13","v":3},{"$f":"Tirage!$S13","v":2},{"$f":"BG3","v":8},{"$f":"VLOOKUP(BF7,Inscriptions!$I$3:$J$12,2,FALSE)","v":0},{"$f":"VLOOKUP(BG7,Inscriptions!$I$3:$J$12,2,FALSE)","v":0}]
[null,null,null,null,null,null,"Mettre ab pour abandon",null,null,null,null,null,null,"Mettre ab pour abandon",null,null,null,null,null,null,"Mettre ab pour abandon",null,null,null,null,null,null,"Mettre ab pour abandon",null,null,null,null,null,null,"Mettre ab pour abandon",null,null,null,null,null,null,"Mettre ab pour abandon",null,null,null,null,null,null,"Mettre ab pour abandon",null,null,null,null,null,null,"Mettre ab pour abandon",null,null,null,null,null,null,"Mettre ab pour abandon"]
[null,null,null,null,null,null,null,null,null,null,null,null,"JOURNEE 3",null,null,null,null,null,null,null,null,null,null,null,null,null,null,null,null,null,null,null,null,null,null,null,null,null,null,null,null,"Mettre ex pour exempt",null,null,null,null,null,null,"Mettre ex pour exempt"]
[]
[null,null,null,null,"TOUR 1",null,null,null,null,null,null,"TOUR 2",null,null,null,null,null,null,"TOUR 3",null,null,null,null,null,null,"TOUR 4",null,null,null,null,null,null,"TOUR 5",null,null,null,null,null,null,"TOUR 6",null,null,null,null,null,null,"TOUR 7",null,null,null,null,null,null,"TOUR 8",null,null,null,null,null,null,"TOUR 9"]
[]
[null,null,null,null,"Equipes","Score pour","Score contre","Pts ",null,null,null,"Equipes","Score pour","Score contre","Pts ",null,null,null,"Equipes","Score pour","Score contre","Pts ",null,null,null,"Equipes","Score pour","Score contre","Pts ",null,null,null,"Equipes","Score pour","Score contre","Pts ",null,null,null,"Equipes","Score pour","Score contre","Pts ",null,null,null,"Equipes","Score pour","Score contre","Pts ",null,null,null,"Equipes","Score pour","Score contre","Pts ",null,null,null,"Equipes","Score pour","Score contre","Pts "]
[null,{"$f":"Tirage!$B9","v":7},null,null,{"$f":"VLOOKUP(B14,Inscriptions!$I$3:$J$12,2,FALSE)","v":0},{"$f":"IFERROR(VLOOKUP(E14,$E$3:$G$7,3,0),\"\")&IFERROR(VLOOKUP(E14,$F$3:$H$7,3,0),\"\")","v":""},{"$f":"IFERROR(VLOOKUP(E14,$E$3:$H$7,4,0),\"\")&IFERROR(VLOOKUP(E14,$F$3:$H$7,2,0),\"\")","v":""},{"$f":"IF(E14=0,0,IF(COUNTBLANK(F14:G14),\"\",VLOOKUP(F14&G14,CHOOSE({1,2},tPts324[Score 1]&tPts324[Score 2],tPts324[Pts]),2,0)))","v":0},{"$f":"I3","v":3},null,null,{"$f":"VLOOKUP(I14,Inscriptions!$I$3:$J$12,2,FALSE)","v":0},{"$f":"IFERROR(VLOOKUP(L14,$L$3:$N$7,3,0),\"\")&IFERROR(VLOOKUP(L14,$M$3:$O$7,3,0),\"\")","v":""},{"$f":"IFERROR(VLOOKUP(L14,$L$3:$O$7,4,0),\"\")&IFERROR(VLOOKUP(L14,$M$3:$O$7,2,0),\"\")","v":""},{"$f":"IF(L14=0,0,IF(COUNTBLANK(M14:N14),\"\",VLOOKUP(M14&N14,CHOOSE({1,2},tPts324[Score 1]&tPts324[Score 2],tPts324[Pts]),2,0)))","v":0},{"$f":"Tirage!$F9","v":10},null,null,{"$f":"VLOOKUP(P14,Inscriptions!$I$3:$J$12,2,FALSE)","v":0},{"$f":"IFERROR(VLOOKUP(S14,$S$3:$U$7,3,0),\"\")&IFERROR(VLOOKUP(S14,$T$3:$V$7,3,0),\"\")","v":""},{"$f":"IFERROR(VLOOKUP(S14,$S$3:$V$7,4,0),\"\")&IFERROR(VLOOKUP(S14,$T$3:$V$7,2,0),\"\")","v":""},{"$f":"IF(COUNTBLANK(T14:U14),\"\",VLOOKUP(T14&U14,CHOOSE({1,2},tPts324[Score 1]&tPts324[Score 2],tPts324[Pts]),2,0))","v":""},{"$f":"W3","v":6},null,null,{"$f":"VLOOKUP(W14,Inscriptions!$I$3:$J$12,2,FALSE)","v":0},{"$f":"IFERROR(VLOOKUP(Z14,$Z$3:$AB$7,3,0),\"\")&IFERROR(VLOOKUP(Z14,$AA$3:$AC$7,3,0),\"\")","v":""},{"$f":"IFERROR(VLOOKUP(Z14,$Z$3:$AC$7,4,0),\"\")&IFERROR(VLOOKUP(Z14,$AA$3:$AC$7,2,0),\"\")","v":""},{"$f":"IF(COUNTBLANK(AA14:AB14),\"\",VLOOKUP(AA14&AB14,CHOOSE({1,2},tPts324[Score 1]&tPts324[Score 2],tPts324[Pts]),2,0))","v":""},{"$f":"Tirage!$J9","v":1},null,null,{"$f":"VLOOKUP(AD14,Inscriptions!$I$3:$J$12,2,FALSE)","v":0},{"$f":"IFERROR(VLOOKUP(AG14,$AG$3:$AI$7,3,0),\"\")&IFERROR(VLOOKUP(AG14,$AH$3:$AJ$7,3,0),\"\")","v":""},{"$f":"IFERROR(VLOOKUP(AG14,$AG$3:$AJ$7,4,0),\"\")&IFERROR(VLOOKUP(AG14,$AH$3:$AJ$7,2,0),\"\")","v":""},{"$f":"IF(COUNTBLANK(AH14:AI14),\"\",VLOOKUP(AH14&AI14,CHOOSE({1,2},tPts324[Score 1]&tPts324[Score 2],tPts324[Pts]),2,0))","v":""},{"$f":"Tirage!$L9","v":9},null,null,{"$f":"VLOOKUP(AK14,Inscriptions!$I$3:$J$12,2,FALSE)","v":0},{"$f":"IFERROR(VLOOKUP(AN14,$AN$3:$AP$7,3,0),\"\")&IFERROR(VLOOKUP(AN14,$AO$3:$AQ$7,3,0),\"\")","v":""},{"$f":"IFERROR(VLOOKUP(AN14,$AN$3:$AQ$7,4,0),\"\")&IFERROR(VLOOKUP(AN14,$AO$3:$AQ$7,2,0),\"\")","v":""},{"$f":"IF(COUNTBLANK(AO14:AP14),\"\",VLOOKUP(AO14&AP14,CHOOSE({1,2},tPts324[Score 1]&tPts324[Score 2],tPts324[Pts]),2,0))","v":""},{"$f":"Tirage!$N9","v":3},null,null,{"$f":"VLOOKUP(AR14,Inscriptions!$I$3:$J$12,2,FALSE)","v":0},{"$f":"IFERROR(VLOOKUP(AU14,AU$3:AW$7,3,0),\"\")&IFERROR(VLOOKUP(AU14,AV$3:AX$7,3,0),\"\")","v":""},{"$f":"IFERROR(VLOOKUP(AU14,AU$3:AX$7,4,0),\"\")&IFERROR(VLOOKUP(AU14,AV$3:AX$7,2,0),\"\")","v":""},{"$f":"IF(COUNTBLANK(AV14:AW14),\"\",VLOOKUP(AV14&AW14,CHOOSE({1,2},tPts324[Score 1]&tPts324[Score 2],tPts324[Pts]),2,0))","v":""},{"$f":"Tirage!$P9","v":2},null,null,{"$f":"VLOOKUP(AY14,Inscriptions!$I$3:$J$12,2,FALSE)","v":0},{"$f":"IFERROR(VLOOKUP(BB14,$BB$3:BD$7,3,0),\"\")&IFERROR(VLOOKUP(BB14,$BC$3:$BE$7,3,0),\"\")","v":""},{"$f":"IFERROR(VLOOKUP(BB14,$BB$3:$BE$7,4,0),\"\")&IFERROR(VLOOKUP(BB14,$BC$3:$BE$7,2,0),\"\")","v":""},{"$f":"IF(COUNTBLANK(BC14:BD14),\"\",VLOOKUP(BC14&BD14,CHOOSE({1,2},tPts324[Score 1]&tPts324[Score 2],tPts324[Pts]),2,0))","v":""},{"$f":"Tirage!$R9","v":6},null,null,{"$f":"VLOOKUP(BF14,Inscriptions!$I$3:$J$12,2,FALSE)","v":0},{"$f":"IFERROR(VLOOKUP(BI14,$BI$3:BK$7,3,0),\"\")&IFERROR(VLOOKUP(BI14,$BJ$3:$BL$7,3,0),\"\")","v":""},{"$f":"IFERROR(VLOOKUP(BI14,$BI$3:$BL$7,4,0),\"\")&IFERROR(VLOOKUP(BI14,$BJ$3:$BL$7,2,0),\"\")","v":""},{"$f":"IF(COUNTBLANK(BJ14:BK14),\"\",VLOOKUP(BJ14&BK14,CHOOSE({1,2},tPts324[Score 1]&tPts324[Score 2],tPts324[Pts]),2,0))","v":""}]
[null,{"$f":"Tirage!$B10","v":3},null,null,{"$f":"VLOOKUP(B15,Inscriptions!$I$3:$J$12,2,FALSE)","v":0},{"$f":"IFERROR(VLOOKUP(E15,$E$3:$G$7,3,0),\"\")&IFERROR(VLOOKUP(E15,$F$3:$H$7,3,0),\"\")","v":""},{"$f":"IFERROR(VLOOKUP(E15,$E$3:$H$7,4,0),\"\")&IFERROR(VLOOKUP(E15,$F$3:H$7,2,0),\"\")","v":""},{"$f":"IF(E15=0,0,IF(COUNTBLANK(F15:G15),\"\",VLOOKUP(F15&G15,CHOOSE({1,2},tPts324[Score 1]&tPts324[Score 2],tPts324[Pts]),2,0)))","v":0},{"$f":"I4","v":2},null,null,{"$f":"VLOOKUP(I15,Inscriptions!$I$3:$J$12,2,FALSE)","v":0},{"$f":"IFERROR(VLOOKUP(L15,$L$3:$N$7,3,0),\"\")&IFERROR(VLOOKUP(L15,$M$3:$O$7,3,0),\"\")","v":""},{"$f":"IFERROR(VLOOKUP(L15,$L$3:$O$7,4,0),\"\")&IFERROR(VLOOKUP(L15,$M$3:$O$7,2,0),\"\")","v":""},{"$f":"IF(L15=0,0,IF(COUNTBLANK(M15:N15),\"\",VLOOKUP(M15&N15,CHOOSE({1,2},tPts324[Score 1]&tPts324[Score 2],tPts324[Pts]),2,0)))","v":0},{"$f":"Tirage!$F10","v":4},null,null,{"$f":"VLOOKUP(P15,Inscriptions!$I$3:$J$12,2,FALSE)","v":0},{"$f":"IFERROR(VLOOKUP(S15,$S$3:$U$7,3,0),\"\")&IFERROR(VLOOKUP(S15,$T$3:$V$7,3,0),\"\")","v":""},{"$f":"IFERROR(VLOOKUP(S15,$S$3:$V$7,4,0),\"\")&IFERROR(VLOOKUP(S15,$T$3:$V$7,2,0),\"\")","v":""},{"$f":"IF(COUNTBLANK(T15:U15),\"\",VLOOKUP(T15&U15,CHOOSE({1,2},tPts324[Score 1]&tPts324[Score 2],tPts324[Pts]),2,0))","v":""},{"$f":"W4","v":5},null,null,{"$f":"VLOOKUP(W15,Inscriptions!$I$3:$J$12,2,FALSE)","v":0},{"$f":"IFERROR(VLOOKUP(Z15,$Z$3:$AB$7,3,0),\"\")&IFERROR(VLOOKUP(Z15,$AA$3:$AC$7,3,0),\"\")","v":""},{"$f":"IFERROR(VLOOKUP(Z15,$Z$3:$AC$7,4,0),\"\")&IFERROR(VLOOKUP(Z15,$AA$3:$AC$7,2,0),\"\")","v":""},{"$f":"IF(COUNTBLANK(AA15:AB15),\"\",VLOOKUP(AA15&AB15,CHOOSE({1,2},tPts324[Score 1]&tPts324[Score 2],tPts324[Pts]),2,0))","v":""},{"$f":"Tirage!$J10","v":7},null,null,{"$f":"VLOOKUP(AD15,Inscriptions!$I$3:$J$12,2,FALSE)","v":0},{"$f":"IFERROR(VLOOKUP(AG15,$AG$3:$AI$7,3,0),\"\")&IFERROR(VLOOKUP(AG15,$AH$3:$AJ$7,3,0),\"\")","v":""},{"$f":"IFERROR(VLOOKUP(AG15,$AG$3:$AJ$7,4,0),\"\")&IFERROR(VLOOKUP(AG15,$AH$3:$AJ$7,2,0),\"\")","v":""},{"$f":"IF(COUNTBLANK(AH15:AI15),\"\",VLOOKUP(AH15&AI15,CHOOSE({1,2},tPts324[Score 1]&tPts324[Score 2],tPts324[Pts]),2,0))","v":""},{"$f":"Tirage!$L10","v":3},null,null,{"$f":"VLOOKUP(AK15,Inscriptions!$I$3:$J$12,2,FALSE)","v":0},{"$f":"IFERROR(VLOOKUP(AN15,$AN$3:$AP$7,3,0),\"\")&IFERROR(VLOOKUP(AN15,$AO$3:$AQ$7,3,0),\"\")","v":""},{"$f":"IFERROR(VLOOKUP(AN15,$AN$3:$AQ$7,4,0),\"\")&IFERROR(VLOOKUP(AN15,$AO$3:$AQ$7,2,0),\"\")","v":""},{"$f":"IF(COUNTBLANK(AO15:AP15),\"\",VLOOKUP(AO15&AP15,CHOOSE({1,2},tPts324[Score 1]&tPts324[Score 2],tPts324[Pts]),2,0))","v":""},{"$f":"Tirage!$N10","v":8},null,null,{"$f":"VLOOKUP(AR15,Inscriptions!$I$3:$J$12,2,FALSE)","v":0},{"$f":"IFERROR(VLOOKUP(AU15,AU$3:AW$7,3,0),\"\")&IFERROR(VLOOKUP(AU15,AV$3:AX$7,3,0),\"\")","v":""},{"$f":"IFERROR(VLOOKUP(AU15,AU$3:AX$7,4,0),\"\")&IFERROR(VLOOKUP(AU15,AV$3:AX$7,2,0),\"\")","v":""},{"$f":"IF(COUNTBLANK(AV15:AW15),\"\",VLOOKUP(AV15&AW15,CHOOSE({1,2},tPts324[Score 1]&tPts324[Score 2],tPts324[Pts]),2,0))","v":""},{"$f":"Tirage!$P10","v":8},null,null,{"$f":"VLOOKUP(AY15,Inscriptions!$I$3:$J$12,2,FALSE)","v":0},{"$f":"IFERROR(VLOOKUP(BB15,$BB$3:BD$7,3,0),\"\")&IFERROR(VLOOKUP(BB15,$BC$3:$BE$7,3,0),\"\")","v":""},{"$f":"IFERROR(VLOOKUP(BB15,$BB$3:$BE$7,4,0),\"\")&IFERROR(VLOOKUP(BB15,$BC$3:$BE$7,2,0),\"\")","v":""},{"$f":"IF(COUNTBLANK(BC15:BD15),\"\",VLOOKUP(BC15&BD15,CHOOSE({1,2},tPts324[Score 1]&tPts324[Score 2],tPts324[Pts]),2,0))","v":""},{"$f":"Tirage!$R10","v":7},null,null,{"$f":"VLOOKUP(BF15,Inscriptions!$I$3:$J$12,2,FALSE)","v":0},{"$f":"IFERROR(VLOOKUP(BI15,$BI$3:BK$7,3,0),\"\")&IFERROR(VLOOKUP(BI15,$BJ$3:$BL$7,3,0),\"\")","v":""},{"$f":"IFERROR(VLOOKUP(BI15,$BI$3:$BL$7,4,0),\"\")&IFERROR(VLOOKUP(BI15,$BJ$3:$BL$7,2,0),\"\")","v":""},{"$f":"IF(COUNTBLANK(BJ15:BK15),\"\",VLOOKUP(BJ15&BK15,CHOOSE({1,2},tPts324[Score 1]&tPts324[Score 2],tPts324[Pts]),2,0))","v":""}]
[null,{"$f":"Tirage!$B11","v":6},null,null,{"$f":"VLOOKUP(B16,Inscriptions!$I$3:$J$12,2,FALSE)","v":0},"",{"$f":"IFERROR(VLOOKUP(E16,$E$3:$H$7,4,0),\"\")&IFERROR(VLOOKUP(E16,$F$3:H$7,2,0),\"\")","v":""},{"$f":"IF(E16=0,0,IF(COUNTBLANK(F16:G16),\"\",VLOOKUP(F16&G16,CHOOSE({1,2},tPts324[Score 1]&tPts324[Score 2],tPts324[Pts]),2,0)))","v":0},8,null,null,{"$f":"VLOOKUP(I16,Inscriptions!$I$3:$J$12,2,FALSE)","v":0},"","",{"$f":"IF(L16=0,0,IF(COUNTBLANK(M16:N16),\"\",VLOOKUP(M16&N16,CHOOSE({1,2},tPts324[Score 1]&tPts324[Score 2],tPts324[Pts]),2,0)))","v":0},{"$f":"Tirage!$F11","v":8},null,null,{"$f":"VLOOKUP(P16,Inscriptions!$I$3:$J$12,2,FALSE)","v":0},"","",{"$f":"IF(COUNTBLANK(T16:U16),\"\",VLOOKUP(T16&U16,CHOOSE({1,2},tPts324[Score 1]&tPts324[Score 2],tPts324[Pts]),2,0))","v":""},{"$f":"W5","v":4},null,null,{"$f":"VLOOKUP(W16,Inscriptions!$I$3:$J$12,2,FALSE)","v":0},"","",{"$f":"IF(COUNTBLANK(AA16:AB16),\"\",VLOOKUP(AA16&AB16,CHOOSE({1,2},tPts324[Score 1]&tPts324[Score 2],tPts324[Pts]),2,0))","v":""},{"$f":"Tirage!$J11","v":4},null,null,{"$f":"VLOOKUP(AD16,Inscriptions!$I$3:$J$12,2,FALSE)","v":0},"","",{"$f":"IF(COUNTBLANK(AH16:AI16),\"\",VLOOKUP(AH16&AI16,CHOOSE({1,2},tPts324[Score 1]&tPts324[Score 2],tPts324[Pts]),2,0))","v":""},{"$f":"Tirage!$L11","v":2},null,null,{"$f":"VLOOKUP(AK16,Inscriptions!$I$3:$J$12,2,FALSE)","v":0},"","",{"$f":"IF(COUNTBLANK(AO16:AP16),\"\",VLOOKUP(AO16&AP16,CHOOSE({1,2},tPts324[Score 1]&tPts324[Score 2],tPts324[Pts]),2,0))","v":""},{"$f":"Tirage!$N11","v":4},null,null,{"$f":"VLOOKUP(AR16,Inscriptions!$I$3:$J$12,2,FALSE)","v":0},"","",{"$f":"IF(COUNTBLANK(AV16:AW16),\"\",VLOOKUP(AV16&AW16,CHOOSE({1,2},tPts324[Score 1]&tPts324[Score 2],tPts324[Pts]),2,0))","v":""},{"$f":"Tirage!$P11","v":7},null,null,{"$f":"VLOOKUP(AY16,Inscriptions!$I$3:$J$12,2,FALSE)","v":0},{"$f":"IFERROR(VLOOKUP(BB16,$BB$3:BD$7,3,0),\"\")&IFERROR(VLOOKUP(BB16,$BC$3:$BE$7,3,0),\"\")","v":""},"",{"$f":"IF(COUNTBLANK(BC16:BD16),\"\",VLOOKUP(BC16&BD16,CHOOSE({1,2},tPts324[Score 1]&tPts324[Score 2],tPts324[Pts]),2,0))","v":""},{"$f":"Tirage!$R11","v":4},null,null,{"$f":"VLOOKUP(BF16,Inscriptions!$I$3:$J$12,2,FALSE)","v":0},{"$f":"IFERROR(VLOOKUP(BI16,$BI$3:BK$7,3,0),\"\")&IFERROR(VLOOKUP(BI16,$BJ$3:$BL$7,3,0),\"\")","v":""},"",{"$f":"IF(COUNTBLANK(BJ16:BK16),\"\",VLOOKUP(BJ16&BK16,CHOOSE({1,2},tPts324[Score 1]&tPts324[Score 2],tPts324[Pts]),2,0))","v":""}]
[null,{"$f":"Tirage!$B12","v":9},null,null,{"$f":"VLOOKUP(B17,Inscriptions!$I$3:$J$12,2,FALSE)","v":0},"",{"$f":"IFERROR(VLOOKUP(E17,$E$3:$H$7,4,0),\"\")&IFERROR(VLOOKUP(E17,$F$3:H$7,2,0),\"\")","v":""},{"$f":"IF(E17=0,0,IF(COUNTBLANK(F17:G17),\"\",VLOOKUP(F17&G17,CHOOSE({1,2},tPts324[Score 1]&tPts324[Score 2],tPts324[Pts]),2,0)))","v":0},5,null,null,{"$f":"VLOOKUP(I17,Inscriptions!$I$3:$J$12,2,FALSE)","v":0},"","",{"$f":"IF(L17=0,0,IF(COUNTBLANK(M17:N17),\"\",VLOOKUP(M17&N17,CHOOSE({1,2},tPts324[Score 1]&tPts324[Score 2],tPts324[Pts]),2,0)))","v":0},{"$f":"Tirage!$F12","v":1},null,null,{"$f":"VLOOKUP(P17,Inscriptions!$I$3:$J$12,2,FALSE)","v":0},"","",{"$f":"IF(COUNTBLANK(T17:U17),\"\",VLOOKUP(T17&U17,CHOOSE({1,2},tPts324[Score 1]&tPts324[Score 2],tPts324[Pts]),2,0))","v":""},{"$f":"W6","v":8},null,null,{"$f":"VLOOKUP(W17,Inscriptions!$I$3:$J$12,2,FALSE)","v":0},"","",{"$f":"IF(COUNTBLANK(AA17:AB17),\"\",VLOOKUP(AA17&AB17,CHOOSE({1,2},tPts324[Score 1]&tPts324[Score 2],tPts324[Pts]),2,0))","v":""},{"$f":"Tirage!$J12","v":3},null,null,{"$f":"VLOOKUP(AD17,Inscriptions!$I$3:$J$12,2,FALSE)","v":0},"","",{"$f":"IF(COUNTBLANK(AH17:AI17),\"\",VLOOKUP(AH17&AI17,CHOOSE({1,2},tPts324[Score 1]&tPts324[Score 2],tPts324[Pts]),2,0))","v":""},{"$f":"Tirage!$L12","v":10},null,null,{"$f":"VLOOKUP(AK17,Inscriptions!$I$3:$J$12,2,FALSE)","v":0},"","",{"$f":"IF(COUNTBLANK(AO17:AP17),\"\",VLOOKUP(AO17&AP17,CHOOSE({1,2},tPts324[Score 1]&tPts324[Score 2],tPts324[Pts]),2,0))","v":""},{"$f":"Tirage!$N12","v":7},null,null,{"$f":"VLOOKUP(AR17,Inscriptions!$I$3:$J$12,2,FALSE)","v":0},"","",{"$f":"IF(COUNTBLANK(AV17:AW17),\"\",VLOOKUP(AV17&AW17,CHOOSE({1,2},tPts324[Score 1]&tPts324[Score 2],tPts324[Pts]),2,0))","v":""},{"$f":"Tirage!$P12","v":4},null,null,{"$f":"VLOOKUP(AY17,Inscriptions!$I$3:$J$12,2,FALSE)","v":0},{"$f":"IFERROR(VLOOKUP(BB17,$BB$3:BD$7,3,0),\"\")&IFERROR(VLOOKUP(BB17,$BC$3:$BE$7,3,0),\"\")","v":""},"",{"$f":"IF(COUNTBLANK(BC17:BD17),\"\",VLOOKUP(BC17&BD17,CHOOSE({1,2},tPts324[Score 1]&tPts324[Score 2],tPts324[Pts]),2,0))","v":""},{"$f":"Tirage!$R12","v":10},null,null,{"$f":"VLOOKUP(BF17,Inscriptions!$I$3:$J$12,2,FALSE)","v":0},{"$f":"IFERROR(VLOOKUP(BI17,$BI$3:BK$7,3,0),\"\")&IFERROR(VLOOKUP(BI17,$BJ$3:$BL$7,3,0),\"\")","v":""},"",{"$f":"IF(COUNTBLANK(BJ17:BK17),\"\",VLOOKUP(BJ17&BK17,CHOOSE({1,2},tPts324[Score 1]&tPts324[Score 2],tPts324[Pts]),2,0))","v":""}]
[null,{"$f":"Tirage!$B13","v":8},null,null,{"$f":"VLOOKUP(B18,Inscriptions!$I$3:$J$12,2,FALSE)","v":0},"",{"$f":"IFERROR(VLOOKUP(E18,$E$3:$H$7,4,0),\"\")&IFERROR(VLOOKUP(E18,$F$3:H$7,2,0),\"\")","v":""},{"$f":"IF(E18=0,0,IF(COUNTBLANK(F18:G18),\"\",VLOOKUP(F18&G18,CHOOSE({1,2},tPts324[Score 1]&tPts324[Score 2],tPts324[Pts]),2,0)))","v":0},4,null,null,{"$f":"VLOOKUP(I18,Inscriptions!$I$3:$J$12,2,FALSE)","v":0},"","",{"$f":"IF(L18=0,0,IF(COUNTBLANK(M18:N18),\"\",VLOOKUP(M18&N18,CHOOSE({1,2},tPts324[Score 1]&tPts324[Score 2],tPts324[Pts]),2,0)))","v":0},{"$f":"Tirage!$F13","v":3},null,null,{"$f":"VLOOKUP(P18,Inscriptions!$I$3:$J$12,2,FALSE)","v":0},"","",{"$f":"IF(COUNTBLANK(T18:U18),\"\",VLOOKUP(T18&U18,CHOOSE({1,2},tPts324[Score 1]&tPts324[Score 2],tPts324[Pts]),2,0))","v":""},{"$f":"W7","v":1},null,null,{"$f":"VLOOKUP(W18,Inscriptions!$I$3:$J$12,2,FALSE)","v":0},"","",{"$f":"IF(COUNTBLANK(AA18:AB18),\"\",VLOOKUP(AA18&AB18,CHOOSE({1,2},tPts324[Score 1]&tPts324[Score 2],tPts324[Pts]),2,0))","v":""},{"$f":"Tirage!$J13","v":10},null,null,{"$f":"VLOOKUP(AD18,Inscriptions!$I$3:$J$12,2,FALSE)","v":0},"","",{"$f":"IF(COUNTBLANK(AH18:AI18),\"\",VLOOKUP(AH18&AI18,CHOOSE({1,2},tPts324[Score 1]&tPts324[Score 2],tPts324[Pts]),2,0))","v":""},{"$f":"Tirage!$L13","v":4},null,null,{"$f":"VLOOKUP(AK18,Inscriptions!$I$3:$J$12,2,FALSE)","v":0},"","",{"$f":"IF(COUNTBLANK(AO18:AP18),\"\",VLOOKUP(AO18&AP18,CHOOSE({1,2},tPts324[Score 1]&tPts324[Score 2],tPts324[Pts]),2,0))","v":""},{"$f":"Tirage!$N13","v":5},null,null,{"$f":"VLOOKUP(AR18,Inscriptions!$I$3:$J$12,2,FALSE)","v":0},"","",{"$f":"IF(COUNTBLANK(AV18:AW18),\"\",VLOOKUP(AV18&AW18,CHOOSE({1,2},tPts324[Score 1]&tPts324[Score 2],tPts324[Pts]),2,0))","v":""},{"$f":"Tirage!$P13","v":10},null,null,{"$f":"VLOOKUP(AY18,Inscriptions!$I$3:$J$12,2,FALSE)","v":0},{"$f":"IFERROR(VLOOKUP(BB18,$BB$3:BD$7,3,0),\"\")&IFERROR(VLOOKUP(BB18,$BC$3:$BE$7,3,0),\"\")","v":""},"",{"$f":"IF(COUNTBLANK(BC18:BD18),\"\",VLOOKUP(BC18&BD18,CHOOSE({1,2},tPts324[Score 1]&tPts324[Score 2],tPts324[Pts]),2,0))","v":""},{"$f":"Tirage!$R13","v":3},null,null,{"$f":"VLOOKUP(BF18,Inscriptions!$I$3:$J$12,2,FALSE)","v":0},{"$f":"IFERROR(VLOOKUP(BI18,$BI$3:BK$7,3,0),\"\")&IFERROR(VLOOKUP(BI18,$BJ$3:$BL$7,3,0),\"\")","v":""},"",{"$f":"IF(COUNTBLANK(BJ18:BK18),\"\",VLOOKUP(BJ18&BK18,CHOOSE({1,2},tPts324[Score 1]&tPts324[Score 2],tPts324[Pts]),2,0))","v":""}]
[null,{"$f":"Tirage!$C9","v":10},null,null,{"$f":"VLOOKUP(B19,Inscriptions!$I$3:$J$12,2,FALSE)","v":0},"",{"$f":"IFERROR(VLOOKUP(E19,$E$3:$H$7,4,0),\"\")&IFERROR(VLOOKUP(E19,$F$3:H$7,2,0),\"\")","v":""},{"$f":"IF(E19=0,0,IF(COUNTBLANK(F19:G19),\"\",VLOOKUP(F19&G19,CHOOSE({1,2},tPts324[Score 1]&tPts324[Score 2],tPts324[Pts]),2,0)))","v":0},{"$f":"J3","v":9},null,null,{"$f":"VLOOKUP(I19,Inscriptions!$I$3:$J$12,2,FALSE)","v":0},"","",{"$f":"IF(L19=0,0,IF(COUNTBLANK(M19:N19),\"\",VLOOKUP(M19&N19,CHOOSE({1,2},tPts324[Score 1]&tPts324[Score 2],tPts324[Pts]),2,0)))","v":0},{"$f":"Tirage!$G9","v":2},null,null,{"$f":"VLOOKUP(P19,Inscriptions!$I$3:$J$12,2,FALSE)","v":0},"","",{"$f":"IF(COUNTBLANK(T19:U19),\"\",VLOOKUP(T19&U19,CHOOSE({1,2},tPts324[Score 1]&tPts324[Score 2],tPts324[Pts]),2,0))","v":""},{"$f":"X3","v":10},null,null,{"$f":"VLOOKUP(W19,Inscriptions!$I$3:$J$12,2,FALSE)","v":0},"","",{"$f":"IF(COUNTBLANK(AA19:AB19),\"\",VLOOKUP(AA19&AB19,CHOOSE({1,2},tPts324[Score 1]&tPts324[Score 2],tPts324[Pts]),2,0))","v":""},{"$f":"Tirage!$K9","v":6},null,null,{"$f":"VLOOKUP(AD19,Inscriptions!$I$3:$J$12,2,FALSE)","v":0},"","",{"$f":"IF(COUNTBLANK(AH19:AI19),\"\",VLOOKUP(AH19&AI19,CHOOSE({1,2},tPts324[Score 1]&tPts324[Score 2],tPts324[Pts]),2,0))","v":""},{"$f":"Tirage!$M9","v":6},null,null,{"$f":"VLOOKUP(AK19,Inscriptions!$I$3:$J$12,2,FALSE)","v":0},"","",{"$f":"IF(COUNTBLANK(AO19:AP19),\"\",VLOOKUP(AO19&AP19,CHOOSE({1,2},tPts324[Score 1]&tPts324[Score 2],tPts324[Pts]),2,0))","v":""},{"$f":"Tirage!$O9","v":10},null,null,{"$f":"VLOOKUP(AR19,Inscriptions!$I$3:$J$12,2,FALSE)","v":0},"","",{"$f":"IF(COUNTBLANK(AV19:AW19),\"\",VLOOKUP(AV19&AW19,CHOOSE({1,2},tPts324[Score 1]&tPts324[Score 2],tPts324[Pts]),2,0))","v":""},{"$f":"Tirage!$Q9","v":9},null,null,{"$f":"VLOOKUP(AY19,Inscriptions!$I$3:$J$12,2,FALSE)","v":0},{"$f":"IFERROR(VLOOKUP(BB19,$BB$3:BD$7,3,0),\"\")&IFERROR(VLOOKUP(BB19,$BC$3:$BE$7,3,0),\"\")","v":""},"",{"$f":"IF(COUNTBLANK(BC19:BD19),\"\",VLOOKUP(BC19&BD19,CHOOSE({1,2},tPts324[Score 1]&tPts324[Score 2],tPts324[Pts]),2,0))","v":""},{"$f":"Tirage!$S9","v":8},null,null,{"$f":"VLOOKUP(BF19,Inscriptions!$I$3:$J$12,2,FALSE)","v":0},{"$f":"IFERROR(VLOOKUP(BI19,$BI$3:BK$7,3,0),\"\")&IFERROR(VLOOKUP(BI19,$BJ$3:$BL$7,3,0),\"\")","v":""},"",{"$f":"IF(COUNTBLANK(BJ19:BK19),\"\",VLOOKUP(BJ19&BK19,CHOOSE({1,2},tPts324[Score 1]&tPts324[Score 2],tPts324[Pts]),2,0))","v":""}]
[null,{"$f":"Tirage!$C10","v":5},null,null,{"$f":"VLOOKUP(B20,Inscriptions!$I$3:$J$12,2,FALSE)","v":0},"",{"$f":"IFERROR(VLOOKUP(E20,$E$3:$H$7,4,0),\"\")&IFERROR(VLOOKUP(E20,$F$3:H$7,2,0),\"\")","v":""},{"$f":"IF(E20=0,0,IF(COUNTBLANK(F20:G20),\"\",VLOOKUP(F20&G20,CHOOSE({1,2},tPts324[Score 1]&tPts324[Score 2],tPts324[Pts]),2,0)))","v":0},{"$f":"J4","v":1},null,null,{"$f":"VLOOKUP(I20,Inscriptions!$I$3:$J$12,2,FALSE)","v":0},"","",{"$f":"IF(L20=0,0,IF(COUNTBLANK(M20:N20),\"\",VLOOKUP(M20&N20,CHOOSE({1,2},tPts324[Score 1]&tPts324[Score 2],tPts324[Pts]),2,0)))","v":0},{"$f":"Tirage!$G10","v":7},null,null,{"$f":"VLOOKUP(P20,Inscriptions!$I$3:$J$12,2,FALSE)","v":0},"","",{"$f":"IF(COUNTBLANK(T20:U20),\"\",VLOOKUP(T20&U20,CHOOSE({1,2},tPts324[Score 1]&tPts324[Score 2],tPts324[Pts]),2,0))","v":""},{"$f":"X4","v":9},null,null,{"$f":"VLOOKUP(W20,Inscriptions!$I$3:$J$12,2,FALSE)","v":0},"","",{"$f":"IF(COUNTBLANK(AA20:AB20),\"\",VLOOKUP(AA20&AB20,CHOOSE({1,2},tPts324[Score 1]&tPts324[Score 2],tPts324[Pts]),2,0))","v":""},{"$f":"Tirage!$K10","v":5},null,null,{"$f":"VLOOKUP(AD20,Inscriptions!$I$3:$J$12,2,FALSE)","v":0},"","",{"$f":"IF(COUNTBLANK(AH20:AI20),\"\",VLOOKUP(AH20&AI20,CHOOSE({1,2},tPts324[Score 1]&tPts324[Score 2],tPts324[Pts]),2,0))","v":""},{"$f":"Tirage!$M10","v":1},null,null,{"$f":"VLOOKUP(AK20,Inscriptions!$I$3:$J$12,2,FALSE)","v":0},"","",{"$f":"IF(COUNTBLANK(AO20:AP20),\"\",VLOOKUP(AO20&AP20,CHOOSE({1,2},tPts324[Score 1]&tPts324[Score 2],tPts324[Pts]),2,0))","v":""},{"$f":"Tirage!$O10","v":1},null,null,{"$f":"VLOOKUP(AR20,Inscriptions!$I$3:$J$12,2,FALSE)","v":0},"","",{"$f":"IF(COUNTBLANK(AV20:AW20),\"\",VLOOKUP(AV20&AW20,CHOOSE({1,2},tPts324[Score 1]&tPts324[Score 2],tPts324[Pts]),2,0))","v":""},{"$f":"Tirage!$Q10","v":5},null,null,{"$f":"VLOOKUP(AY20,Inscriptions!$I$3:$J$12,2,FALSE)","v":0},{"$f":"IFERROR(VLOOKUP(BB20,$BB$3:BD$7,3,0),\"\")&IFERROR(VLOOKUP(BB20,$BC$3:$BE$7,3,0),\"\")","v":""},"",{"$f":"IF(COUNTBLANK(BC20:BD20),\"\",VLOOKUP(BC20&BD20,CHOOSE({1,2},tPts324[Score 1]&tPts324[Score 2],tPts324[Pts]),2,0))","v":""},{"$f":"Tirage!$S10","v":9},null,null,{"$f":"VLOOKUP(BF20,Inscriptions!$I$3:$J$12,2,FALSE)","v":0},{"$f":"IFERROR(VLOOKUP(BI20,$BI$3:BK$7,3,0),\"\")&IFERROR(VLOOKUP(BI20,$BJ$3:$BL$7,3,0),\"\")","v":""},"",{"$f":"IF(COUNTBLANK(BJ20:BK20),\"\",VLOOKUP(BJ20&BK20,CHOOSE({1,2},tPts324[Score 1]&tPts324[Score 2],tPts324[Pts]),2,0))","v":""}]
[null,{"$f":"Tirage!$C11","v":2},null,null,{"$f":"VLOOKUP(B21,Inscriptions!$I$3:$J$12,2,FALSE)","v":0},"",{"$f":"IFERROR(VLOOKUP(E21,$E$3:$H$7,4,0),\"\")&IFERROR(VLOOKUP(E21,$F$3:H$7,2,0),\"\")","v":""},{"$f":"IF(E21=0,0,IF(COUNTBLANK(F21:G21),\"\",VLOOKUP(F21&G21,CHOOSE({1,2},tPts324[Score 1]&tPts324[Score 2],tPts324[Pts]),2,0)))","v":0},7,null,null,{"$f":"VLOOKUP(I21,Inscriptions!$I$3:$J$12,2,FALSE)","v":0},"","",{"$f":"IF(L21=0,0,IF(COUNTBLANK(M21:N21),\"\",VLOOKUP(M21&N21,CHOOSE({1,2},tPts324[Score 1]&tPts324[Score 2],tPts324[Pts]),2,0)))","v":0},{"$f":"Tirage!$G11","v":9},null,null,{"$f":"VLOOKUP(P21,Inscriptions!$I$3:$J$12,2,FALSE)","v":0},"","",{"$f":"IF(COUNTBLANK(T21:U21),\"\",VLOOKUP(T21&U21,CHOOSE({1,2},tPts324[Score 1]&tPts324[Score 2],tPts324[Pts]),2,0))","v":""},{"$f":"X5","v":3},null,null,{"$f":"VLOOKUP(W21,Inscriptions!$I$3:$J$12,2,FALSE)","v":0},"","",{"$f":"IF(COUNTBLANK(AA21:AB21),\"\",VLOOKUP(AA21&AB21,CHOOSE({1,2},tPts324[Score 1]&tPts324[Score 2],tPts324[Pts]),2,0))","v":""},{"$f":"Tirage!$K11","v":2},null,null,{"$f":"VLOOKUP(AD21,Inscriptions!$I$3:$J$12,2,FALSE)","v":0},"","",{"$f":"IF(COUNTBLANK(AH21:AI21),\"\",VLOOKUP(AH21&AI21,CHOOSE({1,2},tPts324[Score 1]&tPts324[Score 2],tPts324[Pts]),2,0))","v":""},{"$f":"Tirage!$M11","v":7},null,null,{"$f":"VLOOKUP(AK21,Inscriptions!$I$3:$J$12,2,FALSE)","v":0},"","",{"$f":"IF(COUNTBLANK(AO21:AP21),\"\",VLOOKUP(AO21&AP21,CHOOSE({1,2},tPts324[Score 1]&tPts324[Score 2],tPts324[Pts]),2,0))","v":""},{"$f":"Tirage!$O11","v":9},null,null,{"$f":"VLOOKUP(AR21,Inscriptions!$I$3:$J$12,2,FALSE)","v":0},"","",{"$f":"IF(COUNTBLANK(AV21:AW21),\"\",VLOOKUP(AV21&AW21,CHOOSE({1,2},tPts324[Score 1]&tPts324[Score 2],tPts324[Pts]),2,0))","v":""},{"$f":"Tirage!$Q11","v":3},null,null,{"$f":"VLOOKUP(AY21,Inscriptions!$I$3:$J$12,2,FALSE)","v":0},{"$f":"IFERROR(VLOOKUP(BB21,$BB$3:BD$7,3,0),\"\")&IFERROR(VLOOKUP(BB21,$BC$3:$BE$7,3,0),\"\")","v":""},"",{"$f":"IF(COUNTBLANK(BC21:BD21),\"\",VLOOKUP(BC21&BD21,CHOOSE({1,2},tPts324[Score 1]&tPts324[Score 2],tPts324[Pts]),2,0))","v":""},{"$f":"Tirage!$S11","v":1},null,null,{"$f":"VLOOKUP(BF21,Inscriptions!$I$3:$J$12,2,FALSE)","v":0},{"$f":"IFERROR(VLOOKUP(BI21,$BI$3:BK$7,3,0),\"\")&IFERROR(VLOOKUP(BI21,$BJ$3:$BL$7,3,0),\"\")","v":""},"",{"$f":"IF(COUNTBLANK(BJ21:BK21),\"\",VLOOKUP(BJ21&BK21,CHOOSE({1,2},tPts324[Score 1]&tPts324[Score 2],tPts324[Pts]),2,0))","v":""}]
[null,{"$f":"Tirage!$C12","v":1},null,null,{"$f":"VLOOKUP(B22,Inscriptions!$I$3:$J$12,2,FALSE)","v":0},"",{"$f":"IFERROR(VLOOKUP(E22,$E$3:$H$7,4,0),\"\")&IFERROR(VLOOKUP(E22,$F$3:H$7,2,0),\"\")","v":""},{"$f":"IF(E22=0,0,IF(COUNTBLANK(F22:G22),\"\",VLOOKUP(F22&G22,CHOOSE({1,2},tPts324[Score 1]&tPts324[Score 2],tPts324[Pts]),2,0)))","v":0},6,null,null,{"$f":"VLOOKUP(I22,Inscriptions!$I$3:$J$12,2,FALSE)","v":0},"","",{"$f":"IF(L22=0,0,IF(COUNTBLANK(M22:N22),\"\",VLOOKUP(M22&N22,CHOOSE({1,2},tPts324[Score 1]&tPts324[Score 2],tPts324[Pts]),2,0)))","v":0},{"$f":"Tirage!$G12","v":5},null,null,{"$f":"VLOOKUP(P22,Inscriptions!$I$3:$J$12,2,FALSE)","v":0},"","",{"$f":"IF(COUNTBLANK(T22:U22),\"\",VLOOKUP(T22&U22,CHOOSE({1,2},tPts324[Score 1]&tPts324[Score 2],tPts324[Pts]),2,0))","v":""},{"$f":"X6","v":2},null,null,{"$f":"VLOOKUP(W22,Inscriptions!$I$3:$J$12,2,FALSE)","v":0},"","",{"$f":"IF(COUNTBLANK(AA22:AB22),\"\",VLOOKUP(AA22&AB22,CHOOSE({1,2},tPts324[Score 1]&tPts324[Score 2],tPts324[Pts]),2,0))","v":""},{"$f":"Tirage!$K12","v":8},null,null,{"$f":"VLOOKUP(AD22,Inscriptions!$I$3:$J$12,2,FALSE)","v":0},"","",{"$f":"IF(COUNTBLANK(AH22:AI22),\"\",VLOOKUP(AH22&AI22,CHOOSE({1,2},tPts324[Score 1]&tPts324[Score 2],tPts324[Pts]),2,0))","v":""},{"$f":"Tirage!$M12","v":8},null,null,{"$f":"VLOOKUP(AK22,Inscriptions!$I$3:$J$12,2,FALSE)","v":0},"","",{"$f":"IF(COUNTBLANK(AO22:AP22),\"\",VLOOKUP(AO22&AP22,CHOOSE({1,2},tPts324[Score 1]&tPts324[Score 2],tPts324[Pts]),2,0))","v":""},{"$f":"Tirage!$O12","v":6},null,null,{"$f":"VLOOKUP(AR22,Inscriptions!$I$3:$J$12,2,FALSE)","v":0},"","",{"$f":"IF(COUNTBLANK(AV22:AW22),\"\",VLOOKUP(AV22&AW22,CHOOSE({1,2},tPts324[Score 1]&tPts324[Score 2],tPts324[Pts]),2,0))","v":""},{"$f":"Tirage!$Q12","v":6},null,null,{"$f":"VLOOKUP(AY22,Inscriptions!$I$3:$J$12,2,FALSE)","v":0},{"$f":"IFERROR(VLOOKUP(BB22,$BB$3:BD$7,3,0),\"\")&IFERROR(VLOOKUP(BB22,$BC$3:$BE$7,3,0),\"\")","v":""},"",{"$f":"IF(COUNTBLANK(BC22:BD22),\"\",VLOOKUP(BC22&BD22,CHOOSE({1,2},tPts324[Score 1]&tPts324[Score 2],tPts324[Pts]),2,0))","v":""},{"$f":"Tirage!$S12","v":5},null,null,{"$f":"VLOOKUP(BF22,Inscriptions!$I$3:$J$12,2,FALSE)","v":0},{"$f":"IFERROR(VLOOKUP(BI22,$BI$3:BK$7,3,0),\"\")&IFERROR(VLOOKUP(BI22,$BJ$3:$BL$7,3,0),\"\")","v":""},"",{"$f":"IF(COUNTBLANK(BJ22:BK22),\"\",VLOOKUP(BJ22&BK22,CHOOSE({1,2},tPts324[Score 1]&tPts324[Score 2],tPts324[Pts]),2,0))","v":""}]
[null,{"$f":"Tirage!$C13","v":4},null,null,{"$f":"VLOOKUP(B23,Inscriptions!$I$3:$J$12,2,FALSE)","v":0},"",{"$f":"IFERROR(VLOOKUP(E23,$E$3:$H$7,4,0),\"\")&IFERROR(VLOOKUP(E23,$F$3:H$7,2,0),\"\")","v":""},{"$f":"IF(E23=0,0,IF(COUNTBLANK(F23:G23),\"\",VLOOKUP(F23&G23,CHOOSE({1,2},tPts324[Score 1]&tPts324[Score 2],tPts324[Pts]),2,0)))","v":0},10,null,null,{"$f":"VLOOKUP(I23,Inscriptions!$I$3:$J$12,2,FALSE)","v":0},"","",{"$f":"IF(L23=0,0,IF(COUNTBLANK(M23:N23),\"\",VLOOKUP(M23&N23,CHOOSE({1,2},tPts324[Score 1]&tPts324[Score 2],tPts324[Pts]),2,0)))","v":0},{"$f":"Tirage!$G13","v":6},null,null,{"$f":"VLOOKUP(P23,Inscriptions!$I$3:$J$12,2,FALSE)","v":0},"","",{"$f":"IF(COUNTBLANK(T23:U23),\"\",VLOOKUP(T23&U23,CHOOSE({1,2},tPts324[Score 1]&tPts324[Score 2],tPts324[Pts]),2,0))","v":""},{"$f":"X7","v":7},null,null,{"$f":"VLOOKUP(W23,Inscriptions!$I$3:$J$12,2,FALSE)","v":0},"","",{"$f":"IF(COUNTBLANK(AA23:AB23),\"\",VLOOKUP(AA23&AB23,CHOOSE({1,2},tPts324[Score 1]&tPts324[Score 2],tPts324[Pts]),2,0))","v":""},{"$f":"Tirage!$K13","v":9},null,null,{"$f":"VLOOKUP(AD23,Inscriptions!$I$3:$J$12,2,FALSE)","v":0},"","",{"$f":"IF(COUNTBLANK(AH23:AI23),\"\",VLOOKUP(AH23&AI23,CHOOSE({1,2},tPts324[Score 1]&tPts324[Score 2],tPts324[Pts]),2,0))","v":""},{"$f":"Tirage!$M13","v":5},null,null,{"$f":"VLOOKUP(AK23,Inscriptions!$I$3:$J$12,2,FALSE)","v":0},{"$f":"IFERROR(VLOOKUP(AN23,$AN$3:$AP$7,3,0),\"\")&IFERROR(VLOOKUP(AN23,$AO$3:$AQ$7,3,0),\"\")","v":""},{"$f":"IFERROR(VLOOKUP(AN23,$AN$3:$AQ$7,4,0),\"\")&IFERROR(VLOOKUP(AN23,$AO$3:$AQ$7,2,0),\"\")","v":""},{"$f":"IF(COUNTBLANK(AO23:AP23),\"\",VLOOKUP(AO23&AP23,CHOOSE({1,2},tPts324[Score 1]&tPts324[Score 2],tPts324[Pts]),2,0))","v":""},{"$f":"Tirage!$O13","v":2},null,null,{"$f":"VLOOKUP(AR23,Inscriptions!$I$3:$J$12,2,FALSE)","v":0},"","",{"$f":"IF(COUNTBLANK(AV23:AW23),\"\",VLOOKUP(AV23&AW23,CHOOSE({1,2},tPts324[Score 1]&tPts324[Score 2],tPts324[Pts]),2,0))","v":""},{"$f":"Tirage!$Q13","v":1},null,null,{"$f":"VLOOKUP(AY23,Inscriptions!$I$3:$J$12,2,FALSE)","v":0},{"$f":"IFERROR(VLOOKUP(BB23,$BB$3:BD$7,3,0),\"\")&IFERROR(VLOOKUP(BB23,$BC$3:$BE$7,3,0),\"\")","v":""},"",{"$f":"IF(COUNTBLANK(BC23:BD23),\"\",VLOOKUP(BC23&BD23,CHOOSE({1,2},tPts324[Score 1]&tPts324[Score 2],tPts324[Pts]),2,0))","v":""},{"$f":"Tirage!$S13","v":2},null,null,{"$f":"VLOOKUP(BF23,Inscriptions!$I$3:$J$12,2,FALSE)","v":0},{"$f":"IFERROR(VLOOKUP(BI23,$BI$3:BK$7,3,0),\"\")&IFERROR(VLOOKUP(BI23,$BJ$3:$BL$7,3,0),\"\")","v":""},"",{"$f":"IF(COUNTBLANK(BJ23:BK23),\"\",VLOOKUP(BJ23&BK23,CHOOSE({1,2},tPts324[Score 1]&tPts324[Score 2],tPts324[Pts]),2,0))","v":""}]
[]
[]
[]
[null,null,null,"Grille des points",null,null,null,null,null,null,null,null,"Classement Général journée 3"]
[null,null,null,"Score 1","Score 2","Pts",null,null,null,"Place",null,"Place","Equipes","Total Pts"]
[null,null,null,0,0,0,null,null,null,1,null,1,null,{"$f":"IFERROR(VLOOKUP(M29,$E$14:$H$23,4,0)*1,0)\n+IFERROR(VLOOKUP(M29,$L$14:$O$23,4,0)*1,0)\n+IFERROR(VLOOKUP(M29,$S$14:$V$23,4,0)*1,0)\n+IFERROR(VLOOKUP(M29,$Z$14:$AC$23,4,0)*1,0)\n+IFERROR(VLOOKUP(M29,$AG$14:$AJ$23,4,0)*1,0)\n+IFERROR(VLOOKUP(M29,$AN$14:$AQ$23,4,0)*1,0)\n+IFERROR(VLOOKUP(M29,$AU$14:$AX$23,4,0)*1,0\n+IFERROR(VLOOKUP(M29,$BB$14:$BE$23,4,0)*1,0)\n+IFERROR(VLOOKUP(M29,$BI$14:$BL$23,4,0)*1,0))","v":0},{"$f":"IF(N29=0,-100,N29)","v":-100}]
[null,null,null,0,1,1,null,null,null,2,null,2,null,0,-100]
[null,null,null,0,2,1,null,null,null,3,null,3,null,0,-100]
[null,null,null,1,0,10,null,null,null,4,null,4,null,0,-100]
[null,null,null,1,1,3,null,null,null,5,null,5,null,0,-100]
[null,null,null,1,2,1,null,null,null,6,null,6,null,0,-100]
[null,null,null,2,0,10,null,null,null,7,null,7,null,0,-100]
[null,null,null,2,1,10,null,null,null,8,null,8,null,0,-100]
[null,null,null,2,2,3,null,null,null,9,null,9,null,0,-100]
[null,null,null,2,"ab",10,null,null,null,10,null,10,null,0,-100]
[null,null,null,"ab",2,0,null,null,null,11,null,null,null,null,{"$f":"IF(N39=0,-100,N39)","v":-100}]
[null,null,null,1,"ab",10,null,null,null,12]
[null,null,null,"ab",1,0,null,null,null,13]

{"sheet":"Journée4","index":8,"n_rows":41,"n_cols":64,"rows_kept":41,"cut":false,"hidden":true,"merged":[[30,15,30,16],[8,12,9,14],[10,46,10,49],[10,53,10,56],[10,60,10,63],[25,12,25,13],[26,3,26,5],[26,10,26,11],[26,12,26,13],[8,55,8,56],[8,62,8,63],[9,34,9,61],[10,4,10,7],[10,11,10,14],[10,18,10,21],[10,25,10,28],[10,32,10,35],[10,39,10,42],[7,48,7,49],[7,55,7,56],[7,62,7,63],[8,27,8,28],[8,34,8,35],[8,41,8,42],[8,48,8,49],[7,41,7,42],[7,6,7,7],[7,13,7,14],[7,20,7,21],[7,27,7,28],[7,34,7,35],[0,60,0,63],[0,24,1,24],[0,25,0,28],[0,31,1,31],[0,32,0,35],[0,38,1,38],[0,39,0,42],[0,45,1,45],[0,46,0,49],[0,52,1,52],[0,53,0,56],[0,59,1,59],[0,18,0,21],[0,3,1,3],[0,4,0,7],[0,10,1,10],[0,11,0,14],[0,17,1,17]]}
[null,null,null,"Arbitre","TOUR 1",null,null,null,null,null,"Arbitre","TOUR 2",null,null,null,null,null,"Arbitre","TOUR 3",null,null,null,null,null,"Arbitre","TOUR 4",null,null,null,null,null,"Arbitre","TOUR 5",null,null,null,null,null,"Arbitre","TOUR 6",null,null,null,null,null,"Arbitre","TOUR 7",null,null,null,null,null,"Arbitre","TOUR 8",null,null,null,null,null,"Arbitre","TOUR 9"]
[null,null,null,null,"Equipe 1","Equipe 2","Score 1","Score 2",null,null,null,"Equipe 1","Equipe 2","Score 1","Score 2",null,null,null,"Equipe 1","Equipe 2","Score 1","Score 2",null,null,null,"Equipe 1","Equipe 2","Score 1","Score 2",null,null,null,"Equipe 1","Equipe 2","Score 1","Score 2",null,null,null,"Equipe 1","Equipe 2","Score 1","Score 2",null,null,null,"Equipe 1","Equipe 2","Score 1","Score 2",null,null,null,"Equipe 1","Equipe 2","Score 1","Score 2",null,null,null,"Equipe 1","Equipe 2","Score 1","Score 2"]
[null,{"$f":"Tirage!$B9","v":7},{"$f":"Tirage!$C9","v":10},{"$f":"B7","v":8},{"$f":"VLOOKUP(B3,Inscriptions!$M$3:$N$12,2,FALSE)","v":0},{"$f":"VLOOKUP(C3,Inscriptions!$M$3:$N$12,2,FALSE)","v":0},null,null,{"$f":"Tirage!D9","v":3},{"$f":"Tirage!E9","v":9},{"$f":"I7","v":4},{"$f":"VLOOKUP(I3,Inscriptions!$M$3:$N$12,2,FALSE)","v":0},{"$f":"VLOOKUP(J3,Inscriptions!$M$3:$N$12,2,FALSE)","v":0},null,null,{"$f":"Tirage!$F9","v":10},{"$f":"Tirage!$G9","v":2},{"$f":"P7","v":3},{"$f":"VLOOKUP(P3,Inscriptions!$M$3:$N$12,2,FALSE)","v":0},{"$f":"VLOOKUP(Q3,Inscriptions!$M$3:$N$12,2,FALSE)","v":0},null,null,{"$f":"Tirage!$H9","v":6},{"$f":"Tirage!$I9","v":10},{"$f":"W7","v":1},{"$f":"VLOOKUP(W3,Inscriptions!$M$3:$N$12,2,FALSE)","v":0},{"$f":"VLOOKUP(X3,Inscriptions!$M$3:$N$12,2,FALSE)","v":0},null,null,{"$f":"Tirage!$J9","v":1},{"$f":"Tirage!$K9","v":6},{"$f":"AD7","v":10},{"$f":"VLOOKUP(AD3,Inscriptions!$M$3:$N$12,2,FALSE)","v":0},{"$f":"VLOOKUP(AE3,Inscriptions!$M$3:$N$12,2,FALSE)","v":0},null,null,{"$f":"Tirage!$L9","v":9},{"$f":"Tirage!$M9","v":6},{"$f":"AK7","v":4},{"$f":"VLOOKUP(AK3,Inscriptions!$M$3:$N$12,2,FALSE)","v":0},{"$f":"VLOOKUP(AL3,Inscriptions!$M$3:$N$12,2,FALSE)","v":0},null,null,{"$f":"Tirage!$N9","v":3},{"$f":"Tirage!$O9","v":10},{"$f":"AR7","v":5},{"$f":"VLOOKUP(AR3,Inscriptions!$M$3:$N$12,2,FALSE)","v":0},{"$f":"VLOOKUP(AS3,Inscriptions!$M$3:$N$12,2,FALSE)","v":0},null,null,{"$f":"Tirage!$P9","v":2},{"$f":"Tirage!$Q9","v":9},{"$f":"AY7","v":10},{"$f":"VLOOKUP(AY3,Inscriptions!$M$3:$N$12,2,FALSE)","v":0},{"$f":"VLOOKUP(AZ3,Inscriptions!$M$3:$N$12,2,FALSE)","v":0},null,null,{"$f":"Tirage!$R9","v":6},{"$f":"Tirage!$S9","v":8},{"$f":"BF7","v":3},{"$f":"VLOOKUP(BF3,Inscriptions!$M$3:$N$12,2,FALSE)","v":0},{"$f":"VLOOKUP(BG3,Inscriptions!$M$3:$N$12,2,FALSE)","v":0}]
[null,{"$f":"Tirage!$B10","v":3},{"$f":"Tirage!$C10","v":5},{"$f":"C7","v":4},{"$f":"VLOOKUP(B4,Inscriptions!$M$3:$N$12,2,FALSE)","v":0},{"$f":"VLOOKUP(C4,Inscriptions!$M$3:$N$12,2,FALSE)","v":0},null,null,{"$f":"Tirage!D10","v":2},{"$f":"Tirage!E10","v":1},{"$f":"J7","v":10},{"$f":"VLOOKUP(I4,Inscriptions!$M$3:$N$12,2,FALSE)","v":0},{"$f":"VLOOKUP(J4,Inscriptions!$M$3:$N$12,2,FALSE)","v":0},null,null,{"$f":"Tirage!$F10","v":4},{"$f":"Tirage!$G10","v":7},{"$f":"Q7","v":6},{"$f":"VLOOKUP(P4,Inscriptions!$M$3:$N$12,2,FALSE)","v":0},{"$f":"VLOOKUP(Q4,Inscriptions!$M$3:$N$12,2,FALSE)","v":0},null,null,{"$f":"Tirage!$H10","v":5},{"$f":"Tirage!$I10","v":9},{"$f":"X7","v":7},{"$f":"VLOOKUP(W4,Inscriptions!$M$3:$N$12,2,FALSE)","v":0},{"$f":"VLOOKUP(X4,Inscriptions!$M$3:$N$12,2,FALSE)","v":0},null,null,{"$f":"Tirage!$J10","v":7},{"$f":"Tirage!$K10","v":5},{"$f":"AE7","v":9},{"$f":"VLOOKUP(AD4,Inscriptions!$M$3:$N$12,2,FALSE)","v":0},{"$f":"VLOOKUP(AE4,Inscriptions!$M$3:$N$12,2,FALSE)","v":0},null,null,{"$f":"Tirage!$L10","v":3},{"$f":"Tirage!$M10","v":1},{"$f":"AL7","v":5},{"$f":"VLOOKUP(AK4,Inscriptions!$M$3:$N$12,2,FALSE)","v":0},{"$f":"VLOOKUP(AL4,Inscriptions!$M$3:$N$12,2,FALSE)","v":0},null,null,{"$f":"Tirage!$N10","v":8},{"$f":"Tirage!$O10","v":1},{"$f":"AS7","v":2},{"$f":"VLOOKUP(AR4,Inscriptions!$M$3:$N$12,2,FALSE)","v":0},{"$f":"VLOOKUP(AS4,Inscriptions!$M$3:$N$12,2,FALSE)","v":0},null,null,{"$f":"Tirage!$P10","v":8},{"$f":"Tirage!$Q10","v":5},{"$f":"AZ7","v":1},{"$f":"VLOOKUP(AY4,Inscriptions!$M$3:$N$12,2,FALSE)","v":0},{"$f":"VLOOKUP(AZ4,Inscriptions!$M$3:$N$12,2,FALSE)","v":0},null,null,{"$f":"Tirage!$R10","v":7},{"$f":"Tirage!$S10","v":9},{"$f":"BG7","v":2},{"$f":"VLOOKUP(BF4,Inscriptions!$M$3:$N$12,2,FALSE)","v":0},{"$f":"VLOOKUP(BG4,Inscriptions!$M$3:$N$12,2,FALSE)","v":0}]
[null,{"$f":"Tirage!$B11","v":6},{"$f":"Tirage!$C11","v":2},{"$f":"B6","v":9},{"$f":"VLOOKUP(B5,Inscriptions!$M$3:$N$12,2,FALSE)","v":0},{"$f":"VLOOKUP(C5,Inscriptions!$M$3:$N$12,2,FALSE)","v":0},null,null,{"$f":"Tirage!D11","v":8},{"$f":"Tirage!E11","v":7},{"$f":"I6","v":5},{"$f":"VLOOKUP(I5,Inscriptions!$M$3:$N$12,2,FALSE)","v":0},{"$f":"VLOOKUP(J5,Inscriptions!$M$3:$N$12,2,FALSE)","v":0},null,null,{"$f":"Tirage!$F11","v":8},{"$f":"Tirage!$G11","v":9},{"$f":"P6","v":1},{"$f":"VLOOKUP(P5,Inscriptions!$M$3:$N$12,2,FALSE)","v":0},{"$f":"VLOOKUP(Q5,Inscriptions!$M$3:$N$12,2,FALSE)","v":0},null,null,{"$f":"Tirage!$H11","v":4},{"$f":"Tirage!$I11","v":3},{"$f":"W6","v":8},{"$f":"VLOOKUP(W5,Inscriptions!$M$3:$N$12,2,FALSE)","v":0},{"$f":"VLOOKUP(X5,Inscriptions!$M$3:$N$12,2,FALSE)","v":0},null,null,{"$f":"Tirage!$J11","v":4},{"$f":"Tirage!$K11","v":2},{"$f":"AD6","v":3},{"$f":"VLOOKUP(AD5,Inscriptions!$M$3:$N$12,2,FALSE)","v":0},{"$f":"VLOOKUP(AE5,Inscriptions!$M$3:$N$12,2,FALSE)","v":0},null,null,{"$f":"Tirage!$L11","v":2},{"$f":"Tirage!$M11","v":7},{"$f":"AK6","v":10},{"$f":"VLOOKUP(AK5,Inscriptions!$M$3:$N$12,2,FALSE)","v":0},{"$f":"VLOOKUP(AL5,Inscriptions!$M$3:$N$12,2,FALSE)","v":0},null,null,{"$f":"Tirage!$N11","v":4},{"$f":"Tirage!$O11","v":9},{"$f":"AR6","v":7},{"$f":"VLOOKUP(AR5,Inscriptions!$M$3:$N$12,2,FALSE)","v":0},{"$f":"VLOOKUP(AS5,Inscriptions!$M$3:$N$12,2,FALSE)","v":0},null,null,{"$f":"Tirage!$P11","v":7},{"$f":"Tirage!$Q11","v":3},{"$f":"AY6","v":4},{"$f":"VLOOKUP(AY5,Inscriptions!$M$3:$N$12,2,FALSE)","v":0},{"$f":"VLOOKUP(AZ5,Inscriptions!$M$3:$N$12,2,FALSE)","v":0},null,null,{"$f":"Tirage!$R11","v":4},{"$f":"Tirage!$S11","v":1},{"$f":"BF6","v":10},{"$f":"VLOOKUP(BF5,Inscriptions!$M$3:$N$12,2,FALSE)","v":0},{"$f":"VLOOKUP(BG5,Inscriptions!$M$3:$N$12,2,FALSE)","v":0}]
[null,{"$f":"Tirage!$B12","v":9},{"$f":"Tirage!$C12","v":1},{"$f":"B3","v":7},{"$f":"VLOOKUP(B6,Inscriptions!$M$3:$N$12,2,FALSE)","v":0},{"$f":"VLOOKUP(C6,Inscriptions!$M$3:$N$12,2,FALSE)","v":0},null,null,{"$f":"Tirage!D12","v":5},{"$f":"Tirage!E12","v":6},{"$f":"I3","v":3},{"$f":"VLOOKUP(I6,Inscriptions!$M$3:$N$12,2,FALSE)","v":0},{"$f":"VLOOKUP(J6,Inscriptions!$M$3:$N$12,2,FALSE)","v":0},null,null,{"$f":"Tirage!$F12","v":1},{"$f":"Tirage!$G12","v":5},{"$f":"Q3","v":2},{"$f":"VLOOKUP(P6,Inscriptions!$M$3:$N$12,2,FALSE)","v":0},{"$f":"VLOOKUP(Q6,Inscriptions!$M$3:$N$12,2,FALSE)","v":0},null,null,{"$f":"Tirage!$H12","v":8},{"$f":"Tirage!$I12","v":2},{"$f":"X3","v":10},{"$f":"VLOOKUP(W6,Inscriptions!$M$3:$N$12,2,FALSE)","v":0},{"$f":"VLOOKUP(X6,Inscriptions!$M$3:$N$12,2,FALSE)","v":0},null,null,{"$f":"Tirage!$J12","v":3},{"$f":"Tirage!$K12","v":8},{"$f":"AD4","v":7},{"$f":"VLOOKUP(AD6,Inscriptions!$M$3:$N$12,2,FALSE)","v":0},{"$f":"VLOOKUP(AE6,Inscriptions!$M$3:$N$12,2,FALSE)","v":0},null,null,{"$f":"Tirage!$L12","v":10},{"$f":"Tirage!$M12","v":8},{"$f":"AL3","v":6},{"$f":"VLOOKUP(AK6,Inscriptions!$M$3:$N$12,2,FALSE)","v":0},{"$f":"VLOOKUP(AL6,Inscriptions!$M$3:$N$12,2,FALSE)","v":0},null,null,{"$f":"Tirage!$N12","v":7},{"$f":"Tirage!$O12","v":6},{"$f":"AS4","v":1},{"$f":"VLOOKUP(AR6,Inscriptions!$M$3:$N$12,2,FALSE)","v":0},{"$f":"VLOOKUP(AS6,Inscriptions!$M$3:$N$12,2,FALSE)","v":0},null,null,{"$f":"Tirage!$P12","v":4},{"$f":"Tirage!$Q12","v":6},{"$f":"AY3","v":2},{"$f":"VLOOKUP(AY6,Inscriptions!$M$3:$N$12,2,FALSE)","v":0},{"$f":"VLOOKUP(AZ6,Inscriptions!$M$3:$N$12,2,FALSE)","v":0},null,null,{"$f":"Tirage!$R12","v":10},{"$f":"Tirage!$S12","v":5},{"$f":"BF3","v":6},{"$f":"VLOOKUP(BF6,Inscriptions!$M$3:$N$12,2,FALSE)","v":0},{"$f":"VLOOKUP(BG6,Inscriptions!$M$3:$N$12,2,FALSE)","v":0}]
[null,{"$f":"Tirage!$B13","v":8},{"$f":"Tirage!$C13","v":4},{"$f":"B5","v":6},{"$f":"VLOOKUP(B7,Inscriptions!$M$3:$N$12,2,FALSE)","v":0},{"$f":"VLOOKUP(C7,Inscriptions!$M$3:$N$12,2,FALSE)","v":0},null,null,{"$f":"Tirage!D13","v":4},{"$f":"Tirage!E13","v":10},{"$f":"J3","v":9},{"$f":"VLOOKUP(I7,Inscriptions!$M$3:$N$12,2,FALSE)","v":0},{"$f":"VLOOKUP(J7,Inscriptions!$M$3:$N$12,2,FALSE)","v":0},null,null,{"$f":"Tirage!$F13","v":3},{"$f":"Tirage!$G13","v":6},{"$f":"P5","v":8},{"$f":"VLOOKUP(P7,Inscriptions!$M$3:$N$12,2,FALSE)","v":0},{"$f":"VLOOKUP(Q7,Inscriptions!$M$3:$N$12,2,FALSE)","v":0},null,null,{"$f":"Tirage!$H13","v":1},{"$f":"Tirage!$I13","v":7},{"$f":"W5","v":4},{"$f":"VLOOKUP(W7,Inscriptions!$M$3:$N$12,2,FALSE)","v":0},{"$f":"VLOOKUP(X7,Inscriptions!$M$3:$N$12,2,FALSE)","v":0},null,null,{"$f":"Tirage!$J13","v":10},{"$f":"Tirage!$K13","v":9},{"$f":"AD5","v":4},{"$f":"VLOOKUP(AD7,Inscriptions!$M$3:$N$12,2,FALSE)","v":0},{"$f":"VLOOKUP(AE7,Inscriptions!$M$3:$N$12,2,FALSE)","v":0},null,null,{"$f":"Tirage!$L13","v":4},{"$f":"Tirage!$M13","v":5},{"$f":"AK5","v":2},{"$f":"VLOOKUP(AK7,Inscriptions!$M$3:$N$12,2,FALSE)","v":0},{"$f":"VLOOKUP(AL7,Inscriptions!$M$3:$N$12,2,FALSE)","v":0},null,null,{"$f":"Tirage!$N13","v":5},{"$f":"Tirage!$O13","v":2},{"$f":"AR5","v":4},{"$f":"VLOOKUP(AR7,Inscriptions!$M$3:$N$12,2,FALSE)","v":0},{"$f":"VLOOKUP(AS7,Inscriptions!$M$3:$N$12,2,FALSE)","v":0},null,null,{"$f":"Tirage!$P13","v":10},{"$f":"Tirage!$Q13","v":1},{"$f":"AY5","v":7},{"$f":"VLOOKUP(AY7,Inscriptions!$M$3:$N$12,2,FALSE)","v":0},{"$f":"VLOOKUP(AZ7,Inscriptions!$M$3:$N$12,2,FALSE)","v":0},null,null,{"$f":"Tirage!$R13","v":3},{"$f":"Tirage!$S13","v":2},{"$f":"BG3","v":8},{"$f":"VLOOKUP(BF7,Inscriptions!$M$3:$N$12,2,FALSE)","v":0},{"$f":"VLOOKUP(BG7,Inscriptions!$M$3:$N$12,2,FALSE)","v":0}]
[null,null,null,null,null,null,"Mettre ab pour abandon",null,null,null,null,null,null,"Mettre ab pour abandon",null,null,null,null,null,null,"Mettre ab pour abandon",null,null,null,null,null,null,"Mettre ab pour abandon",null,null,null,null,null,null,"Mettre ab pour abandon",null,null,null,null,null,null,"Mettre ab pour abandon",null,null,null,null,null,null,"Mettre ab pour abandon",null,null,null,null,null,null,"Mettre ab pour abandon",null,null,null,null,null,null,"Mettre ab pour abandon"]
[null,null,null,null,null,null,null,null,null,null,null,null,"JOURNEE 4",null,null,null,null,null,null,null,null,null,null,null,null,null,null,null,null,null,null,null,null,null,null,null,null,null,null,null,null,"Mettre ex pour exempt",null,null,null,null,null,null,"Mettre ex pour exempt"]
[]
[null,null,null,null,"TOUR 1",null,null,null,null,null,null,"TOUR 2",null,null,null,null,null,null,"TOUR 3",null,null,null,null,null,null,"TOUR 4",null,null,null,null,null,null,"TOUR 5",null,null,null,null,null,null,"TOUR 6",null,null,null,null,null,null,"TOUR 7",null,null,null,null,null,null,"TOUR 8",null,null,null,null,null,null,"TOUR 9"]
[]
[null,null,null,null,"Equipes","Score pour","Score contre","Pts ",null,null,null,"Equipes","Score pour","Score contre","Pts ",null,null,null,"Equipes","Score pour","Score contre","Pts ",null,null,null,"Equipes","Score pour","Score contre","Pts ",null,null,null,"Equipes","Score pour","Score contre","Pts ",null,null,null,"Equipes","Score pour","Score contre","Pts ",null,null,null,"Equipes","Score pour","Score contre","Pts ",null,null,null,"Equipes","Score pour","Score contre","Pts ",null,null,null,"Equipes","Score pour","Score contre","Pts "]
[null,{"$f":"Tirage!$B9","v":7},null,null,{"$f":"VLOOKUP(B14,Inscriptions!$M$3:$N$12,2,FALSE)","v":0},{"$f":"IFERROR(VLOOKUP(E14,$E$3:$G$7,3,0),\"\")&IFERROR(VLOOKUP(E14,$F$3:$H$7,3,0),\"\")","v":""},{"$f":"IFERROR(VLOOKUP(E14,$E$3:$H$7,4,0),\"\")&IFERROR(VLOOKUP(E14,$F$3:$H$7,2,0),\"\")","v":""},{"$f":"IF(E15=0,0,IF(COUNTBLANK(F14:G14),\"\",VLOOKUP(F14&G14,CHOOSE({1,2},tPts3245[Score 1]&tPts3245[Score 2],tPts3245[Pts]),2,0)))","v":0},{"$f":"I3","v":3},null,null,{"$f":"VLOOKUP(I14,Inscriptions!$M$3:$MF$12,2,FALSE)","v":0},{"$f":"IFERROR(VLOOKUP(L14,$L$3:$N$7,3,0),\"\")&IFERROR(VLOOKUP(L14,$M$3:$O$7,3,0),\"\")","v":""},{"$f":"IFERROR(VLOOKUP(L14,$L$3:$O$7,4,0),\"\")&IFERROR(VLOOKUP(L14,$M$3:$O$7,2,0),\"\")","v":""},{"$f":"IF(L14=0,0,IF(COUNTBLANK(M14:N14),\"\",VLOOKUP(M14&N14,CHOOSE({1,2},tPts3245[Score 1]&tPts3245[Score 2],tPts3245[Pts]),2,0)))","v":0},{"$f":"Tirage!$F9","v":10},null,null,{"$f":"VLOOKUP(P14,Inscriptions!$M$3:$N$12,2,FALSE)","v":0},{"$f":"IFERROR(VLOOKUP(S14,$S$3:$U$7,3,0),\"\")&IFERROR(VLOOKUP(S14,$T$3:$V$7,3,0),\"\")","v":""},{"$f":"IFERROR(VLOOKUP(S14,$S$3:$V$7,4,0),\"\")&IFERROR(VLOOKUP(S14,$T$3:$V$7,2,0),\"\")","v":""},{"$f":"IF(COUNTBLANK(T14:U14),\"\",VLOOKUP(T14&U14,CHOOSE({1,2},tPts3245[Score 1]&tPts3245[Score 2],tPts3245[Pts]),2,0))","v":""},{"$f":"W3","v":6},null,null,{"$f":"VLOOKUP(W14,Inscriptions!$M$3:$N$12,2,FALSE)","v":0},{"$f":"IFERROR(VLOOKUP(Z14,$Z$3:$AB$7,3,0),\"\")&IFERROR(VLOOKUP(Z14,$AA$3:$AC$7,3,0),\"\")","v":""},{"$f":"IFERROR(VLOOKUP(Z14,$Z$3:$AC$7,4,0),\"\")&IFERROR(VLOOKUP(Z14,$AA$3:$AC$7,2,0),\"\")","v":""},{"$f":"IF(COUNTBLANK(AA14:AB14),\"\",VLOOKUP(AA14&AB14,CHOOSE({1,2},tPts3245[Score 1]&tPts3245[Score 2],tPts3245[Pts]),2,0))","v":""},{"$f":"Tirage!$J9","v":1},null,null,{"$f":"VLOOKUP(AD14,Inscriptions!$M$3:$N$12,2,FALSE)","v":0},{"$f":"IFERROR(VLOOKUP(AG14,$AG$3:$AI$7,3,0),\"\")&IFERROR(VLOOKUP(AG14,$AH$3:$AJ$7,3,0),\"\")","v":""},{"$f":"IFERROR(VLOOKUP(AG14,$AG$3:$AJ$7,4,0),\"\")&IFERROR(VLOOKUP(AG14,$AH$3:$AJ$7,2,0),\"\")","v":""},{"$f":"IF(COUNTBLANK(AH14:AI14),\"\",VLOOKUP(AH14&AI14,CHOOSE({1,2},tPts3245[Score 1]&tPts3245[Score 2],tPts3245[Pts]),2,0))","v":""},{"$f":"Tirage!$L9","v":9},null,null,{"$f":"VLOOKUP(AK14,Inscriptions!$M$3:$N$12,2,FALSE)","v":0},{"$f":"IFERROR(VLOOKUP(AN14,$AN$3:$AP$7,3,0),\"\")&IFERROR(VLOOKUP(AN14,$AO$3:$AQ$7,3,0),\"\")","v":""},{"$f":"IFERROR(VLOOKUP(AN14,$AN$3:$AQ$7,4,0),\"\")&IFERROR(VLOOKUP(AN14,$AO$3:$AQ$7,2,0),\"\")","v":""},{"$f":"IF(COUNTBLANK(AO14:AP14),\"\",VLOOKUP(AO14&AP14,CHOOSE({1,2},tPts3245[Score 1]&tPts3245[Score 2],tPts3245[Pts]),2,0))","v":""},{"$f":"Tirage!$N9","v":3},null,null,{"$f":"VLOOKUP(AR14,Inscriptions!$M$3:$N$12,2,FALSE)","v":0},{"$f":"IFERROR(VLOOKUP(AU14,AU$3:AW$7,3,0),\"\")&IFERROR(VLOOKUP(AU14,AV$3:AX$7,3,0),\"\")","v":""},{"$f":"IFERROR(VLOOKUP(AU14,AU$3:AX$7,4,0),\"\")&IFERROR(VLOOKUP(AU14,AV$3:AX$7,2,0),\"\")","v":""},{"$f":"IF(COUNTBLANK(AV14:AW14),\"\",VLOOKUP(AV14&AW14,CHOOSE({1,2},tPts3245[Score 1]&tPts3245[Score 2],tPts3245[Pts]),2,0))","v":""},{"$f":"Tirage!$P9","v":2},null,null,{"$f":"VLOOKUP(AY14,Inscriptions!$M$3:$N$12,2,FALSE)","v":0},{"$f":"IFERROR(VLOOKUP(BB14,$BB$3:BD$7,3,0),\"\")&IFERROR(VLOOKUP(BB14,$BC$3:$BE$7,3,0),\"\")","v":""},{"$f":"IFERROR(VLOOKUP(BB14,$BB$3:$BE$7,4,0),\"\")&IFERROR(VLOOKUP(BB14,$BC$3:$BE$7,2,0),\"\")","v":""},{"$f":"IF(COUNTBLANK(BC14:BD14),\"\",VLOOKUP(BC14&BD14,CHOOSE({1,2},tPts3245[Score 1]&tPts3245[Score 2],tPts3245[Pts]),2,0))","v":""},{"$f":"Tirage!$R9","v":6},null,null,{"$f":"VLOOKUP(BF14,Inscriptions!$M$3:$N$12,2,FALSE)","v":0},{"$f":"IFERROR(VLOOKUP(BI14,$BI$3:BK$7,3,0),\"\")&IFERROR(VLOOKUP(BI14,$BJ$3:$BL$7,3,0),\"\")","v":""},{"$f":"IFERROR(VLOOKUP(BI14,$BI$3:$BL$7,4,0),\"\")&IFERROR(VLOOKUP(BI14,$BJ$3:$BL$7,2,0),\"\")","v":""},{"$f":"IF(COUNTBLANK(BJ14:BK14),\"\",VLOOKUP(BJ14&BK14,CHOOSE({1,2},tPts3245[Score 1]&tPts3245[Score 2],tPts3245[Pts]),2,0))","v":""}]
[null,{"$f":"Tirage!$B10","v":3},null,null,{"$f":"VLOOKUP(B15,Inscriptions!$M$3:$N$12,2,FALSE)","v":0},{"$f":"IFERROR(VLOOKUP(E15,$E$3:$G$7,3,0),\"\")&IFERROR(VLOOKUP(E15,$F$3:$H$7,3,0),\"\")","v":""},{"$f":"IFERROR(VLOOKUP(E15,$E$3:$H$7,4,0),\"\")&IFERROR(VLOOKUP(E15,$F$3:$H$7,2,0),\"\")","v":""},{"$f":"IF(E16=0,0,IF(COUNTBLANK(F15:G15),\"\",VLOOKUP(F15&G15,CHOOSE({1,2},tPts3245[Score 1]&tPts3245[Score 2],tPts3245[Pts]),2,0)))","v":0},{"$f":"I4","v":2},null,null,{"$f":"VLOOKUP(I15,Inscriptions!$M$3:$MF$12,2,FALSE)","v":0},{"$f":"IFERROR(VLOOKUP(L15,$L$3:$N$7,3,0),\"\")&IFERROR(VLOOKUP(L15,$M$3:$O$7,3,0),\"\")","v":""},{"$f":"IFERROR(VLOOKUP(L15,$L$3:$O$7,4,0),\"\")&IFERROR(VLOOKUP(L15,$M$3:$O$7,2,0),\"\")","v":""},{"$f":"IF(L15=0,0,IF(COUNTBLANK(M15:N15),\"\",VLOOKUP(M15&N15,CHOOSE({1,2},tPts3245[Score 1]&tPts3245[Score 2],tPts3245[Pts]),2,0)))","v":0},{"$f":"Tirage!$F10","v":4},null,null,{"$f":"VLOOKUP(P15,Inscriptions!$M$3:$N$12,2,FALSE)","v":0},{"$f":"IFERROR(VLOOKUP(S15,$S$3:$U$7,3,0),\"\")&IFERROR(VLOOKUP(S15,$T$3:$V$7,3,0),\"\")","v":""},{"$f":"IFERROR(VLOOKUP(S15,$S$3:$V$7,4,0),\"\")&IFERROR(VLOOKUP(S15,$T$3:$V$7,2,0),\"\")","v":""},{"$f":"IF(COUNTBLANK(T15:U15),\"\",VLOOKUP(T15&U15,CHOOSE({1,2},tPts3245[Score 1]&tPts3245[Score 2],tPts3245[Pts]),2,0))","v":""},{"$f":"W4","v":5},null,null,{"$f":"VLOOKUP(W15,Inscriptions!$M$3:$N$12,2,FALSE)","v":0},{"$f":"IFERROR(VLOOKUP(Z15,$Z$3:$AB$7,3,0),\"\")&IFERROR(VLOOKUP(Z15,$AA$3:$AC$7,3,0),\"\")","v":""},{"$f":"IFERROR(VLOOKUP(Z15,$Z$3:$AC$7,4,0),\"\")&IFERROR(VLOOKUP(Z15,$AA$3:$AC$7,2,0),\"\")","v":""},{"$f":"IF(COUNTBLANK(AA15:AB15),\"\",VLOOKUP(AA15&AB15,CHOOSE({1,2},tPts3245[Score 1]&tPts3245[Score 2],tPts3245[Pts]),2,0))","v":""},{"$f":"Tirage!$J10","v":7},null,null,{"$f":"VLOOKUP(AD15,Inscriptions!$M$3:$N$12,2,FALSE)","v":0},{"$f":"IFERROR(VLOOKUP(AG15,$AG$3:$AI$7,3,0),\"\")&IFERROR(VLOOKUP(AG15,$AH$3:$AJ$7,3,0),\"\")","v":""},{"$f":"IFERROR(VLOOKUP(AG15,$AG$3:$AJ$7,4,0),\"\")&IFERROR(VLOOKUP(AG15,$AH$3:$AJ$7,2,0),\"\")","v":""},{"$f":"IF(COUNTBLANK(AH15:AI15),\"\",VLOOKUP(AH15&AI15,CHOOSE({1,2},tPts3245[Score 1]&tPts3245[Score 2],tPts3245[Pts]),2,0))","v":""},{"$f":"Tirage!$L10","v":3},null,null,{"$f":"VLOOKUP(AK15,Inscriptions!$M$3:$N$12,2,FALSE)","v":0},{"$f":"IFERROR(VLOOKUP(AN15,$AN$3:$AP$7,3,0),\"\")&IFERROR(VLOOKUP(AN15,$AO$3:$AQ$7,3,0),\"\")","v":""},{"$f":"IFERROR(VLOOKUP(AN15,$AN$3:$AQ$7,4,0),\"\")&IFERROR(VLOOKUP(AN15,$AO$3:$AQ$7,2,0),\"\")","v":""},{"$f":"IF(COUNTBLANK(AO15:AP15),\"\",VLOOKUP(AO15&AP15,CHOOSE({1,2},tPts3245[Score 1]&tPts3245[Score 2],tPts3245[Pts]),2,0))","v":""},{"$f":"Tirage!$N10","v":8},null,null,{"$f":"VLOOKUP(AR15,Inscriptions!$M$3:$N$12,2,FALSE)","v":0},{"$f":"IFERROR(VLOOKUP(AU15,AU$3:AW$7,3,0),\"\")&IFERROR(VLOOKUP(AU15,AV$3:AX$7,3,0),\"\")","v":""},{"$f":"IFERROR(VLOOKUP(AU15,AU$3:AX$7,4,0),\"\")&IFERROR(VLOOKUP(AU15,AV$3:AX$7,2,0),\"\")","v":""},{"$f":"IF(COUNTBLANK(AV15:AW15),\"\",VLOOKUP(AV15&AW15,CHOOSE({1,2},tPts3245[Score 1]&tPts3245[Score 2],tPts3245[Pts]),2,0))","v":""},{"$f":"Tirage!$P10","v":8},null,null,{"$f":"VLOOKUP(AY15,Inscriptions!$M$3:$N$12,2,FALSE)","v":0},{"$f":"IFERROR(VLOOKUP(BB15,$BB$3:BD$7,3,0),\"\")&IFERROR(VLOOKUP(BB15,$BC$3:$BE$7,3,0),\"\")","v":""},{"$f":"IFERROR(VLOOKUP(BB15,$BB$3:$BE$7,4,0),\"\")&IFERROR(VLOOKUP(BB15,$BC$3:$BE$7,2,0),\"\")","v":""},{"$f":"IF(COUNTBLANK(BC15:BD15),\"\",VLOOKUP(BC15&BD15,CHOOSE({1,2},tPts3245[Score 1]&tPts3245[Score 2],tPts3245[Pts]),2,0))","v":""},{"$f":"Tirage!$R10","v":7},null,null,{"$f":"VLOOKUP(BF15,Inscriptions!$M$3:$N$12,2,FALSE)","v":0},{"$f":"IFERROR(VLOOKUP(BI15,$BI$3:BK$7,3,0),\"\")&IFERROR(VLOOKUP(BI15,$BJ$3:$BL$7,3,0),\"\")","v":""},"",{"$f":"IF(COUNTBLANK(BJ15:BK15),\"\",VLOOKUP(BJ15&BK15,CHOOSE({1,2},tPts3245[Score 1]&tPts3245[Score 2],tPts3245[Pts]),2,0))","v":""}]
[null,{"$f":"Tirage!$B11","v":6},null,null,{"$f":"VLOOKUP(B16,Inscriptions!$M$3:$N$12,2,FALSE)","v":0},"","",{"$f":"IF(E17=0,0,IF(COUNTBLANK(F16:G16),\"\",VLOOKUP(F16&G16,CHOOSE({1,2},tPts3245[Score 1]&tPts3245[Score 2],tPts3245[Pts]),2,0)))","v":0},8,null,null,{"$f":"VLOOKUP(I16,Inscriptions!$M$3:$MF$12,2,FALSE)","v":0},"","",{"$f":"IF(L16=0,0,IF(COUNTBLANK(M16:N16),\"\",VLOOKUP(M16&N16,CHOOSE({1,2},tPts3245[Score 1]&tPts3245[Score 2],tPts3245[Pts]),2,0)))","v":0},{"$f":"Tirage!$F11","v":8},null,null,{"$f":"VLOOKUP(P16,Inscriptions!$M$3:$N$12,2,FALSE)","v":0},"","",{"$f":"IF(COUNTBLANK(T16:U16),\"\",VLOOKUP(T16&U16,CHOOSE({1,2},tPts3245[Score 1]&tPts3245[Score 2],tPts3245[Pts]),2,0))","v":""},{"$f":"W5","v":4},null,null,{"$f":"VLOOKUP(W16,Inscriptions!$M$3:$N$12,2,FALSE)","v":0},"","",{"$f":"IF(COUNTBLANK(AA16:AB16),\"\",VLOOKUP(AA16&AB16,CHOOSE({1,2},tPts3245[Score 1]&tPts3245[Score 2],tPts3245[Pts]),2,0))","v":""},{"$f":"Tirage!$J11","v":4},null,null,{"$f":"VLOOKUP(AD16,Inscriptions!$M$3:$N$12,2,FALSE)","v":0},"","",{"$f":"IF(COUNTBLANK(AH16:AI16),\"\",VLOOKUP(AH16&AI16,CHOOSE({1,2},tPts3245[Score 1]&tPts3245[Score 2],tPts3245[Pts]),2,0))","v":""},{"$f":"Tirage!$L11","v":2},null,null,{"$f":"VLOOKUP(AK16,Inscriptions!$M$3:$N$12,2,FALSE)","v":0},"","",{"$f":"IF(COUNTBLANK(AO16:AP16),\"\",VLOOKUP(AO16&AP16,CHOOSE({1,2},tPts3245[Score 1]&tPts3245[Score 2],tPts3245[Pts]),2,0))","v":""},{"$f":"Tirage!$N11","v":4},null,null,{"$f":"VLOOKUP(AR16,Inscriptions!$M$3:$N$12,2,FALSE)","v":0},"","",{"$f":"IF(COUNTBLANK(AV16:AW16),\"\",VLOOKUP(AV16&AW16,CHOOSE({1,2},tPts3245[Score 1]&tPts3245[Score 2],tPts3245[Pts]),2,0))","v":""},{"$f":"Tirage!$P11","v":7},null,null,{"$f":"VLOOKUP(AY16,Inscriptions!$M$3:$N$12,2,FALSE)","v":0},{"$f":"IFERROR(VLOOKUP(BB16,$BB$3:BD$7,3,0),\"\")&IFERROR(VLOOKUP(BB16,$BC$3:$BE$7,3,0),\"\")","v":""},"",{"$f":"IF(COUNTBLANK(BC16:BD16),\"\",VLOOKUP(BC16&BD16,CHOOSE({1,2},tPts3245[Score 1]&tPts3245[Score 2],tPts3245[Pts]),2,0))","v":""},{"$f":"Tirage!$R11","v":4},null,null,{"$f":"VLOOKUP(BF16,Inscriptions!$M$3:$N$12,2,FALSE)","v":0},{"$f":"IFERROR(VLOOKUP(BI16,$BI$3:BK$7,3,0),\"\")&IFERROR(VLOOKUP(BI16,$BJ$3:$BL$7,3,0),\"\")","v":""},"",{"$f":"IF(COUNTBLANK(BJ16:BK16),\"\",VLOOKUP(BJ16&BK16,CHOOSE({1,2},tPts3245[Score 1]&tPts3245[Score 2],tPts3245[Pts]),2,0))","v":""}]
[null,{"$f":"Tirage!$B12","v":9},null,null,{"$f":"VLOOKUP(B17,Inscriptions!$M$3:$N$12,2,FALSE)","v":0},"","",{"$f":"IF(E18=0,0,IF(COUNTBLANK(F17:G17),\"\",VLOOKUP(F17&G17,CHOOSE({1,2},tPts3245[Score 1]&tPts3245[Score 2],tPts3245[Pts]),2,0)))","v":0},5,null,null,{"$f":"VLOOKUP(I17,Inscriptions!$M$3:$MF$12,2,FALSE)","v":0},"","",{"$f":"IF(L17=0,0,IF(COUNTBLANK(M17:N17),\"\",VLOOKUP(M17&N17,CHOOSE({1,2},tPts3245[Score 1]&tPts3245[Score 2],tPts3245[Pts]),2,0)))","v":0},{"$f":"Tirage!$F12","v":1},null,null,{"$f":"VLOOKUP(P17,Inscriptions!$M$3:$N$12,2,FALSE)","v":0},"","",{"$f":"IF(COUNTBLANK(T17:U17),\"\",VLOOKUP(T17&U17,CHOOSE({1,2},tPts3245[Score 1]&tPts3245[Score 2],tPts3245[Pts]),2,0))","v":""},{"$f":"W6","v":8},null,null,{"$f":"VLOOKUP(W17,Inscriptions!$M$3:$N$12,2,FALSE)","v":0},"","",{"$f":"IF(COUNTBLANK(AA17:AB17),\"\",VLOOKUP(AA17&AB17,CHOOSE({1,2},tPts3245[Score 1]&tPts3245[Score 2],tPts3245[Pts]),2,0))","v":""},{"$f":"Tirage!$J12","v":3},null,null,{"$f":"VLOOKUP(AD17,Inscriptions!$M$3:$N$12,2,FALSE)","v":0},"","",{"$f":"IF(COUNTBLANK(AH17:AI17),\"\",VLOOKUP(AH17&AI17,CHOOSE({1,2},tPts3245[Score 1]&tPts3245[Score 2],tPts3245[Pts]),2,0))","v":""},{"$f":"Tirage!$L12","v":10},null,null,{"$f":"VLOOKUP(AK17,Inscriptions!$M$3:$N$12,2,FALSE)","v":0},"","",{"$f":"IF(COUNTBLANK(AO17:AP17),\"\",VLOOKUP(AO17&AP17,CHOOSE({1,2},tPts3245[Score 1]&tPts3245[Score 2],tPts3245[Pts]),2,0))","v":""},{"$f":"Tirage!$N12","v":7},null,null,{"$f":"VLOOKUP(AR17,Inscriptions!$M$3:$N$12,2,FALSE)","v":0},"","",{"$f":"IF(COUNTBLANK(AV17:AW17),\"\",VLOOKUP(AV17&AW17,CHOOSE({1,2},tPts3245[Score 1]&tPts3245[Score 2],tPts3245[Pts]),2,0))","v":""},{"$f":"Tirage!$P12","v":4},null,null,{"$f":"VLOOKUP(AY17,Inscriptions!$M$3:$N$12,2,FALSE)","v":0},{"$f":"IFERROR(VLOOKUP(BB17,$BB$3:BD$7,3,0),\"\")&IFERROR(VLOOKUP(BB17,$BC$3:$BE$7,3,0),\"\")","v":""},"",{"$f":"IF(COUNTBLANK(BC17:BD17),\"\",VLOOKUP(BC17&BD17,CHOOSE({1,2},tPts3245[Score 1]&tPts3245[Score 2],tPts3245[Pts]),2,0))","v":""},{"$f":"Tirage!$R12","v":10},null,null,{"$f":"VLOOKUP(BF17,Inscriptions!$M$3:$N$12,2,FALSE)","v":0},{"$f":"IFERROR(VLOOKUP(BI17,$BI$3:BK$7,3,0),\"\")&IFERROR(VLOOKUP(BI17,$BJ$3:$BL$7,3,0),\"\")","v":""},"",{"$f":"IF(COUNTBLANK(BJ17:BK17),\"\",VLOOKUP(BJ17&BK17,CHOOSE({1,2},tPts3245[Score 1]&tPts3245[Score 2],tPts3245[Pts]),2,0))","v":""}]
[null,{"$f":"Tirage!$B13","v":8},null,null,{"$f":"VLOOKUP(B18,Inscriptions!$M$3:$N$12,2,FALSE)","v":0},"","",{"$f":"IF(E19=0,0,IF(COUNTBLANK(F18:G18),\"\",VLOOKUP(F18&G18,CHOOSE({1,2},tPts3245[Score 1]&tPts3245[Score 2],tPts3245[Pts]),2,0)))","v":0},4,null,null,{"$f":"VLOOKUP(I18,Inscriptions!$M$3:$MF$12,2,FALSE)","v":0},"","",{"$f":"IF(L18=0,0,IF(COUNTBLANK(M18:N18),\"\",VLOOKUP(M18&N18,CHOOSE({1,2},tPts3245[Score 1]&tPts3245[Score 2],tPts3245[Pts]),2,0)))","v":0},{"$f":"Tirage!$F13","v":3},null,null,{"$f":"VLOOKUP(P18,Inscriptions!$M$3:$N$12,2,FALSE)","v":0},"","",{"$f":"IF(COUNTBLANK(T18:U18),\"\",VLOOKUP(T18&U18,CHOOSE({1,2},tPts3245[Score 1]&tPts3245[Score 2],tPts3245[Pts]),2,0))","v":""},{"$f":"W7","v":1},null,null,{"$f":"VLOOKUP(W18,Inscriptions!$M$3:$N$12,2,FALSE)","v":0},"","",{"$f":"IF(COUNTBLANK(AA18:AB18),\"\",VLOOKUP(AA18&AB18,CHOOSE({1,2},tPts3245[Score 1]&tPts3245[Score 2],tPts3245[Pts]),2,0))","v":""},{"$f":"Tirage!$J13","v":10},null,null,{"$f":"VLOOKUP(AD18,Inscriptions!$M$3:$N$12,2,FALSE)","v":0},"","",{"$f":"IF(COUNTBLANK(AH18:AI18),\"\",VLOOKUP(AH18&AI18,CHOOSE({1,2},tPts3245[Score 1]&tPts3245[Score 2],tPts3245[Pts]),2,0))","v":""},{"$f":"Tirage!$L13","v":4},null,null,{"$f":"VLOOKUP(AK18,Inscriptions!$M$3:$N$12,2,FALSE)","v":0},"","",{"$f":"IF(COUNTBLANK(AO18:AP18),\"\",VLOOKUP(AO18&AP18,CHOOSE({1,2},tPts3245[Score 1]&tPts3245[Score 2],tPts3245[Pts]),2,0))","v":""},{"$f":"Tirage!$N13","v":5},null,null,{"$f":"VLOOKUP(AR18,Inscriptions!$M$3:$N$12,2,FALSE)","v":0},"","",{"$f":"IF(COUNTBLANK(AV18:AW18),\"\",VLOOKUP(AV18&AW18,CHOOSE({1,2},tPts3245[Score 1]&tPts3245[Score 2],tPts3245[Pts]),2,0))","v":""},{"$f":"Tirage!$P13","v":10},null,null,{"$f":"VLOOKUP(AY18,Inscriptions!$M$3:$N$12,2,FALSE)","v":0},{"$f":"IFERROR(VLOOKUP(BB18,$BB$3:BD$7,3,0),\"\")&IFERROR(VLOOKUP(BB18,$BC$3:$BE$7,3,0),\"\")","v":""},"",{"$f":"IF(COUNTBLANK(BC18:BD18),\"\",VLOOKUP(BC18&BD18,CHOOSE({1,2},tPts3245[Score 1]&tPts3245[Score 2],tPts3245[Pts]),2,0))","v":""},{"$f":"Tirage!$R13","v":3},null,null,{"$f":"VLOOKUP(BF18,Inscriptions!$M$3:$N$12,2,FALSE)","v":0},{"$f":"IFERROR(VLOOKUP(BI18,$BI$3:BK$7,3,0),\"\")&IFERROR(VLOOKUP(BI18,$BJ$3:$BL$7,3,0),\"\")","v":""},"",{"$f":"IF(COUNTBLANK(BJ18:BK18),\"\",VLOOKUP(BJ18&BK18,CHOOSE({1,2},tPts3245[Score 1]&tPts3245[Score 2],tPts3245[Pts]),2,0))","v":""}]
[null,{"$f":"Tirage!$C9","v":10},null,null,{"$f":"VLOOKUP(B19,Inscriptions!$M$3:$N$12,2,FALSE)","v":0},"","",{"$f":"IF(E20=0,0,IF(COUNTBLANK(F19:G19),\"\",VLOOKUP(F19&G19,CHOOSE({1,2},tPts3245[Score 1]&tPts3245[Score 2],tPts3245[Pts]),2,0)))","v":0},{"$f":"J3","v":9},null,null,{"$f":"VLOOKUP(I19,Inscriptions!$M$3:$MF$12,2,FALSE)","v":0},"","",{"$f":"IF(L19=0,0,IF(COUNTBLANK(M19:N19),\"\",VLOOKUP(M19&N19,CHOOSE({1,2},tPts3245[Score 1]&tPts3245[Score 2],tPts3245[Pts]),2,0)))","v":0},{"$f":"Tirage!$G9","v":2},null,null,{"$f":"VLOOKUP(P19,Inscriptions!$M$3:$N$12,2,FALSE)","v":0},"","",{"$f":"IF(COUNTBLANK(T19:U19),\"\",VLOOKUP(T19&U19,CHOOSE({1,2},tPts3245[Score 1]&tPts3245[Score 2],tPts3245[Pts]),2,0))","v":""},{"$f":"X3","v":10},null,null,{"$f":"VLOOKUP(W19,Inscriptions!$M$3:$N$12,2,FALSE)","v":0},"","",{"$f":"IF(COUNTBLANK(AA19:AB19),\"\",VLOOKUP(AA19&AB19,CHOOSE({1,2},tPts3245[Score 1]&tPts3245[Score 2],tPts3245[Pts]),2,0))","v":""},{"$f":"Tirage!$K9","v":6},null,null,{"$f":"VLOOKUP(AD19,Inscriptions!$M$3:$N$12,2,FALSE)","v":0},"","",{"$f":"IF(COUNTBLANK(AH19:AI19),\"\",VLOOKUP(AH19&AI19,CHOOSE({1,2},tPts3245[Score 1]&tPts3245[Score 2],tPts3245[Pts]),2,0))","v":""},{"$f":"Tirage!$M9","v":6},null,null,{"$f":"VLOOKUP(AK19,Inscriptions!$M$3:$N$12,2,FALSE)","v":0},"","",{"$f":"IF(COUNTBLANK(AO19:AP19),\"\",VLOOKUP(AO19&AP19,CHOOSE({1,2},tPts3245[Score 1]&tPts3245[Score 2],tPts3245[Pts]),2,0))","v":""},{"$f":"Tirage!$O9","v":10},null,null,{"$f":"VLOOKUP(AR19,Inscriptions!$M$3:$N$12,2,FALSE)","v":0},"","",{"$f":"IF(COUNTBLANK(AV19:AW19),\"\",VLOOKUP(AV19&AW19,CHOOSE({1,2},tPts3245[Score 1]&tPts3245[Score 2],tPts3245[Pts]),2,0))","v":""},{"$f":"Tirage!$Q9","v":9},null,null,{"$f":"VLOOKUP(AY19,Inscriptions!$M$3:$N$12,2,FALSE)","v":0},{"$f":"IFERROR(VLOOKUP(BB19,$BB$3:BD$7,3,0),\"\")&IFERROR(VLOOKUP(BB19,$BC$3:$BE$7,3,0),\"\")","v":""},"",{"$f":"IF(COUNTBLANK(BC19:BD19),\"\",VLOOKUP(BC19&BD19,CHOOSE({1,2},tPts3245[Score 1]&tPts3245[Score 2],tPts3245[Pts]),2,0))","v":""},{"$f":"Tirage!$S9","v":8},null,null,{"$f":"VLOOKUP(BF19,Inscriptions!$M$3:$N$12,2,FALSE)","v":0},{"$f":"IFERROR(VLOOKUP(BI19,$BI$3:BK$7,3,0),\"\")&IFERROR(VLOOKUP(BI19,$BJ$3:$BL$7,3,0),\"\")","v":""},"",{"$f":"IF(COUNTBLANK(BJ19:BK19),\"\",VLOOKUP(BJ19&BK19,CHOOSE({1,2},tPts3245[Score 1]&tPts3245[Score 2],tPts3245[Pts]),2,0))","v":""}]
[null,{"$f":"Tirage!$C10","v":5},null,null,{"$f":"VLOOKUP(B20,Inscriptions!$M$3:$N$12,2,FALSE)","v":0},"","",{"$f":"IF(E21=0,0,IF(COUNTBLANK(F20:G20),\"\",VLOOKUP(F20&G20,CHOOSE({1,2},tPts3245[Score 1]&tPts3245[Score 2],tPts3245[Pts]),2,0)))","v":0},{"$f":"J4","v":1},null,null,{"$f":"VLOOKUP(I20,Inscriptions!$M$3:$MF$12,2,FALSE)","v":0},"","",{"$f":"IF(L20=0,0,IF(COUNTBLANK(M20:N20),\"\",VLOOKUP(M20&N20,CHOOSE({1,2},tPts3245[Score 1]&tPts3245[Score 2],tPts3245[Pts]),2,0)))","v":0},{"$f":"Tirage!$G10","v":7},null,null,{"$f":"VLOOKUP(P20,Inscriptions!$M$3:$N$12,2,FALSE)","v":0},"","",{"$f":"IF(COUNTBLANK(T20:U20),\"\",VLOOKUP(T20&U20,CHOOSE({1,2},tPts3245[Score 1]&tPts3245[Score 2],tPts3245[Pts]),2,0))","v":""},{"$f":"X4","v":9},null,null,{"$f":"VLOOKUP(W20,Inscriptions!$M$3:$N$12,2,FALSE)","v":0},"","",{"$f":"IF(COUNTBLANK(AA20:AB20),\"\",VLOOKUP(AA20&AB20,CHOOSE({1,2},tPts3245[Score 1]&tPts3245[Score 2],tPts3245[Pts]),2,0))","v":""},{"$f":"Tirage!$K10","v":5},null,null,{"$f":"VLOOKUP(AD20,Inscriptions!$M$3:$N$12,2,FALSE)","v":0},"","",{"$f":"IF(COUNTBLANK(AH20:AI20),\"\",VLOOKUP(AH20&AI20,CHOOSE({1,2},tPts3245[Score 1]&tPts3245[Score 2],tPts3245[Pts]),2,0))","v":""},{"$f":"Tirage!$M10","v":1},null,null,{"$f":"VLOOKUP(AK20,Inscriptions!$M$3:$N$12,2,FALSE)","v":0},"","",{"$f":"IF(COUNTBLANK(AO20:AP20),\"\",VLOOKUP(AO20&AP20,CHOOSE({1,2},tPts3245[Score 1]&tPts3245[Score 2],tPts3245[Pts]),2,0))","v":""},{"$f":"Tirage!$O10","v":1},null,null,{"$f":"VLOOKUP(AR20,Inscriptions!$M$3:$N$12,2,FALSE)","v":0},"","",{"$f":"IF(COUNTBLANK(AV20:AW20),\"\",VLOOKUP(AV20&AW20,CHOOSE({1,2},tPts3245[Score 1]&tPts3245[Score 2],tPts3245[Pts]),2,0))","v":""},{"$f":"Tirage!$Q10","v":5},null,null,{"$f":"VLOOKUP(AY20,Inscriptions!$M$3:$N$12,2,FALSE)","v":0},{"$f":"IFERROR(VLOOKUP(BB20,$BB$3:BD$7,3,0),\"\")&IFERROR(VLOOKUP(BB20,$BC$3:$BE$7,3,0),\"\")","v":""},"",{"$f":"IF(COUNTBLANK(BC20:BD20),\"\",VLOOKUP(BC20&BD20,CHOOSE({1,2},tPts3245[Score 1]&tPts3245[Score 2],tPts3245[Pts]),2,0))","v":""},{"$f":"Tirage!$S10","v":9},null,null,{"$f":"VLOOKUP(BF20,Inscriptions!$M$3:$N$12,2,FALSE)","v":0},{"$f":"IFERROR(VLOOKUP(BI20,$BI$3:BK$7,3,0),\"\")&IFERROR(VLOOKUP(BI20,$BJ$3:$BL$7,3,0),\"\")","v":""},"",{"$f":"IF(COUNTBLANK(BJ20:BK20),\"\",VLOOKUP(BJ20&BK20,CHOOSE({1,2},tPts3245[Score 1]&tPts3245[Score 2],tPts3245[Pts]),2,0))","v":""}]
[null,{"$f":"Tirage!$C11","v":2},null,null,{"$f":"VLOOKUP(B21,Inscriptions!$M$3:$N$12,2,FALSE)","v":0},"","",{"$f":"IF(E22=0,0,IF(COUNTBLANK(F21:G21),\"\",VLOOKUP(F21&G21,CHOOSE({1,2},tPts3245[Score 1]&tPts3245[Score 2],tPts3245[Pts]),2,0)))","v":0},7,null,null,{"$f":"VLOOKUP(I21,Inscriptions!$M$3:$MF$12,2,FALSE)","v":0},"","",{"$f":"IF(L21=0,0,IF(COUNTBLANK(M21:N21),\"\",VLOOKUP(M21&N21,CHOOSE({1,2},tPts3245[Score 1]&tPts3245[Score 2],tPts3245[Pts]),2,0)))","v":0},{"$f":"Tirage!$G11","v":9},null,null,{"$f":"VLOOKUP(P21,Inscriptions!$M$3:$N$12,2,FALSE)","v":0},"","",{"$f":"IF(COUNTBLANK(T21:U21),\"\",VLOOKUP(T21&U21,CHOOSE({1,2},tPts3245[Score 1]&tPts3245[Score 2],tPts3245[Pts]),2,0))","v":""},{"$f":"X5","v":3},null,null,{"$f":"VLOOKUP(W21,Inscriptions!$M$3:$N$12,2,FALSE)","v":0},"","",{"$f":"IF(COUNTBLANK(AA21:AB21),\"\",VLOOKUP(AA21&AB21,CHOOSE({1,2},tPts3245[Score 1]&tPts3245[Score 2],tPts3245[Pts]),2,0))","v":""},{"$f":"Tirage!$K11","v":2},null,null,{"$f":"VLOOKUP(AD21,Inscriptions!$M$3:$N$12,2,FALSE)","v":0},"","",{"$f":"IF(COUNTBLANK(AH21:AI21),\"\",VLOOKUP(AH21&AI21,CHOOSE({1,2},tPts3245[Score 1]&tPts3245[Score 2],tPts3245[Pts]),2,0))","v":""},{"$f":"Tirage!$M11","v":7},null,null,{"$f":"VLOOKUP(AK21,Inscriptions!$M$3:$N$12,2,FALSE)","v":0},"","",{"$f":"IF(COUNTBLANK(AO21:AP21),\"\",VLOOKUP(AO21&AP21,CHOOSE({1,2},tPts3245[Score 1]&tPts3245[Score 2],tPts3245[Pts]),2,0))","v":""},{"$f":"Tirage!$O11","v":9},null,null,{"$f":"VLOOKUP(AR21,Inscriptions!$M$3:$N$12,2,FALSE)","v":0},"","",{"$f":"IF(COUNTBLANK(AV21:AW21),\"\",VLOOKUP(AV21&AW21,CHOOSE({1,2},tPts3245[Score 1]&tPts3245[Score 2],tPts3245[Pts]),2,0))","v":""},{"$f":"Tirage!$Q11","v":3},null,null,{"$f":"VLOOKUP(AY21,Inscriptions!$M$3:$N$12,2,FALSE)","v":0},{"$f":"IFERROR(VLOOKUP(BB21,$BB$3:BD$7,3,0),\"\")&IFERROR(VLOOKUP(BB21,$BC$3:$BE$7,3,0),\"\")","v":""},"",{"$f":"IF(COUNTBLANK(BC21:BD21),\"\",VLOOKUP(BC21&BD21,CHOOSE({1,2},tPts3245[Score 1]&tPts3245[Score 2],tPts3245[Pts]),2,0))","v":""},{"$f":"Tirage!$S11","v":1},null,null,{"$f":"VLOOKUP(BF21,Inscriptions!$M$3:$N$12,2,FALSE)","v":0},{"$f":"IFERROR(VLOOKUP(BI21,$BI$3:BK$7,3,0),\"\")&IFERROR(VLOOKUP(BI21,$BJ$3:$BL$7,3,0),\"\")","v":""},"",{"$f":"IF(COUNTBLANK(BJ21:BK21),\"\",VLOOKUP(BJ21&BK21,CHOOSE({1,2},tPts3245[Score 1]&tPts3245[Score 2],tPts3245[Pts]),2,0))","v":""}]
[null,{"$f":"Tirage!$C12","v":1},null,null,{"$f":"VLOOKUP(B22,Inscriptions!$M$3:$N$12,2,FALSE)","v":0},"","",{"$f":"IF(E23=0,0,IF(COUNTBLANK(F22:G22),\"\",VLOOKUP(F22&G22,CHOOSE({1,2},tPts3245[Score 1]&tPts3245[Score 2],tPts3245[Pts]),2,0)))","v":0},6,null,null,{"$f":"VLOOKUP(I22,Inscriptions!$M$3:$MF$12,2,FALSE)","v":0},"","",{"$f":"IF(L22=0,0,IF(COUNTBLANK(M22:N22),\"\",VLOOKUP(M22&N22,CHOOSE({1,2},tPts3245[Score 1]&tPts3245[Score 2],tPts3245[Pts]),2,0)))","v":0},{"$f":"Tirage!$G12","v":5},null,null,{"$f":"VLOOKUP(P22,Inscriptions!$M$3:$N$12,2,FALSE)","v":0},"","",{"$f":"IF(COUNTBLANK(T22:U22),\"\",VLOOKUP(T22&U22,CHOOSE({1,2},tPts3245[Score 1]&tPts3245[Score 2],tPts3245[Pts]),2,0))","v":""},{"$f":"X6","v":2},null,null,{"$f":"VLOOKUP(W22,Inscriptions!$M$3:$N$12,2,FALSE)","v":0},"","",{"$f":"IF(COUNTBLANK(AA22:AB22),\"\",VLOOKUP(AA22&AB22,CHOOSE({1,2},tPts3245[Score 1]&tPts3245[Score 2],tPts3245[Pts]),2,0))","v":""},{"$f":"Tirage!$K12","v":8},null,null,{"$f":"VLOOKUP(AD22,Inscriptions!$M$3:$N$12,2,FALSE)","v":0},"","",{"$f":"IF(COUNTBLANK(AH22:AI22),\"\",VLOOKUP(AH22&AI22,CHOOSE({1,2},tPts3245[Score 1]&tPts3245[Score 2],tPts3245[Pts]),2,0))","v":""},{"$f":"Tirage!$M12","v":8},null,null,{"$f":"VLOOKUP(AK22,Inscriptions!$M$3:$N$12,2,FALSE)","v":0},"","",{"$f":"IF(COUNTBLANK(AO22:AP22),\"\",VLOOKUP(AO22&AP22,CHOOSE({1,2},tPts3245[Score 1]&tPts3245[Score 2],tPts3245[Pts]),2,0))","v":""},{"$f":"Tirage!$O12","v":6},null,null,{"$f":"VLOOKUP(AR22,Inscriptions!$M$3:$N$12,2,FALSE)","v":0},"","",{"$f":"IF(COUNTBLANK(AV22:AW22),\"\",VLOOKUP(AV22&AW22,CHOOSE({1,2},tPts3245[Score 1]&tPts3245[Score 2],tPts3245[Pts]),2,0))","v":""},{"$f":"Tirage!$Q12","v":6},null,null,{"$f":"VLOOKUP(AY22,Inscriptions!$M$3:$N$12,2,FALSE)","v":0},{"$f":"IFERROR(VLOOKUP(BB22,$BB$3:BD$7,3,0),\"\")&IFERROR(VLOOKUP(BB22,$BC$3:$BE$7,3,0),\"\")","v":""},"",{"$f":"IF(COUNTBLANK(BC22:BD22),\"\",VLOOKUP(BC22&BD22,CHOOSE({1,2},tPts3245[Score 1]&tPts3245[Score 2],tPts3245[Pts]),2,0))","v":""},{"$f":"Tirage!$S12","v":5},null,null,{"$f":"VLOOKUP(BF22,Inscriptions!$M$3:$N$12,2,FALSE)","v":0},{"$f":"IFERROR(VLOOKUP(BI22,$BI$3:BK$7,3,0),\"\")&IFERROR(VLOOKUP(BI22,$BJ$3:$BL$7,3,0),\"\")","v":""},"",{"$f":"IF(COUNTBLANK(BJ22:BK22),\"\",VLOOKUP(BJ22&BK22,CHOOSE({1,2},tPts3245[Score 1]&tPts3245[Score 2],tPts3245[Pts]),2,0))","v":""}]
[null,{"$f":"Tirage!$C13","v":4},null,null,{"$f":"VLOOKUP(B23,Inscriptions!$M$3:$N$12,2,FALSE)","v":0},"","",{"$f":"IF(E23=0,0,IF(COUNTBLANK(F23:G23),\"\",VLOOKUP(F23&G23,CHOOSE({1,2},tPts3245[Score 1]&tPts3245[Score 2],tPts3245[Pts]),2,0)))","v":0},10,null,null,{"$f":"VLOOKUP(I23,Inscriptions!$M$3:$MF$12,2,FALSE)","v":0},"","",{"$f":"IF(L23=0,0,IF(COUNTBLANK(M23:N23),\"\",VLOOKUP(M23&N23,CHOOSE({1,2},tPts3245[Score 1]&tPts3245[Score 2],tPts3245[Pts]),2,0)))","v":0},{"$f":"Tirage!$G13","v":6},null,null,{"$f":"VLOOKUP(P23,Inscriptions!$M$3:$N$12,2,FALSE)","v":0},"","",{"$f":"IF(COUNTBLANK(T23:U23),\"\",VLOOKUP(T23&U23,CHOOSE({1,2},tPts3245[Score 1]&tPts3245[Score 2],tPts3245[Pts]),2,0))","v":""},{"$f":"X7","v":7},null,null,{"$f":"VLOOKUP(W23,Inscriptions!$M$3:$N$12,2,FALSE)","v":0},"","",{"$f":"IF(COUNTBLANK(AA23:AB23),\"\",VLOOKUP(AA23&AB23,CHOOSE({1,2},tPts3245[Score 1]&tPts3245[Score 2],tPts3245[Pts]),2,0))","v":""},{"$f":"Tirage!$K13","v":9},null,null,{"$f":"VLOOKUP(AD23,Inscriptions!$M$3:$N$12,2,FALSE)","v":0},"","",{"$f":"IF(COUNTBLANK(AH23:AI23),\"\",VLOOKUP(AH23&AI23,CHOOSE({1,2},tPts3245[Score 1]&tPts3245[Score 2],tPts3245[Pts]),2,0))","v":""},{"$f":"Tirage!$M13","v":5},null,null,{"$f":"VLOOKUP(AK23,Inscriptions!$M$3:$N$12,2,FALSE)","v":0},{"$f":"IFERROR(VLOOKUP(AN23,$AN$3:$AP$7,3,0),\"\")&IFERROR(VLOOKUP(AN23,$AO$3:$AQ$7,3,0),\"\")","v":""},{"$f":"IFERROR(VLOOKUP(AN23,$AN$3:$AQ$7,4,0),\"\")&IFERROR(VLOOKUP(AN23,$AO$3:$AQ$7,2,0),\"\")","v":""},{"$f":"IF(COUNTBLANK(AO23:AP23),\"\",VLOOKUP(AO23&AP23,CHOOSE({1,2},tPts3245[Score 1]&tPts3245[Score 2],tPts3245[Pts]),2,0))","v":""},{"$f":"Tirage!$O13","v":2},null,null,{"$f":"VLOOKUP(AR23,Inscriptions!$M$3:$N$12,2,FALSE)","v":0},"","",{"$f":"IF(COUNTBLANK(AV23:AW23),\"\",VLOOKUP(AV23&AW23,CHOOSE({1,2},tPts3245[Score 1]&tPts3245[Score 2],tPts3245[Pts]),2,0))","v":""},{"$f":"Tirage!$Q13","v":1},null,null,{"$f":"VLOOKUP(AY23,Inscriptions!$M$3:$N$12,2,FALSE)","v":0},{"$f":"IFERROR(VLOOKUP(BB23,$BB$3:BD$7,3,0),\"\")&IFERROR(VLOOKUP(BB23,$BC$3:$BE$7,3,0),\"\")","v":""},"",{"$f":"IF(COUNTBLANK(BC23:BD23),\"\",VLOOKUP(BC23&BD23,CHOOSE({1,2},tPts3245[Score 1]&tPts3245[Score 2],tPts3245[Pts]),2,0))","v":""},{"$f":"Tirage!$S13","v":2},null,null,{"$f":"VLOOKUP(BF23,Inscriptions!$M$3:$N$12,2,FALSE)","v":0},{"$f":"IFERROR(VLOOKUP(BI23,$BI$3:BK$7,3,0),\"\")&IFERROR(VLOOKUP(BI23,$BJ$3:$BL$7,3,0),\"\")","v":""},"",{"$f":"IF(COUNTBLANK(BJ23:BK23),\"\",VLOOKUP(BJ23&BK23,CHOOSE({1,2},tPts3245[Score 1]&tPts3245[Score 2],tPts3245[Pts]),2,0))","v":""}]
[]
[]
[]
[null,null,null,"Grille des points",null,null,null,null,null,null,null,null,"Classement Général journée 4"]
[null,null,null,"Score 1","Score 2","Pts",null,null,null,"Place",null,"Place","Equipes","Total Pts"]
[null,null,null,0,0,0,null,null,null,1,null,1,null,{"$f":"IFERROR(VLOOKUP(M29,$E$14:$H$23,4,0)*1,0)\n+IFERROR(VLOOKUP(M29,$L$14:$O$23,4,0)*1,0)\n+IFERROR(VLOOKUP(M29,$S$14:$V$23,4,0)*1,0)\n+IFERROR(VLOOKUP(M29,$Z$14:$AC$23,4,0)*1,0)\n+IFERROR(VLOOKUP(M29,$AG$14:$AJ$23,4,0)*1,0)\n+IFERROR(VLOOKUP(M29,$AN$14:$AQ$23,4,0)*1,0)\n+IFERROR(VLOOKUP(M29,$AU$14:$AX$23,4,0)*1,0\n+IFERROR(VLOOKUP(M29,$BB$14:$BE$23,4,0)*1,0)\n+IFERROR(VLOOKUP(M29,$BI$14:$BL$23,4,0)*1,0))","v":0},{"$f":"IF(N29=0,-100,N29)","v":-100}]
[null,null,null,0,1,1,null,null,null,2,null,2,null,0,-100]
[null,null,null,0,2,1,null,null,null,3,null,3,null,0,-100]
[null,null,null,1,0,10,null,null,null,4,null,4,null,0,-100]
[null,null,null,1,1,3,null,null,null,5,null,5,null,0,-100]
[null,null,null,1,2,1,null,null,null,6,null,6,null,0,-100]
[null,null,null,2,0,10,null,null,null,7,null,7,null,0,-100]
[null,null,null,2,1,10,null,null,null,8,null,8,null,0,-100]
[null,null,null,2,2,3,null,null,null,9,null,9,null,0,-100]
[null,null,null,2,"ab",10,null,null,null,10,null,10,null,0,-100]
[null,null,null,"ab",2,0,null,null,null,11]
[null,null,null,1,"ab",10,null,null,null,12]
[null,null,null,"ab",1,0,null,null,null,13]

{"sheet":"Journée5","index":9,"n_rows":41,"n_cols":64,"rows_kept":41,"cut":false,"hidden":true,"merged":[[26,3,26,5],[26,10,26,11],[26,12,26,13],[30,15,30,16],[10,39,10,42],[10,46,10,49],[10,53,10,56],[10,60,10,63],[25,12,25,13],[10,4,10,7],[10,11,10,14],[10,18,10,21],[10,25,10,28],[10,32,10,35],[7,48,7,49],[7,55,7,56],[7,62,7,63],[8,12,9,14],[8,27,8,28],[8,34,8,35],[8,41,8,42],[8,48,8,49],[8,55,8,56],[8,62,8,63],[7,41,7,42],[9,34,9,61],[7,6,7,7],[7,13,7,14],[7,20,7,21],[7,27,7,28],[7,34,7,35],[0,60,0,63],[0,24,1,24],[0,25,0,28],[0,31,1,31],[0,32,0,35],[0,38,1,38],[0,39,0,42],[0,45,1,45],[0,46,0,49],[0,52,1,52],[0,53,0,56],[0,59,1,59],[0,18,0,21],[0,3,1,3],[0,4,0,7],[0,10,1,10],[0,11,0,14],[0,17,1,17]]}
[null,null,null,"Arbitre","TOUR 1",null,null,null,null,null,"Arbitre","TOUR 2",null,null,null,null,null,"Arbitre","TOUR 3",null,null,null,null,null,"Arbitre","TOUR 4",null,null,null,null,null,"Arbitre","TOUR 5",null,null,null,null,null,"Arbitre","TOUR 6",null,null,null,null,null,"Arbitre","TOUR 7",null,null,null,null,null,"Arbitre","TOUR 8",null,null,null,null,null,"Arbitre","TOUR 9"]
[null,null,null,null,"Equipe 1","Equipe 2","Score 1","Score 2",null,null,null,"Equipe 1","Equipe 2","Score 1","Score 2",null,null,null,"Equipe 1","Equipe 2","Score 1","Score 2",null,null,null,"Equipe 1","Equipe 2","Score 1","Score 2",null,null,null,"Equipe 1","Equipe 2","Score 1","Score 2",null,null,null,"Equipe 1","Equipe 2","Score 1","Score 2",null,null,null,"Equipe 1","Equipe 2","Score 1","Score 2",null,null,null,"Equipe 1","Equipe 2","Score 1","Score 2",null,null,null,"Equipe 1","Equipe 2","Score 1","Score 2"]
[null,{"$f":"Tirage!$B9","v":7},{"$f":"Tirage!$C9","v":10},{"$f":"B7","v":8},{"$f":"VLOOKUP(B3,Inscriptions!$A$19:$B$28,2,FALSE)","v":0},{"$f":"VLOOKUP(C3,Inscriptions!$A$19:$B$28,2,FALSE)","v":0},null,null,{"$f":"Tirage!D9","v":3},{"$f":"Tirage!E9","v":9},{"$f":"I7","v":4},{"$f":"VLOOKUP(I3,Inscriptions!$A$19:$B$28,2,FALSE)","v":0},{"$f":"VLOOKUP(J3,Inscriptions!$A$19:$B$28,2,FALSE)","v":0},null,null,{"$f":"Tirage!$F9","v":10},{"$f":"Tirage!$G9","v":2},{"$f":"P7","v":3},{"$f":"VLOOKUP(P3,Inscriptions!$A$19:$B$28,2,FALSE)","v":0},{"$f":"VLOOKUP(Q3,Inscriptions!$A$19:$B$28,2,FALSE)","v":0},null,null,{"$f":"Tirage!$H9","v":6},{"$f":"Tirage!$I9","v":10},{"$f":"W7","v":1},{"$f":"VLOOKUP(W3,Inscriptions!$A$19:$B$28,2,FALSE)","v":0},{"$f":"VLOOKUP(X3,Inscriptions!$A$19:$B$28,2,FALSE)","v":0},null,null,{"$f":"Tirage!$J9","v":1},{"$f":"Tirage!$K9","v":6},{"$f":"AD7","v":10},{"$f":"VLOOKUP(AD3,Inscriptions!$A$19:$B$28,2,FALSE)","v":0},{"$f":"VLOOKUP(AE3,Inscriptions!$A$19:$B$28,2,FALSE)","v":0},null,null,{"$f":"Tirage!$L9","v":9},{"$f":"Tirage!$M9","v":6},{"$f":"AK7","v":4},{"$f":"VLOOKUP(AK3,Inscriptions!$A$19:$B$28,2,FALSE)","v":0},{"$f":"VLOOKUP(AL3,Inscriptions!$A$19:$B$28,2,FALSE)","v":0},null,null,{"$f":"Tirage!$N9","v":3},{"$f":"Tirage!$O9","v":10},{"$f":"AR7","v":5},{"$f":"VLOOKUP(AR3,Inscriptions!$A$19:$B$28,2,FALSE)","v":0},{"$f":"VLOOKUP(AS3,Inscriptions!$A$19:$B$28,2,FALSE)","v":0},null,null,{"$f":"Tirage!$P9","v":2},{"$f":"Tirage!$Q9","v":9},{"$f":"AY7","v":10},{"$f":"VLOOKUP(AY3,Inscriptions!$A$19:$B$28,2,FALSE)","v":0},{"$f":"VLOOKUP(AZ3,Inscriptions!$A$19:$B$28,2,FALSE)","v":0},null,null,{"$f":"Tirage!$R9","v":6},{"$f":"Tirage!$S9","v":8},{"$f":"BF7","v":3},{"$f":"VLOOKUP(BF3,Inscriptions!$A$19:$B$28,2,FALSE)","v":0},{"$f":"VLOOKUP(BG3,Inscriptions!$A$19:$B$28,2,FALSE)","v":0}]
[null,{"$f":"Tirage!$B10","v":3},{"$f":"Tirage!$C10","v":5},{"$f":"C7","v":4},{"$f":"VLOOKUP(B4,Inscriptions!$A$19:$B$28,2,FALSE)","v":0},{"$f":"VLOOKUP(C4,Inscriptions!$A$19:$B$28,2,FALSE)","v":0},null,null,{"$f":"Tirage!D10","v":2},{"$f":"Tirage!E10","v":1},{"$f":"J7","v":10},{"$f":"VLOOKUP(I4,Inscriptions!$A$19:$B$28,2,FALSE)","v":0},{"$f":"VLOOKUP(J4,Inscriptions!$A$19:$B$28,2,FALSE)","v":0},null,null,{"$f":"Tirage!$F10","v":4},{"$f":"Tirage!$G10","v":7},{"$f":"Q7","v":6},{"$f":"VLOOKUP(P4,Inscriptions!$A$19:$B$28,2,FALSE)","v":0},{"$f":"VLOOKUP(Q4,Inscriptions!$A$19:$B$28,2,FALSE)","v":0},null,null,{"$f":"Tirage!$H10","v":5},{"$f":"Tirage!$I10","v":9},{"$f":"X7","v":7},{"$f":"VLOOKUP(W4,Inscriptions!$A$19:$B$28,2,FALSE)","v":0},{"$f":"VLOOKUP(X4,Inscriptions!$A$19:$B$28,2,FALSE)","v":0},null,null,{"$f":"Tirage!$J10","v":7},{"$f":"Tirage!$K10","v":5},{"$f":"AE7","v":9},{"$f":"VLOOKUP(AD4,Inscriptions!$A$19:$B$28,2,FALSE)","v":0},{"$f":"VLOOKUP(AE4,Inscriptions!$A$19:$B$28,2,FALSE)","v":0},null,null,{"$f":"Tirage!$L10","v":3},{"$f":"Tirage!$M10","v":1},{"$f":"AL7","v":5},{"$f":"VLOOKUP(AK4,Inscriptions!$A$19:$B$28,2,FALSE)","v":0},{"$f":"VLOOKUP(AL4,Inscriptions!$A$19:$B$28,2,FALSE)","v":0},null,null,{"$f":"Tirage!$N10","v":8},{"$f":"Tirage!$O10","v":1},{"$f":"AS7","v":2},{"$f":"VLOOKUP(AR4,Inscriptions!$A$19:$B$28,2,FALSE)","v":0},{"$f":"VLOOKUP(AS4,Inscriptions!$A$19:$B$28,2,FALSE)","v":0},null,null,{"$f":"Tirage!$P10","v":8},{"$f":"Tirage!$Q10","v":5},{"$f":"AZ7","v":1},{"$f":"VLOOKUP(AY4,Inscriptions!$A$19:$B$28,2,FALSE)","v":0},{"$f":"VLOOKUP(AZ4,Inscriptions!$A$19:$B$28,2,FALSE)","v":0},null,null,{"$f":"Tirage!$R10","v":7},{"$f":"Tirage!$S10","v":9},{"$f":"BG7","v":2},{"$f":"VLOOKUP(BF4,Inscriptions!$A$19:$B$28,2,FALSE)","v":0},{"$f":"VLOOKUP(BG4,Inscriptions!$A$19:$B$28,2,FALSE)","v":0}]
[null,{"$f":"Tirage!$B11","v":6},{"$f":"Tirage!$C11","v":2},{"$f":"B6","v":9},{"$f":"VLOOKUP(B5,Inscriptions!$A$19:$B$28,2,FALSE)","v":0},{"$f":"VLOOKUP(C5,Inscriptions!$A$19:$B$28,2,FALSE)","v":0},null,null,{"$f":"Tirage!D11","v":8},{"$f":"Tirage!E11","v":7},{"$f":"I6","v":5},{"$f":"VLOOKUP(I5,Inscriptions!$A$19:$B$28,2,FALSE)","v":0},{"$f":"VLOOKUP(J5,Inscriptions!$A$19:$B$28,2,FALSE)","v":0},null,null,{"$f":"Tirage!$F11","v":8},{"$f":"Tirage!$G11","v":9},{"$f":"P6","v":1},{"$f":"VLOOKUP(P5,Inscriptions!$A$19:$B$28,2,FALSE)","v":0},{"$f":"VLOOKUP(Q5,Inscriptions!$A$19:$B$28,2,FALSE)","v":0},null,null,{"$f":"Tirage!$H11","v":4},{"$f":"Tirage!$I11","v":3},{"$f":"W6","v":8},{"$f":"VLOOKUP(W5,Inscriptions!$A$19:$B$28,2,FALSE)","v":0},{"$f":"VLOOKUP(X5,Inscriptions!$A$19:$B$28,2,FALSE)","v":0},null,null,{"$f":"Tirage!$J11","v":4},{"$f":"Tirage!$K11","v":2},{"$f":"AD6","v":3},{"$f":"VLOOKUP(AD5,Inscriptions!$A$19:$B$28,2,FALSE)","v":0},{"$f":"VLOOKUP(AE5,Inscriptions!$A$19:$B$28,2,FALSE)","v":0},null,null,{"$f":"Tirage!$L11","v":2},{"$f":"Tirage!$M11","v":7},{"$f":"AK6","v":10},{"$f":"VLOOKUP(AK5,Inscriptions!$A$19:$B$28,2,FALSE)","v":0},{"$f":"VLOOKUP(AL5,Inscriptions!$A$19:$B$28,2,FALSE)","v":0},null,null,{"$f":"Tirage!$N11","v":4},{"$f":"Tirage!$O11","v":9},{"$f":"AR6","v":7},{"$f":"VLOOKUP(AR5,Inscriptions!$A$19:$B$28,2,FALSE)","v":0},{"$f":"VLOOKUP(AS5,Inscriptions!$A$19:$B$28,2,FALSE)","v":0},null,null,{"$f":"Tirage!$P11","v":7},{"$f":"Tirage!$Q11","v":3},{"$f":"AY6","v":4},{"$f":"VLOOKUP(AY5,Inscriptions!$A$19:$B$28,2,FALSE)","v":0},{"$f":"VLOOKUP(AZ5,Inscriptions!$A$19:$B$28,2,FALSE)","v":0},null,null,{"$f":"Tirage!$R11","v":4},{"$f":"Tirage!$S11","v":1},{"$f":"BF6","v":10},{"$f":"VLOOKUP(BF5,Inscriptions!$A$19:$B$28,2,FALSE)","v":0},{"$f":"VLOOKUP(BG5,Inscriptions!$A$19:$B$28,2,FALSE)","v":0}]
[null,{"$f":"Tirage!$B12","v":9},{"$f":"Tirage!$C12","v":1},{"$f":"B3","v":7},{"$f":"VLOOKUP(B6,Inscriptions!$A$19:$B$28,2,FALSE)","v":0},{"$f":"VLOOKUP(C6,Inscriptions!$A$19:$B$28,2,FALSE)","v":0},null,null,{"$f":"Tirage!D12","v":5},{"$f":"Tirage!E12","v":6},{"$f":"I3","v":3},{"$f":"VLOOKUP(I6,Inscriptions!$A$19:$B$28,2,FALSE)","v":0},{"$f":"VLOOKUP(J6,Inscriptions!$A$19:$B$28,2,FALSE)","v":0},null,null,{"$f":"Tirage!$F12","v":1},{"$f":"Tirage!$G12","v":5},{"$f":"Q3","v":2},{"$f":"VLOOKUP(P6,Inscriptions!$A$19:$B$28,2,FALSE)","v":0},{"$f":"VLOOKUP(Q6,Inscriptions!$A$19:$B$28,2,FALSE)","v":0},null,null,{"$f":"Tirage!$H12","v":8},{"$f":"Tirage!$I12","v":2},{"$f":"X3","v":10},{"$f":"VLOOKUP(W6,Inscriptions!$A$19:$B$28,2,FALSE)","v":0},{"$f":"VLOOKUP(X6,Inscriptions!$A$19:$B$28,2,FALSE)","v":0},null,null,{"$f":"Tirage!$J12","v":3},{"$f":"Tirage!$K12","v":8},{"$f":"AD4","v":7},{"$f":"VLOOKUP(AD6,Inscriptions!$A$19:$B$28,2,FALSE)","v":0},{"$f":"VLOOKUP(AE6,Inscriptions!$A$19:$B$28,2,FALSE)","v":0},null,null,{"$f":"Tirage!$L12","v":10},{"$f":"Tirage!$M12","v":8},{"$f":"AL3","v":6},{"$f":"VLOOKUP(AK6,Inscriptions!$A$19:$B$28,2,FALSE)","v":0},{"$f":"VLOOKUP(AL6,Inscriptions!$A$19:$B$28,2,FALSE)","v":0},null,null,{"$f":"Tirage!$N12","v":7},{"$f":"Tirage!$O12","v":6},{"$f":"AS4","v":1},{"$f":"VLOOKUP(AR6,Inscriptions!$A$19:$B$28,2,FALSE)","v":0},{"$f":"VLOOKUP(AS6,Inscriptions!$A$19:$B$28,2,FALSE)","v":0},null,null,{"$f":"Tirage!$P12","v":4},{"$f":"Tirage!$Q12","v":6},{"$f":"AY3","v":2},{"$f":"VLOOKUP(AY6,Inscriptions!$A$19:$B$28,2,FALSE)","v":0},{"$f":"VLOOKUP(AZ6,Inscriptions!$A$19:$B$28,2,FALSE)","v":0},null,null,{"$f":"Tirage!$R12","v":10},{"$f":"Tirage!$S12","v":5},{"$f":"BF3","v":6},{"$f":"VLOOKUP(BF6,Inscriptions!$A$19:$B$28,2,FALSE)","v":0},{"$f":"VLOOKUP(BG6,Inscriptions!$A$19:$B$28,2,FALSE)","v":0}]
[null,{"$f":"Tirage!$B13","v":8},{"$f":"Tirage!$C13","v":4},{"$f":"B5","v":6},{"$f":"VLOOKUP(B7,Inscriptions!$A$19:$B$28,2,FALSE)","v":0},{"$f":"VLOOKUP(C7,Inscriptions!$A$19:$B$28,2,FALSE)","v":0},null,null,{"$f":"Tirage!D13","v":4},{"$f":"Tirage!E13","v":10},{"$f":"J3","v":9},{"$f":"VLOOKUP(I7,Inscriptions!$A$19:$B$28,2,FALSE)","v":0},{"$f":"VLOOKUP(J7,Inscriptions!$A$19:$B$28,2,FALSE)","v":0},null,null,{"$f":"Tirage!$F13","v":3},{"$f":"Tirage!$G13","v":6},{"$f":"P5","v":8},{"$f":"VLOOKUP(P7,Inscriptions!$A$19:$B$28,2,FALSE)","v":0},{"$f":"VLOOKUP(Q7,Inscriptions!$A$19:$B$28,2,FALSE)","v":0},null,null,{"$f":"Tirage!$H13","v":1},{"$f":"Tirage!$I13","v":7},{"$f":"W5","v":4},{"$f":"VLOOKUP(W7,Inscriptions!$A$19:$B$28,2,FALSE)","v":0},{"$f":"VLOOKUP(X7,Inscriptions!$A$19:$B$28,2,FALSE)","v":0},null,null,{"$f":"Tirage!$J13","v":10},{"$f":"Tirage!$K13","v":9},{"$f":"AD5","v":4},{"$f":"VLOOKUP(AD7,Inscriptions!$A$19:$B$28,2,FALSE)","v":0},{"$f":"VLOOKUP(AE7,Inscriptions!$A$19:$B$28,2,FALSE)","v":0},null,null,{"$f":"Tirage!$L13","v":4},{"$f":"Tirage!$M13","v":5},{"$f":"AK5","v":2},{"$f":"VLOOKUP(AK7,Inscriptions!$A$19:$B$28,2,FALSE)","v":0},{"$f":"VLOOKUP(AL7,Inscriptions!$A$19:$B$28,2,FALSE)","v":0},null,null,{"$f":"Tirage!$N13","v":5},{"$f":"Tirage!$O13","v":2},{"$f":"AR5","v":4},{"$f":"VLOOKUP(AR7,Inscriptions!$A$19:$B$28,2,FALSE)","v":0},{"$f":"VLOOKUP(AS7,Inscriptions!$A$19:$B$28,2,FALSE)","v":0},null,null,{"$f":"Tirage!$P13","v":10},{"$f":"Tirage!$Q13","v":1},{"$f":"AY5","v":7},{"$f":"VLOOKUP(AY7,Inscriptions!$A$19:$B$28,2,FALSE)","v":0},{"$f":"VLOOKUP(AZ7,Inscriptions!$A$19:$B$28,2,FALSE)","v":0},null,null,{"$f":"Tirage!$R13","v":3},{"$f":"Tirage!$S13","v":2},{"$f":"BG3","v":8},{"$f":"VLOOKUP(BF7,Inscriptions!$A$19:$B$28,2,FALSE)","v":0},{"$f":"VLOOKUP(BG7,Inscriptions!$A$19:$B$28,2,FALSE)","v":0}]
[null,null,null,null,null,null,"Mettre ab pour abandon",null,null,null,null,null,null,"Mettre ab pour abandon",null,null,null,null,null,null,"Mettre ab pour abandon",null,null,null,null,null,null,"Mettre ab pour abandon",null,null,null,null,null,null,"Mettre ab pour abandon",null,null,null,null,null,null,"Mettre ab pour abandon",null,null,null,null,null,null,"Mettre ab pour abandon",null,null,null,null,null,null,"Mettre ab pour abandon",null,null,null,null,null,null,"Mettre ab pour abandon"]
[null,null,null,null,null,null,null,null,null,null,null,null,"JOURNEE5",null,null,null,null,null,null,null,null,null,null,null,null,null,null,null,null,null,null,null,null,null,null,null,null,null,null,null,null,"Mettre ex pour exempt",null,null,null,null,null,null,"Mettre ex pour exempt"]
[]
[null,null,null,null,"TOUR 1",null,null,null,null,null,null,"TOUR 2",null,null,null,null,null,null,"TOUR 3",null,null,null,null,null,null,"TOUR 4",null,null,null,null,null,null,"TOUR 5",null,null,null,null,null,null,"TOUR 6",null,null,null,null,null,null,"TOUR 7",null,null,null,null,null,null,"TOUR 8",null,null,null,null,null,null,"TOUR 9"]
[]
[null,null,null,null,"Equipes","Score pour","Score contre","Pts ",null,null,null,"Equipes","Score pour","Score contre","Pts ",null,null,null,"Equipes","Score pour","Score contre","Pts ",null,null,null,"Equipes","Score pour","Score contre","Pts ",null,null,null,"Equipes","Score pour","Score contre","Pts ",null,null,null,"Equipes","Score pour","Score contre","Pts ",null,null,null,"Equipes","Score pour","Score contre","Pts ",null,null,null,"Equipes","Score pour","Score contre","Pts ",null,null,null,"Equipes","Score pour","Score contre","Pts "]
[null,{"$f":"Tirage!$B9","v":7},null,null,{"$f":"VLOOKUP(B14,Inscriptions!$A$19:$B$28,2,FALSE)","v":0},{"$f":"IFERROR(VLOOKUP(E14,$E$3:$G$7,3,0),\"\")&IFERROR(VLOOKUP(E14,$F$3:$H$7,3,0),\"\")","v":""},{"$f":"IFERROR(VLOOKUP(E14,$E$3:$H$7,4,0),\"\")&IFERROR(VLOOKUP(E14,$F$3:$H$7,2,0),\"\")","v":""},{"$f":"IF(E15=0,0,IF(COUNTBLANK(F14:G14),\"\",VLOOKUP(F14&G14,CHOOSE({1,2},tPts32456[Score 1]&tPts32456[Score 2],tPts32456[Pts]),2,0)))","v":0},{"$f":"I3","v":3},null,null,{"$f":"VLOOKUP(I14,Inscriptions!$A$19:$B$28,2,FALSE)","v":0},{"$f":"IFERROR(VLOOKUP(L14,$L$3:$N$7,3,0),\"\")&IFERROR(VLOOKUP(L14,$M$3:$O$7,3,0),\"\")","v":""},{"$f":"IFERROR(VLOOKUP(L14,$L$3:$O$7,4,0),\"\")&IFERROR(VLOOKUP(L14,$M$3:$O$7,2,0),\"\")","v":""},{"$f":"IF(L14=0,0,IF(COUNTBLANK(M14:N14),\"\",VLOOKUP(M14&N14,CHOOSE({1,2},tPts32456[Score 1]&tPts32456[Score 2],tPts32456[Pts]),2,0)))","v":0},{"$f":"Tirage!$F9","v":10},null,null,{"$f":"VLOOKUP(P14,Inscriptions!$M$3:$N$12,2,FALSE)","v":0},{"$f":"IFERROR(VLOOKUP(S14,$S$3:$U$7,3,0),\"\")&IFERROR(VLOOKUP(S14,$T$3:$V$7,3,0),\"\")","v":""},{"$f":"IFERROR(VLOOKUP(S14,$S$3:$V$7,4,0),\"\")&IFERROR(VLOOKUP(S14,$T$3:$V$7,2,0),\"\")","v":""},{"$f":"IF(COUNTBLANK(T14:U14),\"\",VLOOKUP(T14&U14,CHOOSE({1,2},tPts32456[Score 1]&tPts32456[Score 2],tPts32456[Pts]),2,0))","v":""},{"$f":"W3","v":6},null,null,{"$f":"VLOOKUP(W14,Inscriptions!$M$3:$N$12,2,FALSE)","v":0},{"$f":"IFERROR(VLOOKUP(Z14,$Z$3:$AB$7,3,0),\"\")&IFERROR(VLOOKUP(Z14,$AA$3:$AC$7,3,0),\"\")","v":""},{"$f":"IFERROR(VLOOKUP(Z14,$Z$3:$AC$7,4,0),\"\")&IFERROR(VLOOKUP(Z14,$AA$3:$AC$7,2,0),\"\")","v":""},{"$f":"IF(COUNTBLANK(AA14:AB14),\"\",VLOOKUP(AA14&AB14,CHOOSE({1,2},tPts32456[Score 1]&tPts32456[Score 2],tPts32456[Pts]),2,0))","v":""},{"$f":"Tirage!$J9","v":1},null,null,{"$f":"VLOOKUP(AD14,Inscriptions!$M$3:$N$12,2,FALSE)","v":0},{"$f":"IFERROR(VLOOKUP(AG14,$AG$3:$AI$7,3,0),\"\")&IFERROR(VLOOKUP(AG14,$AH$3:$AJ$7,3,0),\"\")","v":""},{"$f":"IFERROR(VLOOKUP(AG14,$AG$3:$AJ$7,4,0),\"\")&IFERROR(VLOOKUP(AG14,$AH$3:$AJ$7,2,0),\"\")","v":""},{"$f":"IF(COUNTBLANK(AH14:AI14),\"\",VLOOKUP(AH14&AI14,CHOOSE({1,2},tPts32456[Score 1]&tPts32456[Score 2],tPts32456[Pts]),2,0))","v":""},{"$f":"Tirage!$L9","v":9},null,null,{"$f":"VLOOKUP(AK14,Inscriptions!$M$3:$N$12,2,FALSE)","v":0},{"$f":"IFERROR(VLOOKUP(AN14,$AN$3:$AP$7,3,0),\"\")&IFERROR(VLOOKUP(AN14,$AO$3:$AQ$7,3,0),\"\")","v":""},{"$f":"IFERROR(VLOOKUP(AN14,$AN$3:$AQ$7,4,0),\"\")&IFERROR(VLOOKUP(AN14,$AO$3:$AQ$7,2,0),\"\")","v":""},{"$f":"IF(COUNTBLANK(AO14:AP14),\"\",VLOOKUP(AO14&AP14,CHOOSE({1,2},tPts32456[Score 1]&tPts32456[Score 2],tPts32456[Pts]),2,0))","v":""},{"$f":"Tirage!$N9","v":3},null,null,{"$f":"VLOOKUP(AR14,Inscriptions!$M$3:$N$12,2,FALSE)","v":0},{"$f":"IFERROR(VLOOKUP(AU14,AU$3:AW$7,3,0),\"\")&IFERROR(VLOOKUP(AU14,AV$3:AX$7,3,0),\"\")","v":""},{"$f":"IFERROR(VLOOKUP(AU14,AU$3:AX$7,4,0),\"\")&IFERROR(VLOOKUP(AU14,AV$3:AX$7,2,0),\"\")","v":""},{"$f":"IF(COUNTBLANK(AV14:AW14),\"\",VLOOKUP(AV14&AW14,CHOOSE({1,2},tPts32456[Score 1]&tPts32456[Score 2],tPts32456[Pts]),2,0))","v":""},{"$f":"Tirage!$P9","v":2},null,null,{"$f":"VLOOKUP(AY14,Inscriptions!$M$3:$N$12,2,FALSE)","v":0},{"$f":"IFERROR(VLOOKUP(BB14,$BB$3:BD$7,3,0),\"\")&IFERROR(VLOOKUP(BB14,$BC$3:$BE$7,3,0),\"\")","v":""},{"$f":"IFERROR(VLOOKUP(BB14,$BB$3:$BE$7,4,0),\"\")&IFERROR(VLOOKUP(BB14,$BC$3:$BE$7,2,0),\"\")","v":""},{"$f":"IF(COUNTBLANK(BC14:BD14),\"\",VLOOKUP(BC14&BD14,CHOOSE({1,2},tPts32456[Score 1]&tPts32456[Score 2],tPts32456[Pts]),2,0))","v":""},{"$f":"Tirage!$R9","v":6},null,null,{"$f":"VLOOKUP(BF14,Inscriptions!$M$3:$N$12,2,FALSE)","v":0},{"$f":"IFERROR(VLOOKUP(BI14,$BI$3:BK$7,3,0),\"\")&IFERROR(VLOOKUP(BI14,$BJ$3:$BL$7,3,0),\"\")","v":""},{"$f":"IFERROR(VLOOKUP(BI14,$BI$3:$BL$7,4,0),\"\")&IFERROR(VLOOKUP(BI14,$BJ$3:$BL$7,2,0),\"\")","v":""},{"$f":"IF(COUNTBLANK(BJ14:BK14),\"\",VLOOKUP(BJ14&BK14,CHOOSE({1,2},tPts32456[Score 1]&tPts32456[Score 2],tPts32456[Pts]),2,0))","v":""}]
[null,{"$f":"Tirage!$B10","v":3},null,null,{"$f":"VLOOKUP(B15,Inscriptions!$A$19:$B$28,2,FALSE)","v":0},{"$f":"IFERROR(VLOOKUP(E15,$E$3:$G$7,3,0),\"\")&IFERROR(VLOOKUP(E15,$F$3:$H$7,3,0),\"\")","v":""},{"$f":"IFERROR(VLOOKUP(E15,$E$3:$H$7,4,0),\"\")&IFERROR(VLOOKUP(E15,$F$3:$H$7,2,0),\"\")","v":""},{"$f":"IF(E16=0,0,IF(COUNTBLANK(F15:G15),\"\",VLOOKUP(F15&G15,CHOOSE({1,2},tPts32456[Score 1]&tPts32456[Score 2],tPts32456[Pts]),2,0)))","v":0},{"$f":"I4","v":2},null,null,{"$f":"VLOOKUP(I15,Inscriptions!$A$19:$B$28,2,FALSE)","v":0},{"$f":"IFERROR(VLOOKUP(L15,$L$3:$N$7,3,0),\"\")&IFERROR(VLOOKUP(L15,$M$3:$O$7,3,0),\"\")","v":""},{"$f":"IFERROR(VLOOKUP(L15,$L$3:$O$7,4,0),\"\")&IFERROR(VLOOKUP(L15,$M$3:$O$7,2,0),\"\")","v":""},{"$f":"IF(L15=0,0,IF(COUNTBLANK(M15:N15),\"\",VLOOKUP(M15&N15,CHOOSE({1,2},tPts32456[Score 1]&tPts32456[Score 2],tPts32456[Pts]),2,0)))","v":0},{"$f":"Tirage!$F10","v":4},null,null,{"$f":"VLOOKUP(P15,Inscriptions!$M$3:$N$12,2,FALSE)","v":0},{"$f":"IFERROR(VLOOKUP(S15,$S$3:$U$7,3,0),\"\")&IFERROR(VLOOKUP(S15,$T$3:$V$7,3,0),\"\")","v":""},{"$f":"IFERROR(VLOOKUP(S15,$S$3:$V$7,4,0),\"\")&IFERROR(VLOOKUP(S15,$T$3:$V$7,2,0),\"\")","v":""},{"$f":"IF(COUNTBLANK(T15:U15),\"\",VLOOKUP(T15&U15,CHOOSE({1,2},tPts32456[Score 1]&tPts32456[Score 2],tPts32456[Pts]),2,0))","v":""},{"$f":"W4","v":5},null,null,{"$f":"VLOOKUP(W15,Inscriptions!$M$3:$N$12,2,FALSE)","v":0},{"$f":"IFERROR(VLOOKUP(Z15,$Z$3:$AB$7,3,0),\"\")&IFERROR(VLOOKUP(Z15,$AA$3:$AC$7,3,0),\"\")","v":""},{"$f":"IFERROR(VLOOKUP(Z15,$Z$3:$AC$7,4,0),\"\")&IFERROR(VLOOKUP(Z15,$AA$3:$AC$7,2,0),\"\")","v":""},{"$f":"IF(COUNTBLANK(AA15:AB15),\"\",VLOOKUP(AA15&AB15,CHOOSE({1,2},tPts32456[Score 1]&tPts32456[Score 2],tPts32456[Pts]),2,0))","v":""},{"$f":"Tirage!$J10","v":7},null,null,{"$f":"VLOOKUP(AD15,Inscriptions!$M$3:$N$12,2,FALSE)","v":0},{"$f":"IFERROR(VLOOKUP(AG15,$AG$3:$AI$7,3,0),\"\")&IFERROR(VLOOKUP(AG15,$AH$3:$AJ$7,3,0),\"\")","v":""},{"$f":"IFERROR(VLOOKUP(AG15,$AG$3:$AJ$7,4,0),\"\")&IFERROR(VLOOKUP(AG15,$AH$3:$AJ$7,2,0),\"\")","v":""},{"$f":"IF(COUNTBLANK(AH15:AI15),\"\",VLOOKUP(AH15&AI15,CHOOSE({1,2},tPts32456[Score 1]&tPts32456[Score 2],tPts32456[Pts]),2,0))","v":""},{"$f":"Tirage!$L10","v":3},null,null,{"$f":"VLOOKUP(AK15,Inscriptions!$M$3:$N$12,2,FALSE)","v":0},{"$f":"IFERROR(VLOOKUP(AN15,$AN$3:$AP$7,3,0),\"\")&IFERROR(VLOOKUP(AN15,$AO$3:$AQ$7,3,0),\"\")","v":""},{"$f":"IFERROR(VLOOKUP(AN15,$AN$3:$AQ$7,4,0),\"\")&IFERROR(VLOOKUP(AN15,$AO$3:$AQ$7,2,0),\"\")","v":""},{"$f":"IF(COUNTBLANK(AO15:AP15),\"\",VLOOKUP(AO15&AP15,CHOOSE({1,2},tPts32456[Score 1]&tPts32456[Score 2],tPts32456[Pts]),2,0))","v":""},{"$f":"Tirage!$N10","v":8},null,null,{"$f":"VLOOKUP(AR15,Inscriptions!$M$3:$N$12,2,FALSE)","v":0},{"$f":"IFERROR(VLOOKUP(AU15,AU$3:AW$7,3,0),\"\")&IFERROR(VLOOKUP(AU15,AV$3:AX$7,3,0),\"\")","v":""},{"$f":"IFERROR(VLOOKUP(AU15,AU$3:AX$7,4,0),\"\")&IFERROR(VLOOKUP(AU15,AV$3:AX$7,2,0),\"\")","v":""},{"$f":"IF(COUNTBLANK(AV15:AW15),\"\",VLOOKUP(AV15&AW15,CHOOSE({1,2},tPts32456[Score 1]&tPts32456[Score 2],tPts32456[Pts]),2,0))","v":""},{"$f":"Tirage!$P10","v":8},null,null,{"$f":"VLOOKUP(AY15,Inscriptions!$M$3:$N$12,2,FALSE)","v":0},{"$f":"IFERROR(VLOOKUP(BB15,$BB$3:BD$7,3,0),\"\")&IFERROR(VLOOKUP(BB15,$BC$3:$BE$7,3,0),\"\")","v":""},{"$f":"IFERROR(VLOOKUP(BB15,$BB$3:$BE$7,4,0),\"\")&IFERROR(VLOOKUP(BB15,$BC$3:$BE$7,2,0),\"\")","v":""},{"$f":"IF(COUNTBLANK(BC15:BD15),\"\",VLOOKUP(BC15&BD15,CHOOSE({1,2},tPts32456[Score 1]&tPts32456[Score 2],tPts32456[Pts]),2,0))","v":""},{"$f":"Tirage!$R10","v":7},null,null,{"$f":"VLOOKUP(BF15,Inscriptions!$M$3:$N$12,2,FALSE)","v":0},{"$f":"IFERROR(VLOOKUP(BI15,$BI$3:BK$7,3,0),\"\")&IFERROR(VLOOKUP(BI15,$BJ$3:$BL$7,3,0),\"\")","v":""},"",{"$f":"IF(COUNTBLANK(BJ15:BK15),\"\",VLOOKUP(BJ15&BK15,CHOOSE({1,2},tPts32456[Score 1]&tPts32456[Score 2],tPts32456[Pts]),2,0))","v":""}]
[null,{"$f":"Tirage!$B11","v":6},null,null,{"$f":"VLOOKUP(B16,Inscriptions!$A$19:$B$28,2,FALSE)","v":0},"","",{"$f":"IF(E17=0,0,IF(COUNTBLANK(F16:G16),\"\",VLOOKUP(F16&G16,CHOOSE({1,2},tPts32456[Score 1]&tPts32456[Score 2],tPts32456[Pts]),2,0)))","v":0},8,null,null,{"$f":"VLOOKUP(I16,Inscriptions!$A$19:$B$28,2,FALSE)","v":0},"","",{"$f":"IF(L16=0,0,IF(COUNTBLANK(M16:N16),\"\",VLOOKUP(M16&N16,CHOOSE({1,2},tPts32456[Score 1]&tPts32456[Score 2],tPts32456[Pts]),2,0)))","v":0},{"$f":"Tirage!$F11","v":8},null,null,{"$f":"VLOOKUP(P16,Inscriptions!$M$3:$N$12,2,FALSE)","v":0},"","",{"$f":"IF(COUNTBLANK(T16:U16),\"\",VLOOKUP(T16&U16,CHOOSE({1,2},tPts32456[Score 1]&tPts32456[Score 2],tPts32456[Pts]),2,0))","v":""},{"$f":"W5","v":4},null,null,{"$f":"VLOOKUP(W16,Inscriptions!$M$3:$N$12,2,FALSE)","v":0},"","",{"$f":"IF(COUNTBLANK(AA16:AB16),\"\",VLOOKUP(AA16&AB16,CHOOSE({1,2},tPts32456[Score 1]&tPts32456[Score 2],tPts32456[Pts]),2,0))","v":""},{"$f":"Tirage!$J11","v":4},null,null,{"$f":"VLOOKUP(AD16,Inscriptions!$M$3:$N$12,2,FALSE)","v":0},"","",{"$f":"IF(COUNTBLANK(AH16:AI16),\"\",VLOOKUP(AH16&AI16,CHOOSE({1,2},tPts32456[Score 1]&tPts32456[Score 2],tPts32456[Pts]),2,0))","v":""},{"$f":"Tirage!$L11","v":2},null,null,{"$f":"VLOOKUP(AK16,Inscriptions!$M$3:$N$12,2,FALSE)","v":0},"","",{"$f":"IF(COUNTBLANK(AO16:AP16),\"\",VLOOKUP(AO16&AP16,CHOOSE({1,2},tPts32456[Score 1]&tPts32456[Score 2],tPts32456[Pts]),2,0))","v":""},{"$f":"Tirage!$N11","v":4},null,null,{"$f":"VLOOKUP(AR16,Inscriptions!$M$3:$N$12,2,FALSE)","v":0},"","",{"$f":"IF(COUNTBLANK(AV16:AW16),\"\",VLOOKUP(AV16&AW16,CHOOSE({1,2},tPts32456[Score 1]&tPts32456[Score 2],tPts32456[Pts]),2,0))","v":""},{"$f":"Tirage!$P11","v":7},null,null,{"$f":"VLOOKUP(AY16,Inscriptions!$M$3:$N$12,2,FALSE)","v":0},{"$f":"IFERROR(VLOOKUP(BB16,$BB$3:BD$7,3,0),\"\")&IFERROR(VLOOKUP(BB16,$BC$3:$BE$7,3,0),\"\")","v":""},"",{"$f":"IF(COUNTBLANK(BC16:BD16),\"\",VLOOKUP(BC16&BD16,CHOOSE({1,2},tPts32456[Score 1]&tPts32456[Score 2],tPts32456[Pts]),2,0))","v":""},{"$f":"Tirage!$R11","v":4},null,null,{"$f":"VLOOKUP(BF16,Inscriptions!$M$3:$N$12,2,FALSE)","v":0},{"$f":"IFERROR(VLOOKUP(BI16,$BI$3:BK$7,3,0),\"\")&IFERROR(VLOOKUP(BI16,$BJ$3:$BL$7,3,0),\"\")","v":""},"",{"$f":"IF(COUNTBLANK(BJ16:BK16),\"\",VLOOKUP(BJ16&BK16,CHOOSE({1,2},tPts32456[Score 1]&tPts32456[Score 2],tPts32456[Pts]),2,0))","v":""}]
[null,{"$f":"Tirage!$B12","v":9},null,null,{"$f":"VLOOKUP(B17,Inscriptions!$A$19:$B$28,2,FALSE)","v":0},"","",{"$f":"IF(E18=0,0,IF(COUNTBLANK(F17:G17),\"\",VLOOKUP(F17&G17,CHOOSE({1,2},tPts32456[Score 1]&tPts32456[Score 2],tPts32456[Pts]),2,0)))","v":0},5,null,null,{"$f":"VLOOKUP(I17,Inscriptions!$A$19:$B$28,2,FALSE)","v":0},"","",{"$f":"IF(L17=0,0,IF(COUNTBLANK(M17:N17),\"\",VLOOKUP(M17&N17,CHOOSE({1,2},tPts32456[Score 1]&tPts32456[Score 2],tPts32456[Pts]),2,0)))","v":0},{"$f":"Tirage!$F12","v":1},null,null,{"$f":"VLOOKUP(P17,Inscriptions!$M$3:$N$12,2,FALSE)","v":0},"","",{"$f":"IF(COUNTBLANK(T17:U17),\"\",VLOOKUP(T17&U17,CHOOSE({1,2},tPts32456[Score 1]&tPts32456[Score 2],tPts32456[Pts]),2,0))","v":""},{"$f":"W6","v":8},null,null,{"$f":"VLOOKUP(W17,Inscriptions!$M$3:$N$12,2,FALSE)","v":0},"","",{"$f":"IF(COUNTBLANK(AA17:AB17),\"\",VLOOKUP(AA17&AB17,CHOOSE({1,2},tPts32456[Score 1]&tPts32456[Score 2],tPts32456[Pts]),2,0))","v":""},{"$f":"Tirage!$J12","v":3},null,null,{"$f":"VLOOKUP(AD17,Inscriptions!$M$3:$N$12,2,FALSE)","v":0},"","",{"$f":"IF(COUNTBLANK(AH17:AI17),\"\",VLOOKUP(AH17&AI17,CHOOSE({1,2},tPts32456[Score 1]&tPts32456[Score 2],tPts32456[Pts]),2,0))","v":""},{"$f":"Tirage!$L12","v":10},null,null,{"$f":"VLOOKUP(AK17,Inscriptions!$M$3:$N$12,2,FALSE)","v":0},"","",{"$f":"IF(COUNTBLANK(AO17:AP17),\"\",VLOOKUP(AO17&AP17,CHOOSE({1,2},tPts32456[Score 1]&tPts32456[Score 2],tPts32456[Pts]),2,0))","v":""},{"$f":"Tirage!$N12","v":7},null,null,{"$f":"VLOOKUP(AR17,Inscriptions!$M$3:$N$12,2,FALSE)","v":0},"","",{"$f":"IF(COUNTBLANK(AV17:AW17),\"\",VLOOKUP(AV17&AW17,CHOOSE({1,2},tPts32456[Score 1]&tPts32456[Score 2],tPts32456[Pts]),2,0))","v":""},{"$f":"Tirage!$P12","v":4},null,null,{"$f":"VLOOKUP(AY17,Inscriptions!$M$3:$N$12,2,FALSE)","v":0},{"$f":"IFERROR(VLOOKUP(BB17,$BB$3:BD$7,3,0),\"\")&IFERROR(VLOOKUP(BB17,$BC$3:$BE$7,3,0),\"\")","v":""},"",{"$f":"IF(COUNTBLANK(BC17:BD17),\"\",VLOOKUP(BC17&BD17,CHOOSE({1,2},tPts32456[Score 1]&tPts32456[Score 2],tPts32456[Pts]),2,0))","v":""},{"$f":"Tirage!$R12","v":10},null,null,{"$f":"VLOOKUP(BF17,Inscriptions!$M$3:$N$12,2,FALSE)","v":0},{"$f":"IFERROR(VLOOKUP(BI17,$BI$3:BK$7,3,0),\"\")&IFERROR(VLOOKUP(BI17,$BJ$3:$BL$7,3,0),\"\")","v":""},"",{"$f":"IF(COUNTBLANK(BJ17:BK17),\"\",VLOOKUP(BJ17&BK17,CHOOSE({1,2},tPts32456[Score 1]&tPts32456[Score 2],tPts32456[Pts]),2,0))","v":""}]
[null,{"$f":"Tirage!$B13","v":8},null,null,{"$f":"VLOOKUP(B18,Inscriptions!$A$19:$B$28,2,FALSE)","v":0},"","",{"$f":"IF(E19=0,0,IF(COUNTBLANK(F18:G18),\"\",VLOOKUP(F18&G18,CHOOSE({1,2},tPts32456[Score 1]&tPts32456[Score 2],tPts32456[Pts]),2,0)))","v":0},4,null,null,{"$f":"VLOOKUP(I18,Inscriptions!$A$19:$B$28,2,FALSE)","v":0},"","",{"$f":"IF(L18=0,0,IF(COUNTBLANK(M18:N18),\"\",VLOOKUP(M18&N18,CHOOSE({1,2},tPts32456[Score 1]&tPts32456[Score 2],tPts32456[Pts]),2,0)))","v":0},{"$f":"Tirage!$F13","v":3},null,null,{"$f":"VLOOKUP(P18,Inscriptions!$M$3:$N$12,2,FALSE)","v":0},"","",{"$f":"IF(COUNTBLANK(T18:U18),\"\",VLOOKUP(T18&U18,CHOOSE({1,2},tPts32456[Score 1]&tPts32456[Score 2],tPts32456[Pts]),2,0))","v":""},{"$f":"W7","v":1},null,null,{"$f":"VLOOKUP(W18,Inscriptions!$M$3:$N$12,2,FALSE)","v":0},"","",{"$f":"IF(COUNTBLANK(AA18:AB18),\"\",VLOOKUP(AA18&AB18,CHOOSE({1,2},tPts32456[Score 1]&tPts32456[Score 2],tPts32456[Pts]),2,0))","v":""},{"$f":"Tirage!$J13","v":10},null,null,{"$f":"VLOOKUP(AD18,Inscriptions!$M$3:$N$12,2,FALSE)","v":0},"","",{"$f":"IF(COUNTBLANK(AH18:AI18),\"\",VLOOKUP(AH18&AI18,CHOOSE({1,2},tPts32456[Score 1]&tPts32456[Score 2],tPts32456[Pts]),2,0))","v":""},{"$f":"Tirage!$L13","v":4},null,null,{"$f":"VLOOKUP(AK18,Inscriptions!$M$3:$N$12,2,FALSE)","v":0},"","",{"$f":"IF(COUNTBLANK(AO18:AP18),\"\",VLOOKUP(AO18&AP18,CHOOSE({1,2},tPts32456[Score 1]&tPts32456[Score 2],tPts32456[Pts]),2,0))","v":""},{"$f":"Tirage!$N13","v":5},null,null,{"$f":"VLOOKUP(AR18,Inscriptions!$M$3:$N$12,2,FALSE)","v":0},"","",{"$f":"IF(COUNTBLANK(AV18:AW18),\"\",VLOOKUP(AV18&AW18,CHOOSE({1,2},tPts32456[Score 1]&tPts32456[Score 2],tPts32456[Pts]),2,0))","v":""},{"$f":"Tirage!$P13","v":10},null,null,{"$f":"VLOOKUP(AY18,Inscriptions!$M$3:$N$12,2,FALSE)","v":0},{"$f":"IFERROR(VLOOKUP(BB18,$BB$3:BD$7,3,0),\"\")&IFERROR(VLOOKUP(BB18,$BC$3:$BE$7,3,0),\"\")","v":""},"",{"$f":"IF(COUNTBLANK(BC18:BD18),\"\",VLOOKUP(BC18&BD18,CHOOSE({1,2},tPts32456[Score 1]&tPts32456[Score 2],tPts32456[Pts]),2,0))","v":""},{"$f":"Tirage!$R13","v":3},null,null,{"$f":"VLOOKUP(BF18,Inscriptions!$M$3:$N$12,2,FALSE)","v":0},{"$f":"IFERROR(VLOOKUP(BI18,$BI$3:BK$7,3,0),\"\")&IFERROR(VLOOKUP(BI18,$BJ$3:$BL$7,3,0),\"\")","v":""},"",{"$f":"IF(COUNTBLANK(BJ18:BK18),\"\",VLOOKUP(BJ18&BK18,CHOOSE({1,2},tPts32456[Score 1]&tPts32456[Score 2],tPts32456[Pts]),2,0))","v":""}]
[null,{"$f":"Tirage!$C9","v":10},null,null,{"$f":"VLOOKUP(B19,Inscriptions!$A$19:$B$28,2,FALSE)","v":0},"","",{"$f":"IF(E20=0,0,IF(COUNTBLANK(F19:G19),\"\",VLOOKUP(F19&G19,CHOOSE({1,2},tPts32456[Score 1]&tPts32456[Score 2],tPts32456[Pts]),2,0)))","v":0},{"$f":"J3","v":9},null,null,{"$f":"VLOOKUP(I19,Inscriptions!$A$19:$B$28,2,FALSE)","v":0},"","",{"$f":"IF(L19=0,0,IF(COUNTBLANK(M19:N19),\"\",VLOOKUP(M19&N19,CHOOSE({1,2},tPts32456[Score 1]&tPts32456[Score 2],tPts32456[Pts]),2,0)))","v":0},{"$f":"Tirage!$G9","v":2},null,null,{"$f":"VLOOKUP(P19,Inscriptions!$M$3:$N$12,2,FALSE)","v":0},"","",{"$f":"IF(COUNTBLANK(T19:U19),\"\",VLOOKUP(T19&U19,CHOOSE({1,2},tPts32456[Score 1]&tPts32456[Score 2],tPts32456[Pts]),2,0))","v":""},{"$f":"X3","v":10},null,null,{"$f":"VLOOKUP(W19,Inscriptions!$M$3:$N$12,2,FALSE)","v":0},"","",{"$f":"IF(COUNTBLANK(AA19:AB19),\"\",VLOOKUP(AA19&AB19,CHOOSE({1,2},tPts32456[Score 1]&tPts32456[Score 2],tPts32456[Pts]),2,0))","v":""},{"$f":"Tirage!$K9","v":6},null,null,{"$f":"VLOOKUP(AD19,Inscriptions!$M$3:$N$12,2,FALSE)","v":0},"","",{"$f":"IF(COUNTBLANK(AH19:AI19),\"\",VLOOKUP(AH19&AI19,CHOOSE({1,2},tPts32456[Score 1]&tPts32456[Score 2],tPts32456[Pts]),2,0))","v":""},{"$f":"Tirage!$M9","v":6},null,null,{"$f":"VLOOKUP(AK19,Inscriptions!$M$3:$N$12,2,FALSE)","v":0},"","",{"$f":"IF(COUNTBLANK(AO19:AP19),\"\",VLOOKUP(AO19&AP19,CHOOSE({1,2},tPts32456[Score 1]&tPts32456[Score 2],tPts32456[Pts]),2,0))","v":""},{"$f":"Tirage!$O9","v":10},null,null,{"$f":"VLOOKUP(AR19,Inscriptions!$M$3:$N$12,2,FALSE)","v":0},"","",{"$f":"IF(COUNTBLANK(AV19:AW19),\"\",VLOOKUP(AV19&AW19,CHOOSE({1,2},tPts32456[Score 1]&tPts32456[Score 2],tPts32456[Pts]),2,0))","v":""},{"$f":"Tirage!$Q9","v":9},null,null,{"$f":"VLOOKUP(AY19,Inscriptions!$M$3:$N$12,2,FALSE)","v":0},{"$f":"IFERROR(VLOOKUP(BB19,$BB$3:BD$7,3,0),\"\")&IFERROR(VLOOKUP(BB19,$BC$3:$BE$7,3,0),\"\")","v":""},"",{"$f":"IF(COUNTBLANK(BC19:BD19),\"\",VLOOKUP(BC19&BD19,CHOOSE({1,2},tPts32456[Score 1]&tPts32456[Score 2],tPts32456[Pts]),2,0))","v":""},{"$f":"Tirage!$S9","v":8},null,null,{"$f":"VLOOKUP(BF19,Inscriptions!$M$3:$N$12,2,FALSE)","v":0},{"$f":"IFERROR(VLOOKUP(BI19,$BI$3:BK$7,3,0),\"\")&IFERROR(VLOOKUP(BI19,$BJ$3:$BL$7,3,0),\"\")","v":""},"",{"$f":"IF(COUNTBLANK(BJ19:BK19),\"\",VLOOKUP(BJ19&BK19,CHOOSE({1,2},tPts32456[Score 1]&tPts32456[Score 2],tPts32456[Pts]),2,0))","v":""}]
[null,{"$f":"Tirage!$C10","v":5},null,null,{"$f":"VLOOKUP(B20,Inscriptions!$A$19:$B$28,2,FALSE)","v":0},"","",{"$f":"IF(E21=0,0,IF(COUNTBLANK(F20:G20),\"\",VLOOKUP(F20&G20,CHOOSE({1,2},tPts32456[Score 1]&tPts32456[Score 2],tPts32456[Pts]),2,0)))","v":0},{"$f":"J4","v":1},null,null,{"$f":"VLOOKUP(I20,Inscriptions!$A$19:$B$28,2,FALSE)","v":0},"","",{"$f":"IF(L20=0,0,IF(COUNTBLANK(M20:N20),\"\",VLOOKUP(M20&N20,CHOOSE({1,2},tPts32456[Score 1]&tPts32456[Score 2],tPts32456[Pts]),2,0)))","v":0},{"$f":"Tirage!$G10","v":7},null,null,{"$f":"VLOOKUP(P20,Inscriptions!$M$3:$N$12,2,FALSE)","v":0},"","",{"$f":"IF(COUNTBLANK(T20:U20),\"\",VLOOKUP(T20&U20,CHOOSE({1,2},tPts32456[Score 1]&tPts32456[Score 2],tPts32456[Pts]),2,0))","v":""},{"$f":"X4","v":9},null,null,{"$f":"VLOOKUP(W20,Inscriptions!$M$3:$N$12,2,FALSE)","v":0},"","",{"$f":"IF(COUNTBLANK(AA20:AB20),\"\",VLOOKUP(AA20&AB20,CHOOSE({1,2},tPts32456[Score 1]&tPts32456[Score 2],tPts32456[Pts]),2,0))","v":""},{"$f":"Tirage!$K10","v":5},null,null,{"$f":"VLOOKUP(AD20,Inscriptions!$M$3:$N$12,2,FALSE)","v":0},"","",{"$f":"IF(COUNTBLANK(AH20:AI20),\"\",VLOOKUP(AH20&AI20,CHOOSE({1,2},tPts32456[Score 1]&tPts32456[Score 2],tPts32456[Pts]),2,0))","v":""},{"$f":"Tirage!$M10","v":1},null,null,{"$f":"VLOOKUP(AK20,Inscriptions!$M$3:$N$12,2,FALSE)","v":0},"","",{"$f":"IF(COUNTBLANK(AO20:AP20),\"\",VLOOKUP(AO20&AP20,CHOOSE({1,2},tPts32456[Score 1]&tPts32456[Score 2],tPts32456[Pts]),2,0))","v":""},{"$f":"Tirage!$O10","v":1},null,null,{"$f":"VLOOKUP(AR20,Inscriptions!$M$3:$N$12,2,FALSE)","v":0},"","",{"$f":"IF(COUNTBLANK(AV20:AW20),\"\",VLOOKUP(AV20&AW20,CHOOSE({1,2},tPts32456[Score 1]&tPts32456[Score 2],tPts32456[Pts]),2,0))","v":""},{"$f":"Tirage!$Q10","v":5},null,null,{"$f":"VLOOKUP(AY20,Inscriptions!$M$3:$N$12,2,FALSE)","v":0},{"$f":"IFERROR(VLOOKUP(BB20,$BB$3:BD$7,3,0),\"\")&IFERROR(VLOOKUP(BB20,$BC$3:$BE$7,3,0),\"\")","v":""},"",{"$f":"IF(COUNTBLANK(BC20:BD20),\"\",VLOOKUP(BC20&BD20,CHOOSE({1,2},tPts32456[Score 1]&tPts32456[Score 2],tPts32456[Pts]),2,0))","v":""},{"$f":"Tirage!$S10","v":9},null,null,{"$f":"VLOOKUP(BF20,Inscriptions!$M$3:$N$12,2,FALSE)","v":0},{"$f":"IFERROR(VLOOKUP(BI20,$BI$3:BK$7,3,0),\"\")&IFERROR(VLOOKUP(BI20,$BJ$3:$BL$7,3,0),\"\")","v":""},"",{"$f":"IF(COUNTBLANK(BJ20:BK20),\"\",VLOOKUP(BJ20&BK20,CHOOSE({1,2},tPts32456[Score 1]&tPts32456[Score 2],tPts32456[Pts]),2,0))","v":""}]
[null,{"$f":"Tirage!$C11","v":2},null,null,{"$f":"VLOOKUP(B21,Inscriptions!$A$19:$B$28,2,FALSE)","v":0},"","",{"$f":"IF(E22=0,0,IF(COUNTBLANK(F21:G21),\"\",VLOOKUP(F21&G21,CHOOSE({1,2},tPts32456[Score 1]&tPts32456[Score 2],tPts32456[Pts]),2,0)))","v":0},7,null,null,{"$f":"VLOOKUP(I21,Inscriptions!$A$19:$B$28,2,FALSE)","v":0},"","",{"$f":"IF(L21=0,0,IF(COUNTBLANK(M21:N21),\"\",VLOOKUP(M21&N21,CHOOSE({1,2},tPts32456[Score 1]&tPts32456[Score 2],tPts32456[Pts]),2,0)))","v":0},{"$f":"Tirage!$G11","v":9},null,null,{"$f":"VLOOKUP(P21,Inscriptions!$M$3:$N$12,2,FALSE)","v":0},"","",{"$f":"IF(COUNTBLANK(T21:U21),\"\",VLOOKUP(T21&U21,CHOOSE({1,2},tPts32456[Score 1]&tPts32456[Score 2],tPts32456[Pts]),2,0))","v":""},{"$f":"X5","v":3},null,null,{"$f":"VLOOKUP(W21,Inscriptions!$M$3:$N$12,2,FALSE)","v":0},"","",{"$f":"IF(COUNTBLANK(AA21:AB21),\"\",VLOOKUP(AA21&AB21,CHOOSE({1,2},tPts32456[Score 1]&tPts32456[Score 2],tPts32456[Pts]),2,0))","v":""},{"$f":"Tirage!$K11","v":2},null,null,{"$f":"VLOOKUP(AD21,Inscriptions!$M$3:$N$12,2,FALSE)","v":0},"","",{"$f":"IF(COUNTBLANK(AH21:AI21),\"\",VLOOKUP(AH21&AI21,CHOOSE({1,2},tPts32456[Score 1]&tPts32456[Score 2],tPts32456[Pts]),2,0))","v":""},{"$f":"Tirage!$M11","v":7},null,null,{"$f":"VLOOKUP(AK21,Inscriptions!$M$3:$N$12,2,FALSE)","v":0},"","",{"$f":"IF(COUNTBLANK(AO21:AP21),\"\",VLOOKUP(AO21&AP21,CHOOSE({1,2},tPts32456[Score 1]&tPts32456[Score 2],tPts32456[Pts]),2,0))","v":""},{"$f":"Tirage!$O11","v":9},null,null,{"$f":"VLOOKUP(AR21,Inscriptions!$M$3:$N$12,2,FALSE)","v":0},"","",{"$f":"IF(COUNTBLANK(AV21:AW21),\"\",VLOOKUP(AV21&AW21,CHOOSE({1,2},tPts32456[Score 1]&tPts32456[Score 2],tPts32456[Pts]),2,0))","v":""},{"$f":"Tirage!$Q11","v":3},null,null,{"$f":"VLOOKUP(AY21,Inscriptions!$M$3:$N$12,2,FALSE)","v":0},{"$f":"IFERROR(VLOOKUP(BB21,$BB$3:BD$7,3,0),\"\")&IFERROR(VLOOKUP(BB21,$BC$3:$BE$7,3,0),\"\")","v":""},"",{"$f":"IF(COUNTBLANK(BC21:BD21),\"\",VLOOKUP(BC21&BD21,CHOOSE({1,2},tPts32456[Score 1]&tPts32456[Score 2],tPts32456[Pts]),2,0))","v":""},{"$f":"Tirage!$S11","v":1},null,null,{"$f":"VLOOKUP(BF21,Inscriptions!$M$3:$N$12,2,FALSE)","v":0},{"$f":"IFERROR(VLOOKUP(BI21,$BI$3:BK$7,3,0),\"\")&IFERROR(VLOOKUP(BI21,$BJ$3:$BL$7,3,0),\"\")","v":""},"",{"$f":"IF(COUNTBLANK(BJ21:BK21),\"\",VLOOKUP(BJ21&BK21,CHOOSE({1,2},tPts32456[Score 1]&tPts32456[Score 2],tPts32456[Pts]),2,0))","v":""}]
[null,{"$f":"Tirage!$C12","v":1},null,null,{"$f":"VLOOKUP(B22,Inscriptions!$A$19:$B$28,2,FALSE)","v":0},"","",{"$f":"IF(E23=0,0,IF(COUNTBLANK(F22:G22),\"\",VLOOKUP(F22&G22,CHOOSE({1,2},tPts32456[Score 1]&tPts32456[Score 2],tPts32456[Pts]),2,0)))","v":0},6,null,null,{"$f":"VLOOKUP(I22,Inscriptions!$A$19:$B$28,2,FALSE)","v":0},"","",{"$f":"IF(L22=0,0,IF(COUNTBLANK(M22:N22),\"\",VLOOKUP(M22&N22,CHOOSE({1,2},tPts32456[Score 1]&tPts32456[Score 2],tPts32456[Pts]),2,0)))","v":0},{"$f":"Tirage!$G12","v":5},null,null,{"$f":"VLOOKUP(P22,Inscriptions!$M$3:$N$12,2,FALSE)","v":0},"","",{"$f":"IF(COUNTBLANK(T22:U22),\"\",VLOOKUP(T22&U22,CHOOSE({1,2},tPts32456[Score 1]&tPts32456[Score 2],tPts32456[Pts]),2,0))","v":""},{"$f":"X6","v":2},null,null,{"$f":"VLOOKUP(W22,Inscriptions!$M$3:$N$12,2,FALSE)","v":0},"","",{"$f":"IF(COUNTBLANK(AA22:AB22),\"\",VLOOKUP(AA22&AB22,CHOOSE({1,2},tPts32456[Score 1]&tPts32456[Score 2],tPts32456[Pts]),2,0))","v":""},{"$f":"Tirage!$K12","v":8},null,null,{"$f":"VLOOKUP(AD22,Inscriptions!$M$3:$N$12,2,FALSE)","v":0},"","",{"$f":"IF(COUNTBLANK(AH22:AI22),\"\",VLOOKUP(AH22&AI22,CHOOSE({1,2},tPts32456[Score 1]&tPts32456[Score 2],tPts32456[Pts]),2,0))","v":""},{"$f":"Tirage!$M12","v":8},null,null,{"$f":"VLOOKUP(AK22,Inscriptions!$M$3:$N$12,2,FALSE)","v":0},"","",{"$f":"IF(COUNTBLANK(AO22:AP22),\"\",VLOOKUP(AO22&AP22,CHOOSE({1,2},tPts32456[Score 1]&tPts32456[Score 2],tPts32456[Pts]),2,0))","v":""},{"$f":"Tirage!$O12","v":6},null,null,{"$f":"VLOOKUP(AR22,Inscriptions!$M$3:$N$12,2,FALSE)","v":0},"","",{"$f":"IF(COUNTBLANK(AV22:AW22),\"\",VLOOKUP(AV22&AW22,CHOOSE({1,2},tPts32456[Score 1]&tPts32456[Score 2],tPts32456[Pts]),2,0))","v":""},{"$f":"Tirage!$Q12","v":6},null,null,{"$f":"VLOOKUP(AY22,Inscriptions!$M$3:$N$12,2,FALSE)","v":0},{"$f":"IFERROR(VLOOKUP(BB22,$BB$3:BD$7,3,0),\"\")&IFERROR(VLOOKUP(BB22,$BC$3:$BE$7,3,0),\"\")","v":""},"",{"$f":"IF(COUNTBLANK(BC22:BD22),\"\",VLOOKUP(BC22&BD22,CHOOSE({1,2},tPts32456[Score 1]&tPts32456[Score 2],tPts32456[Pts]),2,0))","v":""},{"$f":"Tirage!$S12","v":5},null,null,{"$f":"VLOOKUP(BF22,Inscriptions!$M$3:$N$12,2,FALSE)","v":0},{"$f":"IFERROR(VLOOKUP(BI22,$BI$3:BK$7,3,0),\"\")&IFERROR(VLOOKUP(BI22,$BJ$3:$BL$7,3,0),\"\")","v":""},"",{"$f":"IF(COUNTBLANK(BJ22:BK22),\"\",VLOOKUP(BJ22&BK22,CHOOSE({1,2},tPts32456[Score 1]&tPts32456[Score 2],tPts32456[Pts]),2,0))","v":""}]
[null,{"$f":"Tirage!$C13","v":4},null,null,{"$f":"VLOOKUP(B23,Inscriptions!$A$19:$B$28,2,FALSE)","v":0},"","",{"$f":"IF(E23=0,0,IF(COUNTBLANK(F23:G23),\"\",VLOOKUP(F23&G23,CHOOSE({1,2},tPts32456[Score 1]&tPts32456[Score 2],tPts32456[Pts]),2,0)))","v":0},10,null,null,{"$f":"VLOOKUP(I23,Inscriptions!$A$19:$B$28,2,FALSE)","v":0},"","",{"$f":"IF(L23=0,0,IF(COUNTBLANK(M23:N23),\"\",VLOOKUP(M23&N23,CHOOSE({1,2},tPts32456[Score 1]&tPts32456[Score 2],tPts32456[Pts]),2,0)))","v":0},{"$f":"Tirage!$G13","v":6},null,null,{"$f":"VLOOKUP(P23,Inscriptions!$M$3:$N$12,2,FALSE)","v":0},"","",{"$f":"IF(COUNTBLANK(T23:U23),\"\",VLOOKUP(T23&U23,CHOOSE({1,2},tPts32456[Score 1]&tPts32456[Score 2],tPts32456[Pts]),2,0))","v":""},{"$f":"X7","v":7},null,null,{"$f":"VLOOKUP(W23,Inscriptions!$M$3:$N$12,2,FALSE)","v":0},"","",{"$f":"IF(COUNTBLANK(AA23:AB23),\"\",VLOOKUP(AA23&AB23,CHOOSE({1,2},tPts32456[Score 1]&tPts32456[Score 2],tPts32456[Pts]),2,0))","v":""},{"$f":"Tirage!$K13","v":9},null,null,{"$f":"VLOOKUP(AD23,Inscriptions!$M$3:$N$12,2,FALSE)","v":0},"","",{"$f":"IF(COUNTBLANK(AH23:AI23),\"\",VLOOKUP(AH23&AI23,CHOOSE({1,2},tPts32456[Score 1]&tPts32456[Score 2],tPts32456[Pts]),2,0))","v":""},{"$f":"Tirage!$M13","v":5},null,null,{"$f":"VLOOKUP(AK23,Inscriptions!$M$3:$N$12,2,FALSE)","v":0},{"$f":"IFERROR(VLOOKUP(AN23,$AN$3:$AP$7,3,0),\"\")&IFERROR(VLOOKUP(AN23,$AO$3:$AQ$7,3,0),\"\")","v":""},{"$f":"IFERROR(VLOOKUP(AN23,$AN$3:$AQ$7,4,0),\"\")&IFERROR(VLOOKUP(AN23,$AO$3:$AQ$7,2,0),\"\")","v":""},{"$f":"IF(COUNTBLANK(AO23:AP23),\"\",VLOOKUP(AO23&AP23,CHOOSE({1,2},tPts32456[Score 1]&tPts32456[Score 2],tPts32456[Pts]),2,0))","v":""},{"$f":"Tirage!$O13","v":2},null,null,{"$f":"VLOOKUP(AR23,Inscriptions!$M$3:$N$12,2,FALSE)","v":0},"","",{"$f":"IF(COUNTBLANK(AV23:AW23),\"\",VLOOKUP(AV23&AW23,CHOOSE({1,2},tPts32456[Score 1]&tPts32456[Score 2],tPts32456[Pts]),2,0))","v":""},{"$f":"Tirage!$Q13","v":1},null,null,{"$f":"VLOOKUP(AY23,Inscriptions!$M$3:$N$12,2,FALSE)","v":0},{"$f":"IFERROR(VLOOKUP(BB23,$BB$3:BD$7,3,0),\"\")&IFERROR(VLOOKUP(BB23,$BC$3:$BE$7,3,0),\"\")","v":""},"",{"$f":"IF(COUNTBLANK(BC23:BD23),\"\",VLOOKUP(BC23&BD23,CHOOSE({1,2},tPts32456[Score 1]&tPts32456[Score 2],tPts32456[Pts]),2,0))","v":""},{"$f":"Tirage!$S13","v":2},null,null,{"$f":"VLOOKUP(BF23,Inscriptions!$M$3:$N$12,2,FALSE)","v":0},{"$f":"IFERROR(VLOOKUP(BI23,$BI$3:BK$7,3,0),\"\")&IFERROR(VLOOKUP(BI23,$BJ$3:$BL$7,3,0),\"\")","v":""},"",{"$f":"IF(COUNTBLANK(BJ23:BK23),\"\",VLOOKUP(BJ23&BK23,CHOOSE({1,2},tPts32456[Score 1]&tPts32456[Score 2],tPts32456[Pts]),2,0))","v":""}]
[]
[]
[]
[null,null,null,"Grille des points",null,null,null,null,null,null,null,null,"Classement Général journée 4"]
[null,null,null,"Score 1","Score 2","Pts",null,null,null,"Place",null,"Place","Equipes","Total Pts"]
[null,null,null,0,0,0,null,null,null,1,null,1,null,{"$f":"IFERROR(VLOOKUP(M29,$E$14:$H$23,4,0)*1,0)\n+IFERROR(VLOOKUP(M29,$L$14:$O$23,4,0)*1,0)\n+IFERROR(VLOOKUP(M29,$S$14:$V$23,4,0)*1,0)\n+IFERROR(VLOOKUP(M29,$Z$14:$AC$23,4,0)*1,0)\n+IFERROR(VLOOKUP(M29,$AG$14:$AJ$23,4,0)*1,0)\n+IFERROR(VLOOKUP(M29,$AN$14:$AQ$23,4,0)*1,0)\n+IFERROR(VLOOKUP(M29,$AU$14:$AX$23,4,0)*1,0\n+IFERROR(VLOOKUP(M29,$BB$14:$BE$23,4,0)*1,0)\n+IFERROR(VLOOKUP(M29,$BI$14:$BL$23,4,0)*1,0))","v":0},{"$f":"IF(N29=0,-100,N29)","v":-100}]
[null,null,null,0,1,1,null,null,null,2,null,2,null,0,-100]
[null,null,null,0,2,1,null,null,null,3,null,3,null,0,-100]
[null,null,null,1,0,10,null,null,null,4,null,4,null,0,-100]
[null,null,null,1,1,3,null,null,null,5,null,5,null,0,-100]
[null,null,null,1,2,1,null,null,null,6,null,6,null,0,-100]
[null,null,null,2,0,10,null,null,null,7,null,7,null,0,-100]
[null,null,null,2,1,10,null,null,null,8,null,8,null,0,-100]
[null,null,null,2,2,3,null,null,null,9,null,9,null,0,-100]
[null,null,null,2,"ab",10,null,null,null,10,null,10,null,0,-100]
[null,null,null,"ab",2,0,null,null,null,11]
[null,null,null,1,"ab",10,null,null,null,12]
[null,null,null,"ab",1,0,null,null,null,13]

{"sheet":"Journée6","index":10,"n_rows":41,"n_cols":64,"rows_kept":41,"cut":false,"hidden":true,"merged":[[26,3,26,5],[26,10,26,11],[26,12,26,13],[30,15,30,16],[10,39,10,42],[10,46,10,49],[10,53,10,56],[10,60,10,63],[25,12,25,13],[10,4,10,7],[10,11,10,14],[10,18,10,21],[10,25,10,28],[10,32,10,35],[7,48,7,49],[7,55,7,56],[7,62,7,63],[8,12,9,14],[8,27,8,28],[8,34,8,35],[8,41,8,42],[8,48,8,49],[8,55,8,56],[8,62,8,63],[7,41,7,42],[9,34,9,61],[7,6,7,7],[7,13,7,14],[7,20,7,21],[7,27,7,28],[7,34,7,35],[0,60,0,63],[0,24,1,24],[0,25,0,28],[0,31,1,31],[0,32,0,35],[0,38,1,38],[0,39,0,42],[0,45,1,45],[0,46,0,49],[0,52,1,52],[0,53,0,56],[0,59,1,59],[0,18,0,21],[0,3,1,3],[0,4,0,7],[0,10,1,10],[0,11,0,14],[0,17,1,17]]}
[null,null,null,"Arbitre","TOUR 1",null,null,null,null,null,"Arbitre","TOUR 2",null,null,null,null,null,"Arbitre","TOUR 3",null,null,null,null,null,"Arbitre","TOUR 4",null,null,null,null,null,"Arbitre","TOUR 5",null,null,null,null,null,"Arbitre","TOUR 6",null,null,null,null,null,"Arbitre","TOUR 7",null,null,null,null,null,"Arbitre","TOUR 8",null,null,null,null,null,"Arbitre","TOUR 9"]
[null,null,null,null,"Equipe 1","Equipe 2","Score 1","Score 2",null,null,null,"Equipe 1","Equipe 2","Score 1","Score 2",null,null,null,"Equipe 1","Equipe 2","Score 1","Score 2",null,null,null,"Equipe 1","Equipe 2","Score 1","Score 2",null,null,null,"Equipe 1","Equipe 2","Score 1","Score 2",null,null,null,"Equipe 1","Equipe 2","Score 1","Score 2",null,null,null,"Equipe 1","Equipe 2","Score 1","Score 2",null,null,null,"Equipe 1","Equipe 2","Score 1","Score 2",null,null,null,"Equipe 1","Equipe 2","Score 1","Score 2"]
[null,{"$f":"Tirage!$B9","v":7},{"$f":"Tirage!$C9","v":10},{"$f":"B7","v":8},{"$f":"VLOOKUP(B3,Inscriptions!$E$19:$F$28,2,FALSE)","v":0},{"$f":"VLOOKUP(C3,Inscriptions!$E$19:$F$28,2,FALSE)","v":0},null,null,{"$f":"Tirage!D9","v":3},{"$f":"Tirage!E9","v":9},{"$f":"I7","v":4},{"$f":"VLOOKUP(I3,Inscriptions!$E$19:$F$28,2,FALSE)","v":0},{"$f":"VLOOKUP(J3,Inscriptions!$E$19:$F$28,2,FALSE)","v":0},null,null,{"$f":"Tirage!$F9","v":10},{"$f":"Tirage!$G9","v":2},{"$f":"P7","v":3},{"$f":"VLOOKUP(P3,Inscriptions!$E$19:$F$28,2,FALSE)","v":0},{"$f":"VLOOKUP(Q3,Inscriptions!$E$19:$F$28,2,FALSE)","v":0},null,null,{"$f":"Tirage!$H9","v":6},{"$f":"Tirage!$I9","v":10},{"$f":"W7","v":1},{"$f":"VLOOKUP(W3,Inscriptions!$E$19:$F$28,2,FALSE)","v":0},{"$f":"VLOOKUP(X3,Inscriptions!$E$19:$F$28,2,FALSE)","v":0},null,null,{"$f":"Tirage!$J9","v":1},{"$f":"Tirage!$K9","v":6},{"$f":"AD7","v":10},{"$f":"VLOOKUP(AD3,Inscriptions!$E$19:$F$28,2,FALSE)","v":0},{"$f":"VLOOKUP(AE3,Inscriptions!$E$19:$F$28,2,FALSE)","v":0},null,null,{"$f":"Tirage!$L9","v":9},{"$f":"Tirage!$M9","v":6},{"$f":"AK7","v":4},{"$f":"VLOOKUP(AK3,Inscriptions!$E$19:$F$28,2,FALSE)","v":0},{"$f":"VLOOKUP(AL3,Inscriptions!$E$19:$F$28,2,FALSE)","v":0},null,null,{"$f":"Tirage!$N9","v":3},{"$f":"Tirage!$O9","v":10},{"$f":"AR7","v":5},{"$f":"VLOOKUP(AR3,Inscriptions!$E$19:$F$28,2,FALSE)","v":0},{"$f":"VLOOKUP(AS3,Inscriptions!$E$19:$F$28,2,FALSE)","v":0},null,null,{"$f":"Tirage!$P9","v":2},{"$f":"Tirage!$Q9","v":9},{"$f":"AY7","v":10},{"$f":"VLOOKUP(AY3,Inscriptions!$E$19:$F$28,2,FALSE)","v":0},{"$f":"VLOOKUP(AZ3,Inscriptions!$E$19:$F$28,2,FALSE)","v":0},null,null,{"$f":"Tirage!$R9","v":6},{"$f":"Tirage!$S9","v":8},{"$f":"BF7","v":3},{"$f":"VLOOKUP(BF3,Inscriptions!$E$19:$F$28,2,FALSE)","v":0},{"$f":"VLOOKUP(BG3,Inscriptions!$E$19:$F$28,2,FALSE)","v":0}]
[null,{"$f":"Tirage!$B10","v":3},{"$f":"Tirage!$C10","v":5},{"$f":"C7","v":4},{"$f":"VLOOKUP(B4,Inscriptions!$E$19:$F$28,2,FALSE)","v":0},{"$f":"VLOOKUP(C4,Inscriptions!$E$19:$F$28,2,FALSE)","v":0},null,null,{"$f":"Tirage!D10","v":2},{"$f":"Tirage!E10","v":1},{"$f":"J7","v":10},{"$f":"VLOOKUP(I4,Inscriptions!$E$19:$F$28,2,FALSE)","v":0},{"$f":"VLOOKUP(J4,Inscriptions!$E$19:$F$28,2,FALSE)","v":0},null,null,{"$f":"Tirage!$F10","v":4},{"$f":"Tirage!$G10","v":7},{"$f":"Q7","v":6},{"$f":"VLOOKUP(P4,Inscriptions!$E$19:$F$28,2,FALSE)","v":0},{"$f":"VLOOKUP(Q4,Inscriptions!$E$19:$F$28,2,FALSE)","v":0},null,null,{"$f":"Tirage!$H10","v":5},{"$f":"Tirage!$I10","v":9},{"$f":"X7","v":7},{"$f":"VLOOKUP(W4,Inscriptions!$E$19:$F$28,2,FALSE)","v":0},{"$f":"VLOOKUP(X4,Inscriptions!$E$19:$F$28,2,FALSE)","v":0},null,null,{"$f":"Tirage!$J10","v":7},{"$f":"Tirage!$K10","v":5},{"$f":"AE7","v":9},{"$f":"VLOOKUP(AD4,Inscriptions!$E$19:$F$28,2,FALSE)","v":0},{"$f":"VLOOKUP(AE4,Inscriptions!$E$19:$F$28,2,FALSE)","v":0},null,null,{"$f":"Tirage!$L10","v":3},{"$f":"Tirage!$M10","v":1},{"$f":"AL7","v":5},{"$f":"VLOOKUP(AK4,Inscriptions!$E$19:$F$28,2,FALSE)","v":0},{"$f":"VLOOKUP(AL4,Inscriptions!$E$19:$F$28,2,FALSE)","v":0},null,null,{"$f":"Tirage!$N10","v":8},{"$f":"Tirage!$O10","v":1},{"$f":"AS7","v":2},{"$f":"VLOOKUP(AR4,Inscriptions!$E$19:$F$28,2,FALSE)","v":0},{"$f":"VLOOKUP(AS4,Inscriptions!$E$19:$F$28,2,FALSE)","v":0},null,null,{"$f":"Tirage!$P10","v":8},{"$f":"Tirage!$Q10","v":5},{"$f":"AZ7","v":1},{"$f":"VLOOKUP(AY4,Inscriptions!$E$19:$F$28,2,FALSE)","v":0},{"$f":"VLOOKUP(AZ4,Inscriptions!$E$19:$F$28,2,FALSE)","v":0},null,null,{"$f":"Tirage!$R10","v":7},{"$f":"Tirage!$S10","v":9},{"$f":"BG7","v":2},{"$f":"VLOOKUP(BF4,Inscriptions!$E$19:$F$28,2,FALSE)","v":0},{"$f":"VLOOKUP(BG4,Inscriptions!$E$19:$F$28,2,FALSE)","v":0}]
[null,{"$f":"Tirage!$B11","v":6},{"$f":"Tirage!$C11","v":2},{"$f":"B6","v":9},{"$f":"VLOOKUP(B5,Inscriptions!$E$19:$F$28,2,FALSE)","v":0},{"$f":"VLOOKUP(C5,Inscriptions!$E$19:$F$28,2,FALSE)","v":0},null,null,{"$f":"Tirage!D11","v":8},{"$f":"Tirage!E11","v":7},{"$f":"I6","v":5},{"$f":"VLOOKUP(I5,Inscriptions!$E$19:$F$28,2,FALSE)","v":0},{"$f":"VLOOKUP(J5,Inscriptions!$E$19:$F$28,2,FALSE)","v":0},null,null,{"$f":"Tirage!$F11","v":8},{"$f":"Tirage!$G11","v":9},{"$f":"P6","v":1},{"$f":"VLOOKUP(P5,Inscriptions!$E$19:$F$28,2,FALSE)","v":0},{"$f":"VLOOKUP(Q5,Inscriptions!$E$19:$F$28,2,FALSE)","v":0},null,null,{"$f":"Tirage!$H11","v":4},{"$f":"Tirage!$I11","v":3},{"$f":"W6","v":8},{"$f":"VLOOKUP(W5,Inscriptions!$E$19:$F$28,2,FALSE)","v":0},{"$f":"VLOOKUP(X5,Inscriptions!$E$19:$F$28,2,FALSE)","v":0},null,null,{"$f":"Tirage!$J11","v":4},{"$f":"Tirage!$K11","v":2},{"$f":"AD6","v":3},{"$f":"VLOOKUP(AD5,Inscriptions!$E$19:$F$28,2,FALSE)","v":0},{"$f":"VLOOKUP(AE5,Inscriptions!$E$19:$F$28,2,FALSE)","v":0},null,null,{"$f":"Tirage!$L11","v":2},{"$f":"Tirage!$M11","v":7},{"$f":"AK6","v":10},{"$f":"VLOOKUP(AK5,Inscriptions!$E$19:$F$28,2,FALSE)","v":0},{"$f":"VLOOKUP(AL5,Inscriptions!$E$19:$F$28,2,FALSE)","v":0},null,null,{"$f":"Tirage!$N11","v":4},{"$f":"Tirage!$O11","v":9},{"$f":"AR6","v":7},{"$f":"VLOOKUP(AR5,Inscriptions!$E$19:$F$28,2,FALSE)","v":0},{"$f":"VLOOKUP(AS5,Inscriptions!$E$19:$F$28,2,FALSE)","v":0},null,null,{"$f":"Tirage!$P11","v":7},{"$f":"Tirage!$Q11","v":3},{"$f":"AY6","v":4},{"$f":"VLOOKUP(AY5,Inscriptions!$E$19:$F$28,2,FALSE)","v":0},{"$f":"VLOOKUP(AZ5,Inscriptions!$E$19:$F$28,2,FALSE)","v":0},null,null,{"$f":"Tirage!$R11","v":4},{"$f":"Tirage!$S11","v":1},{"$f":"BF6","v":10},{"$f":"VLOOKUP(BF5,Inscriptions!$E$19:$F$28,2,FALSE)","v":0},{"$f":"VLOOKUP(BG5,Inscriptions!$E$19:$F$28,2,FALSE)","v":0}]
[null,{"$f":"Tirage!$B12","v":9},{"$f":"Tirage!$C12","v":1},{"$f":"B3","v":7},{"$f":"VLOOKUP(B6,Inscriptions!$E$19:$F$28,2,FALSE)","v":0},{"$f":"VLOOKUP(C6,Inscriptions!$E$19:$F$28,2,FALSE)","v":0},null,null,{"$f":"Tirage!D12","v":5},{"$f":"Tirage!E12","v":6},{"$f":"I3","v":3},{"$f":"VLOOKUP(I6,Inscriptions!$E$19:$F$28,2,FALSE)","v":0},{"$f":"VLOOKUP(J6,Inscriptions!$E$19:$F$28,2,FALSE)","v":0},null,null,{"$f":"Tirage!$F12","v":1},{"$f":"Tirage!$G12","v":5},{"$f":"Q3","v":2},{"$f":"VLOOKUP(P6,Inscriptions!$E$19:$F$28,2,FALSE)","v":0},{"$f":"VLOOKUP(Q6,Inscriptions!$E$19:$F$28,2,FALSE)","v":0},null,null,{"$f":"Tirage!$H12","v":8},{"$f":"Tirage!$I12","v":2},{"$f":"X3","v":10},{"$f":"VLOOKUP(W6,Inscriptions!$E$19:$F$28,2,FALSE)","v":0},{"$f":"VLOOKUP(X6,Inscriptions!$E$19:$F$28,2,FALSE)","v":0},null,null,{"$f":"Tirage!$J12","v":3},{"$f":"Tirage!$K12","v":8},{"$f":"AD4","v":7},{"$f":"VLOOKUP(AD6,Inscriptions!$E$19:$F$28,2,FALSE)","v":0},{"$f":"VLOOKUP(AE6,Inscriptions!$E$19:$F$28,2,FALSE)","v":0},null,null,{"$f":"Tirage!$L12","v":10},{"$f":"Tirage!$M12","v":8},{"$f":"AL3","v":6},{"$f":"VLOOKUP(AK6,Inscriptions!$E$19:$F$28,2,FALSE)","v":0},{"$f":"VLOOKUP(AL6,Inscriptions!$E$19:$F$28,2,FALSE)","v":0},null,null,{"$f":"Tirage!$N12","v":7},{"$f":"Tirage!$O12","v":6},{"$f":"AS4","v":1},{"$f":"VLOOKUP(AR6,Inscriptions!$E$19:$F$28,2,FALSE)","v":0},{"$f":"VLOOKUP(AS6,Inscriptions!$E$19:$F$28,2,FALSE)","v":0},null,null,{"$f":"Tirage!$P12","v":4},{"$f":"Tirage!$Q12","v":6},{"$f":"AY3","v":2},{"$f":"VLOOKUP(AY6,Inscriptions!$E$19:$F$28,2,FALSE)","v":0},{"$f":"VLOOKUP(AZ6,Inscriptions!$E$19:$F$28,2,FALSE)","v":0},null,null,{"$f":"Tirage!$R12","v":10},{"$f":"Tirage!$S12","v":5},{"$f":"BF3","v":6},{"$f":"VLOOKUP(BF6,Inscriptions!$E$19:$F$28,2,FALSE)","v":0},{"$f":"VLOOKUP(BG6,Inscriptions!$E$19:$F$28,2,FALSE)","v":0}]
[null,{"$f":"Tirage!$B13","v":8},{"$f":"Tirage!$C13","v":4},{"$f":"B5","v":6},{"$f":"VLOOKUP(B7,Inscriptions!$E$19:$F$28,2,FALSE)","v":0},{"$f":"VLOOKUP(C7,Inscriptions!$E$19:$F$28,2,FALSE)","v":0},null,null,{"$f":"Tirage!D13","v":4},{"$f":"Tirage!E13","v":10},{"$f":"J3","v":9},{"$f":"VLOOKUP(I7,Inscriptions!$E$19:$F$28,2,FALSE)","v":0},{"$f":"VLOOKUP(J7,Inscriptions!$E$19:$F$28,2,FALSE)","v":0},null,null,{"$f":"Tirage!$F13","v":3},{"$f":"Tirage!$G13","v":6},{"$f":"P5","v":8},{"$f":"VLOOKUP(P7,Inscriptions!$E$19:$F$28,2,FALSE)","v":0},{"$f":"VLOOKUP(Q7,Inscriptions!$E$19:$F$28,2,FALSE)","v":0},null,null,{"$f":"Tirage!$H13","v":1},{"$f":"Tirage!$I13","v":7},{"$f":"W5","v":4},{"$f":"VLOOKUP(W7,Inscriptions!$E$19:$F$28,2,FALSE)","v":0},{"$f":"VLOOKUP(X7,Inscriptions!$E$19:$F$28,2,FALSE)","v":0},null,null,{"$f":"Tirage!$J13","v":10},{"$f":"Tirage!$K13","v":9},{"$f":"AD5","v":4},{"$f":"VLOOKUP(AD7,Inscriptions!$E$19:$F$28,2,FALSE)","v":0},{"$f":"VLOOKUP(AE7,Inscriptions!$E$19:$F$28,2,FALSE)","v":0},null,null,{"$f":"Tirage!$L13","v":4},{"$f":"Tirage!$M13","v":5},{"$f":"AK5","v":2},{"$f":"VLOOKUP(AK7,Inscriptions!$E$19:$F$28,2,FALSE)","v":0},{"$f":"VLOOKUP(AL7,Inscriptions!$E$19:$F$28,2,FALSE)","v":0},null,null,{"$f":"Tirage!$N13","v":5},{"$f":"Tirage!$O13","v":2},{"$f":"AR5","v":4},{"$f":"VLOOKUP(AR7,Inscriptions!$E$19:$F$28,2,FALSE)","v":0},{"$f":"VLOOKUP(AS7,Inscriptions!$E$19:$F$28,2,FALSE)","v":0},null,null,{"$f":"Tirage!$P13","v":10},{"$f":"Tirage!$Q13","v":1},{"$f":"AY5","v":7},{"$f":"VLOOKUP(AY7,Inscriptions!$E$19:$F$28,2,FALSE)","v":0},{"$f":"VLOOKUP(AZ7,Inscriptions!$E$19:$F$28,2,FALSE)","v":0},null,null,{"$f":"Tirage!$R13","v":3},{"$f":"Tirage!$S13","v":2},{"$f":"BG3","v":8},{"$f":"VLOOKUP(BF7,Inscriptions!$E$19:$F$28,2,FALSE)","v":0},{"$f":"VLOOKUP(BG7,Inscriptions!$E$19:$F$28,2,FALSE)","v":0}]
[null,null,null,null,null,null,"Mettre ab pour abandon",null,null,null,null,null,null,"Mettre ab pour abandon",null,null,null,null,null,null,"Mettre ab pour abandon",null,null,null,null,null,null,"Mettre ab pour abandon",null,null,null,null,null,null,"Mettre ab pour abandon",null,null,null,null,null,null,"Mettre ab pour abandon",null,null,null,null,null,null,"Mettre ab pour abandon",null,null,null,null,null,null,"Mettre ab pour abandon",null,null,null,null,null,null,"Mettre ab pour abandon"]
[null,null,null,null,null,null,null,null,null,null,null,null,"JOURNEE 6",null,null,null,null,null,null,null,null,null,null,null,null,null,null,null,null,null,null,null,null,null,null,null,null,null,null,null,null,"Mettre ex pour exempt",null,null,null,null,null,null,"Mettre ex pour exempt"]
[]
[null,null,null,null,"TOUR 1",null,null,null,null,null,null,"TOUR 2",null,null,null,null,null,null,"TOUR 3",null,null,null,null,null,null,"TOUR 4",null,null,null,null,null,null,"TOUR 5",null,null,null,null,null,null,"TOUR 6",null,null,null,null,null,null,"TOUR 7",null,null,null,null,null,null,"TOUR 8",null,null,null,null,null,null,"TOUR 9"]
[]
[null,null,null,null,"Equipes","Score pour","Score contre","Pts ",null,null,null,"Equipes","Score pour","Score contre","Pts ",null,null,null,"Equipes","Score pour","Score contre","Pts ",null,null,null,"Equipes","Score pour","Score contre","Pts ",null,null,null,"Equipes","Score pour","Score contre","Pts ",null,null,null,"Equipes","Score pour","Score contre","Pts ",null,null,null,"Equipes","Score pour","Score contre","Pts ",null,null,null,"Equipes","Score pour","Score contre","Pts ",null,null,null,"Equipes","Score pour","Score contre","Pts "]
[null,{"$f":"Tirage!$B9","v":7},null,null,{"$f":"VLOOKUP(B14,Inscriptions!$E$19:$F$28,2,FALSE)","v":0},{"$f":"IFERROR(VLOOKUP(E14,$E$3:$G$7,3,0),\"\")&IFERROR(VLOOKUP(E14,$F$3:$H$7,3,0),\"\")","v":""},{"$f":"IFERROR(VLOOKUP(E14,$E$3:$H$7,4,0),\"\")&IFERROR(VLOOKUP(E14,$F$3:$H$7,2,0),\"\")","v":""},{"$f":"IF(E15=0,0,IF(COUNTBLANK(F14:G14),\"\",VLOOKUP(F14&G14,CHOOSE({1,2},tPts32457[Score 1]&tPts32457[Score 2],tPts32457[Pts]),2,0)))","v":0},{"$f":"I3","v":3},null,null,{"$f":"VLOOKUP(I14,Inscriptions!$E$19:$F$28,2,FALSE)","v":0},{"$f":"IFERROR(VLOOKUP(L14,$L$3:$N$7,3,0),\"\")&IFERROR(VLOOKUP(L14,$M$3:$O$7,3,0),\"\")","v":""},{"$f":"IFERROR(VLOOKUP(L14,$L$3:$O$7,4,0),\"\")&IFERROR(VLOOKUP(L14,$M$3:$O$7,2,0),\"\")","v":""},{"$f":"IF(L14=0,0,IF(COUNTBLANK(M14:N14),\"\",VLOOKUP(M14&N14,CHOOSE({1,2},tPts32457[Score 1]&tPts32457[Score 2],tPts32457[Pts]),2,0)))","v":0},{"$f":"Tirage!$F9","v":10},null,null,{"$f":"VLOOKUP(P14,Inscriptions!$E$19:$F$28,2,FALSE)","v":0},{"$f":"IFERROR(VLOOKUP(S14,$S$3:$U$7,3,0),\"\")&IFERROR(VLOOKUP(S14,$T$3:$V$7,3,0),\"\")","v":""},{"$f":"IFERROR(VLOOKUP(S14,$S$3:$V$7,4,0),\"\")&IFERROR(VLOOKUP(S14,$T$3:$V$7,2,0),\"\")","v":""},{"$f":"IF(COUNTBLANK(T14:U14),\"\",VLOOKUP(T14&U14,CHOOSE({1,2},tPts32457[Score 1]&tPts32457[Score 2],tPts32457[Pts]),2,0))","v":""},{"$f":"W3","v":6},null,null,{"$f":"VLOOKUP(W14,Inscriptions!$E$19:$F$28,2,FALSE)","v":0},{"$f":"IFERROR(VLOOKUP(Z14,$Z$3:$AB$7,3,0),\"\")&IFERROR(VLOOKUP(Z14,$AA$3:$AC$7,3,0),\"\")","v":""},{"$f":"IFERROR(VLOOKUP(Z14,$Z$3:$AC$7,4,0),\"\")&IFERROR(VLOOKUP(Z14,$AA$3:$AC$7,2,0),\"\")","v":""},{"$f":"IF(COUNTBLANK(AA14:AB14),\"\",VLOOKUP(AA14&AB14,CHOOSE({1,2},tPts32457[Score 1]&tPts32457[Score 2],tPts32457[Pts]),2,0))","v":""},{"$f":"Tirage!$J9","v":1},null,null,{"$f":"VLOOKUP(AD14,Inscriptions!$E$19:$F$28,2,FALSE)","v":0},{"$f":"IFERROR(VLOOKUP(AG14,$AG$3:$AI$7,3,0),\"\")&IFERROR(VLOOKUP(AG14,$AH$3:$AJ$7,3,0),\"\")","v":""},{"$f":"IFERROR(VLOOKUP(AG14,$AG$3:$AJ$7,4,0),\"\")&IFERROR(VLOOKUP(AG14,$AH$3:$AJ$7,2,0),\"\")","v":""},{"$f":"IF(COUNTBLANK(AH14:AI14),\"\",VLOOKUP(AH14&AI14,CHOOSE({1,2},tPts32457[Score 1]&tPts32457[Score 2],tPts32457[Pts]),2,0))","v":""},{"$f":"Tirage!$L9","v":9},null,null,{"$f":"VLOOKUP(AK14,Inscriptions!$E$19:$F$28,2,FALSE)","v":0},{"$f":"IFERROR(VLOOKUP(AN14,$AN$3:$AP$7,3,0),\"\")&IFERROR(VLOOKUP(AN14,$AO$3:$AQ$7,3,0),\"\")","v":""},{"$f":"IFERROR(VLOOKUP(AN14,$AN$3:$AQ$7,4,0),\"\")&IFERROR(VLOOKUP(AN14,$AO$3:$AQ$7,2,0),\"\")","v":""},{"$f":"IF(COUNTBLANK(AO14:AP14),\"\",VLOOKUP(AO14&AP14,CHOOSE({1,2},tPts32457[Score 1]&tPts32457[Score 2],tPts32457[Pts]),2,0))","v":""},{"$f":"Tirage!$N9","v":3},null,null,{"$f":"VLOOKUP(AR14,Inscriptions!$E$19:$F$28,2,FALSE)","v":0},{"$f":"IFERROR(VLOOKUP(AU14,AU$3:AW$7,3,0),\"\")&IFERROR(VLOOKUP(AU14,AV$3:AX$7,3,0),\"\")","v":""},{"$f":"IFERROR(VLOOKUP(AU14,AU$3:AX$7,4,0),\"\")&IFERROR(VLOOKUP(AU14,AV$3:AX$7,2,0),\"\")","v":""},{"$f":"IF(COUNTBLANK(AV14:AW14),\"\",VLOOKUP(AV14&AW14,CHOOSE({1,2},tPts32457[Score 1]&tPts32457[Score 2],tPts32457[Pts]),2,0))","v":""},{"$f":"Tirage!$P9","v":2},null,null,{"$f":"VLOOKUP(AY14,Inscriptions!$E$19:$F$28,2,FALSE)","v":0},{"$f":"IFERROR(VLOOKUP(BB14,$BB$3:BD$7,3,0),\"\")&IFERROR(VLOOKUP(BB14,$BC$3:$BE$7,3,0),\"\")","v":""},{"$f":"IFERROR(VLOOKUP(BB14,$BB$3:$BE$7,4,0),\"\")&IFERROR(VLOOKUP(BB14,$BC$3:$BE$7,2,0),\"\")","v":""},{"$f":"IF(COUNTBLANK(BC14:BD14),\"\",VLOOKUP(BC14&BD14,CHOOSE({1,2},tPts32457[Score 1]&tPts32457[Score 2],tPts32457[Pts]),2,0))","v":""},{"$f":"Tirage!$R9","v":6},null,null,{"$f":"VLOOKUP(BF14,Inscriptions!$E$19:$F$28,2,FALSE)","v":0},{"$f":"IFERROR(VLOOKUP(BI14,$BI$3:BK$7,3,0),\"\")&IFERROR(VLOOKUP(BI14,$BJ$3:$BL$7,3,0),\"\")","v":""},{"$f":"IFERROR(VLOOKUP(BI14,$BI$3:$BL$7,4,0),\"\")&IFERROR(VLOOKUP(BI14,$BJ$3:$BL$7,2,0),\"\")","v":""},{"$f":"IF(COUNTBLANK(BJ14:BK14),\"\",VLOOKUP(BJ14&BK14,CHOOSE({1,2},tPts32457[Score 1]&tPts32457[Score 2],tPts32457[Pts]),2,0))","v":""}]
[null,{"$f":"Tirage!$B10","v":3},null,null,{"$f":"VLOOKUP(B15,Inscriptions!$E$19:$F$28,2,FALSE)","v":0},{"$f":"IFERROR(VLOOKUP(E15,$E$3:$G$7,3,0),\"\")&IFERROR(VLOOKUP(E15,$F$3:$H$7,3,0),\"\")","v":""},{"$f":"IFERROR(VLOOKUP(E15,$E$3:$H$7,4,0),\"\")&IFERROR(VLOOKUP(E15,$F$3:$H$7,2,0),\"\")","v":""},{"$f":"IF(E16=0,0,IF(COUNTBLANK(F15:G15),\"\",VLOOKUP(F15&G15,CHOOSE({1,2},tPts32457[Score 1]&tPts32457[Score 2],tPts32457[Pts]),2,0)))","v":0},{"$f":"I4","v":2},null,null,{"$f":"VLOOKUP(I15,Inscriptions!$E$19:$F$28,2,FALSE)","v":0},{"$f":"IFERROR(VLOOKUP(L15,$L$3:$N$7,3,0),\"\")&IFERROR(VLOOKUP(L15,$M$3:$O$7,3,0),\"\")","v":""},{"$f":"IFERROR(VLOOKUP(L15,$L$3:$O$7,4,0),\"\")&IFERROR(VLOOKUP(L15,$M$3:$O$7,2,0),\"\")","v":""},{"$f":"IF(L15=0,0,IF(COUNTBLANK(M15:N15),\"\",VLOOKUP(M15&N15,CHOOSE({1,2},tPts32457[Score 1]&tPts32457[Score 2],tPts32457[Pts]),2,0)))","v":0},{"$f":"Tirage!$F10","v":4},null,null,{"$f":"VLOOKUP(P15,Inscriptions!$E$19:$F$28,2,FALSE)","v":0},{"$f":"IFERROR(VLOOKUP(S15,$S$3:$U$7,3,0),\"\")&IFERROR(VLOOKUP(S15,$T$3:$V$7,3,0),\"\")","v":""},{"$f":"IFERROR(VLOOKUP(S15,$S$3:$V$7,4,0),\"\")&IFERROR(VLOOKUP(S15,$T$3:$V$7,2,0),\"\")","v":""},{"$f":"IF(COUNTBLANK(T15:U15),\"\",VLOOKUP(T15&U15,CHOOSE({1,2},tPts32457[Score 1]&tPts32457[Score 2],tPts32457[Pts]),2,0))","v":""},{"$f":"W4","v":5},null,null,{"$f":"VLOOKUP(W15,Inscriptions!$E$19:$F$28,2,FALSE)","v":0},{"$f":"IFERROR(VLOOKUP(Z15,$Z$3:$AB$7,3,0),\"\")&IFERROR(VLOOKUP(Z15,$AA$3:$AC$7,3,0),\"\")","v":""},{"$f":"IFERROR(VLOOKUP(Z15,$Z$3:$AC$7,4,0),\"\")&IFERROR(VLOOKUP(Z15,$AA$3:$AC$7,2,0),\"\")","v":""},{"$f":"IF(COUNTBLANK(AA15:AB15),\"\",VLOOKUP(AA15&AB15,CHOOSE({1,2},tPts32457[Score 1]&tPts32457[Score 2],tPts32457[Pts]),2,0))","v":""},{"$f":"Tirage!$J10","v":7},null,null,{"$f":"VLOOKUP(AD15,Inscriptions!$E$19:$F$28,2,FALSE)","v":0},{"$f":"IFERROR(VLOOKUP(AG15,$AG$3:$AI$7,3,0),\"\")&IFERROR(VLOOKUP(AG15,$AH$3:$AJ$7,3,0),\"\")","v":""},{"$f":"IFERROR(VLOOKUP(AG15,$AG$3:$AJ$7,4,0),\"\")&IFERROR(VLOOKUP(AG15,$AH$3:$AJ$7,2,0),\"\")","v":""},{"$f":"IF(COUNTBLANK(AH15:AI15),\"\",VLOOKUP(AH15&AI15,CHOOSE({1,2},tPts32457[Score 1]&tPts32457[Score 2],tPts32457[Pts]),2,0))","v":""},{"$f":"Tirage!$L10","v":3},null,null,{"$f":"VLOOKUP(AK15,Inscriptions!$E$19:$F$28,2,FALSE)","v":0},{"$f":"IFERROR(VLOOKUP(AN15,$AN$3:$AP$7,3,0),\"\")&IFERROR(VLOOKUP(AN15,$AO$3:$AQ$7,3,0),\"\")","v":""},{"$f":"IFERROR(VLOOKUP(AN15,$AN$3:$AQ$7,4,0),\"\")&IFERROR(VLOOKUP(AN15,$AO$3:$AQ$7,2,0),\"\")","v":""},{"$f":"IF(COUNTBLANK(AO15:AP15),\"\",VLOOKUP(AO15&AP15,CHOOSE({1,2},tPts32457[Score 1]&tPts32457[Score 2],tPts32457[Pts]),2,0))","v":""},{"$f":"Tirage!$N10","v":8},null,null,{"$f":"VLOOKUP(AR15,Inscriptions!$E$19:$F$28,2,FALSE)","v":0},{"$f":"IFERROR(VLOOKUP(AU15,AU$3:AW$7,3,0),\"\")&IFERROR(VLOOKUP(AU15,AV$3:AX$7,3,0),\"\")","v":""},{"$f":"IFERROR(VLOOKUP(AU15,AU$3:AX$7,4,0),\"\")&IFERROR(VLOOKUP(AU15,AV$3:AX$7,2,0),\"\")","v":""},{"$f":"IF(COUNTBLANK(AV15:AW15),\"\",VLOOKUP(AV15&AW15,CHOOSE({1,2},tPts32457[Score 1]&tPts32457[Score 2],tPts32457[Pts]),2,0))","v":""},{"$f":"Tirage!$P10","v":8},null,null,{"$f":"VLOOKUP(AY15,Inscriptions!$E$19:$F$28,2,FALSE)","v":0},{"$f":"IFERROR(VLOOKUP(BB15,$BB$3:BD$7,3,0),\"\")&IFERROR(VLOOKUP(BB15,$BC$3:$BE$7,3,0),\"\")","v":""},{"$f":"IFERROR(VLOOKUP(BB15,$BB$3:$BE$7,4,0),\"\")&IFERROR(VLOOKUP(BB15,$BC$3:$BE$7,2,0),\"\")","v":""},{"$f":"IF(COUNTBLANK(BC15:BD15),\"\",VLOOKUP(BC15&BD15,CHOOSE({1,2},tPts32457[Score 1]&tPts32457[Score 2],tPts32457[Pts]),2,0))","v":""},{"$f":"Tirage!$R10","v":7},null,null,{"$f":"VLOOKUP(BF15,Inscriptions!$E$19:$F$28,2,FALSE)","v":0},{"$f":"IFERROR(VLOOKUP(BI15,$BI$3:BK$7,3,0),\"\")&IFERROR(VLOOKUP(BI15,$BJ$3:$BL$7,3,0),\"\")","v":""},"",{"$f":"IF(COUNTBLANK(BJ15:BK15),\"\",VLOOKUP(BJ15&BK15,CHOOSE({1,2},tPts32457[Score 1]&tPts32457[Score 2],tPts32457[Pts]),2,0))","v":""}]
[null,{"$f":"Tirage!$B11","v":6},null,null,{"$f":"VLOOKUP(B16,Inscriptions!$E$19:$F$28,2,FALSE)","v":0},"","",{"$f":"IF(E17=0,0,IF(COUNTBLANK(F16:G16),\"\",VLOOKUP(F16&G16,CHOOSE({1,2},tPts32457[Score 1]&tPts32457[Score 2],tPts32457[Pts]),2,0)))","v":0},8,null,null,{"$f":"VLOOKUP(I16,Inscriptions!$E$19:$F$28,2,FALSE)","v":0},"","",{"$f":"IF(L16=0,0,IF(COUNTBLANK(M16:N16),\"\",VLOOKUP(M16&N16,CHOOSE({1,2},tPts32457[Score 1]&tPts32457[Score 2],tPts32457[Pts]),2,0)))","v":0},{"$f":"Tirage!$F11","v":8},null,null,{"$f":"VLOOKUP(P16,Inscriptions!$E$19:$F$28,2,FALSE)","v":0},"","",{"$f":"IF(COUNTBLANK(T16:U16),\"\",VLOOKUP(T16&U16,CHOOSE({1,2},tPts32457[Score 1]&tPts32457[Score 2],tPts32457[Pts]),2,0))","v":""},{"$f":"W5","v":4},null,null,{"$f":"VLOOKUP(W16,Inscriptions!$E$19:$F$28,2,FALSE)","v":0},"","",{"$f":"IF(COUNTBLANK(AA16:AB16),\"\",VLOOKUP(AA16&AB16,CHOOSE({1,2},tPts32457[Score 1]&tPts32457[Score 2],tPts32457[Pts]),2,0))","v":""},{"$f":"Tirage!$J11","v":4},null,null,{"$f":"VLOOKUP(AD16,Inscriptions!$E$19:$F$28,2,FALSE)","v":0},"","",{"$f":"IF(COUNTBLANK(AH16:AI16),\"\",VLOOKUP(AH16&AI16,CHOOSE({1,2},tPts32457[Score 1]&tPts32457[Score 2],tPts32457[Pts]),2,0))","v":""},{"$f":"Tirage!$L11","v":2},null,null,{"$f":"VLOOKUP(AK16,Inscriptions!$E$19:$F$28,2,FALSE)","v":0},"","",{"$f":"IF(COUNTBLANK(AO16:AP16),\"\",VLOOKUP(AO16&AP16,CHOOSE({1,2},tPts32457[Score 1]&tPts32457[Score 2],tPts32457[Pts]),2,0))","v":""},{"$f":"Tirage!$N11","v":4},null,null,{"$f":"VLOOKUP(AR16,Inscriptions!$E$19:$F$28,2,FALSE)","v":0},"","",{"$f":"IF(COUNTBLANK(AV16:AW16),\"\",VLOOKUP(AV16&AW16,CHOOSE({1,2},tPts32457[Score 1]&tPts32457[Score 2],tPts32457[Pts]),2,0))","v":""},{"$f":"Tirage!$P11","v":7},null,null,{"$f":"VLOOKUP(AY16,Inscriptions!$E$19:$F$28,2,FALSE)","v":0},{"$f":"IFERROR(VLOOKUP(BB16,$BB$3:BD$7,3,0),\"\")&IFERROR(VLOOKUP(BB16,$BC$3:$BE$7,3,0),\"\")","v":""},"",{"$f":"IF(COUNTBLANK(BC16:BD16),\"\",VLOOKUP(BC16&BD16,CHOOSE({1,2},tPts32457[Score 1]&tPts32457[Score 2],tPts32457[Pts]),2,0))","v":""},{"$f":"Tirage!$R11","v":4},null,null,{"$f":"VLOOKUP(BF16,Inscriptions!$E$19:$F$28,2,FALSE)","v":0},{"$f":"IFERROR(VLOOKUP(BI16,$BI$3:BK$7,3,0),\"\")&IFERROR(VLOOKUP(BI16,$BJ$3:$BL$7,3,0),\"\")","v":""},"",{"$f":"IF(COUNTBLANK(BJ16:BK16),\"\",VLOOKUP(BJ16&BK16,CHOOSE({1,2},tPts32457[Score 1]&tPts32457[Score 2],tPts32457[Pts]),2,0))","v":""}]
[null,{"$f":"Tirage!$B12","v":9},null,null,{"$f":"VLOOKUP(B17,Inscriptions!$E$19:$F$28,2,FALSE)","v":0},"","",{"$f":"IF(E18=0,0,IF(COUNTBLANK(F17:G17),\"\",VLOOKUP(F17&G17,CHOOSE({1,2},tPts32457[Score 1]&tPts32457[Score 2],tPts32457[Pts]),2,0)))","v":0},5,null,null,{"$f":"VLOOKUP(I17,Inscriptions!$E$19:$F$28,2,FALSE)","v":0},"","",{"$f":"IF(L17=0,0,IF(COUNTBLANK(M17:N17),\"\",VLOOKUP(M17&N17,CHOOSE({1,2},tPts32457[Score 1]&tPts32457[Score 2],tPts32457[Pts]),2,0)))","v":0},{"$f":"Tirage!$F12","v":1},null,null,{"$f":"VLOOKUP(P17,Inscriptions!$E$19:$F$28,2,FALSE)","v":0},"","",{"$f":"IF(COUNTBLANK(T17:U17),\"\",VLOOKUP(T17&U17,CHOOSE({1,2},tPts32457[Score 1]&tPts32457[Score 2],tPts32457[Pts]),2,0))","v":""},{"$f":"W6","v":8},null,null,{"$f":"VLOOKUP(W17,Inscriptions!$E$19:$F$28,2,FALSE)","v":0},"","",{"$f":"IF(COUNTBLANK(AA17:AB17),\"\",VLOOKUP(AA17&AB17,CHOOSE({1,2},tPts32457[Score 1]&tPts32457[Score 2],tPts32457[Pts]),2,0))","v":""},{"$f":"Tirage!$J12","v":3},null,null,{"$f":"VLOOKUP(AD17,Inscriptions!$E$19:$F$28,2,FALSE)","v":0},"","",{"$f":"IF(COUNTBLANK(AH17:AI17),\"\",VLOOKUP(AH17&AI17,CHOOSE({1,2},tPts32457[Score 1]&tPts32457[Score 2],tPts32457[Pts]),2,0))","v":""},{"$f":"Tirage!$L12","v":10},null,null,{"$f":"VLOOKUP(AK17,Inscriptions!$E$19:$F$28,2,FALSE)","v":0},"","",{"$f":"IF(COUNTBLANK(AO17:AP17),\"\",VLOOKUP(AO17&AP17,CHOOSE({1,2},tPts32457[Score 1]&tPts32457[Score 2],tPts32457[Pts]),2,0))","v":""},{"$f":"Tirage!$N12","v":7},null,null,{"$f":"VLOOKUP(AR17,Inscriptions!$E$19:$F$28,2,FALSE)","v":0},"","",{"$f":"IF(COUNTBLANK(AV17:AW17),\"\",VLOOKUP(AV17&AW17,CHOOSE({1,2},tPts32457[Score 1]&tPts32457[Score 2],tPts32457[Pts]),2,0))","v":""},{"$f":"Tirage!$P12","v":4},null,null,{"$f":"VLOOKUP(AY17,Inscriptions!$E$19:$F$28,2,FALSE)","v":0},{"$f":"IFERROR(VLOOKUP(BB17,$BB$3:BD$7,3,0),\"\")&IFERROR(VLOOKUP(BB17,$BC$3:$BE$7,3,0),\"\")","v":""},"",{"$f":"IF(COUNTBLANK(BC17:BD17),\"\",VLOOKUP(BC17&BD17,CHOOSE({1,2},tPts32457[Score 1]&tPts32457[Score 2],tPts32457[Pts]),2,0))","v":""},{"$f":"Tirage!$R12","v":10},null,null,{"$f":"VLOOKUP(BF17,Inscriptions!$E$19:$F$28,2,FALSE)","v":0},{"$f":"IFERROR(VLOOKUP(BI17,$BI$3:BK$7,3,0),\"\")&IFERROR(VLOOKUP(BI17,$BJ$3:$BL$7,3,0),\"\")","v":""},"",{"$f":"IF(COUNTBLANK(BJ17:BK17),\"\",VLOOKUP(BJ17&BK17,CHOOSE({1,2},tPts32457[Score 1]&tPts32457[Score 2],tPts32457[Pts]),2,0))","v":""}]
[null,{"$f":"Tirage!$B13","v":8},null,null,{"$f":"VLOOKUP(B18,Inscriptions!$E$19:$F$28,2,FALSE)","v":0},"","",{"$f":"IF(E19=0,0,IF(COUNTBLANK(F18:G18),\"\",VLOOKUP(F18&G18,CHOOSE({1,2},tPts32457[Score 1]&tPts32457[Score 2],tPts32457[Pts]),2,0)))","v":0},4,null,null,{"$f":"VLOOKUP(I18,Inscriptions!$E$19:$F$28,2,FALSE)","v":0},"","",{"$f":"IF(L18=0,0,IF(COUNTBLANK(M18:N18),\"\",VLOOKUP(M18&N18,CHOOSE({1,2},tPts32457[Score 1]&tPts32457[Score 2],tPts32457[Pts]),2,0)))","v":0},{"$f":"Tirage!$F13","v":3},null,null,{"$f":"VLOOKUP(P18,Inscriptions!$E$19:$F$28,2,FALSE)","v":0},"","",{"$f":"IF(COUNTBLANK(T18:U18),\"\",VLOOKUP(T18&U18,CHOOSE({1,2},tPts32457[Score 1]&tPts32457[Score 2],tPts32457[Pts]),2,0))","v":""},{"$f":"W7","v":1},null,null,{"$f":"VLOOKUP(W18,Inscriptions!$E$19:$F$28,2,FALSE)","v":0},"","",{"$f":"IF(COUNTBLANK(AA18:AB18),\"\",VLOOKUP(AA18&AB18,CHOOSE({1,2},tPts32457[Score 1]&tPts32457[Score 2],tPts32457[Pts]),2,0))","v":""},{"$f":"Tirage!$J13","v":10},null,null,{"$f":"VLOOKUP(AD18,Inscriptions!$E$19:$F$28,2,FALSE)","v":0},"","",{"$f":"IF(COUNTBLANK(AH18:AI18),\"\",VLOOKUP(AH18&AI18,CHOOSE({1,2},tPts32457[Score 1]&tPts32457[Score 2],tPts32457[Pts]),2,0))","v":""},{"$f":"Tirage!$L13","v":4},null,null,{"$f":"VLOOKUP(AK18,Inscriptions!$E$19:$F$28,2,FALSE)","v":0},"","",{"$f":"IF(COUNTBLANK(AO18:AP18),\"\",VLOOKUP(AO18&AP18,CHOOSE({1,2},tPts32457[Score 1]&tPts32457[Score 2],tPts32457[Pts]),2,0))","v":""},{"$f":"Tirage!$N13","v":5},null,null,{"$f":"VLOOKUP(AR18,Inscriptions!$E$19:$F$28,2,FALSE)","v":0},"","",{"$f":"IF(COUNTBLANK(AV18:AW18),\"\",VLOOKUP(AV18&AW18,CHOOSE({1,2},tPts32457[Score 1]&tPts32457[Score 2],tPts32457[Pts]),2,0))","v":""},{"$f":"Tirage!$P13","v":10},null,null,{"$f":"VLOOKUP(AY18,Inscriptions!$E$19:$F$28,2,FALSE)","v":0},{"$f":"IFERROR(VLOOKUP(BB18,$BB$3:BD$7,3,0),\"\")&IFERROR(VLOOKUP(BB18,$BC$3:$BE$7,3,0),\"\")","v":""},"",{"$f":"IF(COUNTBLANK(BC18:BD18),\"\",VLOOKUP(BC18&BD18,CHOOSE({1,2},tPts32457[Score 1]&tPts32457[Score 2],tPts32457[Pts]),2,0))","v":""},{"$f":"Tirage!$R13","v":3},null,null,{"$f":"VLOOKUP(BF18,Inscriptions!$E$19:$F$28,2,FALSE)","v":0},{"$f":"IFERROR(VLOOKUP(BI18,$BI$3:BK$7,3,0),\"\")&IFERROR(VLOOKUP(BI18,$BJ$3:$BL$7,3,0),\"\")","v":""},"",{"$f":"IF(COUNTBLANK(BJ18:BK18),\"\",VLOOKUP(BJ18&BK18,CHOOSE({1,2},tPts32457[Score 1]&tPts32457[Score 2],tPts32457[Pts]),2,0))","v":""}]
[null,{"$f":"Tirage!$C9","v":10},null,null,{"$f":"VLOOKUP(B19,Inscriptions!$E$19:$F$28,2,FALSE)","v":0},"","",{"$f":"IF(E20=0,0,IF(COUNTBLANK(F19:G19),\"\",VLOOKUP(F19&G19,CHOOSE({1,2},tPts32457[Score 1]&tPts32457[Score 2],tPts32457[Pts]),2,0)))","v":0},{"$f":"J3","v":9},null,null,{"$f":"VLOOKUP(I19,Inscriptions!$E$19:$F$28,2,FALSE)","v":0},"","",{"$f":"IF(L19=0,0,IF(COUNTBLANK(M19:N19),\"\",VLOOKUP(M19&N19,CHOOSE({1,2},tPts32457[Score 1]&tPts32457[Score 2],tPts32457[Pts]),2,0)))","v":0},{"$f":"Tirage!$G9","v":2},null,null,{"$f":"VLOOKUP(P19,Inscriptions!$E$19:$F$28,2,FALSE)","v":0},"","",{"$f":"IF(COUNTBLANK(T19:U19),\"\",VLOOKUP(T19&U19,CHOOSE({1,2},tPts32457[Score 1]&tPts32457[Score 2],tPts32457[Pts]),2,0))","v":""},{"$f":"X3","v":10},null,null,{"$f":"VLOOKUP(W19,Inscriptions!$E$19:$F$28,2,FALSE)","v":0},"","",{"$f":"IF(COUNTBLANK(AA19:AB19),\"\",VLOOKUP(AA19&AB19,CHOOSE({1,2},tPts32457[Score 1]&tPts32457[Score 2],tPts32457[Pts]),2,0))","v":""},{"$f":"Tirage!$K9","v":6},null,null,{"$f":"VLOOKUP(AD19,Inscriptions!$E$19:$F$28,2,FALSE)","v":0},"","",{"$f":"IF(COUNTBLANK(AH19:AI19),\"\",VLOOKUP(AH19&AI19,CHOOSE({1,2},tPts32457[Score 1]&tPts32457[Score 2],tPts32457[Pts]),2,0))","v":""},{"$f":"Tirage!$M9","v":6},null,null,{"$f":"VLOOKUP(AK19,Inscriptions!$E$19:$F$28,2,FALSE)","v":0},"","",{"$f":"IF(COUNTBLANK(AO19:AP19),\"\",VLOOKUP(AO19&AP19,CHOOSE({1,2},tPts32457[Score 1]&tPts32457[Score 2],tPts32457[Pts]),2,0))","v":""},{"$f":"Tirage!$O9","v":10},null,null,{"$f":"VLOOKUP(AR19,Inscriptions!$E$19:$F$28,2,FALSE)","v":0},"","",{"$f":"IF(COUNTBLANK(AV19:AW19),\"\",VLOOKUP(AV19&AW19,CHOOSE({1,2},tPts32457[Score 1]&tPts32457[Score 2],tPts32457[Pts]),2,0))","v":""},{"$f":"Tirage!$Q9","v":9},null,null,{"$f":"VLOOKUP(AY19,Inscriptions!$E$19:$F$28,2,FALSE)","v":0},{"$f":"IFERROR(VLOOKUP(BB19,$BB$3:BD$7,3,0),\"\")&IFERROR(VLOOKUP(BB19,$BC$3:$BE$7,3,0),\"\")","v":""},"",{"$f":"IF(COUNTBLANK(BC19:BD19),\"\",VLOOKUP(BC19&BD19,CHOOSE({1,2},tPts32457[Score 1]&tPts32457[Score 2],tPts32457[Pts]),2,0))","v":""},{"$f":"Tirage!$S9","v":8},null,null,{"$f":"VLOOKUP(BF19,Inscriptions!$E$19:$F$28,2,FALSE)","v":0},{"$f":"IFERROR(VLOOKUP(BI19,$BI$3:BK$7,3,0),\"\")&IFERROR(VLOOKUP(BI19,$BJ$3:$BL$7,3,0),\"\")","v":""},"",{"$f":"IF(COUNTBLANK(BJ19:BK19),\"\",VLOOKUP(BJ19&BK19,CHOOSE({1,2},tPts32457[Score 1]&tPts32457[Score 2],tPts32457[Pts]),2,0))","v":""}]
[null,{"$f":"Tirage!$C10","v":5},null,null,{"$f":"VLOOKUP(B20,Inscriptions!$E$19:$F$28,2,FALSE)","v":0},"","",{"$f":"IF(E21=0,0,IF(COUNTBLANK(F20:G20),\"\",VLOOKUP(F20&G20,CHOOSE({1,2},tPts32457[Score 1]&tPts32457[Score 2],tPts32457[Pts]),2,0)))","v":0},{"$f":"J4","v":1},null,null,{"$f":"VLOOKUP(I20,Inscriptions!$E$19:$F$28,2,FALSE)","v":0},"","",{"$f":"IF(L20=0,0,IF(COUNTBLANK(M20:N20),\"\",VLOOKUP(M20&N20,CHOOSE({1,2},tPts32457[Score 1]&tPts32457[Score 2],tPts32457[Pts]),2,0)))","v":0},{"$f":"Tirage!$G10","v":7},null,null,{"$f":"VLOOKUP(P20,Inscriptions!$E$19:$F$28,2,FALSE)","v":0},"","",{"$f":"IF(COUNTBLANK(T20:U20),\"\",VLOOKUP(T20&U20,CHOOSE({1,2},tPts32457[Score 1]&tPts32457[Score 2],tPts32457[Pts]),2,0))","v":""},{"$f":"X4","v":9},null,null,{"$f":"VLOOKUP(W20,Inscriptions!$E$19:$F$28,2,FALSE)","v":0},"","",{"$f":"IF(COUNTBLANK(AA20:AB20),\"\",VLOOKUP(AA20&AB20,CHOOSE({1,2},tPts32457[Score 1]&tPts32457[Score 2],tPts32457[Pts]),2,0))","v":""},{"$f":"Tirage!$K10","v":5},null,null,{"$f":"VLOOKUP(AD20,Inscriptions!$E$19:$F$28,2,FALSE)","v":0},"","",{"$f":"IF(COUNTBLANK(AH20:AI20),\"\",VLOOKUP(AH20&AI20,CHOOSE({1,2},tPts32457[Score 1]&tPts32457[Score 2],tPts32457[Pts]),2,0))","v":""},{"$f":"Tirage!$M10","v":1},null,null,{"$f":"VLOOKUP(AK20,Inscriptions!$E$19:$F$28,2,FALSE)","v":0},"","",{"$f":"IF(COUNTBLANK(AO20:AP20),\"\",VLOOKUP(AO20&AP20,CHOOSE({1,2},tPts32457[Score 1]&tPts32457[Score 2],tPts32457[Pts]),2,0))","v":""},{"$f":"Tirage!$O10","v":1},null,null,{"$f":"VLOOKUP(AR20,Inscriptions!$E$19:$F$28,2,FALSE)","v":0},"","",{"$f":"IF(COUNTBLANK(AV20:AW20),\"\",VLOOKUP(AV20&AW20,CHOOSE({1,2},tPts32457[Score 1]&tPts32457[Score 2],tPts32457[Pts]),2,0))","v":""},{"$f":"Tirage!$Q10","v":5},null,null,{"$f":"VLOOKUP(AY20,Inscriptions!$E$19:$F$28,2,FALSE)","v":0},{"$f":"IFERROR(VLOOKUP(BB20,$BB$3:BD$7,3,0),\"\")&IFERROR(VLOOKUP(BB20,$BC$3:$BE$7,3,0),\"\")","v":""},"",{"$f":"IF(COUNTBLANK(BC20:BD20),\"\",VLOOKUP(BC20&BD20,CHOOSE({1,2},tPts32457[Score 1]&tPts32457[Score 2],tPts32457[Pts]),2,0))","v":""},{"$f":"Tirage!$S10","v":9},null,null,{"$f":"VLOOKUP(BF20,Inscriptions!$E$19:$F$28,2,FALSE)","v":0},{"$f":"IFERROR(VLOOKUP(BI20,$BI$3:BK$7,3,0),\"\")&IFERROR(VLOOKUP(BI20,$BJ$3:$BL$7,3,0),\"\")","v":""},"",{"$f":"IF(COUNTBLANK(BJ20:BK20),\"\",VLOOKUP(BJ20&BK20,CHOOSE({1,2},tPts32457[Score 1]&tPts32457[Score 2],tPts32457[Pts]),2,0))","v":""}]
[null,{"$f":"Tirage!$C11","v":2},null,null,{"$f":"VLOOKUP(B21,Inscriptions!$E$19:$F$28,2,FALSE)","v":0},"","",{"$f":"IF(E22=0,0,IF(COUNTBLANK(F21:G21),\"\",VLOOKUP(F21&G21,CHOOSE({1,2},tPts32457[Score 1]&tPts32457[Score 2],tPts32457[Pts]),2,0)))","v":0},7,null,null,{"$f":"VLOOKUP(I21,Inscriptions!$E$19:$F$28,2,FALSE)","v":0},"","",{"$f":"IF(L21=0,0,IF(COUNTBLANK(M21:N21),\"\",VLOOKUP(M21&N21,CHOOSE({1,2},tPts32457[Score 1]&tPts32457[Score 2],tPts32457[Pts]),2,0)))","v":0},{"$f":"Tirage!$G11","v":9},null,null,{"$f":"VLOOKUP(P21,Inscriptions!$E$19:$F$28,2,FALSE)","v":0},"","",{"$f":"IF(COUNTBLANK(T21:U21),\"\",VLOOKUP(T21&U21,CHOOSE({1,2},tPts32457[Score 1]&tPts32457[Score 2],tPts32457[Pts]),2,0))","v":""},{"$f":"X5","v":3},null,null,{"$f":"VLOOKUP(W21,Inscriptions!$E$19:$F$28,2,FALSE)","v":0},"","",{"$f":"IF(COUNTBLANK(AA21:AB21),\"\",VLOOKUP(AA21&AB21,CHOOSE({1,2},tPts32457[Score 1]&tPts32457[Score 2],tPts32457[Pts]),2,0))","v":""},{"$f":"Tirage!$K11","v":2},null,null,{"$f":"VLOOKUP(AD21,Inscriptions!$E$19:$F$28,2,FALSE)","v":0},"","",{"$f":"IF(COUNTBLANK(AH21:AI21),\"\",VLOOKUP(AH21&AI21,CHOOSE({1,2},tPts32457[Score 1]&tPts32457[Score 2],tPts32457[Pts]),2,0))","v":""},{"$f":"Tirage!$M11","v":7},null,null,{"$f":"VLOOKUP(AK21,Inscriptions!$E$19:$F$28,2,FALSE)","v":0},"","",{"$f":"IF(COUNTBLANK(AO21:AP21),\"\",VLOOKUP(AO21&AP21,CHOOSE({1,2},tPts32457[Score 1]&tPts32457[Score 2],tPts32457[Pts]),2,0))","v":""},{"$f":"Tirage!$O11","v":9},null,null,{"$f":"VLOOKUP(AR21,Inscriptions!$E$19:$F$28,2,FALSE)","v":0},"","",{"$f":"IF(COUNTBLANK(AV21:AW21),\"\",VLOOKUP(AV21&AW21,CHOOSE({1,2},tPts32457[Score 1]&tPts32457[Score 2],tPts32457[Pts]),2,0))","v":""},{"$f":"Tirage!$Q11","v":3},null,null,{"$f":"VLOOKUP(AY21,Inscriptions!$E$19:$F$28,2,FALSE)","v":0},{"$f":"IFERROR(VLOOKUP(BB21,$BB$3:BD$7,3,0),\"\")&IFERROR(VLOOKUP(BB21,$BC$3:$BE$7,3,0),\"\")","v":""},"",{"$f":"IF(COUNTBLANK(BC21:BD21),\"\",VLOOKUP(BC21&BD21,CHOOSE({1,2},tPts32457[Score 1]&tPts32457[Score 2],tPts32457[Pts]),2,0))","v":""},{"$f":"Tirage!$S11","v":1},null,null,{"$f":"VLOOKUP(BF21,Inscriptions!$E$19:$F$28,2,FALSE)","v":0},{"$f":"IFERROR(VLOOKUP(BI21,$BI$3:BK$7,3,0),\"\")&IFERROR(VLOOKUP(BI21,$BJ$3:$BL$7,3,0),\"\")","v":""},"",{"$f":"IF(COUNTBLANK(BJ21:BK21),\"\",VLOOKUP(BJ21&BK21,CHOOSE({1,2},tPts32457[Score 1]&tPts32457[Score 2],tPts32457[Pts]),2,0))","v":""}]
[null,{"$f":"Tirage!$C12","v":1},null,null,{"$f":"VLOOKUP(B22,Inscriptions!$E$19:$F$28,2,FALSE)","v":0},"","",{"$f":"IF(E23=0,0,IF(COUNTBLANK(F22:G22),\"\",VLOOKUP(F22&G22,CHOOSE({1,2},tPts32457[Score 1]&tPts32457[Score 2],tPts32457[Pts]),2,0)))","v":0},6,null,null,{"$f":"VLOOKUP(I22,Inscriptions!$E$19:$F$28,2,FALSE)","v":0},"","",{"$f":"IF(L22=0,0,IF(COUNTBLANK(M22:N22),\"\",VLOOKUP(M22&N22,CHOOSE({1,2},tPts32457[Score 1]&tPts32457[Score 2],tPts32457[Pts]),2,0)))","v":0},{"$f":"Tirage!$G12","v":5},null,null,{"$f":"VLOOKUP(P22,Inscriptions!$E$19:$F$28,2,FALSE)","v":0},"","",{"$f":"IF(COUNTBLANK(T22:U22),\"\",VLOOKUP(T22&U22,CHOOSE({1,2},tPts32457[Score 1]&tPts32457[Score 2],tPts32457[Pts]),2,0))","v":""},{"$f":"X6","v":2},null,null,{"$f":"VLOOKUP(W22,Inscriptions!$E$19:$F$28,2,FALSE)","v":0},"","",{"$f":"IF(COUNTBLANK(AA22:AB22),\"\",VLOOKUP(AA22&AB22,CHOOSE({1,2},tPts32457[Score 1]&tPts32457[Score 2],tPts32457[Pts]),2,0))","v":""},{"$f":"Tirage!$K12","v":8},null,null,{"$f":"VLOOKUP(AD22,Inscriptions!$E$19:$F$28,2,FALSE)","v":0},"","",{"$f":"IF(COUNTBLANK(AH22:AI22),\"\",VLOOKUP(AH22&AI22,CHOOSE({1,2},tPts32457[Score 1]&tPts32457[Score 2],tPts32457[Pts]),2,0))","v":""},{"$f":"Tirage!$M12","v":8},null,null,{"$f":"VLOOKUP(AK22,Inscriptions!$E$19:$F$28,2,FALSE)","v":0},"","",{"$f":"IF(COUNTBLANK(AO22:AP22),\"\",VLOOKUP(AO22&AP22,CHOOSE({1,2},tPts32457[Score 1]&tPts32457[Score 2],tPts32457[Pts]),2,0))","v":""},{"$f":"Tirage!$O12","v":6},null,null,{"$f":"VLOOKUP(AR22,Inscriptions!$E$19:$F$28,2,FALSE)","v":0},"","",{"$f":"IF(COUNTBLANK(AV22:AW22),\"\",VLOOKUP(AV22&AW22,CHOOSE({1,2},tPts32457[Score 1]&tPts32457[Score 2],tPts32457[Pts]),2,0))","v":""},{"$f":"Tirage!$Q12","v":6},null,null,{"$f":"VLOOKUP(AY22,Inscriptions!$E$19:$F$28,2,FALSE)","v":0},{"$f":"IFERROR(VLOOKUP(BB22,$BB$3:BD$7,3,0),\"\")&IFERROR(VLOOKUP(BB22,$BC$3:$BE$7,3,0),\"\")","v":""},"",{"$f":"IF(COUNTBLANK(BC22:BD22),\"\",VLOOKUP(BC22&BD22,CHOOSE({1,2},tPts32457[Score 1]&tPts32457[Score 2],tPts32457[Pts]),2,0))","v":""},{"$f":"Tirage!$S12","v":5},null,null,{"$f":"VLOOKUP(BF22,Inscriptions!$E$19:$F$28,2,FALSE)","v":0},{"$f":"IFERROR(VLOOKUP(BI22,$BI$3:BK$7,3,0),\"\")&IFERROR(VLOOKUP(BI22,$BJ$3:$BL$7,3,0),\"\")","v":""},"",{"$f":"IF(COUNTBLANK(BJ22:BK22),\"\",VLOOKUP(BJ22&BK22,CHOOSE({1,2},tPts32457[Score 1]&tPts32457[Score 2],tPts32457[Pts]),2,0))","v":""}]
[null,{"$f":"Tirage!$C13","v":4},null,null,{"$f":"VLOOKUP(B23,Inscriptions!$E$19:$F$28,2,FALSE)","v":0},"","",{"$f":"IF(E23=0,0,IF(COUNTBLANK(F23:G23),\"\",VLOOKUP(F23&G23,CHOOSE({1,2},tPts32457[Score 1]&tPts32457[Score 2],tPts32457[Pts]),2,0)))","v":0},10,null,null,{"$f":"VLOOKUP(I23,Inscriptions!$E$19:$F$28,2,FALSE)","v":0},"","",{"$f":"IF(L23=0,0,IF(COUNTBLANK(M23:N23),\"\",VLOOKUP(M23&N23,CHOOSE({1,2},tPts32457[Score 1]&tPts32457[Score 2],tPts32457[Pts]),2,0)))","v":0},{"$f":"Tirage!$G13","v":6},null,null,{"$f":"VLOOKUP(P23,Inscriptions!$E$19:$F$28,2,FALSE)","v":0},"","",{"$f":"IF(COUNTBLANK(T23:U23),\"\",VLOOKUP(T23&U23,CHOOSE({1,2},tPts32457[Score 1]&tPts32457[Score 2],tPts32457[Pts]),2,0))","v":""},{"$f":"X7","v":7},null,null,{"$f":"VLOOKUP(W23,Inscriptions!$E$19:$F$28,2,FALSE)","v":0},"","",{"$f":"IF(COUNTBLANK(AA23:AB23),\"\",VLOOKUP(AA23&AB23,CHOOSE({1,2},tPts32457[Score 1]&tPts32457[Score 2],tPts32457[Pts]),2,0))","v":""},{"$f":"Tirage!$K13","v":9},null,null,{"$f":"VLOOKUP(AD23,Inscriptions!$E$19:$F$28,2,FALSE)","v":0},"","",{"$f":"IF(COUNTBLANK(AH23:AI23),\"\",VLOOKUP(AH23&AI23,CHOOSE({1,2},tPts32457[Score 1]&tPts32457[Score 2],tPts32457[Pts]),2,0))","v":""},{"$f":"Tirage!$M13","v":5},null,null,{"$f":"VLOOKUP(AK23,Inscriptions!$E$19:$F$28,2,FALSE)","v":0},{"$f":"IFERROR(VLOOKUP(AN23,$AN$3:$AP$7,3,0),\"\")&IFERROR(VLOOKUP(AN23,$AO$3:$AQ$7,3,0),\"\")","v":""},{"$f":"IFERROR(VLOOKUP(AN23,$AN$3:$AQ$7,4,0),\"\")&IFERROR(VLOOKUP(AN23,$AO$3:$AQ$7,2,0),\"\")","v":""},{"$f":"IF(COUNTBLANK(AO23:AP23),\"\",VLOOKUP(AO23&AP23,CHOOSE({1,2},tPts32457[Score 1]&tPts32457[Score 2],tPts32457[Pts]),2,0))","v":""},{"$f":"Tirage!$O13","v":2},null,null,{"$f":"VLOOKUP(AR23,Inscriptions!$E$19:$F$28,2,FALSE)","v":0},"","",{"$f":"IF(COUNTBLANK(AV23:AW23),\"\",VLOOKUP(AV23&AW23,CHOOSE({1,2},tPts32457[Score 1]&tPts32457[Score 2],tPts32457[Pts]),2,0))","v":""},{"$f":"Tirage!$Q13","v":1},null,null,{"$f":"VLOOKUP(AY23,Inscriptions!$E$19:$F$28,2,FALSE)","v":0},{"$f":"IFERROR(VLOOKUP(BB23,$BB$3:BD$7,3,0),\"\")&IFERROR(VLOOKUP(BB23,$BC$3:$BE$7,3,0),\"\")","v":""},"",{"$f":"IF(COUNTBLANK(BC23:BD23),\"\",VLOOKUP(BC23&BD23,CHOOSE({1,2},tPts32457[Score 1]&tPts32457[Score 2],tPts32457[Pts]),2,0))","v":""},{"$f":"Tirage!$S13","v":2},null,null,{"$f":"VLOOKUP(BF23,Inscriptions!$E$19:$F$28,2,FALSE)","v":0},{"$f":"IFERROR(VLOOKUP(BI23,$BI$3:BK$7,3,0),\"\")&IFERROR(VLOOKUP(BI23,$BJ$3:$BL$7,3,0),\"\")","v":""},"",{"$f":"IF(COUNTBLANK(BJ23:BK23),\"\",VLOOKUP(BJ23&BK23,CHOOSE({1,2},tPts32457[Score 1]&tPts32457[Score 2],tPts32457[Pts]),2,0))","v":""}]
[]
[]
[]
[null,null,null,"Grille des points",null,null,null,null,null,null,null,null,"Classement Général journée 4"]
[null,null,null,"Score 1","Score 2","Pts",null,null,null,"Place",null,"Place","Equipes","Total Pts"]
[null,null,null,0,0,0,null,null,null,1,null,1,null,{"$f":"IFERROR(VLOOKUP(M29,$E$14:$H$23,4,0)*1,0)\n+IFERROR(VLOOKUP(M29,$L$14:$O$23,4,0)*1,0)\n+IFERROR(VLOOKUP(M29,$S$14:$V$23,4,0)*1,0)\n+IFERROR(VLOOKUP(M29,$Z$14:$AC$23,4,0)*1,0)\n+IFERROR(VLOOKUP(M29,$AG$14:$AJ$23,4,0)*1,0)\n+IFERROR(VLOOKUP(M29,$AN$14:$AQ$23,4,0)*1,0)\n+IFERROR(VLOOKUP(M29,$AU$14:$AX$23,4,0)*1,0\n+IFERROR(VLOOKUP(M29,$BB$14:$BE$23,4,0)*1,0)\n+IFERROR(VLOOKUP(M29,$BI$14:$BL$23,4,0)*1,0))","v":0},{"$f":"IF(N29=0,-100,N29)","v":-100}]
[null,null,null,0,1,1,null,null,null,2,null,2,null,0,-100]
[null,null,null,0,2,1,null,null,null,3,null,3,null,0,-100]
[null,null,null,1,0,10,null,null,null,4,null,4,null,0,-100]
[null,null,null,1,1,3,null,null,null,5,null,5,null,0,-100]
[null,null,null,1,2,1,null,null,null,6,null,6,null,0,-100]
[null,null,null,2,0,10,null,null,null,7,null,7,null,0,-100]
[null,null,null,2,1,10,null,null,null,8,null,8,null,0,-100]
[null,null,null,2,2,3,null,null,null,9,null,9,null,0,-100]
[null,null,null,2,"ab",10,null,null,null,10,null,10,null,0,-100]
[null,null,null,"ab",2,0,null,null,null,11]
[null,null,null,1,"ab",10,null,null,null,12]
[null,null,null,"ab",1,0,null,null,null,13]

{"sheet":"Journée7","index":11,"n_rows":41,"n_cols":64,"rows_kept":41,"cut":false,"hidden":true,"merged":[[26,3,26,5],[26,10,26,11],[26,12,26,13],[30,15,30,16],[10,39,10,42],[10,46,10,49],[10,53,10,56],[10,60,10,63],[25,12,25,13],[10,4,10,7],[10,11,10,14],[10,18,10,21],[10,25,10,28],[10,32,10,35],[7,48,7,49],[7,55,7,56],[7,62,7,63],[8,12,9,14],[8,27,8,28],[8,34,8,35],[8,41,8,42],[8,48,8,49],[8,55,8,56],[8,62,8,63],[7,41,7,42],[9,34,9,61],[7,6,7,7],[7,13,7,14],[7,20,7,21],[7,27,7,28],[7,34,7,35],[0,60,0,63],[0,24,1,24],[0,25,0,28],[0,31,1,31],[0,32,0,35],[0,38,1,38],[0,39,0,42],[0,45,1,45],[0,46,0,49],[0,52,1,52],[0,53,0,56],[0,59,1,59],[0,18,0,21],[0,3,1,3],[0,4,0,7],[0,10,1,10],[0,11,0,14],[0,17,1,17]]}
[null,null,null,"Arbitre","TOUR 1",null,null,null,null,null,"Arbitre","TOUR 2",null,null,null,null,null,"Arbitre","TOUR 3",null,null,null,null,null,"Arbitre","TOUR 4",null,null,null,null,null,"Arbitre","TOUR 5",null,null,null,null,null,"Arbitre","TOUR 6",null,null,null,null,null,"Arbitre","TOUR 7",null,null,null,null,null,"Arbitre","TOUR 8",null,null,null,null,null,"Arbitre","TOUR 9"]
[null,null,null,null,"Equipe 1","Equipe 2","Score 1","Score 2",null,null,null,"Equipe 1","Equipe 2","Score 1","Score 2",null,null,null,"Equipe 1","Equipe 2","Score 1","Score 2",null,null,null,"Equipe 1","Equipe 2","Score 1","Score 2",null,null,null,"Equipe 1","Equipe 2","Score 1","Score 2",null,null,null,"Equipe 1","Equipe 2","Score 1","Score 2",null,null,null,"Equipe 1","Equipe 2","Score 1","Score 2",null,null,null,"Equipe 1","Equipe 2","Score 1","Score 2",null,null,null,"Equipe 1","Equipe 2","Score 1","Score 2"]
[null,{"$f":"Tirage!$B9","v":7},{"$f":"Tirage!$C9","v":10},{"$f":"B7","v":8},{"$f":"VLOOKUP(B3,Inscriptions!$I$19:$J$28,2,FALSE)","v":0},{"$f":"VLOOKUP(C3,Inscriptions!$I$19:$J$28,2,FALSE)","v":0},null,null,{"$f":"Tirage!D9","v":3},{"$f":"Tirage!E9","v":9},{"$f":"I7","v":4},{"$f":"VLOOKUP(I3,Inscriptions!$I$19:$J$28,2,FALSE)","v":0},{"$f":"VLOOKUP(J3,Inscriptions!$I$19:$J$28,2,FALSE)","v":0},null,null,{"$f":"Tirage!$F9","v":10},{"$f":"Tirage!$G9","v":2},{"$f":"P7","v":3},{"$f":"VLOOKUP(P3,Inscriptions!$I$19:$J$28,2,FALSE)","v":0},{"$f":"VLOOKUP(Q3,Inscriptions!$I$19:$J$28,2,FALSE)","v":0},null,null,{"$f":"Tirage!$H9","v":6},{"$f":"Tirage!$I9","v":10},{"$f":"W7","v":1},{"$f":"VLOOKUP(W3,Inscriptions!$I$19:$J$28,2,FALSE)","v":0},{"$f":"VLOOKUP(X3,Inscriptions!$I$19:$J$28,2,FALSE)","v":0},null,null,{"$f":"Tirage!$J9","v":1},{"$f":"Tirage!$K9","v":6},{"$f":"AD7","v":10},{"$f":"VLOOKUP(AD3,Inscriptions!$I$19:$J$28,2,FALSE)","v":0},{"$f":"VLOOKUP(AE3,Inscriptions!$I$19:$J$28,2,FALSE)","v":0},null,null,{"$f":"Tirage!$L9","v":9},{"$f":"Tirage!$M9","v":6},{"$f":"AK7","v":4},{"$f":"VLOOKUP(AK3,Inscriptions!$I$19:$J$28,2,FALSE)","v":0},{"$f":"VLOOKUP(AL3,Inscriptions!$I$19:$J$28,2,FALSE)","v":0},null,null,{"$f":"Tirage!$N9","v":3},{"$f":"Tirage!$O9","v":10},{"$f":"AR7","v":5},{"$f":"VLOOKUP(AR3,Inscriptions!$I$19:$J$28,2,FALSE)","v":0},{"$f":"VLOOKUP(AS3,Inscriptions!$I$19:$J$28,2,FALSE)","v":0},null,null,{"$f":"Tirage!$P9","v":2},{"$f":"Tirage!$Q9","v":9},{"$f":"AY7","v":10},{"$f":"VLOOKUP(AY3,Inscriptions!$I$19:$J$28,2,FALSE)","v":0},{"$f":"VLOOKUP(AZ3,Inscriptions!$I$19:$J$28,2,FALSE)","v":0},null,null,{"$f":"Tirage!$R9","v":6},{"$f":"Tirage!$S9","v":8},{"$f":"BF7","v":3},{"$f":"VLOOKUP(BF3,Inscriptions!$I$19:$J$28,2,FALSE)","v":0},{"$f":"VLOOKUP(BG3,Inscriptions!$I$19:$J$28,2,FALSE)","v":0}]
[null,{"$f":"Tirage!$B10","v":3},{"$f":"Tirage!$C10","v":5},{"$f":"C7","v":4},{"$f":"VLOOKUP(B4,Inscriptions!$I$19:$J$28,2,FALSE)","v":0},{"$f":"VLOOKUP(C4,Inscriptions!$I$19:$J$28,2,FALSE)","v":0},null,null,{"$f":"Tirage!D10","v":2},{"$f":"Tirage!E10","v":1},{"$f":"J7","v":10},{"$f":"VLOOKUP(I4,Inscriptions!$I$19:$J$28,2,FALSE)","v":0},{"$f":"VLOOKUP(J4,Inscriptions!$I$19:$J$28,2,FALSE)","v":0},null,null,{"$f":"Tirage!$F10","v":4},{"$f":"Tirage!$G10","v":7},{"$f":"Q7","v":6},{"$f":"VLOOKUP(P4,Inscriptions!$I$19:$J$28,2,FALSE)","v":0},{"$f":"VLOOKUP(Q4,Inscriptions!$I$19:$J$28,2,FALSE)","v":0},null,null,{"$f":"Tirage!$H10","v":5},{"$f":"Tirage!$I10","v":9},{"$f":"X7","v":7},{"$f":"VLOOKUP(W4,Inscriptions!$I$19:$J$28,2,FALSE)","v":0},{"$f":"VLOOKUP(X4,Inscriptions!$I$19:$J$28,2,FALSE)","v":0},null,null,{"$f":"Tirage!$J10","v":7},{"$f":"Tirage!$K10","v":5},{"$f":"AE7","v":9},{"$f":"VLOOKUP(AD4,Inscriptions!$I$19:$J$28,2,FALSE)","v":0},{"$f":"VLOOKUP(AE4,Inscriptions!$I$19:$J$28,2,FALSE)","v":0},null,null,{"$f":"Tirage!$L10","v":3},{"$f":"Tirage!$M10","v":1},{"$f":"AL7","v":5},{"$f":"VLOOKUP(AK4,Inscriptions!$I$19:$J$28,2,FALSE)","v":0},{"$f":"VLOOKUP(AL4,Inscriptions!$I$19:$J$28,2,FALSE)","v":0},null,null,{"$f":"Tirage!$N10","v":8},{"$f":"Tirage!$O10","v":1},{"$f":"AS7","v":2},{"$f":"VLOOKUP(AR4,Inscriptions!$I$19:$J$28,2,FALSE)","v":0},{"$f":"VLOOKUP(AS4,Inscriptions!$I$19:$J$28,2,FALSE)","v":0},null,null,{"$f":"Tirage!$P10","v":8},{"$f":"Tirage!$Q10","v":5},{"$f":"AZ7","v":1},{"$f":"VLOOKUP(AY4,Inscriptions!$I$19:$J$28,2,FALSE)","v":0},{"$f":"VLOOKUP(AZ4,Inscriptions!$I$19:$J$28,2,FALSE)","v":0},null,null,{"$f":"Tirage!$R10","v":7},{"$f":"Tirage!$S10","v":9},{"$f":"BG7","v":2},{"$f":"VLOOKUP(BF4,Inscriptions!$I$19:$J$28,2,FALSE)","v":0},{"$f":"VLOOKUP(BG4,Inscriptions!$I$19:$J$28,2,FALSE)","v":0}]
[null,{"$f":"Tirage!$B11","v":6},{"$f":"Tirage!$C11","v":2},{"$f":"B6","v":9},{"$f":"VLOOKUP(B5,Inscriptions!$I$19:$J$28,2,FALSE)","v":0},{"$f":"VLOOKUP(C5,Inscriptions!$I$19:$J$28,2,FALSE)","v":0},null,null,{"$f":"Tirage!D11","v":8},{"$f":"Tirage!E11","v":7},{"$f":"I6","v":5},{"$f":"VLOOKUP(I5,Inscriptions!$I$19:$J$28,2,FALSE)","v":0},{"$f":"VLOOKUP(J5,Inscriptions!$I$19:$J$28,2,FALSE)","v":0},null,null,{"$f":"Tirage!$F11","v":8},{"$f":"Tirage!$G11","v":9},{"$f":"P6","v":1},{"$f":"VLOOKUP(P5,Inscriptions!$I$19:$J$28,2,FALSE)","v":0},{"$f":"VLOOKUP(Q5,Inscriptions!$I$19:$J$28,2,FALSE)","v":0},null,null,{"$f":"Tirage!$H11","v":4},{"$f":"Tirage!$I11","v":3},{"$f":"W6","v":8},{"$f":"VLOOKUP(W5,Inscriptions!$I$19:$J$28,2,FALSE)","v":0},{"$f":"VLOOKUP(X5,Inscriptions!$I$19:$J$28,2,FALSE)","v":0},null,null,{"$f":"Tirage!$J11","v":4},{"$f":"Tirage!$K11","v":2},{"$f":"AD6","v":3},{"$f":"VLOOKUP(AD5,Inscriptions!$I$19:$J$28,2,FALSE)","v":0},{"$f":"VLOOKUP(AE5,Inscriptions!$I$19:$J$28,2,FALSE)","v":0},null,null,{"$f":"Tirage!$L11","v":2},{"$f":"Tirage!$M11","v":7},{"$f":"AK6","v":10},{"$f":"VLOOKUP(AK5,Inscriptions!$I$19:$J$28,2,FALSE)","v":0},{"$f":"VLOOKUP(AL5,Inscriptions!$I$19:$J$28,2,FALSE)","v":0},null,null,{"$f":"Tirage!$N11","v":4},{"$f":"Tirage!$O11","v":9},{"$f":"AR6","v":7},{"$f":"VLOOKUP(AR5,Inscriptions!$I$19:$J$28,2,FALSE)","v":0},{"$f":"VLOOKUP(AS5,Inscriptions!$I$19:$J$28,2,FALSE)","v":0},null,null,{"$f":"Tirage!$P11","v":7},{"$f":"Tirage!$Q11","v":3},{"$f":"AY6","v":4},{"$f":"VLOOKUP(AY5,Inscriptions!$I$19:$J$28,2,FALSE)","v":0},{"$f":"VLOOKUP(AZ5,Inscriptions!$I$19:$J$28,2,FALSE)","v":0},null,null,{"$f":"Tirage!$R11","v":4},{"$f":"Tirage!$S11","v":1},{"$f":"BF6","v":10},{"$f":"VLOOKUP(BF5,Inscriptions!$I$19:$J$28,2,FALSE)","v":0},{"$f":"VLOOKUP(BG5,Inscriptions!$I$19:$J$28,2,FALSE)","v":0}]
[null,{"$f":"Tirage!$B12","v":9},{"$f":"Tirage!$C12","v":1},{"$f":"B3","v":7},{"$f":"VLOOKUP(B6,Inscriptions!$I$19:$J$28,2,FALSE)","v":0},{"$f":"VLOOKUP(C6,Inscriptions!$I$19:$J$28,2,FALSE)","v":0},null,null,{"$f":"Tirage!D12","v":5},{"$f":"Tirage!E12","v":6},{"$f":"I3","v":3},{"$f":"VLOOKUP(I6,Inscriptions!$I$19:$J$28,2,FALSE)","v":0},{"$f":"VLOOKUP(J6,Inscriptions!$I$19:$J$28,2,FALSE)","v":0},null,null,{"$f":"Tirage!$F12","v":1},{"$f":"Tirage!$G12","v":5},{"$f":"Q3","v":2},{"$f":"VLOOKUP(P6,Inscriptions!$I$19:$J$28,2,FALSE)","v":0},{"$f":"VLOOKUP(Q6,Inscriptions!$I$19:$J$28,2,FALSE)","v":0},null,null,{"$f":"Tirage!$H12","v":8},{"$f":"Tirage!$I12","v":2},{"$f":"X3","v":10},{"$f":"VLOOKUP(W6,Inscriptions!$I$19:$J$28,2,FALSE)","v":0},{"$f":"VLOOKUP(X6,Inscriptions!$I$19:$J$28,2,FALSE)","v":0},null,null,{"$f":"Tirage!$J12","v":3},{"$f":"Tirage!$K12","v":8},{"$f":"AD4","v":7},{"$f":"VLOOKUP(AD6,Inscriptions!$I$19:$J$28,2,FALSE)","v":0},{"$f":"VLOOKUP(AE6,Inscriptions!$I$19:$J$28,2,FALSE)","v":0},null,null,{"$f":"Tirage!$L12","v":10},{"$f":"Tirage!$M12","v":8},{"$f":"AL3","v":6},{"$f":"VLOOKUP(AK6,Inscriptions!$I$19:$J$28,2,FALSE)","v":0},{"$f":"VLOOKUP(AL6,Inscriptions!$I$19:$J$28,2,FALSE)","v":0},null,null,{"$f":"Tirage!$N12","v":7},{"$f":"Tirage!$O12","v":6},{"$f":"AS4","v":1},{"$f":"VLOOKUP(AR6,Inscriptions!$I$19:$J$28,2,FALSE)","v":0},{"$f":"VLOOKUP(AS6,Inscriptions!$I$19:$J$28,2,FALSE)","v":0},null,null,{"$f":"Tirage!$P12","v":4},{"$f":"Tirage!$Q12","v":6},{"$f":"AY3","v":2},{"$f":"VLOOKUP(AY6,Inscriptions!$I$19:$J$28,2,FALSE)","v":0},{"$f":"VLOOKUP(AZ6,Inscriptions!$I$19:$J$28,2,FALSE)","v":0},null,null,{"$f":"Tirage!$R12","v":10},{"$f":"Tirage!$S12","v":5},{"$f":"BF3","v":6},{"$f":"VLOOKUP(BF6,Inscriptions!$I$19:$J$28,2,FALSE)","v":0},{"$f":"VLOOKUP(BG6,Inscriptions!$I$19:$J$28,2,FALSE)","v":0}]
[null,{"$f":"Tirage!$B13","v":8},{"$f":"Tirage!$C13","v":4},{"$f":"B5","v":6},{"$f":"VLOOKUP(B7,Inscriptions!$I$19:$J$28,2,FALSE)","v":0},{"$f":"VLOOKUP(C7,Inscriptions!$I$19:$J$28,2,FALSE)","v":0},null,null,{"$f":"Tirage!D13","v":4},{"$f":"Tirage!E13","v":10},{"$f":"J3","v":9},{"$f":"VLOOKUP(I7,Inscriptions!$I$19:$J$28,2,FALSE)","v":0},{"$f":"VLOOKUP(J7,Inscriptions!$I$19:$J$28,2,FALSE)","v":0},null,null,{"$f":"Tirage!$F13","v":3},{"$f":"Tirage!$G13","v":6},{"$f":"P5","v":8},{"$f":"VLOOKUP(P7,Inscriptions!$I$19:$J$28,2,FALSE)","v":0},{"$f":"VLOOKUP(Q7,Inscriptions!$I$19:$J$28,2,FALSE)","v":0},null,null,{"$f":"Tirage!$H13","v":1},{"$f":"Tirage!$I13","v":7},{"$f":"W5","v":4},{"$f":"VLOOKUP(W7,Inscriptions!$I$19:$J$28,2,FALSE)","v":0},{"$f":"VLOOKUP(X7,Inscriptions!$I$19:$J$28,2,FALSE)","v":0},null,null,{"$f":"Tirage!$J13","v":10},{"$f":"Tirage!$K13","v":9},{"$f":"AD5","v":4},{"$f":"VLOOKUP(AD7,Inscriptions!$I$19:$J$28,2,FALSE)","v":0},{"$f":"VLOOKUP(AE7,Inscriptions!$I$19:$J$28,2,FALSE)","v":0},null,null,{"$f":"Tirage!$L13","v":4},{"$f":"Tirage!$M13","v":5},{"$f":"AK5","v":2},{"$f":"VLOOKUP(AK7,Inscriptions!$I$19:$J$28,2,FALSE)","v":0},{"$f":"VLOOKUP(AL7,Inscriptions!$I$19:$J$28,2,FALSE)","v":0},null,null,{"$f":"Tirage!$N13","v":5},{"$f":"Tirage!$O13","v":2},{"$f":"AR5","v":4},{"$f":"VLOOKUP(AR7,Inscriptions!$I$19:$J$28,2,FALSE)","v":0},{"$f":"VLOOKUP(AS7,Inscriptions!$I$19:$J$28,2,FALSE)","v":0},null,null,{"$f":"Tirage!$P13","v":10},{"$f":"Tirage!$Q13","v":1},{"$f":"AY5","v":7},{"$f":"VLOOKUP(AY7,Inscriptions!$I$19:$J$28,2,FALSE)","v":0},{"$f":"VLOOKUP(AZ7,Inscriptions!$I$19:$J$28,2,FALSE)","v":0},null,null,{"$f":"Tirage!$R13","v":3},{"$f":"Tirage!$S13","v":2},{"$f":"BG3","v":8},{"$f":"VLOOKUP(BF7,Inscriptions!$I$19:$J$28,2,FALSE)","v":0},{"$f":"VLOOKUP(BG7,Inscriptions!$I$19:$J$28,2,FALSE)","v":0}]
[null,null,null,null,null,null,"Mettre ab pour abandon",null,null,null,null,null,null,"Mettre ab pour abandon",null,null,null,null,null,null,"Mettre ab pour abandon",null,null,null,null,null,null,"Mettre ab pour abandon",null,null,null,null,null,null,"Mettre ab pour abandon",null,null,null,null,null,null,"Mettre ab pour abandon",null,null,null,null,null,null,"Mettre ab pour abandon",null,null,null,null,null,null,"Mettre ab pour abandon",null,null,null,null,null,null,"Mettre ab pour abandon"]
[null,null,null,null,null,null,null,null,null,null,null,null,"JOURNEE 7",null,null,null,null,null,null,null,null,null,null,null,null,null,null,null,null,null,null,null,null,null,null,null,null,null,null,null,null,"Mettre ex pour exempt",null,null,null,null,null,null,"Mettre ex pour exempt"]
[]
[null,null,null,null,"TOUR 1",null,null,null,null,null,null,"TOUR 2",null,null,null,null,null,null,"TOUR 3",null,null,null,null,null,null,"TOUR 4",null,null,null,null,null,null,"TOUR 5",null,null,null,null,null,null,"TOUR 6",null,null,null,null,null,null,"TOUR 7",null,null,null,null,null,null,"TOUR 8",null,null,null,null,null,null,"TOUR 9"]
[]
[null,null,null,null,"Equipes","Score pour","Score contre","Pts ",null,null,null,"Equipes","Score pour","Score contre","Pts ",null,null,null,"Equipes","Score pour","Score contre","Pts ",null,null,null,"Equipes","Score pour","Score contre","Pts ",null,null,null,"Equipes","Score pour","Score contre","Pts ",null,null,null,"Equipes","Score pour","Score contre","Pts ",null,null,null,"Equipes","Score pour","Score contre","Pts ",null,null,null,"Equipes","Score pour","Score contre","Pts ",null,null,null,"Equipes","Score pour","Score contre","Pts "]
[null,{"$f":"Tirage!$B9","v":7},null,null,{"$f":"VLOOKUP(B14,Inscriptions!$I$19:$J$28,2,FALSE)","v":0},{"$f":"IFERROR(VLOOKUP(E14,$E$3:$G$7,3,0),\"\")&IFERROR(VLOOKUP(E14,$F$3:$H$7,3,0),\"\")","v":""},{"$f":"IFERROR(VLOOKUP(E14,$E$3:$H$7,4,0),\"\")&IFERROR(VLOOKUP(E14,$F$3:$H$7,2,0),\"\")","v":""},{"$f":"IF(E15=0,0,IF(COUNTBLANK(F14:G14),\"\",VLOOKUP(F14&G14,CHOOSE({1,2},tPts32458[Score 1]&tPts32458[Score 2],tPts32458[Pts]),2,0)))","v":0},{"$f":"I3","v":3},null,null,{"$f":"VLOOKUP(I14,Inscriptions!$I$19:$J$28,2,FALSE)","v":0},{"$f":"IFERROR(VLOOKUP(L14,$L$3:$N$7,3,0),\"\")&IFERROR(VLOOKUP(L14,$M$3:$O$7,3,0),\"\")","v":""},{"$f":"IFERROR(VLOOKUP(L14,$L$3:$O$7,4,0),\"\")&IFERROR(VLOOKUP(L14,$M$3:$O$7,2,0),\"\")","v":""},{"$f":"IF(L14=0,0,IF(COUNTBLANK(M14:N14),\"\",VLOOKUP(M14&N14,CHOOSE({1,2},tPts32458[Score 1]&tPts32458[Score 2],tPts32458[Pts]),2,0)))","v":0},{"$f":"Tirage!$F9","v":10},null,null,{"$f":"VLOOKUP(P14,Inscriptions!$I$19:$J$28,2,FALSE)","v":0},{"$f":"IFERROR(VLOOKUP(S14,$S$3:$U$7,3,0),\"\")&IFERROR(VLOOKUP(S14,$T$3:$V$7,3,0),\"\")","v":""},{"$f":"IFERROR(VLOOKUP(S14,$S$3:$V$7,4,0),\"\")&IFERROR(VLOOKUP(S14,$T$3:$V$7,2,0),\"\")","v":""},{"$f":"IF(COUNTBLANK(T14:U14),\"\",VLOOKUP(T14&U14,CHOOSE({1,2},tPts32458[Score 1]&tPts32458[Score 2],tPts32458[Pts]),2,0))","v":""},{"$f":"W3","v":6},null,null,{"$f":"VLOOKUP(W14,Inscriptions!$I$19:$J$28,2,FALSE)","v":0},{"$f":"IFERROR(VLOOKUP(Z14,$Z$3:$AB$7,3,0),\"\")&IFERROR(VLOOKUP(Z14,$AA$3:$AC$7,3,0),\"\")","v":""},{"$f":"IFERROR(VLOOKUP(Z14,$Z$3:$AC$7,4,0),\"\")&IFERROR(VLOOKUP(Z14,$AA$3:$AC$7,2,0),\"\")","v":""},{"$f":"IF(COUNTBLANK(AA14:AB14),\"\",VLOOKUP(AA14&AB14,CHOOSE({1,2},tPts32458[Score 1]&tPts32458[Score 2],tPts32458[Pts]),2,0))","v":""},{"$f":"Tirage!$J9","v":1},null,null,{"$f":"VLOOKUP(AD14,Inscriptions!$I$19:$J$28,2,FALSE)","v":0},{"$f":"IFERROR(VLOOKUP(AG14,$AG$3:$AI$7,3,0),\"\")&IFERROR(VLOOKUP(AG14,$AH$3:$AJ$7,3,0),\"\")","v":""},{"$f":"IFERROR(VLOOKUP(AG14,$AG$3:$AJ$7,4,0),\"\")&IFERROR(VLOOKUP(AG14,$AH$3:$AJ$7,2,0),\"\")","v":""},{"$f":"IF(COUNTBLANK(AH14:AI14),\"\",VLOOKUP(AH14&AI14,CHOOSE({1,2},tPts32458[Score 1]&tPts32458[Score 2],tPts32458[Pts]),2,0))","v":""},{"$f":"Tirage!$L9","v":9},null,null,{"$f":"VLOOKUP(AK14,Inscriptions!$I$19:$J$28,2,FALSE)","v":0},{"$f":"IFERROR(VLOOKUP(AN14,$AN$3:$AP$7,3,0),\"\")&IFERROR(VLOOKUP(AN14,$AO$3:$AQ$7,3,0),\"\")","v":""},{"$f":"IFERROR(VLOOKUP(AN14,$AN$3:$AQ$7,4,0),\"\")&IFERROR(VLOOKUP(AN14,$AO$3:$AQ$7,2,0),\"\")","v":""},{"$f":"IF(COUNTBLANK(AO14:AP14),\"\",VLOOKUP(AO14&AP14,CHOOSE({1,2},tPts32458[Score 1]&tPts32458[Score 2],tPts32458[Pts]),2,0))","v":""},{"$f":"Tirage!$N9","v":3},null,null,{"$f":"VLOOKUP(AR14,Inscriptions!$I$19:$J$28,2,FALSE)","v":0},{"$f":"IFERROR(VLOOKUP(AU14,AU$3:AW$7,3,0),\"\")&IFERROR(VLOOKUP(AU14,AV$3:AX$7,3,0),\"\")","v":""},{"$f":"IFERROR(VLOOKUP(AU14,AU$3:AX$7,4,0),\"\")&IFERROR(VLOOKUP(AU14,AV$3:AX$7,2,0),\"\")","v":""},{"$f":"IF(COUNTBLANK(AV14:AW14),\"\",VLOOKUP(AV14&AW14,CHOOSE({1,2},tPts32458[Score 1]&tPts32458[Score 2],tPts32458[Pts]),2,0))","v":""},{"$f":"Tirage!$P9","v":2},null,null,{"$f":"VLOOKUP(AY14,Inscriptions!$I$19:$J$28,2,FALSE)","v":0},{"$f":"IFERROR(VLOOKUP(BB14,$BB$3:BD$7,3,0),\"\")&IFERROR(VLOOKUP(BB14,$BC$3:$BE$7,3,0),\"\")","v":""},{"$f":"IFERROR(VLOOKUP(BB14,$BB$3:$BE$7,4,0),\"\")&IFERROR(VLOOKUP(BB14,$BC$3:$BE$7,2,0),\"\")","v":""},{"$f":"IF(COUNTBLANK(BC14:BD14),\"\",VLOOKUP(BC14&BD14,CHOOSE({1,2},tPts32458[Score 1]&tPts32458[Score 2],tPts32458[Pts]),2,0))","v":""},{"$f":"Tirage!$R9","v":6},null,null,{"$f":"VLOOKUP(BF14,Inscriptions!$I$19:$J$28,2,FALSE)","v":0},{"$f":"IFERROR(VLOOKUP(BI14,$BI$3:BK$7,3,0),\"\")&IFERROR(VLOOKUP(BI14,$BJ$3:$BL$7,3,0),\"\")","v":""},{"$f":"IFERROR(VLOOKUP(BI14,$BI$3:$BL$7,4,0),\"\")&IFERROR(VLOOKUP(BI14,$BJ$3:$BL$7,2,0),\"\")","v":""},{"$f":"IF(COUNTBLANK(BJ14:BK14),\"\",VLOOKUP(BJ14&BK14,CHOOSE({1,2},tPts32458[Score 1]&tPts32458[Score 2],tPts32458[Pts]),2,0))","v":""}]
[null,{"$f":"Tirage!$B10","v":3},null,null,{"$f":"VLOOKUP(B15,Inscriptions!$I$19:$J$28,2,FALSE)","v":0},{"$f":"IFERROR(VLOOKUP(E15,$E$3:$G$7,3,0),\"\")&IFERROR(VLOOKUP(E15,$F$3:$H$7,3,0),\"\")","v":""},{"$f":"IFERROR(VLOOKUP(E15,$E$3:$H$7,4,0),\"\")&IFERROR(VLOOKUP(E15,$F$3:$H$7,2,0),\"\")","v":""},{"$f":"IF(E16=0,0,IF(COUNTBLANK(F15:G15),\"\",VLOOKUP(F15&G15,CHOOSE({1,2},tPts32458[Score 1]&tPts32458[Score 2],tPts32458[Pts]),2,0)))","v":0},{"$f":"I4","v":2},null,null,{"$f":"VLOOKUP(I15,Inscriptions!$I$19:$J$28,2,FALSE)","v":0},{"$f":"IFERROR(VLOOKUP(L15,$L$3:$N$7,3,0),\"\")&IFERROR(VLOOKUP(L15,$M$3:$O$7,3,0),\"\")","v":""},{"$f":"IFERROR(VLOOKUP(L15,$L$3:$O$7,4,0),\"\")&IFERROR(VLOOKUP(L15,$M$3:$O$7,2,0),\"\")","v":""},{"$f":"IF(L15=0,0,IF(COUNTBLANK(M15:N15),\"\",VLOOKUP(M15&N15,CHOOSE({1,2},tPts32458[Score 1]&tPts32458[Score 2],tPts32458[Pts]),2,0)))","v":0},{"$f":"Tirage!$F10","v":4},null,null,{"$f":"VLOOKUP(P15,Inscriptions!$I$19:$J$28,2,FALSE)","v":0},{"$f":"IFERROR(VLOOKUP(S15,$S$3:$U$7,3,0),\"\")&IFERROR(VLOOKUP(S15,$T$3:$V$7,3,0),\"\")","v":""},{"$f":"IFERROR(VLOOKUP(S15,$S$3:$V$7,4,0),\"\")&IFERROR(VLOOKUP(S15,$T$3:$V$7,2,0),\"\")","v":""},{"$f":"IF(COUNTBLANK(T15:U15),\"\",VLOOKUP(T15&U15,CHOOSE({1,2},tPts32458[Score 1]&tPts32458[Score 2],tPts32458[Pts]),2,0))","v":""},{"$f":"W4","v":5},null,null,{"$f":"VLOOKUP(W15,Inscriptions!$I$19:$J$28,2,FALSE)","v":0},{"$f":"IFERROR(VLOOKUP(Z15,$Z$3:$AB$7,3,0),\"\")&IFERROR(VLOOKUP(Z15,$AA$3:$AC$7,3,0),\"\")","v":""},{"$f":"IFERROR(VLOOKUP(Z15,$Z$3:$AC$7,4,0),\"\")&IFERROR(VLOOKUP(Z15,$AA$3:$AC$7,2,0),\"\")","v":""},{"$f":"IF(COUNTBLANK(AA15:AB15),\"\",VLOOKUP(AA15&AB15,CHOOSE({1,2},tPts32458[Score 1]&tPts32458[Score 2],tPts32458[Pts]),2,0))","v":""},{"$f":"Tirage!$J10","v":7},null,null,{"$f":"VLOOKUP(AD15,Inscriptions!$I$19:$J$28,2,FALSE)","v":0},{"$f":"IFERROR(VLOOKUP(AG15,$AG$3:$AI$7,3,0),\"\")&IFERROR(VLOOKUP(AG15,$AH$3:$AJ$7,3,0),\"\")","v":""},{"$f":"IFERROR(VLOOKUP(AG15,$AG$3:$AJ$7,4,0),\"\")&IFERROR(VLOOKUP(AG15,$AH$3:$AJ$7,2,0),\"\")","v":""},{"$f":"IF(COUNTBLANK(AH15:AI15),\"\",VLOOKUP(AH15&AI15,CHOOSE({1,2},tPts32458[Score 1]&tPts32458[Score 2],tPts32458[Pts]),2,0))","v":""},{"$f":"Tirage!$L10","v":3},null,null,{"$f":"VLOOKUP(AK15,Inscriptions!$I$19:$J$28,2,FALSE)","v":0},{"$f":"IFERROR(VLOOKUP(AN15,$AN$3:$AP$7,3,0),\"\")&IFERROR(VLOOKUP(AN15,$AO$3:$AQ$7,3,0),\"\")","v":""},{"$f":"IFERROR(VLOOKUP(AN15,$AN$3:$AQ$7,4,0),\"\")&IFERROR(VLOOKUP(AN15,$AO$3:$AQ$7,2,0),\"\")","v":""},{"$f":"IF(COUNTBLANK(AO15:AP15),\"\",VLOOKUP(AO15&AP15,CHOOSE({1,2},tPts32458[Score 1]&tPts32458[Score 2],tPts32458[Pts]),2,0))","v":""},{"$f":"Tirage!$N10","v":8},null,null,{"$f":"VLOOKUP(AR15,Inscriptions!$I$19:$J$28,2,FALSE)","v":0},{"$f":"IFERROR(VLOOKUP(AU15,AU$3:AW$7,3,0),\"\")&IFERROR(VLOOKUP(AU15,AV$3:AX$7,3,0),\"\")","v":""},{"$f":"IFERROR(VLOOKUP(AU15,AU$3:AX$7,4,0),\"\")&IFERROR(VLOOKUP(AU15,AV$3:AX$7,2,0),\"\")","v":""},{"$f":"IF(COUNTBLANK(AV15:AW15),\"\",VLOOKUP(AV15&AW15,CHOOSE({1,2},tPts32458[Score 1]&tPts32458[Score 2],tPts32458[Pts]),2,0))","v":""},{"$f":"Tirage!$P10","v":8},null,null,{"$f":"VLOOKUP(AY15,Inscriptions!$I$19:$J$28,2,FALSE)","v":0},{"$f":"IFERROR(VLOOKUP(BB15,$BB$3:BD$7,3,0),\"\")&IFERROR(VLOOKUP(BB15,$BC$3:$BE$7,3,0),\"\")","v":""},{"$f":"IFERROR(VLOOKUP(BB15,$BB$3:$BE$7,4,0),\"\")&IFERROR(VLOOKUP(BB15,$BC$3:$BE$7,2,0),\"\")","v":""},{"$f":"IF(COUNTBLANK(BC15:BD15),\"\",VLOOKUP(BC15&BD15,CHOOSE({1,2},tPts32458[Score 1]&tPts32458[Score 2],tPts32458[Pts]),2,0))","v":""},{"$f":"Tirage!$R10","v":7},null,null,{"$f":"VLOOKUP(BF15,Inscriptions!$I$19:$J$28,2,FALSE)","v":0},{"$f":"IFERROR(VLOOKUP(BI15,$BI$3:BK$7,3,0),\"\")&IFERROR(VLOOKUP(BI15,$BJ$3:$BL$7,3,0),\"\")","v":""},"",{"$f":"IF(COUNTBLANK(BJ15:BK15),\"\",VLOOKUP(BJ15&BK15,CHOOSE({1,2},tPts32458[Score 1]&tPts32458[Score 2],tPts32458[Pts]),2,0))","v":""}]
[null,{"$f":"Tirage!$B11","v":6},null,null,{"$f":"VLOOKUP(B16,Inscriptions!$I$19:$J$28,2,FALSE)","v":0},"","",{"$f":"IF(E17=0,0,IF(COUNTBLANK(F16:G16),\"\",VLOOKUP(F16&G16,CHOOSE({1,2},tPts32458[Score 1]&tPts32458[Score 2],tPts32458[Pts]),2,0)))","v":0},8,null,null,{"$f":"VLOOKUP(I16,Inscriptions!$I$19:$J$28,2,FALSE)","v":0},"","",{"$f":"IF(L16=0,0,IF(COUNTBLANK(M16:N16),\"\",VLOOKUP(M16&N16,CHOOSE({1,2},tPts32458[Score 1]&tPts32458[Score 2],tPts32458[Pts]),2,0)))","v":0},{"$f":"Tirage!$F11","v":8},null,null,{"$f":"VLOOKUP(P16,Inscriptions!$I$19:$J$28,2,FALSE)","v":0},"","",{"$f":"IF(COUNTBLANK(T16:U16),\"\",VLOOKUP(T16&U16,CHOOSE({1,2},tPts32458[Score 1]&tPts32458[Score 2],tPts32458[Pts]),2,0))","v":""},{"$f":"W5","v":4},null,null,{"$f":"VLOOKUP(W16,Inscriptions!$I$19:$J$28,2,FALSE)","v":0},"","",{"$f":"IF(COUNTBLANK(AA16:AB16),\"\",VLOOKUP(AA16&AB16,CHOOSE({1,2},tPts32458[Score 1]&tPts32458[Score 2],tPts32458[Pts]),2,0))","v":""},{"$f":"Tirage!$J11","v":4},null,null,{"$f":"VLOOKUP(AD16,Inscriptions!$I$19:$J$28,2,FALSE)","v":0},"","",{"$f":"IF(COUNTBLANK(AH16:AI16),\"\",VLOOKUP(AH16&AI16,CHOOSE({1,2},tPts32458[Score 1]&tPts32458[Score 2],tPts32458[Pts]),2,0))","v":""},{"$f":"Tirage!$L11","v":2},null,null,{"$f":"VLOOKUP(AK16,Inscriptions!$I$19:$J$28,2,FALSE)","v":0},"","",{"$f":"IF(COUNTBLANK(AO16:AP16),\"\",VLOOKUP(AO16&AP16,CHOOSE({1,2},tPts32458[Score 1]&tPts32458[Score 2],tPts32458[Pts]),2,0))","v":""},{"$f":"Tirage!$N11","v":4},null,null,{"$f":"VLOOKUP(AR16,Inscriptions!$I$19:$J$28,2,FALSE)","v":0},"","",{"$f":"IF(COUNTBLANK(AV16:AW16),\"\",VLOOKUP(AV16&AW16,CHOOSE({1,2},tPts32458[Score 1]&tPts32458[Score 2],tPts32458[Pts]),2,0))","v":""},{"$f":"Tirage!$P11","v":7},null,null,{"$f":"VLOOKUP(AY16,Inscriptions!$I$19:$J$28,2,FALSE)","v":0},{"$f":"IFERROR(VLOOKUP(BB16,$BB$3:BD$7,3,0),\"\")&IFERROR(VLOOKUP(BB16,$BC$3:$BE$7,3,0),\"\")","v":""},"",{"$f":"IF(COUNTBLANK(BC16:BD16),\"\",VLOOKUP(BC16&BD16,CHOOSE({1,2},tPts32458[Score 1]&tPts32458[Score 2],tPts32458[Pts]),2,0))","v":""},{"$f":"Tirage!$R11","v":4},null,null,{"$f":"VLOOKUP(BF16,Inscriptions!$I$19:$J$28,2,FALSE)","v":0},{"$f":"IFERROR(VLOOKUP(BI16,$BI$3:BK$7,3,0),\"\")&IFERROR(VLOOKUP(BI16,$BJ$3:$BL$7,3,0),\"\")","v":""},"",{"$f":"IF(COUNTBLANK(BJ16:BK16),\"\",VLOOKUP(BJ16&BK16,CHOOSE({1,2},tPts32458[Score 1]&tPts32458[Score 2],tPts32458[Pts]),2,0))","v":""}]
[null,{"$f":"Tirage!$B12","v":9},null,null,{"$f":"VLOOKUP(B17,Inscriptions!$I$19:$J$28,2,FALSE)","v":0},"","",{"$f":"IF(E18=0,0,IF(COUNTBLANK(F17:G17),\"\",VLOOKUP(F17&G17,CHOOSE({1,2},tPts32458[Score 1]&tPts32458[Score 2],tPts32458[Pts]),2,0)))","v":0},5,null,null,{"$f":"VLOOKUP(I17,Inscriptions!$I$19:$J$28,2,FALSE)","v":0},"","",{"$f":"IF(L17=0,0,IF(COUNTBLANK(M17:N17),\"\",VLOOKUP(M17&N17,CHOOSE({1,2},tPts32458[Score 1]&tPts32458[Score 2],tPts32458[Pts]),2,0)))","v":0},{"$f":"Tirage!$F12","v":1},null,null,{"$f":"VLOOKUP(P17,Inscriptions!$I$19:$J$28,2,FALSE)","v":0},"","",{"$f":"IF(COUNTBLANK(T17:U17),\"\",VLOOKUP(T17&U17,CHOOSE({1,2},tPts32458[Score 1]&tPts32458[Score 2],tPts32458[Pts]),2,0))","v":""},{"$f":"W6","v":8},null,null,{"$f":"VLOOKUP(W17,Inscriptions!$I$19:$J$28,2,FALSE)","v":0},"","",{"$f":"IF(COUNTBLANK(AA17:AB17),\"\",VLOOKUP(AA17&AB17,CHOOSE({1,2},tPts32458[Score 1]&tPts32458[Score 2],tPts32458[Pts]),2,0))","v":""},{"$f":"Tirage!$J12","v":3},null,null,{"$f":"VLOOKUP(AD17,Inscriptions!$I$19:$J$28,2,FALSE)","v":0},"","",{"$f":"IF(COUNTBLANK(AH17:AI17),\"\",VLOOKUP(AH17&AI17,CHOOSE({1,2},tPts32458[Score 1]&tPts32458[Score 2],tPts32458[Pts]),2,0))","v":""},{"$f":"Tirage!$L12","v":10},null,null,{"$f":"VLOOKUP(AK17,Inscriptions!$I$19:$J$28,2,FALSE)","v":0},"","",{"$f":"IF(COUNTBLANK(AO17:AP17),\"\",VLOOKUP(AO17&AP17,CHOOSE({1,2},tPts32458[Score 1]&tPts32458[Score 2],tPts32458[Pts]),2,0))","v":""},{"$f":"Tirage!$N12","v":7},null,null,{"$f":"VLOOKUP(AR17,Inscriptions!$I$19:$J$28,2,FALSE)","v":0},"","",{"$f":"IF(COUNTBLANK(AV17:AW17),\"\",VLOOKUP(AV17&AW17,CHOOSE({1,2},tPts32458[Score 1]&tPts32458[Score 2],tPts32458[Pts]),2,0))","v":""},{"$f":"Tirage!$P12","v":4},null,null,{"$f":"VLOOKUP(AY17,Inscriptions!$I$19:$J$28,2,FALSE)","v":0},{"$f":"IFERROR(VLOOKUP(BB17,$BB$3:BD$7,3,0),\"\")&IFERROR(VLOOKUP(BB17,$BC$3:$BE$7,3,0),\"\")","v":""},"",{"$f":"IF(COUNTBLANK(BC17:BD17),\"\",VLOOKUP(BC17&BD17,CHOOSE({1,2},tPts32458[Score 1]&tPts32458[Score 2],tPts32458[Pts]),2,0))","v":""},{"$f":"Tirage!$R12","v":10},null,null,{"$f":"VLOOKUP(BF17,Inscriptions!$I$19:$J$28,2,FALSE)","v":0},{"$f":"IFERROR(VLOOKUP(BI17,$BI$3:BK$7,3,0),\"\")&IFERROR(VLOOKUP(BI17,$BJ$3:$BL$7,3,0),\"\")","v":""},"",{"$f":"IF(COUNTBLANK(BJ17:BK17),\"\",VLOOKUP(BJ17&BK17,CHOOSE({1,2},tPts32458[Score 1]&tPts32458[Score 2],tPts32458[Pts]),2,0))","v":""}]
[null,{"$f":"Tirage!$B13","v":8},null,null,{"$f":"VLOOKUP(B18,Inscriptions!$I$19:$J$28,2,FALSE)","v":0},"","",{"$f":"IF(E19=0,0,IF(COUNTBLANK(F18:G18),\"\",VLOOKUP(F18&G18,CHOOSE({1,2},tPts32458[Score 1]&tPts32458[Score 2],tPts32458[Pts]),2,0)))","v":0},4,null,null,{"$f":"VLOOKUP(I18,Inscriptions!$I$19:$J$28,2,FALSE)","v":0},"","",{"$f":"IF(L18=0,0,IF(COUNTBLANK(M18:N18),\"\",VLOOKUP(M18&N18,CHOOSE({1,2},tPts32458[Score 1]&tPts32458[Score 2],tPts32458[Pts]),2,0)))","v":0},{"$f":"Tirage!$F13","v":3},null,null,{"$f":"VLOOKUP(P18,Inscriptions!$I$19:$J$28,2,FALSE)","v":0},"","",{"$f":"IF(COUNTBLANK(T18:U18),\"\",VLOOKUP(T18&U18,CHOOSE({1,2},tPts32458[Score 1]&tPts32458[Score 2],tPts32458[Pts]),2,0))","v":""},{"$f":"W7","v":1},null,null,{"$f":"VLOOKUP(W18,Inscriptions!$I$19:$J$28,2,FALSE)","v":0},"","",{"$f":"IF(COUNTBLANK(AA18:AB18),\"\",VLOOKUP(AA18&AB18,CHOOSE({1,2},tPts32458[Score 1]&tPts32458[Score 2],tPts32458[Pts]),2,0))","v":""},{"$f":"Tirage!$J13","v":10},null,null,{"$f":"VLOOKUP(AD18,Inscriptions!$I$19:$J$28,2,FALSE)","v":0},"","",{"$f":"IF(COUNTBLANK(AH18:AI18),\"\",VLOOKUP(AH18&AI18,CHOOSE({1,2},tPts32458[Score 1]&tPts32458[Score 2],tPts32458[Pts]),2,0))","v":""},{"$f":"Tirage!$L13","v":4},null,null,{"$f":"VLOOKUP(AK18,Inscriptions!$I$19:$J$28,2,FALSE)","v":0},"","",{"$f":"IF(COUNTBLANK(AO18:AP18),\"\",VLOOKUP(AO18&AP18,CHOOSE({1,2},tPts32458[Score 1]&tPts32458[Score 2],tPts32458[Pts]),2,0))","v":""},{"$f":"Tirage!$N13","v":5},null,null,{"$f":"VLOOKUP(AR18,Inscriptions!$I$19:$J$28,2,FALSE)","v":0},"","",{"$f":"IF(COUNTBLANK(AV18:AW18),\"\",VLOOKUP(AV18&AW18,CHOOSE({1,2},tPts32458[Score 1]&tPts32458[Score 2],tPts32458[Pts]),2,0))","v":""},{"$f":"Tirage!$P13","v":10},null,null,{"$f":"VLOOKUP(AY18,Inscriptions!$I$19:$J$28,2,FALSE)","v":0},{"$f":"IFERROR(VLOOKUP(BB18,$BB$3:BD$7,3,0),\"\")&IFERROR(VLOOKUP(BB18,$BC$3:$BE$7,3,0),\"\")","v":""},"",{"$f":"IF(COUNTBLANK(BC18:BD18),\"\",VLOOKUP(BC18&BD18,CHOOSE({1,2},tPts32458[Score 1]&tPts32458[Score 2],tPts32458[Pts]),2,0))","v":""},{"$f":"Tirage!$R13","v":3},null,null,{"$f":"VLOOKUP(BF18,Inscriptions!$I$19:$J$28,2,FALSE)","v":0},{"$f":"IFERROR(VLOOKUP(BI18,$BI$3:BK$7,3,0),\"\")&IFERROR(VLOOKUP(BI18,$BJ$3:$BL$7,3,0),\"\")","v":""},"",{"$f":"IF(COUNTBLANK(BJ18:BK18),\"\",VLOOKUP(BJ18&BK18,CHOOSE({1,2},tPts32458[Score 1]&tPts32458[Score 2],tPts32458[Pts]),2,0))","v":""}]
[null,{"$f":"Tirage!$C9","v":10},null,null,{"$f":"VLOOKUP(B19,Inscriptions!$I$19:$J$28,2,FALSE)","v":0},"","",{"$f":"IF(E20=0,0,IF(COUNTBLANK(F19:G19),\"\",VLOOKUP(F19&G19,CHOOSE({1,2},tPts32458[Score 1]&tPts32458[Score 2],tPts32458[Pts]),2,0)))","v":0},{"$f":"J3","v":9},null,null,{"$f":"VLOOKUP(I19,Inscriptions!$I$19:$J$28,2,FALSE)","v":0},"","",{"$f":"IF(L19=0,0,IF(COUNTBLANK(M19:N19),\"\",VLOOKUP(M19&N19,CHOOSE({1,2},tPts32458[Score 1]&tPts32458[Score 2],tPts32458[Pts]),2,0)))","v":0},{"$f":"Tirage!$G9","v":2},null,null,{"$f":"VLOOKUP(P19,Inscriptions!$I$19:$J$28,2,FALSE)","v":0},"","",{"$f":"IF(COUNTBLANK(T19:U19),\"\",VLOOKUP(T19&U19,CHOOSE({1,2},tPts32458[Score 1]&tPts32458[Score 2],tPts32458[Pts]),2,0))","v":""},{"$f":"X3","v":10},null,null,{"$f":"VLOOKUP(W19,Inscriptions!$I$19:$J$28,2,FALSE)","v":0},"","",{"$f":"IF(COUNTBLANK(AA19:AB19),\"\",VLOOKUP(AA19&AB19,CHOOSE({1,2},tPts32458[Score 1]&tPts32458[Score 2],tPts32458[Pts]),2,0))","v":""},{"$f":"Tirage!$K9","v":6},null,null,{"$f":"VLOOKUP(AD19,Inscriptions!$I$19:$J$28,2,FALSE)","v":0},"","",{"$f":"IF(COUNTBLANK(AH19:AI19),\"\",VLOOKUP(AH19&AI19,CHOOSE({1,2},tPts32458[Score 1]&tPts32458[Score 2],tPts32458[Pts]),2,0))","v":""},{"$f":"Tirage!$M9","v":6},null,null,{"$f":"VLOOKUP(AK19,Inscriptions!$I$19:$J$28,2,FALSE)","v":0},"","",{"$f":"IF(COUNTBLANK(AO19:AP19),\"\",VLOOKUP(AO19&AP19,CHOOSE({1,2},tPts32458[Score 1]&tPts32458[Score 2],tPts32458[Pts]),2,0))","v":""},{"$f":"Tirage!$O9","v":10},null,null,{"$f":"VLOOKUP(AR19,Inscriptions!$I$19:$J$28,2,FALSE)","v":0},"","",{"$f":"IF(COUNTBLANK(AV19:AW19),\"\",VLOOKUP(AV19&AW19,CHOOSE({1,2},tPts32458[Score 1]&tPts32458[Score 2],tPts32458[Pts]),2,0))","v":""},{"$f":"Tirage!$Q9","v":9},null,null,{"$f":"VLOOKUP(AY19,Inscriptions!$I$19:$J$28,2,FALSE)","v":0},{"$f":"IFERROR(VLOOKUP(BB19,$BB$3:BD$7,3,0),\"\")&IFERROR(VLOOKUP(BB19,$BC$3:$BE$7,3,0),\"\")","v":""},"",{"$f":"IF(COUNTBLANK(BC19:BD19),\"\",VLOOKUP(BC19&BD19,CHOOSE({1,2},tPts32458[Score 1]&tPts32458[Score 2],tPts32458[Pts]),2,0))","v":""},{"$f":"Tirage!$S9","v":8},null,null,{"$f":"VLOOKUP(BF19,Inscriptions!$I$19:$J$28,2,FALSE)","v":0},{"$f":"IFERROR(VLOOKUP(BI19,$BI$3:BK$7,3,0),\"\")&IFERROR(VLOOKUP(BI19,$BJ$3:$BL$7,3,0),\"\")","v":""},"",{"$f":"IF(COUNTBLANK(BJ19:BK19),\"\",VLOOKUP(BJ19&BK19,CHOOSE({1,2},tPts32458[Score 1]&tPts32458[Score 2],tPts32458[Pts]),2,0))","v":""}]
[null,{"$f":"Tirage!$C10","v":5},null,null,{"$f":"VLOOKUP(B20,Inscriptions!$I$19:$J$28,2,FALSE)","v":0},"","",{"$f":"IF(E21=0,0,IF(COUNTBLANK(F20:G20),\"\",VLOOKUP(F20&G20,CHOOSE({1,2},tPts32458[Score 1]&tPts32458[Score 2],tPts32458[Pts]),2,0)))","v":0},{"$f":"J4","v":1},null,null,{"$f":"VLOOKUP(I20,Inscriptions!$I$19:$J$28,2,FALSE)","v":0},"","",{"$f":"IF(L20=0,0,IF(COUNTBLANK(M20:N20),\"\",VLOOKUP(M20&N20,CHOOSE({1,2},tPts32458[Score 1]&tPts32458[Score 2],tPts32458[Pts]),2,0)))","v":0},{"$f":"Tirage!$G10","v":7},null,null,{"$f":"VLOOKUP(P20,Inscriptions!$I$19:$J$28,2,FALSE)","v":0},"","",{"$f":"IF(COUNTBLANK(T20:U20),\"\",VLOOKUP(T20&U20,CHOOSE({1,2},tPts32458[Score 1]&tPts32458[Score 2],tPts32458[Pts]),2,0))","v":""},{"$f":"X4","v":9},null,null,{"$f":"VLOOKUP(W20,Inscriptions!$I$19:$J$28,2,FALSE)","v":0},"","",{"$f":"IF(COUNTBLANK(AA20:AB20),\"\",VLOOKUP(AA20&AB20,CHOOSE({1,2},tPts32458[Score 1]&tPts32458[Score 2],tPts32458[Pts]),2,0))","v":""},{"$f":"Tirage!$K10","v":5},null,null,{"$f":"VLOOKUP(AD20,Inscriptions!$I$19:$J$28,2,FALSE)","v":0},"","",{"$f":"IF(COUNTBLANK(AH20:AI20),\"\",VLOOKUP(AH20&AI20,CHOOSE({1,2},tPts32458[Score 1]&tPts32458[Score 2],tPts32458[Pts]),2,0))","v":""},{"$f":"Tirage!$M10","v":1},null,null,{"$f":"VLOOKUP(AK20,Inscriptions!$I$19:$J$28,2,FALSE)","v":0},"","",{"$f":"IF(COUNTBLANK(AO20:AP20),\"\",VLOOKUP(AO20&AP20,CHOOSE({1,2},tPts32458[Score 1]&tPts32458[Score 2],tPts32458[Pts]),2,0))","v":""},{"$f":"Tirage!$O10","v":1},null,null,{"$f":"VLOOKUP(AR20,Inscriptions!$I$19:$J$28,2,FALSE)","v":0},"","",{"$f":"IF(COUNTBLANK(AV20:AW20),\"\",VLOOKUP(AV20&AW20,CHOOSE({1,2},tPts32458[Score 1]&tPts32458[Score 2],tPts32458[Pts]),2,0))","v":""},{"$f":"Tirage!$Q10","v":5},null,null,{"$f":"VLOOKUP(AY20,Inscriptions!$I$19:$J$28,2,FALSE)","v":0},{"$f":"IFERROR(VLOOKUP(BB20,$BB$3:BD$7,3,0),\"\")&IFERROR(VLOOKUP(BB20,$BC$3:$BE$7,3,0),\"\")","v":""},"",{"$f":"IF(COUNTBLANK(BC20:BD20),\"\",VLOOKUP(BC20&BD20,CHOOSE({1,2},tPts32458[Score 1]&tPts32458[Score 2],tPts32458[Pts]),2,0))","v":""},{"$f":"Tirage!$S10","v":9},null,null,{"$f":"VLOOKUP(BF20,Inscriptions!$I$19:$J$28,2,FALSE)","v":0},{"$f":"IFERROR(VLOOKUP(BI20,$BI$3:BK$7,3,0),\"\")&IFERROR(VLOOKUP(BI20,$BJ$3:$BL$7,3,0),\"\")","v":""},"",{"$f":"IF(COUNTBLANK(BJ20:BK20),\"\",VLOOKUP(BJ20&BK20,CHOOSE({1,2},tPts32458[Score 1]&tPts32458[Score 2],tPts32458[Pts]),2,0))","v":""}]
[null,{"$f":"Tirage!$C11","v":2},null,null,{"$f":"VLOOKUP(B21,Inscriptions!$I$19:$J$28,2,FALSE)","v":0},"","",{"$f":"IF(E22=0,0,IF(COUNTBLANK(F21:G21),\"\",VLOOKUP(F21&G21,CHOOSE({1,2},tPts32458[Score 1]&tPts32458[Score 2],tPts32458[Pts]),2,0)))","v":0},7,null,null,{"$f":"VLOOKUP(I21,Inscriptions!$I$19:$J$28,2,FALSE)","v":0},"","",{"$f":"IF(L21=0,0,IF(COUNTBLANK(M21:N21),\"\",VLOOKUP(M21&N21,CHOOSE({1,2},tPts32458[Score 1]&tPts32458[Score 2],tPts32458[Pts]),2,0)))","v":0},{"$f":"Tirage!$G11","v":9},null,null,{"$f":"VLOOKUP(P21,Inscriptions!$I$19:$J$28,2,FALSE)","v":0},"","",{"$f":"IF(COUNTBLANK(T21:U21),\"\",VLOOKUP(T21&U21,CHOOSE({1,2},tPts32458[Score 1]&tPts32458[Score 2],tPts32458[Pts]),2,0))","v":""},{"$f":"X5","v":3},null,null,{"$f":"VLOOKUP(W21,Inscriptions!$I$19:$J$28,2,FALSE)","v":0},"","",{"$f":"IF(COUNTBLANK(AA21:AB21),\"\",VLOOKUP(AA21&AB21,CHOOSE({1,2},tPts32458[Score 1]&tPts32458[Score 2],tPts32458[Pts]),2,0))","v":""},{"$f":"Tirage!$K11","v":2},null,null,{"$f":"VLOOKUP(AD21,Inscriptions!$I$19:$J$28,2,FALSE)","v":0},"","",{"$f":"IF(COUNTBLANK(AH21:AI21),\"\",VLOOKUP(AH21&AI21,CHOOSE({1,2},tPts32458[Score 1]&tPts32458[Score 2],tPts32458[Pts]),2,0))","v":""},{"$f":"Tirage!$M11","v":7},null,null,{"$f":"VLOOKUP(AK21,Inscriptions!$I$19:$J$28,2,FALSE)","v":0},"","",{"$f":"IF(COUNTBLANK(AO21:AP21),\"\",VLOOKUP(AO21&AP21,CHOOSE({1,2},tPts32458[Score 1]&tPts32458[Score 2],tPts32458[Pts]),2,0))","v":""},{"$f":"Tirage!$O11","v":9},null,null,{"$f":"VLOOKUP(AR21,Inscriptions!$I$19:$J$28,2,FALSE)","v":0},"","",{"$f":"IF(COUNTBLANK(AV21:AW21),\"\",VLOOKUP(AV21&AW21,CHOOSE({1,2},tPts32458[Score 1]&tPts32458[Score 2],tPts32458[Pts]),2,0))","v":""},{"$f":"Tirage!$Q11","v":3},null,null,{"$f":"VLOOKUP(AY21,Inscriptions!$I$19:$J$28,2,FALSE)","v":0},{"$f":"IFERROR(VLOOKUP(BB21,$BB$3:BD$7,3,0),\"\")&IFERROR(VLOOKUP(BB21,$BC$3:$BE$7,3,0),\"\")","v":""},"",{"$f":"IF(COUNTBLANK(BC21:BD21),\"\",VLOOKUP(BC21&BD21,CHOOSE({1,2},tPts32458[Score 1]&tPts32458[Score 2],tPts32458[Pts]),2,0))","v":""},{"$f":"Tirage!$S11","v":1},null,null,{"$f":"VLOOKUP(BF21,Inscriptions!$I$19:$J$28,2,FALSE)","v":0},{"$f":"IFERROR(VLOOKUP(BI21,$BI$3:BK$7,3,0),\"\")&IFERROR(VLOOKUP(BI21,$BJ$3:$BL$7,3,0),\"\")","v":""},"",{"$f":"IF(COUNTBLANK(BJ21:BK21),\"\",VLOOKUP(BJ21&BK21,CHOOSE({1,2},tPts32458[Score 1]&tPts32458[Score 2],tPts32458[Pts]),2,0))","v":""}]
[null,{"$f":"Tirage!$C12","v":1},null,null,{"$f":"VLOOKUP(B22,Inscriptions!$I$19:$J$28,2,FALSE)","v":0},"","",{"$f":"IF(E23=0,0,IF(COUNTBLANK(F22:G22),\"\",VLOOKUP(F22&G22,CHOOSE({1,2},tPts32458[Score 1]&tPts32458[Score 2],tPts32458[Pts]),2,0)))","v":0},6,null,null,{"$f":"VLOOKUP(I22,Inscriptions!$I$19:$J$28,2,FALSE)","v":0},"","",{"$f":"IF(L22=0,0,IF(COUNTBLANK(M22:N22),\"\",VLOOKUP(M22&N22,CHOOSE({1,2},tPts32458[Score 1]&tPts32458[Score 2],tPts32458[Pts]),2,0)))","v":0},{"$f":"Tirage!$G12","v":5},null,null,{"$f":"VLOOKUP(P22,Inscriptions!$I$19:$J$28,2,FALSE)","v":0},"","",{"$f":"IF(COUNTBLANK(T22:U22),\"\",VLOOKUP(T22&U22,CHOOSE({1,2},tPts32458[Score 1]&tPts32458[Score 2],tPts32458[Pts]),2,0))","v":""},{"$f":"X6","v":2},null,null,{"$f":"VLOOKUP(W22,Inscriptions!$I$19:$J$28,2,FALSE)","v":0},"","",{"$f":"IF(COUNTBLANK(AA22:AB22),\"\",VLOOKUP(AA22&AB22,CHOOSE({1,2},tPts32458[Score 1]&tPts32458[Score 2],tPts32458[Pts]),2,0))","v":""},{"$f":"Tirage!$K12","v":8},null,null,{"$f":"VLOOKUP(AD22,Inscriptions!$I$19:$J$28,2,FALSE)","v":0},"","",{"$f":"IF(COUNTBLANK(AH22:AI22),\"\",VLOOKUP(AH22&AI22,CHOOSE({1,2},tPts32458[Score 1]&tPts32458[Score 2],tPts32458[Pts]),2,0))","v":""},{"$f":"Tirage!$M12","v":8},null,null,{"$f":"VLOOKUP(AK22,Inscriptions!$I$19:$J$28,2,FALSE)","v":0},"","",{"$f":"IF(COUNTBLANK(AO22:AP22),\"\",VLOOKUP(AO22&AP22,CHOOSE({1,2},tPts32458[Score 1]&tPts32458[Score 2],tPts32458[Pts]),2,0))","v":""},{"$f":"Tirage!$O12","v":6},null,null,{"$f":"VLOOKUP(AR22,Inscriptions!$I$19:$J$28,2,FALSE)","v":0},"","",{"$f":"IF(COUNTBLANK(AV22:AW22),\"\",VLOOKUP(AV22&AW22,CHOOSE({1,2},tPts32458[Score 1]&tPts32458[Score 2],tPts32458[Pts]),2,0))","v":""},{"$f":"Tirage!$Q12","v":6},null,null,{"$f":"VLOOKUP(AY22,Inscriptions!$I$19:$J$28,2,FALSE)","v":0},{"$f":"IFERROR(VLOOKUP(BB22,$BB$3:BD$7,3,0),\"\")&IFERROR(VLOOKUP(BB22,$BC$3:$BE$7,3,0),\"\")","v":""},"",{"$f":"IF(COUNTBLANK(BC22:BD22),\"\",VLOOKUP(BC22&BD22,CHOOSE({1,2},tPts32458[Score 1]&tPts32458[Score 2],tPts32458[Pts]),2,0))","v":""},{"$f":"Tirage!$S12","v":5},null,null,{"$f":"VLOOKUP(BF22,Inscriptions!$I$19:$J$28,2,FALSE)","v":0},{"$f":"IFERROR(VLOOKUP(BI22,$BI$3:BK$7,3,0),\"\")&IFERROR(VLOOKUP(BI22,$BJ$3:$BL$7,3,0),\"\")","v":""},"",{"$f":"IF(COUNTBLANK(BJ22:BK22),\"\",VLOOKUP(BJ22&BK22,CHOOSE({1,2},tPts32458[Score 1]&tPts32458[Score 2],tPts32458[Pts]),2,0))","v":""}]
[null,{"$f":"Tirage!$C13","v":4},null,null,{"$f":"VLOOKUP(B23,Inscriptions!$I$19:$J$28,2,FALSE)","v":0},"","",{"$f":"IF(E23=0,0,IF(COUNTBLANK(F23:G23),\"\",VLOOKUP(F23&G23,CHOOSE({1,2},tPts32458[Score 1]&tPts32458[Score 2],tPts32458[Pts]),2,0)))","v":0},10,null,null,{"$f":"VLOOKUP(I23,Inscriptions!$I$19:$J$28,2,FALSE)","v":0},"","",{"$f":"IF(L23=0,0,IF(COUNTBLANK(M23:N23),\"\",VLOOKUP(M23&N23,CHOOSE({1,2},tPts32458[Score 1]&tPts32458[Score 2],tPts32458[Pts]),2,0)))","v":0},{"$f":"Tirage!$G13","v":6},null,null,{"$f":"VLOOKUP(P23,Inscriptions!$I$19:$J$28,2,FALSE)","v":0},"","",{"$f":"IF(COUNTBLANK(T23:U23),\"\",VLOOKUP(T23&U23,CHOOSE({1,2},tPts32458[Score 1]&tPts32458[Score 2],tPts32458[Pts]),2,0))","v":""},{"$f":"X7","v":7},null,null,{"$f":"VLOOKUP(W23,Inscriptions!$I$19:$J$28,2,FALSE)","v":0},"","",{"$f":"IF(COUNTBLANK(AA23:AB23),\"\",VLOOKUP(AA23&AB23,CHOOSE({1,2},tPts32458[Score 1]&tPts32458[Score 2],tPts32458[Pts]),2,0))","v":""},{"$f":"Tirage!$K13","v":9},null,null,{"$f":"VLOOKUP(AD23,Inscriptions!$I$19:$J$28,2,FALSE)","v":0},"","",{"$f":"IF(COUNTBLANK(AH23:AI23),\"\",VLOOKUP(AH23&AI23,CHOOSE({1,2},tPts32458[Score 1]&tPts32458[Score 2],tPts32458[Pts]),2,0))","v":""},{"$f":"Tirage!$M13","v":5},null,null,{"$f":"VLOOKUP(AK23,Inscriptions!$I$19:$J$28,2,FALSE)","v":0},{"$f":"IFERROR(VLOOKUP(AN23,$AN$3:$AP$7,3,0),\"\")&IFERROR(VLOOKUP(AN23,$AO$3:$AQ$7,3,0),\"\")","v":""},{"$f":"IFERROR(VLOOKUP(AN23,$AN$3:$AQ$7,4,0),\"\")&IFERROR(VLOOKUP(AN23,$AO$3:$AQ$7,2,0),\"\")","v":""},{"$f":"IF(COUNTBLANK(AO23:AP23),\"\",VLOOKUP(AO23&AP23,CHOOSE({1,2},tPts32458[Score 1]&tPts32458[Score 2],tPts32458[Pts]),2,0))","v":""},{"$f":"Tirage!$O13","v":2},null,null,{"$f":"VLOOKUP(AR23,Inscriptions!$I$19:$J$28,2,FALSE)","v":0},"","",{"$f":"IF(COUNTBLANK(AV23:AW23),\"\",VLOOKUP(AV23&AW23,CHOOSE({1,2},tPts32458[Score 1]&tPts32458[Score 2],tPts32458[Pts]),2,0))","v":""},{"$f":"Tirage!$Q13","v":1},null,null,{"$f":"VLOOKUP(AY23,Inscriptions!$I$19:$J$28,2,FALSE)","v":0},{"$f":"IFERROR(VLOOKUP(BB23,$BB$3:BD$7,3,0),\"\")&IFERROR(VLOOKUP(BB23,$BC$3:$BE$7,3,0),\"\")","v":""},"",{"$f":"IF(COUNTBLANK(BC23:BD23),\"\",VLOOKUP(BC23&BD23,CHOOSE({1,2},tPts32458[Score 1]&tPts32458[Score 2],tPts32458[Pts]),2,0))","v":""},{"$f":"Tirage!$S13","v":2},null,null,{"$f":"VLOOKUP(BF23,Inscriptions!$I$19:$J$28,2,FALSE)","v":0},{"$f":"IFERROR(VLOOKUP(BI23,$BI$3:BK$7,3,0),\"\")&IFERROR(VLOOKUP(BI23,$BJ$3:$BL$7,3,0),\"\")","v":""},"",{"$f":"IF(COUNTBLANK(BJ23:BK23),\"\",VLOOKUP(BJ23&BK23,CHOOSE({1,2},tPts32458[Score 1]&tPts32458[Score 2],tPts32458[Pts]),2,0))","v":""}]
[]
[]
[]
[null,null,null,"Grille des points",null,null,null,null,null,null,null,null,"Classement Général journée 4"]
[null,null,null,"Score 1","Score 2","Pts",null,null,null,"Place",null,"Place","Equipes","Total Pts"]
[null,null,null,0,0,0,null,null,null,1,null,1,null,{"$f":"IFERROR(VLOOKUP(M29,$E$14:$H$23,4,0)*1,0)\n+IFERROR(VLOOKUP(M29,$L$14:$O$23,4,0)*1,0)\n+IFERROR(VLOOKUP(M29,$S$14:$V$23,4,0)*1,0)\n+IFERROR(VLOOKUP(M29,$Z$14:$AC$23,4,0)*1,0)\n+IFERROR(VLOOKUP(M29,$AG$14:$AJ$23,4,0)*1,0)\n+IFERROR(VLOOKUP(M29,$AN$14:$AQ$23,4,0)*1,0)\n+IFERROR(VLOOKUP(M29,$AU$14:$AX$23,4,0)*1,0\n+IFERROR(VLOOKUP(M29,$BB$14:$BE$23,4,0)*1,0)\n+IFERROR(VLOOKUP(M29,$BI$14:$BL$23,4,0)*1,0))","v":0},{"$f":"IF(N29=0,-100,N29)","v":-100}]
[null,null,null,0,1,1,null,null,null,2,null,2,null,0,-100]
[null,null,null,0,2,1,null,null,null,3,null,3,null,0,-100]
[null,null,null,1,0,10,null,null,null,4,null,4,null,0,-100]
[null,null,null,1,1,3,null,null,null,5,null,5,null,0,-100]
[null,null,null,1,2,1,null,null,null,6,null,6,null,0,-100]
[null,null,null,2,0,10,null,null,null,7,null,7,null,0,-100]
[null,null,null,2,1,10,null,null,null,8,null,8,null,0,-100]
[null,null,null,2,2,3,null,null,null,9,null,9,null,0,-100]
[null,null,null,2,"ab",10,null,null,null,10,null,10,null,0,-100]
[null,null,null,"ab",2,0,null,null,null,11]
[null,null,null,1,"ab",10,null,null,null,12]
[null,null,null,"ab",1,0,null,null,null,13]

{"sheet":"Journée8","index":12,"n_rows":42,"n_cols":64,"rows_kept":42,"cut":false,"hidden":true,"merged":[[26,3,26,5],[26,10,26,11],[26,12,26,13],[30,15,30,16],[10,39,10,42],[10,46,10,49],[10,53,10,56],[10,60,10,63],[25,12,25,13],[10,4,10,7],[10,11,10,14],[10,18,10,21],[10,25,10,28],[10,32,10,35],[7,48,7,49],[7,55,7,56],[7,62,7,63],[8,12,9,14],[8,27,8,28],[8,34,8,35],[8,41,8,42],[8,48,8,49],[8,55,8,56],[8,62,8,63],[7,41,7,42],[9,34,9,61],[7,6,7,7],[7,13,7,14],[7,20,7,21],[7,27,7,28],[7,34,7,35],[0,60,0,63],[0,24,1,24],[0,25,0,28],[0,31,1,31],[0,32,0,35],[0,38,1,38],[0,39,0,42],[0,45,1,45],[0,46,0,49],[0,52,1,52],[0,53,0,56],[0,59,1,59],[0,18,0,21],[0,3,1,3],[0,4,0,7],[0,10,1,10],[0,11,0,14],[0,17,1,17]]}
[null,null,null,"Arbitre","TOUR 1",null,null,null,null,null,"Arbitre","TOUR 2",null,null,null,null,null,"Arbitre","TOUR 3",null,null,null,null,null,"Arbitre","TOUR 4",null,null,null,null,null,"Arbitre","TOUR 5",null,null,null,null,null,"Arbitre","TOUR 6",null,null,null,null,null,"Arbitre","TOUR 7",null,null,null,null,null,"Arbitre","TOUR 8",null,null,null,null,null,"Arbitre","TOUR 9"]
[null,null,null,null,"Equipe 1","Equipe 2","Score 1","Score 2",null,null,null,"Equipe 1","Equipe 2","Score 1","Score 2",null,null,null,"Equipe 1","Equipe 2","Score 1","Score 2",null,null,null,"Equipe 1","Equipe 2","Score 1","Score 2",null,null,null,"Equipe 1","Equipe 2","Score 1","Score 2",null,null,null,"Equipe 1","Equipe 2","Score 1","Score 2",null,null,null,"Equipe 1","Equipe 2","Score 1","Score 2",null,null,null,"Equipe 1","Equipe 2","Score 1","Score 2",null,null,null,"Equipe 1","Equipe 2","Score 1","Score 2"]
[null,{"$f":"Tirage!$B9","v":7},{"$f":"Tirage!$C9","v":10},{"$f":"B7","v":8},{"$f":"VLOOKUP(B3,Inscriptions!$M$19:$N$28,2,FALSE)","v":0},{"$f":"VLOOKUP(C3,Inscriptions!$M$19:$N$28,2,FALSE)","v":0},null,null,{"$f":"Tirage!D9","v":3},{"$f":"Tirage!E9","v":9},{"$f":"I7","v":4},{"$f":"VLOOKUP(I3,Inscriptions!$M$19:$N$28,2,FALSE)","v":0},{"$f":"VLOOKUP(J3,Inscriptions!$M$19:$N$28,2,FALSE)","v":0},null,null,{"$f":"Tirage!$F9","v":10},{"$f":"Tirage!$G9","v":2},{"$f":"P7","v":3},{"$f":"VLOOKUP(P3,Inscriptions!$M$19:$N$28,2,FALSE)","v":0},{"$f":"VLOOKUP(Q3,Inscriptions!$M$19:$N$28,2,FALSE)","v":0},null,null,{"$f":"Tirage!$H9","v":6},{"$f":"Tirage!$I9","v":10},{"$f":"W7","v":1},{"$f":"VLOOKUP(W3,Inscriptions!$M$19:$N$28,2,FALSE)","v":0},{"$f":"VLOOKUP(X3,Inscriptions!$M$19:$N$28,2,FALSE)","v":0},null,null,{"$f":"Tirage!$J9","v":1},{"$f":"Tirage!$K9","v":6},{"$f":"AD7","v":10},{"$f":"VLOOKUP(AD3,Inscriptions!$M$19:$N$28,2,FALSE)","v":0},{"$f":"VLOOKUP(AE3,Inscriptions!$M$19:$N$28,2,FALSE)","v":0},null,null,{"$f":"Tirage!$L9","v":9},{"$f":"Tirage!$M9","v":6},{"$f":"AK7","v":4},{"$f":"VLOOKUP(AK3,Inscriptions!$M$19:$N$28,2,FALSE)","v":0},{"$f":"VLOOKUP(AL3,Inscriptions!$M$19:$N$28,2,FALSE)","v":0},null,null,{"$f":"Tirage!$N9","v":3},{"$f":"Tirage!$O9","v":10},{"$f":"AR7","v":5},{"$f":"VLOOKUP(AR3,Inscriptions!$M$19:$N$28,2,FALSE)","v":0},{"$f":"VLOOKUP(AS3,Inscriptions!$M$19:$N$28,2,FALSE)","v":0},null,null,{"$f":"Tirage!$P9","v":2},{"$f":"Tirage!$Q9","v":9},{"$f":"AY7","v":10},{"$f":"VLOOKUP(AY3,Inscriptions!$M$19:$N$28,2,FALSE)","v":0},{"$f":"VLOOKUP(AZ3,Inscriptions!$M$19:$N$28,2,FALSE)","v":0},null,null,{"$f":"Tirage!$R9","v":6},{"$f":"Tirage!$S9","v":8},{"$f":"BF7","v":3},{"$f":"VLOOKUP(BF3,Inscriptions!$M$19:$N$28,2,FALSE)","v":0},{"$f":"VLOOKUP(BG3,Inscriptions!$M$19:$N$28,2,FALSE)","v":0}]
[null,{"$f":"Tirage!$B10","v":3},{"$f":"Tirage!$C10","v":5},{"$f":"C7","v":4},{"$f":"VLOOKUP(B4,Inscriptions!$M$19:$N$28,2,FALSE)","v":0},{"$f":"VLOOKUP(C4,Inscriptions!$M$19:$N$28,2,FALSE)","v":0},null,null,{"$f":"Tirage!D10","v":2},{"$f":"Tirage!E10","v":1},{"$f":"J7","v":10},{"$f":"VLOOKUP(I4,Inscriptions!$M$19:$N$28,2,FALSE)","v":0},{"$f":"VLOOKUP(J4,Inscriptions!$M$19:$N$28,2,FALSE)","v":0},null,null,{"$f":"Tirage!$F10","v":4},{"$f":"Tirage!$G10","v":7},{"$f":"Q7","v":6},{"$f":"VLOOKUP(P4,Inscriptions!$M$19:$N$28,2,FALSE)","v":0},{"$f":"VLOOKUP(Q4,Inscriptions!$M$19:$N$28,2,FALSE)","v":0},null,null,{"$f":"Tirage!$H10","v":5},{"$f":"Tirage!$I10","v":9},{"$f":"X7","v":7},{"$f":"VLOOKUP(W4,Inscriptions!$M$19:$N$28,2,FALSE)","v":0},{"$f":"VLOOKUP(X4,Inscriptions!$M$19:$N$28,2,FALSE)","v":0},null,null,{"$f":"Tirage!$J10","v":7},{"$f":"Tirage!$K10","v":5},{"$f":"AE7","v":9},{"$f":"VLOOKUP(AD4,Inscriptions!$M$19:$N$28,2,FALSE)","v":0},{"$f":"VLOOKUP(AE4,Inscriptions!$M$19:$N$28,2,FALSE)","v":0},null,null,{"$f":"Tirage!$L10","v":3},{"$f":"Tirage!$M10","v":1},{"$f":"AL7","v":5},{"$f":"VLOOKUP(AK4,Inscriptions!$M$19:$N$28,2,FALSE)","v":0},{"$f":"VLOOKUP(AL4,Inscriptions!$M$19:$N$28,2,FALSE)","v":0},null,null,{"$f":"Tirage!$N10","v":8},{"$f":"Tirage!$O10","v":1},{"$f":"AS7","v":2},{"$f":"VLOOKUP(AR4,Inscriptions!$M$19:$N$28,2,FALSE)","v":0},{"$f":"VLOOKUP(AS4,Inscriptions!$M$19:$N$28,2,FALSE)","v":0},null,null,{"$f":"Tirage!$P10","v":8},{"$f":"Tirage!$Q10","v":5},{"$f":"AZ7","v":1},{"$f":"VLOOKUP(AY4,Inscriptions!$M$19:$N$28,2,FALSE)","v":0},{"$f":"VLOOKUP(AZ4,Inscriptions!$M$19:$N$28,2,FALSE)","v":0},null,null,{"$f":"Tirage!$R10","v":7},{"$f":"Tirage!$S10","v":9},{"$f":"BG7","v":2},{"$f":"VLOOKUP(BF4,Inscriptions!$M$19:$N$28,2,FALSE)","v":0},{"$f":"VLOOKUP(BG4,Inscriptions!$M$19:$N$28,2,FALSE)","v":0}]
[null,{"$f":"Tirage!$B11","v":6},{"$f":"Tirage!$C11","v":2},{"$f":"B6","v":9},{"$f":"VLOOKUP(B5,Inscriptions!$M$19:$N$28,2,FALSE)","v":0},{"$f":"VLOOKUP(C5,Inscriptions!$M$19:$N$28,2,FALSE)","v":0},null,null,{"$f":"Tirage!D11","v":8},{"$f":"Tirage!E11","v":7},{"$f":"I6","v":5},{"$f":"VLOOKUP(I5,Inscriptions!$M$19:$N$28,2,FALSE)","v":0},{"$f":"VLOOKUP(J5,Inscriptions!$M$19:$N$28,2,FALSE)","v":0},null,null,{"$f":"Tirage!$F11","v":8},{"$f":"Tirage!$G11","v":9},{"$f":"P6","v":1},{"$f":"VLOOKUP(P5,Inscriptions!$M$19:$N$28,2,FALSE)","v":0},{"$f":"VLOOKUP(Q5,Inscriptions!$M$19:$N$28,2,FALSE)","v":0},null,null,{"$f":"Tirage!$H11","v":4},{"$f":"Tirage!$I11","v":3},{"$f":"W6","v":8},{"$f":"VLOOKUP(W5,Inscriptions!$M$19:$N$28,2,FALSE)","v":0},{"$f":"VLOOKUP(X5,Inscriptions!$M$19:$N$28,2,FALSE)","v":0},null,null,{"$f":"Tirage!$J11","v":4},{"$f":"Tirage!$K11","v":2},{"$f":"AD6","v":3},{"$f":"VLOOKUP(AD5,Inscriptions!$M$19:$N$28,2,FALSE)","v":0},{"$f":"VLOOKUP(AE5,Inscriptions!$M$19:$N$28,2,FALSE)","v":0},null,null,{"$f":"Tirage!$L11","v":2},{"$f":"Tirage!$M11","v":7},{"$f":"AK6","v":10},{"$f":"VLOOKUP(AK5,Inscriptions!$M$19:$N$28,2,FALSE)","v":0},{"$f":"VLOOKUP(AL5,Inscriptions!$M$19:$N$28,2,FALSE)","v":0},null,null,{"$f":"Tirage!$N11","v":4},{"$f":"Tirage!$O11","v":9},{"$f":"AR6","v":7},{"$f":"VLOOKUP(AR5,Inscriptions!$M$19:$N$28,2,FALSE)","v":0},{"$f":"VLOOKUP(AS5,Inscriptions!$M$19:$N$28,2,FALSE)","v":0},null,null,{"$f":"Tirage!$P11","v":7},{"$f":"Tirage!$Q11","v":3},{"$f":"AY6","v":4},{"$f":"VLOOKUP(AY5,Inscriptions!$M$19:$N$28,2,FALSE)","v":0},{"$f":"VLOOKUP(AZ5,Inscriptions!$M$19:$N$28,2,FALSE)","v":0},null,null,{"$f":"Tirage!$R11","v":4},{"$f":"Tirage!$S11","v":1},{"$f":"BF6","v":10},{"$f":"VLOOKUP(BF5,Inscriptions!$M$19:$N$28,2,FALSE)","v":0},{"$f":"VLOOKUP(BG5,Inscriptions!$M$19:$N$28,2,FALSE)","v":0}]
[null,{"$f":"Tirage!$B12","v":9},{"$f":"Tirage!$C12","v":1},{"$f":"B3","v":7},{"$f":"VLOOKUP(B6,Inscriptions!$M$19:$N$28,2,FALSE)","v":0},{"$f":"VLOOKUP(C6,Inscriptions!$M$19:$N$28,2,FALSE)","v":0},null,null,{"$f":"Tirage!D12","v":5},{"$f":"Tirage!E12","v":6},{"$f":"I3","v":3},{"$f":"VLOOKUP(I6,Inscriptions!$M$19:$N$28,2,FALSE)","v":0},{"$f":"VLOOKUP(J6,Inscriptions!$M$19:$N$28,2,FALSE)","v":0},null,null,{"$f":"Tirage!$F12","v":1},{"$f":"Tirage!$G12","v":5},{"$f":"Q3","v":2},{"$f":"VLOOKUP(P6,Inscriptions!$M$19:$N$28,2,FALSE)","v":0},{"$f":"VLOOKUP(Q6,Inscriptions!$M$19:$N$28,2,FALSE)","v":0},null,null,{"$f":"Tirage!$H12","v":8},{"$f":"Tirage!$I12","v":2},{"$f":"X3","v":10},{"$f":"VLOOKUP(W6,Inscriptions!$M$19:$N$28,2,FALSE)","v":0},{"$f":"VLOOKUP(X6,Inscriptions!$M$19:$N$28,2,FALSE)","v":0},null,null,{"$f":"Tirage!$J12","v":3},{"$f":"Tirage!$K12","v":8},{"$f":"AD4","v":7},{"$f":"VLOOKUP(AD6,Inscriptions!$M$19:$N$28,2,FALSE)","v":0},{"$f":"VLOOKUP(AE6,Inscriptions!$M$19:$N$28,2,FALSE)","v":0},null,null,{"$f":"Tirage!$L12","v":10},{"$f":"Tirage!$M12","v":8},{"$f":"AL3","v":6},{"$f":"VLOOKUP(AK6,Inscriptions!$M$19:$N$28,2,FALSE)","v":0},{"$f":"VLOOKUP(AL6,Inscriptions!$M$19:$N$28,2,FALSE)","v":0},null,null,{"$f":"Tirage!$N12","v":7},{"$f":"Tirage!$O12","v":6},{"$f":"AS4","v":1},{"$f":"VLOOKUP(AR6,Inscriptions!$M$19:$N$28,2,FALSE)","v":0},{"$f":"VLOOKUP(AS6,Inscriptions!$M$19:$N$28,2,FALSE)","v":0},null,null,{"$f":"Tirage!$P12","v":4},{"$f":"Tirage!$Q12","v":6},{"$f":"AY3","v":2},{"$f":"VLOOKUP(AY6,Inscriptions!$M$19:$N$28,2,FALSE)","v":0},{"$f":"VLOOKUP(AZ6,Inscriptions!$M$19:$N$28,2,FALSE)","v":0},null,null,{"$f":"Tirage!$R12","v":10},{"$f":"Tirage!$S12","v":5},{"$f":"BF3","v":6},{"$f":"VLOOKUP(BF6,Inscriptions!$M$19:$N$28,2,FALSE)","v":0},{"$f":"VLOOKUP(BG6,Inscriptions!$M$19:$N$28,2,FALSE)","v":0}]
[null,{"$f":"Tirage!$B13","v":8},{"$f":"Tirage!$C13","v":4},{"$f":"B5","v":6},{"$f":"VLOOKUP(B7,Inscriptions!$M$19:$N$28,2,FALSE)","v":0},{"$f":"VLOOKUP(C7,Inscriptions!$M$19:$N$28,2,FALSE)","v":0},null,null,{"$f":"Tirage!D13","v":4},{"$f":"Tirage!E13","v":10},{"$f":"J3","v":9},{"$f":"VLOOKUP(I7,Inscriptions!$M$19:$N$28,2,FALSE)","v":0},{"$f":"VLOOKUP(J7,Inscriptions!$M$19:$N$28,2,FALSE)","v":0},null,null,{"$f":"Tirage!$F13","v":3},{"$f":"Tirage!$G13","v":6},{"$f":"P5","v":8},{"$f":"VLOOKUP(P7,Inscriptions!$M$19:$N$28,2,FALSE)","v":0},{"$f":"VLOOKUP(Q7,Inscriptions!$M$19:$N$28,2,FALSE)","v":0},null,null,{"$f":"Tirage!$H13","v":1},{"$f":"Tirage!$I13","v":7},{"$f":"W5","v":4},{"$f":"VLOOKUP(W7,Inscriptions!$M$19:$N$28,2,FALSE)","v":0},{"$f":"VLOOKUP(X7,Inscriptions!$M$19:$N$28,2,FALSE)","v":0},null,null,{"$f":"Tirage!$J13","v":10},{"$f":"Tirage!$K13","v":9},{"$f":"AD5","v":4},{"$f":"VLOOKUP(AD7,Inscriptions!$M$19:$N$28,2,FALSE)","v":0},{"$f":"VLOOKUP(AE7,Inscriptions!$M$19:$N$28,2,FALSE)","v":0},null,null,{"$f":"Tirage!$L13","v":4},{"$f":"Tirage!$M13","v":5},{"$f":"AK5","v":2},{"$f":"VLOOKUP(AK7,Inscriptions!$M$19:$N$28,2,FALSE)","v":0},{"$f":"VLOOKUP(AL7,Inscriptions!$M$19:$N$28,2,FALSE)","v":0},null,null,{"$f":"Tirage!$N13","v":5},{"$f":"Tirage!$O13","v":2},{"$f":"AR5","v":4},{"$f":"VLOOKUP(AR7,Inscriptions!$M$19:$N$28,2,FALSE)","v":0},{"$f":"VLOOKUP(AS7,Inscriptions!$M$19:$N$28,2,FALSE)","v":0},null,null,{"$f":"Tirage!$P13","v":10},{"$f":"Tirage!$Q13","v":1},{"$f":"AY5","v":7},{"$f":"VLOOKUP(AY7,Inscriptions!$M$19:$N$28,2,FALSE)","v":0},{"$f":"VLOOKUP(AZ7,Inscriptions!$M$19:$N$28,2,FALSE)","v":0},null,null,{"$f":"Tirage!$R13","v":3},{"$f":"Tirage!$S13","v":2},{"$f":"BG3","v":8},{"$f":"VLOOKUP(BF7,Inscriptions!$M$19:$N$28,2,FALSE)","v":0},{"$f":"VLOOKUP(BG7,Inscriptions!$M$19:$N$28,2,FALSE)","v":0}]
[null,null,null,null,null,null,"Mettre ab pour abandon",null,null,null,null,null,null,"Mettre ab pour abandon",null,null,null,null,null,null,"Mettre ab pour abandon",null,null,null,null,null,null,"Mettre ab pour abandon",null,null,null,null,null,null,"Mettre ab pour abandon",null,null,null,null,null,null,"Mettre ab pour abandon",null,null,null,null,null,null,"Mettre ab pour abandon",null,null,null,null,null,null,"Mettre ab pour abandon",null,null,null,null,null,null,"Mettre ab pour abandon"]
[null,null,null,null,null,null,null,null,null,null,null,null,"JOURNEE 8",null,null,null,null,null,null,null,null,null,null,null,null,null,null,null,null,null,null,null,null,null,null,null,null,null,null,null,null,"Mettre ex pour exempt",null,null,null,null,null,null,"Mettre ex pour exempt"]
[]
[null,null,null,null,"TOUR 1",null,null,null,null,null,null,"TOUR 2",null,null,null,null,null,null,"TOUR 3",null,null,null,null,null,null,"TOUR 4",null,null,null,null,null,null,"TOUR 5",null,null,null,null,null,null,"TOUR 6",null,null,null,null,null,null,"TOUR 7",null,null,null,null,null,null,"TOUR 8",null,null,null,null,null,null,"TOUR 9"]
[]
[null,null,null,null,"Equipes","Score pour","Score contre","Pts ",null,null,null,"Equipes","Score pour","Score contre","Pts ",null,null,null,"Equipes","Score pour","Score contre","Pts ",null,null,null,"Equipes","Score pour","Score contre","Pts ",null,null,null,"Equipes","Score pour","Score contre","Pts ",null,null,null,"Equipes","Score pour","Score contre","Pts ",null,null,null,"Equipes","Score pour","Score contre","Pts ",null,null,null,"Equipes","Score pour","Score contre","Pts ",null,null,null,"Equipes","Score pour","Score contre","Pts "]
[null,{"$f":"Tirage!$B9","v":7},null,null,{"$f":"VLOOKUP(B14,Inscriptions!$M$19:$N$28,2,FALSE)","v":0},{"$f":"IFERROR(VLOOKUP(E14,$E$3:$G$7,3,0),\"\")&IFERROR(VLOOKUP(E14,$F$3:$H$7,3,0),\"\")","v":""},{"$f":"IFERROR(VLOOKUP(E14,$E$3:$H$7,4,0),\"\")&IFERROR(VLOOKUP(E14,$F$3:$H$7,2,0),\"\")","v":""},{"$f":"IF(E15=0,0,IF(COUNTBLANK(F14:G14),\"\",VLOOKUP(F14&G14,CHOOSE({1,2},tPts32459[Score 1]&tPts32459[Score 2],tPts32459[Pts]),2,0)))","v":0},{"$f":"I3","v":3},null,null,{"$f":"VLOOKUP(I14,Inscriptions!$M$19:$MF$28,2,FALSE)","v":0},{"$f":"IFERROR(VLOOKUP(L14,$L$3:$N$7,3,0),\"\")&IFERROR(VLOOKUP(L14,$M$3:$O$7,3,0),\"\")","v":""},{"$f":"IFERROR(VLOOKUP(L14,$L$3:$O$7,4,0),\"\")&IFERROR(VLOOKUP(L14,$M$3:$O$7,2,0),\"\")","v":""},{"$f":"IF(L14=0,0,IF(COUNTBLANK(M14:N14),\"\",VLOOKUP(M14&N14,CHOOSE({1,2},tPts32459[Score 1]&tPts32459[Score 2],tPts32459[Pts]),2,0)))","v":0},{"$f":"Tirage!$F9","v":10},null,null,{"$f":"VLOOKUP(P14,Inscriptions!$M$19:$N$28,2,FALSE)","v":0},{"$f":"IFERROR(VLOOKUP(S14,$S$3:$U$7,3,0),\"\")&IFERROR(VLOOKUP(S14,$T$3:$V$7,3,0),\"\")","v":""},{"$f":"IFERROR(VLOOKUP(S14,$S$3:$V$7,4,0),\"\")&IFERROR(VLOOKUP(S14,$T$3:$V$7,2,0),\"\")","v":""},{"$f":"IF(COUNTBLANK(T14:U14),\"\",VLOOKUP(T14&U14,CHOOSE({1,2},tPts32459[Score 1]&tPts32459[Score 2],tPts32459[Pts]),2,0))","v":""},{"$f":"W3","v":6},null,null,{"$f":"VLOOKUP(W14,Inscriptions!$M$19:$N$28,2,FALSE)","v":0},{"$f":"IFERROR(VLOOKUP(Z14,$Z$3:$AB$7,3,0),\"\")&IFERROR(VLOOKUP(Z14,$AA$3:$AC$7,3,0),\"\")","v":""},{"$f":"IFERROR(VLOOKUP(Z14,$Z$3:$AC$7,4,0),\"\")&IFERROR(VLOOKUP(Z14,$AA$3:$AC$7,2,0),\"\")","v":""},{"$f":"IF(COUNTBLANK(AA14:AB14),\"\",VLOOKUP(AA14&AB14,CHOOSE({1,2},tPts32459[Score 1]&tPts32459[Score 2],tPts32459[Pts]),2,0))","v":""},{"$f":"Tirage!$J9","v":1},null,null,{"$f":"VLOOKUP(AD14,Inscriptions!$M$19:$N$28,2,FALSE)","v":0},{"$f":"IFERROR(VLOOKUP(AG14,$AG$3:$AI$7,3,0),\"\")&IFERROR(VLOOKUP(AG14,$AH$3:$AJ$7,3,0),\"\")","v":""},{"$f":"IFERROR(VLOOKUP(AG14,$AG$3:$AJ$7,4,0),\"\")&IFERROR(VLOOKUP(AG14,$AH$3:$AJ$7,2,0),\"\")","v":""},{"$f":"IF(COUNTBLANK(AH14:AI14),\"\",VLOOKUP(AH14&AI14,CHOOSE({1,2},tPts32459[Score 1]&tPts32459[Score 2],tPts32459[Pts]),2,0))","v":""},{"$f":"Tirage!$L9","v":9},null,null,{"$f":"VLOOKUP(AK14,Inscriptions!$M$19:$N$28,2,FALSE)","v":0},{"$f":"IFERROR(VLOOKUP(AN14,$AN$3:$AP$7,3,0),\"\")&IFERROR(VLOOKUP(AN14,$AO$3:$AQ$7,3,0),\"\")","v":""},{"$f":"IFERROR(VLOOKUP(AN14,$AN$3:$AQ$7,4,0),\"\")&IFERROR(VLOOKUP(AN14,$AO$3:$AQ$7,2,0),\"\")","v":""},{"$f":"IF(COUNTBLANK(AO14:AP14),\"\",VLOOKUP(AO14&AP14,CHOOSE({1,2},tPts32459[Score 1]&tPts32459[Score 2],tPts32459[Pts]),2,0))","v":""},{"$f":"Tirage!$N9","v":3},null,null,{"$f":"VLOOKUP(AR14,Inscriptions!$M$19:$N$28,2,FALSE)","v":0},{"$f":"IFERROR(VLOOKUP(AU14,AU$3:AW$7,3,0),\"\")&IFERROR(VLOOKUP(AU14,AV$3:AX$7,3,0),\"\")","v":""},{"$f":"IFERROR(VLOOKUP(AU14,AU$3:AX$7,4,0),\"\")&IFERROR(VLOOKUP(AU14,AV$3:AX$7,2,0),\"\")","v":""},{"$f":"IF(COUNTBLANK(AV14:AW14),\"\",VLOOKUP(AV14&AW14,CHOOSE({1,2},tPts32459[Score 1]&tPts32459[Score 2],tPts32459[Pts]),2,0))","v":""},{"$f":"Tirage!$P9","v":2},null,null,{"$f":"VLOOKUP(AY14,Inscriptions!$M$19:$N$28,2,FALSE)","v":0},{"$f":"IFERROR(VLOOKUP(BB14,$BB$3:BD$7,3,0),\"\")&IFERROR(VLOOKUP(BB14,$BC$3:$BE$7,3,0),\"\")","v":""},{"$f":"IFERROR(VLOOKUP(BB14,$BB$3:$BE$7,4,0),\"\")&IFERROR(VLOOKUP(BB14,$BC$3:$BE$7,2,0),\"\")","v":""},{"$f":"IF(COUNTBLANK(BC14:BD14),\"\",VLOOKUP(BC14&BD14,CHOOSE({1,2},tPts32459[Score 1]&tPts32459[Score 2],tPts32459[Pts]),2,0))","v":""},{"$f":"Tirage!$R9","v":6},null,null,{"$f":"VLOOKUP(BF14,Inscriptions!$M$19:$N$28,2,FALSE)","v":0},{"$f":"IFERROR(VLOOKUP(BI14,$BI$3:BK$7,3,0),\"\")&IFERROR(VLOOKUP(BI14,$BJ$3:$BL$7,3,0),\"\")","v":""},{"$f":"IFERROR(VLOOKUP(BI14,$BI$3:$BL$7,4,0),\"\")&IFERROR(VLOOKUP(BI14,$BJ$3:$BL$7,2,0),\"\")","v":""},{"$f":"IF(COUNTBLANK(BJ14:BK14),\"\",VLOOKUP(BJ14&BK14,CHOOSE({1,2},tPts32459[Score 1]&tPts32459[Score 2],tPts32459[Pts]),2,0))","v":""}]
[null,{"$f":"Tirage!$B10","v":3},null,null,{"$f":"VLOOKUP(B15,Inscriptions!$M$19:$N$28,2,FALSE)","v":0},{"$f":"IFERROR(VLOOKUP(E15,$E$3:$G$7,3,0),\"\")&IFERROR(VLOOKUP(E15,$F$3:$H$7,3,0),\"\")","v":""},{"$f":"IFERROR(VLOOKUP(E15,$E$3:$H$7,4,0),\"\")&IFERROR(VLOOKUP(E15,$F$3:$H$7,2,0),\"\")","v":""},{"$f":"IF(E16=0,0,IF(COUNTBLANK(F15:G15),\"\",VLOOKUP(F15&G15,CHOOSE({1,2},tPts32459[Score 1]&tPts32459[Score 2],tPts32459[Pts]),2,0)))","v":0},{"$f":"I4","v":2},null,null,{"$f":"VLOOKUP(I15,Inscriptions!$M$19:$MF$28,2,FALSE)","v":0},{"$f":"IFERROR(VLOOKUP(L15,$L$3:$N$7,3,0),\"\")&IFERROR(VLOOKUP(L15,$M$3:$O$7,3,0),\"\")","v":""},{"$f":"IFERROR(VLOOKUP(L15,$L$3:$O$7,4,0),\"\")&IFERROR(VLOOKUP(L15,$M$3:$O$7,2,0),\"\")","v":""},{"$f":"IF(L15=0,0,IF(COUNTBLANK(M15:N15),\"\",VLOOKUP(M15&N15,CHOOSE({1,2},tPts32459[Score 1]&tPts32459[Score 2],tPts32459[Pts]),2,0)))","v":0},{"$f":"Tirage!$F10","v":4},null,null,{"$f":"VLOOKUP(P15,Inscriptions!$M$19:$N$28,2,FALSE)","v":0},{"$f":"IFERROR(VLOOKUP(S15,$S$3:$U$7,3,0),\"\")&IFERROR(VLOOKUP(S15,$T$3:$V$7,3,0),\"\")","v":""},{"$f":"IFERROR(VLOOKUP(S15,$S$3:$V$7,4,0),\"\")&IFERROR(VLOOKUP(S15,$T$3:$V$7,2,0),\"\")","v":""},{"$f":"IF(COUNTBLANK(T15:U15),\"\",VLOOKUP(T15&U15,CHOOSE({1,2},tPts32459[Score 1]&tPts32459[Score 2],tPts32459[Pts]),2,0))","v":""},{"$f":"W4","v":5},null,null,{"$f":"VLOOKUP(W15,Inscriptions!$M$19:$N$28,2,FALSE)","v":0},{"$f":"IFERROR(VLOOKUP(Z15,$Z$3:$AB$7,3,0),\"\")&IFERROR(VLOOKUP(Z15,$AA$3:$AC$7,3,0),\"\")","v":""},{"$f":"IFERROR(VLOOKUP(Z15,$Z$3:$AC$7,4,0),\"\")&IFERROR(VLOOKUP(Z15,$AA$3:$AC$7,2,0),\"\")","v":""},{"$f":"IF(COUNTBLANK(AA15:AB15),\"\",VLOOKUP(AA15&AB15,CHOOSE({1,2},tPts32459[Score 1]&tPts32459[Score 2],tPts32459[Pts]),2,0))","v":""},{"$f":"Tirage!$J10","v":7},null,null,{"$f":"VLOOKUP(AD15,Inscriptions!$M$19:$N$28,2,FALSE)","v":0},{"$f":"IFERROR(VLOOKUP(AG15,$AG$3:$AI$7,3,0),\"\")&IFERROR(VLOOKUP(AG15,$AH$3:$AJ$7,3,0),\"\")","v":""},{"$f":"IFERROR(VLOOKUP(AG15,$AG$3:$AJ$7,4,0),\"\")&IFERROR(VLOOKUP(AG15,$AH$3:$AJ$7,2,0),\"\")","v":""},{"$f":"IF(COUNTBLANK(AH15:AI15),\"\",VLOOKUP(AH15&AI15,CHOOSE({1,2},tPts32459[Score 1]&tPts32459[Score 2],tPts32459[Pts]),2,0))","v":""},{"$f":"Tirage!$L10","v":3},null,null,{"$f":"VLOOKUP(AK15,Inscriptions!$M$19:$N$28,2,FALSE)","v":0},{"$f":"IFERROR(VLOOKUP(AN15,$AN$3:$AP$7,3,0),\"\")&IFERROR(VLOOKUP(AN15,$AO$3:$AQ$7,3,0),\"\")","v":""},{"$f":"IFERROR(VLOOKUP(AN15,$AN$3:$AQ$7,4,0),\"\")&IFERROR(VLOOKUP(AN15,$AO$3:$AQ$7,2,0),\"\")","v":""},{"$f":"IF(COUNTBLANK(AO15:AP15),\"\",VLOOKUP(AO15&AP15,CHOOSE({1,2},tPts32459[Score 1]&tPts32459[Score 2],tPts32459[Pts]),2,0))","v":""},{"$f":"Tirage!$N10","v":8},null,null,{"$f":"VLOOKUP(AR15,Inscriptions!$M$19:$N$28,2,FALSE)","v":0},{"$f":"IFERROR(VLOOKUP(AU15,AU$3:AW$7,3,0),\"\")&IFERROR(VLOOKUP(AU15,AV$3:AX$7,3,0),\"\")","v":""},{"$f":"IFERROR(VLOOKUP(AU15,AU$3:AX$7,4,0),\"\")&IFERROR(VLOOKUP(AU15,AV$3:AX$7,2,0),\"\")","v":""},{"$f":"IF(COUNTBLANK(AV15:AW15),\"\",VLOOKUP(AV15&AW15,CHOOSE({1,2},tPts32459[Score 1]&tPts32459[Score 2],tPts32459[Pts]),2,0))","v":""},{"$f":"Tirage!$P10","v":8},null,null,{"$f":"VLOOKUP(AY15,Inscriptions!$M$19:$N$28,2,FALSE)","v":0},{"$f":"IFERROR(VLOOKUP(BB15,$BB$3:BD$7,3,0),\"\")&IFERROR(VLOOKUP(BB15,$BC$3:$BE$7,3,0),\"\")","v":""},{"$f":"IFERROR(VLOOKUP(BB15,$BB$3:$BE$7,4,0),\"\")&IFERROR(VLOOKUP(BB15,$BC$3:$BE$7,2,0),\"\")","v":""},{"$f":"IF(COUNTBLANK(BC15:BD15),\"\",VLOOKUP(BC15&BD15,CHOOSE({1,2},tPts32459[Score 1]&tPts32459[Score 2],tPts32459[Pts]),2,0))","v":""},{"$f":"Tirage!$R10","v":7},null,null,{"$f":"VLOOKUP(BF15,Inscriptions!$M$19:$N$28,2,FALSE)","v":0},{"$f":"IFERROR(VLOOKUP(BI15,$BI$3:BK$7,3,0),\"\")&IFERROR(VLOOKUP(BI15,$BJ$3:$BL$7,3,0),\"\")","v":""},"",{"$f":"IF(COUNTBLANK(BJ15:BK15),\"\",VLOOKUP(BJ15&BK15,CHOOSE({1,2},tPts32459[Score 1]&tPts32459[Score 2],tPts32459[Pts]),2,0))","v":""}]
[null,{"$f":"Tirage!$B11","v":6},null,null,{"$f":"VLOOKUP(B16,Inscriptions!$M$19:$N$28,2,FALSE)","v":0},"","",{"$f":"IF(E17=0,0,IF(COUNTBLANK(F16:G16),\"\",VLOOKUP(F16&G16,CHOOSE({1,2},tPts32459[Score 1]&tPts32459[Score 2],tPts32459[Pts]),2,0)))","v":0},8,null,null,{"$f":"VLOOKUP(I16,Inscriptions!$M$19:$MF$28,2,FALSE)","v":0},"","",{"$f":"IF(L16=0,0,IF(COUNTBLANK(M16:N16),\"\",VLOOKUP(M16&N16,CHOOSE({1,2},tPts32459[Score 1]&tPts32459[Score 2],tPts32459[Pts]),2,0)))","v":0},{"$f":"Tirage!$F11","v":8},null,null,{"$f":"VLOOKUP(P16,Inscriptions!$M$19:$N$28,2,FALSE)","v":0},"","",{"$f":"IF(COUNTBLANK(T16:U16),\"\",VLOOKUP(T16&U16,CHOOSE({1,2},tPts32459[Score 1]&tPts32459[Score 2],tPts32459[Pts]),2,0))","v":""},{"$f":"W5","v":4},null,null,{"$f":"VLOOKUP(W16,Inscriptions!$M$19:$N$28,2,FALSE)","v":0},"","",{"$f":"IF(COUNTBLANK(AA16:AB16),\"\",VLOOKUP(AA16&AB16,CHOOSE({1,2},tPts32459[Score 1]&tPts32459[Score 2],tPts32459[Pts]),2,0))","v":""},{"$f":"Tirage!$J11","v":4},null,null,{"$f":"VLOOKUP(AD16,Inscriptions!$M$19:$N$28,2,FALSE)","v":0},"","",{"$f":"IF(COUNTBLANK(AH16:AI16),\"\",VLOOKUP(AH16&AI16,CHOOSE({1,2},tPts32459[Score 1]&tPts32459[Score 2],tPts32459[Pts]),2,0))","v":""},{"$f":"Tirage!$L11","v":2},null,null,{"$f":"VLOOKUP(AK16,Inscriptions!$M$19:$N$28,2,FALSE)","v":0},"","",{"$f":"IF(COUNTBLANK(AO16:AP16),\"\",VLOOKUP(AO16&AP16,CHOOSE({1,2},tPts32459[Score 1]&tPts32459[Score 2],tPts32459[Pts]),2,0))","v":""},{"$f":"Tirage!$N11","v":4},null,null,{"$f":"VLOOKUP(AR16,Inscriptions!$M$19:$N$28,2,FALSE)","v":0},"","",{"$f":"IF(COUNTBLANK(AV16:AW16),\"\",VLOOKUP(AV16&AW16,CHOOSE({1,2},tPts32459[Score 1]&tPts32459[Score 2],tPts32459[Pts]),2,0))","v":""},{"$f":"Tirage!$P11","v":7},null,null,{"$f":"VLOOKUP(AY16,Inscriptions!$M$19:$N$28,2,FALSE)","v":0},{"$f":"IFERROR(VLOOKUP(BB16,$BB$3:BD$7,3,0),\"\")&IFERROR(VLOOKUP(BB16,$BC$3:$BE$7,3,0),\"\")","v":""},"",{"$f":"IF(COUNTBLANK(BC16:BD16),\"\",VLOOKUP(BC16&BD16,CHOOSE({1,2},tPts32459[Score 1]&tPts32459[Score 2],tPts32459[Pts]),2,0))","v":""},{"$f":"Tirage!$R11","v":4},null,null,{"$f":"VLOOKUP(BF16,Inscriptions!$M$19:$N$28,2,FALSE)","v":0},{"$f":"IFERROR(VLOOKUP(BI16,$BI$3:BK$7,3,0),\"\")&IFERROR(VLOOKUP(BI16,$BJ$3:$BL$7,3,0),\"\")","v":""},"",{"$f":"IF(COUNTBLANK(BJ16:BK16),\"\",VLOOKUP(BJ16&BK16,CHOOSE({1,2},tPts32459[Score 1]&tPts32459[Score 2],tPts32459[Pts]),2,0))","v":""}]
[null,{"$f":"Tirage!$B12","v":9},null,null,{"$f":"VLOOKUP(B17,Inscriptions!$M$19:$N$28,2,FALSE)","v":0},"","",{"$f":"IF(E18=0,0,IF(COUNTBLANK(F17:G17),\"\",VLOOKUP(F17&G17,CHOOSE({1,2},tPts32459[Score 1]&tPts32459[Score 2],tPts32459[Pts]),2,0)))","v":0},5,null,null,{"$f":"VLOOKUP(I17,Inscriptions!$M$19:$MF$28,2,FALSE)","v":0},"","",{"$f":"IF(L17=0,0,IF(COUNTBLANK(M17:N17),\"\",VLOOKUP(M17&N17,CHOOSE({1,2},tPts32459[Score 1]&tPts32459[Score 2],tPts32459[Pts]),2,0)))","v":0},{"$f":"Tirage!$F12","v":1},null,null,{"$f":"VLOOKUP(P17,Inscriptions!$M$19:$N$28,2,FALSE)","v":0},"","",{"$f":"IF(COUNTBLANK(T17:U17),\"\",VLOOKUP(T17&U17,CHOOSE({1,2},tPts32459[Score 1]&tPts32459[Score 2],tPts32459[Pts]),2,0))","v":""},{"$f":"W6","v":8},null,null,{"$f":"VLOOKUP(W17,Inscriptions!$M$19:$N$28,2,FALSE)","v":0},"","",{"$f":"IF(COUNTBLANK(AA17:AB17),\"\",VLOOKUP(AA17&AB17,CHOOSE({1,2},tPts32459[Score 1]&tPts32459[Score 2],tPts32459[Pts]),2,0))","v":""},{"$f":"Tirage!$J12","v":3},null,null,{"$f":"VLOOKUP(AD17,Inscriptions!$M$19:$N$28,2,FALSE)","v":0},"","",{"$f":"IF(COUNTBLANK(AH17:AI17),\"\",VLOOKUP(AH17&AI17,CHOOSE({1,2},tPts32459[Score 1]&tPts32459[Score 2],tPts32459[Pts]),2,0))","v":""},{"$f":"Tirage!$L12","v":10},null,null,{"$f":"VLOOKUP(AK17,Inscriptions!$M$19:$N$28,2,FALSE)","v":0},"","",{"$f":"IF(COUNTBLANK(AO17:AP17),\"\",VLOOKUP(AO17&AP17,CHOOSE({1,2},tPts32459[Score 1]&tPts32459[Score 2],tPts32459[Pts]),2,0))","v":""},{"$f":"Tirage!$N12","v":7},null,null,{"$f":"VLOOKUP(AR17,Inscriptions!$M$19:$N$28,2,FALSE)","v":0},"","",{"$f":"IF(COUNTBLANK(AV17:AW17),\"\",VLOOKUP(AV17&AW17,CHOOSE({1,2},tPts32459[Score 1]&tPts32459[Score 2],tPts32459[Pts]),2,0))","v":""},{"$f":"Tirage!$P12","v":4},null,null,{"$f":"VLOOKUP(AY17,Inscriptions!$M$19:$N$28,2,FALSE)","v":0},{"$f":"IFERROR(VLOOKUP(BB17,$BB$3:BD$7,3,0),\"\")&IFERROR(VLOOKUP(BB17,$BC$3:$BE$7,3,0),\"\")","v":""},"",{"$f":"IF(COUNTBLANK(BC17:BD17),\"\",VLOOKUP(BC17&BD17,CHOOSE({1,2},tPts32459[Score 1]&tPts32459[Score 2],tPts32459[Pts]),2,0))","v":""},{"$f":"Tirage!$R12","v":10},null,null,{"$f":"VLOOKUP(BF17,Inscriptions!$M$19:$N$28,2,FALSE)","v":0},{"$f":"IFERROR(VLOOKUP(BI17,$BI$3:BK$7,3,0),\"\")&IFERROR(VLOOKUP(BI17,$BJ$3:$BL$7,3,0),\"\")","v":""},"",{"$f":"IF(COUNTBLANK(BJ17:BK17),\"\",VLOOKUP(BJ17&BK17,CHOOSE({1,2},tPts32459[Score 1]&tPts32459[Score 2],tPts32459[Pts]),2,0))","v":""}]
[null,{"$f":"Tirage!$B13","v":8},null,null,{"$f":"VLOOKUP(B18,Inscriptions!$M$19:$N$28,2,FALSE)","v":0},"","",{"$f":"IF(E19=0,0,IF(COUNTBLANK(F18:G18),\"\",VLOOKUP(F18&G18,CHOOSE({1,2},tPts32459[Score 1]&tPts32459[Score 2],tPts32459[Pts]),2,0)))","v":0},4,null,null,{"$f":"VLOOKUP(I18,Inscriptions!$M$19:$MF$28,2,FALSE)","v":0},"","",{"$f":"IF(L18=0,0,IF(COUNTBLANK(M18:N18),\"\",VLOOKUP(M18&N18,CHOOSE({1,2},tPts32459[Score 1]&tPts32459[Score 2],tPts32459[Pts]),2,0)))","v":0},{"$f":"Tirage!$F13","v":3},null,null,{"$f":"VLOOKUP(P18,Inscriptions!$M$19:$N$28,2,FALSE)","v":0},"","",{"$f":"IF(COUNTBLANK(T18:U18),\"\",VLOOKUP(T18&U18,CHOOSE({1,2},tPts32459[Score 1]&tPts32459[Score 2],tPts32459[Pts]),2,0))","v":""},{"$f":"W7","v":1},null,null,{"$f":"VLOOKUP(W18,Inscriptions!$M$19:$N$28,2,FALSE)","v":0},"","",{"$f":"IF(COUNTBLANK(AA18:AB18),\"\",VLOOKUP(AA18&AB18,CHOOSE({1,2},tPts32459[Score 1]&tPts32459[Score 2],tPts32459[Pts]),2,0))","v":""},{"$f":"Tirage!$J13","v":10},null,null,{"$f":"VLOOKUP(AD18,Inscriptions!$M$19:$N$28,2,FALSE)","v":0},"","",{"$f":"IF(COUNTBLANK(AH18:AI18),\"\",VLOOKUP(AH18&AI18,CHOOSE({1,2},tPts32459[Score 1]&tPts32459[Score 2],tPts32459[Pts]),2,0))","v":""},{"$f":"Tirage!$L13","v":4},null,null,{"$f":"VLOOKUP(AK18,Inscriptions!$M$19:$N$28,2,FALSE)","v":0},"","",{"$f":"IF(COUNTBLANK(AO18:AP18),\"\",VLOOKUP(AO18&AP18,CHOOSE({1,2},tPts32459[Score 1]&tPts32459[Score 2],tPts32459[Pts]),2,0))","v":""},{"$f":"Tirage!$N13","v":5},null,null,{"$f":"VLOOKUP(AR18,Inscriptions!$M$19:$N$28,2,FALSE)","v":0},"","",{"$f":"IF(COUNTBLANK(AV18:AW18),\"\",VLOOKUP(AV18&AW18,CHOOSE({1,2},tPts32459[Score 1]&tPts32459[Score 2],tPts32459[Pts]),2,0))","v":""},{"$f":"Tirage!$P13","v":10},null,null,{"$f":"VLOOKUP(AY18,Inscriptions!$M$19:$N$28,2,FALSE)","v":0},{"$f":"IFERROR(VLOOKUP(BB18,$BB$3:BD$7,3,0),\"\")&IFERROR(VLOOKUP(BB18,$BC$3:$BE$7,3,0),\"\")","v":""},"",{"$f":"IF(COUNTBLANK(BC18:BD18),\"\",VLOOKUP(BC18&BD18,CHOOSE({1,2},tPts32459[Score 1]&tPts32459[Score 2],tPts32459[Pts]),2,0))","v":""},{"$f":"Tirage!$R13","v":3},null,null,{"$f":"VLOOKUP(BF18,Inscriptions!$M$19:$N$28,2,FALSE)","v":0},{"$f":"IFERROR(VLOOKUP(BI18,$BI$3:BK$7,3,0),\"\")&IFERROR(VLOOKUP(BI18,$BJ$3:$BL$7,3,0),\"\")","v":""},"",{"$f":"IF(COUNTBLANK(BJ18:BK18),\"\",VLOOKUP(BJ18&BK18,CHOOSE({1,2},tPts32459[Score 1]&tPts32459[Score 2],tPts32459[Pts]),2,0))","v":""}]
[null,{"$f":"Tirage!$C9","v":10},null,null,{"$f":"VLOOKUP(B19,Inscriptions!$M$19:$N$28,2,FALSE)","v":0},"","",{"$f":"IF(E20=0,0,IF(COUNTBLANK(F19:G19),\"\",VLOOKUP(F19&G19,CHOOSE({1,2},tPts32459[Score 1]&tPts32459[Score 2],tPts32459[Pts]),2,0)))","v":0},{"$f":"J3","v":9},null,null,{"$f":"VLOOKUP(I19,Inscriptions!$M$19:$MF$28,2,FALSE)","v":0},"","",{"$f":"IF(L19=0,0,IF(COUNTBLANK(M19:N19),\"\",VLOOKUP(M19&N19,CHOOSE({1,2},tPts32459[Score 1]&tPts32459[Score 2],tPts32459[Pts]),2,0)))","v":0},{"$f":"Tirage!$G9","v":2},null,null,{"$f":"VLOOKUP(P19,Inscriptions!$M$19:$N$28,2,FALSE)","v":0},"","",{"$f":"IF(COUNTBLANK(T19:U19),\"\",VLOOKUP(T19&U19,CHOOSE({1,2},tPts32459[Score 1]&tPts32459[Score 2],tPts32459[Pts]),2,0))","v":""},{"$f":"X3","v":10},null,null,{"$f":"VLOOKUP(W19,Inscriptions!$M$19:$N$28,2,FALSE)","v":0},"","",{"$f":"IF(COUNTBLANK(AA19:AB19),\"\",VLOOKUP(AA19&AB19,CHOOSE({1,2},tPts32459[Score 1]&tPts32459[Score 2],tPts32459[Pts]),2,0))","v":""},{"$f":"Tirage!$K9","v":6},null,null,{"$f":"VLOOKUP(AD19,Inscriptions!$M$19:$N$28,2,FALSE)","v":0},"","",{"$f":"IF(COUNTBLANK(AH19:AI19),\"\",VLOOKUP(AH19&AI19,CHOOSE({1,2},tPts32459[Score 1]&tPts32459[Score 2],tPts32459[Pts]),2,0))","v":""},{"$f":"Tirage!$M9","v":6},null,null,{"$f":"VLOOKUP(AK19,Inscriptions!$M$19:$N$28,2,FALSE)","v":0},"","",{"$f":"IF(COUNTBLANK(AO19:AP19),\"\",VLOOKUP(AO19&AP19,CHOOSE({1,2},tPts32459[Score 1]&tPts32459[Score 2],tPts32459[Pts]),2,0))","v":""},{"$f":"Tirage!$O9","v":10},null,null,{"$f":"VLOOKUP(AR19,Inscriptions!$M$19:$N$28,2,FALSE)","v":0},"","",{"$f":"IF(COUNTBLANK(AV19:AW19),\"\",VLOOKUP(AV19&AW19,CHOOSE({1,2},tPts32459[Score 1]&tPts32459[Score 2],tPts32459[Pts]),2,0))","v":""},{"$f":"Tirage!$Q9","v":9},null,null,{"$f":"VLOOKUP(AY19,Inscriptions!$M$19:$N$28,2,FALSE)","v":0},{"$f":"IFERROR(VLOOKUP(BB19,$BB$3:BD$7,3,0),\"\")&IFERROR(VLOOKUP(BB19,$BC$3:$BE$7,3,0),\"\")","v":""},"",{"$f":"IF(COUNTBLANK(BC19:BD19),\"\",VLOOKUP(BC19&BD19,CHOOSE({1,2},tPts32459[Score 1]&tPts32459[Score 2],tPts32459[Pts]),2,0))","v":""},{"$f":"Tirage!$S9","v":8},null,null,{"$f":"VLOOKUP(BF19,Inscriptions!$M$19:$N$28,2,FALSE)","v":0},{"$f":"IFERROR(VLOOKUP(BI19,$BI$3:BK$7,3,0),\"\")&IFERROR(VLOOKUP(BI19,$BJ$3:$BL$7,3,0),\"\")","v":""},"",{"$f":"IF(COUNTBLANK(BJ19:BK19),\"\",VLOOKUP(BJ19&BK19,CHOOSE({1,2},tPts32459[Score 1]&tPts32459[Score 2],tPts32459[Pts]),2,0))","v":""}]
[null,{"$f":"Tirage!$C10","v":5},null,null,{"$f":"VLOOKUP(B20,Inscriptions!$M$19:$N$28,2,FALSE)","v":0},"","",{"$f":"IF(E21=0,0,IF(COUNTBLANK(F20:G20),\"\",VLOOKUP(F20&G20,CHOOSE({1,2},tPts32459[Score 1]&tPts32459[Score 2],tPts32459[Pts]),2,0)))","v":0},{"$f":"J4","v":1},null,null,{"$f":"VLOOKUP(I20,Inscriptions!$M$19:$MF$28,2,FALSE)","v":0},"","",{"$f":"IF(L20=0,0,IF(COUNTBLANK(M20:N20),\"\",VLOOKUP(M20&N20,CHOOSE({1,2},tPts32459[Score 1]&tPts32459[Score 2],tPts32459[Pts]),2,0)))","v":0},{"$f":"Tirage!$G10","v":7},null,null,{"$f":"VLOOKUP(P20,Inscriptions!$M$19:$N$28,2,FALSE)","v":0},"","",{"$f":"IF(COUNTBLANK(T20:U20),\"\",VLOOKUP(T20&U20,CHOOSE({1,2},tPts32459[Score 1]&tPts32459[Score 2],tPts32459[Pts]),2,0))","v":""},{"$f":"X4","v":9},null,null,{"$f":"VLOOKUP(W20,Inscriptions!$M$19:$N$28,2,FALSE)","v":0},"","",{"$f":"IF(COUNTBLANK(AA20:AB20),\"\",VLOOKUP(AA20&AB20,CHOOSE({1,2},tPts32459[Score 1]&tPts32459[Score 2],tPts32459[Pts]),2,0))","v":""},{"$f":"Tirage!$K10","v":5},null,null,{"$f":"VLOOKUP(AD20,Inscriptions!$M$19:$N$28,2,FALSE)","v":0},"","",{"$f":"IF(COUNTBLANK(AH20:AI20),\"\",VLOOKUP(AH20&AI20,CHOOSE({1,2},tPts32459[Score 1]&tPts32459[Score 2],tPts32459[Pts]),2,0))","v":""},{"$f":"Tirage!$M10","v":1},null,null,{"$f":"VLOOKUP(AK20,Inscriptions!$M$19:$N$28,2,FALSE)","v":0},"","",{"$f":"IF(COUNTBLANK(AO20:AP20),\"\",VLOOKUP(AO20&AP20,CHOOSE({1,2},tPts32459[Score 1]&tPts32459[Score 2],tPts32459[Pts]),2,0))","v":""},{"$f":"Tirage!$O10","v":1},null,null,{"$f":"VLOOKUP(AR20,Inscriptions!$M$19:$N$28,2,FALSE)","v":0},"","",{"$f":"IF(COUNTBLANK(AV20:AW20),\"\",VLOOKUP(AV20&AW20,CHOOSE({1,2},tPts32459[Score 1]&tPts32459[Score 2],tPts32459[Pts]),2,0))","v":""},{"$f":"Tirage!$Q10","v":5},null,null,{"$f":"VLOOKUP(AY20,Inscriptions!$M$19:$N$28,2,FALSE)","v":0},{"$f":"IFERROR(VLOOKUP(BB20,$BB$3:BD$7,3,0),\"\")&IFERROR(VLOOKUP(BB20,$BC$3:$BE$7,3,0),\"\")","v":""},"",{"$f":"IF(COUNTBLANK(BC20:BD20),\"\",VLOOKUP(BC20&BD20,CHOOSE({1,2},tPts32459[Score 1]&tPts32459[Score 2],tPts32459[Pts]),2,0))","v":""},{"$f":"Tirage!$S10","v":9},null,null,{"$f":"VLOOKUP(BF20,Inscriptions!$M$19:$N$28,2,FALSE)","v":0},{"$f":"IFERROR(VLOOKUP(BI20,$BI$3:BK$7,3,0),\"\")&IFERROR(VLOOKUP(BI20,$BJ$3:$BL$7,3,0),\"\")","v":""},"",{"$f":"IF(COUNTBLANK(BJ20:BK20),\"\",VLOOKUP(BJ20&BK20,CHOOSE({1,2},tPts32459[Score 1]&tPts32459[Score 2],tPts32459[Pts]),2,0))","v":""}]
[null,{"$f":"Tirage!$C11","v":2},null,null,{"$f":"VLOOKUP(B21,Inscriptions!$M$19:$N$28,2,FALSE)","v":0},"","",{"$f":"IF(E22=0,0,IF(COUNTBLANK(F21:G21),\"\",VLOOKUP(F21&G21,CHOOSE({1,2},tPts32459[Score 1]&tPts32459[Score 2],tPts32459[Pts]),2,0)))","v":0},7,null,null,{"$f":"VLOOKUP(I21,Inscriptions!$M$19:$MF$28,2,FALSE)","v":0},"","",{"$f":"IF(L21=0,0,IF(COUNTBLANK(M21:N21),\"\",VLOOKUP(M21&N21,CHOOSE({1,2},tPts32459[Score 1]&tPts32459[Score 2],tPts32459[Pts]),2,0)))","v":0},{"$f":"Tirage!$G11","v":9},null,null,{"$f":"VLOOKUP(P21,Inscriptions!$M$19:$N$28,2,FALSE)","v":0},"","",{"$f":"IF(COUNTBLANK(T21:U21),\"\",VLOOKUP(T21&U21,CHOOSE({1,2},tPts32459[Score 1]&tPts32459[Score 2],tPts32459[Pts]),2,0))","v":""},{"$f":"X5","v":3},null,null,{"$f":"VLOOKUP(W21,Inscriptions!$M$19:$N$28,2,FALSE)","v":0},"","",{"$f":"IF(COUNTBLANK(AA21:AB21),\"\",VLOOKUP(AA21&AB21,CHOOSE({1,2},tPts32459[Score 1]&tPts32459[Score 2],tPts32459[Pts]),2,0))","v":""},{"$f":"Tirage!$K11","v":2},null,null,{"$f":"VLOOKUP(AD21,Inscriptions!$M$19:$N$28,2,FALSE)","v":0},"","",{"$f":"IF(COUNTBLANK(AH21:AI21),\"\",VLOOKUP(AH21&AI21,CHOOSE({1,2},tPts32459[Score 1]&tPts32459[Score 2],tPts32459[Pts]),2,0))","v":""},{"$f":"Tirage!$M11","v":7},null,null,{"$f":"VLOOKUP(AK21,Inscriptions!$M$19:$N$28,2,FALSE)","v":0},"","",{"$f":"IF(COUNTBLANK(AO21:AP21),\"\",VLOOKUP(AO21&AP21,CHOOSE({1,2},tPts32459[Score 1]&tPts32459[Score 2],tPts32459[Pts]),2,0))","v":""},{"$f":"Tirage!$O11","v":9},null,null,{"$f":"VLOOKUP(AR21,Inscriptions!$M$19:$N$28,2,FALSE)","v":0},"","",{"$f":"IF(COUNTBLANK(AV21:AW21),\"\",VLOOKUP(AV21&AW21,CHOOSE({1,2},tPts32459[Score 1]&tPts32459[Score 2],tPts32459[Pts]),2,0))","v":""},{"$f":"Tirage!$Q11","v":3},null,null,{"$f":"VLOOKUP(AY21,Inscriptions!$M$19:$N$28,2,FALSE)","v":0},{"$f":"IFERROR(VLOOKUP(BB21,$BB$3:BD$7,3,0),\"\")&IFERROR(VLOOKUP(BB21,$BC$3:$BE$7,3,0),\"\")","v":""},"",{"$f":"IF(COUNTBLANK(BC21:BD21),\"\",VLOOKUP(BC21&BD21,CHOOSE({1,2},tPts32459[Score 1]&tPts32459[Score 2],tPts32459[Pts]),2,0))","v":""},{"$f":"Tirage!$S11","v":1},null,null,{"$f":"VLOOKUP(BF21,Inscriptions!$M$19:$N$28,2,FALSE)","v":0},{"$f":"IFERROR(VLOOKUP(BI21,$BI$3:BK$7,3,0),\"\")&IFERROR(VLOOKUP(BI21,$BJ$3:$BL$7,3,0),\"\")","v":""},"",{"$f":"IF(COUNTBLANK(BJ21:BK21),\"\",VLOOKUP(BJ21&BK21,CHOOSE({1,2},tPts32459[Score 1]&tPts32459[Score 2],tPts32459[Pts]),2,0))","v":""}]
[null,{"$f":"Tirage!$C12","v":1},null,null,{"$f":"VLOOKUP(B22,Inscriptions!$M$19:$N$28,2,FALSE)","v":0},"","",{"$f":"IF(E23=0,0,IF(COUNTBLANK(F22:G22),\"\",VLOOKUP(F22&G22,CHOOSE({1,2},tPts32459[Score 1]&tPts32459[Score 2],tPts32459[Pts]),2,0)))","v":0},6,null,null,{"$f":"VLOOKUP(I22,Inscriptions!$M$19:$MF$28,2,FALSE)","v":0},"","",{"$f":"IF(L22=0,0,IF(COUNTBLANK(M22:N22),\"\",VLOOKUP(M22&N22,CHOOSE({1,2},tPts32459[Score 1]&tPts32459[Score 2],tPts32459[Pts]),2,0)))","v":0},{"$f":"Tirage!$G12","v":5},null,null,{"$f":"VLOOKUP(P22,Inscriptions!$M$19:$N$28,2,FALSE)","v":0},"","",{"$f":"IF(COUNTBLANK(T22:U22),\"\",VLOOKUP(T22&U22,CHOOSE({1,2},tPts32459[Score 1]&tPts32459[Score 2],tPts32459[Pts]),2,0))","v":""},{"$f":"X6","v":2},null,null,{"$f":"VLOOKUP(W22,Inscriptions!$M$19:$N$28,2,FALSE)","v":0},"","",{"$f":"IF(COUNTBLANK(AA22:AB22),\"\",VLOOKUP(AA22&AB22,CHOOSE({1,2},tPts32459[Score 1]&tPts32459[Score 2],tPts32459[Pts]),2,0))","v":""},{"$f":"Tirage!$K12","v":8},null,null,{"$f":"VLOOKUP(AD22,Inscriptions!$M$19:$N$28,2,FALSE)","v":0},"","",{"$f":"IF(COUNTBLANK(AH22:AI22),\"\",VLOOKUP(AH22&AI22,CHOOSE({1,2},tPts32459[Score 1]&tPts32459[Score 2],tPts32459[Pts]),2,0))","v":""},{"$f":"Tirage!$M12","v":8},null,null,{"$f":"VLOOKUP(AK22,Inscriptions!$M$19:$N$28,2,FALSE)","v":0},"","",{"$f":"IF(COUNTBLANK(AO22:AP22),\"\",VLOOKUP(AO22&AP22,CHOOSE({1,2},tPts32459[Score 1]&tPts32459[Score 2],tPts32459[Pts]),2,0))","v":""},{"$f":"Tirage!$O12","v":6},null,null,{"$f":"VLOOKUP(AR22,Inscriptions!$M$19:$N$28,2,FALSE)","v":0},"","",{"$f":"IF(COUNTBLANK(AV22:AW22),\"\",VLOOKUP(AV22&AW22,CHOOSE({1,2},tPts32459[Score 1]&tPts32459[Score 2],tPts32459[Pts]),2,0))","v":""},{"$f":"Tirage!$Q12","v":6},null,null,{"$f":"VLOOKUP(AY22,Inscriptions!$M$19:$N$28,2,FALSE)","v":0},{"$f":"IFERROR(VLOOKUP(BB22,$BB$3:BD$7,3,0),\"\")&IFERROR(VLOOKUP(BB22,$BC$3:$BE$7,3,0),\"\")","v":""},"",{"$f":"IF(COUNTBLANK(BC22:BD22),\"\",VLOOKUP(BC22&BD22,CHOOSE({1,2},tPts32459[Score 1]&tPts32459[Score 2],tPts32459[Pts]),2,0))","v":""},{"$f":"Tirage!$S12","v":5},null,null,{"$f":"VLOOKUP(BF22,Inscriptions!$M$19:$N$28,2,FALSE)","v":0},{"$f":"IFERROR(VLOOKUP(BI22,$BI$3:BK$7,3,0),\"\")&IFERROR(VLOOKUP(BI22,$BJ$3:$BL$7,3,0),\"\")","v":""},"",{"$f":"IF(COUNTBLANK(BJ22:BK22),\"\",VLOOKUP(BJ22&BK22,CHOOSE({1,2},tPts32459[Score 1]&tPts32459[Score 2],tPts32459[Pts]),2,0))","v":""}]
[null,{"$f":"Tirage!$C13","v":4},null,null,{"$f":"VLOOKUP(B23,Inscriptions!$M$19:$N$28,2,FALSE)","v":0},"","",{"$f":"IF(E23=0,0,IF(COUNTBLANK(F23:G23),\"\",VLOOKUP(F23&G23,CHOOSE({1,2},tPts32459[Score 1]&tPts32459[Score 2],tPts32459[Pts]),2,0)))","v":0},10,null,null,{"$f":"VLOOKUP(I23,Inscriptions!$M$19:$MF$28,2,FALSE)","v":0},"","",{"$f":"IF(L23=0,0,IF(COUNTBLANK(M23:N23),\"\",VLOOKUP(M23&N23,CHOOSE({1,2},tPts32459[Score 1]&tPts32459[Score 2],tPts32459[Pts]),2,0)))","v":0},{"$f":"Tirage!$G13","v":6},null,null,{"$f":"VLOOKUP(P23,Inscriptions!$M$19:$N$28,2,FALSE)","v":0},"","",{"$f":"IF(COUNTBLANK(T23:U23),\"\",VLOOKUP(T23&U23,CHOOSE({1,2},tPts32459[Score 1]&tPts32459[Score 2],tPts32459[Pts]),2,0))","v":""},{"$f":"X7","v":7},null,null,{"$f":"VLOOKUP(W23,Inscriptions!$M$19:$N$28,2,FALSE)","v":0},"","",{"$f":"IF(COUNTBLANK(AA23:AB23),\"\",VLOOKUP(AA23&AB23,CHOOSE({1,2},tPts32459[Score 1]&tPts32459[Score 2],tPts32459[Pts]),2,0))","v":""},{"$f":"Tirage!$K13","v":9},null,null,{"$f":"VLOOKUP(AD23,Inscriptions!$M$19:$N$28,2,FALSE)","v":0},"","",{"$f":"IF(COUNTBLANK(AH23:AI23),\"\",VLOOKUP(AH23&AI23,CHOOSE({1,2},tPts32459[Score 1]&tPts32459[Score 2],tPts32459[Pts]),2,0))","v":""},{"$f":"Tirage!$M13","v":5},null,null,{"$f":"VLOOKUP(AK23,Inscriptions!$M$19:$N$28,2,FALSE)","v":0},{"$f":"IFERROR(VLOOKUP(AN23,$AN$3:$AP$7,3,0),\"\")&IFERROR(VLOOKUP(AN23,$AO$3:$AQ$7,3,0),\"\")","v":""},{"$f":"IFERROR(VLOOKUP(AN23,$AN$3:$AQ$7,4,0),\"\")&IFERROR(VLOOKUP(AN23,$AO$3:$AQ$7,2,0),\"\")","v":""},{"$f":"IF(COUNTBLANK(AO23:AP23),\"\",VLOOKUP(AO23&AP23,CHOOSE({1,2},tPts32459[Score 1]&tPts32459[Score 2],tPts32459[Pts]),2,0))","v":""},{"$f":"Tirage!$O13","v":2},null,null,{"$f":"VLOOKUP(AR23,Inscriptions!$M$19:$N$28,2,FALSE)","v":0},"","",{"$f":"IF(COUNTBLANK(AV23:AW23),\"\",VLOOKUP(AV23&AW23,CHOOSE({1,2},tPts32459[Score 1]&tPts32459[Score 2],tPts32459[Pts]),2,0))","v":""},{"$f":"Tirage!$Q13","v":1},null,null,{"$f":"VLOOKUP(AY23,Inscriptions!$M$19:$N$28,2,FALSE)","v":0},{"$f":"IFERROR(VLOOKUP(BB23,$BB$3:BD$7,3,0),\"\")&IFERROR(VLOOKUP(BB23,$BC$3:$BE$7,3,0),\"\")","v":""},"",{"$f":"IF(COUNTBLANK(BC23:BD23),\"\",VLOOKUP(BC23&BD23,CHOOSE({1,2},tPts32459[Score 1]&tPts32459[Score 2],tPts32459[Pts]),2,0))","v":""},{"$f":"Tirage!$S13","v":2},null,null,{"$f":"VLOOKUP(BF23,Inscriptions!$M$19:$N$28,2,FALSE)","v":0},{"$f":"IFERROR(VLOOKUP(BI23,$BI$3:BK$7,3,0),\"\")&IFERROR(VLOOKUP(BI23,$BJ$3:$BL$7,3,0),\"\")","v":""},"",{"$f":"IF(COUNTBLANK(BJ23:BK23),\"\",VLOOKUP(BJ23&BK23,CHOOSE({1,2},tPts32459[Score 1]&tPts32459[Score 2],tPts32459[Pts]),2,0))","v":""}]
[]
[]
[]
[null,null,null,"Grille des points",null,null,null,null,null,null,null,null,"Classement Général journée 8"]
[null,null,null,"Score 1","Score 2","Pts",null,null,null,"Place",null,"Place","Equipes","Total Pts"]
[null,null,null,0,0,0,null,null,null,1,null,1,null,{"$f":"IFERROR(VLOOKUP(M29,$E$14:$H$23,4,0)*1,0)\n+IFERROR(VLOOKUP(M29,$L$14:$O$23,4,0)*1,0)\n+IFERROR(VLOOKUP(M29,$S$14:$V$23,4,0)*1,0)\n+IFERROR(VLOOKUP(M29,$Z$14:$AC$23,4,0)*1,0)\n+IFERROR(VLOOKUP(M29,$AG$14:$AJ$23,4,0)*1,0)\n+IFERROR(VLOOKUP(M29,$AN$14:$AQ$23,4,0)*1,0)\n+IFERROR(VLOOKUP(M29,$AU$14:$AX$23,4,0)*1,0\n+IFERROR(VLOOKUP(M29,$BB$14:$BE$23,4,0)*1,0)\n+IFERROR(VLOOKUP(M29,$BI$14:$BL$23,4,0)*1,0))","v":0},{"$f":"IF(N29=0,-100,N29)","v":-100}]
[null,null,null,0,1,1,null,null,null,2,null,2,null,0,-100]
[null,null,null,0,2,1,null,null,null,3,null,3,null,0,-100]
[null,null,null,1,0,10,null,null,null,4,null,4,null,0,-100]
[null,null,null,1,1,3,null,null,null,5,null,5,null,0,-100]
[null,null,null,1,2,1,null,null,null,6,null,6,null,0,-100]
[null,null,null,2,0,10,null,null,null,7,null,7,null,0,-100]
[null,null,null,2,1,10,null,null,null,8,null,8,null,0,-100]
[null,null,null,2,2,3,null,null,null,9,null,9,null,0,-100]
[null,null,null,2,"ab",10,null,null,null,10,null,10,null,0,-100]
[null,null,null,"ab",2,0,null,null,null,11]
[null,null,null,1,"ab",10,null,null,null,12]
[null,null,null,"ab",1,0,null,null,null,13]
[null,null,null,null,null,null,null,null,null,14]