{"text_format":"1","workbook":"xlsx","n_sheets":5,"sheets":["Reporting","graphique","2023","2024","Recap"],"not_rendered":{"charts":5,"images":0,"macros":1,"external_links":1,"defined_names":29,"comments":0,"pivot_tables":0},"unopened":[],"bounds":{"document_bytes":16777216,"sheet_cells":100000,"rows_first":2000,"rows_last":500,"rows_between":2000,"halvings":0,"cell_chars":16384,"cell_head_chars":4096},"cells_cut":0,"cells_raw":0,"read":"whole","date_system":"1900"}

{"sheet":"Reporting","index":0,"n_rows":12,"n_cols":22,"rows_kept":12,"cut":false,"hidden":false,"merged":[[11,10,12,10],[9,14,10,14],[9,16,10,16],[1,1,2,8],[11,2,12,2],[11,4,12,4],[11,6,12,6],[11,8,12,8]]}
[]
[null,"JOURNAL DE BORD                          des Certificats de vie enveloppe T",null,null,null,null,null,null,null,null,2023,1,null,null,null,null,null,null,null,null,null,{"$f":"IF(L2=1,2,IF(L2=2,4,IF(L2=3,5,\"\")))","v":2}]
[null,null,null,null,null,null,null,null,null,null,null,null,null,null,null,null,null,null,null,null,{"$f":"HLOOKUP(C12,INDIRECT($K$2&\"!$I$4:$P$8\"),V2,FALSE)","v":123902}]
[]
[null,null,null,null,null,null,null,null,null,null,null,null,null,null,null,null,null,null,null,null,{"$f":"HLOOKUP(E12,INDIRECT($K$2&\"!$I$4:$P$8\"),V2,FALSE)","v":106409}]
[null,null,null,null,null,null,null,null,null,null,null,null,null,null,null,null,null,null,null,null,{"$f":"HLOOKUP(G12,INDIRECT($K$2&\"!$I$4:$P$8\"),V2,FALSE)","v":0.85881583832383657}]
[null,null,null,null,null,null,null,null,null,null,null,null,null,null,null,null,null,null,null,null,{"$f":"HLOOKUP(I12,INDIRECT($K$2&\"!$I$4:$P$8\"),V2,FALSE)","v":108537}]
[null,null,null,null,null,null,null,null,null,null,null,null,null,null,{"$f":"HLOOKUP(O10,INDIRECT($K$2&\"!$I$4:$P$8\"),V2,FALSE)","v":"2023-06-22"},null,{"$f":"HLOOKUP(Q10,INDIRECT($K$2&\"!$I$4:$P$8\"),V2,FALSE)","v":"2023-09-30"},null,null,null,{"$f":"HLOOKUP(K12,INDIRECT($K$2&\"!$I$4:$P$8\"),V2,FALSE)","v":0.87599070232926024}]
[]
[null,null,null,null,null,null,null,null,null,null,null,null,null,null,"PÉRIODE DÉBUT",null,"PÉRIODE FIN"]
[]
[null,null,"Certificats envoyé",null,"certifcats Reçus",null,"% Reçu",null,"certifcats scannés",null,"% Scanné"]

{"sheet":"graphique","index":1,"n_rows":33,"n_cols":1,"rows_kept":33,"cut":false,"hidden":false,"merged":[]}
["Mes graphiques"]
[]
[1]
[]
[]
[]
[]
[]
[]
[]
[]
[]
[]
[]
[]
[]
[]
[]
[]
[]
[]
[]
[]
[]
[]
[]
[]
[]
[]
[]
[]
[]
[2]

{"sheet":"2023","index":2,"n_rows":473,"n_cols":20,"rows_kept":473,"cut":false,"hidden":false,"merged":[[0,2,1,3]]}
[null,null,"Certificats 2023"]
[]
[]
[null,null,null,null,null,null,null,null,"ID","PÉRIODE DÉBUT","PÉRIODE FIN","Certificats envoyé","certifcats Reçus","% reçu","certifcats scannés","% Scanné"]
[null,"Date","CHIFFRE jour","TOTAL","certifcats scannés","Total",null,null,1,"2023-06-22","2023-09-30",123902,{"$f":"SUM(C7:C107)","v":106409},{"$f":"M5/L5","v":0.85881583832383657},{"$f":"SUM(E7:E107)","v":108537},{"$f":"O5/L5","v":0.87599070232926024},null,"MOIS","Certificats Reçu","Certificats Scanné"]
[null,"DATE","KILOMÉTRAGE 1","KILOMÈTRES","Colonne2","Colonne4","Colonne5",null,null,null,null,null,null,null,null,null,null,"2023-06-01"]
[null,"2023-06-22",148,148,8,8,123902,null,2,"2023-10-01","2024-09-30",66693,{"$f":"SUM(C108:C381)","v":44691.58},{"$f":"M7/L7","v":0.67010900694225783},{"$f":"SUM(E108:E381)","v":48338},{"$f":"O7/L7","v":0.72478371043437839},null,"2023-06-01",{"$f":"D15","v":30507},{"$f":"SUM(E7:E15)","v":24}]
[null,"2023-06-23",1411,{"$f":"D7+Données[[#This Row],[KILOMÉTRAGE 1]]","v":1559},0,{"$f":"F7+Données[[#This Row],[Colonne2]]","v":8},123902,null,3,"2023-06-22","2024-09-30",{"$f":"SUM(L5:L7)","v":190595},{"$f":"SUM(M5:M7)","v":151100.58000000002},{"$f":"M8/L8","v":0.7927835462630185},{"$f":"SUM(O5:O7)","v":156875},{"$f":"O8/L8","v":0.82308035362942367},null,"2023-07-01",{"$f":"SUM(C16:C46)","v":71295},{"$f":"SUM(E16:E46)","v":78382}]
[null,"2023-06-24",0,{"$f":"D8+Données[[#This Row],[KILOMÉTRAGE 1]]","v":1559},0,{"$f":"F8+Données[[#This Row],[Colonne2]]","v":8},123902,null,null,null,null,null,null,null,null,null,null,"2023-08-01",{"$f":"SUM(C47:C77)","v":3268},{"$f":"SUM(E47:E77)","v":29227}]
[null,"2023-06-25",0,{"$f":"D9+Données[[#This Row],[KILOMÉTRAGE 1]]","v":1559},0,{"$f":"F9+Données[[#This Row],[Colonne2]]","v":8},123902,null,null,null,null,null,null,null,null,null,null,"2023-09-01",{"$f":"SUM(C78:C107)","v":1339},{"$f":"SUM(E78:E107)","v":904}]
[null,"2023-06-26",4545,{"$f":"D10+Données[[#This Row],[KILOMÉTRAGE 1]]","v":6104},12,{"$f":"F10+Données[[#This Row],[Colonne2]]","v":20},123902,null,null,null,null,null,null,null,null,null,null,"2023-10-01",{"$f":"SUM(C108:C138)","v":13886},{"$f":"SUM(E108:E138)","v":593}]
[null,"2023-06-27",11134,{"$f":"D11+Données[[#This Row],[KILOMÉTRAGE 1]]","v":17238},0,{"$f":"F11+Données[[#This Row],[Colonne2]]","v":20},123902,null,null,null,null,null,null,null,null,null,null,"2023-11-01",{"$f":"SUM(C139:C168)","v":26946},{"$f":"SUM(E139:E168)","v":0}]
[null,"2023-06-28",6020,{"$f":"D12+Données[[#This Row],[KILOMÉTRAGE 1]]","v":23258},4,{"$f":"F12+Données[[#This Row],[Colonne2]]","v":24},123902,null,null,null,null,null,null,null,null,null,null,"2023-12-01",{"$f":"SUM(C169:C199)","v":2463},{"$f":"SUM(E169:E199)","v":3847}]
[null,"2023-06-29",764,{"$f":"D13+Données[[#This Row],[KILOMÉTRAGE 1]]","v":24022},0,{"$f":"F13+Données[[#This Row],[Colonne2]]","v":24},123902,null,null,null,null,null,null,null,null,null,null,"2024-01-01",{"$f":"SUM(C200:C230)","v":686},{"$f":"SUM(E200:E230)","v":10162}]
[null,"2023-06-30",6485,{"$f":"D14+Données[[#This Row],[KILOMÉTRAGE 1]]","v":30507},0,{"$f":"F14+Données[[#This Row],[Colonne2]]","v":24},123902,null,null,null,null,null,null,null,null,null,null,"2024-02-01",{"$f":"SUM(C231:C259)","v":284},{"$f":"SUM(E231:E259)","v":22048}]
[null,"2023-07-01",0,{"$f":"D15+Données[[#This Row],[KILOMÉTRAGE 1]]","v":30507},0,{"$f":"F15+Données[[#This Row],[Colonne2]]","v":24},123902,null,null,null,null,null,null,null,null,null,null,"2024-03-01",{"$f":"SUM(C260:C290)","v":128},{"$f":"SUM(E260:E290)","v":11158}]
[null,"2023-07-02",0,{"$f":"D16+Données[[#This Row],[KILOMÉTRAGE 1]]","v":30507},0,{"$f":"F16+Données[[#This Row],[Colonne2]]","v":24},123902,null,null,null,null,null,null,null,null,null,null,"2024-04-01",{"$f":"SUM(C291:C320)","v":103},{"$f":"SUM(E291:E320)","v":283}]
[null,"2023-07-03",23815,{"$f":"D17+Données[[#This Row],[KILOMÉTRAGE 1]]","v":54322},0,{"$f":"F17+Données[[#This Row],[Colonne2]]","v":24},123902,null,null,null,null,null,null,null,null,null,null,"2024-05-01",{"$f":"SUM(C321:C351)","v":97},{"$f":"SUM(E321:E351)","v":157}]
[null,"2023-07-04",4215,{"$f":"D18+Données[[#This Row],[KILOMÉTRAGE 1]]","v":58537},852,{"$f":"F18+Données[[#This Row],[Colonne2]]","v":876},123902,null,null,null,null,null,null,null,null,null,null,"2024-06-01",{"$f":"SUM(C352:C381)","v":98.58},{"$f":"SUM(E352:E381)","v":90}]
[null,"2023-07-05",5208,{"$f":"D19+Données[[#This Row],[KILOMÉTRAGE 1]]","v":63745},2686,{"$f":"F19+Données[[#This Row],[Colonne2]]","v":3562},123902]
[null,"2023-07-06",4507,{"$f":"D20+Données[[#This Row],[KILOMÉTRAGE 1]]","v":68252},3024,{"$f":"F20+Données[[#This Row],[Colonne2]]","v":6586},123902]
[null,"2023-07-07",4457,{"$f":"D21+Données[[#This Row],[KILOMÉTRAGE 1]]","v":72709},2496,{"$f":"F21+Données[[#This Row],[Colonne2]]","v":9082},123902]
[null,"2023-07-08",0,{"$f":"D22+Données[[#This Row],[KILOMÉTRAGE 1]]","v":72709},0,{"$f":"F22+Données[[#This Row],[Colonne2]]","v":9082},123902]
[null,"2023-07-09",0,{"$f":"D23+Données[[#This Row],[KILOMÉTRAGE 1]]","v":72709},0,{"$f":"F23+Données[[#This Row],[Colonne2]]","v":9082},123902]
[null,"2023-07-10",7807,{"$f":"D24+Données[[#This Row],[KILOMÉTRAGE 1]]","v":80516},4226,{"$f":"F24+Données[[#This Row],[Colonne2]]","v":13308},123902]
[null,"2023-07-11",5604,{"$f":"D25+Données[[#This Row],[KILOMÉTRAGE 1]]","v":86120},4930,{"$f":"F25+Données[[#This Row],[Colonne2]]","v":18238},123902]
[null,"2023-07-12",4597,{"$f":"D26+Données[[#This Row],[KILOMÉTRAGE 1]]","v":90717},5028,{"$f":"F26+Données[[#This Row],[Colonne2]]","v":23266},123902]
[null,"2023-07-13",1578,{"$f":"D27+Données[[#This Row],[KILOMÉTRAGE 1]]","v":92295},4920,{"$f":"F27+Données[[#This Row],[Colonne2]]","v":28186},123902]
[null,"2023-07-14",0,{"$f":"D28+Données[[#This Row],[KILOMÉTRAGE 1]]","v":92295},0,{"$f":"F28+Données[[#This Row],[Colonne2]]","v":28186},123902]
[null,"2023-07-15",0,{"$f":"D29+Données[[#This Row],[KILOMÉTRAGE 1]]","v":92295},0,{"$f":"F29+Données[[#This Row],[Colonne2]]","v":28186},123902]
[null,"2023-07-16",0,{"$f":"D30+Données[[#This Row],[KILOMÉTRAGE 1]]","v":92295},0,{"$f":"F30+Données[[#This Row],[Colonne2]]","v":28186},123902]
[null,"2023-07-17",2420,{"$f":"D31+Données[[#This Row],[KILOMÉTRAGE 1]]","v":94715},4988,{"$f":"F31+Données[[#This Row],[Colonne2]]","v":33174},123902]
[null,"2023-07-18",824,{"$f":"D32+Données[[#This Row],[KILOMÉTRAGE 1]]","v":95539},6895,{"$f":"F32+Données[[#This Row],[Colonne2]]","v":40069},123902]
[null,"2023-07-19",828,{"$f":"D33+Données[[#This Row],[KILOMÉTRAGE 1]]","v":96367},5759,{"$f":"F33+Données[[#This Row],[Colonne2]]","v":45828},123902]
[null,"2023-07-20",887,{"$f":"D34+Données[[#This Row],[KILOMÉTRAGE 1]]","v":97254},6126,{"$f":"F34+Données[[#This Row],[Colonne2]]","v":51954},123902]
[null,"2023-07-21",824,{"$f":"D35+Données[[#This Row],[KILOMÉTRAGE 1]]","v":98078},4015,{"$f":"F35+Données[[#This Row],[Colonne2]]","v":55969},123902]
[null,"2023-07-22",0,{"$f":"D36+Données[[#This Row],[KILOMÉTRAGE 1]]","v":98078},0,{"$f":"F36+Données[[#This Row],[Colonne2]]","v":55969},123902]
[null,"2023-07-23",0,{"$f":"D37+Données[[#This Row],[KILOMÉTRAGE 1]]","v":98078},0,{"$f":"F37+Données[[#This Row],[Colonne2]]","v":55969},123902]
[null,"2023-07-24",2,{"$f":"D38+Données[[#This Row],[KILOMÉTRAGE 1]]","v":98080},6293,{"$f":"F38+Données[[#This Row],[Colonne2]]","v":62262},123902]
[null,"2023-07-25",2112,{"$f":"D39+Données[[#This Row],[KILOMÉTRAGE 1]]","v":100192},0,{"$f":"F39+Données[[#This Row],[Colonne2]]","v":62262},123902]
{"$rows_left_out":434}
{"sheet":"2024","index":3,"n_rows":433,"n_cols":20,"rows_kept":433,"cut":false,"hidden":false,"merged":[[0,2,1,3]]}
[null,null,"Certificats 2024"]
[]
[]
[null,null,null,null,null,null,null,null,"ID","PÉRIODE DÉBUT","PÉRIODE FIN","Certificats envoyé","certifcats Reçus","% reçu","certifcats scannés","% Scanné"]
[null,"Date","CHIFFRE jour","TOTAL","certifcats scannés","Total",null,null,1,"2024-10-01",null,7883,{"$f":"SUM(C7:C107)","v":0},{"$f":"M5/L5","v":0},{"$f":"SUM(E7:E107)","v":0},{"$f":"O5/L5","v":0},null,"MOIS","Certificats Reçu","Certificats Scanné"]
[null,"DATE","KILOMÉTRAGE 1","KILOMÈTRES","Colonne2","Colonne4","Colonne5",null,null,null,null,null,null,null,null,null,null,"2023-06-01"]
[null,"2024-10-01",null,null,null,null,7883,null,null,null,null,null,null,null,null,null,null,"2024-10-01",{"$f":"D15","v":0},{"$f":"SUM(E7:E15)","v":0}]
[null,"2024-10-02",null,{"$f":"D7+Données4[[#This Row],[KILOMÉTRAGE 1]]","v":0},null,{"$f":"F7+Données4[[#This Row],[Colonne2]]","v":0},7883,null,null,null,null,null,null,null,null,null,null,"2024-11-01",{"$f":"SUM(C16:C46)","v":0},{"$f":"SUM(E16:E46)","v":0}]
[null,"2024-10-03",null,{"$f":"D8+Données4[[#This Row],[KILOMÉTRAGE 1]]","v":0},null,{"$f":"F8+Données4[[#This Row],[Colonne2]]","v":0},7883,null,null,null,null,null,null,null,null,null,null,"2024-12-01",{"$f":"SUM(C47:C77)","v":0},{"$f":"SUM(E47:E77)","v":0}]
[null,"2024-10-04",null,{"$f":"D9+Données4[[#This Row],[KILOMÉTRAGE 1]]","v":0},null,{"$f":"F9+Données4[[#This Row],[Colonne2]]","v":0},7883,null,null,null,null,null,null,null,null,null,null,"2025-01-01",{"$f":"SUM(C78:C107)","v":0},{"$f":"SUM(E78:E107)","v":0}]
[null,"2024-10-05",null,{"$f":"D10+Données4[[#This Row],[KILOMÉTRAGE 1]]","v":0},null,{"$f":"F10+Données4[[#This Row],[Colonne2]]","v":0},7883,null,null,null,null,null,null,null,null,null,null,"2025-02-01",{"$f":"SUM(C108:C138)","v":0},{"$f":"SUM(E108:E138)","v":0}]
[null,"2024-10-06",null,{"$f":"D11+Données4[[#This Row],[KILOMÉTRAGE 1]]","v":0},null,{"$f":"F11+Données4[[#This Row],[Colonne2]]","v":0},7883,null,null,null,null,null,null,null,null,null,null,"2025-03-01",{"$f":"SUM(C139:C168)","v":0},{"$f":"SUM(E139:E168)","v":0}]
[null,"2024-10-07",null,{"$f":"D12+Données4[[#This Row],[KILOMÉTRAGE 1]]","v":0},null,{"$f":"F12+Données4[[#This Row],[Colonne2]]","v":0},7883]
[null,"2024-10-08",null,{"$f":"D13+Données4[[#This Row],[KILOMÉTRAGE 1]]","v":0},null,{"$f":"F13+Données4[[#This Row],[Colonne2]]","v":0},7883]
[null,"2024-10-09",null,{"$f":"D14+Données4[[#This Row],[KILOMÉTRAGE 1]]","v":0},null,{"$f":"F14+Données4[[#This Row],[Colonne2]]","v":0},7883]
[null,"2024-10-10",null,{"$f":"D15+Données4[[#This Row],[KILOMÉTRAGE 1]]","v":0},null,{"$f":"F15+Données4[[#This Row],[Colonne2]]","v":0},7883]
[null,"2024-10-11",null,{"$f":"D16+Données4[[#This Row],[KILOMÉTRAGE 1]]","v":0},null,{"$f":"F16+Données4[[#This Row],[Colonne2]]","v":0},7883]
[null,"2024-10-12",null,{"$f":"D17+Données4[[#This Row],[KILOMÉTRAGE 1]]","v":0},null,{"$f":"F17+Données4[[#This Row],[Colonne2]]","v":0},7883]
[null,"2024-10-13",null,{"$f":"D18+Données4[[#This Row],[KILOMÉTRAGE 1]]","v":0},null,{"$f":"F18+Données4[[#This Row],[Colonne2]]","v":0},7883]
[null,"2024-10-14",null,{"$f":"D19+Données4[[#This Row],[KILOMÉTRAGE 1]]","v":0},null,{"$f":"F19+Données4[[#This Row],[Colonne2]]","v":0},7883]
[null,"2024-10-15",null,{"$f":"D20+Données4[[#This Row],[KILOMÉTRAGE 1]]","v":0},null,{"$f":"F20+Données4[[#This Row],[Colonne2]]","v":0},7883]
[null,"2024-10-16",null,{"$f":"D21+Données4[[#This Row],[KILOMÉTRAGE 1]]","v":0},null,{"$f":"F21+Données4[[#This Row],[Colonne2]]","v":0},7883]
[null,"2024-10-17",null,{"$f":"D22+Données4[[#This Row],[KILOMÉTRAGE 1]]","v":0},null,{"$f":"F22+Données4[[#This Row],[Colonne2]]","v":0},7883]
[null,"2024-10-18",null,{"$f":"D23+Données4[[#This Row],[KILOMÉTRAGE 1]]","v":0},null,{"$f":"F23+Données4[[#This Row],[Colonne2]]","v":0},7883]
[null,"2024-10-19",null,{"$f":"D24+Données4[[#This Row],[KILOMÉTRAGE 1]]","v":0},null,{"$f":"F24+Données4[[#This Row],[Colonne2]]","v":0},7883]
[null,"2024-10-20",null,{"$f":"D25+Données4[[#This Row],[KILOMÉTRAGE 1]]","v":0},null,{"$f":"F25+Données4[[#This Row],[Colonne2]]","v":0},7883]
[null,"2024-10-21",null,{"$f":"D26+Données4[[#This Row],[KILOMÉTRAGE 1]]","v":0},null,{"$f":"F26+Données4[[#This Row],[Colonne2]]","v":0},7883]
[null,"2024-10-22",null,{"$f":"D27+Données4[[#This Row],[KILOMÉTRAGE 1]]","v":0},null,{"$f":"F27+Données4[[#This Row],[Colonne2]]","v":0},7883]
[null,"2024-10-23",null,{"$f":"D28+Données4[[#This Row],[KILOMÉTRAGE 1]]","v":0},null,{"$f":"F28+Données4[[#This Row],[Colonne2]]","v":0},7883]
[null,"2024-10-24",null,{"$f":"D29+Données4[[#This Row],[KILOMÉTRAGE 1]]","v":0},null,{"$f":"F29+Données4[[#This Row],[Colonne2]]","v":0},7883]
[null,"2024-10-25",null,{"$f":"D30+Données4[[#This Row],[KILOMÉTRAGE 1]]","v":0},null,{"$f":"F30+Données4[[#This Row],[Colonne2]]","v":0},7883]
[null,"2024-10-26",null,{"$f":"D31+Données4[[#This Row],[KILOMÉTRAGE 1]]","v":0},null,{"$f":"F31+Données4[[#This Row],[Colonne2]]","v":0},7883]
[null,"2024-10-27",null,{"$f":"D32+Données4[[#This Row],[KILOMÉTRAGE 1]]","v":0},null,{"$f":"F32+Données4[[#This Row],[Colonne2]]","v":0},7883]
[null,"2024-10-28",null,{"$f":"D33+Données4[[#This Row],[KILOMÉTRAGE 1]]","v":0},null,{"$f":"F33+Données4[[#This Row],[Colonne2]]","v":0},7883]
[null,"2024-10-29",null,{"$f":"D34+Données4[[#This Row],[KILOMÉTRAGE 1]]","v":0},null,{"$f":"F34+Données4[[#This Row],[Colonne2]]","v":0},7883]
[null,"2024-10-30",null,{"$f":"D35+Données4[[#This Row],[KILOMÉTRAGE 1]]","v":0},null,{"$f":"F35+Données4[[#This Row],[Colonne2]]","v":0},7883]
[null,"2024-10-31",null,{"$f":"D36+Données4[[#This Row],[KILOMÉTRAGE 1]]","v":0},null,{"$f":"F36+Données4[[#This Row],[Colonne2]]","v":0},7883]
[null,"2024-11-01",null,{"$f":"D37+Données4[[#This Row],[KILOMÉTRAGE 1]]","v":0},null,{"$f":"F37+Données4[[#This Row],[Colonne2]]","v":0},7883]
[null,"2024-11-02",null,{"$f":"D38+Données4[[#This Row],[KILOMÉTRAGE 1]]","v":0},null,{"$f":"F38+Données4[[#This Row],[Colonne2]]","v":0},7883]
[null,"2024-11-03",null,{"$f":"D39+Données4[[#This Row],[KILOMÉTRAGE 1]]","v":0},null,{"$f":"F39+Données4[[#This Row],[Colonne2]]","v":0},7883]
{"$rows_left_out":394}
{"sheet":"Recap","index":4,"n_rows":591,"n_cols":23,"rows_kept":591,"cut":false,"hidden":false,"merged":[]}
["Date","ACTIVITÉ","CV","CHIFFRE jour","certifcats scannés",null,null,"Année","1er envoi","Certificats Reçus","Certificats Scannés",null,"Estimation Stock Certificats de vie","Estimation Stock caisses Certificat de vie","En Attente de Reception",null,null,null,null,null,null,2023,1]
["2023-06-22","certificat","CV202306",148,{"$f":"'2023'!E7","v":8},125902,null,"2023-06-22",123902,{"$f":"SUMIF(C:C,\"CV\"&YEAR(H2)&TEXT(MONTH(H2),\"00\"),D:D)","v":106409},{"$f":"SUMIF(C:C,\"CV\"&YEAR(H2)&TEXT(MONTH(H2),\"00\"),E:E)","v":108537},null,{"$f":"J3-K3","v":-3646.4199999999983},{"$f":"M2/600","v":-6.0773666666666637},{"$f":"I3-J3","v":22001.42},null,null,null,null,null,null,2024,2]
["2023-06-23","certificat","CV202306",1411,{"$f":"'2023'!E8","v":0},125902,null,"2023-10-01",66693,{"$f":"SUMIF(C:C,\"CV\"&YEAR(H3)&TEXT(MONTH(H3),\"00\"),D:D)","v":44691.58},{"$f":"SUMIF(C:C,\"CV\"&YEAR(H3)&TEXT(MONTH(H3),\"00\"),E:E)","v":48338},null,null,null,null,null,null,null,null,null,null,null,3]
["2023-06-24",null,"CV202306",0,{"$f":"'2023'!E9","v":0}]
["2023-06-25",null,"CV202306",0,{"$f":"'2023'!E10","v":0}]
["2023-06-26","certificat","CV202306",4545,{"$f":"'2023'!E11","v":12},125902]
["2023-06-27","certificat","CV202306",11134,{"$f":"'2023'!E12","v":0},125902]
["2023-06-28","certificat","CV202306",6020,{"$f":"'2023'!E13","v":4},125902]
["2023-06-29","certificat","CV202306",764,{"$f":"'2023'!E14","v":0},125902]
["2023-06-30","certificat","CV202306",6485,{"$f":"'2023'!E15","v":0}]
["2023-07-01",null,"CV202306",0,{"$f":"'2023'!E16","v":0}]
["2023-07-02",null,"CV202306",0,{"$f":"'2023'!E17","v":0}]
["2023-07-03","certificat","CV202306",23815,{"$f":"'2023'!E18","v":0},125902]
["2023-07-04","certificat","CV202306",4215,{"$f":"'2023'!E19","v":852},125902]
["2023-07-05","certificat","CV202306",5208,{"$f":"'2023'!E20","v":2686},125902]
["2023-07-06","certificat","CV202306",4507,{"$f":"'2023'!E21","v":3024},125902]
["2023-07-07","certificat","CV202306",4457,{"$f":"'2023'!E22","v":2496},125902]
["2023-07-08",null,"CV202306",0,{"$f":"'2023'!E23","v":0}]
["2023-07-09",null,"CV202306",0,{"$f":"'2023'!E24","v":0}]
["2023-07-10","certificat","CV202306",7807,{"$f":"'2023'!E25","v":4226},125902]
["2023-07-11","certificat","CV202306",5604,{"$f":"'2023'!E26","v":4930},125902]
["2023-07-12","certificat","CV202306",4597,{"$f":"'2023'!E27","v":5028},125902]
["2023-07-13","certificat","CV202306",1578,{"$f":"'2023'!E28","v":4920},125902]
["2023-07-14","certificat","CV202306",0,{"$f":"'2023'!E29","v":0},125902]
["2023-07-15",null,"CV202306",0,{"$f":"'2023'!E30","v":0}]
["2023-07-16",null,"CV202306",0,{"$f":"'2023'!E31","v":0}]
["2023-07-17","certificat","CV202306",2420,{"$f":"'2023'!E32","v":4988},125902]
["2023-07-18","certificat","CV202306",824,{"$f":"'2023'!E33","v":6895},125902]
["2023-07-19","certificat","CV202306",828,{"$f":"'2023'!E34","v":5759},125902]
["2023-07-20","certificat","CV202306",887,{"$f":"'2023'!E35","v":6126},125902]
["2023-07-21","certificat","CV202306",824,{"$f":"'2023'!E36","v":4015},125902]
["2023-07-22",null,"CV202306",0,{"$f":"'2023'!E37","v":0}]
["2023-07-23",null,"CV202306",0,{"$f":"'2023'!E38","v":0}]
["2023-07-24","certificat","CV202306",2,{"$f":"'2023'!E39","v":6293},125902]
["2023-07-25","certificat","CV202306",2112,{"$f":"'2023'!E40","v":0},125902]
["2023-07-26","certificat","CV202306",349,{"$f":"'2023'!E41","v":0},125902]
["2023-07-27","certificat","CV202306",449,{"$f":"'2023'!E42","v":13266},125902]
["2023-07-28","certificat","CV202306",446,{"$f":"'2023'!E43","v":42},125902]
["2023-07-29","certificat","CV202306",0,{"$f":"'2023'!E44","v":0},125902]
["2023-07-30","certificat","CV202306",0,{"$f":"'2023'!E45","v":2836},125902]
{"$rows_left_out":551}