{"text_format":"1","workbook":"xlsx","n_sheets":3,"sheets":["Feuil1","Feuil2","Feuil3"],"not_rendered":{"charts":0,"images":0,"macros":1,"external_links":0,"defined_names":1,"comments":1,"pivot_tables":0},"unopened":[],"bounds":{"document_bytes":16777216,"sheet_cells":100000,"rows_first":2000,"rows_last":500,"rows_between":2000,"halvings":0,"cell_chars":16384,"cell_head_chars":4096},"cells_cut":0,"cells_raw":0,"read":"whole","date_system":"1900"}

{"sheet":"Feuil1","index":0,"n_rows":32,"n_cols":25,"rows_kept":32,"cut":false,"hidden":false,"merged":[[4,7,4,24],[3,2,3,24]]}
["2024-07-27",null,8,"1900-01-02"]
[]
[null,null,null,null,null,{"$f":"DATE(2024,C1+1,1)-1","v":45535}]
[null,null,"ICI J'AIMERAI QUE SOIT AFFICHE LE MOIS SELECTIONNE DANS LA LISTE (AB 3)"]
[null,null,null,null,null,null,null,"ici j'aimerai que se soit affiché automatiquement la date que j'ai choisi dans l'onglet (AB). Exemple Vendredi 26 juillet 2024 et si possible que le restatn de ma liste soit masquée. "]
[null,null,"type","date","horaire début","horaire fin","intérêt","08:00:00","09:00:00","10:00:00","11:00:00","12:00:00","13:00:00","14:00:00","15:00:00","16:00:00","17:00:00","18:00:00","19:00:00","20:00:00","21:00:00","22:00:00","23:00:00",1,1.0416666666666701]
[]
[null,null,{"$f":"IFERROR(INDEX(Feuil2!A:A,_xlfn.AGGREGATE(15,6,ROW($B$3:$B$12)/(Feuil2!$B$3:$B$12=$A$1),ROW(A1))),\"\")","v":"VOLLEY - H - TOUR PRÉLIMINAIRE"},{"$f":"IFERROR(INDEX(Feuil2!B:B,_xlfn.AGGREGATE(15,6,ROW($B$3:$B$12)/(Feuil2!$B$3:$B$12=$A$1),ROW(B1))),\"\")","v":"2024-07-27"},{"$f":"IFERROR(INDEX(Feuil2!C:C,_xlfn.AGGREGATE(15,6,ROW($B$3:$B$12)/(Feuil2!$B$3:$B$12=$A$1),ROW(C1))),\"\")","v":"13:00:00"},{"$f":"IFERROR(INDEX(Feuil2!D:D,_xlfn.AGGREGATE(15,6,ROW($B$3:$B$12)/(Feuil2!$B$3:$B$12=$A$1),ROW(D1))),\"\")","v":"15:30:00"}]
[null,null,{"$f":"IFERROR(INDEX(Feuil2!A:A,_xlfn.AGGREGATE(15,6,ROW($B$3:$B$12)/(Feuil2!$B$3:$B$12=$A$1),ROW(A2))),\"\")","v":"JUDO - H/F -48KG -60KG - REPECHAGE, DEMI-FINALES, BRONZE, FINALE "},{"$f":"IFERROR(INDEX(Feuil2!B:B,_xlfn.AGGREGATE(15,6,ROW($B$3:$B$12)/(Feuil2!$B$3:$B$12=$A$1),ROW(B2))),\"\")","v":"2024-07-27"},{"$f":"IFERROR(INDEX(Feuil2!C:C,_xlfn.AGGREGATE(15,6,ROW($B$3:$B$12)/(Feuil2!$B$3:$B$12=$A$1),ROW(C2))),\"\")","v":"16:00:00"},{"$f":"IFERROR(INDEX(Feuil2!D:D,_xlfn.AGGREGATE(15,6,ROW($B$3:$B$12)/(Feuil2!$B$3:$B$12=$A$1),ROW(D2))),\"\")","v":"19:00:00"}]
[null,null,{"$f":"IFERROR(INDEX(Feuil2!A:A,_xlfn.AGGREGATE(15,6,ROW($B$3:$B$12)/(Feuil2!$B$3:$B$12=$A$1),ROW(A3))),\"\")","v":"SKATEBOARD - H - STREET FINAL -"},{"$f":"IFERROR(INDEX(Feuil2!B:B,_xlfn.AGGREGATE(15,6,ROW($B$3:$B$12)/(Feuil2!$B$3:$B$12=$A$1),ROW(B3))),\"\")","v":"2024-07-27"},{"$f":"IFERROR(INDEX(Feuil2!C:C,_xlfn.AGGREGATE(15,6,ROW($B$3:$B$12)/(Feuil2!$B$3:$B$12=$A$1),ROW(C3))),\"\")","v":"17:00:00"},{"$f":"IFERROR(INDEX(Feuil2!D:D,_xlfn.AGGREGATE(15,6,ROW($B$3:$B$12)/(Feuil2!$B$3:$B$12=$A$1),ROW(D3))),\"\")","v":"19:00:00"}]
[null,null,{"$f":"IFERROR(INDEX(Feuil2!A:A,_xlfn.AGGREGATE(15,6,ROW($B$3:$B$12)/(Feuil2!$B$3:$B$12=$A$1),ROW(A4))),\"\")","v":"ESCRIME - H/F - DEMI-FINALES, BRONZE & FINALE -"},{"$f":"IFERROR(INDEX(Feuil2!B:B,_xlfn.AGGREGATE(15,6,ROW($B$3:$B$12)/(Feuil2!$B$3:$B$12=$A$1),ROW(B4))),\"\")","v":"2024-07-27"},{"$f":"IFERROR(INDEX(Feuil2!C:C,_xlfn.AGGREGATE(15,6,ROW($B$3:$B$12)/(Feuil2!$B$3:$B$12=$A$1),ROW(C4))),\"\")","v":"19:00:00"},{"$f":"IFERROR(INDEX(Feuil2!D:D,_xlfn.AGGREGATE(15,6,ROW($B$3:$B$12)/(Feuil2!$B$3:$B$12=$A$1),ROW(D4))),\"\")","v":"22:50:00"}]
[null,null,{"$f":"IFERROR(INDEX(Feuil2!A:A,_xlfn.AGGREGATE(15,6,ROW($B$3:$B$12)/(Feuil2!$B$3:$B$12=$A$1),ROW(A5))),\"\")","v":"NATATION -  H/F 400M, 4X100M NAGE LIBRE - DEMI-FINALES & FINALES "},{"$f":"IFERROR(INDEX(Feuil2!B:B,_xlfn.AGGREGATE(15,6,ROW($B$3:$B$12)/(Feuil2!$B$3:$B$12=$A$1),ROW(B5))),\"\")","v":"2024-07-27"},{"$f":"IFERROR(INDEX(Feuil2!C:C,_xlfn.AGGREGATE(15,6,ROW($B$3:$B$12)/(Feuil2!$B$3:$B$12=$A$1),ROW(C5))),\"\")","v":"20:30:00"},{"$f":"IFERROR(INDEX(Feuil2!D:D,_xlfn.AGGREGATE(15,6,ROW($B$3:$B$12)/(Feuil2!$B$3:$B$12=$A$1),ROW(D5))),\"\")","v":"22:30:00"}]
[null,null,{"$f":"IFERROR(INDEX(Feuil2!A:A,_xlfn.AGGREGATE(15,6,ROW($B$3:$B$12)/(Feuil2!$B$3:$B$12=$A$1),ROW(A6))),\"\")","v":"BEACH VOLLEY - H/F - PHASE PRÉLIMINAIRE"},{"$f":"IFERROR(INDEX(Feuil2!B:B,_xlfn.AGGREGATE(15,6,ROW($B$3:$B$12)/(Feuil2!$B$3:$B$12=$A$1),ROW(B6))),\"\")","v":"2024-07-27"},{"$f":"IFERROR(INDEX(Feuil2!C:C,_xlfn.AGGREGATE(15,6,ROW($B$3:$B$12)/(Feuil2!$B$3:$B$12=$A$1),ROW(C6))),\"\")","v":"14:00:00"},{"$f":"IFERROR(INDEX(Feuil2!D:D,_xlfn.AGGREGATE(15,6,ROW($B$3:$B$12)/(Feuil2!$B$3:$B$12=$A$1),ROW(D6))),\"\")","v":"16:00:00"}]
[null,null,{"$f":"IFERROR(INDEX(Feuil2!A:A,_xlfn.AGGREGATE(15,6,ROW($B$3:$B$12)/(Feuil2!$B$3:$B$12=$A$1),ROW(A7))),\"\")","v":"RUGBY À 7 - H - MATCHES DE CLASSEMENT, DEMI-FINALES, BRONZE & FINALE"},{"$f":"IFERROR(INDEX(Feuil2!B:B,_xlfn.AGGREGATE(15,6,ROW($B$3:$B$12)/(Feuil2!$B$3:$B$12=$A$1),ROW(B7))),\"\")","v":"2024-07-27"},{"$f":"IFERROR(INDEX(Feuil2!C:C,_xlfn.AGGREGATE(15,6,ROW($B$3:$B$12)/(Feuil2!$B$3:$B$12=$A$1),ROW(C7))),\"\")","v":"14:30:00"},{"$f":"IFERROR(INDEX(Feuil2!D:D,_xlfn.AGGREGATE(15,6,ROW($B$3:$B$12)/(Feuil2!$B$3:$B$12=$A$1),ROW(D7))),\"\")","v":"20:45:00"}]
[null,null,{"$f":"IFERROR(INDEX(Feuil2!A:A,_xlfn.AGGREGATE(15,6,ROW($B$3:$B$12)/(Feuil2!$B$3:$B$12=$A$1),ROW(A8))),\"\")","v":"PLONGEON - F - TREMPLIN 3M"},{"$f":"IFERROR(INDEX(Feuil2!B:B,_xlfn.AGGREGATE(15,6,ROW($B$3:$B$12)/(Feuil2!$B$3:$B$12=$A$1),ROW(B8))),\"\")","v":"2024-07-27"},{"$f":"IFERROR(INDEX(Feuil2!C:C,_xlfn.AGGREGATE(15,6,ROW($B$3:$B$12)/(Feuil2!$B$3:$B$12=$A$1),ROW(C8))),\"\")","v":"11:00:00"},{"$f":"IFERROR(INDEX(Feuil2!D:D,_xlfn.AGGREGATE(15,6,ROW($B$3:$B$12)/(Feuil2!$B$3:$B$12=$A$1),ROW(D8))),\"\")","v":"20:00:00"}]
[null,null,{"$f":"IFERROR(INDEX(Feuil2!A:A,_xlfn.AGGREGATE(15,6,ROW($B$3:$B$12)/(Feuil2!$B$3:$B$12=$A$1),ROW(A9))),\"\")","v":"RUGBY - H - PLACEMENT, DEMI ET FINALE"},{"$f":"IFERROR(INDEX(Feuil2!B:B,_xlfn.AGGREGATE(15,6,ROW($B$3:$B$12)/(Feuil2!$B$3:$B$12=$A$1),ROW(B9))),\"\")","v":"2024-07-27"},{"$f":"IFERROR(INDEX(Feuil2!C:C,_xlfn.AGGREGATE(15,6,ROW($B$3:$B$12)/(Feuil2!$B$3:$B$12=$A$1),ROW(C9))),\"\")","v":"14:30:00"},{"$f":"IFERROR(INDEX(Feuil2!D:D,_xlfn.AGGREGATE(15,6,ROW($B$3:$B$12)/(Feuil2!$B$3:$B$12=$A$1),ROW(D9))),\"\")","v":"20:45:00"}]
[null,null,{"$f":"IFERROR(INDEX(Feuil2!A:A,_xlfn.AGGREGATE(15,6,ROW($B$3:$B$12)/(Feuil2!$B$3:$B$12=$A$1),ROW(A10))),\"\")","v":""},{"$f":"IFERROR(INDEX(Feuil2!B:B,_xlfn.AGGREGATE(15,6,ROW($B$3:$B$12)/(Feuil2!$B$3:$B$12=$A$1),ROW(B10))),\"\")","v":""},{"$f":"IFERROR(INDEX(Feuil2!C:C,_xlfn.AGGREGATE(15,6,ROW($B$3:$B$12)/(Feuil2!$B$3:$B$12=$A$1),ROW(C10))),\"\")","v":""},{"$f":"IFERROR(INDEX(Feuil2!D:D,_xlfn.AGGREGATE(15,6,ROW($B$3:$B$12)/(Feuil2!$B$3:$B$12=$A$1),ROW(D10))),\"\")","v":""}]
[null,null,{"$f":"IFERROR(INDEX(Feuil2!A:A,_xlfn.AGGREGATE(15,6,ROW($B$3:$B$12)/(Feuil2!$B$3:$B$12=$A$1),ROW(A11))),\"\")","v":""},{"$f":"IFERROR(INDEX(Feuil2!B:B,_xlfn.AGGREGATE(15,6,ROW($B$3:$B$12)/(Feuil2!$B$3:$B$12=$A$1),ROW(B11))),\"\")","v":""},{"$f":"IFERROR(INDEX(Feuil2!C:C,_xlfn.AGGREGATE(15,6,ROW($B$3:$B$12)/(Feuil2!$B$3:$B$12=$A$1),ROW(C11))),\"\")","v":""},{"$f":"IFERROR(INDEX(Feuil2!D:D,_xlfn.AGGREGATE(15,6,ROW($B$3:$B$12)/(Feuil2!$B$3:$B$12=$A$1),ROW(D11))),\"\")","v":""}]
[null,null,{"$f":"IFERROR(INDEX(Feuil2!A:A,_xlfn.AGGREGATE(15,6,ROW($B$3:$B$12)/(Feuil2!$B$3:$B$12=$A$1),ROW(A12))),\"\")","v":""},{"$f":"IFERROR(INDEX(Feuil2!B:B,_xlfn.AGGREGATE(15,6,ROW($B$3:$B$12)/(Feuil2!$B$3:$B$12=$A$1),ROW(B12))),\"\")","v":""},{"$f":"IFERROR(INDEX(Feuil2!C:C,_xlfn.AGGREGATE(15,6,ROW($B$3:$B$12)/(Feuil2!$B$3:$B$12=$A$1),ROW(C12))),\"\")","v":""},{"$f":"IFERROR(INDEX(Feuil2!D:D,_xlfn.AGGREGATE(15,6,ROW($B$3:$B$12)/(Feuil2!$B$3:$B$12=$A$1),ROW(D12))),\"\")","v":""}]
[null,null,{"$f":"IFERROR(INDEX(Feuil2!A:A,_xlfn.AGGREGATE(15,6,ROW($B$3:$B$12)/(Feuil2!$B$3:$B$12=$A$1),ROW(A13))),\"\")","v":""},{"$f":"IFERROR(INDEX(Feuil2!B:B,_xlfn.AGGREGATE(15,6,ROW($B$3:$B$12)/(Feuil2!$B$3:$B$12=$A$1),ROW(B13))),\"\")","v":""},{"$f":"IFERROR(INDEX(Feuil2!C:C,_xlfn.AGGREGATE(15,6,ROW($B$3:$B$12)/(Feuil2!$B$3:$B$12=$A$1),ROW(C13))),\"\")","v":""},{"$f":"IFERROR(INDEX(Feuil2!D:D,_xlfn.AGGREGATE(15,6,ROW($B$3:$B$12)/(Feuil2!$B$3:$B$12=$A$1),ROW(D13))),\"\")","v":""}]
[null,null,{"$f":"IFERROR(INDEX(Feuil2!A:A,_xlfn.AGGREGATE(15,6,ROW($B$3:$B$12)/(Feuil2!$B$3:$B$12=$A$1),ROW(A14))),\"\")","v":""},{"$f":"IFERROR(INDEX(Feuil2!B:B,_xlfn.AGGREGATE(15,6,ROW($B$3:$B$12)/(Feuil2!$B$3:$B$12=$A$1),ROW(B14))),\"\")","v":""},{"$f":"IFERROR(INDEX(Feuil2!C:C,_xlfn.AGGREGATE(15,6,ROW($B$3:$B$12)/(Feuil2!$B$3:$B$12=$A$1),ROW(C14))),\"\")","v":""},{"$f":"IFERROR(INDEX(Feuil2!D:D,_xlfn.AGGREGATE(15,6,ROW($B$3:$B$12)/(Feuil2!$B$3:$B$12=$A$1),ROW(D14))),\"\")","v":""}]
[null,null,{"$f":"IFERROR(INDEX(Feuil2!A:A,_xlfn.AGGREGATE(15,6,ROW($B$3:$B$12)/(Feuil2!$B$3:$B$12=$A$1),ROW(A15))),\"\")","v":""},{"$f":"IFERROR(INDEX(Feuil2!B:B,_xlfn.AGGREGATE(15,6,ROW($B$3:$B$12)/(Feuil2!$B$3:$B$12=$A$1),ROW(B15))),\"\")","v":""},{"$f":"IFERROR(INDEX(Feuil2!C:C,_xlfn.AGGREGATE(15,6,ROW($B$3:$B$12)/(Feuil2!$B$3:$B$12=$A$1),ROW(C15))),\"\")","v":""},{"$f":"IFERROR(INDEX(Feuil2!D:D,_xlfn.AGGREGATE(15,6,ROW($B$3:$B$12)/(Feuil2!$B$3:$B$12=$A$1),ROW(D15))),\"\")","v":""}]
[null,null,{"$f":"IFERROR(INDEX(Feuil2!A:A,_xlfn.AGGREGATE(15,6,ROW($B$3:$B$12)/(Feuil2!$B$3:$B$12=$A$1),ROW(A16))),\"\")","v":""},{"$f":"IFERROR(INDEX(Feuil2!B:B,_xlfn.AGGREGATE(15,6,ROW($B$3:$B$12)/(Feuil2!$B$3:$B$12=$A$1),ROW(B16))),\"\")","v":""},{"$f":"IFERROR(INDEX(Feuil2!C:C,_xlfn.AGGREGATE(15,6,ROW($B$3:$B$12)/(Feuil2!$B$3:$B$12=$A$1),ROW(C16))),\"\")","v":""},{"$f":"IFERROR(INDEX(Feuil2!D:D,_xlfn.AGGREGATE(15,6,ROW($B$3:$B$12)/(Feuil2!$B$3:$B$12=$A$1),ROW(D16))),\"\")","v":""}]
[null,null,{"$f":"IFERROR(INDEX(Feuil2!A:A,_xlfn.AGGREGATE(15,6,ROW($B$3:$B$12)/(Feuil2!$B$3:$B$12=$A$1),ROW(A17))),\"\")","v":""},{"$f":"IFERROR(INDEX(Feuil2!B:B,_xlfn.AGGREGATE(15,6,ROW($B$3:$B$12)/(Feuil2!$B$3:$B$12=$A$1),ROW(B17))),\"\")","v":""},{"$f":"IFERROR(INDEX(Feuil2!C:C,_xlfn.AGGREGATE(15,6,ROW($B$3:$B$12)/(Feuil2!$B$3:$B$12=$A$1),ROW(C17))),\"\")","v":""},{"$f":"IFERROR(INDEX(Feuil2!D:D,_xlfn.AGGREGATE(15,6,ROW($B$3:$B$12)/(Feuil2!$B$3:$B$12=$A$1),ROW(D17))),\"\")","v":""}]
[null,null,{"$f":"IFERROR(INDEX(Feuil2!A:A,_xlfn.AGGREGATE(15,6,ROW($B$3:$B$12)/(Feuil2!$B$3:$B$12=$A$1),ROW(A18))),\"\")","v":""},{"$f":"IFERROR(INDEX(Feuil2!B:B,_xlfn.AGGREGATE(15,6,ROW($B$3:$B$12)/(Feuil2!$B$3:$B$12=$A$1),ROW(B18))),\"\")","v":""},{"$f":"IFERROR(INDEX(Feuil2!C:C,_xlfn.AGGREGATE(15,6,ROW($B$3:$B$12)/(Feuil2!$B$3:$B$12=$A$1),ROW(C18))),\"\")","v":""},{"$f":"IFERROR(INDEX(Feuil2!D:D,_xlfn.AGGREGATE(15,6,ROW($B$3:$B$12)/(Feuil2!$B$3:$B$12=$A$1),ROW(D18))),\"\")","v":""}]
[null,null,{"$f":"IFERROR(INDEX(Feuil2!A:A,_xlfn.AGGREGATE(15,6,ROW($B$3:$B$12)/(Feuil2!$B$3:$B$12=$A$1),ROW(A19))),\"\")","v":""},{"$f":"IFERROR(INDEX(Feuil2!B:B,_xlfn.AGGREGATE(15,6,ROW($B$3:$B$12)/(Feuil2!$B$3:$B$12=$A$1),ROW(B19))),\"\")","v":""},{"$f":"IFERROR(INDEX(Feuil2!C:C,_xlfn.AGGREGATE(15,6,ROW($B$3:$B$12)/(Feuil2!$B$3:$B$12=$A$1),ROW(C19))),\"\")","v":""},{"$f":"IFERROR(INDEX(Feuil2!D:D,_xlfn.AGGREGATE(15,6,ROW($B$3:$B$12)/(Feuil2!$B$3:$B$12=$A$1),ROW(D19))),\"\")","v":""}]
[null,null,{"$f":"IFERROR(INDEX(Feuil2!A:A,_xlfn.AGGREGATE(15,6,ROW($B$3:$B$12)/(Feuil2!$B$3:$B$12=$A$1),ROW(A20))),\"\")","v":""}]
[null,null,{"$f":"IFERROR(INDEX(Feuil2!A:A,_xlfn.AGGREGATE(15,6,ROW($B$3:$B$12)/(Feuil2!$B$3:$B$12=$A$1),ROW(A21))),\"\")","v":""}]
[null,null,{"$f":"IFERROR(INDEX(Feuil2!A:A,_xlfn.AGGREGATE(15,6,ROW($B$3:$B$12)/(Feuil2!$B$3:$B$12=$A$1),ROW(A22))),\"\")","v":""}]
[null,null,{"$f":"IFERROR(INDEX(Feuil2!A:A,_xlfn.AGGREGATE(15,6,ROW($B$3:$B$12)/(Feuil2!$B$3:$B$12=$A$1),ROW(A23))),\"\")","v":""}]
[null,null,{"$f":"IFERROR(INDEX(Feuil2!A:A,_xlfn.AGGREGATE(15,6,ROW($B$3:$B$12)/(Feuil2!$B$3:$B$12=$A$1),ROW(A24))),\"\")","v":""}]
[null,null,{"$f":"IFERROR(INDEX(Feuil2!A:A,_xlfn.AGGREGATE(15,6,ROW($B$3:$B$12)/(Feuil2!$B$3:$B$12=$A$1),ROW(A25))),\"\")","v":""}]

{"sheet":"Feuil2","index":1,"n_rows":18,"n_cols":7,"rows_kept":18,"cut":false,"hidden":false,"merged":[]}
[null,null,null,null,null,null,"2024-07-26"]
["type","date","début","fin","intérêt",null,"2024-07-27"]
["cérémonie d'ouverture","2024-07-26","20:00:00","23:15:00","fort",null,"2024-07-28"]
["VOLLEY - H - TOUR PRÉLIMINAIRE","2024-07-27","13:00:00","15:30:00","fort",null,"2024-07-29"]
["JUDO - H/F -48KG -60KG - REPECHAGE, DEMI-FINALES, BRONZE, FINALE ","2024-07-27","16:00:00","19:00:00","fort",null,"2024-07-30"]
["SKATEBOARD - H - STREET FINAL -","2024-07-27","17:00:00","19:00:00","fort",null,"2024-07-31"]
["ESCRIME - H/F - DEMI-FINALES, BRONZE & FINALE -","2024-07-27","19:00:00","22:50:00","fort"]
["NATATION -  H/F 400M, 4X100M NAGE LIBRE - DEMI-FINALES & FINALES ","2024-07-27","20:30:00","22:30:00","fort",null,"2024-08-01"]
["BEACH VOLLEY - H/F - PHASE PRÉLIMINAIRE","2024-07-27","14:00:00","16:00:00","moyen",null,"2024-08-02"]
["RUGBY À 7 - H - MATCHES DE CLASSEMENT, DEMI-FINALES, BRONZE & FINALE","2024-07-27","14:30:00","20:45:00","moyen",null,"2024-08-03"]
["PLONGEON - F - TREMPLIN 3M","2024-07-27","11:00:00","20:00:00","moyen",null,"2024-08-04"]
["RUGBY - H - PLACEMENT, DEMI ET FINALE","2024-07-27","14:30:00","20:45:00","moyen",null,"2024-08-05"]
[null,null,null,null,null,null,"2024-08-06"]
[null,null,null,null,null,null,"2024-08-07"]
[null,null,null,null,null,null,"2024-08-08"]
[null,null,null,null,null,null,"2024-08-09"]
[null,null,null,null,null,null,"2024-08-10"]
[null,null,null,null,null,null,"2024-08-11"]

{"sheet":"Feuil3","index":2,"n_rows":0,"n_cols":0,"rows_kept":0,"cut":false,"hidden":false,"merged":[]}