{"text_format":"1","workbook":"xlsx","n_sheets":3,"sheets":["Feuil1","Feuil2","Feuil3"],"not_rendered":{"charts":0,"images":0,"macros":1,"external_links":0,"defined_names":1,"comments":1,"pivot_tables":0},"unopened":[],"bounds":{"document_bytes":16777216,"sheet_cells":100000,"rows_first":2000,"rows_last":500,"rows_between":2000,"halvings":0,"cell_chars":16384,"cell_head_chars":4096},"cells_cut":0,"cells_raw":0,"read":"whole","date_system":"1900"}

{"sheet":"Feuil1","index":0,"n_rows":15,"n_cols":25,"rows_kept":15,"cut":false,"hidden":false,"merged":[[4,7,4,24],[3,2,3,24]]}
["2024-07-26",null,8,2]
[]
[null,null,null,null,null,{"$f":"DATE(2024,C1+1,1)-1","v":"2024-08-31"}]
[null,null,"ICI J'AIMERAI QUE SOIT AFFICHE LE MOIS SELECTIONNE DANS LA LISTE (AB 3)"]
[null,null,null,null,null,null,null,"ici j'aimerai que se soit affiché automatiquement la date que j'ai choisi dans l'onglet (AB). Exemple Vendredi 26 juillet 2024 et si possible que le restatn de ma liste soit masquée. "]
[null,null,"type","date","horaire début","horaire fin","intérêt","08:00:00","09:00:00","10:00:00","11:00:00","12:00:00","13:00:00","14:00:00","15:00:00","16:00:00","17:00:00","18:00:00","19:00:00","20:00:00","21:00:00","22:00:00","23:00:00",1,1.0416666666666701]
[]
[null,null,"cérémonie d'ouverture","2024-07-26","20:00:00","23:15:00",{"$f":"VLOOKUP($C8,Feuil2!A2:E13,5,FALSE)","v":"fort"}]
[null,null,null,{"$f":"A1","v":"2024-07-26"},{"$f":"VLOOKUP($C9,Feuil2!A2:E17,3,FALSE)","v":{"$error":"#N/A"}},{"$f":"VLOOKUP($C9,Feuil2!B2:F17,4,FALSE)","v":{"$error":"#N/A"}},{"$f":"VLOOKUP($C9,Feuil2!A3:E14,5,FALSE)","v":{"$error":"#N/A"}}]
[null,null,null,null,{"$f":"VLOOKUP($C10,Feuil2!A3:E18,3,FALSE)","v":{"$error":"#N/A"}},{"$f":"VLOOKUP($C10,Feuil2!B3:F18,4,FALSE)","v":{"$error":"#N/A"}},{"$f":"VLOOKUP($C10,Feuil2!A4:E15,5,FALSE)","v":{"$error":"#N/A"}}]
[null,null,null,null,{"$f":"VLOOKUP($C11,Feuil2!A4:E19,3,FALSE)","v":{"$error":"#N/A"}},{"$f":"VLOOKUP($C11,Feuil2!B4:F19,4,FALSE)","v":{"$error":"#N/A"}},{"$f":"VLOOKUP($C11,Feuil2!A5:E16,5,FALSE)","v":{"$error":"#N/A"}}]
[null,null,null,null,{"$f":"VLOOKUP($C12,Feuil2!A5:E20,3,FALSE)","v":{"$error":"#N/A"}},{"$f":"VLOOKUP($C12,Feuil2!B5:F20,4,FALSE)","v":{"$error":"#N/A"}},{"$f":"VLOOKUP($C12,Feuil2!A6:E17,5,FALSE)","v":{"$error":"#N/A"}}]
[null,null,null,null,{"$f":"VLOOKUP($C13,Feuil2!A6:E21,3,FALSE)","v":{"$error":"#N/A"}},{"$f":"VLOOKUP($C13,Feuil2!B6:F21,4,FALSE)","v":{"$error":"#N/A"}},{"$f":"VLOOKUP($C13,Feuil2!A7:E18,5,FALSE)","v":{"$error":"#N/A"}}]
[null,null,null,null,{"$f":"VLOOKUP($C14,Feuil2!A7:E22,3,FALSE)","v":{"$error":"#N/A"}},{"$f":"VLOOKUP($C14,Feuil2!B7:F22,4,FALSE)","v":{"$error":"#N/A"}},{"$f":"VLOOKUP($C14,Feuil2!A8:E19,5,FALSE)","v":{"$error":"#N/A"}}]
[null,null,null,null,{"$f":"VLOOKUP($C15,Feuil2!A8:E23,3,FALSE)","v":{"$error":"#N/A"}},{"$f":"VLOOKUP($C15,Feuil2!B8:F23,4,FALSE)","v":{"$error":"#N/A"}},{"$f":"VLOOKUP($C15,Feuil2!A9:E20,5,FALSE)","v":{"$error":"#N/A"}}]

{"sheet":"Feuil2","index":1,"n_rows":18,"n_cols":7,"rows_kept":18,"cut":false,"hidden":false,"merged":[]}
[null,null,null,null,null,null,"2024-07-26"]
["type","date","début","fin","intérêt",null,"2024-07-27"]
["cérémonie d'ouverture","2024-07-26","20:00:00","23:15:00","fort",null,"2024-07-28"]
["VOLLEY - H - TOUR PRÉLIMINAIRE","2024-07-27","13:00:00","15:30:00","fort",null,"2024-07-29"]
["JUDO - H/F -48KG -60KG - REPECHAGE, DEMI-FINALES, BRONZE, FINALE ","2024-07-27","16:00:00","19:00:00","fort",null,"2024-07-30"]
["SKATEBOARD - H - STREET FINAL -","2024-07-27","17:00:00","19:00:00","fort",null,"2024-07-31"]
["ESCRIME - H/F - DEMI-FINALES, BRONZE & FINALE -","2024-07-27","19:00:00","22:50:00","fort"]
["NATATION -  H/F 400M, 4X100M NAGE LIBRE - DEMI-FINALES & FINALES ","2024-07-27","20:30:00","22:30:00","fort",null,"2024-08-01"]
["BEACH VOLLEY - H/F - PHASE PRÉLIMINAIRE","2024-07-27","14:00:00","16:00:00","moyen",null,"2024-08-02"]
["RUGBY À 7 - H - MATCHES DE CLASSEMENT, DEMI-FINALES, BRONZE & FINALE","2024-07-27","14:30:00","20:45:00","moyen",null,"2024-08-03"]
["PLONGEON - F - TREMPLIN 3M","2024-07-27","11:00:00","20:00:00","moyen",null,"2024-08-04"]
["RUGBY - H - PLACEMENT, DEMI ET FINALE","2024-07-27","14:30:00","20:45:00","moyen",null,"2024-08-05"]
[null,null,null,null,null,null,"2024-08-06"]
[null,null,null,null,null,null,"2024-08-07"]
[null,null,null,null,null,null,"2024-08-08"]
[null,null,null,null,null,null,"2024-08-09"]
[null,null,null,null,null,null,"2024-08-10"]
[null,null,null,null,null,null,"2024-08-11"]

{"sheet":"Feuil3","index":2,"n_rows":0,"n_cols":0,"rows_kept":0,"cut":false,"hidden":false,"merged":[]}