{"text_format":"1","workbook":"xlsx","n_sheets":4,"sheets":["Données masses","calcul  % u","calcul ","exploitation certificat"],"not_rendered":{"charts":3,"images":0,"macros":1,"external_links":0,"defined_names":29,"comments":3,"pivot_tables":0},"unopened":[],"bounds":{"document_bytes":16777216,"sheet_cells":100000,"rows_first":2000,"rows_last":500,"rows_between":2000,"halvings":0,"cell_chars":16384,"cell_head_chars":4096},"cells_cut":0,"cells_raw":0,"read":"whole","date_system":"1900"}

{"sheet":"Données masses","index":0,"n_rows":12,"n_cols":44,"rows_kept":12,"cut":false,"hidden":false,"merged":[[5,2,7,2]]}
[]
[null,"Masses",null,"1 mg","2 mg","2 mg","5 mg","10 mg","20 mg","20 mg","50 mg","100 mg","200 mg","200 mg","500 mg","1 g","2 g","2 g","5 g","10 g","20 g","20 g","50 g","100 g","200 g","200 g","500 g","1 kg","2 kg","2 kg",null,"40 mg","25 g","150 g","220 g","250 g","300 g","400 g","3 kg","3,1 kg","4 kg","4,5 kg"]
[null,"Masses g",null,1E-3,2E-3,2E-3,5.0000000000000001E-3,0.01,0.02,0.02,0.05,0.1,0.2,0.2,0.5,1,2,2,5,10,20,20,50,100,200,200,500,1000,2000,2000,null,0.04,25,150,220,250,300,400,3000,3100,4000,4500]
[null,"Identification zwiebel",null,"aucune","aucune","<","aucune","aucune","aucune","<","aucune","aucune","aucune","<","aucune","ZH98L","ZH51L","ZH52L","ZH73G","ZH70J","ZH87L","ZH88L","ZH44J","ZH54K","ZH89M","ZH90M","ZH40F","ZH37H","ZH26H","ZH59C",null,"néant","néant","néant","néant","néant","néant","néant","néant","néant","néant","néant"]
[null,"Identification kalilab",null,"A12-MER-0001","a12-MER-0001","A12-MER-0001","A12-MER-0001","A12-MER-0001","A12-MER-0001","A12-MER-0001","A12-MER-0001","A12-MER-0001","A12-MER-0001","A12-MER-0001","A12-MER-0001","A12-MER-0002","A12-MER-0002","A12-MER-0002","A12-MER-0002","A12-MER-0002","A12-MER-0002","A12-MER-0002","A12-MER-0002","A12-MER-0002","A12-MER-0002","A12-MER-0002","A12-MER-0002","A12-MER-0002","A12-MER-0002","A12-MER-0002",null,"association","association","association","association","association","association","association","association","association","association","association"]
[null,"Incertitude µg (k = 2 )","Certificat d'étalonnage :Z23 46410 et Z23 46411 du 21/11/2023",2,2,2,2,2.6,3,3,4,5,6,6,8,10,13,13,16,20,26,26,30,50,100,100,260,500,1000,1000,null,{"$f":"I6+J6","v":6},{"$f":"IF(AND(U9=\"oui\",OR(V9=\"non\",V9=\"doublon\")),U6+S6,IF(AND(V9=\"oui\",OR(U9=\"non\",U9=\"doublon\")),V6+S6,))","v":42},{"$f":"W6+X6","v":80},{"$f":"IF(AND(U9=\"oui\",OR(V9=\"non\",V9=\"doublon\"),Y9=\"oui\",OR(Z9=\"non\",Z9=\"doublon\")),U6+Y6,IF(AND(U9=\"oui\",OR(V9=\"non\",V9=\"doublon\"),Z9=\"oui\",OR(Y9=\"non\",Y9=\"doublon\")),U6+Z6,IF(AND(V9=\"oui\",OR(U9=\"non\",U9=\"doublon\"),Y9=\"oui\",OR(Z9=\"non\",Z9=\"doublon\")),V6+Y6,IF(AND(V9=\"oui\",OR(U9=\"non\",U9=\"doublon\"),Z9=\"oui\",OR(Y9=\"non\",Y9=\"doublon\")),V6+Z6,\"/!\\ ERREUR /!\\\"))))","v":126},{"$f":"IF(AND(Y9=\"oui\",OR(Z9=\"non\",Z9=\"doublon\")),Y6+W6,IF(AND(Z9=\"oui\",OR(Y9=\"non\",Y9=\"doublon\")),Z6+W6,))","v":130},{"$f":"IF(AND(Y9=\"oui\",OR(Z9=\"non\",Z9=\"doublon\")),Y6+X6,IF(AND(Z9=\"oui\",OR(Y9=\"non\",Y9=\"doublon\")),Z6+X6,))","v":150},{"$f":"Y6+Z6","v":200},{"$f":"IF(AND(AC9=\"oui\",OR(AD9=\"non\",AD9=\"doublon\")),AC6+AB6,IF(AND(AD9=\"oui\",OR(AC9=\"non\",AC9=\"doublon\")),AD6+AB6,))","v":1500},{"$f":"IF(AND(AC9=\"oui\",OR(AD9=\"non\",AD9=\"doublon\")),AC6+AB6+X6,IF(AND(AD9=\"oui\",OR(AC9=\"non\",AC9=\"doublon\")),AD6+AB6+X6,))","v":1550},{"$f":"AC6+AD6","v":2000},{"$f":"AC6+AD6+AA6","v":2260}]
[null,"Dérive µg",null,{"$f":"IF(ISBLANK(INDIRECT(\"D15\")),INDIRECT(\"D6\"),\"calcul dérive\")","v":2},{"$f":"IF(ISBLANK(INDIRECT(\"E15\")),INDIRECT(\"E6\"),\"calcul dérive\")","v":2},{"$f":"IF(ISBLANK(INDIRECT(\"F15\")),INDIRECT(\"F6\"),\"calcul dérive\")","v":2},{"$f":"IF(ISBLANK(INDIRECT(\"G15\")),INDIRECT(\"G6\"),\"calcul dérive\")","v":2},{"$f":"IF(ISBLANK(INDIRECT(\"H15\")),INDIRECT(\"H6\"),\"calcul dérive\")","v":2.6},{"$f":"IF(ISBLANK(INDIRECT(\"I15\")),INDIRECT(\"I6\"),\"calcul dérive\")","v":3},{"$f":"IF(ISBLANK(INDIRECT(\"J15\")),INDIRECT(\"J6\"),\"calcul dérive\")","v":3},{"$f":"IF(ISBLANK(INDIRECT(\"K15\")),INDIRECT(\"K6\"),\"calcul dérive\")","v":4},{"$f":"IF(ISBLANK(INDIRECT(\"L15\")),INDIRECT(\"L6\"),\"calcul dérive\")","v":5},{"$f":"IF(ISBLANK(INDIRECT(\"M15\")),INDIRECT(\"M6\"),\"calcul dérive\")","v":6},{"$f":"IF(ISBLANK(INDIRECT(\"N15\")),INDIRECT(\"N6\"),\"calcul dérive\")","v":6},{"$f":"IF(ISBLANK(INDIRECT(\"O15\")),INDIRECT(\"O6\"),\"calcul dérive\")","v":8},{"$f":"IF(ISBLANK(INDIRECT(\"P15\")),INDIRECT(\"P6\"),\"calcul dérive\")","v":10},{"$f":"IF(ISBLANK(INDIRECT(\"Q15\")),INDIRECT(\"Q6\"),\"calcul dérive\")","v":13},{"$f":"IF(ISBLANK(INDIRECT(\"R15\")),INDIRECT(\"R6\"),\"calcul dérive\")","v":13},{"$f":"IF(ISBLANK(INDIRECT(\"S15\")),INDIRECT(\"S6\"),\"calcul dérive\")","v":16},{"$f":"IF(ISBLANK(INDIRECT(\"T15\")),INDIRECT(\"T6\"),\"calcul dérive\")","v":20},{"$f":"IF(ISBLANK(INDIRECT(\"U15\")),INDIRECT(\"U6\"),\"calcul dérive\")","v":26},{"$f":"IF(ISBLANK(INDIRECT(\"V15\")),INDIRECT(\"V6\"),\"calcul dérive\")","v":26},{"$f":"IF(ISBLANK(INDIRECT(\"W15\")),INDIRECT(\"W6\"),\"calcul dérive\")","v":30},{"$f":"IF(ISBLANK(INDIRECT(\"X15\")),INDIRECT(\"X6\"),\"calcul dérive\")","v":50},{"$f":"IF(ISBLANK(INDIRECT(\"Y15\")),INDIRECT(\"Y6\"),\"calcul dérive\")","v":100},{"$f":"IF(ISBLANK(INDIRECT(\"Z15\")),INDIRECT(\"Z6\"),\"calcul dérive\")","v":100},{"$f":"IF(ISBLANK(INDIRECT(\"AA15\")),INDIRECT(\"AA6\"),\"calcul dérive\")","v":260},{"$f":"IF(ISBLANK(INDIRECT(\"AB15\")),INDIRECT(\"AB6\"),\"calcul dérive\")","v":500},{"$f":"IF(ISBLANK(INDIRECT(\"AC15\")),INDIRECT(\"AC6\"),\"calcul dérive\")","v":1000},{"$f":"IF(ISBLANK(INDIRECT(\"AD15\")),INDIRECT(\"AD6\"),\"calcul dérive\")","v":1000},null,{"$f":"I7+J7","v":6},{"$f":"IF(AND(U9=\"oui\",OR(V9=\"non\",V9=\"doublon\")),U7+S7,IF(AND(V9=\"oui\",OR(U9=\"non\",U9=\"doublon\")),V7+S7,))","v":42},{"$f":"W7+X7","v":80},{"$f":"IF(AND(U9=\"oui\",OR(V9=\"non\",V9=\"doublon\"),Y9=\"oui\",OR(Z9=\"non\",Z9=\"doublon\")),U7+Y7,IF(AND(U9=\"oui\",OR(V9=\"non\",V9=\"doublon\"),Z9=\"oui\",OR(Y9=\"non\",Y9=\"doublon\")),U7+Z7,IF(AND(V9=\"oui\",OR(U9=\"non\",U9=\"doublon\"),Y9=\"oui\",OR(Z9=\"non\",Z9=\"doublon\")),V7+Y7,IF(AND(V9=\"oui\",OR(U9=\"non\",U9=\"doublon\"),Z9=\"oui\",OR(Y9=\"non\",Y9=\"doublon\")),V7+Z7,\"/!\\ ERREUR /!\\\"))))","v":126},{"$f":"IF(AND(Y9=\"oui\",OR(Z9=\"non\",Z9=\"doublon\")),Y7+W7,IF(AND(Z9=\"oui\",OR(Y9=\"non\",Y9=\"doublon\")),Z7+W7,))","v":130},{"$f":"IF(AND(Y9=\"oui\",OR(Z9=\"non\",Z9=\"doublon\")),Y7+X7,IF(AND(Z9=\"oui\",OR(Y9=\"non\",Y9=\"doublon\")),Z7+X7,))","v":150},{"$f":"Y7+Z7","v":200},{"$f":"IF(AND(AC9=\"oui\",OR(AD9=\"non\",AD9=\"doublon\")),AC7+AB7,IF(AND(AD9=\"oui\",OR(AC9=\"non\",AC9=\"doublon\")),AD7+AB7,))","v":1500},{"$f":"IF(AND(AC9=\"oui\",OR(AD9=\"non\",AD9=\"doublon\")),AC7+AB7+X7,IF(AND(AD9=\"oui\",OR(AC9=\"non\",AC9=\"doublon\")),AD7+AB7+X7,))","v":1550},{"$f":"AC7+AD7","v":2000},{"$f":"AC7+AD7+AA7","v":2260}]
[null,"Valeur vrai g",null,1.0023E-3,24,18,5.0029999999999996E-3,1.0001599999999999E-2,1.9999900000000001E-2,1.9999200000000002E-2,5.00052E-2,0.10000299999999999,0.20000409999999999,0.2000025,0.50000900000000004,1,2.0000089999999999,2.0000079999999998,4.9999960000000003,10.000003,20.000018000000001,20.000022000000001,50.000019000000002,100.000015,200.00007400000001,200.00004300000001,499.99993999999998,1000.00069,2000.0001999999999,1999.9985999999999,null,{"$f":"I8+J8","v":3.9999100000000003E-2},{"$f":"IF(AND(U9=\"oui\",OR(V9=\"non\",V9=\"doublon\")),U8+S8,IF(AND(V9=\"oui\",OR(U9=\"non\",U9=\"doublon\")),V8+S8,\"/!\\ ERREUR /!\\ \"))","v":25.000014},{"$f":"W8+X8","v":150.000034},{"$f":"IF(AND(U9=\"oui\",OR(V9=\"non\",V9=\"doublon\"),Y9=\"oui\",OR(Z9=\"non\",Z9=\"doublon\")),U8+Y8,IF(AND(U9=\"oui\",OR(V9=\"non\",V9=\"doublon\"),Z9=\"oui\",OR(Y9=\"non\",Y9=\"doublon\")),U8+Z8,IF(AND(V9=\"oui\",OR(U9=\"non\",U9=\"doublon\"),Y9=\"oui\",OR(Z9=\"non\",Z9=\"doublon\")),V8+Y8,IF(AND(V9=\"oui\",OR(U9=\"non\",U9=\"doublon\"),Z9=\"oui\",OR(Y9=\"non\",Y9=\"doublon\")),V8+Z8,\"/!\\ ERREUR /!\\\"))))","v":220.00006100000002},{"$f":"IF(AND(Y9=\"oui\",OR(Z9=\"non\",Z9=\"doublon\")),Y8+W8,IF(AND(Z9=\"oui\",OR(Y9=\"non\",Y9=\"doublon\")),Z8+W8,))","v":250.00006200000001},{"$f":"IF(AND(Y9=\"oui\",OR(Z9=\"non\",Z9=\"doublon\")),Y8+X8,IF(AND(Z9=\"oui\",OR(Y9=\"non\",Y9=\"doublon\")),Z8+X8,))","v":300.00005800000002},{"$f":"Y8+Z8","v":400.00011700000005},{"$f":"IF(AND(AC9=\"oui\",OR(AD9=\"non\",AD9=\"doublon\")),AC8+AB8,IF(AND(AD9=\"oui\",OR(AC9=\"non\",AC9=\"doublon\")),AD8+AB8,))","v":2999.9992899999997},{"$f":"IF(AND(AC9=\"oui\",OR(AD9=\"non\",AD9=\"doublon\")),AC8+AB8+X8,IF(AND(AD9=\"oui\",OR(AC9=\"non\",AC9=\"doublon\")),AD8+AB8+X8,))","v":3099.9993049999998},{"$f":"AC8+AD8","v":3999.9987999999998},4499.99874]
[null,"Utilisation (oui/non/doublon)",null,"oui","non","oui","oui","oui","oui","non","oui","oui","oui","non","oui","oui","doublon","oui","oui","oui","oui","non","oui","oui","non","oui","oui",null,"non","oui",null,"association","association","association","association","association","association","association","association","association","association","association"]
[null,"incertitude g",null,{"$f":"(INDIRECT(\"D6\")/2)/1000000","v":9.9999999999999995E-7},{"$f":"(INDIRECT(\"E6\")/2)/1000000","v":9.9999999999999995E-7},{"$f":"(INDIRECT(\"F6\")/2)/1000000","v":9.9999999999999995E-7},{"$f":"(INDIRECT(\"G6\")/2)/1000000","v":9.9999999999999995E-7},{"$f":"(INDIRECT(\"H6\")/2)/1000000","v":1.3E-6},{"$f":"(INDIRECT(\"I6\")/2)/1000000","v":1.5E-6},{"$f":"(INDIRECT(\"J6\")/2)/1000000","v":1.5E-6},{"$f":"(INDIRECT(\"K6\")/2)/1000000","v":1.9999999999999999E-6},{"$f":"(INDIRECT(\"L6\")/2)/1000000","v":2.5000000000000002E-6},{"$f":"(INDIRECT(\"M6\")/2)/1000000","v":3.0000000000000001E-6},{"$f":"(INDIRECT(\"N6\")/2)/1000000","v":3.0000000000000001E-6},{"$f":"(INDIRECT(\"O6\")/2)/1000000","v":3.9999999999999998E-6},{"$f":"(INDIRECT(\"P6\")/2)/1000000","v":5.0000000000000004E-6},{"$f":"(INDIRECT(\"Q6\")/2)/1000000","v":6.4999999999999996E-6},{"$f":"(INDIRECT(\"R6\")/2)/1000000","v":6.4999999999999996E-6},{"$f":"(INDIRECT(\"S6\")/2)/1000000","v":7.9999999999999996E-6},{"$f":"(INDIRECT(\"T6\")/2)/1000000","v":1.0000000000000001E-5},{"$f":"(INDIRECT(\"U6\")/2)/1000000","v":1.2999999999999999E-5},{"$f":"(INDIRECT(\"V6\")/2)/1000000","v":1.2999999999999999E-5},{"$f":"(INDIRECT(\"W6\")/2)/1000000","v":1.5E-5},{"$f":"(INDIRECT(\"X6\")/2)/1000000","v":2.5000000000000001E-5},{"$f":"(INDIRECT(\"Y6\")/2)/1000000","v":5.0000000000000002E-5},{"$f":"(INDIRECT(\"Z6\")/2)/1000000","v":5.0000000000000002E-5},{"$f":"(INDIRECT(\"AA6\")/2)/1000000","v":1.2999999999999999E-4},{"$f":"(INDIRECT(\"AB6\")/2)/1000000","v":2.5000000000000001E-4},{"$f":"(INDIRECT(\"AC6\")/2)/1000000","v":5.0000000000000001E-4},{"$f":"(INDIRECT(\"AD6\")/2)/1000000","v":5.0000000000000001E-4},null,{"$f":"(INDIRECT(\"Af6\")/2)/1000000","v":3.0000000000000001E-6},{"$f":"(INDIRECT(\"Ag6\")/2)/1000000","v":2.0999999999999999E-5},{"$f":"(INDIRECT(\"Ah6\")/2)/1000000","v":4.0000000000000003E-5},{"$f":"(INDIRECT(\"Ai6\")/2)/1000000","v":6.3E-5},{"$f":"(INDIRECT(\"Aj6\")/2)/1000000","v":6.4999999999999994E-5},{"$f":"(INDIRECT(\"Ak6\")/2)/1000000","v":7.4999999999999993E-5},{"$f":"(INDIRECT(\"Al6\")/2)/1000000","v":1E-4},{"$f":"(INDIRECT(\"Am6\")/2)/1000000","v":7.5000000000000002E-4},{"$f":"(INDIRECT(\"An6\")/2)/1000000","v":7.7499999999999997E-4},{"$f":"(INDIRECT(\"Ao6\")/2)/1000000","v":1E-3},{"$f":"(INDIRECT(\"Ap6\")/2)/1000000","v":1.1299999999999999E-3},null,"oui"]
[null,"Dérive g",null,{"$f":"(D7/2)/(1*10^6)","v":9.9999999999999995E-7},9.9999999999999995E-7,9.9999999999999995E-7,9.9999999999999995E-7,1.3E-6,1.5E-6,1.5E-6,1.9999999999999999E-6,2.5000000000000002E-6,3.0000000000000001E-6,3.0000000000000001E-6,3.9999999999999998E-6,5.0000000000000004E-6,6.4999999999999996E-6,6.4999999999999996E-6,7.9999999999999996E-6,1.0000000000000001E-5,1.2999999999999999E-5,1.2999999999999999E-5,1.5E-5,2.5000000000000001E-5,5.0000000000000002E-5,5.0000000000000002E-5,1.2999999999999999E-4,2.5000000000000001E-4,5.0000000000000001E-4,{"$f":"(AD7/2)/(1*10^6)","v":5.0000000000000001E-4},null,{"$f":"(AF7/2)/(1*10^6)","v":3.0000000000000001E-6},2.0999999999999999E-5,4.0000000000000003E-5,6.3E-5,6.4999999999999994E-5,7.4999999999999993E-5,1E-4,7.5000000000000002E-4,7.7499999999999997E-4,1E-3,1.1299999999999999E-3,null,"non"]
[null,"Incertitude conposée de la masse (g)",null,{"$f":"SQRT(D10*D10+D11*D11)","v":1.4142135623730949E-6},{"$f":"SQRT(E10*E10+E11*E11)","v":1.4142135623730949E-6},1.4142135623730949E-6,1.4142135623730949E-6,1.8384776310850236E-6,2.1213203435596428E-6,2.1213203435596428E-6,2.8284271247461899E-6,3.5355339059327378E-6,4.2426406871192857E-6,4.2426406871192857E-6,5.6568542494923798E-6,7.0710678118654756E-6,9.1923881554251171E-6,9.1923881554251171E-6,1.131370849898476E-5,1.4142135623730951E-5,1.8384776310850234E-5,1.8384776310850234E-5,2.1213203435596424E-5,3.5355339059327377E-5,7.0710678118654754E-5,7.0710678118654754E-5,1.8384776310850234E-4,3.5355339059327376E-4,7.0710678118654751E-4,7.0710678118654751E-4,null,{"$f":"SQRT(AF10*AF10+AF11*AF11)","v":4.2426406871192857E-6},{"$f":"SQRT(AG10*AG10+AG11*AG11)","v":2.9698484809834994E-5},{"$f":"SQRT(AH10*AH10+AH11*AH11)","v":5.6568542494923805E-5},8.9095454429504985E-5,9.1923881554251168E-5,1.0606601717798212E-4,1.4142135623730951E-4,1.0606601717798212E-3,1.0960155108391486E-3,1.414213562373095E-3,1.5980613254815972E-3,null,"doublon"]

{"sheet":"calcul  % u","index":1,"n_rows":26,"n_cols":17,"rows_kept":26,"cut":false,"hidden":false,"merged":[[3,1,4,1],[3,2,3,3],[3,4,3,16],[4,2,4,3],[5,1,9,1],[5,2,5,3],[6,2,6,3],[7,2,7,3],[8,2,8,3],[9,2,9,3],[10,1,10,3],[11,1,11,3],[13,1,13,18],[15,1,16,1],[15,2,15,3],[15,4,15,16],[16,2,16,3],[22,1,22,3],[23,1,23,3],[24,1,24,3],[25,1,25,3],[17,1,19,1],[17,2,17,3],[18,2,18,3],[19,2,19,3],[20,1,21,1],[20,2,20,3],[21,2,21,3]]}
[]
[]
[]
[null,"ORIGINE","Composante",null,"Incertitude-type"]
[null,null,"Charges appliquées (g)",null,1,"%",25,"%",100,"%",250,"%",500,"%",1000,"%",{"$f":"'calcul '!M83","v":"/"}]
[null,"Détermination de l'erreur d'indication","Répétabilité des pesées de\nl'étalon de masse (g)",null,{"$f":"'calcul '!G84","v":8.1649658089681535E-5},{"$f":"E6*E6/SUMSQ($E$6:$E$10)*100","v":66.580993571501651},{"$f":"'calcul '!H84","v":8.1649658089681535E-5},{"$f":"G6*G6/SUMSQ(G6:G10)*100","v":1.7601760174708194},{"$f":"'calcul '!I84","v":8.1649658089681535E-5},{"$f":"I6*I6/SUMSQ(I6:I10)*100","v":1.7601760174708194},{"$f":"'calcul '!J84","v":8.1649658089681535E-5},{"$f":"K6*K6/SUMSQ($K$6:$K$10)*100","v":0.79357993823954387},{"$f":"'calcul '!K84","v":8.1649658089681535E-5},{"$f":"M6*M6/SUMSQ($M$6:$M$10)*100","v":0.37106343437930822},{"$f":"'calcul '!L84","v":"/"},{"$f":"O6*O6/SUMSQ($O$6:$O$10)*100","v":{"$error":"#VALUE!"}},{"$f":"'calcul '!M84","v":"/"}]
[null,null,"Résoution à vide (g)",null,{"$f":"'calcul '!G85","v":4.0824829046386304E-5},{"$f":"E7*E7/SUMSQ($E$6:$E$10)*100","v":16.645248394135717},{"$f":"'calcul '!H85","v":4.0824829046386304E-5},{"$f":"G7*G7/SUMSQ(G6:G10)*100","v":0.44004400440102298},{"$f":"'calcul '!I85","v":4.0824829046386304E-5},{"$f":"I7*I7/SUMSQ(I6:I10)*100","v":0.44004400440102298},{"$f":"'calcul '!J85","v":4.0824829046386304E-5},{"$f":"K7*K7/SUMSQ($K$6:$K$10)*100","v":0.19839498457490753},{"$f":"'calcul '!K85","v":4.0824829046386304E-5},{"$f":"M7*M7/SUMSQ($M$6:$M$10)*100","v":9.2765858601850867E-2},{"$f":"'calcul '!L85","v":"/"},{"$f":"O7*O7/SUMSQ($O$6:$O$10)*100","v":{"$error":"#VALUE!"}},{"$f":"'calcul '!M85","v":"/"}]
[null,null,"Résolution en charge\n(charge = étalon de masse) (g)",null,{"$f":"'calcul '!G86","v":4.0824829046386304E-5},16.645248394135717,{"$f":"'calcul '!H86","v":4.0824829046386304E-5},{"$f":"G8*G8/SUMSQ(G6:G10)*100","v":0.44004400440102298},{"$f":"'calcul '!I86","v":4.0824829046386304E-5},{"$f":"I8*I8/SUMSQ(I6:I10)*100","v":0.44004400440102298},{"$f":"'calcul '!J86","v":4.0824829046386304E-5},0.19839498457490753,{"$f":"'calcul '!K86","v":4.0824829046386304E-5},{"$f":"M8*M8/SUMSQ($M$6:$M$10)*100","v":9.2765858601850867E-2},{"$f":"'calcul '!L86","v":"/"},{"$error":"#VALUE!"},{"$f":"'calcul '!M86","v":"/"}]
[null,null,"Etalons de masse étalonnées (g)",null,{"$f":"'calcul '!G87","v":3.5355339059327378E-6},0.12483936295601784,{"$f":"'calcul '!I87","v":3.5355339059327377E-5},{"$f":"G9*G9/SUMSQ(G6:G10)*100","v":0.33003300330076718},{"$f":"'calcul '!I87","v":3.5355339059327377E-5},{"$f":"I9*I9/SUMSQ(I6:I10)*100","v":0.33003300330076718},{"$f":"'calcul '!J87","v":5.6568542494923805E-5},0.38091837038382242,{"$f":"'calcul '!K87","v":8.9095454429504985E-5},{"$f":"M9*M9/SUMSQ($M$6:$M$10)*100","v":0.44182523134889518},{"$f":"'calcul '!L87","v":"/"},{"$error":"#VALUE!"},{"$f":"'calcul '!M87","v":"/"}]
[null,null,"Influence de la température (g)",null,{"$f":"'calcul '!G88","v":6.0621778264910966E-7},3.670277270906957E-3,{"$f":"'calcul '!I88","v":6.0621778264910962E-4},{"$f":"G10*G10/SUMSQ(G6:G10)*100","v":97.029702970426371},{"$f":"'calcul '!I88","v":6.0621778264910962E-4},{"$f":"I10*I10/SUMSQ(I6:I10)*100","v":97.029702970426371},{"$f":"'calcul '!J88","v":9.0932667397366444E-4},98.428711722226822,{"$f":"'calcul '!K88","v":1.3336791218280411E-3},99.001579617068089,{"$f":"'calcul '!L88","v":"/"},{"$error":"#VALUE!"},{"$f":"'calcul '!M88","v":"/"}]
[null,"Incertitude - type composée (g)",null,null,null,{"$f":"SUM(F6:F10)","v":100.00000000000003},null,{"$f":"SUM(H6:H10)","v":100},null,{"$f":"SUM(J6:J10)","v":100},null,{"$f":"SUM(L6:L10)","v":100},null,{"$f":"SUM(N6:N10)","v":100},null,{"$f":"SUM(P6:P10)","v":{"$error":"#VALUE!"}},{"$f":"'calcul '!M89","v":"/"}]
[null,"Incertitude élargie (k=2) (g)",null,null,null,null,null,null,null,null,null,null,null,null,null,null,{"$f":"'calcul '!M90","v":"/"}]
[]
[null,"Phase 2 : Détermination de l’incertitude de l’instrument de pesage."]
[]
[null,"ORIGINE","Composante",null,"Incertitude-type"]
[null,null,"Charges appliquées (g)",null,1,"%",25,"%",100,"%",250,"%",500,"%",1000,"%",{"$f":"'calcul '!M98","v":"/"}]
[null,"Résultat de la pesé d'un corps","Répétabilité des pesées de\nl'étalon de masse (g)",null,{"$f":"'calcul '!G99","v":8.1649658089681535E-5},{"$f":"E18*E18/SUMSQ(($E$18:$E$24))*100","v":5.7257215338515213},{"$f":"'calcul '!H99","v":8.1649658089681535E-5},{"$f":"G18*G18/SUMSQ($G$18:$G$24)*100","v":7.0003766022295896E-2},{"$f":"'calcul '!I99","v":8.1649658089681535E-5},{"$f":"I18*I18/SUMSQ($I$18:$I$24)*100","v":1.7711758181796575E-2},{"$f":"'calcul '!J99","v":8.1649658089681535E-5},{"$f":"K18*K18/SUMSQ($K$18:$K$24)*100","v":7.8932926597562389E-3},{"$f":"'calcul '!K99","v":8.1649658089681535E-5},{"$f":"M18*M18/SUMSQ($M$18:$M$24)*100","v":3.6712942688731142E-3},{"$f":"'calcul '!L99","v":"/"},{"$f":"O18*O18/SUMSQ($O$18:$O$24)*100","v":{"$error":"#VALUE!"}},{"$f":"'calcul '!M99","v":"/"}]
[null,null,"Résoution à vide (g)",null,{"$f":"'calcul '!G100","v":4.0824829046386304E-5},1.4314303835712618,{"$f":"'calcul '!H100","v":4.0824829046386304E-5},{"$f":"G19*G19/SUMSQ($G$18:$G$24)*100","v":1.7500941506899067E-2},{"$f":"'calcul '!I100","v":4.0824829046386304E-5},{"$f":"I19*I19/SUMSQ($I$18:$I$24)*100","v":4.4279395457844078E-3},{"$f":"'calcul '!J100","v":4.0824829046386304E-5},{"$f":"K19*K19/SUMSQ($K$18:$K$24)*100","v":1.973323165088471E-3},{"$f":"'calcul '!K100","v":4.0824829046386304E-5},{"$f":"M19*M19/SUMSQ($M$18:$M$24)*100","v":9.17823567287772E-4},{"$f":"'calcul '!L100","v":"/"},{"$f":"O19*O19/SUMSQ($O$18:$O$24)*100","v":{"$error":"#VALUE!"}},{"$f":"'calcul '!M100","v":"/"}]
[null,null,"Résolution en charge\n(charge = étalon de masse) (g)",null,{"$f":"'calcul '!G101","v":4.0824829046386304E-5},1.4314303835712618,{"$f":"'calcul '!H101","v":4.0824829046386304E-5},1.7500941506899067E-2,{"$f":"'calcul '!I101","v":4.0824829046386304E-5},4.4279395457844078E-3,{"$f":"'calcul '!J101","v":4.0824829046386304E-5},1.973323165088471E-3,{"$f":"'calcul '!K101","v":4.0824829046386304E-5},9.17823567287772E-4,{"$f":"'calcul '!L101","v":"/"},{"$error":"#VALUE!"},{"$f":"'calcul '!M101","v":"/"}]
[null,"Erreur d'indication","Erreur d'indication non-corrigée (g)",null,{"$f":"'calcul '!G102","v":1.1119854989834726E-4},10.619882931123703,{"$f":"'calcul '!H102","v":3.4937837654847585E-4},1.2817540801613163,{"$f":"'calcul '!I102","v":6.3170899154453542E-4},1.0601981702157119,{"$f":"'calcul '!J102","v":9.1671369576301869E-4},0.99498584898324338,{"$f":"'calcul '!K102","v":1.3467250090506719E-3},0.99877647785633683,{"$f":"'calcul '!L102","v":"/"},{"$error":"#VALUE!"},{"$f":"'calcul '!M102","v":"/"}]
[null,null,"Pérénité des erreurs (g)",null,{"$f":"'calcul '!G103","v":1.1119854989834726E-4},10.619882931123703,{"$f":"'calcul '!H103","v":3.4937837654847585E-4},1.2817540801613163,{"$f":"'calcul '!I103","v":6.3170899154453542E-4},1.0601981702157119,{"$f":"'calcul '!J103","v":9.1671369576301869E-4},0.99498584898324338,{"$f":"'calcul '!K103","v":1.3467250090506719E-3},0.99877647785633683,{"$f":"'calcul '!L103","v":"/"},{"$error":"#VALUE!"},{"$f":"'calcul '!M103","v":"/"}]
[null,"Influence de la température (g)",null,null,{"$f":"'calcul '!G104","v":6.0621778264910716E-6},3.1563039957746335E-2,{"$f":"'calcul '!H104","v":3.0310889132455355E-3},96.473940056781089,{"$f":"'calcul '!I104","v":6.0621778264910711E-3},97.63606698454619,{"$f":"'calcul '!J104","v":9.0932667397366062E-3},97.901495527951752,{"$f":"'calcul '!K104","v":1.3336791218280356E-2},97.951966748085624,{"$f":"'calcul '!L104","v":"/"},{"$error":"#VALUE!"},{"$f":"'calcul '!M104","v":"/"}]
[null,"Excentration de la charge (g)",null,null,{"$f":"'calcul '!G105","v":2.8577380332838929E-4},70.140088796800796,{"$f":"'calcul '!H105","v":2.8577380332838929E-4},0.85754613386017109,{"$f":"'calcul '!I105","v":2.8577380332838929E-4},0.21696903774903178,{"$f":"'calcul '!J105","v":2.8577380332838929E-4},9.6692835091828855E-2,{"$f":"'calcul '!K105","v":2.8577380332838929E-4},4.4973354798260728E-2,{"$f":"'calcul '!L105","v":"/"},{"$error":"#VALUE!"},{"$f":"'calcul '!M105","v":"/"}]
[null,"Incertitude - type composée (g)",null,null,{"$f":"'calcul '!G106","v":3.4122375601247141E-4},{"$f":"SUM(F18:F24)","v":100},{"$f":"'calcul '!H106","v":3.0859839867808073E-3},{"$f":"SUM(H18:H24)","v":99.999999999999986},{"$f":"'calcul '!I106","v":6.1351266626423206E-3},{"$f":"SUM(J18:J24)","v":100.00000000000001},{"$f":"'calcul '!J106","v":9.1902064539741025E-3},{"$f":"SUM(L18:L24)","v":100},{"$f":"'calcul '!K106","v":1.34754963977834E-2},{"$f":"SUM(N18:N24)","v":100},{"$f":"'calcul '!L106","v":"/"},{"$f":"SUM(P18:P24)","v":{"$error":"#VALUE!"}},{"$f":"'calcul '!M106","v":"/"}]
[null,"Incertitude élargie (k=2) (g)",null,null,{"$f":"'calcul '!G107","v":6.8244751202494282E-4},null,{"$f":"'calcul '!H107","v":6.1719679735616146E-3},null,{"$f":"'calcul '!I107","v":1.2270253325284641E-2},null,{"$f":"'calcul '!J107","v":1.8380412907948205E-2},null,{"$f":"'calcul '!K107","v":2.69509927955668E-2},null,{"$f":"'calcul '!L107","v":"/"},null,{"$f":"'calcul '!M107","v":"/"}]

{"sheet":"calcul ","index":2,"n_rows":118,"n_cols":28,"rows_kept":118,"cut":false,"hidden":false,"merged":[[4,2,5,11],[16,2,16,3],[17,2,17,3],[18,2,18,3],[19,1,20,1],[19,2,20,3],[0,0,2,0],[0,2,2,3],[0,4,2,10],[0,11,0,13],[1,11,1,13],[2,11,2,13],[28,12,30,12],[29,7,29,8],[30,7,30,8],[34,1,34,3],[34,4,34,6],[34,7,34,9],[21,2,21,3],[22,1,23,1],[22,2,23,3],[27,1,27,12],[28,1,30,1],[28,2,30,2],[28,3,30,5],[28,6,30,6],[28,7,28,8],[28,11,30,11],[35,9,36,9],[37,5,38,5],[37,6,38,6],[37,8,38,8],[37,9,38,9],[39,1,41,1],[39,4,41,4],[39,5,40,5],[39,6,40,6],[39,7,41,7],[35,1,38,1],[35,4,38,4],[35,5,36,5],[35,6,36,6],[35,7,38,7],[35,8,36,8],[63,1,63,3],[64,1,64,3],[65,1,65,3],[66,1,66,3],[68,1,68,7],[69,1,69,7],[39,8,40,8],[39,9,40,9],[45,1,45,12],[47,1,47,3],[61,1,61,11],[62,1,62,3],[62,4,62,11],[75,4,75,7],[77,1,77,12],[79,1,79,12],[80,1,80,12],[81,1,82,1],[81,2,81,5],[81,6,81,12],[82,2,82,3],[70,1,70,2],[71,1,71,2],[72,1,72,2],[73,1,73,2],[74,1,74,2],[75,1,75,2],[88,1,88,3],[89,1,89,3],[91,1,91,3],[92,1,92,3],[94,1,94,12],[95,1,95,12],[83,1,87,1],[83,2,83,3],[84,2,84,3],[84,4,85,4],[84,5,85,5],[85,2,85,3],[86,2,86,3],[87,2,87,3],[96,1,97,1],[96,2,96,5],[96,6,96,12],[97,2,97,3],[98,1,100,1],[98,2,98,3],[99,2,99,3],[99,4,100,4],[99,5,100,5],[100,2,100,3],[106,1,106,3],[108,1,108,3],[109,1,109,3],[111,1,111,12],[112,1,115,12],[117,1,117,12],[101,1,102,1],[101,2,101,3],[102,2,102,3],[103,1,103,3],[104,1,104,3],[105,1,105,3]]}
[]
[]
[]
[]
[null,null,"Certificat d'étalonnage N°01-2023"]
[null,null,null,null,null,null,null,null,null,null,null,null,null,null,null,null,{"$f":"TEXT(Q5,\"hhmm\")","v":"0000"}]
[null,null,null,null,null,null,null,null,null,null,null,null,null,null,null,null,{"$f":"C19-DATE(YEAR(C19),1,0)","v":342}]
[null,"DELIVRE A",null,null,null,null,null,null,null,null,null,null,null,null,null,null,{"$f":"RIGHT(C17,2)","v":"02"}]
[null,null,null,null,null,null,null,null,null,null,null,null,null,null,null,null,{"$f":"RIGHT(C17,8)","v":"BAL-0002"}]
[null,"Les masses ou poids utilisés font l'objet d'un certificat d'étalonnage COFRAC émis par un prestataire externe.",null,null,null,null,null,null,null,null,null,null,null,null,null,null,{"$f":"LEFT(Q9,3)","v":"BAL"},{"$f":"MID(C17,2,1)","v":"1"},{"$f":"RIGHT(C17,2)","v":"02"}]
[null,null,null,null,null,null,null,null,null,null,null,null,null,null,null,null,"LIAL"]
[null,"Configuration d'étalonnage :",null,null,null,null,null,null,null,null,null,null,null,null,null,null,{"$f":"IF(Q11=\"LIAL\",\"I\",\"E\")","v":"I"}]
[null,"Chronologie des pesées : CROISSANT.",null,null,null,null,null,null,null,null,null,null,null,null,null," ",{"$f":"TEXT(C19,\"aa\")","v":"23"}]
[null,"Mode de lecture : DIRECT.",null,null,null,null,null,"Rajouter dans la macro de protection une option pour vérifier si D17 est vide -> message d'erreur, si rempli protège.",null,null,null,null,null,null,null,null,{"$f":"IF(Q10=\"BAL\",1,IF(Q10=\"AUT\",2,\"/\"))","v":1}]
[null,"Modalité de l'étalonnage :",null,null,null,null,null,null,null,null,null,null,null,null,null,null,{"$f":"_xlfn.CONCAT(\"Certificat d'étalonnage N° \",Q12,\"-\",R10,Q14,S10,\"-\",Q6,\"-\",Q7,\"-\",Q13)","v":"Certificat d'étalonnage N° I-1102-0000-342-23"}]
[null,null,null,null,null,null,null,null,null,null,null,null,null,null,null,null,null,null,{"$f":"C5","v":"Certificat d'étalonnage N°01-2023"},null,null,null,null,null,null,"Appareil de pesage",null,{"$f":"C17","v":"A12-BAL-0002"}]
[null,"Appareil de pesage ","A12-BAL-0002",null,null,null,null,null,null,null,null,null,null,null,null,null,null,null,"balance",null,"affichage",null,": oui.","étalonnage",null,"Opérateur",null,{"$f":"C18","v":0}]
[null,"Opérateur ",null,null,null,null,null,null,null,null,null,null,null,null,null,null,null,null,"A6-BAL-0003",null,"numérique ",null,": non.","périodique.",null,"Date d'intervention",null,{"$f":"C19","v":45268}]
[null,"Date d'intervention","2023-12-08",null,null,null,null,null,null,null,null,null,null,null,null,null,null,null,"A6-BAL-0006",null,"analogique",null,null,"après maintenance.",null,"Date d'émission",null,{"$f":"C22","v":0}]
[null,"Visa",null,null,null,null,null,null,null,null,null,null,null,null,null,null,null,null,"A6-AUT-0013",null,"/",null,null,"après ajustage."]
[null,null,null,null,null,null,null,null,null,null,null,null,null,null,null,null,null,null,"A9-AUT-0004"]
[null,"Date d'émission",null,null,null,null,null,null,null,null,null,null,null,null,null,null,null,null,"A9-AUT-0005"]
[null,"Visa",null,null,null,null,null,null,null,null,null,null,null,null,null,null,null,null,"A9-AUT-0006"]
[null,null,null,null,null,null,null,null,null,null,null,null,null,null,null,null,null,null,"A9-AUT-0021"]
[null,null,null,null,null,null,null,null,null,null,null,null,null,null,null,null,null,null,"A9-AUT-0029"]
[null,"Donnée technique de l'appareil de pesage :",null,null,null,null,null,null,null,null,null,null,null,null,null,null,null,null,"A9-BAL-0004"]
[null,null,null,null,null,null,null,null,null,null,null,null,null,null,null,null,null,null,"A12-BAL-0002"]
[null,"Caractéristique de l'instrument",null,null,null,null,null,null,null,null,null,null,null,null,null,null,null,null,"A12-BAL-0003"]
[null,"Affichage :","numérique ","Nombres d'étendues de pesage :",null,null,1,null,null,"Etendue 1","Etendue 2","C (°C-1) :",1.5E-5,null,null,null,null,null,"/"]
[null,null,null,null,null,null,null,"Portée (g) :",null,220,"/"]
[null,null,null,null,null,null,null,"Résolution d (g) :",null,1E-4,"/"]
[]
[null,"Conditions ambiantes :"]
[]
[null,"Température (°C)",null,null,"Pression (hPa)",null,null,"Humidité (%)"]
[null,"Température d'étalonnage","début ","fin","Pression lors de l'étalonnage","min","max","Humidité lors de l'étalonnage","min","max"]
[null,null,19.899999999999999,20.6]
[null,null,"ΔT =",{"$f":"IF(OR(ISBLANK(C37:D37),C37:D37=\"/\"),\"/\",ABS(C37-D37))","v":0.70000000000000284},null,994,1034,null,20,80]
[null,null,"x̅ =",{"$f":"IF(OR(ISBLANK(C37:D37),C37:D37=\"/\"),\"/\",AVERAGE(C37:D37))","v":20.25}]
[null,"Température d'utilisation ","min","max","Pression lors de l'utilisation","min","max","Humidité lors de l'utilisation","min","max"]
[null,null,18,25]
[null,null,"ΔT =",{"$f":"IF(OR(ISBLANK(C41:D41),C41:D41=\"/\"),\"/\",ABS(C41-D41))","v":7},null,994,1034,null,20,80]
[]
[null,"Les essais réalisés lors de l'étalonnage de l'appareil de pesage sont détaillés dans le MO-------"]
[]
[null,"Essais :"]
[]
[null,"Répétabilité (g)"]
[null,"Masse pesée :",100,null,null,null," "]
[null,1,100.00020000000001]
[null,2,100.0001]
[null,3,100.0003]
[null,4,100.0003]
[null,5,100.00020000000001]
[null,6,100.00020000000001]
[null,7,100.0001]
[null,8,100.0003]
[null,9,100.0001]
[null,10,100.00020000000001]
[null,"s =",{"$f":"IF(OR(ISBLANK(C49:C54)),\"/\",STDEV(C50:C59))","v":8.1649658089681535E-5},{"$f":"IF(OR(ISBLANK(D49:D54)),\"/\",STDEV(D50:D59))","v":"/"}]
[]
[null,"Détermination de l'erreur d'indication (g)"]
[null,"Indication à charge nulle (g)  :",null,null,0]
[null,"Charge d'étalonnage appliquée (g) : ",null,null,null,0.1,50,100,150,220,"/","/"]
[null,"Valeur vraie de l'étalon (g) :",null,null,"xi",{"$f":"IF(OR(ISBLANK(F64),F64=\"/\"),\"/\",IF(F64='Données masses'!$D$3,'Données masses'!$D$8,IF(AND(F64='Données masses'!$E$3,'Données masses'!$E$9=\"oui\",OR('Données masses'!$F$9=\"non\",'Données masses'!$F$9=\"doublon\")),'Données masses'!$E$8,IF(AND(F64='Données masses'!$F$3,'Données masses'!$F$9=\"oui\",OR('Données masses'!$E$9=\"non\",'Données masses'!$E$9=\"doublon\")),'Données masses'!$F$8,IF(F64='Données masses'!$G$3,'Données masses'!$G$8,IF(F64='Données masses'!$H$3,'Données masses'!$H$8,IF(AND(F64='Données masses'!$I$3,'Données masses'!$I$9=\"oui\",OR('Données masses'!$J$9=\"non\",'Données masses'!$J$9=\"doublon\")),'Données masses'!$I$8,IF(AND(F64='Données masses'!$J$3,'Données masses'!$J$9=\"oui\",OR('Données masses'!$I$9=\"non\",'Données masses'!$I$9=\"doublon\")),'Données masses'!$J$8,IF(F64='Données masses'!$K$3,'Données masses'!$K$8,IF(F64='Données masses'!$L$3,'Données masses'!$L$8,IF(AND(F64='Données masses'!$M$3,'Données masses'!$M$9=\"oui\",OR('Données masses'!$N$9=\"non\",'Données masses'!$N$9=\"doublon\")),'Données masses'!$M$8,IF(AND(F64='Données masses'!$N$3,'Données masses'!$N$9=\"oui\",OR('Données masses'!$M$9=\"non\",'Données masses'!$M$9=\"doublon\")),'Données masses'!$N$8,IF(F64='Données masses'!$O$3,'Données masses'!$O$8,IF(F64='Données masses'!$P$3,'Données masses'!$P$8,IF(AND(F64='Données masses'!$Q$3,'Données masses'!$Q$9=\"oui\",OR('Données masses'!$R$9=\"non\",'Données masses'!$R$9=\"doublon\")),'Données masses'!$Q$8,IF(AND(F64='Données masses'!$R$3,'Données masses'!$R$9=\"oui\",OR('Données masses'!$Q$9=\"non\",'Données masses'!$Q$9=\"doublon\")),'Données masses'!$R$8,IF(F64='Données masses'!$S$3,'Données masses'!$S$8,IF(F64='Données masses'!$T$3,'Données masses'!$T$8,IF(AND(F64='Données masses'!$U$3,'Données masses'!$U$9=\"oui\",OR('Données masses'!$V$9=\"non\",'Données masses'!$V$9=\"doublon\")),'Données masses'!$U$8,IF(AND(F64='Données masses'!$V$3,'Données masses'!$V$9=\"oui\",OR('Données masses'!$U$9=\"non\",'Données masses'!$U$9=\"doublon\")),'Données masses'!$V$8,IF(F64='Données masses'!$W$3,'Données masses'!$W$8,IF(F64='Données masses'!$X$3,'Données masses'!$X$8,IF(AND(F64='Données masses'!$Y$3,'Données masses'!$Y$9=\"oui\",OR('Données masses'!$Z$9=\"non\",'Données masses'!$Z$9=\"doublon\")),'Données masses'!$Y$8,IF(AND(F64='Données masses'!$Z$3,'Données masses'!$Z$9=\"oui\",OR('Données masses'!$Y$9=\"non\",'Données masses'!$Y$9=\"doublon\")),'Données masses'!$Z$8,IF(F64='Données masses'!$AA$3,'Données masses'!$AA$8,IF(F64='Données masses'!$AB$3,'Données masses'!$AB$8,IF(AND(F64='Données masses'!$AC$3,'Données masses'!$AC$9=\"oui\",OR('Données masses'!$AD$9=\"non\",'Données masses'!$AD$9=\"doublon\")),'Données masses'!$AC$8,IF(AND(F64='Données masses'!$AD$3,'Données masses'!$AD$9=\"oui\",OR('Données masses'!$AC$9=\"non\",'Données masses'!$AC$9=\"doublon\")),'Données masses'!$AD$8,IF(F64='Données masses'!$AF$3,'Données masses'!$AF$8,IF(F64='Données masses'!$AG$3,'Données masses'!$AG$8,IF(F64='Données masses'!$AH$3,'Données masses'!$AH$8,IF(F64='Données masses'!$AI$3,'Données masses'!$AI$8,IF(F64='Données masses'!$AJ$3,'Données masses'!$AJ$8,IF(F64='Données masses'!$AK$3,'Données masses'!$AK$8,IF(F64='Données masses'!$AL$3,'Données masses'!$AL$8,IF(F64='Données masses'!$AM$3,'Données masses'!$AM$8,IF(F64='Données masses'!$AN$3,'Données masses'!$AN$8,IF(F64='Données masses'!$AO$3,'Données masses'!$AO$8,IF(F64='Données masses'!$AP$3,'Données masses'!$AP$8,\"Erreur\")))))))))))))))))))))))))))))))))))))))","v":0.10000299999999999},{"$f":"IF(OR(ISBLANK(G64),G64=\"/\"),\"/\",IF(G64='Données masses'!$D$3,'Données masses'!$D$8,IF(AND(G64='Données masses'!$E$3,'Données masses'!$E$9=\"oui\",OR('Données masses'!$F$9=\"non\",'Données masses'!$F$9=\"doublon\")),'Données masses'!$E$8,IF(AND(G64='Données masses'!$F$3,'Données masses'!$F$9=\"oui\",OR('Données masses'!$E$9=\"non\",'Données masses'!$E$9=\"doublon\")),'Données masses'!$F$8,IF(G64='Données masses'!$G$3,'Données masses'!$G$8,IF(G64='Données masses'!$H$3,'Données masses'!$H$8,IF(AND(G64='Données masses'!$I$3,'Données masses'!$I$9=\"oui\",OR('Données masses'!$J$9=\"non\",'Données masses'!$J$9=\"doublon\")),'Données masses'!$I$8,IF(AND(G64='Données masses'!$J$3,'Données masses'!$J$9=\"oui\",OR('Données masses'!$I$9=\"non\",'Données masses'!$I$9=\"doublon\")),'Données masses'!$J$8,IF(G64='Données masses'!$K$3,'Données masses'!$K$8,IF(G64='Données masses'!$L$3,'Données masses'!$L$8,IF(AND(G64='Données masses'!$M$3,'Données masses'!$M$9=\"oui\",OR('Données masses'!$N$9=\"non\",'Données masses'!$N$9=\"doublon\")),'Données masses'!$M$8,IF(AND(G64='Données masses'!$N$3,'Données masses'!$N$9=\"oui\",OR('Données masses'!$M$9=\"non\",'Données masses'!$M$9=\"doublon\")),'Données masses'!$N$8,IF(G64='Données masses'!$O$3,'Données masses'!$O$8,IF(G64='Données masses'!$P$3,'Données masses'!$P$8,IF(AND(G64='Données masses'!$Q$3,'Données masses'!$Q$9=\"oui\",OR('Données masses'!$R$9=\"non\",'Données masses'!$R$9=\"doublon\")),'Données masses'!$Q$8,IF(AND(G64='Données masses'!$R$3,'Données masses'!$R$9=\"oui\",OR('Données masses'!$Q$9=\"non\",'Données masses'!$Q$9=\"doublon\")),'Données masses'!$R$8,IF(G64='Données masses'!$S$3,'Données masses'!$S$8,IF(G64='Données masses'!$T$3,'Données masses'!$T$8,IF(AND(G64='Données masses'!$U$3,'Données masses'!$U$9=\"oui\",OR('Données masses'!$V$9=\"non\",'Données masses'!$V$9=\"doublon\")),'Données masses'!$U$8,IF(AND(G64='Données masses'!$V$3,'Données masses'!$V$9=\"oui\",OR('Données masses'!$U$9=\"non\",'Données masses'!$U$9=\"doublon\")),'Données masses'!$V$8,IF(G64='Données masses'!$W$3,'Données masses'!$W$8,IF(G64='Données masses'!$X$3,'Données masses'!$X$8,IF(AND(G64='Données masses'!$Y$3,'Données masses'!$Y$9=\"oui\",OR('Données masses'!$Z$9=\"non\",'Données masses'!$Z$9=\"doublon\")),'Données masses'!$Y$8,IF(AND(G64='Données masses'!$Z$3,'Données masses'!$Z$9=\"oui\",OR('Données masses'!$Y$9=\"non\",'Données masses'!$Y$9=\"doublon\")),'Données masses'!$Z$8,IF(G64='Données masses'!$AA$3,'Données masses'!$AA$8,IF(G64='Données masses'!$AB$3,'Données masses'!$AB$8,IF(AND(G64='Données masses'!$AC$3,'Données masses'!$AC$9=\"oui\",OR('Données masses'!$AD$9=\"non\",'Données masses'!$AD$9=\"doublon\")),'Données masses'!$AC$8,IF(AND(G64='Données masses'!$AD$3,'Données masses'!$AD$9=\"oui\",OR('Données masses'!$AC$9=\"non\",'Données masses'!$AC$9=\"doublon\")),'Données masses'!$AD$8,IF(G64='Données masses'!$AF$3,'Données masses'!$AF$8,IF(G64='Données masses'!$AG$3,'Données masses'!$AG$8,IF(G64='Données masses'!$AH$3,'Données masses'!$AH$8,IF(G64='Données masses'!$AI$3,'Données masses'!$AI$8,IF(G64='Données masses'!$AJ$3,'Données masses'!$AJ$8,IF(G64='Données masses'!$AK$3,'Données masses'!$AK$8,IF(G64='Données masses'!$AL$3,'Données masses'!$AL$8,IF(G64='Données masses'!$AM$3,'Données masses'!$AM$8,IF(G64='Données masses'!$AN$3,'Données masses'!$AN$8,IF(G64='Données masses'!$AO$3,'Données masses'!$AO$8,IF(G64='Données masses'!$AP$3,'Données masses'!$AP$8,\"Erreur\")))))))))))))))))))))))))))))))))))))))","v":50.000019000000002},{"$f":"IF(OR(ISBLANK(H64),H64=\"/\"),\"/\",IF(H64='Données masses'!$D$3,'Données masses'!$D$8,IF(AND(H64='Données masses'!$E$3,'Données masses'!$E$9=\"oui\",OR('Données masses'!$F$9=\"non\",'Données masses'!$F$9=\"doublon\")),'Données masses'!$E$8,IF(AND(H64='Données masses'!$F$3,'Données masses'!$F$9=\"oui\",OR('Données masses'!$E$9=\"non\",'Données masses'!$E$9=\"doublon\")),'Données masses'!$F$8,IF(H64='Données masses'!$G$3,'Données masses'!$G$8,IF(H64='Données masses'!$H$3,'Données masses'!$H$8,IF(AND(H64='Données masses'!$I$3,'Données masses'!$I$9=\"oui\",OR('Données masses'!$J$9=\"non\",'Données masses'!$J$9=\"doublon\")),'Données masses'!$I$8,IF(AND(H64='Données masses'!$J$3,'Données masses'!$J$9=\"oui\",OR('Données masses'!$I$9=\"non\",'Données masses'!$I$9=\"doublon\")),'Données masses'!$J$8,IF(H64='Données masses'!$K$3,'Données masses'!$K$8,IF(H64='Données masses'!$L$3,'Données masses'!$L$8,IF(AND(H64='Données masses'!$M$3,'Données masses'!$M$9=\"oui\",OR('Données masses'!$N$9=\"non\",'Données masses'!$N$9=\"doublon\")),'Données masses'!$M$8,IF(AND(H64='Données masses'!$N$3,'Données masses'!$N$9=\"oui\",OR('Données masses'!$M$9=\"non\",'Données masses'!$M$9=\"doublon\")),'Données masses'!$N$8,IF(H64='Données masses'!$O$3,'Données masses'!$O$8,IF(H64='Données masses'!$P$3,'Données masses'!$P$8,IF(AND(H64='Données masses'!$Q$3,'Données masses'!$Q$9=\"oui\",OR('Données masses'!$R$9=\"non\",'Données masses'!$R$9=\"doublon\")),'Données masses'!$Q$8,IF(AND(H64='Données masses'!$R$3,'Données masses'!$R$9=\"oui\",OR('Données masses'!$Q$9=\"non\",'Données masses'!$Q$9=\"doublon\")),'Données masses'!$R$8,IF(H64='Données masses'!$S$3,'Données masses'!$S$8,IF(H64='Données masses'!$T$3,'Données masses'!$T$8,IF(AND(H64='Données masses'!$U$3,'Données masses'!$U$9=\"oui\",OR('Données masses'!$V$9=\"non\",'Données masses'!$V$9=\"doublon\")),'Données masses'!$U$8,IF(AND(H64='Données masses'!$V$3,'Données masses'!$V$9=\"oui\",OR('Données masses'!$U$9=\"non\",'Données masses'!$U$9=\"doublon\")),'Données masses'!$V$8,IF(H64='Données masses'!$W$3,'Données masses'!$W$8,IF(H64='Données masses'!$X$3,'Données masses'!$X$8,IF(AND(H64='Données masses'!$Y$3,'Données masses'!$Y$9=\"oui\",OR('Données masses'!$Z$9=\"non\",'Données masses'!$Z$9=\"doublon\")),'Données masses'!$Y$8,IF(AND(H64='Données masses'!$Z$3,'Données masses'!$Z$9=\"oui\",OR('Données masses'!$Y$9=\"non\",'Données masses'!$Y$9=\"doublon\")),'Données masses'!$Z$8,IF(H64='Données masses'!$AA$3,'Données masses'!$AA$8,IF(H64='Données masses'!$AB$3,'Données masses'!$AB$8,IF(AND(H64='Données masses'!$AC$3,'Données masses'!$AC$9=\"oui\",OR('Données masses'!$AD$9=\"non\",'Données masses'!$AD$9=\"doublon\")),'Données masses'!$AC$8,IF(AND(H64='Données masses'!$AD$3,'Données masses'!$AD$9=\"oui\",OR('Données masses'!$AC$9=\"non\",'Données masses'!$AC$9=\"doublon\")),'Données masses'!$AD$8,IF(H64='Données masses'!$AF$3,'Données masses'!$AF$8,IF(H64='Données masses'!$AG$3,'Données masses'!$AG$8,IF(H64='Données masses'!$AH$3,'Données masses'!$AH$8,IF(H64='Données masses'!$AI$3,'Données masses'!$AI$8,IF(H64='Données masses'!$AJ$3,'Données masses'!$AJ$8,IF(H64='Données masses'!$AK$3,'Données masses'!$AK$8,IF(H64='Données masses'!$AL$3,'Données masses'!$AL$8,IF(H64='Données masses'!$AM$3,'Données masses'!$AM$8,IF(H64='Données masses'!$AN$3,'Données masses'!$AN$8,IF(H64='Données masses'!$AO$3,'Données masses'!$AO$8,IF(H64='Données masses'!$AP$3,'Données masses'!$AP$8,\"Erreur\")))))))))))))))))))))))))))))))))))))))","v":100.000015},{"$f":"IF(OR(ISBLANK(I64),I64=\"/\"),\"/\",IF(I64='Données masses'!$D$3,'Données masses'!$D$8,IF(AND(I64='Données masses'!$E$3,'Données masses'!$E$9=\"oui\",OR('Données masses'!$F$9=\"non\",'Données masses'!$F$9=\"doublon\")),'Données masses'!$E$8,IF(AND(I64='Données masses'!$F$3,'Données masses'!$F$9=\"oui\",OR('Données masses'!$E$9=\"non\",'Données masses'!$E$9=\"doublon\")),'Données masses'!$F$8,IF(I64='Données masses'!$G$3,'Données masses'!$G$8,IF(I64='Données masses'!$H$3,'Données masses'!$H$8,IF(AND(I64='Données masses'!$I$3,'Données masses'!$I$9=\"oui\",OR('Données masses'!$J$9=\"non\",'Données masses'!$J$9=\"doublon\")),'Données masses'!$I$8,IF(AND(I64='Données masses'!$J$3,'Données masses'!$J$9=\"oui\",OR('Données masses'!$I$9=\"non\",'Données masses'!$I$9=\"doublon\")),'Données masses'!$J$8,IF(I64='Données masses'!$K$3,'Données masses'!$K$8,IF(I64='Données masses'!$L$3,'Données masses'!$L$8,IF(AND(I64='Données masses'!$M$3,'Données masses'!$M$9=\"oui\",OR('Données masses'!$N$9=\"non\",'Données masses'!$N$9=\"doublon\")),'Données masses'!$M$8,IF(AND(I64='Données masses'!$N$3,'Données masses'!$N$9=\"oui\",OR('Données masses'!$M$9=\"non\",'Données masses'!$M$9=\"doublon\")),'Données masses'!$N$8,IF(I64='Données masses'!$O$3,'Données masses'!$O$8,IF(I64='Données masses'!$P$3,'Données masses'!$P$8,IF(AND(I64='Données masses'!$Q$3,'Données masses'!$Q$9=\"oui\",OR('Données masses'!$R$9=\"non\",'Données masses'!$R$9=\"doublon\")),'Données masses'!$Q$8,IF(AND(I64='Données masses'!$R$3,'Données masses'!$R$9=\"oui\",OR('Données masses'!$Q$9=\"non\",'Données masses'!$Q$9=\"doublon\")),'Données masses'!$R$8,IF(I64='Données masses'!$S$3,'Données masses'!$S$8,IF(I64='Données masses'!$T$3,'Données masses'!$T$8,IF(AND(I64='Données masses'!$U$3,'Données masses'!$U$9=\"oui\",OR('Données masses'!$V$9=\"non\",'Données masses'!$V$9=\"doublon\")),'Données masses'!$U$8,IF(AND(I64='Données masses'!$V$3,'Données masses'!$V$9=\"oui\",OR('Données masses'!$U$9=\"non\",'Données masses'!$U$9=\"doublon\")),'Données masses'!$V$8,IF(I64='Données masses'!$W$3,'Données masses'!$W$8,IF(I64='Données masses'!$X$3,'Données masses'!$X$8,IF(AND(I64='Données masses'!$Y$3,'Données masses'!$Y$9=\"oui\",OR('Données masses'!$Z$9=\"non\",'Données masses'!$Z$9=\"doublon\")),'Données masses'!$Y$8,IF(AND(I64='Données masses'!$Z$3,'Données masses'!$Z$9=\"oui\",OR('Données masses'!$Y$9=\"non\",'Données masses'!$Y$9=\"doublon\")),'Données masses'!$Z$8,IF(I64='Données masses'!$AA$3,'Données masses'!$AA$8,IF(I64='Données masses'!$AB$3,'Données masses'!$AB$8,IF(AND(I64='Données masses'!$AC$3,'Données masses'!$AC$9=\"oui\",OR('Données masses'!$AD$9=\"non\",'Données masses'!$AD$9=\"doublon\")),'Données masses'!$AC$8,IF(AND(I64='Données masses'!$AD$3,'Données masses'!$AD$9=\"oui\",OR('Données masses'!$AC$9=\"non\",'Données masses'!$AC$9=\"doublon\")),'Données masses'!$AD$8,IF(I64='Données masses'!$AF$3,'Données masses'!$AF$8,IF(I64='Données masses'!$AG$3,'Données masses'!$AG$8,IF(I64='Données masses'!$AH$3,'Données masses'!$AH$8,IF(I64='Données masses'!$AI$3,'Données masses'!$AI$8,IF(I64='Données masses'!$AJ$3,'Données masses'!$AJ$8,IF(I64='Données masses'!$AK$3,'Données masses'!$AK$8,IF(I64='Données masses'!$AL$3,'Données masses'!$AL$8,IF(I64='Données masses'!$AM$3,'Données masses'!$AM$8,IF(I64='Données masses'!$AN$3,'Données masses'!$AN$8,IF(I64='Données masses'!$AO$3,'Données masses'!$AO$8,IF(I64='Données masses'!$AP$3,'Données masses'!$AP$8,\"Erreur\")))))))))))))))))))))))))))))))))))))))","v":150.000034},{"$f":"IF(OR(ISBLANK(J64),J64=\"/\"),\"/\",IF(J64='Données masses'!$D$3,'Données masses'!$D$8,IF(AND(J64='Données masses'!$E$3,'Données masses'!$E$9=\"oui\",OR('Données masses'!$F$9=\"non\",'Données masses'!$F$9=\"doublon\")),'Données masses'!$E$8,IF(AND(J64='Données masses'!$F$3,'Données masses'!$F$9=\"oui\",OR('Données masses'!$E$9=\"non\",'Données masses'!$E$9=\"doublon\")),'Données masses'!$F$8,IF(J64='Données masses'!$G$3,'Données masses'!$G$8,IF(J64='Données masses'!$H$3,'Données masses'!$H$8,IF(AND(J64='Données masses'!$I$3,'Données masses'!$I$9=\"oui\",OR('Données masses'!$J$9=\"non\",'Données masses'!$J$9=\"doublon\")),'Données masses'!$I$8,IF(AND(J64='Données masses'!$J$3,'Données masses'!$J$9=\"oui\",OR('Données masses'!$I$9=\"non\",'Données masses'!$I$9=\"doublon\")),'Données masses'!$J$8,IF(J64='Données masses'!$K$3,'Données masses'!$K$8,IF(J64='Données masses'!$L$3,'Données masses'!$L$8,IF(AND(J64='Données masses'!$M$3,'Données masses'!$M$9=\"oui\",OR('Données masses'!$N$9=\"non\",'Données masses'!$N$9=\"doublon\")),'Données masses'!$M$8,IF(AND(J64='Données masses'!$N$3,'Données masses'!$N$9=\"oui\",OR('Données masses'!$M$9=\"non\",'Données masses'!$M$9=\"doublon\")),'Données masses'!$N$8,IF(J64='Données masses'!$O$3,'Données masses'!$O$8,IF(J64='Données masses'!$P$3,'Données masses'!$P$8,IF(AND(J64='Données masses'!$Q$3,'Données masses'!$Q$9=\"oui\",OR('Données masses'!$R$9=\"non\",'Données masses'!$R$9=\"doublon\")),'Données masses'!$Q$8,IF(AND(J64='Données masses'!$R$3,'Données masses'!$R$9=\"oui\",OR('Données masses'!$Q$9=\"non\",'Données masses'!$Q$9=\"doublon\")),'Données masses'!$R$8,IF(J64='Données masses'!$S$3,'Données masses'!$S$8,IF(J64='Données masses'!$T$3,'Données masses'!$T$8,IF(AND(J64='Données masses'!$U$3,'Données masses'!$U$9=\"oui\",OR('Données masses'!$V$9=\"non\",'Données masses'!$V$9=\"doublon\")),'Données masses'!$U$8,IF(AND(J64='Données masses'!$V$3,'Données masses'!$V$9=\"oui\",OR('Données masses'!$U$9=\"non\",'Données masses'!$U$9=\"doublon\")),'Données masses'!$V$8,IF(J64='Données masses'!$W$3,'Données masses'!$W$8,IF(J64='Données masses'!$X$3,'Données masses'!$X$8,IF(AND(J64='Données masses'!$Y$3,'Données masses'!$Y$9=\"oui\",OR('Données masses'!$Z$9=\"non\",'Données masses'!$Z$9=\"doublon\")),'Données masses'!$Y$8,IF(AND(J64='Données masses'!$Z$3,'Données masses'!$Z$9=\"oui\",OR('Données masses'!$Y$9=\"non\",'Données masses'!$Y$9=\"doublon\")),'Données masses'!$Z$8,IF(J64='Données masses'!$AA$3,'Données masses'!$AA$8,IF(J64='Données masses'!$AB$3,'Données masses'!$AB$8,IF(AND(J64='Données masses'!$AC$3,'Données masses'!$AC$9=\"oui\",OR('Données masses'!$AD$9=\"non\",'Données masses'!$AD$9=\"doublon\")),'Données masses'!$AC$8,IF(AND(J64='Données masses'!$AD$3,'Données masses'!$AD$9=\"oui\",OR('Données masses'!$AC$9=\"non\",'Données masses'!$AC$9=\"doublon\")),'Données masses'!$AD$8,IF(J64='Données masses'!$AF$3,'Données masses'!$AF$8,IF(J64='Données masses'!$AG$3,'Données masses'!$AG$8,IF(J64='Données masses'!$AH$3,'Données masses'!$AH$8,IF(J64='Données masses'!$AI$3,'Données masses'!$AI$8,IF(J64='Données masses'!$AJ$3,'Données masses'!$AJ$8,IF(J64='Données masses'!$AK$3,'Données masses'!$AK$8,IF(J64='Données masses'!$AL$3,'Données masses'!$AL$8,IF(J64='Données masses'!$AM$3,'Données masses'!$AM$8,IF(J64='Données masses'!$AN$3,'Données masses'!$AN$8,IF(J64='Données masses'!$AO$3,'Données masses'!$AO$8,IF(J64='Données masses'!$AP$3,'Données masses'!$AP$8,\"Erreur\")))))))))))))))))))))))))))))))))))))))","v":220.00006100000002},{"$f":"IF(OR(ISBLANK(K64),K64=\"/\"),\"/\",IF(K64='Données masses'!$D$3,'Données masses'!$D$8,IF(AND(K64='Données masses'!$E$3,'Données masses'!$E$9=\"oui\",OR('Données masses'!$F$9=\"non\",'Données masses'!$F$9=\"doublon\")),'Données masses'!$E$8,IF(AND(K64='Données masses'!$F$3,'Données masses'!$F$9=\"oui\",OR('Données masses'!$E$9=\"non\",'Données masses'!$E$9=\"doublon\")),'Données masses'!$F$8,IF(K64='Données masses'!$G$3,'Données masses'!$G$8,IF(K64='Données masses'!$H$3,'Données masses'!$H$8,IF(AND(K64='Données masses'!$I$3,'Données masses'!$I$9=\"oui\",OR('Données masses'!$J$9=\"non\",'Données masses'!$J$9=\"doublon\")),'Données masses'!$I$8,IF(AND(K64='Données masses'!$J$3,'Données masses'!$J$9=\"oui\",OR('Données masses'!$I$9=\"non\",'Données masses'!$I$9=\"doublon\")),'Données masses'!$J$8,IF(K64='Données masses'!$K$3,'Données masses'!$K$8,IF(K64='Données masses'!$L$3,'Données masses'!$L$8,IF(AND(K64='Données masses'!$M$3,'Données masses'!$M$9=\"oui\",OR('Données masses'!$N$9=\"non\",'Données masses'!$N$9=\"doublon\")),'Données masses'!$M$8,IF(AND(K64='Données masses'!$N$3,'Données masses'!$N$9=\"oui\",OR('Données masses'!$M$9=\"non\",'Données masses'!$M$9=\"doublon\")),'Données masses'!$N$8,IF(K64='Données masses'!$O$3,'Données masses'!$O$8,IF(K64='Données masses'!$P$3,'Données masses'!$P$8,IF(AND(K64='Données masses'!$Q$3,'Données masses'!$Q$9=\"oui\",OR('Données masses'!$R$9=\"non\",'Données masses'!$R$9=\"doublon\")),'Données masses'!$Q$8,IF(AND(K64='Données masses'!$R$3,'Données masses'!$R$9=\"oui\",OR('Données masses'!$Q$9=\"non\",'Données masses'!$Q$9=\"doublon\")),'Données masses'!$R$8,IF(K64='Données masses'!$S$3,'Données masses'!$S$8,IF(K64='Données masses'!$T$3,'Données masses'!$T$8,IF(AND(K64='Données masses'!$U$3,'Données masses'!$U$9=\"oui\",OR('Données masses'!$V$9=\"non\",'Données masses'!$V$9=\"doublon\")),'Données masses'!$U$8,IF(AND(K64='Données masses'!$V$3,'Données masses'!$V$9=\"oui\",OR('Données masses'!$U$9=\"non\",'Données masses'!$U$9=\"doublon\")),'Données masses'!$V$8,IF(K64='Données masses'!$W$3,'Données masses'!$W$8,IF(K64='Données masses'!$X$3,'Données masses'!$X$8,IF(AND(K64='Données masses'!$Y$3,'Données masses'!$Y$9=\"oui\",OR('Données masses'!$Z$9=\"non\",'Données masses'!$Z$9=\"doublon\")),'Données masses'!$Y$8,IF(AND(K64='Données masses'!$Z$3,'Données masses'!$Z$9=\"oui\",OR('Données masses'!$Y$9=\"non\",'Données masses'!$Y$9=\"doublon\")),'Données masses'!$Z$8,IF(K64='Données masses'!$AA$3,'Données masses'!$AA$8,IF(K64='Données masses'!$AB$3,'Données masses'!$AB$8,IF(AND(K64='Données masses'!$AC$3,'Données masses'!$AC$9=\"oui\",OR('Données masses'!$AD$9=\"non\",'Données masses'!$AD$9=\"doublon\")),'Données masses'!$AC$8,IF(AND(K64='Données masses'!$AD$3,'Données masses'!$AD$9=\"oui\",OR('Données masses'!$AC$9=\"non\",'Données masses'!$AC$9=\"doublon\")),'Données masses'!$AD$8,IF(K64='Données masses'!$AF$3,'Données masses'!$AF$8,IF(K64='Données masses'!$AG$3,'Données masses'!$AG$8,IF(K64='Données masses'!$AH$3,'Données masses'!$AH$8,IF(K64='Données masses'!$AI$3,'Données masses'!$AI$8,IF(K64='Données masses'!$AJ$3,'Données masses'!$AJ$8,IF(K64='Données masses'!$AK$3,'Données masses'!$AK$8,IF(K64='Données masses'!$AL$3,'Données masses'!$AL$8,IF(K64='Données masses'!$AM$3,'Données masses'!$AM$8,IF(K64='Données masses'!$AN$3,'Données masses'!$AN$8,IF(K64='Données masses'!$AO$3,'Données masses'!$AO$8,IF(K64='Données masses'!$AP$3,'Données masses'!$AP$8,\"Erreur\")))))))))))))))))))))))))))))))))))))))","v":"/"},{"$f":"IF(OR(ISBLANK(L64),L64=\"/\"),\"/\",IF(L64='Données masses'!$D$3,'Données masses'!$D$8,IF(AND(L64='Données masses'!$E$3,'Données masses'!$E$9=\"oui\",OR('Données masses'!$F$9=\"non\",'Données masses'!$F$9=\"doublon\")),'Données masses'!$E$8,IF(AND(L64='Données masses'!$F$3,'Données masses'!$F$9=\"oui\",OR('Données masses'!$E$9=\"non\",'Données masses'!$E$9=\"doublon\")),'Données masses'!$F$8,IF(L64='Données masses'!$G$3,'Données masses'!$G$8,IF(L64='Données masses'!$H$3,'Données masses'!$H$8,IF(AND(L64='Données masses'!$I$3,'Données masses'!$I$9=\"oui\",OR('Données masses'!$J$9=\"non\",'Données masses'!$J$9=\"doublon\")),'Données masses'!$I$8,IF(AND(L64='Données masses'!$J$3,'Données masses'!$J$9=\"oui\",OR('Données masses'!$I$9=\"non\",'Données masses'!$I$9=\"doublon\")),'Données masses'!$J$8,IF(L64='Données masses'!$K$3,'Données masses'!$K$8,IF(L64='Données masses'!$L$3,'Données masses'!$L$8,IF(AND(L64='Données masses'!$M$3,'Données masses'!$M$9=\"oui\",OR('Données masses'!$N$9=\"non\",'Données masses'!$N$9=\"doublon\")),'Données masses'!$M$8,IF(AND(L64='Données masses'!$N$3,'Données masses'!$N$9=\"oui\",OR('Données masses'!$M$9=\"non\",'Données masses'!$M$9=\"doublon\")),'Données masses'!$N$8,IF(L64='Données masses'!$O$3,'Données masses'!$O$8,IF(L64='Données masses'!$P$3,'Données masses'!$P$8,IF(AND(L64='Données masses'!$Q$3,'Données masses'!$Q$9=\"oui\",OR('Données masses'!$R$9=\"non\",'Données masses'!$R$9=\"doublon\")),'Données masses'!$Q$8,IF(AND(L64='Données masses'!$R$3,'Données masses'!$R$9=\"oui\",OR('Données masses'!$Q$9=\"non\",'Données masses'!$Q$9=\"doublon\")),'Données masses'!$R$8,IF(L64='Données masses'!$S$3,'Données masses'!$S$8,IF(L64='Données masses'!$T$3,'Données masses'!$T$8,IF(AND(L64='Données masses'!$U$3,'Données masses'!$U$9=\"oui\",OR('Données masses'!$V$9=\"non\",'Données masses'!$V$9=\"doublon\")),'Données masses'!$U$8,IF(AND(L64='Données masses'!$V$3,'Données masses'!$V$9=\"oui\",OR('Données masses'!$U$9=\"non\",'Données masses'!$U$9=\"doublon\")),'Données masses'!$V$8,IF(L64='Données masses'!$W$3,'Données masses'!$W$8,IF(L64='Données masses'!$X$3,'Données masses'!$X$8,IF(AND(L64='Données masses'!$Y$3,'Données masses'!$Y$9=\"oui\",OR('Données masses'!$Z$9=\"non\",'Données masses'!$Z$9=\"doublon\")),'Données masses'!$Y$8,IF(AND(L64='Données masses'!$Z$3,'Données masses'!$Z$9=\"oui\",OR('Données masses'!$Y$9=\"non\",'Données masses'!$Y$9=\"doublon\")),'Données masses'!$Z$8,IF(L64='Données masses'!$AA$3,'Données masses'!$AA$8,IF(L64='Données masses'!$AB$3,'Données masses'!$AB$8,IF(AND(L64='Données masses'!$AC$3,'Données masses'!$AC$9=\"oui\",OR('Données masses'!$AD$9=\"non\",'Données masses'!$AD$9=\"doublon\")),'Données masses'!$AC$8,IF(AND(L64='Données masses'!$AD$3,'Données masses'!$AD$9=\"oui\",OR('Données masses'!$AC$9=\"non\",'Données masses'!$AC$9=\"doublon\")),'Données masses'!$AD$8,IF(L64='Données masses'!$AF$3,'Données masses'!$AF$8,IF(L64='Données masses'!$AG$3,'Données masses'!$AG$8,IF(L64='Données masses'!$AH$3,'Données masses'!$AH$8,IF(L64='Données masses'!$AI$3,'Données masses'!$AI$8,IF(L64='Données masses'!$AJ$3,'Données masses'!$AJ$8,IF(L64='Données masses'!$AK$3,'Données masses'!$AK$8,IF(L64='Données masses'!$AL$3,'Données masses'!$AL$8,IF(L64='Données masses'!$AM$3,'Données masses'!$AM$8,IF(L64='Données masses'!$AN$3,'Données masses'!$AN$8,IF(L64='Données masses'!$AO$3,'Données masses'!$AO$8,IF(L64='Données masses'!$AP$3,'Données masses'!$AP$8,\"Erreur\")))))))))))))))))))))))))))))))))))))))","v":"/"}]
[null,"Indication de la balance (g) :",null,null,"xbal",0.10009999999999999,50.000300000000003,100.0003,150,219.99979999999999,"/","/"]
[null,"Erreur d'indication relevée (g) :",null,null,"Ei",{"$f":"(IF(OR(ISBLANK(F64),ISBLANK(F66),F64=\"/\"),\"/\",(ABS(F65-F66))))","v":9.6999999999999864E-5},2.8100000000108594E-4,2.8499999999098691E-4,3.399999999942338E-5,2.6100000002315937E-4,"/","/"]
[]
[null,"Excentration (g)"]
[null,{"$f":"IF(OR(C17=S20,C17=S21,C17=S22,C17=S23,C17=S24,C17=S25),(HYPERLINK(\"[C:\\Users\\b.bevalot\\Desktop\\Balance\\10076_MO-A-RS_MP-001-06_Etalonnage_Vérification_d_.docx]dilumat\",\"Excentration pour un DILUMAT.\")),IF(OR(C17=S19,C17=S27,C17=S28),(HYPERLINK(\"[C:\\Users\\b.bevalot\\Desktop\\Balance\\10076_MO-A-RS_MP-001-06_Etalonnage_Vérification_d_.docx]cercle\",\"Excentration pour une balance à plateau circulaire.\")),IF(OR(C17=S26,C17=S18),(HYPERLINK(\"[C:\\Users\\b.bevalot\\Desktop\\Balance\\10076_MO-A-RS_MP-001-06_Etalonnage_Vérification_d_.docx]carré\",\"Excentration pour une balance à plateau rectangle.\")),\"/\")))","v":"Excentration pour une balance à plateau circulaire."}]
[null,"Charge appliquée :",null,null,null,100]
[null,"Point testé",null,"centre",1,2,3,4," "]
[null,"Valeur de référence Ic :",null,100.0001]
[null,"Valeur lue Ii :",null,null,100.0008,100.0005,99.999399999999994,100.0001]
[null,"Ii- Ic :",null,null,{"$f":"IF(OR(ISBLANK($D$73),ISBLANK(E74),$D$73=\"/\",E74=\"/\"),\"/\",ABS(E74-$D$73))","v":6.9999999999481588E-4},{"$f":"IF(OR(ISBLANK($D$73),ISBLANK(F74),$D$73=\"/\",F74=\"/\"),\"/\",ABS(F74-$D$73))","v":3.9999999999906777E-4},{"$f":"IF(OR(ISBLANK($D$73),ISBLANK(G74),$D$73=\"/\",G74=\"/\"),\"/\",ABS(G74-$D$73))","v":7.0000000000902673E-4},{"$f":"IF(OR(ISBLANK($D$73),ISBLANK(H74),$D$73=\"/\",H74=\"/\"),\"/\",ABS(H74-$D$73))","v":0}]
[null,"Incertitude type :",null,null,{"$f":"IF(OR(ISBLANK(E75:H75),E75:H75=\"/\"),\"/\",(MAX(E75:H75)/SQRT(6)))","v":2.8577380332838929E-4}]
[]
[null,"Exploitation des essais :"]
[]
[null,"Phase 1 : Détermination des erreurs d’indication de l’instrument de pesage et des incertitudes associées"]
[null,"Incertitude-type"]
[null,"ORIGINE","Composante",null,null,null,"Charges appliquées (g) :"]
[null,null,"Grandeur",null,"Source","Loi de probabilité",{"$f":"IF(ISBLANK(F64),\"/\",F64)","v":0.1},50,100,150,220,"/","/"]
[null,"Détermination de l'erreur d'indication","Répétabilité des pesées de\nl'étalon de masse (g)",null,"Etalonnage","Normale",{"$f":"IF(G83=\"/\",\"/\",IF(AND($C$49>0,G83<=$C$49,OR($D$49=0,G83<$D$49)),$C$60,IF(OR(ISBLANK($D$49),G83<=C49),$C$60,$D$60)))","v":8.1649658089681535E-5},{"$f":"IF(H83=\"/\",\"/\",IF(AND($C$49>0,H83<=$C$49,OR($D$49=0,H83<$D$49)),$C$60,IF(OR(ISBLANK($D$49),H83<=B49),$C$60,$D$60)))","v":8.1649658089681535E-5},8.1649658089681535E-5,8.1649658089681535E-5,8.1649658089681535E-5,"/","/","<- attention aux étendues"]
[null,null,"Résoution à vide (g)",null,"Indicateur nimérique","Triangulaire",{"$f":"IF(AND(G83<>\"/\",$J$31>0),$J$31/SQRT(6),\"/\")","v":4.0824829046386304E-5},{"$f":"IF(AND(H83<>\"/\",$J$31>0),$J$31/SQRT(6),\"/\")","v":4.0824829046386304E-5},4.0824829046386304E-5,4.0824829046386304E-5,4.0824829046386304E-5,"/","/","<- a modifier (intégrer les 2 echelons )"]
[null,null,"Résolution en charge\n(charge = étalon de masse) (g)",null,null,null,{"$f":"IF(AND(G83<=$J$30,G83<$K$30,G83<>\"/\"),$J$31/SQRT(6),IF(AND(G83>$J$30,G83<=$K$30,G83<>\"/\"),$K$31/SQRT(6),\"/\"))","v":4.0824829046386304E-5},{"$f":"IF(AND(H83<=$J$30,H83<$K$30,H83<>\"/\"),$J$31/SQRT(6),IF(AND(H83>$J$30,H83<=$K$30,H83<>\"/\"),$K$31/SQRT(6),\"/\"))","v":4.0824829046386304E-5},4.0824829046386304E-5,4.0824829046386304E-5,4.0824829046386304E-5,"/","/"]
[null,null,"Etalons de masse étalonnées (g)",null,"Certificat d'étalonnage","Normale\nk = 2",{"$f":"IF(OR(ISBLANK(G83),G83=\"/\"),\"/\",IF(G83='Données masses'!$D$3,'Données masses'!$D$12,IF(AND(G83='Données masses'!$E$3,'Données masses'!$E$9=\"oui\",OR('Données masses'!$F$9=\"non\",'Données masses'!$F$9=\"doublon\")),'Données masses'!$E$12,IF(AND(G83='Données masses'!$F$3,'Données masses'!$F$9=\"oui\",OR('Données masses'!$E$9=\"non\",'Données masses'!$E$9=\"doublon\")),'Données masses'!$F$12,IF(G83='Données masses'!$G$3,'Données masses'!$G$12,IF(G83='Données masses'!$H$3,'Données masses'!$H$12,IF(AND(G83='Données masses'!$I$3,'Données masses'!$I$9=\"oui\",OR('Données masses'!$J$9=\"non\",'Données masses'!$J$9=\"doublon\")),'Données masses'!$I$12,IF(AND(G83='Données masses'!$J$3,'Données masses'!$J$9=\"oui\",OR('Données masses'!$I$9=\"non\",'Données masses'!$I$9=\"doublon\")),'Données masses'!$J$12,IF(G83='Données masses'!$K$3,'Données masses'!$K$12,IF(G83='Données masses'!$L$3,'Données masses'!$L$12,IF(AND(G83='Données masses'!$M$3,'Données masses'!$M$9=\"oui\",OR('Données masses'!$N$9=\"non\",'Données masses'!$N$9=\"doublon\")),'Données masses'!$M$12,IF(AND(G83='Données masses'!$N$3,'Données masses'!$N$9=\"oui\",OR('Données masses'!$M$9=\"non\",'Données masses'!$M$9=\"doublon\")),'Données masses'!$N$12,IF(G83='Données masses'!$O$3,'Données masses'!$O$12,IF(G83='Données masses'!$P$3,'Données masses'!$P$12,IF(AND(G83='Données masses'!$Q$3,'Données masses'!$Q$9=\"oui\",OR('Données masses'!$R$9=\"non\",'Données masses'!$R$9=\"doublon\")),'Données masses'!$Q$12,IF(AND(G83='Données masses'!$R$3,'Données masses'!$R$9=\"oui\",OR('Données masses'!$Q$9=\"non\",'Données masses'!$Q$9=\"doublon\")),'Données masses'!$R$12,IF(G83='Données masses'!$S$3,'Données masses'!$S$12,IF(G83='Données masses'!$T$3,'Données masses'!$T$12,IF(AND(G83='Données masses'!$U$3,'Données masses'!$U$9=\"oui\",OR('Données masses'!$V$9=\"non\",'Données masses'!$V$9=\"doublon\")),'Données masses'!$U$12,IF(AND(G83='Données masses'!$V$3,'Données masses'!$V$9=\"oui\",OR('Données masses'!$U$9=\"non\",'Données masses'!$U$9=\"doublon\")),'Données masses'!$V$12,IF(G83='Données masses'!$W$3,'Données masses'!$W$12,IF(G83='Données masses'!$X$3,'Données masses'!$X$12,IF(AND(G83='Données masses'!$Y$3,'Données masses'!$Y$9=\"oui\",OR('Données masses'!$Z$9=\"non\",'Données masses'!$Z$9=\"doublon\")),'Données masses'!$Y$12,IF(AND(G83='Données masses'!$Z$3,'Données masses'!$Z$9=\"oui\",OR('Données masses'!$Y$9=\"non\",'Données masses'!$Y$9=\"doublon\")),'Données masses'!$Z$12,IF(G83='Données masses'!$AA$3,'Données masses'!$AA$12,IF(G83='Données masses'!$AB$3,'Données masses'!$AB$12,IF(AND(G83='Données masses'!$AC$3,'Données masses'!$AC$9=\"oui\",OR('Données masses'!$AD$9=\"non\",'Données masses'!$AD$9=\"doublon\")),'Données masses'!$AC$12,IF(AND(G83='Données masses'!$AD$3,'Données masses'!$AD$9=\"oui\",OR('Données masses'!$AC$9=\"non\",'Données masses'!$AC$9=\"doublon\")),'Données masses'!$AD$12,IF(G83='Données masses'!$AF$3,'Données masses'!$AF$12,IF(G83='Données masses'!$AG$3,'Données masses'!$AG$12,IF(G83='Données masses'!$AH$3,'Données masses'!$AH$12,IF(G83='Données masses'!$AI$3,'Données masses'!$AI$12,IF(G83='Données masses'!$AJ$3,'Données masses'!$AJ$12,IF(G83='Données masses'!$AK$3,'Données masses'!$AK$12,IF(G83='Données masses'!$AL$3,'Données masses'!$AL$12,IF(G83='Données masses'!$AM$3,'Données masses'!$AM$12,IF(G83='Données masses'!$AN$3,'Données masses'!$AN$12,IF(G83='Données masses'!$AO$3,'Données masses'!$AO$12,IF(G83='Données masses'!$AP$3,'Données masses'!$AP$12,\"ERREUR!!!!!\")))))))))))))))))))))))))))))))))))))))","v":3.5355339059327378E-6},{"$f":"IF(OR(ISBLANK(H83),H83=\"/\"),\"/\",IF(H83='Données masses'!$D$3,'Données masses'!$D$12,IF(AND(H83='Données masses'!$E$3,'Données masses'!$E$9=\"oui\",OR('Données masses'!$F$9=\"non\",'Données masses'!$F$9=\"doublon\")),'Données masses'!$E$12,IF(AND(H83='Données masses'!$F$3,'Données masses'!$F$9=\"oui\",OR('Données masses'!$E$9=\"non\",'Données masses'!$E$9=\"doublon\")),'Données masses'!$F$12,IF(H83='Données masses'!$G$3,'Données masses'!$G$12,IF(H83='Données masses'!$H$3,'Données masses'!$H$12,IF(AND(H83='Données masses'!$I$3,'Données masses'!$I$9=\"oui\",OR('Données masses'!$J$9=\"non\",'Données masses'!$J$9=\"doublon\")),'Données masses'!$I$12,IF(AND(H83='Données masses'!$J$3,'Données masses'!$J$9=\"oui\",OR('Données masses'!$I$9=\"non\",'Données masses'!$I$9=\"doublon\")),'Données masses'!$J$12,IF(H83='Données masses'!$K$3,'Données masses'!$K$12,IF(H83='Données masses'!$L$3,'Données masses'!$L$12,IF(AND(H83='Données masses'!$M$3,'Données masses'!$M$9=\"oui\",OR('Données masses'!$N$9=\"non\",'Données masses'!$N$9=\"doublon\")),'Données masses'!$M$12,IF(AND(H83='Données masses'!$N$3,'Données masses'!$N$9=\"oui\",OR('Données masses'!$M$9=\"non\",'Données masses'!$M$9=\"doublon\")),'Données masses'!$N$12,IF(H83='Données masses'!$O$3,'Données masses'!$O$12,IF(H83='Données masses'!$P$3,'Données masses'!$P$12,IF(AND(H83='Données masses'!$Q$3,'Données masses'!$Q$9=\"oui\",OR('Données masses'!$R$9=\"non\",'Données masses'!$R$9=\"doublon\")),'Données masses'!$Q$12,IF(AND(H83='Données masses'!$R$3,'Données masses'!$R$9=\"oui\",OR('Données masses'!$Q$9=\"non\",'Données masses'!$Q$9=\"doublon\")),'Données masses'!$R$12,IF(H83='Données masses'!$S$3,'Données masses'!$S$12,IF(H83='Données masses'!$T$3,'Données masses'!$T$12,IF(AND(H83='Données masses'!$U$3,'Données masses'!$U$9=\"oui\",OR('Données masses'!$V$9=\"non\",'Données masses'!$V$9=\"doublon\")),'Données masses'!$U$12,IF(AND(H83='Données masses'!$V$3,'Données masses'!$V$9=\"oui\",OR('Données masses'!$U$9=\"non\",'Données masses'!$U$9=\"doublon\")),'Données masses'!$V$12,IF(H83='Données masses'!$W$3,'Données masses'!$W$12,IF(H83='Données masses'!$X$3,'Données masses'!$X$12,IF(AND(H83='Données masses'!$Y$3,'Données masses'!$Y$9=\"oui\",OR('Données masses'!$Z$9=\"non\",'Données masses'!$Z$9=\"doublon\")),'Données masses'!$Y$12,IF(AND(H83='Données masses'!$Z$3,'Données masses'!$Z$9=\"oui\",OR('Données masses'!$Y$9=\"non\",'Données masses'!$Y$9=\"doublon\")),'Données masses'!$Z$12,IF(H83='Données masses'!$AA$3,'Données masses'!$AA$12,IF(H83='Données masses'!$AB$3,'Données masses'!$AB$12,IF(AND(H83='Données masses'!$AC$3,'Données masses'!$AC$9=\"oui\",OR('Données masses'!$AD$9=\"non\",'Données masses'!$AD$9=\"doublon\")),'Données masses'!$AC$12,IF(AND(H83='Données masses'!$AD$3,'Données masses'!$AD$9=\"oui\",OR('Données masses'!$AC$9=\"non\",'Données masses'!$AC$9=\"doublon\")),'Données masses'!$AD$12,IF(H83='Données masses'!$AF$3,'Données masses'!$AF$12,IF(H83='Données masses'!$AG$3,'Données masses'!$AG$12,IF(H83='Données masses'!$AH$3,'Données masses'!$AH$12,IF(H83='Données masses'!$AI$3,'Données masses'!$AI$12,IF(H83='Données masses'!$AJ$3,'Données masses'!$AJ$12,IF(H83='Données masses'!$AK$3,'Données masses'!$AK$12,IF(H83='Données masses'!$AL$3,'Données masses'!$AL$12,IF(H83='Données masses'!$AM$3,'Données masses'!$AM$12,IF(H83='Données masses'!$AN$3,'Données masses'!$AN$12,IF(H83='Données masses'!$AO$3,'Données masses'!$AO$12,IF(H83='Données masses'!$AP$3,'Données masses'!$AP$12,\"ERREUR!!!!!\")))))))))))))))))))))))))))))))))))))))","v":2.1213203435596424E-5},{"$f":"IF(OR(ISBLANK(I83),I83=\"/\"),\"/\",IF(I83='Données masses'!$D$3,'Données masses'!$D$12,IF(AND(I83='Données masses'!$E$3,'Données masses'!$E$9=\"oui\",OR('Données masses'!$F$9=\"non\",'Données masses'!$F$9=\"doublon\")),'Données masses'!$E$12,IF(AND(I83='Données masses'!$F$3,'Données masses'!$F$9=\"oui\",OR('Données masses'!$E$9=\"non\",'Données masses'!$E$9=\"doublon\")),'Données masses'!$F$12,IF(I83='Données masses'!$G$3,'Données masses'!$G$12,IF(I83='Données masses'!$H$3,'Données masses'!$H$12,IF(AND(I83='Données masses'!$I$3,'Données masses'!$I$9=\"oui\",OR('Données masses'!$J$9=\"non\",'Données masses'!$J$9=\"doublon\")),'Données masses'!$I$12,IF(AND(I83='Données masses'!$J$3,'Données masses'!$J$9=\"oui\",OR('Données masses'!$I$9=\"non\",'Données masses'!$I$9=\"doublon\")),'Données masses'!$J$12,IF(I83='Données masses'!$K$3,'Données masses'!$K$12,IF(I83='Données masses'!$L$3,'Données masses'!$L$12,IF(AND(I83='Données masses'!$M$3,'Données masses'!$M$9=\"oui\",OR('Données masses'!$N$9=\"non\",'Données masses'!$N$9=\"doublon\")),'Données masses'!$M$12,IF(AND(I83='Données masses'!$N$3,'Données masses'!$N$9=\"oui\",OR('Données masses'!$M$9=\"non\",'Données masses'!$M$9=\"doublon\")),'Données masses'!$N$12,IF(I83='Données masses'!$O$3,'Données masses'!$O$12,IF(I83='Données masses'!$P$3,'Données masses'!$P$12,IF(AND(I83='Données masses'!$Q$3,'Données masses'!$Q$9=\"oui\",OR('Données masses'!$R$9=\"non\",'Données masses'!$R$9=\"doublon\")),'Données masses'!$Q$12,IF(AND(I83='Données masses'!$R$3,'Données masses'!$R$9=\"oui\",OR('Données masses'!$Q$9=\"non\",'Données masses'!$Q$9=\"doublon\")),'Données masses'!$R$12,IF(I83='Données masses'!$S$3,'Données masses'!$S$12,IF(I83='Données masses'!$T$3,'Données masses'!$T$12,IF(AND(I83='Données masses'!$U$3,'Données masses'!$U$9=\"oui\",OR('Données masses'!$V$9=\"non\",'Données masses'!$V$9=\"doublon\")),'Données masses'!$U$12,IF(AND(I83='Données masses'!$V$3,'Données masses'!$V$9=\"oui\",OR('Données masses'!$U$9=\"non\",'Données masses'!$U$9=\"doublon\")),'Données masses'!$V$12,IF(I83='Données masses'!$W$3,'Données masses'!$W$12,IF(I83='Données masses'!$X$3,'Données masses'!$X$12,IF(AND(I83='Données masses'!$Y$3,'Données masses'!$Y$9=\"oui\",OR('Données masses'!$Z$9=\"non\",'Données masses'!$Z$9=\"doublon\")),'Données masses'!$Y$12,IF(AND(I83='Données masses'!$Z$3,'Données masses'!$Z$9=\"oui\",OR('Données masses'!$Y$9=\"non\",'Données masses'!$Y$9=\"doublon\")),'Données masses'!$Z$12,IF(I83='Données masses'!$AA$3,'Données masses'!$AA$12,IF(I83='Données masses'!$AB$3,'Données masses'!$AB$12,IF(AND(I83='Données masses'!$AC$3,'Données masses'!$AC$9=\"oui\",OR('Données masses'!$AD$9=\"non\",'Données masses'!$AD$9=\"doublon\")),'Données masses'!$AC$12,IF(AND(I83='Données masses'!$AD$3,'Données masses'!$AD$9=\"oui\",OR('Données masses'!$AC$9=\"non\",'Données masses'!$AC$9=\"doublon\")),'Données masses'!$AD$12,IF(I83='Données masses'!$AF$3,'Données masses'!$AF$12,IF(I83='Données masses'!$AG$3,'Données masses'!$AG$12,IF(I83='Données masses'!$AH$3,'Données masses'!$AH$12,IF(I83='Données masses'!$AI$3,'Données masses'!$AI$12,IF(I83='Données masses'!$AJ$3,'Données masses'!$AJ$12,IF(I83='Données masses'!$AK$3,'Données masses'!$AK$12,IF(I83='Données masses'!$AL$3,'Données masses'!$AL$12,IF(I83='Données masses'!$AM$3,'Données masses'!$AM$12,IF(I83='Données masses'!$AN$3,'Données masses'!$AN$12,IF(I83='Données masses'!$AO$3,'Données masses'!$AO$12,IF(I83='Données masses'!$AP$3,'Données masses'!$AP$12,\"ERREUR!!!!!\")))))))))))))))))))))))))))))))))))))))","v":3.5355339059327377E-5},{"$f":"IF(OR(ISBLANK(J83),J83=\"/\"),\"/\",IF(J83='Données masses'!$D$3,'Données masses'!$D$12,IF(AND(J83='Données masses'!$E$3,'Données masses'!$E$9=\"oui\",OR('Données masses'!$F$9=\"non\",'Données masses'!$F$9=\"doublon\")),'Données masses'!$E$12,IF(AND(J83='Données masses'!$F$3,'Données masses'!$F$9=\"oui\",OR('Données masses'!$E$9=\"non\",'Données masses'!$E$9=\"doublon\")),'Données masses'!$F$12,IF(J83='Données masses'!$G$3,'Données masses'!$G$12,IF(J83='Données masses'!$H$3,'Données masses'!$H$12,IF(AND(J83='Données masses'!$I$3,'Données masses'!$I$9=\"oui\",OR('Données masses'!$J$9=\"non\",'Données masses'!$J$9=\"doublon\")),'Données masses'!$I$12,IF(AND(J83='Données masses'!$J$3,'Données masses'!$J$9=\"oui\",OR('Données masses'!$I$9=\"non\",'Données masses'!$I$9=\"doublon\")),'Données masses'!$J$12,IF(J83='Données masses'!$K$3,'Données masses'!$K$12,IF(J83='Données masses'!$L$3,'Données masses'!$L$12,IF(AND(J83='Données masses'!$M$3,'Données masses'!$M$9=\"oui\",OR('Données masses'!$N$9=\"non\",'Données masses'!$N$9=\"doublon\")),'Données masses'!$M$12,IF(AND(J83='Données masses'!$N$3,'Données masses'!$N$9=\"oui\",OR('Données masses'!$M$9=\"non\",'Données masses'!$M$9=\"doublon\")),'Données masses'!$N$12,IF(J83='Données masses'!$O$3,'Données masses'!$O$12,IF(J83='Données masses'!$P$3,'Données masses'!$P$12,IF(AND(J83='Données masses'!$Q$3,'Données masses'!$Q$9=\"oui\",OR('Données masses'!$R$9=\"non\",'Données masses'!$R$9=\"doublon\")),'Données masses'!$Q$12,IF(AND(J83='Données masses'!$R$3,'Données masses'!$R$9=\"oui\",OR('Données masses'!$Q$9=\"non\",'Données masses'!$Q$9=\"doublon\")),'Données masses'!$R$12,IF(J83='Données masses'!$S$3,'Données masses'!$S$12,IF(J83='Données masses'!$T$3,'Données masses'!$T$12,IF(AND(J83='Données masses'!$U$3,'Données masses'!$U$9=\"oui\",OR('Données masses'!$V$9=\"non\",'Données masses'!$V$9=\"doublon\")),'Données masses'!$U$12,IF(AND(J83='Données masses'!$V$3,'Données masses'!$V$9=\"oui\",OR('Données masses'!$U$9=\"non\",'Données masses'!$U$9=\"doublon\")),'Données masses'!$V$12,IF(J83='Données masses'!$W$3,'Données masses'!$W$12,IF(J83='Données masses'!$X$3,'Données masses'!$X$12,IF(AND(J83='Données masses'!$Y$3,'Données masses'!$Y$9=\"oui\",OR('Données masses'!$Z$9=\"non\",'Données masses'!$Z$9=\"doublon\")),'Données masses'!$Y$12,IF(AND(J83='Données masses'!$Z$3,'Données masses'!$Z$9=\"oui\",OR('Données masses'!$Y$9=\"non\",'Données masses'!$Y$9=\"doublon\")),'Données masses'!$Z$12,IF(J83='Données masses'!$AA$3,'Données masses'!$AA$12,IF(J83='Données masses'!$AB$3,'Données masses'!$AB$12,IF(AND(J83='Données masses'!$AC$3,'Données masses'!$AC$9=\"oui\",OR('Données masses'!$AD$9=\"non\",'Données masses'!$AD$9=\"doublon\")),'Données masses'!$AC$12,IF(AND(J83='Données masses'!$AD$3,'Données masses'!$AD$9=\"oui\",OR('Données masses'!$AC$9=\"non\",'Données masses'!$AC$9=\"doublon\")),'Données masses'!$AD$12,IF(J83='Données masses'!$AF$3,'Données masses'!$AF$12,IF(J83='Données masses'!$AG$3,'Données masses'!$AG$12,IF(J83='Données masses'!$AH$3,'Données masses'!$AH$12,IF(J83='Données masses'!$AI$3,'Données masses'!$AI$12,IF(J83='Données masses'!$AJ$3,'Données masses'!$AJ$12,IF(J83='Données masses'!$AK$3,'Données masses'!$AK$12,IF(J83='Données masses'!$AL$3,'Données masses'!$AL$12,IF(J83='Données masses'!$AM$3,'Données masses'!$AM$12,IF(J83='Données masses'!$AN$3,'Données masses'!$AN$12,IF(J83='Données masses'!$AO$3,'Données masses'!$AO$12,IF(J83='Données masses'!$AP$3,'Données masses'!$AP$12,\"ERREUR!!!!!\")))))))))))))))))))))))))))))))))))))))","v":5.6568542494923805E-5},{"$f":"IF(OR(ISBLANK(K83),K83=\"/\"),\"/\",IF(K83='Données masses'!$D$3,'Données masses'!$D$12,IF(AND(K83='Données masses'!$E$3,'Données masses'!$E$9=\"oui\",OR('Données masses'!$F$9=\"non\",'Données masses'!$F$9=\"doublon\")),'Données masses'!$E$12,IF(AND(K83='Données masses'!$F$3,'Données masses'!$F$9=\"oui\",OR('Données masses'!$E$9=\"non\",'Données masses'!$E$9=\"doublon\")),'Données masses'!$F$12,IF(K83='Données masses'!$G$3,'Données masses'!$G$12,IF(K83='Données masses'!$H$3,'Données masses'!$H$12,IF(AND(K83='Données masses'!$I$3,'Données masses'!$I$9=\"oui\",OR('Données masses'!$J$9=\"non\",'Données masses'!$J$9=\"doublon\")),'Données masses'!$I$12,IF(AND(K83='Données masses'!$J$3,'Données masses'!$J$9=\"oui\",OR('Données masses'!$I$9=\"non\",'Données masses'!$I$9=\"doublon\")),'Données masses'!$J$12,IF(K83='Données masses'!$K$3,'Données masses'!$K$12,IF(K83='Données masses'!$L$3,'Données masses'!$L$12,IF(AND(K83='Données masses'!$M$3,'Données masses'!$M$9=\"oui\",OR('Données masses'!$N$9=\"non\",'Données masses'!$N$9=\"doublon\")),'Données masses'!$M$12,IF(AND(K83='Données masses'!$N$3,'Données masses'!$N$9=\"oui\",OR('Données masses'!$M$9=\"non\",'Données masses'!$M$9=\"doublon\")),'Données masses'!$N$12,IF(K83='Données masses'!$O$3,'Données masses'!$O$12,IF(K83='Données masses'!$P$3,'Données masses'!$P$12,IF(AND(K83='Données masses'!$Q$3,'Données masses'!$Q$9=\"oui\",OR('Données masses'!$R$9=\"non\",'Données masses'!$R$9=\"doublon\")),'Données masses'!$Q$12,IF(AND(K83='Données masses'!$R$3,'Données masses'!$R$9=\"oui\",OR('Données masses'!$Q$9=\"non\",'Données masses'!$Q$9=\"doublon\")),'Données masses'!$R$12,IF(K83='Données masses'!$S$3,'Données masses'!$S$12,IF(K83='Données masses'!$T$3,'Données masses'!$T$12,IF(AND(K83='Données masses'!$U$3,'Données masses'!$U$9=\"oui\",OR('Données masses'!$V$9=\"non\",'Données masses'!$V$9=\"doublon\")),'Données masses'!$U$12,IF(AND(K83='Données masses'!$V$3,'Données masses'!$V$9=\"oui\",OR('Données masses'!$U$9=\"non\",'Données masses'!$U$9=\"doublon\")),'Données masses'!$V$12,IF(K83='Données masses'!$W$3,'Données masses'!$W$12,IF(K83='Données masses'!$X$3,'Données masses'!$X$12,IF(AND(K83='Données masses'!$Y$3,'Données masses'!$Y$9=\"oui\",OR('Données masses'!$Z$9=\"non\",'Données masses'!$Z$9=\"doublon\")),'Données masses'!$Y$12,IF(AND(K83='Données masses'!$Z$3,'Données masses'!$Z$9=\"oui\",OR('Données masses'!$Y$9=\"non\",'Données masses'!$Y$9=\"doublon\")),'Données masses'!$Z$12,IF(K83='Données masses'!$AA$3,'Données masses'!$AA$12,IF(K83='Données masses'!$AB$3,'Données masses'!$AB$12,IF(AND(K83='Données masses'!$AC$3,'Données masses'!$AC$9=\"oui\",OR('Données masses'!$AD$9=\"non\",'Données masses'!$AD$9=\"doublon\")),'Données masses'!$AC$12,IF(AND(K83='Données masses'!$AD$3,'Données masses'!$AD$9=\"oui\",OR('Données masses'!$AC$9=\"non\",'Données masses'!$AC$9=\"doublon\")),'Données masses'!$AD$12,IF(K83='Données masses'!$AF$3,'Données masses'!$AF$12,IF(K83='Données masses'!$AG$3,'Données masses'!$AG$12,IF(K83='Données masses'!$AH$3,'Données masses'!$AH$12,IF(K83='Données masses'!$AI$3,'Données masses'!$AI$12,IF(K83='Données masses'!$AJ$3,'Données masses'!$AJ$12,IF(K83='Données masses'!$AK$3,'Données masses'!$AK$12,IF(K83='Données masses'!$AL$3,'Données masses'!$AL$12,IF(K83='Données masses'!$AM$3,'Données masses'!$AM$12,IF(K83='Données masses'!$AN$3,'Données masses'!$AN$12,IF(K83='Données masses'!$AO$3,'Données masses'!$AO$12,IF(K83='Données masses'!$AP$3,'Données masses'!$AP$12,\"ERREUR!!!!!\")))))))))))))))))))))))))))))))))))))))","v":8.9095454429504985E-5},{"$f":"IF(OR(ISBLANK(L83),L83=\"/\"),\"/\",IF(L83='Données masses'!$D$3,'Données masses'!$D$12,IF(AND(L83='Données masses'!$E$3,'Données masses'!$E$9=\"oui\",OR('Données masses'!$F$9=\"non\",'Données masses'!$F$9=\"doublon\")),'Données masses'!$E$12,IF(AND(L83='Données masses'!$F$3,'Données masses'!$F$9=\"oui\",OR('Données masses'!$E$9=\"non\",'Données masses'!$E$9=\"doublon\")),'Données masses'!$F$12,IF(L83='Données masses'!$G$3,'Données masses'!$G$12,IF(L83='Données masses'!$H$3,'Données masses'!$H$12,IF(AND(L83='Données masses'!$I$3,'Données masses'!$I$9=\"oui\",OR('Données masses'!$J$9=\"non\",'Données masses'!$J$9=\"doublon\")),'Données masses'!$I$12,IF(AND(L83='Données masses'!$J$3,'Données masses'!$J$9=\"oui\",OR('Données masses'!$I$9=\"non\",'Données masses'!$I$9=\"doublon\")),'Données masses'!$J$12,IF(L83='Données masses'!$K$3,'Données masses'!$K$12,IF(L83='Données masses'!$L$3,'Données masses'!$L$12,IF(AND(L83='Données masses'!$M$3,'Données masses'!$M$9=\"oui\",OR('Données masses'!$N$9=\"non\",'Données masses'!$N$9=\"doublon\")),'Données masses'!$M$12,IF(AND(L83='Données masses'!$N$3,'Données masses'!$N$9=\"oui\",OR('Données masses'!$M$9=\"non\",'Données masses'!$M$9=\"doublon\")),'Données masses'!$N$12,IF(L83='Données masses'!$O$3,'Données masses'!$O$12,IF(L83='Données masses'!$P$3,'Données masses'!$P$12,IF(AND(L83='Données masses'!$Q$3,'Données masses'!$Q$9=\"oui\",OR('Données masses'!$R$9=\"non\",'Données masses'!$R$9=\"doublon\")),'Données masses'!$Q$12,IF(AND(L83='Données masses'!$R$3,'Données masses'!$R$9=\"oui\",OR('Données masses'!$Q$9=\"non\",'Données masses'!$Q$9=\"doublon\")),'Données masses'!$R$12,IF(L83='Données masses'!$S$3,'Données masses'!$S$12,IF(L83='Données masses'!$T$3,'Données masses'!$T$12,IF(AND(L83='Données masses'!$U$3,'Données masses'!$U$9=\"oui\",OR('Données masses'!$V$9=\"non\",'Données masses'!$V$9=\"doublon\")),'Données masses'!$U$12,IF(AND(L83='Données masses'!$V$3,'Données masses'!$V$9=\"oui\",OR('Données masses'!$U$9=\"non\",'Données masses'!$U$9=\"doublon\")),'Données masses'!$V$12,IF(L83='Données masses'!$W$3,'Données masses'!$W$12,IF(L83='Données masses'!$X$3,'Données masses'!$X$12,IF(AND(L83='Données masses'!$Y$3,'Données masses'!$Y$9=\"oui\",OR('Données masses'!$Z$9=\"non\",'Données masses'!$Z$9=\"doublon\")),'Données masses'!$Y$12,IF(AND(L83='Données masses'!$Z$3,'Données masses'!$Z$9=\"oui\",OR('Données masses'!$Y$9=\"non\",'Données masses'!$Y$9=\"doublon\")),'Données masses'!$Z$12,IF(L83='Données masses'!$AA$3,'Données masses'!$AA$12,IF(L83='Données masses'!$AB$3,'Données masses'!$AB$12,IF(AND(L83='Données masses'!$AC$3,'Données masses'!$AC$9=\"oui\",OR('Données masses'!$AD$9=\"non\",'Données masses'!$AD$9=\"doublon\")),'Données masses'!$AC$12,IF(AND(L83='Données masses'!$AD$3,'Données masses'!$AD$9=\"oui\",OR('Données masses'!$AC$9=\"non\",'Données masses'!$AC$9=\"doublon\")),'Données masses'!$AD$12,IF(L83='Données masses'!$AF$3,'Données masses'!$AF$12,IF(L83='Données masses'!$AG$3,'Données masses'!$AG$12,IF(L83='Données masses'!$AH$3,'Données masses'!$AH$12,IF(L83='Données masses'!$AI$3,'Données masses'!$AI$12,IF(L83='Données masses'!$AJ$3,'Données masses'!$AJ$12,IF(L83='Données masses'!$AK$3,'Données masses'!$AK$12,IF(L83='Données masses'!$AL$3,'Données masses'!$AL$12,IF(L83='Données masses'!$AM$3,'Données masses'!$AM$12,IF(L83='Données masses'!$AN$3,'Données masses'!$AN$12,IF(L83='Données masses'!$AO$3,'Données masses'!$AO$12,IF(L83='Données masses'!$AP$3,'Données masses'!$AP$12,\"ERREUR!!!!!\")))))))))))))))))))))))))))))))))))))))","v":"/"},{"$f":"IF(OR(ISBLANK(M83),M83=\"/\"),\"/\",IF(M83='Données masses'!$D$3,'Données masses'!$D$12,IF(AND(M83='Données masses'!$E$3,'Données masses'!$E$9=\"oui\",OR('Données masses'!$F$9=\"non\",'Données masses'!$F$9=\"doublon\")),'Données masses'!$E$12,IF(AND(M83='Données masses'!$F$3,'Données masses'!$F$9=\"oui\",OR('Données masses'!$E$9=\"non\",'Données masses'!$E$9=\"doublon\")),'Données masses'!$F$12,IF(M83='Données masses'!$G$3,'Données masses'!$G$12,IF(M83='Données masses'!$H$3,'Données masses'!$H$12,IF(AND(M83='Données masses'!$I$3,'Données masses'!$I$9=\"oui\",OR('Données masses'!$J$9=\"non\",'Données masses'!$J$9=\"doublon\")),'Données masses'!$I$12,IF(AND(M83='Données masses'!$J$3,'Données masses'!$J$9=\"oui\",OR('Données masses'!$I$9=\"non\",'Données masses'!$I$9=\"doublon\")),'Données masses'!$J$12,IF(M83='Données masses'!$K$3,'Données masses'!$K$12,IF(M83='Données masses'!$L$3,'Données masses'!$L$12,IF(AND(M83='Données masses'!$M$3,'Données masses'!$M$9=\"oui\",OR('Données masses'!$N$9=\"non\",'Données masses'!$N$9=\"doublon\")),'Données masses'!$M$12,IF(AND(M83='Données masses'!$N$3,'Données masses'!$N$9=\"oui\",OR('Données masses'!$M$9=\"non\",'Données masses'!$M$9=\"doublon\")),'Données masses'!$N$12,IF(M83='Données masses'!$O$3,'Données masses'!$O$12,IF(M83='Données masses'!$P$3,'Données masses'!$P$12,IF(AND(M83='Données masses'!$Q$3,'Données masses'!$Q$9=\"oui\",OR('Données masses'!$R$9=\"non\",'Données masses'!$R$9=\"doublon\")),'Données masses'!$Q$12,IF(AND(M83='Données masses'!$R$3,'Données masses'!$R$9=\"oui\",OR('Données masses'!$Q$9=\"non\",'Données masses'!$Q$9=\"doublon\")),'Données masses'!$R$12,IF(M83='Données masses'!$S$3,'Données masses'!$S$12,IF(M83='Données masses'!$T$3,'Données masses'!$T$12,IF(AND(M83='Données masses'!$U$3,'Données masses'!$U$9=\"oui\",OR('Données masses'!$V$9=\"non\",'Données masses'!$V$9=\"doublon\")),'Données masses'!$U$12,IF(AND(M83='Données masses'!$V$3,'Données masses'!$V$9=\"oui\",OR('Données masses'!$U$9=\"non\",'Données masses'!$U$9=\"doublon\")),'Données masses'!$V$12,IF(M83='Données masses'!$W$3,'Données masses'!$W$12,IF(M83='Données masses'!$X$3,'Données masses'!$X$12,IF(AND(M83='Données masses'!$Y$3,'Données masses'!$Y$9=\"oui\",OR('Données masses'!$Z$9=\"non\",'Données masses'!$Z$9=\"doublon\")),'Données masses'!$Y$12,IF(AND(M83='Données masses'!$Z$3,'Données masses'!$Z$9=\"oui\",OR('Données masses'!$Y$9=\"non\",'Données masses'!$Y$9=\"doublon\")),'Données masses'!$Z$12,IF(M83='Données masses'!$AA$3,'Données masses'!$AA$12,IF(M83='Données masses'!$AB$3,'Données masses'!$AB$12,IF(AND(M83='Données masses'!$AC$3,'Données masses'!$AC$9=\"oui\",OR('Données masses'!$AD$9=\"non\",'Données masses'!$AD$9=\"doublon\")),'Données masses'!$AC$12,IF(AND(M83='Données masses'!$AD$3,'Données masses'!$AD$9=\"oui\",OR('Données masses'!$AC$9=\"non\",'Données masses'!$AC$9=\"doublon\")),'Données masses'!$AD$12,IF(M83='Données masses'!$AF$3,'Données masses'!$AF$12,IF(M83='Données masses'!$AG$3,'Données masses'!$AG$12,IF(M83='Données masses'!$AH$3,'Données masses'!$AH$12,IF(M83='Données masses'!$AI$3,'Données masses'!$AI$12,IF(M83='Données masses'!$AJ$3,'Données masses'!$AJ$12,IF(M83='Données masses'!$AK$3,'Données masses'!$AK$12,IF(M83='Données masses'!$AL$3,'Données masses'!$AL$12,IF(M83='Données masses'!$AM$3,'Données masses'!$AM$12,IF(M83='Données masses'!$AN$3,'Données masses'!$AN$12,IF(M83='Données masses'!$AO$3,'Données masses'!$AO$12,IF(M83='Données masses'!$AP$3,'Données masses'!$AP$12,\"ERREUR!!!!!\")))))))))))))))))))))))))))))))))))))))","v":"/"},"<- toujours la même masse qui sert pour les doublons 2000+1000 x²+y² ou racine ( (x+y)²+(xp+yp)²) REVOIR la formule"]
[null,null,"Influence de la température (g)",null,"Données","Rectangulaire",{"$f":"IF(ISBLANK($M$29),\"Remplir C\",IF(AND($M$29>0,G86<>\"/\"),$M$29*($D$38/SQRT(3))*G83,\"/\"))","v":6.0621778264910966E-7},{"$f":"IF(ISBLANK($M$29),\"Remplir C\",IF(AND($M$29>0,H86<>\"/\"),$M$29*($D$38/SQRT(3))*H83,\"/\"))","v":3.0310889132455481E-4},6.0621778264910962E-4,9.0932667397366444E-4,1.3336791218280411E-3,"/","/"]
[null,"Incertitude - type composée (g)",null,null,null,null,{"$f":"IF(G83<>\"/\",SQRT((G84*G84)+(G85*G85)+(G86*G86)+(G87*G87)+(G88*G88)),\"/\")","v":1.0006431681421321E-4},{"$f":"IF(H83<>\"/\",SQRT((H84*H84)+(H85*H85)+(H86*H86)+(H87*H87)+(H88*H88)),\"/\")","v":3.1988279103367846E-4},{"$f":"IF(I83<>\"/\",SQRT((I84*I84)+(I85*I85)+(I86*I86)+(I87*I87)+(I88*I88)),\"/\")","v":6.1542668125415094E-4},{"$f":"IF(J83<>\"/\",SQRT((J84*J84)+(J85*J85)+(J86*J86)+(J87*J87)+(J88*J88)),\"/\")","v":9.165560539320561E-4},1.3403872574743129E-3,"/","/"]
[null,"Incertitude élargie (k=2) (g)",null,null,null,null,{"$f":"IF(G83<>\"/\",2*G89,\"/\")","v":2.0012863362842641E-4},{"$f":"IF(H83<>\"/\",2*H89,\"/\")","v":6.3976558206735692E-4},1.2308533625083019E-3,1.8331121078641122E-3,2.6807745149486258E-3,"/","/"]
[]
[null,"Incertitude - type composée (mg)",null,null,null,null,{"$f":"IF(G83<>\"/\",G89*1000,\"/\")","v":0.10006431681421321},0.31988279103367845,0.6154266812541509,0.91655605393205608,1.340387257474313,"/","/"]
[null,"Incertitude élargie (k=2) (mg)",null,null,null,null,{"$f":"IF(G83<>\"/\",2*G92,\"/\")","v":0.20012863362842642},0.6397655820673569,1.2308533625083018,1.8331121078641122,2.680774514948626,"/","/"]
[]
[null,"Phase 2 : Détermination de l’incertitude de l’instrument de pesage."]
[null,"Incertitude-type"]
[null,"ORIGINE","Composante",null,null,null,"Charges appliquées (g)"]
[null,null,"Grandeur",null,"Source","Loi de probabilité",{"$f":"IF(ISBLANK(F64),\"/\",F64)","v":0.1},50,100,150,220,"/","/"]
[null,"Résultat de la pesé d'un corps","Répétabilité des pesées de\nl'étalon de masse (g)",null,"Etalonnage","Normale",{"$f":"IF(G83=\"/\",\"/\",IF(AND($C$49>0,G83<=$C$49,OR($D$49=0,G83<$D$49)),$C$60,IF(OR(ISBLANK($D$49),G83<=A57),$C$60,$D$60)))","v":8.1649658089681535E-5},{"$f":"IF(H83=\"/\",\"/\",IF(AND($C$49>0,H83<=$C$49,OR($D$49=0,H83<$D$49)),$C$60,IF(OR(ISBLANK($D$49),H83<=B49),$C$60,$D$60)))","v":8.1649658089681535E-5},8.1649658089681535E-5,8.1649658089681535E-5,8.1649658089681535E-5,"/","/"]
[null,null,"Résoution à vide (g)",null,"Indicateur numérique","Normale \nk = 2",{"$f":"IF(AND(G83<>\"/\",$J$31>0),$J$31/SQRT(6),\"/\")","v":4.0824829046386304E-5},4.0824829046386304E-5,4.0824829046386304E-5,4.0824829046386304E-5,4.0824829046386304E-5,"/","/"]
[null,null,"Résolution en charge\n(charge = étalon de masse) (g)",null,null,null,{"$f":"IF(AND(G83<=$J$30,G83<$K$30,G83<>\"/\"),$J$31/SQRT(6),IF(AND(G83>$J$30,G83<=$K$30,G83<>\"/\"),$K$31/SQRT(6),\"/\"))","v":4.0824829046386304E-5},{"$f":"IF(AND(H83<=$J$30,H83<$K$30,H83<>\"/\"),$J$31/SQRT(6),IF(AND(H83>$J$30,H83<=$K$30,H83<>\"/\"),$K$31/SQRT(6),\"/\"))","v":4.0824829046386304E-5},4.0824829046386304E-5,4.0824829046386304E-5,4.0824829046386304E-5,"/","/"]
[null,"Erreur d'indication","Erreur d'indication non-corrigée (g)",null,"Calcul","Normale ?",{"$f":"IF(G98<>\"/\",SQRT((G89*G89)+((F67/2)*(F67/2))),\"/\")","v":1.1119854989834726E-4},3.4937837654847585E-4,6.3170899154453542E-4,9.1671369576301869E-4,1.3467250090506719E-3,"/","/"]
[null,null,"Pérénité des erreurs (g)",null,"Calcul ","Uniforme",{"$f":"G102","v":1.1119854989834726E-4},{"$f":"H102","v":3.4937837654847585E-4},{"$f":"I102","v":6.3170899154453542E-4},{"$f":"J102","v":9.1671369576301869E-4},{"$f":"K102","v":1.3467250090506719E-3},{"$f":"L102","v":"/"},"/"]
[null,"Influence de la température (g)",null,null,"Données","Rectengulaire",{"$f":"IF(ISBLANK($M$29),\"Remplir C.\",IF(G98<>\"/\",$M$29*$D$42/SQRT(3)*G98,\"/\"))","v":6.0621778264910716E-6},{"$f":"IF(ISBLANK($M$29),\"Remplir C.\",IF(H98<>\"/\",$M$29*$D$42/SQRT(3)*H98,\"/\"))","v":3.0310889132455355E-3},6.0621778264910711E-3,9.0932667397366062E-3,1.3336791218280356E-2,"/","/"]
[null,"Excentration de la charge (g)",null,null,"Etalonnage","Triangulaire",{"$f":"IF(G98<>\"/\",$E$76,\"/\")","v":2.8577380332838929E-4},{"$f":"IF(H98<>\"/\",$E$76,\"/\")","v":2.8577380332838929E-4},2.8577380332838929E-4,2.8577380332838929E-4,2.8577380332838929E-4,"/","/"]
[null,"Incertitude - type composée (g)",null,null,null,null,{"$f":"IF(G98<>\"/\",SQRT(G99*G99+G100*G100+G101*G101+G102*G102+G103*G103+G104*G104+G105*G105),\"/\")","v":3.4122375601247141E-4},{"$f":"IF(H98<>\"/\",SQRT(H99*H99+H100*H100+H101*H101+H102*H102+H103*H103+H104*H104+H105*H105),\"/\")","v":3.0859839867808073E-3},6.1351266626423206E-3,9.1902064539741025E-3,{"$f":"IF(K98<>\"/\",SQRT(K99*K99+K100*K100+K101*K101+K102*K102+K103*K103+K104*K104+K105*K105),\"/\")","v":1.34754963977834E-2},"/","/"]
[null,"Incertitude élargie (k=2) (g)",null,null,null,null,{"$f":"IF(G98<>\"/\",2*G106,\"/\")","v":6.8244751202494282E-4},{"$f":"IF(H98<>\"/\",2*H106,\"/\")","v":6.1719679735616146E-3},1.2270253325284641E-2,1.8380412907948205E-2,{"$f":"IF(K98<>\"/\",2*K106,\"/\")","v":2.69509927955668E-2},"/","/"]
[]
[null,"Incertitude - type composée (mg)",null,null,null,null,{"$f":"IF(G98<>\"/\",G106*1000,\"/\")","v":0.3412237560124714},{"$f":"IF(H98<>\"/\",H106*1000,\"/\")","v":3.0859839867808074},6.1351266626423211,9.1902064539741026,13.475496397783401,"/","/"]
[null,"Incertitude élargie (k=2) (mg)",null,null,null,null,{"$f":"IF(G98<>\"/\",2*G109,\"/\")","v":0.6824475120249428},{"$f":"IF(H98<>\"/\",2*H109,\"/\")","v":6.1719679735616149},12.270253325284642,18.380412907948205,{"$f":"IF(K98<>\"/\",2*K109,\"/\")","v":26.950992795566801},"/","/"]
[]
[null,"Remarques :"]
[]
[]
[]
[]
[]
[null,{"$f":"IF(AND(G99<>0,C17<>0),\"Les résultats de ce présent \"& C5 &\" se rapportent uniquement à l'appareil \"&C17&\".\"& CHAR(10) &\"---- Fin du \"&C5 &\". ---- \",\"\")","v":"Les résultats de ce présent Certificat d'étalonnage N°01-2023 se rapportent uniquement à l'appareil A12-BAL-0002.\n---- Fin du Certificat d'étalonnage N°01-2023. ---- "}]

{"sheet":"exploitation certificat","index":3,"n_rows":93,"n_cols":25,"rows_kept":93,"cut":false,"hidden":false,"merged":[[1,2,2,11],[43,18,47,22]]}
[]
[null,null,{"$f":"\"Exploitation du \"&'calcul '!S16&\".\"","v":"Exploitation du Certificat d'étalonnage N°01-2023."}]
[]
[]
[]
[null,"Appareil de pesage étalonné :",null,{"$f":"'calcul '!AB16","v":"A12-BAL-0002"}]
[null,"Opérateur ",null,{"$f":"'calcul '!AB17","v":0}]
[null,"Date d'étalonnage",null,{"$f":"'calcul '!AB18","v":"2023-12-08"}]
[null,"Date d'exploitation",null,"2023-12-08"]
[]
[]
[]
[null,"Critère(s) vérifié(s):"]
[null,"Linéarité (g):",null,null,2]
[null,"Répétabilité (g):",null,null,2]
[null,"% de la masse pesée :",null,null,2]
[null,"Début d'utilisation de l'appareil de pesage (g):",null,null,0.1]
[null,"Incertitude (g) :",null,null,"oui"]
[]
[null,"Linéarité :",{"$f":"IF(E14<>\"/\",E14,\"Non pris en compte.\")","v":2}]
[]
[null,"Masse pesée (g):",{"$f":"IF('calcul '!F64<>\"/\",'calcul '!F64,\"/\")","v":0.1},"Masse relevées (g):",null,{"$f":"IF('calcul '!F66<>\"/\",'calcul '!F66,\"/\")","v":0.10009999999999999},null,null,null,null,null,null,null,null,null,null,null,null,"Masse pesée (g):",{"$f":"IF('calcul '!F64<>\"/\",'calcul '!F64,#N/A)","v":0.1},"Masse relevées (g):",null,{"$f":"IF('calcul '!F66<>\"/\",'calcul '!F66,#N/A)","v":0.10009999999999999}]
[null,null,{"$f":"IF('calcul '!G64<>\"/\",'calcul '!G64,\"/\")","v":50},null,null,{"$f":"IF('calcul '!G66<>\"/\",'calcul '!G66,\"/\")","v":50.000300000000003},null,null,null,null,null,null,null,null,null,null,null,null,null,{"$f":"IF('calcul '!G64<>\"/\",'calcul '!G64,#N/A)","v":50},null,null,{"$f":"IF('calcul '!G66<>\"/\",'calcul '!G66,#N/A)","v":50.000300000000003}]
[null,null,{"$f":"IF('calcul '!H64<>\"/\",'calcul '!H64,\"/\")","v":100},null,null,{"$f":"IF('calcul '!H66<>\"/\",'calcul '!H66,\"/\")","v":100.0003},null,null,null,null,null,null,null,null,null,null,null,null,null,{"$f":"IF('calcul '!H64<>\"/\",'calcul '!H64,#N/A)","v":100},null,null,{"$f":"IF('calcul '!H66<>\"/\",'calcul '!H66,#N/A)","v":100.0003}]
[null,null,{"$f":"IF('calcul '!I64<>\"/\",'calcul '!I64,\"/\")","v":150},null,null,{"$f":"IF('calcul '!I66<>\"/\",'calcul '!I66,\"/\")","v":150},null,null,null,null,null,null,null,null,null,null,null,null,null,{"$f":"IF('calcul '!I64<>\"/\",'calcul '!I64,#N/A)","v":150},null,null,{"$f":"IF('calcul '!I66<>\"/\",'calcul '!I66,#N/A)","v":150}]
[null,null,{"$f":"IF('calcul '!J64<>\"/\",'calcul '!J64,\"/\")","v":220},null,null,{"$f":"IF('calcul '!J66<>\"/\",'calcul '!J66,\"/\")","v":219.99979999999999},null,null,null,null,null,null,null,null,null,null,null,null,null,{"$f":"IF('calcul '!J64<>\"/\",'calcul '!J64,#N/A)","v":220},null,null,{"$f":"IF('calcul '!J66<>\"/\",'calcul '!J66,#N/A)","v":219.99979999999999}]
[null,null,{"$f":"IF('calcul '!K64<>\"/\",'calcul '!K64,\"/\")","v":"/"},null,null,{"$f":"IF('calcul '!K66<>\"/\",'calcul '!K66,\"/\")","v":"/"},null,null,null,null,null,null,null,null,null,null,null,null,null,{"$f":"IF('calcul '!K64<>\"/\",'calcul '!K64,#N/A)","v":{"$error":"#N/A"}},null,null,{"$f":"IF('calcul '!K66<>\"/\",'calcul '!K66,#N/A)","v":{"$error":"#N/A"}}]
[null,null,{"$f":"IF('calcul '!L64<>\"/\",'calcul '!L64,\"/\")","v":"/"},null,null,{"$f":"IF('calcul '!L66<>\"/\",'calcul '!L66,\"/\")","v":"/"},null,null,null,null,null,null,null,null,null,{"$f":"IF(OR(C28<>\"/\",F28<>\"/\"),LINEST(F22:F28,C22:C28,TRUE,FALSE),IF(OR(C27<>\"/\",F27<>\"/\"),LINEST(F22:F27,C22:C27,TRUE,FALSE),IF(OR(C26<>\"/\",F26<>\"/\"),LINEST(F22:F26,C22:C26,TRUE,FALSE),IF(OR(C25<>\"/\",F25<>\"/\"),LINEST(F22:F25,C22:C25,TRUE,FALSE),\"erreur\"))))","v":0.99999825933861441},2.8106359731339126E-4,null,null,{"$f":"IF('calcul '!L64<>\"/\",'calcul '!L64,#N/A)","v":{"$error":"#N/A"}},null,null,{"$f":"IF('calcul '!L66<>\"/\",'calcul '!L66,#N/A)","v":{"$error":"#N/A"}}]
[null,null,null,null,null,null,null,null,null,null,null,null,null,null,null,{"$f":"LINEST(F22:F26,C22:C26,TRUE,FALSE)","v":0.99999825933861441},2.8106359731339126E-4]
[null,{"$f":"_xlfn.CONCAT(\"y=\",ROUND(P28,4),\"*x\",IF(Q28>0,\"+\",\"\"),ROUND(Q28,4))","v":"y=1*x+0,0003"}]
[]
[null,"y=a*x+b"]
[null,"linéarité = 1-a"]
[null,{"$f":"\"linéarité= \" &ROUND(1-P28,5)&\"(g)\"","v":"linéarité= 0(g)"},null,null,null,null,null,null,null,null,null,null,null,null,null,"marche bien mais pas trop pour notre cas "]
[null,null,null,null,null,null,null,null,null,null,null,null,null,null,null,{"$f":"\"linéarité= \" &ROUND(1-P28,(LEN(_xlfn.TEXTAFTER(E14,\",\"))+2))&\"(g)\"","v":{"$error":"#N/A"}}]
[null,"Jugement :",{"$f":"IF(E14<>\"/\",IF(ABS(1-P28)<E14,\"Conforme. (Comme |\"&ROUND(1-P28,5)&\"| <  \"&E14&\")\",\"Non-conforme. (Comme |\"&ROUND(1-P28,5)&\"| >  \"&E14&\")\"),\"Non applicable\")","v":"Conforme. (Comme |0| <  2)"}]
[]
[]
[]
[null,"Répétabilité :",{"$f":"IF(E15<>\"/\",E15&\" g\",\"Non pris en compte.\")","v":"2 g"}]
[]
[null,{"$f":"IF(AND('calcul '!C49<>0,E15<>\"/\"),\"Répétabilité à \"&'calcul '!C49& \" g :\",\"Non pris en compte.\")","v":"Répétabilité à 100 g :"},null,{"$f":"IF(E15<>\"/\",ROUND('calcul '!C60,4)&\" g\",\"\")","v":"0,0001 g"},{"$f":"IF(B42<>\"Non pris en compte.\",IF(AND('calcul '!C60<>0,'calcul '!C60<E15),\"Conforme .(Comme \"&D42&\" < \"&E15&\" g )\",\"Non-conforme.(Comme\"&D42&\">\"&E15&\" g )\"),\"\")","v":"Conforme .(Comme 0,0001 g < 2 g )"}]
[null,{"$f":"IF(AND('calcul '!D49<>0,E15<>\"/\"),\"Répétabilité à \"&'calcul '!D49& \" g :\",\"Non pris en compte.\")","v":"Non pris en compte."},null,{"$f":"IF(AND(E15<>\"/\",B43<>\"Non pris en compte.\"),ROUND('calcul '!D60,4)&\" g\",\"\")","v":""},{"$f":"IF(B43<>\"Non pris en compte.\",IF(AND('calcul '!C61<>0,'calcul '!C61<E15),\"Conforme .(Comme \"&D43&\" < \"&E15&\" g )\",\"Non-conforme .(Comme \"&D43&\" > \"&E15&\" g )\"),\"\")","v":""}]
[null,null,null,null,null,null,null,null,null,null,null,null,null,null,null,null,null,null,"à vérifier lors d'un étalonnage d'un dilumat."]
[]
[]
[null,"Pourcent de la masse pesée :",null,{"$f":"IF(E16<>\"/\",E16& \" %.\",\"Non pris en compte.\")","v":"2 %."}]
[]
[null,"Masse pesée (g) :",null,{"$f":"'calcul '!F64","v":0.1},{"$f":"'calcul '!G64","v":50},{"$f":"'calcul '!H64","v":100},{"$f":"'calcul '!I64","v":150},{"$f":"'calcul '!J64","v":220},{"$f":"'calcul '!K64","v":"/"},{"$f":"'calcul '!L64","v":"/"},null,null,null,null,"droite reg",{"$f":"IF(OR('calcul '!M98<>\"/\",'calcul '!M107<>\"/\"),LINEST('calcul '!G107:M107,'calcul '!G98:M98,TRUE,FALSE),IF(OR('calcul '!L98<>\"/\",'calcul '!L107<>\"/\"),LINEST('calcul '!G107:L107,'calcul '!G98:L98,TRUE,FALSE),IF(OR('calcul '!K98<>\"/\",'calcul '!K107<>\"/\"),LINEST('calcul '!G107:K107,'calcul '!G98:K98,TRUE,FALSE),IF(OR('calcul '!J98<>\"/\",'calcul '!J107<>\"/\"),LINEST('calcul '!G107:J107,'calcul '!G98:J98,TRUE,FALSE),IF(OR('calcul '!I98<>\"/\",'calcul '!I107<>\"/\"),LINEST('calcul '!G107:I107,'calcul '!G98:I98,TRUE,FALSE),IF(OR('calcul '!H98<>\"/\",'calcul '!H107<>\"/\"),LINEST('calcul '!G107:H107,'calcul '!G98:H98,TRUE,FALSE),\"Attention erreur quelque part.\"))))))","v":1.2004595674354819E-4},4.0403448241335509E-4]
[null,"Incertitudeélargie (k=2) (g) :",null,{"$f":"'calcul '!G107","v":6.8244751202494282E-4},{"$f":"'calcul '!H107","v":6.1719679735616146E-3},{"$f":"'calcul '!I107","v":1.2270253325284641E-2},{"$f":"'calcul '!J107","v":1.8380412907948205E-2},{"$f":"'calcul '!K107","v":2.69509927955668E-2},{"$f":"'calcul '!L107","v":"/"},{"$f":"'calcul '!M107","v":"/"},null,null,null,null,"droite %",{"$f":"E16/100","v":0.02},0,null,"masse conforme (g):",null,{"$f":"IF(Q49>0,-Q49/(P49-P50),\"Attention\")","v":2.0323713099850399E-2}]
[null,null,null,null,null,null,null,null,null,null,null,null,null,null,null,{"$f":"U50","v":2.0323713099850399E-2},null,null,"vérification","masse",{"$f":"P50*U50","v":4.06474261997008E-4},{"$f":"ROUND(U51,5)","v":4.0999999999999999E-4}]
[null,null,null,null,null,null,null,null,null,null,null,null,null,null,null,null,null,null,null,"droite",{"$f":"P49*U50+Q49","v":4.06474261997008E-4},{"$f":"ROUND(U52,5)","v":4.0999999999999999E-4},{"$f":"IF(V51=V52,\"C\",\"NC\")","v":"C"}]
[null,{"$f":"\"La masse pesée (g) en fonction de l'incertitude (g) peut être modélisée par la courbe y = \"&P53&\" * x \"&IF(Q49>0,\"+\",\"\")&\" \"&ROUND(Q49,4)& \" .\"","v":"La masse pesée (g) en fonction de l'incertitude (g) peut être modélisée par la courbe y = 1,2005E-04 * x + 0,0004 ."},null,null,null,null,null,null,null,null,null,null,null,null,null,{"$f":"TEXT(P49,\"0,0000E+00;-0,0000E+00\")","v":"1,2005E-04"},null,null,"vérification arrondi+"]
[null,null,null,null,null,null,null,null,null,null,null,null,null,null,null,null,null,null,null,"masse",{"$f":"P50*ROUNDUP(U50,0)","v":0.02},{"$f":"IF(U54<U55,\"NC\",\"C\")","v":"C"}]
[null,{"$f":"IF(E16<>\"/\",IF(P59=\"OK\",IF(U50<E17,\"Si on tolère \"&E16&\" % d'écart par rapport à la masse pesée, nous sommes conforme à \"&E17&\" g.\",IF(U50>E17,\"Si on tolère \"&E16&\" % d'écart par rapport à la masse pesée, nous ne sommes pas conforme à \"&E17&\" g.\",\"\")),P59))","v":"Si on tolère 2 % d'écart par rapport à la masse pesée, nous sommes conforme à 0,1 g."},null,null,null,null,null,null,null,null,null,null,null,null,null,null,null,null,null,"droite",{"$f":"P49*ROUNDUP(U50,0)+Q49","v":5.2408043915690324E-4}]
[null,{"$f":"IF(E16<>\"/\",\"Nous sommes conforme à partir de \"&ROUND(P51,3)&\" g.\",\"\")","v":"Nous sommes conforme à partir de 0,02 g."},null,null,null,null,null,null,null,null,null,null,null,null,null,null,null,null,"vérification arrondi-"]
[null,null,null,null,null,null,null,null,null,null,null,null,null,null,null,null,null,null,null,"masse",{"$f":"P50*ROUNDDOWN(U50,0)","v":0},{"$f":"IF(U57<U58,\"NC\",\"C\")","v":"NC"}]
[null,null,null,null,null,null,null,null,null,null,null,null,null,null,null,null,null,null,null,"droite",{"$f":"P49*ROUNDDOWN(U50,0)+Q49","v":4.0403448241335509E-4}]
[null,null,null,null,null,null,null,null,null,null,null,null,null,null,null,{"$f":"IF(AND(P49<P50,V54=\"C\",V57=\"NC\"),\"OK\",\"Exploiter l'étalonnage à part.\")","v":"OK"}]
[]
[]
[]
[null,null,null,null,null,null,null,null,null,null,null,null,null,null,null,{"$f":"Q63-0.0005","v":1.8823713099850398E-2},{"$f":"R63-0.0005","v":1.9323713099850398E-2},{"$f":"S63-0.0005","v":1.9823713099850399E-2},{"$f":"U50","v":2.0323713099850399E-2},{"$f":"S63+0.0005","v":2.0823713099850399E-2},{"$f":"T63+0.0005","v":2.13237130998504E-2},2.18237130998504E-2,2.2323713099850401E-2,2.2823713099850401E-2]
[null,null,null,null,null,null,null,null,null,null,null,null,null,null,null,{"$f":"P63*$P$49+$Q$49","v":4.0629419306189267E-4},{"$f":"Q63*$P$49+$Q$49","v":4.0635421604026445E-4},4.0641423901863622E-4,4.06474261997008E-4,4.0653428497537978E-4,4.0659430795375156E-4,4.0665433093212334E-4,4.0671435391049512E-4,4.067743768888669E-4]
[null,null,null,null,null,null,null,null,null,null,null,null,null,null,null,{"$f":"P63*$P$50","v":3.7647426199700798E-4},{"$f":"Q63*$P$50","v":3.8647426199700795E-4},3.9647426199700798E-4,4.06474261997008E-4,4.1647426199700798E-4,4.26474261997008E-4,4.3647426199700803E-4,4.46474261997008E-4,4.5647426199700803E-4]
[null,null,null,null,null,null,null,null,null,null,null,null,null,null,null,{"$f":"MAX(P64:X65)","v":4.5647426199700803E-4},{"$f":"MIN(P64:X65)","v":3.7647426199700798E-4}]
[null,null,null,null,null,null,null,null,null,null,null,null,null,null,null,{"$f":"P66-Q66","v":8.0000000000000047E-5}]
[]
[]
[]
[]
[]
[]
[]
[]
[]
[null,"Incertitude :"]
[]
[null,"Objectif :"]
[]
[null,"Masse (g) :",null,5.0000000000000001E-4,0.02,0.2,10,1000,2000,"/",null,null,null,null,"u etalonnage",{"$f":"IF(J86<>\"/\",LINEST(D87:J87,D86:J86,TRUE,FALSE),IF(I86<>\"/\",LINEST(D87:I87,D86:I86,TRUE,FALSE),IF(H86<>\"/\",LINEST(D87:H87,D86:H86,TRUE,FALSE),IF(G86<>\"/\",LINEST(D87:G87,D86:G86,TRUE,FALSE),IF(F86<>\"/\",LINEST(D87:F87,D86:F86,TRUE,FALSE),IF(E86<>\"/\",LINEST(D87:E87,D86:E86,TRUE,FALSE),\"erreur\"))))))","v":0.12004595674354823},0.40403448241335305,"Masse g",{"$f":"IF(D81<>\"/\",D81,#N/A)","v":5.0000000000000001E-4},0.02,0.2,10,1000,2000,{"$error":"#N/A"}]
[null,"Incertitude (g) :",null,0.06,0.05,0.4,0.4,4,40,"/",null,null,null,null,null,null,null,"Incertitude g",0.06,0.05,0.4,0.4,4,40,{"$error":"#N/A"}]
[]
[null,"Résiltats :"]
[null,null,null,null,null,null,null,null,null,null,null,null,null,null,"u norme",{"$f":"IF(J81<>\"/\",LINEST(D82:J82,D81:J81,TRUE,FALSE),IF(I81<>\"/\",LINEST(D82:I82,D81:I81,TRUE,FALSE),IF(H81<>\"/\",LINEST(D82:H82,D81:H81,TRUE,FALSE),IF(G81<>\"/\",LINEST(D82:G82,D81:G81,TRUE,FALSE),IF(F81<>\"/\",LINEST(D82:F82,D81:F81,TRUE,FALSE),IF(E81<>\"/\",LINEST(D82:E82,D81:E81,TRUE,FALSE),\"erreur\"))))))","v":1.7614615788962167E-2},-1.3523129245929315]
[null,"Masse (g) :",null,{"$f":"'calcul '!G98","v":0.1},{"$f":"'calcul '!H98","v":50},{"$f":"'calcul '!I98","v":100},{"$f":"'calcul '!J98","v":150},{"$f":"'calcul '!K98","v":220},{"$f":"'calcul '!L98","v":"/"},{"$f":"'calcul '!M98","v":"/"},null,null,null,null,null,null,null,"Masse pesée g",{"$f":"IF(D86<>\"/\",D86,#N/A)","v":0.1},50,100,150,220,{"$error":"#N/A"},{"$error":"#N/A"}]
[null,"Incertitude élargie (g) :",null,{"$f":"'calcul '!G110","v":0.6824475120249428},{"$f":"'calcul '!H110","v":6.1719679735616149},{"$f":"'calcul '!I110","v":12.270253325284642},{"$f":"'calcul '!J110","v":18.380412907948205},{"$f":"'calcul '!K110","v":26.950992795566801},{"$f":"'calcul '!L110","v":"/"},{"$f":"'calcul '!M110","v":"/"},null,null,null,null,null,{"$f":"IF(P81>0,\"positif\",\"négatif\")","v":"positif"},null,"U (k = 2) mg",0.6824475120249428,6.1719679735616149,12.270253325284642,18.380412907948205,26.950992795566801,{"$error":"#N/A"},{"$error":"#N/A"}]
[]
[null,"Exploitation :"]
[]
[null,"Masse (g) :",null,{"$f":"'calcul '!G98","v":0.1},{"$f":"'calcul '!H98","v":50},{"$f":"'calcul '!I98","v":100},{"$f":"'calcul '!J98","v":150},{"$f":"'calcul '!K98","v":220},{"$f":"'calcul '!L98","v":"/"},{"$f":"'calcul '!M98","v":"/"},null,null,null,null,null,null,null,"Masse pesée g",{"$f":"IF(D91<>\"/\",D91,#N/A)","v":0.1},50,100,150,220,{"$error":"#N/A"},{"$error":"#N/A"}]
[null,"Incertitude cible (g) :",null,{"$f":"IF(AND(D86<$E$81,D86>=$D$81),$D$82,IF(AND(D86<$F$81,D86>=$E$81),$E$82,IF(AND(D86<$G$81,D86>=$F$81),$F$82,IF(AND(D86<$H$81,D86>=$G$81),$G$82,IF(AND(D86<$I$81,D86>=$H$81),$H$82,IF(AND(D86<$J$81,D86>=$I$81),$I$82,IF(AND(D86<$K$81,D86>=$J$81),$J$82,\"/\")))))))","v":0.05},0.4,0.4,0.4,0.4,"/","/",null,null,null,null,null,null,null,"tolérence",0.05,0.4,0.4,0.4,0.4,{"$error":"#N/A"},{"$error":"#N/A"}]
[null,"Conformité à l'incertitude cible :",null,{"$f":"IF(OR(D92<>\"/\",D87<>\"/\"),IF(D87<D92,\"Conforme\",\"Non conforme\"),\"/\")","v":"Non conforme"},{"$f":"IF(OR(E92<>\"/\",E87<>\"/\"),IF(E87<E92,\"Conforme\",\"Non conforme\"),\"/\")","v":"Non conforme"},"Non conforme","Non conforme","Non conforme","/","/"]