{"text_format":"1","workbook":"xlsx","n_sheets":8,"sheets":["ENTRETIEN...","Formulaire","Codes postaux par région et dép","Liste client","Liste","Feuil1","Feuil2","Feuil3"],"not_rendered":{"charts":0,"images":3,"macros":1,"external_links":0,"defined_names":6,"comments":0,"pivot_tables":0},"unopened":[],"bounds":{"document_bytes":16777216,"sheet_cells":100000,"rows_first":2000,"rows_last":500,"rows_between":2000,"halvings":0,"cell_chars":16384,"cell_head_chars":4096},"cells_cut":0,"cells_raw":0,"read":"whole","date_system":"1900"}

{"sheet":"ENTRETIEN...","index":0,"n_rows":16,"n_cols":15,"rows_kept":16,"cut":false,"hidden":false,"merged":[]}
["SUIVIS ENTRETIEN CLIENT",null,"NOTE","NOTE2","NOTE3","NOM PRENOM","NOTE5","NOTES","ADRESSE","CODE POSTAL","VILLES","TELEPHONE 1 ","TELEPHONE 2","NOTE4","NOTE6"]
[null,null,null,null,null,"n p",null,null,"adr","cp","vil","t1","t2"]
["DATE DU JOUR",null,null,null,null,"n pp",null,null,"adr","cp","vil","t1","t2"]
[{"$f":"TODAY()","v":"2023-12-22"},null,null,null,null,"n pppppp",null,null,"adr","cp","vil","t1","t2"]
[null,null,null,null,null,"n ppp",null,null,"adr","cp","vil","t1","t2"]
[]
[]
[]
[]
[]
[]
[]
[]
[]
[]
[null,null,null,null,"                        "]

{"sheet":"Formulaire","index":1,"n_rows":38,"n_cols":6,"rows_kept":38,"cut":false,"hidden":false,"merged":[[1,1,1,6]]}
[]
[null,"FORMULAIRE : AJOUT CLIENT"]
[]
[null,null,null,"CLIENT                                   PROSPECT ",null,"PARTICULIER                           PROFESSIONNEL "]
[]
[null,null,null,null,null,"Particulier"]
[]
[null,null,null,"RAISON SOCIALE"]
[]
[null,null,null,"N° SIRET"]
[]
[null,null,null,"PRENOM"]
[]
[null,null,null,"NOM"]
[]
[null,null,null,"TELEPHONE 1"]
[]
[null,null,null,"TELEPHONE 2"]
[]
[null,null,null,"E-MAIL"]
[]
[null,null,null,"ADRESSE"]
[]
[null,null,null,"CODE POSTAL "]
[]
[null,null,null,"VILLE "]
[]
[null,null,null,"DEPUIS LE"]
[]
[null,null,null,"NOTE"]
[]
[null,null,null,"NOTE"]
[]
[null,null,null,"ENTRETIEN"]
[]
[null,null,null,"NOTE"]
[]
[null,null,null,null,null,"AJOUTER"]

{"sheet":"Codes postaux par région et dép","index":2,"n_rows":2867,"n_cols":11,"rows_kept":2867,"cut":false,"hidden":true,"merged":[]}
["Code postal","Commune","Ancienne commune","Département","Nom département","Région",null,"Num ligne ","CP ok ","Num ligne CP ok "]
[11000,"CARCASSONNE","GREZES HERMINIS",11,"Aude","Occitanie",null,{"$f":"ROWS($A$2:A2)","v":1},{"$f":"IF(Formulaire!$F$24='Codes postaux par région et dép'!A2,H2,\"\")","v":""},{"$f":"IFERROR(SMALL($I:$I,H2),\"\")","v":""},{"$f":"IFERROR(INDEX($B$2:$B$2867,J2),\"\")","v":""}]
[11000,"CARCASSONNE","MONTREDON",11,"Aude","Occitanie",null,{"$f":"ROWS($A$2:A3)","v":2},{"$f":"IF(Formulaire!$F$24='Codes postaux par région et dép'!A3,H3,\"\")","v":""},"",""]
[11000,"BERRIAC",null,11,"Aude","Occitanie",null,{"$f":"ROWS($A$2:A4)","v":3},{"$f":"IF(Formulaire!$F$24='Codes postaux par région et dép'!A4,H4,\"\")","v":""},"",""]
[11000,"CARCASSONNE","VILLALBE",11,"Aude","Occitanie",null,{"$f":"ROWS($A$2:A5)","v":4},{"$f":"IF(Formulaire!$F$24='Codes postaux par région et dép'!A5,H5,\"\")","v":""},"",""]
[11000,"CARCASSONNE","MAQUENS",11,"Aude","Occitanie",null,{"$f":"ROWS($A$2:A6)","v":5},{"$f":"IF(Formulaire!$F$24='Codes postaux par région et dép'!A6,H6,\"\")","v":""},"",""]
[11000,"CARCASSONNE","MONTLEGUN",11,"Aude","Occitanie",null,{"$f":"ROWS($A$2:A7)","v":6},{"$f":"IF(Formulaire!$F$24='Codes postaux par région et dép'!A7,H7,\"\")","v":""},"",""]
[11000,"CARCASSONNE",null,11,"Aude","Occitanie",null,{"$f":"ROWS($A$2:A8)","v":7},{"$f":"IF(Formulaire!$F$24='Codes postaux par région et dép'!A8,H8,\"\")","v":""},"",""]
[11100,"BAGES",null,11,"Aude","Occitanie",null,{"$f":"ROWS($A$2:A9)","v":8},{"$f":"IF(Formulaire!$F$24='Codes postaux par région et dép'!A9,H9,\"\")","v":""},"",""]
[11100,"NARBONNE","NARBONNE PLAGE",11,"Aude","Occitanie",null,{"$f":"ROWS($A$2:A10)","v":9},{"$f":"IF(Formulaire!$F$24='Codes postaux par région et dép'!A10,H10,\"\")","v":""},"",""]
[11100,"MONTREDON DES CORBIERES",null,11,"Aude","Occitanie",null,{"$f":"ROWS($A$2:A11)","v":10},{"$f":"IF(Formulaire!$F$24='Codes postaux par région et dép'!A11,H11,\"\")","v":""},"",""]
[11100,"NARBONNE",null,11,"Aude","Occitanie",null,{"$f":"ROWS($A$2:A12)","v":11},{"$f":"IF(Formulaire!$F$24='Codes postaux par région et dép'!A12,H12,\"\")","v":""},"",""]
[11110,"VINASSAN",null,11,"Aude","Occitanie",null,{"$f":"ROWS($A$2:A13)","v":12},{"$f":"IF(Formulaire!$F$24='Codes postaux par région et dép'!A13,H13,\"\")","v":""},"",""]
[11110,"ARMISSAN",null,11,"Aude","Occitanie",null,{"$f":"ROWS($A$2:A14)","v":13},{"$f":"IF(Formulaire!$F$24='Codes postaux par région et dép'!A14,H14,\"\")","v":""},"",""]
[11110,"COURSAN",null,11,"Aude","Occitanie",null,{"$f":"ROWS($A$2:A15)","v":14},{"$f":"IF(Formulaire!$F$24='Codes postaux par région et dép'!A15,H15,\"\")","v":""},"",""]
[11110,"SALLES D AUDE",null,11,"Aude","Occitanie",null,{"$f":"ROWS($A$2:A16)","v":15},{"$f":"IF(Formulaire!$F$24='Codes postaux par région et dép'!A16,H16,\"\")","v":""},"",""]
[11120,"BIZE MINERVOIS",null,11,"Aude","Occitanie",null,{"$f":"ROWS($A$2:A17)","v":16},{"$f":"IF(Formulaire!$F$24='Codes postaux par région et dép'!A17,H17,\"\")","v":""},"",""]
[11120,"GINESTAS",null,11,"Aude","Occitanie",null,{"$f":"ROWS($A$2:A18)","v":17},{"$f":"IF(Formulaire!$F$24='Codes postaux par région et dép'!A18,H18,\"\")","v":""},"",""]
[11120,"MOUSSAN",null,11,"Aude","Occitanie",null,{"$f":"ROWS($A$2:A19)","v":18},{"$f":"IF(Formulaire!$F$24='Codes postaux par région et dép'!A19,H19,\"\")","v":""},"",""]
[11120,"POUZOLS MINERVOIS",null,11,"Aude","Occitanie",null,{"$f":"ROWS($A$2:A20)","v":19},{"$f":"IF(Formulaire!$F$24='Codes postaux par région et dép'!A20,H20,\"\")","v":""},"",""]
[11120,"STE VALIERE",null,11,"Aude","Occitanie",null,{"$f":"ROWS($A$2:A21)","v":20},{"$f":"IF(Formulaire!$F$24='Codes postaux par région et dép'!A21,H21,\"\")","v":""},"",""]
[11120,"VENTENAC EN MINERVOIS",null,11,"Aude","Occitanie",null,{"$f":"ROWS($A$2:A22)","v":21},{"$f":"IF(Formulaire!$F$24='Codes postaux par région et dép'!A22,H22,\"\")","v":""},"",""]
[11120,"ARGELIERS",null,11,"Aude","Occitanie",null,{"$f":"ROWS($A$2:A23)","v":22},{"$f":"IF(Formulaire!$F$24='Codes postaux par région et dép'!A23,H23,\"\")","v":""},"",""]
[11120,"MARCORIGNAN",null,11,"Aude","Occitanie",null,{"$f":"ROWS($A$2:A24)","v":23},{"$f":"IF(Formulaire!$F$24='Codes postaux par région et dép'!A24,H24,\"\")","v":""},"",""]
[11120,"ST NAZAIRE D AUDE",null,11,"Aude","Occitanie",null,{"$f":"ROWS($A$2:A25)","v":24},{"$f":"IF(Formulaire!$F$24='Codes postaux par région et dép'!A25,H25,\"\")","v":""},"",""]
[11120,"MAILHAC",null,11,"Aude","Occitanie",null,{"$f":"ROWS($A$2:A26)","v":25},{"$f":"IF(Formulaire!$F$24='Codes postaux par région et dép'!A26,H26,\"\")","v":""},"",""]
[11120,"MIREPEISSET",null,11,"Aude","Occitanie",null,{"$f":"ROWS($A$2:A27)","v":26},{"$f":"IF(Formulaire!$F$24='Codes postaux par région et dép'!A27,H27,\"\")","v":""},"",""]
[11120,"ST MARCEL SUR AUDE",null,11,"Aude","Occitanie",null,{"$f":"ROWS($A$2:A28)","v":27},{"$f":"IF(Formulaire!$F$24='Codes postaux par région et dép'!A28,H28,\"\")","v":""},"",""]
[11130,"SIGEAN",null,11,"Aude","Occitanie",null,{"$f":"ROWS($A$2:A29)","v":28},{"$f":"IF(Formulaire!$F$24='Codes postaux par région et dép'!A29,H29,\"\")","v":""},"",""]
[11140,"AXAT",null,11,"Aude","Occitanie",null,{"$f":"ROWS($A$2:A30)","v":29},{"$f":"IF(Formulaire!$F$24='Codes postaux par région et dép'!A30,H30,\"\")","v":""},"",""]
[11140,"BESSEDE DE SAULT",null,11,"Aude","Occitanie",null,{"$f":"ROWS($A$2:A31)","v":30},{"$f":"IF(Formulaire!$F$24='Codes postaux par région et dép'!A31,H31,\"\")","v":""},"",""]
[11140,"CAMPAGNA DE SAULT",null,11,"Aude","Occitanie",null,{"$f":"ROWS($A$2:A32)","v":31},{"$f":"IF(Formulaire!$F$24='Codes postaux par région et dép'!A32,H32,\"\")","v":""},"",""]
[11140,"ESCOULOUBRE",null,11,"Aude","Occitanie",null,{"$f":"ROWS($A$2:A33)","v":32},{"$f":"IF(Formulaire!$F$24='Codes postaux par région et dép'!A33,H33,\"\")","v":""},"",""]
[11140,"GALINAGUES",null,11,"Aude","Occitanie",null,{"$f":"ROWS($A$2:A34)","v":33},{"$f":"IF(Formulaire!$F$24='Codes postaux par région et dép'!A34,H34,\"\")","v":""},"",""]
[11140,"JOUCOU",null,11,"Aude","Occitanie",null,{"$f":"ROWS($A$2:A35)","v":34},{"$f":"IF(Formulaire!$F$24='Codes postaux par région et dép'!A35,H35,\"\")","v":""},"",""]
[11140,"MERIAL",null,11,"Aude","Occitanie",null,{"$f":"ROWS($A$2:A36)","v":35},{"$f":"IF(Formulaire!$F$24='Codes postaux par région et dép'!A36,H36,\"\")","v":""},"",""]
[11140,"AUNAT",null,11,"Aude","Occitanie",null,{"$f":"ROWS($A$2:A37)","v":36},{"$f":"IF(Formulaire!$F$24='Codes postaux par région et dép'!A37,H37,\"\")","v":""},"",""]
[11140,"BELFORT SUR REBENTY",null,11,"Aude","Occitanie",null,{"$f":"ROWS($A$2:A38)","v":37},{"$f":"IF(Formulaire!$F$24='Codes postaux par région et dép'!A38,H38,\"\")","v":""},"",""]
[11140,"LE BOUSQUET",null,11,"Aude","Occitanie",null,{"$f":"ROWS($A$2:A39)","v":38},{"$f":"IF(Formulaire!$F$24='Codes postaux par région et dép'!A39,H39,\"\")","v":""},"",""]
[11140,"LE CLAT",null,11,"Aude","Occitanie",null,{"$f":"ROWS($A$2:A40)","v":39},{"$f":"IF(Formulaire!$F$24='Codes postaux par région et dép'!A40,H40,\"\")","v":""},"",""]
[11140,"FONTANES DE SAULT",null,11,"Aude","Occitanie",null,{"$f":"ROWS($A$2:A41)","v":40},{"$f":"IF(Formulaire!$F$24='Codes postaux par région et dép'!A41,H41,\"\")","v":""},"",""]
[11140,"MARSA",null,11,"Aude","Occitanie",null,{"$f":"ROWS($A$2:A42)","v":41},{"$f":"IF(Formulaire!$F$24='Codes postaux par région et dép'!A42,H42,\"\")","v":""},"",""]
[11140,"NIORT DE SAULT",null,11,"Aude","Occitanie",null,{"$f":"ROWS($A$2:A43)","v":42},{"$f":"IF(Formulaire!$F$24='Codes postaux par région et dép'!A43,H43,\"\")","v":""},"",""]
[11140,"PUILAURENS",null,11,"Aude","Occitanie",null,{"$f":"ROWS($A$2:A44)","v":43},{"$f":"IF(Formulaire!$F$24='Codes postaux par région et dép'!A44,H44,\"\")","v":""},"",""]
[11140,"CAILLA",null,11,"Aude","Occitanie",null,{"$f":"ROWS($A$2:A45)","v":44},{"$f":"IF(Formulaire!$F$24='Codes postaux par région et dép'!A45,H45,\"\")","v":""},"",""]
[11140,"MAZUBY",null,11,"Aude","Occitanie",null,{"$f":"ROWS($A$2:A46)","v":45},{"$f":"IF(Formulaire!$F$24='Codes postaux par région et dép'!A46,H46,\"\")","v":""},"",""]
[11140,"PUILAURENS","LAPRADELLE",11,"Aude","Occitanie",null,{"$f":"ROWS($A$2:A47)","v":46},{"$f":"IF(Formulaire!$F$24='Codes postaux par région et dép'!A47,H47,\"\")","v":""},"",""]
[11140,"RODOME",null,11,"Aude","Occitanie",null,{"$f":"ROWS($A$2:A48)","v":47},{"$f":"IF(Formulaire!$F$24='Codes postaux par région et dép'!A48,H48,\"\")","v":""},"",""]
[11140,"SALVEZINES",null,11,"Aude","Occitanie",null,{"$f":"ROWS($A$2:A49)","v":48},{"$f":"IF(Formulaire!$F$24='Codes postaux par région et dép'!A49,H49,\"\")","v":""},"",""]
[11140,"ARTIGUES",null,11,"Aude","Occitanie",null,{"$f":"ROWS($A$2:A50)","v":49},{"$f":"IF(Formulaire!$F$24='Codes postaux par région et dép'!A50,H50,\"\")","v":""},"",""]
[11140,"COUNOZOULS",null,11,"Aude","Occitanie",null,{"$f":"ROWS($A$2:A51)","v":50},{"$f":"IF(Formulaire!$F$24='Codes postaux par région et dép'!A51,H51,\"\")","v":""},"",""]
[11140,"LA FAJOLLE",null,11,"Aude","Occitanie",null,{"$f":"ROWS($A$2:A52)","v":51},{"$f":"IF(Formulaire!$F$24='Codes postaux par région et dép'!A52,H52,\"\")","v":""},"",""]
[11140,"GINCLA",null,11,"Aude","Occitanie",null,{"$f":"ROWS($A$2:A53)","v":52},{"$f":"IF(Formulaire!$F$24='Codes postaux par région et dép'!A53,H53,\"\")","v":""},"",""]
[11140,"MONTFORT SUR BOULZANE",null,11,"Aude","Occitanie",null,{"$f":"ROWS($A$2:A54)","v":53},{"$f":"IF(Formulaire!$F$24='Codes postaux par région et dép'!A54,H54,\"\")","v":""},"",""]
[11140,"ROQUEFORT DE SAULT",null,11,"Aude","Occitanie",null,{"$f":"ROWS($A$2:A55)","v":54},{"$f":"IF(Formulaire!$F$24='Codes postaux par région et dép'!A55,H55,\"\")","v":""},"",""]
[11140,"STE COLOMBE SUR GUETTE",null,11,"Aude","Occitanie",null,{"$f":"ROWS($A$2:A56)","v":55},{"$f":"IF(Formulaire!$F$24='Codes postaux par région et dép'!A56,H56,\"\")","v":""},"",""]
[11150,"BRAM",null,11,"Aude","Occitanie",null,{"$f":"ROWS($A$2:A57)","v":56},{"$f":"IF(Formulaire!$F$24='Codes postaux par région et dép'!A57,H57,\"\")","v":""},"",""]
[11150,"VILLASAVARY",null,11,"Aude","Occitanie",null,{"$f":"ROWS($A$2:A58)","v":57},{"$f":"IF(Formulaire!$F$24='Codes postaux par région et dép'!A58,H58,\"\")","v":""},"",""]
[11150,"PEXIORA",null,11,"Aude","Occitanie",null,{"$f":"ROWS($A$2:A59)","v":58},{"$f":"IF(Formulaire!$F$24='Codes postaux par région et dép'!A59,H59,\"\")","v":""},"",""]
[11150,"VILLESISCLE",null,11,"Aude","Occitanie",null,{"$f":"ROWS($A$2:A60)","v":59},{"$f":"IF(Formulaire!$F$24='Codes postaux par région et dép'!A60,H60,\"\")","v":""},"",""]
[11150,"VILLEPINTE",null,11,"Aude","Occitanie",null,{"$f":"ROWS($A$2:A61)","v":60},{"$f":"IF(Formulaire!$F$24='Codes postaux par région et dép'!A61,H61,\"\")","v":""},"",""]
[11160,"CAUNES MINERVOIS",null,11,"Aude","Occitanie",null,{"$f":"ROWS($A$2:A62)","v":61},{"$f":"IF(Formulaire!$F$24='Codes postaux par région et dép'!A62,H62,\"\")","v":""},"",""]
[11160,"LESPINASSIERE",null,11,"Aude","Occitanie",null,{"$f":"ROWS($A$2:A63)","v":62},{"$f":"IF(Formulaire!$F$24='Codes postaux par région et dép'!A63,H63,\"\")","v":""},"",""]
[11160,"RIEUX MINERVOIS",null,11,"Aude","Occitanie",null,{"$f":"ROWS($A$2:A64)","v":63},{"$f":"IF(Formulaire!$F$24='Codes postaux par région et dép'!A64,H64,\"\")","v":""},"",""]
[11160,"PEYRIAC MINERVOIS",null,11,"Aude","Occitanie",null,{"$f":"ROWS($A$2:A65)","v":64},{"$f":"IF(Formulaire!$F$24='Codes postaux par région et dép'!A65,H65,\"\")","v":""},"",""]
[11160,"TRASSANEL",null,11,"Aude","Occitanie",null,{"$f":"ROWS($A$2:A66)","v":65},{"$f":"IF(Formulaire!$F$24='Codes postaux par région et dép'!A66,H66,\"\")","v":""},{"$f":"IFERROR(SMALL($I:$I,H66),\"\")","v":""},{"$f":"IFERROR(INDEX($B$2:$B$2867,J66),\"\")","v":""}]
[11160,"TRAUSSE",null,11,"Aude","Occitanie",null,{"$f":"ROWS($A$2:A67)","v":66},{"$f":"IF(Formulaire!$F$24='Codes postaux par région et dép'!A67,H67,\"\")","v":""},"",""]
[11160,"VILLENEUVE MINERVOIS",null,11,"Aude","Occitanie",null,{"$f":"ROWS($A$2:A68)","v":67},{"$f":"IF(Formulaire!$F$24='Codes postaux par région et dép'!A68,H68,\"\")","v":""},"",""]
[11160,"CASTANS",null,11,"Aude","Occitanie",null,{"$f":"ROWS($A$2:A69)","v":68},{"$f":"IF(Formulaire!$F$24='Codes postaux par région et dép'!A69,H69,\"\")","v":""},"",""]
[11160,"CITOU",null,11,"Aude","Occitanie",null,{"$f":"ROWS($A$2:A70)","v":69},{"$f":"IF(Formulaire!$F$24='Codes postaux par région et dép'!A70,H70,\"\")","v":""},"",""]
[11160,"CABRESPINE",null,11,"Aude","Occitanie",null,{"$f":"ROWS($A$2:A71)","v":70},{"$f":"IF(Formulaire!$F$24='Codes postaux par région et dép'!A71,H71,\"\")","v":""},"",""]
[11170,"CARLIPA",null,11,"Aude","Occitanie",null,{"$f":"ROWS($A$2:A72)","v":71},{"$f":"IF(Formulaire!$F$24='Codes postaux par région et dép'!A72,H72,\"\")","v":""},"",""]
[11170,"MOUSSOULENS",null,11,"Aude","Occitanie",null,{"$f":"ROWS($A$2:A73)","v":72},{"$f":"IF(Formulaire!$F$24='Codes postaux par région et dép'!A73,H73,\"\")","v":""},"",""]
[11170,"RAISSAC SUR LAMPY",null,11,"Aude","Occitanie",null,{"$f":"ROWS($A$2:A74)","v":73},{"$f":"IF(Formulaire!$F$24='Codes postaux par région et dép'!A74,H74,\"\")","v":""},"",""]
[11170,"VILLESPY",null,11,"Aude","Occitanie",null,{"$f":"ROWS($A$2:A75)","v":74},{"$f":"IF(Formulaire!$F$24='Codes postaux par région et dép'!A75,H75,\"\")","v":""},"",""]
[11170,"MONTOLIEU",null,11,"Aude","Occitanie",null,{"$f":"ROWS($A$2:A76)","v":75},{"$f":"IF(Formulaire!$F$24='Codes postaux par région et dép'!A76,H76,\"\")","v":""},"",""]
[11170,"STE EULALIE",null,11,"Aude","Occitanie",null,{"$f":"ROWS($A$2:A77)","v":76},{"$f":"IF(Formulaire!$F$24='Codes postaux par région et dép'!A77,H77,\"\")","v":""},"",""]
[11170,"VILLESEQUELANDE",null,11,"Aude","Occitanie",null,{"$f":"ROWS($A$2:A78)","v":77},{"$f":"IF(Formulaire!$F$24='Codes postaux par région et dép'!A78,H78,\"\")","v":""},"",""]
[11170,"CAUX ET SAUZENS",null,11,"Aude","Occitanie",null,{"$f":"ROWS($A$2:A79)","v":78},{"$f":"IF(Formulaire!$F$24='Codes postaux par région et dép'!A79,H79,\"\")","v":""},"",""]
[11170,"CENNE MONESTIES",null,11,"Aude","Occitanie",null,{"$f":"ROWS($A$2:A80)","v":79},{"$f":"IF(Formulaire!$F$24='Codes postaux par région et dép'!A80,H80,\"\")","v":""},"",""]
{"$rows_left_out":2788}
{"sheet":"Liste client","index":3,"n_rows":11,"n_cols":20,"rows_kept":11,"cut":false,"hidden":false,"merged":[]}
[]
[]
[]
[null,"FICHIER CLIENT "]
[]
[null,"N°","CLIENT  PROSPECT","PARTICULIER  PROFESSIONNEL ","PRENOM","NOM","TELEPHONE 1","TELEPHONE 2","ADRESSE","CODE POSTAL","VILLE","E-MAIL","DEPUIS LE ","NOTE","NOTE3","ENTRETIEN ","NOTE2","RAISON SOCIALE","N° SIRET","Prenom Nom"]
[null,null,"Prospect","Particulier","aaaa","n","t1","t2","adr","cp","vil","e","dat","nn","nnn","Oui","nnnn","rai","sir",{"$f":"CONCATENATE(Tableau5[[#This Row],[PRENOM]],\" \",Tableau5[[#This Row],[NOM]])","v":"aaaa n"}]
[null,null,"Prospect","Particulier","pppppp","n","t1","t2","adr","cp","vil","e","dat","nn","nnn","Oui","nnnn","rai","sir",{"$f":"CONCATENATE(Tableau5[[#This Row],[PRENOM]],\" \",Tableau5[[#This Row],[NOM]])","v":"pppppp n"}]
[null,null,"Prospect","Particulier","ppp","n","t1","t2","adr","cp","vil","e","dat","nn","nnn","oui","nnnn","rai","sir",{"$f":"CONCATENATE(Tableau5[[#This Row],[PRENOM]],\" \",Tableau5[[#This Row],[NOM]])","v":"ppp n"}]
[null,null,"Prospect","Particulier","pp","n","t1","t2","adr","cp","vil","e","dat","nn","nnn","oui","nnnn","rai","sir",{"$f":"CONCATENATE(Tableau5[[#This Row],[PRENOM]],\" \",Tableau5[[#This Row],[NOM]])","v":"pp n"}]
[null,null,"Prospect","Particulier","p","n","t1","t2","adr","cp","vil","e","dat","nn","nnn","Oui","nnnn","rai","sir",{"$f":"CONCATENATE(Tableau5[[#This Row],[PRENOM]],\" \",Tableau5[[#This Row],[NOM]])","v":"p n"}]

{"sheet":"Liste","index":4,"n_rows":6,"n_cols":4,"rows_kept":6,"cut":false,"hidden":false,"merged":[]}
[]
[null,"Client ou Prospect ? ","Type","Entretien "]
[null,"Client","Particulier","Oui"]
[null,"Prospect","Professionnel ","Non"]
[null,null,null,"Attente"]
[null,null,null,"…"]

{"sheet":"Feuil1","index":5,"n_rows":15,"n_cols":3,"rows_kept":15,"cut":false,"hidden":false,"merged":[]}
[]
[]
[]
[]
[null,null,"perlox34 - 12 déc. 2023 à 22:21"]
[null,null," f894009 - 13 déc. 2023 à 09:27"]
[null,null,"Bonjour,"]
[null,null,"Je vous mets ci-joint un lien d'un fichier Excel ou j'ai expliquer ce que je voudrais faire dans les moindres détails avec quelque photos pour que vous comprenez bien. "]
[null,null,"https://www.cjoint.com/c/MLmvqFbwQRl"]
[null,null,"Dans ce deuxième lien ci-dessous veuillez trouvez le fichier Excel .xlsm qui contient donc la macro ou vous pouvez modifier et ajouter des codes si nécessaires. Merci votre aide. Bonne soirée."]
[null,null,"https://www.cjoint.com/c/MLmvt1fOanlMacintosh / Safari 14.1.2"]
[]
[]
[]
[null,null,"Sur la ligne du client je veux que les cellules des colonnes \"nom prénom\" \" adresse\" \"ville\" \"code postal\" \" tel1 et \"tel2\" que j'ai indiqué dans mon explication se copie automatiquement dans la feuille \" ENTRETIEN \" que s'il y a un \" oui \" a entretien. "]

{"sheet":"Feuil2","index":6,"n_rows":18,"n_cols":2,"rows_kept":18,"cut":false,"hidden":false,"merged":[]}
[]
[]
[null,"rang: 1descrip: Prospect Valeur: Professionnel"]
[null,"rang: 3descrip: RAISON SOCIALE Valeur: 2"]
[null,"rang: 5descrip: N° SIRET Valeur: 3"]
[null,"rang: 7descrip: PRENOM Valeur: 4"]
[null,"rang: 9descrip: NOM Valeur: 5"]
[null,"rang: 11descrip: TELEPHONE 1 Valeur: 6"]
[null,"rang: 13descrip: TELEPHONE 2 Valeur: 7"]
[null,"rang: 15descrip: E-MAIL Valeur: 8"]
[null,"rang: 17descrip: ADRESSE Valeur: 9"]
[null,"rang: 19descrip: CODE POSTAL  Valeur: 10"]
[null,"rang: 21descrip: VILLE  Valeur: 11"]
[null,"rang: 23descrip: DEPUIS LE Valeur: 11/01/1900"]
[null,"rang: 25descrip: NOTE Valeur: 13"]
[null,"rang: 27descrip: NOTE Valeur: 14"]
[null,"rang: 29descrip: ENTRETIEN Valeur: 15"]
[null,"rang: 31descrip: NOTE Valeur: "]

{"sheet":"Feuil3","index":7,"n_rows":7,"n_cols":20,"rows_kept":7,"cut":false,"hidden":false,"merged":[]}
[]
[]
[]
[]
[]
[null,"N°","CLIENT  PROSPECT","PARTICULIER  PROFESSIONNEL ","PRENOM","NOM","TELEPHONE 1","TELEPHONE 2","ADRESSE","CODE POSTAL","VILLE","E-MAIL","DEPUIS LE ","NOTE","NOTE3","ENTRETIEN ","NOTE2","RAISON SOCIALE","N° SIRET","Prenom Nom"]
[null,null,"Prospect","Professionnel","pren","nom","t1","t2","adr","cp","ville","@","date","n1","n2","ent","n3","rason","N°"]