{"text_format":"1","workbook":"xlsx","n_sheets":5,"sheets":["Infos extractions","Indiv Global","IG Janv","IG Fév","IG Type"],"not_rendered":{"charts":3,"images":0,"macros":1,"external_links":0,"defined_names":32,"comments":0,"pivot_tables":2},"unopened":[],"bounds":{"document_bytes":16777216,"sheet_cells":100000,"rows_first":2000,"rows_last":500,"rows_between":2000,"halvings":0,"cell_chars":16384,"cell_head_chars":4096},"cells_cut":0,"cells_raw":0,"read":"whole","date_system":"1900"}

{"sheet":"Infos extractions","index":0,"n_rows":420,"n_cols":18,"rows_kept":420,"cut":false,"hidden":false,"merged":[]}
["DATE","Nom de la campagne ","Type de campagne ","Nb d'heures appels décimal","OK","PE","REFUS","NRP","Rappels","Injoignables 3x ","Nb d'appels","Nb CA","Nom","Nb d'Appels/Heure","Tx Transformation","Tx Performance","Nb Heures appels réels (PHONEXONE)","Nb d'heures de présences effectives"]
["2023-01-03","Campagne 1","Questionnaire",2,4,null,null,5,9,null,18,4,"Jérôme",9,0.22222222222222221,1]
["2023-01-03","Campagne 2","Questionnaire",1,1,null,null,8,5,null,14,1,"Coraline",14,7.1428571428571425E-2,1]
["2023-01-03","Campagne 3","Questionnaire",2,1,0,1,15,8,1,26,2,"Samuel",13,7.6923076923076927E-2,0.5]
["2023-01-03","Campagne 4","Questionnaire",7,2,null,null,13,6,2,23,2,"Julie",3.2857142857142856,8.6956521739130432E-2,1]
["2023-01-03","Campagne 5","Questionnaire",2,2,0,0,3,1,0,6,2,"Louane",3,0.33333333333333331,1]
["2023-01-03","Campagne 6","Questionnaire",2,2,0,0,3,5,0,10,2,"Pauline",5,0.2,1]
["2023-01-04","Campagne 7","Questionnaire",5.5,12,null,null,14,21,15,62,12,"Jérôme",11.272727272727273,0.19354838709677419,1]
["2023-01-04","Campagne 8","Questionnaire",5.5,7,null,2,49,22,1,81,9,"Coraline",14.727272727272727,0.1111111111111111,0.77777777777777779]
["2023-01-04","Campagne 9","Questionnaire",7,7,0,1,35,23,null,66,8,"Samuel",9.4285714285714288,0.12121212121212122,0.875]
["2023-01-04","Campagne 10","Questionnaire",7,10,null,null,11,18,null,39,10,"Julie",5.5714285714285712,0.25641025641025639,1]
["2023-01-04","Campagne 11","Questionnaire",7,11,0,0,15,7,0,33,11,"Louane",4.7142857142857144,0.33333333333333331,1]
["2023-01-04","Campagne 12","Questionnaire",7,13,0,0,2,11,1,27,13,"Pauline",3.8571428571428572,0.48148148148148145,1]
["2023-01-05","Campagne 13","Questionnaire",4,8,0,0,3,16,null,27,8,"Silvye",6.75,0.29629629629629628,1]
["2023-01-05","Campagne 14","Questionnaire",5,12,null,null,11,18,null,41,12,"Jérôme",8.1999999999999993,0.29268292682926828,1]
["2023-01-05","Campagne 15","Questionnaire",3.5,7,0,2,12,7,0,28,9,"Samuel",8,0.32142857142857145,0.77777777777777779]
["2023-01-05","Campagne 16","Questionnaire",3.5,6,null,null,5,8,1,20,6,"Julie",5.7142857142857144,0.3,1]
["2023-01-05","Campagne 17","Questionnaire",7,10,0,0,9,7,3,29,10,"Louane",4.1428571428571432,0.34482758620689657,1]
["2023-01-05","Campagne 18","Questionnaire",6.5,12,null,1,16,21,null,50,13,"Coraline",7.6923076923076925,0.26,0.92307692307692313]
["2023-01-05","Campagne 19","Questionnaire",7,12,0,0,11,11,0,34,12,"Pauline",4.8571428571428568,0.35294117647058826,1]
["2023-01-05","Campagne 20","Questionnaire",3.5,9,0,0,21,9,2,41,9,"Samuel",11.714285714285714,0.21951219512195122,1]
["2023-01-05","Campagne 21","Questionnaire",3.5,8,null,null,30,16,3,57,8,"Samuel",16.285714285714285,0.14035087719298245,1]
["2023-01-06","Campagne 22","Questionnaire",2.5,5,0,0,10,17,null,32,5,"Silvye",12.8,0.15625,1]
["2023-01-06","Campagne 23","Questionnaire",5.5,13,null,null,8,25,1,47,13,"Jérôme",8.545454545454545,0.27659574468085107,1]
["2023-01-06","Campagne 24","Questionnaire",3.5,7,0,0,23,14,3,47,7,"Samuel",13.428571428571429,0.14893617021276595,1]
["2023-01-06","Campagne 25","Questionnaire",3.5,14,null,null,26,30,1,71,14,"Julie",20.285714285714285,0.19718309859154928,1]
["2023-01-06","Campagne 26","Questionnaire",3.5,7,0,0,4,12,0,23,7,"Samuel",6.5714285714285712,0.30434782608695654,1]
["2023-01-06","Campagne 27","Questionnaire",3.5,7,null,1,4,20,null,32,8,"Julie",9.1428571428571423,0.25,0.875]
["2023-01-06","Campagne 28","Questionnaire",7,12,null,null,30,16,null,58,12,"Coraline",8.2857142857142865,0.20689655172413793,1]
["2023-01-06","Campagne 29","Questionnaire",7,7,0,0,21,29,0,57,7,"Pauline",8.1428571428571423,0.12280701754385964,1]
["2023-01-06","Campagne 30","Questionnaire",7,11,0,0,16,5,null,32,11,"Louane",4.5714285714285712,0.34375,1]
["2023-01-09","Campagne 31","Questionnaire",3.5,6,null,null,23,9,1,39,6,"Coraline",11.142857142857142,0.15384615384615385,1]
["2023-01-09","Campagne 32","Questionnaire",3.5,7,0,0,9,3,2,21,7,"Louane",6,0.33333333333333331,1]
["2023-01-09","Campagne 33","Questionnaire",3.5,8,0,0,8,1,0,17,8,"Louane",4.8571428571428568,0.47058823529411764,1]
["2023-01-09","Campagne 34","Questionnaire",3.5,11,0,0,29,1,2,43,11,"Silvye",12.285714285714286,0.2558139534883721,1]
["2023-01-09","Campagne 35","Questionnaire",3.5,8,null,null,57,30,1,96,8,"Julie",27.428571428571427,8.3333333333333329E-2,1]
["2023-01-09","Campagne 36","Questionnaire",3.5,9,0,0,43,14,2,68,9,"Samuel",19.428571428571427,0.13235294117647059,1]
["2023-01-09","Campagne 37","Questionnaire",3.5,9,null,1,10,9,null,29,10,"Julie",8.2857142857142865,0.34482758620689657,0.9]
["2023-01-09","Campagne 38","Questionnaire",3.5,6,0,3,21,11,1,42,9,"Samuel",12,0.21428571428571427,0.66666666666666663]
["2023-01-09","Campagne 39","Questionnaire",3.5,15,0,0,33,16,1,65,15,"Pauline",18.571428571428573,0.23076923076923078,1]
["2023-01-09","Campagne 40","Questionnaire",5.5,11,null,9,29,47,1,97,20,"Jérôme",17.636363636363637,0.20618556701030927,0.55000000000000004]
["2023-01-10","Campagne 41","Questionnaire",3.5,8,0,0,13,17,7,45,8,"Samuel",12.857142857142858,0.17777777777777778,1]
["2023-01-10","Campagne 42","Questionnaire",3.5,12,null,null,28,23,null,63,12,"Julie",18,0.19047619047619047,1]
["2023-01-10","Campagne 43","Questionnaire",3.5,8,0,0,40,16,3,67,8,"Samuel",19.142857142857142,0.11940298507462686,1]
["2023-01-10","Campagne 44","Questionnaire",3.5,12,null,null,null,10,null,22,12,"Julie",6.2857142857142856,0.54545454545454541,1]
["2023-01-10","Campagne 45","Questionnaire",3.5,8,null,null,6,6,null,20,8,"Coraline",5.7142857142857144,0.4,1]
["2023-01-10","Campagne 46","Questionnaire",3.5,8,0,0,14,3,null,25,8,"Louane",7.1428571428571432,0.32,1]
["2023-01-10","Campagne 47","Questionnaire",3.5,10,0,0,12,1,1,24,10,"Louane",6.8571428571428568,0.41666666666666669,1]
["2023-01-10","Campagne 48","Questionnaire",3.5,9,0,0,40,2,0,51,9,"Silvye",14.571428571428571,0.17647058823529413,1]
["2023-01-10","Campagne 49","Questionnaire",3.5,14,0,0,19,14,1,48,14,"Silvye",13.714285714285714,0.29166666666666669,1]
["2023-01-10","Campagne 50","Questionnaire",7,34,0,0,10,15,1,60,34,"Pauline",8.5714285714285712,0.56666666666666665,1]
["2023-01-10","Campagne 51","Questionnaire",6.5,17,null,null,22,30,1,70,17,"Jérôme",10.76923076923077,0.24285714285714285,1]
["2023-01-11","Campagne 52","Questionnaire",3.5,10,0,4,10,22,2,48,14,"Samuel",13.714285714285714,0.29166666666666669,0.7142857142857143]
["2023-01-11","Campagne 53","Questionnaire",3.5,12,0,0,23,14,3,52,12,"Samuel",14.857142857142858,0.23076923076923078,1]
["2023-01-11","Campagne 54","Questionnaire",3.5,14,null,null,25,27,null,66,14,"Julie",18.857142857142858,0.21212121212121213,1]
["2023-01-11","Campagne 55","Questionnaire",3.5,11,null,1,15,6,null,33,12,"Julie",9.4285714285714288,0.36363636363636365,0.91666666666666663]
["2023-01-11","Campagne 56","Questionnaire",3.5,13,0,0,9,8,1,31,13,"Louane",8.8571428571428577,0.41935483870967744,1]
["2023-01-11","Campagne 57","Questionnaire",3.5,12,0,1,29,12,null,54,13,"Silvye",15.428571428571429,0.24074074074074073,0.92307692307692313]
["2023-01-11","Campagne 58","Questionnaire",3.5,8,0,0,7,11,2,28,8,"Louane",8,0.2857142857142857,1]
["2023-01-11","Campagne 59","Questionnaire",7,10,null,3,32,30,1,76,13,"Coraline",10.857142857142858,0.17105263157894737,0.76923076923076927]
["2023-01-11","Campagne 60","Prise de RDV",3.5,10,null,6,13,34,1,64,16,"Jérôme",18.285714285714285,0.25,0.625]
["2023-01-11","Campagne 61","Questionnaire",1.5,4,null,null,3,6,null,13,4,"Jérôme",8.6666666666666661,0.30769230769230771,1]
["2023-01-11","Campagne 62","Questionnaire",7,25,0,1,25,40,0,91,26,"Pauline",13,0.2857142857142857,0.96153846153846156]
["2023-01-12","Campagne 63","Questionnaire",7,18,null,null,4,13,null,35,18,"Coraline",5,0.51428571428571423,1]
["2023-01-12","Campagne 64","Questionnaire",3.5,8,0,0,12,7,0,27,8,"Louane",7.7142857142857144,0.29629629629629628,1]
["2023-01-12","Campagne 65","Questionnaire",1.5,2,0,0,0,3,0,5,2,"Pauline",3.3333333333333335,0.4,1]
["2023-01-12","Campagne 66","Questionnaire",3.5,10,null,1,26,7,null,44,11,"Silvye",12.571428571428571,0.25,0.90909090909090906]
["2023-01-12","Campagne 67","Questionnaire",3.5,9,0,3,14,7,0,33,12,"Louane",9.4285714285714288,0.36363636363636365,0.75]
["2023-01-12","Campagne 68","Questionnaire",5,14,null,null,34,22,4,74,14,"Jérôme",14.8,0.1891891891891892,1]
["2023-01-12","Campagne 69","Questionnaire",3,12,0,0,27,12,1,52,12,"Silvye",17.333333333333332,0.23076923076923078,1]
["2023-01-12","Campagne 70","Questionnaire",1.5,11,0,1,8,11,null,31,12,"Jérôme",20.666666666666668,0.38709677419354838,0.91666666666666663]
["2023-01-12","Campagne 71","Questionnaire",5.5,25,0,0,34,20,0,79,25,"Pauline",14.363636363636363,0.31645569620253167,1]
["2023-01-12","Campagne 72","Questionnaire",3.5,10,0,0,27,12,2,51,10,"Samuel",14.571428571428571,0.19607843137254902,1]
["2023-01-12","Campagne 73","Questionnaire",3.5,13,null,null,33,10,null,56,13,"Julie",16,0.23214285714285715,1]
["2023-01-12","Campagne 74","Questionnaire",3.5,10,0,2,13,21,4,50,12,"Samuel",14.285714285714286,0.24,0.83333333333333337]
["2023-01-12","Campagne 75","Questionnaire",3.5,10,null,null,8,7,1,26,10,"Samuel",7.4285714285714288,0.38461538461538464,1]
["2023-01-13","Campagne 76","Questionnaire",3.5,9,0,0,11,4,0,24,9,"Louane",6.8571428571428568,0.375,1]
["2023-01-13","Campagne 77","Questionnaire",7,14,null,2,35,18,null,69,16,"Coraline",9.8571428571428577,0.2318840579710145,0.875]
["2023-01-13","Campagne 78","Questionnaire",2.5,7,0,0,5,4,0,16,7,"Pauline",6.4,0.4375,1]
["2023-01-13","Campagne 79","Questionnaire",3.5,5,0,0,4,7,null,16,5,"Louane",4.5714285714285712,0.3125,1]
{"$rows_left_out":341}
{"sheet":"Indiv Global","index":1,"n_rows":18,"n_cols":29,"rows_kept":18,"cut":false,"hidden":false,"merged":[]}
[{"$f":" TODAY()","v":"2023-11-14"}]
[]
[]
[]
[]
[]
[]
[null,null,null,null,null,null,null,null,null,null,null,null,null,null,null,"Mois","févr"]
["Mois","févr"]
[null,null,null,null,null,null,null,null,null,null,null,null,null,null,null,null,"Valeurs"]
["Nom","Somme de OK","Somme de PE","Somme de REFUS","Somme de NRP","Somme de Rappels","Somme de Injoignables 3x ","Somme de CA","Nombre d'appels","Moyenne Tx Transformation","Moyenne Tx Performance","Nombre Heures appels décimal","Moyenne d'Appels/Heure","Somme de Pourcentage de Temps passé en appels (H dec)",null,"Étiquettes de lignes","Moyenne de OK","Moyenne de PE","Moyenne de REFUS","Moyenne de NRP","Moyenne de Rappels","Moyenne de Injoignables 3x ","Moyenne de Nb CA","Moyenne de Nb d'appels","Moyenne de Tx Transformation","Moyenne de Tx Performance","Somme de Nb d'heures de présences effectives","Moyenne de Appels/Heure (pe)","Somme de Pourcentage de Temps passé en appels (pe)"]
["Jérôme",230,null,233,1039,764,25,463,2291,0.20136335708546774,0.5127952599383252,121.25,19.8828958078958,0.34648568155784654,null,"Jérôme",6.5714285714285712,null,8.3214285714285712,28.861111111111111,21.222222222222221,2.2727272727272729,12.861111111111111,63.638888888888886,0.20136335708546774,0.5127952599383252,5.6875,16.783882783882785,0.30777574277574282]
["Coraline",271,null,34,382,276,125,305,1088,0.29216050964651763,0.89768293521449194,105,10.368376068376067,0.23593386243386241,null,"Coraline",15.055555555555555,null,3.0909090909090908,21.222222222222221,16.235294117647058,8.3333333333333339,16.944444444444443,60.444444444444443,0.29216050964651763,0.89768293521449194,4.375,10.361904761904762,0.23593386243386241]
["Samuel",389,0,11,1012,460,137,400,2009,0.21463459484815295,0.97258698092031415,136.5,14.658608058608056,0.19338217338217339,null,"Samuel",14.407407407407407,0,0.42307692307692307,37.481481481481481,17.037037037037038,5.0740740740740744,14.814814814814815,74.407407407407405,0.21463459484815295,0.97258698092031415,5.833333333333333,14.35,0.18854761904761907]
["Julie",364,0,33,814,632,32,397,1875,0.23333060459433369,0.91800352017263764,138.5,13.753544719169719,0.37244484556758928,null,"Julie",11.375,0,1.8333333333333333,25.4375,19.75,1.6842105263157894,12.40625,58.59375,0.23333060459433369,0.91800352017263764,5.833333333333333,13.392857142857142,0.36845436507936508]
["Louane",358,0,11,705,197,20,369,1291,0.31083901665926289,0.96634328468229391,134,9.5880952380952387,0.23064883913764508,null,"Louane",17.899999999999999,0,0.57894736842105265,35.25,9.85,1.0526315789473684,18.45,64.55,0.31083901665926289,0.96634328468229391,5.833333333333333,9.2214285714285715,0.22076388888888887]
["Pauline",297,0,31,516,305,9,328,1158,0.27745600347714694,0.9142406194882976,125,9.2551860837575131,0.15439111111111112,null,"Pauline",14.142857142857142,0,1.4761904761904763,24.571428571428573,14.523809523809524,0.5625,15.619047619047619,55.142857142857146,0.27745600347714694,0.9142406194882976,5.833333333333333,8.2714285714285722,0.13784920634920636]
["Total général",1909,0,353,4468,2634,348,2262,9712,0.24553921975869031,0.83623897418775017,760.25,13.795010905400511,0.2564558442032957,null,"Total général",12.477124183006536,0,2.8699186991869921,29.012987012987011,17.215686274509803,3.2523364485981308,14.688311688311689,63.064935064935064,0.24553921975869031,0.83623897418775017,33.395833333333329,12.117280099812852,0.24325708740555904]

{"sheet":"IG Janv","index":2,"n_rows":11,"n_cols":28,"rows_kept":11,"cut":false,"hidden":false,"merged":[]}
[]
["Janvier",null,null,null,null,null,null,null,null,null,null,null,null,null,"Temps de Travail en Janvier 154H"]
[]
["Nom","Somme de OK","Somme de PE","Somme de REFUS","Somme de NRP","Somme de Rappels","Somme de Injoignables 3x ","Somme de CA","Nombre d'appels","Moyenne Tx Transformation","Moyenne Tx Performance","Nombre Heures appels décimal","Moyenne d'Appels/Heure","% de Temps passé en appels","Moyenne par jours","OK","PE","REFUS","NRP","Rappels","Injoignables 3x ","CA","Nb d'appels","Tx Transformation","Tx Performance","Nb d'heures de présences effectives mois","Appels/Heure (pe)","% de Temps passé en appels (pe)"]
["Jérôme",322,0,161,773,828,52,483,2136,0.23933220401943459,0.69711786174476087,136,16.078629703629705,0.34694444444444439,"Jérôme",9.4705882352941178,0,7.3181818181818183,22.735294117647058,24.352941176470587,2.8888888888888888,14.205882352941176,62.823529411764703,0.23933220401943459,0.69711786174476087,6.416666666666667,13.870129870129871,0.30639249639249638]
["Coraline",276,null,24,506,344,13,300,1163,0.27948818930500829,0.92579448558550737,130.5,9.1267304124447008,0.26606215410813111,"Coraline",13.142857142857142,null,1.8461538461538463,24.095238095238095,16.38095238095238,1.4444444444444444,14.285714285714286,55.38095238095238,0.27948818930500829,0.92579448558550737,6.125,7.9115646258503398,0.23619803476946333]
["Samuel",329,0,35,974,509,129,364,1976,0.19535507934035057,0.90213363495318377,135,14.428934240362812,0.23617078189300414,"Samuel",9.4,0,1.09375,27.828571428571429,14.542857142857143,3.7941176470588234,10.4,56.457142857142856,0.19535507934035057,0.90213363495318377,5.541666666666667,14.857142857142858,0.23972222222222223]
["Julie",358,null,10,759,729,30,368,1886,0.21690187763053925,0.97557257990915647,140,13.804081632653066,0.4130119047619048,"Julie",10.228571428571428,null,1.1111111111111112,22.323529411764707,20.828571428571429,2.1428571428571428,10.514285714285714,53.885714285714286,0.21690187763053925,0.97557257990915647,6.125,12.829931972789115,0.3933446712018141]
["Louane",333,0,17,506,335,22,350,1213,0.30596698469469624,0.96660419790104946,138.5,8.927033885654577,0.31019655034095472,"Louane",11.482758620689655,0,0.62962962962962965,17.448275862068964,11.551724137931034,0.91666666666666663,12.068965517241379,41.827586206896555,0.30596698469469624,0.96660419790104946,6.125,8.2517006802721085,0.29226001511715799]
["Pauline",306,0,6,472,380,4,312,1168,0.28973525970662178,0.98377226638096205,122,10.681799360060229,0.20607923497267763,"Pauline",13.304347826086957,0,0.31578947368421051,20.521739130434781,16.521739130434781,0.21052631578947367,13.565217391304348,50.782608695652172,0.28973525970662178,0.98377226638096205,6.125,7.9455782312925169,0.17103174603174606]
["Total général",1924,0,253,3990,3125,250,2177,9542,0.24843216912681121,0.90125250216210162,802,12.604834305681763,0.29889546965918545,"Total général",10.870056497175142,0,2.0737704918032787,22.670454545454547,17.655367231638419,2.1186440677966103,12.299435028248588,53.909604519774014,0.24843216912681121,0.90125250216210162,36.458333333333336,10.905142857142858,0.27395904761904766]

{"sheet":"IG Fév","index":3,"n_rows":11,"n_cols":29,"rows_kept":11,"cut":false,"hidden":false,"merged":[]}
[]
["Février",null,null,null,null,null,null,null,null,null,null,null,null,null,"Temps de Travail en Février 140H"]
[]
["Nom","Somme de OK","Somme de PE","Somme de REFUS","Somme de NRP","Somme de Rappels","Somme de Injoignables 3x ","Somme de CA","Nombre d'appels","Moyenne Tx Transformation","Moyenne Tx Performance","Nombre Heures appels décimal","Moyenne d'Appels/Heure","% de Temps passé en appels","Moyenne par jours","OK","PE","REFUS","NRP","Rappels","Injoignables 3x ","CA","Nb d'appels","Tx Transformation","Tx Performance","Nb d'heures de présences effectives mois","Appels/Heure (pe)","% d'évolution Appels/Heure (pe)","% de Temps passé en appels (pe)"]
["Jérôme",230,null,233,1039,764,25,463,2291,0.20136335708546774,0.5127952599383252,121.25,19.8828958078958,0.34648568155784654,"Jérôme",6.5714285714285712,null,8.3214285714285712,28.861111111111111,21.222222222222221,2.2727272727272729,12.861111111111111,63.638888888888886,0.20136335708546774,0.5127952599383252,5.6875,16.783882783882785,{"$f":"(AA5-(VLOOKUP(O5,'IG Janv'!Matrcie, 13,FALSE)))/(VLOOKUP(O5,'IG Janv'!Matrice,13,FALSE))","v":{"$error":"#NAME?"}},0.30777574277574282]
["Coraline",271,null,34,382,276,125,305,1088,0.29216050964651763,0.89768293521449194,105,10.368376068376067,0.23593386243386241,"Coraline",15.055555555555555,null,3.0909090909090908,21.222222222222221,16.235294117647058,8.3333333333333339,16.944444444444443,60.444444444444443,0.29216050964651763,0.89768293521449194,4.375,10.361904761904762,{"$f":"(AA6-(VLOOKUP(O6,'IG Janv'!Matrice,13,FALSE)))/(VLOOKUP(O6,'IG Janv'!Matrice,13,FALSE))","v":{"$error":"#NAME?"}},0.23593386243386241]
["Samuel",389,0,11,1012,460,137,400,2009,0.21463459484815295,0.97258698092031415,136.5,14.658608058608056,0.19338217338217339,"Samuel",14.407407407407407,0,0.42307692307692307,37.481481481481481,17.037037037037038,5.0740740740740744,14.814814814814815,74.407407407407405,0.21463459484815295,0.97258698092031415,5.833333333333333,14.35,{"$f":"(AA7-(VLOOKUP(O7,'IG Janv'!Matrice,13,FALSE)))/(VLOOKUP(O7,'IG Janv'!Matrice,13,FALSE))","v":{"$error":"#NAME?"}},0.18854761904761907]
["Julie",364,0,33,814,632,32,397,1875,0.23333060459433369,0.91800352017263764,138.5,13.753544719169719,0.37244484556758928,"Julie",11.375,0,1.8333333333333333,25.4375,19.75,1.6842105263157894,12.40625,58.59375,0.23333060459433369,0.91800352017263764,5.833333333333333,13.392857142857142,{"$f":"(AA8-(VLOOKUP(O8,'IG Janv'!Matrice,13,FALSE)))/(VLOOKUP(O8,'IG Janv'!Matrice,13,FALSE))","v":{"$error":"#NAME?"}},0.36845436507936508]
["Louane",358,0,11,705,197,20,369,1291,0.31083901665926289,0.96634328468229391,134,9.5880952380952387,0.23064883913764508,"Louane",17.899999999999999,0,0.57894736842105265,35.25,9.85,1.0526315789473684,18.45,64.55,0.31083901665926289,0.96634328468229391,5.833333333333333,9.2214285714285715,{"$f":"(AA9-(VLOOKUP(O9,'IG Janv'!Matrice,13,FALSE)))/(VLOOKUP(O9,'IG Janv'!Matrice,13,FALSE))","v":{"$error":"#NAME?"}},0.22076388888888887]
["Pauline",297,0,31,516,305,9,328,1158,0.27745600347714694,0.9142406194882976,125,9.2551860837575131,0.15439111111111112,"Pauline",14.142857142857142,0,1.4761904761904763,24.571428571428573,14.523809523809524,0.5625,15.619047619047619,55.142857142857146,0.27745600347714694,0.9142406194882976,5.833333333333333,8.2714285714285722,{"$f":"(AA10-(VLOOKUP(O10,'IG Janv'!Matrice,13,FALSE)))/(VLOOKUP(O10,'IG Janv'!Matrice,13,FALSE))","v":{"$error":"#NAME?"}},0.13784920634920636]
["Total général",1909,0,353,4468,2634,348,2262,9712,0.24553921975869031,0.83623897418775017,760.25,13.795010905400511,0.2564558442032957,"Total général",12.477124183006536,0,2.8699186991869921,29.012987012987011,17.215686274509803,3.2523364485981308,14.688311688311689,63.064935064935064,0.24553921975869031,0.83623897418775017,33.395833333333329,12.117280099812852,null,0.24325708740555904]

{"sheet":"IG Type","index":4,"n_rows":4,"n_cols":29,"rows_kept":4,"cut":false,"hidden":false,"merged":[]}
[]
["\"Mois\"",null,null,null,null,null,null,null,null,null,null,null,null,null,"Temps de Travail en "]
[]
["Nom","OK","PE"," REFUS"," NRP"," Rappels"," Injoignables 3x "," CA","Nb d'appels","Moyenne Tx Transformation","Moyenne Tx Performance","Nombre Heures Appels décimal","Moyenne d'Appels/Heure","% de Temps passé en appels","Moyenne par jours","OK","PE","REFUS","NRP","Rappels","Injoignables 3x ","CA","Nb d'appels","Tx Transformation","Tx Performance","Nb d'heures de présences effectives mois","Appels/Heure (pe)","% d'évolution Appels/Heure (pe)","% de Temps passé en appels (pe)"]