{"text_format":"1","workbook":"xlsx","n_sheets":4,"sheets":["Système","Client","Agenda","Calendrier Cadre"],"not_rendered":{"charts":0,"images":2,"macros":1,"external_links":0,"defined_names":16,"comments":0,"pivot_tables":0},"unopened":[],"bounds":{"document_bytes":16777216,"sheet_cells":100000,"rows_first":2000,"rows_last":500,"rows_between":2000,"halvings":0,"cell_chars":16384,"cell_head_chars":4096},"cells_cut":0,"cells_raw":0,"read":"whole","date_system":"1900"}

{"sheet":"Système","index":0,"n_rows":23,"n_cols":10,"rows_kept":23,"cut":false,"hidden":false,"merged":[]}
["Premier mois du planning",{"$f":"IF(AND(C2:C8),\"Erreur !\",\"Jours Chômés\")","v":"Jours Chômés"},"Chômé ?","Jours chômés","Année du jour férié","Dates","Jour Fériés",null,"Choisissez vos couleurs","Couleur"]
["Novembre","Lundi",false,{"$f":"IF(C2,B2,\"\")","v":""},{"$f":"IF(MONTH(1&Premier_mois)<>1,An+1,An)","v":2024},{"$f":"DATE(E2,1,1)","v":"2024-01-01"},{"$f":"\"Jour de l'an \"&E2","v":"Jour de l'an 2024"},null,"Mois pair"]
["Année du premier mois du planning","Mardi",false,{"$f":"IF(C3,B3,\"\")","v":""},{"$f":"IF(MONTH(DATE(An,3,29.56+0.979*MOD(204-11*MOD(An,19),30)-WEEKDAY(DATE(An,3,28.56+0.979*MOD(204-11*MOD(An,19),30))))+1)<MONTH(1&Premier_mois),An+1,An)","v":2024},{"$f":"DATE(E3,3,29.56+0.979*MOD(204-11*MOD(E3,19),30)-WEEKDAY(DATE(E3,3,28.56+0.979*MOD(204-11*MOD(E3,19),30))))+1","v":"2024-04-01"},"Lundi de pâques",null,"Mois impair"]
[2023,"Mercredi",false,"",{"$f":"IF(MONTH(1&Premier_mois)>5,An+1,An)","v":2024},{"$f":"DATE(E4,5,1)","v":"2024-05-01"},"Fête du travail",null,"Jour de la semaine chômés"]
[null,"Jeudi",false,"",{"$f":"IF(MONTH(DATE(An,3,29.56+0.979*MOD(204-11*MOD(An,19),30)-WEEKDAY(DATE(An,3,28.56+0.979*MOD(204-11*MOD(An,19),30))))+1+38)<MONTH(1&Premier_mois),An+1,An)","v":2024},{"$f":"DATE(E5,3,29.56+0.979*MOD(204-11*MOD(E5,19),30)-WEEKDAY(DATE(E5,3,28.56+0.979*MOD(204-11*MOD(E5,19),30))))+1+38","v":"2024-05-09"},"Jeudi de l'ascension",null,"Jour fériés et vacances"]
[null,"Vendredi",false,"",{"$f":"IF(MONTH(1&Premier_mois)>5,An+1,An)","v":2024},{"$f":"DATE(E6,5,8)","v":"2024-05-08"},"Victoire 1945",null,"Jour actuel"]
[null,"Samedi",true,"Samedi",{"$f":"IF(MONTH(DATE(An,3,29.56+0.979*MOD(204-11*MOD(An,19),30)-WEEKDAY(DATE(An,3,28.56+0.979*MOD(204-11*MOD(An,19),30))))+1+49)<MONTH(1&Premier_mois),An+1,An)","v":2024},{"$f":"DATE(E7,3,29.56+0.979*MOD(204-11*MOD(E7,19),30)-WEEKDAY(DATE(E7,3,28.56+0.979*MOD(204-11*MOD(E7,19),30))))+1+49","v":"2024-05-20"},"Lundi de Pentecôte",null,"Ci-dessus reste à programmer pour une prochaine version"]
[null,"Dimanche",true,"Dimanche",{"$f":"IF(MONTH(1&Premier_mois)>7,An+1,An)","v":2024},{"$f":"DATE(E8,7,14)","v":"2024-07-14"},"Fête nationale",null,"Le principe sera celui qui est utilisé sur l'application APACHES"]
[null,null,"N° mois",{"$f":"MONTH(1&Premier_mois)","v":11},{"$f":"IF(MONTH(1&Premier_mois)>8,An+1,An)","v":2024},{"$f":"DATE(E9,8,15)","v":"2024-08-15"},"L'Assomption",null,"Mais par manque de temps ce n'est pas encore mis en place…"]
[null,null,"N° semaine",{"$f":"INT((TODAY()-LOOKUP(TODAY(),DATE(YEAR(TODAY())+{-1;0;1},1,3)-WEEKDAY(DATE(YEAR(TODAY())+{-1;0;1},1,3))+2))/7)+1","v":48},{"$f":"IF(MONTH(1&Premier_mois)>11,An+1,An)","v":2023},{"$f":"DATE(E10,11,1)","v":"2023-11-01"},"La Toussaint"]
[null,null,null,null,{"$f":"IF(MONTH(1&Premier_mois)>11,An+1,An)","v":2023},{"$f":"DATE(E11,11,11)","v":"2023-11-11"},{"$f":"\"Armistice \"&E11","v":"Armistice 2023"}]
[null,null,null,null,null,{"$f":"DATE(An,12,25)","v":"2023-12-25"},"Noël"]
[null,null,null,null,null,{"$f":"\"01/01/\"&E2+1","v":"01/01/2025"},{"$f":"\"Jour de l'an \"&E2+1","v":"Jour de l'an 2025"}]
[null,null,null,null,null,{"$f":"DATE(E3+1,3,29.56+0.979*MOD(204-11*MOD(E3+1,19),30)-WEEKDAY(DATE(E3+1,3,28.56+0.979*MOD(204-11*MOD(E3+1,19),30))))+1","v":"2025-04-21"},"Lundi de pâques"]
[null,null,null,null,null,{"$f":"DATE(E4+1,5,1)","v":"2025-05-01"},"Fête du travail"]
[null,null,null,null,null,{"$f":"DATE(E5+1,3,29.56+0.979*MOD(204-11*MOD(E5+1,19),30)-WEEKDAY(DATE(E5+1,3,28.56+0.979*MOD(204-11*MOD(E5+1,19),30))))+1+38","v":"2025-05-29"},"Jeudi de l'ascension"]
[null,null,null,null,null,{"$f":"DATE(E6+1,5,8)","v":"2025-05-08"},"Victoire 1945"]
[null,null,null,null,null,{"$f":"DATE(E7+1,3,29.56+0.979*MOD(204-11*MOD(E7+1,19),30)-WEEKDAY(DATE(E7+18,3,28.56+0.979*MOD(204-11*MOD(E7+1,19),30))))+1+49","v":"2025-06-09"},"Lundi de Pentecôte"]
[null,null,null,null,null,{"$f":"DATE(E8+1,7,14)","v":"2025-07-14"},"Fête nationale"]
[null,null,null,null,null,{"$f":"DATE(E9+1,8,15)","v":"2025-08-15"},"L'Assomption"]
[null,null,null,null,null,{"$f":"DATE(E10+1,11,1)","v":"2024-11-01"},"La Toussaint"]
[null,null,null,null,null,{"$f":"DATE(E11+1,11,11)","v":"2024-11-11"},{"$f":"\"Armistice \"&E11+1","v":"Armistice 2024"}]
[null,null,null,null,null,{"$f":"DATE(An+1,12,25)","v":"2024-12-25"},"Noël"]

{"sheet":"Client","index":1,"n_rows":1,"n_cols":5,"rows_kept":1,"cut":false,"hidden":false,"merged":[]}
["NOM","DATE","HEURE","N° TEL","NOTE"]

{"sheet":"Agenda","index":2,"n_rows":53,"n_cols":388,"rows_kept":53,"cut":false,"hidden":false,"merged":[[0,3,0,9],[0,10,0,16],[0,17,0,23],[0,24,0,30],[0,31,0,37],[0,38,0,44],[0,87,0,93],[0,94,0,100],[0,101,0,107],[0,108,0,114],[0,115,0,121],[0,122,0,128],[0,45,0,51],[0,52,0,58],[0,59,0,65],[0,66,0,72],[0,73,0,79],[0,80,0,86],[0,206,0,212],[0,129,0,135],[0,136,0,142],[0,143,0,149],[0,150,0,156],[0,157,0,163],[0,164,0,170],[0,171,0,177],[0,178,0,184],[0,185,0,191],[0,192,0,198],[0,199,0,205],[0,227,0,233],[0,234,0,240],[0,241,0,247],[0,332,0,338],[0,255,0,261],[0,262,0,268],[0,269,0,275],[0,276,0,282],[0,283,0,289],[0,290,0,296],[52,0,53,2],[0,248,0,254],[0,381,0,387],[0,339,0,345],[0,346,0,352],[0,353,0,359],[0,360,0,366],[0,367,0,373],[0,374,0,380],[0,297,0,303],[0,304,0,310],[0,311,0,317],[0,318,0,324],[0,325,0,331],[0,213,0,219],[0,220,0,226]]}
[null,null,null,{"$f":"\"Semaine \"&TEXT(INT((D3-LOOKUP(D3,DATE(YEAR(D3)+{-1;0;1},1,3)-WEEKDAY(DATE(YEAR(D3)+{-1;0;1},1,3))+2))/7)+1,\"00\")","v":"Semaine 44"},null,null,null,null,null,null,{"$f":"\"Semaine \"&TEXT(INT((K3-LOOKUP(K3,DATE(YEAR(K3)+{-1;0;1},1,3)-WEEKDAY(DATE(YEAR(K3)+{-1;0;1},1,3))+2))/7)+1,\"00\")","v":"Semaine 45"},null,null,null,null,null,null,{"$f":"\"Semaine \"&TEXT(INT((R3-LOOKUP(R3,DATE(YEAR(R3)+{-1;0;1},1,3)-WEEKDAY(DATE(YEAR(R3)+{-1;0;1},1,3))+2))/7)+1,\"00\")","v":"Semaine 46"},null,null,null,null,null,null,{"$f":"\"Semaine \"&TEXT(INT((Y3-LOOKUP(Y3,DATE(YEAR(Y3)+{-1;0;1},1,3)-WEEKDAY(DATE(YEAR(Y3)+{-1;0;1},1,3))+2))/7)+1,\"00\")","v":"Semaine 47"},null,null,null,null,null,null,{"$f":"\"Semaine \"&TEXT(INT((AF3-LOOKUP(AF3,DATE(YEAR(AF3)+{-1;0;1},1,3)-WEEKDAY(DATE(YEAR(AF3)+{-1;0;1},1,3))+2))/7)+1,\"00\")","v":"Semaine 48"},null,null,null,null,null,null,{"$f":"\"Semaine \"&TEXT(INT((AM3-LOOKUP(AM3,DATE(YEAR(AM3)+{-1;0;1},1,3)-WEEKDAY(DATE(YEAR(AM3)+{-1;0;1},1,3))+2))/7)+1,\"00\")","v":"Semaine 49"},null,null,null,null,null,null,{"$f":"\"Semaine \"&TEXT(INT((AT3-LOOKUP(AT3,DATE(YEAR(AT3)+{-1;0;1},1,3)-WEEKDAY(DATE(YEAR(AT3)+{-1;0;1},1,3))+2))/7)+1,\"00\")","v":"Semaine 50"},null,null,null,null,null,null,{"$f":"\"Semaine \"&TEXT(INT((BA3-LOOKUP(BA3,DATE(YEAR(BA3)+{-1;0;1},1,3)-WEEKDAY(DATE(YEAR(BA3)+{-1;0;1},1,3))+2))/7)+1,\"00\")","v":"Semaine 51"},null,null,null,null,null,null,{"$f":"\"Semaine \"&TEXT(INT((BH3-LOOKUP(BH3,DATE(YEAR(BH3)+{-1;0;1},1,3)-WEEKDAY(DATE(YEAR(BH3)+{-1;0;1},1,3))+2))/7)+1,\"00\")","v":"Semaine 52"},null,null,null,null,null,null,{"$f":"\"Semaine \"&TEXT(INT((BO3-LOOKUP(BO3,DATE(YEAR(BO3)+{-1;0;1},1,3)-WEEKDAY(DATE(YEAR(BO3)+{-1;0;1},1,3))+2))/7)+1,\"00\")","v":"Semaine 01"},null,null,null,null,null,null,{"$f":"\"Semaine \"&TEXT(INT((BV3-LOOKUP(BV3,DATE(YEAR(BV3)+{-1;0;1},1,3)-WEEKDAY(DATE(YEAR(BV3)+{-1;0;1},1,3))+2))/7)+1,\"00\")","v":"Semaine 02"},null,null,null,null,null,null,{"$f":"\"Semaine \"&TEXT(INT((CC3-LOOKUP(CC3,DATE(YEAR(CC3)+{-1;0;1},1,3)-WEEKDAY(DATE(YEAR(CC3)+{-1;0;1},1,3))+2))/7)+1,\"00\")","v":"Semaine 03"},null,null,null,null,null,null,{"$f":"\"Semaine \"&TEXT(INT((CJ3-LOOKUP(CJ3,DATE(YEAR(CJ3)+{-1;0;1},1,3)-WEEKDAY(DATE(YEAR(CJ3)+{-1;0;1},1,3))+2))/7)+1,\"00\")","v":"Semaine 04"},null,null,null,null,null,null,{"$f":"\"Semaine \"&TEXT(INT((CQ3-LOOKUP(CQ3,DATE(YEAR(CQ3)+{-1;0;1},1,3)-WEEKDAY(DATE(YEAR(CQ3)+{-1;0;1},1,3))+2))/7)+1,\"00\")","v":"Semaine 05"},null,null,null,null,null,null,{"$f":"\"Semaine \"&TEXT(INT((CX3-LOOKUP(CX3,DATE(YEAR(CX3)+{-1;0;1},1,3)-WEEKDAY(DATE(YEAR(CX3)+{-1;0;1},1,3))+2))/7)+1,\"00\")","v":"Semaine 06"},null,null,null,null,null,null,{"$f":"\"Semaine \"&TEXT(INT((DE3-LOOKUP(DE3,DATE(YEAR(DE3)+{-1;0;1},1,3)-WEEKDAY(DATE(YEAR(DE3)+{-1;0;1},1,3))+2))/7)+1,\"00\")","v":"Semaine 07"},null,null,null,null,null,null,{"$f":"\"Semaine \"&TEXT(INT((DL3-LOOKUP(DL3,DATE(YEAR(DL3)+{-1;0;1},1,3)-WEEKDAY(DATE(YEAR(DL3)+{-1;0;1},1,3))+2))/7)+1,\"00\")","v":"Semaine 08"},null,null,null,null,null,null,{"$f":"\"Semaine \"&TEXT(INT((DS3-LOOKUP(DS3,DATE(YEAR(DS3)+{-1;0;1},1,3)-WEEKDAY(DATE(YEAR(DS3)+{-1;0;1},1,3))+2))/7)+1,\"00\")","v":"Semaine 09"},null,null,null,null,null,null,{"$f":"\"Semaine \"&TEXT(INT((DZ3-LOOKUP(DZ3,DATE(YEAR(DZ3)+{-1;0;1},1,3)-WEEKDAY(DATE(YEAR(DZ3)+{-1;0;1},1,3))+2))/7)+1,\"00\")","v":"Semaine 10"},null,null,null,null,null,null,{"$f":"\"Semaine \"&TEXT(INT((EG3-LOOKUP(EG3,DATE(YEAR(EG3)+{-1;0;1},1,3)-WEEKDAY(DATE(YEAR(EG3)+{-1;0;1},1,3))+2))/7)+1,\"00\")","v":"Semaine 11"},null,null,null,null,null,null,{"$f":"\"Semaine \"&TEXT(INT((EN3-LOOKUP(EN3,DATE(YEAR(EN3)+{-1;0;1},1,3)-WEEKDAY(DATE(YEAR(EN3)+{-1;0;1},1,3))+2))/7)+1,\"00\")","v":"Semaine 12"},null,null,null,null,null,null,{"$f":"\"Semaine \"&TEXT(INT((EU3-LOOKUP(EU3,DATE(YEAR(EU3)+{-1;0;1},1,3)-WEEKDAY(DATE(YEAR(EU3)+{-1;0;1},1,3))+2))/7)+1,\"00\")","v":"Semaine 13"},null,null,null,null,null,null,{"$f":"\"Semaine \"&TEXT(INT((FB3-LOOKUP(FB3,DATE(YEAR(FB3)+{-1;0;1},1,3)-WEEKDAY(DATE(YEAR(FB3)+{-1;0;1},1,3))+2))/7)+1,\"00\")","v":"Semaine 14"},null,null,null,null,null,null,{"$f":"\"Semaine \"&TEXT(INT((FI3-LOOKUP(FI3,DATE(YEAR(FI3)+{-1;0;1},1,3)-WEEKDAY(DATE(YEAR(FI3)+{-1;0;1},1,3))+2))/7)+1,\"00\")","v":"Semaine 15"},null,null,null,null,null,null,{"$f":"\"Semaine \"&TEXT(INT((FP3-LOOKUP(FP3,DATE(YEAR(FP3)+{-1;0;1},1,3)-WEEKDAY(DATE(YEAR(FP3)+{-1;0;1},1,3))+2))/7)+1,\"00\")","v":"Semaine 16"},null,null,null,null,null,null,{"$f":"\"Semaine \"&TEXT(INT((FW3-LOOKUP(FW3,DATE(YEAR(FW3)+{-1;0;1},1,3)-WEEKDAY(DATE(YEAR(FW3)+{-1;0;1},1,3))+2))/7)+1,\"00\")","v":"Semaine 17"},null,null,null,null,null,null,{"$f":"\"Semaine \"&TEXT(INT((GD3-LOOKUP(GD3,DATE(YEAR(GD3)+{-1;0;1},1,3)-WEEKDAY(DATE(YEAR(GD3)+{-1;0;1},1,3))+2))/7)+1,\"00\")","v":"Semaine 18"},null,null,null,null,null,null,{"$f":"\"Semaine \"&TEXT(INT((GK3-LOOKUP(GK3,DATE(YEAR(GK3)+{-1;0;1},1,3)-WEEKDAY(DATE(YEAR(GK3)+{-1;0;1},1,3))+2))/7)+1,\"00\")","v":"Semaine 19"},null,null,null,null,null,null,{"$f":"\"Semaine \"&TEXT(INT((GR3-LOOKUP(GR3,DATE(YEAR(GR3)+{-1;0;1},1,3)-WEEKDAY(DATE(YEAR(GR3)+{-1;0;1},1,3))+2))/7)+1,\"00\")","v":"Semaine 20"},null,null,null,null,null,null,{"$f":"\"Semaine \"&TEXT(INT((GY3-LOOKUP(GY3,DATE(YEAR(GY3)+{-1;0;1},1,3)-WEEKDAY(DATE(YEAR(GY3)+{-1;0;1},1,3))+2))/7)+1,\"00\")","v":"Semaine 21"},null,null,null,null,null,null,{"$f":"\"Semaine \"&TEXT(INT((HF3-LOOKUP(HF3,DATE(YEAR(HF3)+{-1;0;1},1,3)-WEEKDAY(DATE(YEAR(HF3)+{-1;0;1},1,3))+2))/7)+1,\"00\")","v":"Semaine 22"},null,null,null,null,null,null,{"$f":"\"Semaine \"&TEXT(INT((HM3-LOOKUP(HM3,DATE(YEAR(HM3)+{-1;0;1},1,3)-WEEKDAY(DATE(YEAR(HM3)+{-1;0;1},1,3))+2))/7)+1,\"00\")","v":"Semaine 23"},null,null,null,null,null,null,{"$f":"\"Semaine \"&TEXT(INT((HT3-LOOKUP(HT3,DATE(YEAR(HT3)+{-1;0;1},1,3)-WEEKDAY(DATE(YEAR(HT3)+{-1;0;1},1,3))+2))/7)+1,\"00\")","v":"Semaine 24"},null,null,null,null,null,null,{"$f":"\"Semaine \"&TEXT(INT((IA3-LOOKUP(IA3,DATE(YEAR(IA3)+{-1;0;1},1,3)-WEEKDAY(DATE(YEAR(IA3)+{-1;0;1},1,3))+2))/7)+1,\"00\")","v":"Semaine 25"},null,null,null,null,null,null,{"$f":"\"Semaine \"&TEXT(INT((IH3-LOOKUP(IH3,DATE(YEAR(IH3)+{-1;0;1},1,3)-WEEKDAY(DATE(YEAR(IH3)+{-1;0;1},1,3))+2))/7)+1,\"00\")","v":"Semaine 26"},null,null,null,null,null,null,{"$f":"\"Semaine \"&TEXT(INT((IO3-LOOKUP(IO3,DATE(YEAR(IO3)+{-1;0;1},1,3)-WEEKDAY(DATE(YEAR(IO3)+{-1;0;1},1,3))+2))/7)+1,\"00\")","v":"Semaine 27"},null,null,null,null,null,null,{"$f":"\"Semaine \"&TEXT(INT((IV3-LOOKUP(IV3,DATE(YEAR(IV3)+{-1;0;1},1,3)-WEEKDAY(DATE(YEAR(IV3)+{-1;0;1},1,3))+2))/7)+1,\"00\")","v":"Semaine 28"},null,null,null,null,null,null,{"$f":"\"Semaine \"&TEXT(INT((JC3-LOOKUP(JC3,DATE(YEAR(JC3)+{-1;0;1},1,3)-WEEKDAY(DATE(YEAR(JC3)+{-1;0;1},1,3))+2))/7)+1,\"00\")","v":"Semaine 29"},null,null,null,null,null,null,{"$f":"\"Semaine \"&TEXT(INT((JJ3-LOOKUP(JJ3,DATE(YEAR(JJ3)+{-1;0;1},1,3)-WEEKDAY(DATE(YEAR(JJ3)+{-1;0;1},1,3))+2))/7)+1,\"00\")","v":"Semaine 30"},null,null,null,null,null,null,{"$f":"\"Semaine \"&TEXT(INT((JQ3-LOOKUP(JQ3,DATE(YEAR(JQ3)+{-1;0;1},1,3)-WEEKDAY(DATE(YEAR(JQ3)+{-1;0;1},1,3))+2))/7)+1,\"00\")","v":"Semaine 31"},null,null,null,null,null,null,{"$f":"\"Semaine \"&TEXT(INT((JX3-LOOKUP(JX3,DATE(YEAR(JX3)+{-1;0;1},1,3)-WEEKDAY(DATE(YEAR(JX3)+{-1;0;1},1,3))+2))/7)+1,\"00\")","v":"Semaine 32"},null,null,null,null,null,null,{"$f":"\"Semaine \"&TEXT(INT((KE3-LOOKUP(KE3,DATE(YEAR(KE3)+{-1;0;1},1,3)-WEEKDAY(DATE(YEAR(KE3)+{-1;0;1},1,3))+2))/7)+1,\"00\")","v":"Semaine 33"},null,null,null,null,null,null,{"$f":"\"Semaine \"&TEXT(INT((KL3-LOOKUP(KL3,DATE(YEAR(KL3)+{-1;0;1},1,3)-WEEKDAY(DATE(YEAR(KL3)+{-1;0;1},1,3))+2))/7)+1,\"00\")","v":"Semaine 34"},null,null,null,null,null,null,{"$f":"\"Semaine \"&TEXT(INT((KS3-LOOKUP(KS3,DATE(YEAR(KS3)+{-1;0;1},1,3)-WEEKDAY(DATE(YEAR(KS3)+{-1;0;1},1,3))+2))/7)+1,\"00\")","v":"Semaine 35"},null,null,null,null,null,null,{"$f":"\"Semaine \"&TEXT(INT((KZ3-LOOKUP(KZ3,DATE(YEAR(KZ3)+{-1;0;1},1,3)-WEEKDAY(DATE(YEAR(KZ3)+{-1;0;1},1,3))+2))/7)+1,\"00\")","v":"Semaine 36"},null,null,null,null,null,null,{"$f":"\"Semaine \"&TEXT(INT((LG3-LOOKUP(LG3,DATE(YEAR(LG3)+{-1;0;1},1,3)-WEEKDAY(DATE(YEAR(LG3)+{-1;0;1},1,3))+2))/7)+1,\"00\")","v":"Semaine 37"},null,null,null,null,null,null,{"$f":"\"Semaine \"&TEXT(INT((LN3-LOOKUP(LN3,DATE(YEAR(LN3)+{-1;0;1},1,3)-WEEKDAY(DATE(YEAR(LN3)+{-1;0;1},1,3))+2))/7)+1,\"00\")","v":"Semaine 38"},null,null,null,null,null,null,{"$f":"\"Semaine \"&TEXT(INT((LU3-LOOKUP(LU3,DATE(YEAR(LU3)+{-1;0;1},1,3)-WEEKDAY(DATE(YEAR(LU3)+{-1;0;1},1,3))+2))/7)+1,\"00\")","v":"Semaine 39"},null,null,null,null,null,null,{"$f":"\"Semaine \"&TEXT(INT((MB3-LOOKUP(MB3,DATE(YEAR(MB3)+{-1;0;1},1,3)-WEEKDAY(DATE(YEAR(MB3)+{-1;0;1},1,3))+2))/7)+1,\"00\")","v":"Semaine 40"},null,null,null,null,null,null,{"$f":"\"Semaine \"&TEXT(INT((MI3-LOOKUP(MI3,DATE(YEAR(MI3)+{-1;0;1},1,3)-WEEKDAY(DATE(YEAR(MI3)+{-1;0;1},1,3))+2))/7)+1,\"00\")","v":"Semaine 41"},null,null,null,null,null,null,{"$f":"\"Semaine \"&TEXT(INT((MP3-LOOKUP(MP3,DATE(YEAR(MP3)+{-1;0;1},1,3)-WEEKDAY(DATE(YEAR(MP3)+{-1;0;1},1,3))+2))/7)+1,\"00\")","v":"Semaine 42"},null,null,null,null,null,null,{"$f":"\"Semaine \"&TEXT(INT((MW3-LOOKUP(MW3,DATE(YEAR(MW3)+{-1;0;1},1,3)-WEEKDAY(DATE(YEAR(MW3)+{-1;0;1},1,3))+2))/7)+1,\"00\")","v":"Semaine 43"},null,null,null,null,null,null,{"$f":"\"Semaine \"&TEXT(INT((ND3-LOOKUP(ND3,DATE(YEAR(ND3)+{-1;0;1},1,3)-WEEKDAY(DATE(YEAR(ND3)+{-1;0;1},1,3))+2))/7)+1,\"00\")","v":"Semaine 44"},null,null,null,null,null,null,{"$f":"\"Semaine \"&TEXT(INT((NK3-LOOKUP(NK3,DATE(YEAR(NK3)+{-1;0;1},1,3)-WEEKDAY(DATE(YEAR(NK3)+{-1;0;1},1,3))+2))/7)+1,\"00\")","v":"Semaine 45"},null,null,null,null,null,null,{"$f":"\"Semaine \"&TEXT(INT((NR3-LOOKUP(NR3,DATE(YEAR(NR3)+{-1;0;1},1,3)-WEEKDAY(DATE(YEAR(NR3)+{-1;0;1},1,3))+2))/7)+1,\"00\")","v":"Semaine 46"}]
[null,null,null,"Lundi","Mardi","Mercredi","Jeudi","Vendredi","Samedi","Dimanche","Lundi","Mardi","Mercredi","Jeudi","Vendredi","Samedi","Dimanche","Lundi","Mardi","Mercredi","Jeudi","Vendredi","Samedi","Dimanche","Lundi","Mardi","Mercredi","Jeudi","Vendredi","Samedi","Dimanche","Lundi","Mardi","Mercredi","Jeudi","Vendredi","Samedi","Dimanche","Lundi","Mardi","Mercredi","Jeudi","Vendredi","Samedi","Dimanche","Lundi","Mardi","Mercredi","Jeudi","Vendredi","Samedi","Dimanche","Lundi","Mardi","Mercredi","Jeudi","Vendredi","Samedi","Dimanche","Lundi","Mardi","Mercredi","Jeudi","Vendredi","Samedi","Dimanche","Lundi","Mardi","Mercredi","Jeudi","Vendredi","Samedi","Dimanche","Lundi","Mardi","Mercredi","Jeudi","Vendredi","Samedi","Dimanche","Lundi","Mardi","Mercredi","Jeudi","Vendredi","Samedi","Dimanche","Lundi","Mardi","Mercredi","Jeudi","Vendredi","Samedi","Dimanche","Lundi","Mardi","Mercredi","Jeudi","Vendredi","Samedi","Dimanche","Lundi","Mardi","Mercredi","Jeudi","Vendredi","Samedi","Dimanche","Lundi","Mardi","Mercredi","Jeudi","Vendredi","Samedi","Dimanche","Lundi","Mardi","Mercredi","Jeudi","Vendredi","Samedi","Dimanche","Lundi","Mardi","Mercredi","Jeudi","Vendredi","Samedi","Dimanche","Lundi","Mardi","Mercredi","Jeudi","Vendredi","Samedi","Dimanche","Lundi","Mardi","Mercredi","Jeudi","Vendredi","Samedi","Dimanche","Lundi","Mardi","Mercredi","Jeudi","Vendredi","Samedi","Dimanche","Lundi","Mardi","Mercredi","Jeudi","Vendredi","Samedi","Dimanche","Lundi","Mardi","Mercredi","Jeudi","Vendredi","Samedi","Dimanche","Lundi","Mardi","Mercredi","Jeudi","Vendredi","Samedi","Dimanche","Lundi","Mardi","Mercredi","Jeudi","Vendredi","Samedi","Dimanche","Lundi","Mardi","Mercredi","Jeudi","Vendredi","Samedi","Dimanche","Lundi","Mardi","Mercredi","Jeudi","Vendredi","Samedi","Dimanche","Lundi","Mardi","Mercredi","Jeudi","Vendredi","Samedi","Dimanche","Lundi","Mardi","Mercredi","Jeudi","Vendredi","Samedi","Dimanche","Lundi","Mardi","Mercredi","Jeudi","Vendredi","Samedi","Dimanche","Lundi","Mardi","Mercredi","Jeudi","Vendredi","Samedi","Dimanche","Lundi","Mardi","Mercredi","Jeudi","Vendredi","Samedi","Dimanche","Lundi","Mardi","Mercredi","Jeudi","Vendredi","Samedi","Dimanche","Lundi","Mardi","Mercredi","Jeudi","Vendredi","Samedi","Dimanche","Lundi","Mardi","Mercredi","Jeudi","Vendredi","Samedi","Dimanche","Lundi","Mardi","Mercredi","Jeudi","Vendredi","Samedi","Dimanche","Lundi","Mardi","Mercredi","Jeudi","Vendredi","Samedi","Dimanche","Lundi","Mardi","Mercredi","Jeudi","Vendredi","Samedi","Dimanche","Lundi","Mardi","Mercredi","Jeudi","Vendredi","Samedi","Dimanche","Lundi","Mardi","Mercredi","Jeudi","Vendredi","Samedi","Dimanche","Lundi","Mardi","Mercredi","Jeudi","Vendredi","Samedi","Dimanche","Lundi","Mardi","Mercredi","Jeudi","Vendredi","Samedi","Dimanche","Lundi","Mardi","Mercredi","Jeudi","Vendredi","Samedi","Dimanche","Lundi","Mardi","Mercredi","Jeudi","Vendredi","Samedi","Dimanche","Lundi","Mardi","Mercredi","Jeudi","Vendredi","Samedi","Dimanche","Lundi","Mardi","Mercredi","Jeudi","Vendredi","Samedi","Dimanche","Lundi","Mardi","Mercredi","Jeudi","Vendredi","Samedi","Dimanche","Lundi","Mardi","Mercredi","Jeudi","Vendredi","Samedi","Dimanche","Lundi","Mardi","Mercredi","Jeudi","Vendredi","Samedi","Dimanche","Lundi","Mardi","Mercredi","Jeudi","Vendredi","Samedi","Dimanche","Lundi","Mardi","Mercredi","Jeudi","Vendredi","Samedi","Dimanche","Lundi","Mardi","Mercredi","Jeudi","Vendredi","Samedi","Dimanche","Lundi","Mardi","Mercredi","Jeudi","Vendredi","Samedi","Dimanche","Lundi","Mardi","Mercredi","Jeudi","Vendredi","Samedi","Dimanche","Lundi","Mardi","Mercredi","Jeudi","Vendredi","Samedi","Dimanche"]
[null,null,null,{"$f":"E3-1","v":"2023-10-30"},"2023-10-31","2023-11-01","2023-11-02","2023-11-03","2023-11-04",{"$f":"K3-1","v":"2023-11-05"},{"$f":"DATE(An,MONTH(1&Premier_mois),7)-MOD(DATE(An,MONTH(1&Premier_mois),7)-2,7)","v":"2023-11-06"},{"$f":"K3+1","v":"2023-11-07"},"2023-11-08","2023-11-09","2023-11-10","2023-11-11","2023-11-12","2023-11-13","2023-11-14","2023-11-15","2023-11-16","2023-11-17","2023-11-18","2023-11-19","2023-11-20","2023-11-21","2023-11-22","2023-11-23","2023-11-24","2023-11-25","2023-11-26","2023-11-27","2023-11-28","2023-11-29","2023-11-30","2023-12-01","2023-12-02","2023-12-03","2023-12-04","2023-12-05","2023-12-06","2023-12-07","2023-12-08","2023-12-09","2023-12-10","2023-12-11","2023-12-12","2023-12-13","2023-12-14","2023-12-15","2023-12-16","2023-12-17","2023-12-18","2023-12-19","2023-12-20","2023-12-21","2023-12-22","2023-12-23","2023-12-24","2023-12-25","2023-12-26","2023-12-27","2023-12-28","2023-12-29","2023-12-30","2023-12-31","2024-01-01","2024-01-02","2024-01-03","2024-01-04","2024-01-05","2024-01-06","2024-01-07","2024-01-08","2024-01-09",{"$f":"BW3+1","v":"2024-01-10"},"2024-01-11","2024-01-12","2024-01-13","2024-01-14","2024-01-15","2024-01-16","2024-01-17","2024-01-18","2024-01-19","2024-01-20","2024-01-21","2024-01-22","2024-01-23","2024-01-24","2024-01-25","2024-01-26","2024-01-27","2024-01-28","2024-01-29","2024-01-30","2024-01-31","2024-02-01","2024-02-02","2024-02-03","2024-02-04","2024-02-05","2024-02-06","2024-02-07","2024-02-08","2024-02-09","2024-02-10","2024-02-11","2024-02-12","2024-02-13","2024-02-14","2024-02-15","2024-02-16","2024-02-17","2024-02-18","2024-02-19","2024-02-20","2024-02-21","2024-02-22","2024-02-23","2024-02-24","2024-02-25","2024-02-26","2024-02-27","2024-02-28","2024-02-29","2024-03-01","2024-03-02","2024-03-03","2024-03-04","2024-03-05","2024-03-06","2024-03-07","2024-03-08","2024-03-09","2024-03-10","2024-03-11","2024-03-12","2024-03-13",{"$f":"EI3+1","v":"2024-03-14"},"2024-03-15","2024-03-16","2024-03-17","2024-03-18","2024-03-19","2024-03-20","2024-03-21","2024-03-22","2024-03-23","2024-03-24","2024-03-25","2024-03-26","2024-03-27","2024-03-28","2024-03-29","2024-03-30","2024-03-31","2024-04-01","2024-04-02","2024-04-03","2024-04-04","2024-04-05","2024-04-06","2024-04-07","2024-04-08","2024-04-09","2024-04-10","2024-04-11","2024-04-12","2024-04-13","2024-04-14","2024-04-15","2024-04-16","2024-04-17","2024-04-18","2024-04-19","2024-04-20","2024-04-21","2024-04-22","2024-04-23","2024-04-24","2024-04-25","2024-04-26","2024-04-27","2024-04-28","2024-04-29","2024-04-30","2024-05-01","2024-05-02","2024-05-03","2024-05-04","2024-05-05","2024-05-06","2024-05-07","2024-05-08","2024-05-09","2024-05-10","2024-05-11","2024-05-12","2024-05-13","2024-05-14","2024-05-15","2024-05-16",{"$f":"GU3+1","v":"2024-05-17"},"2024-05-18","2024-05-19","2024-05-20","2024-05-21","2024-05-22","2024-05-23","2024-05-24","2024-05-25","2024-05-26","2024-05-27","2024-05-28","2024-05-29","2024-05-30","2024-05-31","2024-06-01","2024-06-02","2024-06-03","2024-06-04","2024-06-05","2024-06-06","2024-06-07","2024-06-08","2024-06-09","2024-06-10","2024-06-11","2024-06-12","2024-06-13","2024-06-14","2024-06-15","2024-06-16","2024-06-17","2024-06-18","2024-06-19","2024-06-20","2024-06-21","2024-06-22","2024-06-23","2024-06-24","2024-06-25","2024-06-26","2024-06-27","2024-06-28","2024-06-29","2024-06-30","2024-07-01","2024-07-02","2024-07-03","2024-07-04","2024-07-05","2024-07-06","2024-07-07","2024-07-08","2024-07-09","2024-07-10","2024-07-11","2024-07-12","2024-07-13","2024-07-14","2024-07-15","2024-07-16","2024-07-17","2024-07-18","2024-07-19",{"$f":"JG3+1","v":"2024-07-20"},"2024-07-21","2024-07-22","2024-07-23","2024-07-24","2024-07-25","2024-07-26","2024-07-27","2024-07-28","2024-07-29","2024-07-30","2024-07-31","2024-08-01","2024-08-02","2024-08-03","2024-08-04","2024-08-05","2024-08-06","2024-08-07","2024-08-08","2024-08-09","2024-08-10","2024-08-11","2024-08-12","2024-08-13","2024-08-14","2024-08-15","2024-08-16","2024-08-17","2024-08-18","2024-08-19","2024-08-20","2024-08-21","2024-08-22","2024-08-23","2024-08-24","2024-08-25","2024-08-26","2024-08-27","2024-08-28","2024-08-29","2024-08-30","2024-08-31","2024-09-01","2024-09-02","2024-09-03","2024-09-04","2024-09-05","2024-09-06","2024-09-07","2024-09-08","2024-09-09","2024-09-10","2024-09-11","2024-09-12","2024-09-13","2024-09-14","2024-09-15","2024-09-16","2024-09-17","2024-09-18","2024-09-19","2024-09-20","2024-09-21",{"$f":"LS3+1","v":"2024-09-22"},"2024-09-23","2024-09-24","2024-09-25","2024-09-26","2024-09-27","2024-09-28","2024-09-29","2024-09-30","2024-10-01","2024-10-02","2024-10-03","2024-10-04","2024-10-05","2024-10-06","2024-10-07","2024-10-08","2024-10-09","2024-10-10","2024-10-11","2024-10-12","2024-10-13","2024-10-14","2024-10-15","2024-10-16","2024-10-17","2024-10-18","2024-10-19","2024-10-20","2024-10-21","2024-10-22","2024-10-23","2024-10-24","2024-10-25","2024-10-26","2024-10-27","2024-10-28","2024-10-29","2024-10-30","2024-10-31","2024-11-01","2024-11-02","2024-11-03","2024-11-04","2024-11-05","2024-11-06","2024-11-07","2024-11-08","2024-11-09","2024-11-10","2024-11-11","2024-11-12","2024-11-13","2024-11-14","2024-11-15","2024-11-16","2024-11-17"]
["7","00"]
["7",15]
["7",30]
["7",45]
["8","00",null,null,null,null,null," "]
["8",15]
[8,30]
[8,45]
["9","00"]
["9",15]
["9",30]
["9",45]
["10","00",null,null,null,null," "]
["10",15]
["10",30]
["10",45]
["11","00"]
["11",15]
["11",30]
["11",45]
["12","00"]
["12",15]
["12",30]
["12",45]
["13","00"]
["13",15]
[13,30]
[13,45]
["14","00"]
["14",15]
[14,30]
[14,45]
["15","00"]
["15",15]
[15,30]
[15,45]
["16","00"]
["16",15]
[16,30]
[16,45]
["17","00"]
["17",15]
[17,30]
[17,45]
["18","00"]
["18",15]
[18,30]
[18,45]
["19","00"]
[null,null,null,"Notes :","Notes :","Notes :","Notes :","Notes :","Notes :","Notes :","Notes :","Notes :","Notes :","Notes :","Notes :","Notes :","Notes :","Notes :","Notes :","Notes :","Notes :","Notes :","Notes :","Notes :","Notes :","Notes :","Notes :","Notes :","Notes :","Notes :","Notes :","Notes :","Notes :","Notes :","Notes :","Notes :","Notes :","Notes :","Notes :","Notes :","Notes :","Notes :","Notes :","Notes :","Notes :","Notes :","Notes :","Notes :","Notes :","Notes :","Notes :","Notes :","Notes :","Notes :","Notes :","Notes :","Notes :","Notes :","Notes :","Notes :","Notes :","Notes :","Notes :","Notes :","Notes :","Notes :","Notes :","Notes :","Notes :","Notes :","Notes :","Notes :","Notes :","Notes :","Notes :","Notes :","Notes :","Notes :","Notes :","Notes :","Notes :","Notes :","Notes :","Notes :","Notes :","Notes :","Notes :","Notes :","Notes :","Notes :","Notes :","Notes :","Notes :","Notes :","Notes :","Notes :","Notes :","Notes :","Notes :","Notes :","Notes :","Notes :","Notes :","Notes :","Notes :","Notes :","Notes :","Notes :","Notes :","Notes :","Notes :","Notes :","Notes :","Notes :","Notes :","Notes :","Notes :","Notes :","Notes :","Notes :","Notes :","Notes :","Notes :","Notes :","Notes :","Notes :","Notes :","Notes :","Notes :","Notes :","Notes :","Notes :","Notes :","Notes :","Notes :","Notes :","Notes :","Notes :","Notes :","Notes :","Notes :","Notes :","Notes :","Notes :","Notes :","Notes :","Notes :","Notes :","Notes :","Notes :","Notes :","Notes :","Notes :","Notes :","Notes :","Notes :","Notes :","Notes :","Notes :","Notes :","Notes :","Notes :","Notes :","Notes :","Notes :","Notes :","Notes :","Notes :","Notes :","Notes :","Notes :","Notes :","Notes :","Notes :","Notes :","Notes :","Notes :","Notes :","Notes :","Notes :","Notes :","Notes :","Notes :","Notes :","Notes :","Notes :","Notes :","Notes :","Notes :","Notes :","Notes :","Notes :","Notes :","Notes :","Notes :","Notes :","Notes :","Notes :","Notes :","Notes :","Notes :","Notes :","Notes :","Notes :","Notes :","Notes :","Notes :","Notes :","Notes :","Notes :","Notes :","Notes :","Notes :","Notes :","Notes :","Notes :","Notes :","Notes :","Notes :","Notes :","Notes :","Notes :","Notes :","Notes :","Notes :","Notes :","Notes :","Notes :","Notes :","Notes :","Notes :","Notes :","Notes :","Notes :","Notes :","Notes :","Notes :","Notes :","Notes :","Notes :","Notes :","Notes :","Notes :","Notes :","Notes :","Notes :","Notes :","Notes :","Notes :","Notes :","Notes :","Notes :","Notes :","Notes :","Notes :","Notes :","Notes :","Notes :","Notes :","Notes :","Notes :","Notes :","Notes :","Notes :","Notes :","Notes :","Notes :","Notes :","Notes :","Notes :","Notes :","Notes :","Notes :","Notes :","Notes :","Notes :","Notes :","Notes :","Notes :","Notes :","Notes :","Notes :","Notes :","Notes :","Notes :","Notes :","Notes :","Notes :","Notes :","Notes :","Notes :","Notes :","Notes :","Notes :","Notes :","Notes :","Notes :","Notes :","Notes :","Notes :","Notes :","Notes :","Notes :","Notes :","Notes :","Notes :","Notes :","Notes :","Notes :","Notes :","Notes :","Notes :","Notes :","Notes :","Notes :","Notes :","Notes :","Notes :","Notes :","Notes :","Notes :","Notes :","Notes :","Notes :","Notes :","Notes :","Notes :","Notes :","Notes :","Notes :","Notes :","Notes :","Notes :","Notes :","Notes :","Notes :","Notes :","Notes :","Notes :","Notes :","Notes :","Notes :","Notes :","Notes :","Notes :","Notes :","Notes :","Notes :","Notes :","Notes :","Notes :","Notes :","Notes :","Notes :","Notes :","Notes :","Notes :","Notes :","Notes :","Notes :","Notes :","Notes :","Notes :","Notes :","Notes :","Notes :","Notes :","Notes :","Notes :","Notes :","Notes :","Notes :","Notes :","Notes :","Notes :","Notes :","Notes :","Notes :","Notes :","Notes :","Notes :","Notes :","Notes :","Notes :","Notes :","Notes :","Notes :","Notes :"]

{"sheet":"Calendrier Cadre","index":3,"n_rows":35,"n_cols":26,"rows_kept":35,"cut":false,"hidden":false,"merged":[[18,0,18,7],[27,0,27,7],[18,9,18,16],[27,9,27,16],[27,18,27,25],[18,18,18,25],[0,0,0,7],[0,9,0,16],[0,18,0,25],[9,18,9,25],[9,9,9,16],[9,0,9,7]]}
[{"$f":"PROPER(TEXT(B4,\"MMMM\"))&\" \"&YEAR(B4)","v":"Novembre 2023"},null,null,null,null,null,null,null,null,{"$f":"PROPER(TEXT(K4,\"MMMM\"))&\" \"&YEAR(K4)","v":"Décembre 2023"},null,null,null,null,null,null,null,null,{"$f":"PROPER(TEXT(T4,\"MMMM\"))&\" \"&YEAR(T4)","v":"Janvier 2024"}]
["Semaine","Lundi","Mardi","Mercredi","Jeudi","Vendredi","Samedi","Dimanche",null,"Semaine","Lundi","Mardi","Mercredi","Jeudi","Vendredi","Samedi","Dimanche",null,"Semaine","Lundi","Mardi","Mercredi","Jeudi","Vendredi","Samedi","Dimanche"]
[{"$f":"INT((E3-LOOKUP(E3,DATE(YEAR(E3)+{-1;0;1},1,3)-WEEKDAY(DATE(YEAR(E3)+{-1;0;1},1,3))+2))/7)+1","v":44},{"$f":"IF(DAY(DATE(An,MONTH(1&Premier_mois),7)-MOD(DATE(An,MONTH(1&Premier_mois),7)-2,7))>1,DATE(An,MONTH(1&Premier_mois),7)-MOD(DATE(An,MONTH(1&Premier_mois),7)-2,7)-7,DATE(An,MONTH(1&Premier_mois),7)-MOD(DATE(An,MONTH(1&Premier_mois),7)-2,7))","v":"2023-10-30"},{"$f":"B3+1","v":"2023-10-31"},{"$f":"C3+1","v":"2023-11-01"},"2023-11-02","2023-11-03","2023-11-04","2023-11-05",null,{"$f":"INT((N3-LOOKUP(N3,DATE(YEAR(N3)+{-1;0;1},1,3)-WEEKDAY(DATE(YEAR(N3)+{-1;0;1},1,3))+2))/7)+1","v":48},{"$f":"IF(DAY(DATE(An,MONTH(1&Premier_mois)+1,7)-MOD(DATE(An,MONTH(1&Premier_mois)+1,7)-2,7))>1,DATE(An,MONTH(1&Premier_mois)+1,7)-MOD(DATE(An,MONTH(1&Premier_mois)+1,7)-2,7)-7,DATE(An,MONTH(1&Premier_mois)+1,7)-MOD(DATE(An,MONTH(1&Premier_mois)+1,7)-2,7))","v":"2023-11-27"},{"$f":"K3+1","v":"2023-11-28"},{"$f":"L3+1","v":"2023-11-29"},"2023-11-30","2023-12-01","2023-12-02","2023-12-03",null,{"$f":"INT((W3-LOOKUP(W3,DATE(YEAR(W3)+{-1;0;1},1,3)-WEEKDAY(DATE(YEAR(W3)+{-1;0;1},1,3))+2))/7)+1","v":1},{"$f":"IF(DAY(DATE(An,MONTH(1&Premier_mois)+2,7)-MOD(DATE(An,MONTH(1&Premier_mois)+2,7)-2,7))>1,DATE(An,MONTH(1&Premier_mois)+2,7)-MOD(DATE(An,MONTH(1&Premier_mois)+2,7)-2,7)-7,DATE(An,MONTH(1&Premier_mois)+2,7)-MOD(DATE(An,MONTH(1&Premier_mois)+2,7)-2,7))","v":"2024-01-01"},{"$f":"T3+1","v":"2024-01-02"},{"$f":"U3+1","v":"2024-01-03"},"2024-01-04","2024-01-05","2024-01-06","2024-01-07"]
[{"$f":"INT((E4-LOOKUP(E4,DATE(YEAR(E4)+{-1;0;1},1,3)-WEEKDAY(DATE(YEAR(E4)+{-1;0;1},1,3))+2))/7)+1","v":45},{"$f":"H3+1","v":"2023-11-06"},{"$f":"B4+1","v":"2023-11-07"},"2023-11-08","2023-11-09","2023-11-10","2023-11-11","2023-11-12",null,{"$f":"INT((N4-LOOKUP(N4,DATE(YEAR(N4)+{-1;0;1},1,3)-WEEKDAY(DATE(YEAR(N4)+{-1;0;1},1,3))+2))/7)+1","v":49},{"$f":"Q3+1","v":"2023-12-04"},{"$f":"K4+1","v":"2023-12-05"},"2023-12-06","2023-12-07","2023-12-08","2023-12-09","2023-12-10",null,{"$f":"INT((W4-LOOKUP(W4,DATE(YEAR(W4)+{-1;0;1},1,3)-WEEKDAY(DATE(YEAR(W4)+{-1;0;1},1,3))+2))/7)+1","v":2},{"$f":"Z3+1","v":"2024-01-08"},{"$f":"T4+1","v":"2024-01-09"},{"$f":"U4+1","v":"2024-01-10"},"2024-01-11","2024-01-12","2024-01-13","2024-01-14"]
[{"$f":"INT((E5-LOOKUP(E5,DATE(YEAR(E5)+{-1;0;1},1,3)-WEEKDAY(DATE(YEAR(E5)+{-1;0;1},1,3))+2))/7)+1","v":46},{"$f":"H4+1","v":"2023-11-13"},{"$f":"B5+1","v":"2023-11-14"},"2023-11-15","2023-11-16","2023-11-17","2023-11-18","2023-11-19",null,{"$f":"INT((N5-LOOKUP(N5,DATE(YEAR(N5)+{-1;0;1},1,3)-WEEKDAY(DATE(YEAR(N5)+{-1;0;1},1,3))+2))/7)+1","v":50},{"$f":"Q4+1","v":"2023-12-11"},{"$f":"K5+1","v":"2023-12-12"},"2023-12-13","2023-12-14","2023-12-15","2023-12-16","2023-12-17",null,{"$f":"INT((W5-LOOKUP(W5,DATE(YEAR(W5)+{-1;0;1},1,3)-WEEKDAY(DATE(YEAR(W5)+{-1;0;1},1,3))+2))/7)+1","v":3},{"$f":"Z4+1","v":"2024-01-15"},{"$f":"T5+1","v":"2024-01-16"},"2024-01-17","2024-01-18","2024-01-19","2024-01-20","2024-01-21"]
[{"$f":"INT((E6-LOOKUP(E6,DATE(YEAR(E6)+{-1;0;1},1,3)-WEEKDAY(DATE(YEAR(E6)+{-1;0;1},1,3))+2))/7)+1","v":47},"2023-11-20","2023-11-21","2023-11-22","2023-11-23","2023-11-24","2023-11-25","2023-11-26",null,{"$f":"INT((N6-LOOKUP(N6,DATE(YEAR(N6)+{-1;0;1},1,3)-WEEKDAY(DATE(YEAR(N6)+{-1;0;1},1,3))+2))/7)+1","v":51},"2023-12-18","2023-12-19","2023-12-20","2023-12-21","2023-12-22","2023-12-23","2023-12-24",null,{"$f":"INT((W6-LOOKUP(W6,DATE(YEAR(W6)+{-1;0;1},1,3)-WEEKDAY(DATE(YEAR(W6)+{-1;0;1},1,3))+2))/7)+1","v":4},"2024-01-22",{"$f":"T6+1","v":"2024-01-23"},"2024-01-24","2024-01-25","2024-01-26","2024-01-27","2024-01-28"]
[{"$f":"IF(B7<=EOMONTH(B5,0),INT((E7-LOOKUP(E7,DATE(YEAR(E7)+{-1;0;1},1,3)-WEEKDAY(DATE(YEAR(E7)+{-1;0;1},1,3))+2))/7)+1,\"\")","v":48},"2023-11-27","2023-11-28","2023-11-29","2023-11-30","2023-12-01","2023-12-02","2023-12-03",null,{"$f":"IF(K7<=EOMONTH(K5,0),INT((N7-LOOKUP(N7,DATE(YEAR(N7)+{-1;0;1},1,3)-WEEKDAY(DATE(YEAR(N7)+{-1;0;1},1,3))+2))/7)+1,\"\")","v":52},"2023-12-25","2023-12-26","2023-12-27","2023-12-28","2023-12-29","2023-12-30","2023-12-31",null,{"$f":"IF(T7<=EOMONTH(T5,0),INT((W7-LOOKUP(W7,DATE(YEAR(W7)+{-1;0;1},1,3)-WEEKDAY(DATE(YEAR(W7)+{-1;0;1},1,3))+2))/7)+1,\"\")","v":5},"2024-01-29",{"$f":"T7+1","v":"2024-01-30"},"2024-01-31","2024-02-01","2024-02-02","2024-02-03","2024-02-04"]
[{"$f":"IF(B8<=EOMONTH(B6,0),INT((E8-LOOKUP(E8,DATE(YEAR(E8)+{-1;0;1},1,3)-WEEKDAY(DATE(YEAR(E8)+{-1;0;1},1,3))+2))/7)+1,\"\")","v":""},"2023-12-04","2023-12-05","2023-12-06","2023-12-07","2023-12-08","2023-12-09","2023-12-10",null,{"$f":"IF(K8<=EOMONTH(K6,0),INT((N8-LOOKUP(N8,DATE(YEAR(N8)+{-1;0;1},1,3)-WEEKDAY(DATE(YEAR(N8)+{-1;0;1},1,3))+2))/7)+1,\"\")","v":""},"2024-01-01","2024-01-02","2024-01-03","2024-01-04","2024-01-05","2024-01-06","2024-01-07",null,{"$f":"IF(T8<=EOMONTH(T6,0),INT((W8-LOOKUP(W8,DATE(YEAR(W8)+{-1;0;1},1,3)-WEEKDAY(DATE(YEAR(W8)+{-1;0;1},1,3))+2))/7)+1,\"\")","v":""},"2024-02-05",{"$f":"T8+1","v":"2024-02-06"},"2024-02-07","2024-02-08","2024-02-09","2024-02-10","2024-02-11"]
[]
[{"$f":"PROPER(TEXT(B13,\"MMMM\"))&\" \"&YEAR(B13)","v":"Février 2024"},null,null,null,null,null,null,null,null,{"$f":"PROPER(TEXT(K13,\"MMMM\"))&\" \"&YEAR(K13)","v":"Mars 2024"},null,null,null,null,null,null,null,null,{"$f":"PROPER(TEXT(T13,\"MMMM\"))&\" \"&YEAR(T13)","v":"Avril 2024"}]
["Semaine","Lundi","Mardi","Mercredi","Jeudi","Vendredi","Samedi","Dimanche",null,"Semaine","Lundi","Mardi","Mercredi","Jeudi","Vendredi","Samedi","Dimanche",null,"Semaine","Lundi","Mardi","Mercredi","Jeudi","Vendredi","Samedi","Dimanche"]
[{"$f":"INT((E12-LOOKUP(E12,DATE(YEAR(E12)+{-1;0;1},1,3)-WEEKDAY(DATE(YEAR(E12)+{-1;0;1},1,3))+2))/7)+1","v":5},{"$f":"IF(DAY(DATE(An,MONTH(1&Premier_mois)+3,7)-MOD(DATE(An,MONTH(1&Premier_mois)+3,7)-2,7))>1,DATE(An,MONTH(1&Premier_mois)+3,7)-MOD(DATE(An,MONTH(1&Premier_mois)+3,7)-2,7)-7,DATE(An,MONTH(1&Premier_mois)+3,7)-MOD(DATE(An,MONTH(1&Premier_mois)+3,7)-2,7))","v":"2024-01-29"},{"$f":"B12+1","v":"2024-01-30"},{"$f":"C12+1","v":"2024-01-31"},"2024-02-01","2024-02-02","2024-02-03","2024-02-04",null,{"$f":"INT((N12-LOOKUP(N12,DATE(YEAR(N12)+{-1;0;1},1,3)-WEEKDAY(DATE(YEAR(N12)+{-1;0;1},1,3))+2))/7)+1","v":9},{"$f":"IF(DAY(DATE(An,MONTH(1&Premier_mois)+4,7)-MOD(DATE(An,MONTH(1&Premier_mois)+4,7)-2,7))>1,DATE(An,MONTH(1&Premier_mois)+4,7)-MOD(DATE(An,MONTH(1&Premier_mois)+4,7)-2,7)-7,DATE(An,MONTH(1&Premier_mois)+4,7)-MOD(DATE(An,MONTH(1&Premier_mois)+4,7)-2,7))","v":"2024-02-26"},{"$f":"K12+1","v":"2024-02-27"},{"$f":"L12+1","v":"2024-02-28"},"2024-02-29","2024-03-01","2024-03-02","2024-03-03",null,{"$f":"INT((W12-LOOKUP(W12,DATE(YEAR(W12)+{-1;0;1},1,3)-WEEKDAY(DATE(YEAR(W12)+{-1;0;1},1,3))+2))/7)+1","v":14},{"$f":"IF(DAY(DATE(An,MONTH(1&Premier_mois)+5,7)-MOD(DATE(An,MONTH(1&Premier_mois)+5,7)-2,7))>1,DATE(An,MONTH(1&Premier_mois)+5,7)-MOD(DATE(An,MONTH(1&Premier_mois)+5,7)-2,7)-7,DATE(An,MONTH(1&Premier_mois)+5,7)-MOD(DATE(An,MONTH(1&Premier_mois)+5,7)-2,7))","v":"2024-04-01"},{"$f":"T12+1","v":"2024-04-02"},{"$f":"U12+1","v":"2024-04-03"},"2024-04-04","2024-04-05","2024-04-06","2024-04-07"]
[{"$f":"INT((E13-LOOKUP(E13,DATE(YEAR(E13)+{-1;0;1},1,3)-WEEKDAY(DATE(YEAR(E13)+{-1;0;1},1,3))+2))/7)+1","v":6},{"$f":"H12+1","v":"2024-02-05"},{"$f":"B13+1","v":"2024-02-06"},{"$f":"C13+1","v":"2024-02-07"},"2024-02-08","2024-02-09","2024-02-10","2024-02-11",null,{"$f":"INT((N13-LOOKUP(N13,DATE(YEAR(N13)+{-1;0;1},1,3)-WEEKDAY(DATE(YEAR(N13)+{-1;0;1},1,3))+2))/7)+1","v":10},{"$f":"Q12+1","v":"2024-03-04"},{"$f":"K13+1","v":"2024-03-05"},{"$f":"L13+1","v":"2024-03-06"},"2024-03-07","2024-03-08","2024-03-09","2024-03-10",null,{"$f":"INT((W13-LOOKUP(W13,DATE(YEAR(W13)+{-1;0;1},1,3)-WEEKDAY(DATE(YEAR(W13)+{-1;0;1},1,3))+2))/7)+1","v":15},{"$f":"Z12+1","v":"2024-04-08"},{"$f":"T13+1","v":"2024-04-09"},{"$f":"U13+1","v":"2024-04-10"},"2024-04-11","2024-04-12","2024-04-13","2024-04-14"]
[{"$f":"INT((E14-LOOKUP(E14,DATE(YEAR(E14)+{-1;0;1},1,3)-WEEKDAY(DATE(YEAR(E14)+{-1;0;1},1,3))+2))/7)+1","v":7},{"$f":"H13+1","v":"2024-02-12"},{"$f":"B14+1","v":"2024-02-13"},"2024-02-14","2024-02-15","2024-02-16","2024-02-17","2024-02-18",null,{"$f":"INT((N14-LOOKUP(N14,DATE(YEAR(N14)+{-1;0;1},1,3)-WEEKDAY(DATE(YEAR(N14)+{-1;0;1},1,3))+2))/7)+1","v":11},{"$f":"Q13+1","v":"2024-03-11"},{"$f":"K14+1","v":"2024-03-12"},"2024-03-13","2024-03-14","2024-03-15","2024-03-16","2024-03-17",null,{"$f":"INT((W14-LOOKUP(W14,DATE(YEAR(W14)+{-1;0;1},1,3)-WEEKDAY(DATE(YEAR(W14)+{-1;0;1},1,3))+2))/7)+1","v":16},{"$f":"Z13+1","v":"2024-04-15"},{"$f":"T14+1","v":"2024-04-16"},"2024-04-17","2024-04-18","2024-04-19","2024-04-20","2024-04-21"]
[{"$f":"INT((E15-LOOKUP(E15,DATE(YEAR(E15)+{-1;0;1},1,3)-WEEKDAY(DATE(YEAR(E15)+{-1;0;1},1,3))+2))/7)+1","v":8},"2024-02-19",{"$f":"B15+1","v":"2024-02-20"},"2024-02-21","2024-02-22","2024-02-23","2024-02-24","2024-02-25",null,{"$f":"INT((N15-LOOKUP(N15,DATE(YEAR(N15)+{-1;0;1},1,3)-WEEKDAY(DATE(YEAR(N15)+{-1;0;1},1,3))+2))/7)+1","v":12},"2024-03-18",{"$f":"K15+1","v":"2024-03-19"},"2024-03-20","2024-03-21","2024-03-22","2024-03-23","2024-03-24",null,{"$f":"INT((W15-LOOKUP(W15,DATE(YEAR(W15)+{-1;0;1},1,3)-WEEKDAY(DATE(YEAR(W15)+{-1;0;1},1,3))+2))/7)+1","v":17},"2024-04-22",{"$f":"T15+1","v":"2024-04-23"},"2024-04-24","2024-04-25","2024-04-26","2024-04-27","2024-04-28"]
[{"$f":"IF(B16<=EOMONTH(B14,0),INT((E16-LOOKUP(E16,DATE(YEAR(E16)+{-1;0;1},1,3)-WEEKDAY(DATE(YEAR(E16)+{-1;0;1},1,3))+2))/7)+1,\"\")","v":9},"2024-02-26",{"$f":"B16+1","v":"2024-02-27"},"2024-02-28","2024-02-29","2024-03-01","2024-03-02","2024-03-03",null,{"$f":"IF(K16<=EOMONTH(K14,0),INT((N16-LOOKUP(N16,DATE(YEAR(N16)+{-1;0;1},1,3)-WEEKDAY(DATE(YEAR(N16)+{-1;0;1},1,3))+2))/7)+1,\"\")","v":13},"2024-03-25",{"$f":"K16+1","v":"2024-03-26"},"2024-03-27","2024-03-28","2024-03-29","2024-03-30","2024-03-31",null,{"$f":"IF(T16<=EOMONTH(T14,0),INT((W16-LOOKUP(W16,DATE(YEAR(W16)+{-1;0;1},1,3)-WEEKDAY(DATE(YEAR(W16)+{-1;0;1},1,3))+2))/7)+1,\"\")","v":18},"2024-04-29",{"$f":"T16+1","v":"2024-04-30"},"2024-05-01","2024-05-02","2024-05-03","2024-05-04","2024-05-05"]
[{"$f":"IF(B17<=EOMONTH(B15,0),INT((E17-LOOKUP(E17,DATE(YEAR(E17)+{-1;0;1},1,3)-WEEKDAY(DATE(YEAR(E17)+{-1;0;1},1,3))+2))/7)+1,\"\")","v":""},"2024-03-04",{"$f":"B17+1","v":"2024-03-05"},"2024-03-06","2024-03-07","2024-03-08","2024-03-09","2024-03-10",null,{"$f":"IF(K17<=EOMONTH(K15,0),INT((N17-LOOKUP(N17,DATE(YEAR(N17)+{-1;0;1},1,3)-WEEKDAY(DATE(YEAR(N17)+{-1;0;1},1,3))+2))/7)+1,\"\")","v":""},"2024-04-01",{"$f":"K17+1","v":"2024-04-02"},"2024-04-03","2024-04-04","2024-04-05","2024-04-06","2024-04-07",null,{"$f":"IF(T17<=EOMONTH(T15,0),INT((W17-LOOKUP(W17,DATE(YEAR(W17)+{-1;0;1},1,3)-WEEKDAY(DATE(YEAR(W17)+{-1;0;1},1,3))+2))/7)+1,\"\")","v":""},"2024-05-06",{"$f":"T17+1","v":"2024-05-07"},"2024-05-08","2024-05-09","2024-05-10","2024-05-11","2024-05-12"]
[]
[{"$f":"PROPER(TEXT(B22,\"MMMM\"))&\" \"&YEAR(B22)","v":"Mai 2024"},null,null,null,null,null,null,null,null,{"$f":"PROPER(TEXT(K22,\"MMMM\"))&\" \"&YEAR(K22)","v":"Juin 2024"},null,null,null,null,null,null,null,null,{"$f":"PROPER(TEXT(T22,\"MMMM\"))&\" \"&YEAR(T22)","v":"Juillet 2024"}]
["Semaine","Lundi","Mardi","Mercredi","Jeudi","Vendredi","Samedi","Dimanche",null,"Semaine","Lundi","Mardi","Mercredi","Jeudi","Vendredi","Samedi","Dimanche",null,"Semaine","Lundi","Mardi","Mercredi","Jeudi","Vendredi","Samedi","Dimanche"]
[{"$f":"INT((E21-LOOKUP(E21,DATE(YEAR(E21)+{-1;0;1},1,3)-WEEKDAY(DATE(YEAR(E21)+{-1;0;1},1,3))+2))/7)+1","v":18},{"$f":"IF(DAY(DATE(An,MONTH(1&Premier_mois)+6,7)-MOD(DATE(An,MONTH(1&Premier_mois)+6,7)-2,7))>1,DATE(An,MONTH(1&Premier_mois)+6,7)-MOD(DATE(An,MONTH(1&Premier_mois)+6,7)-2,7)-7,DATE(An,MONTH(1&Premier_mois)+6,7)-MOD(DATE(An,MONTH(1&Premier_mois)+6,7)-2,7))","v":"2024-04-29"},{"$f":"B21+1","v":"2024-04-30"},{"$f":"C21+1","v":"2024-05-01"},"2024-05-02","2024-05-03","2024-05-04","2024-05-05",null,{"$f":"INT((N21-LOOKUP(N21,DATE(YEAR(N21)+{-1;0;1},1,3)-WEEKDAY(DATE(YEAR(N21)+{-1;0;1},1,3))+2))/7)+1","v":22},{"$f":"IF(DAY(DATE(An,MONTH(1&Premier_mois)+7,7)-MOD(DATE(An,MONTH(1&Premier_mois)+7,7)-2,7))>1,DATE(An,MONTH(1&Premier_mois)+7,7)-MOD(DATE(An,MONTH(1&Premier_mois)+7,7)-2,7)-7,DATE(An,MONTH(1&Premier_mois)+7,7)-MOD(DATE(An,MONTH(1&Premier_mois)+7,7)-2,7))","v":"2024-05-27"},{"$f":"K21+1","v":"2024-05-28"},{"$f":"L21+1","v":"2024-05-29"},"2024-05-30","2024-05-31","2024-06-01","2024-06-02",null,{"$f":"INT((W21-LOOKUP(W21,DATE(YEAR(W21)+{-1;0;1},1,3)-WEEKDAY(DATE(YEAR(W21)+{-1;0;1},1,3))+2))/7)+1","v":27},{"$f":"IF(DAY(DATE(An,MONTH(1&Premier_mois)+8,7)-MOD(DATE(An,MONTH(1&Premier_mois)+8,7)-2,7))>1,DATE(An,MONTH(1&Premier_mois)+8,7)-MOD(DATE(An,MONTH(1&Premier_mois)+8,7)-2,7)-7,DATE(An,MONTH(1&Premier_mois)+8,7)-MOD(DATE(An,MONTH(1&Premier_mois)+8,7)-2,7))","v":"2024-07-01"},{"$f":"T21+1","v":"2024-07-02"},{"$f":"U21+1","v":"2024-07-03"},"2024-07-04","2024-07-05","2024-07-06","2024-07-07"]
[{"$f":"INT((E22-LOOKUP(E22,DATE(YEAR(E22)+{-1;0;1},1,3)-WEEKDAY(DATE(YEAR(E22)+{-1;0;1},1,3))+2))/7)+1","v":19},{"$f":"H21+1","v":"2024-05-06"},{"$f":"B22+1","v":"2024-05-07"},{"$f":"C22+1","v":"2024-05-08"},"2024-05-09","2024-05-10","2024-05-11","2024-05-12",null,{"$f":"INT((N22-LOOKUP(N22,DATE(YEAR(N22)+{-1;0;1},1,3)-WEEKDAY(DATE(YEAR(N22)+{-1;0;1},1,3))+2))/7)+1","v":23},{"$f":"Q21+1","v":"2024-06-03"},{"$f":"K22+1","v":"2024-06-04"},{"$f":"L22+1","v":"2024-06-05"},"2024-06-06","2024-06-07","2024-06-08","2024-06-09",null,{"$f":"INT((W22-LOOKUP(W22,DATE(YEAR(W22)+{-1;0;1},1,3)-WEEKDAY(DATE(YEAR(W22)+{-1;0;1},1,3))+2))/7)+1","v":28},{"$f":"Z21+1","v":"2024-07-08"},{"$f":"T22+1","v":"2024-07-09"},{"$f":"U22+1","v":"2024-07-10"},"2024-07-11","2024-07-12","2024-07-13","2024-07-14"]
[{"$f":"INT((E23-LOOKUP(E23,DATE(YEAR(E23)+{-1;0;1},1,3)-WEEKDAY(DATE(YEAR(E23)+{-1;0;1},1,3))+2))/7)+1","v":20},{"$f":"H22+1","v":"2024-05-13"},{"$f":"B23+1","v":"2024-05-14"},"2024-05-15","2024-05-16","2024-05-17","2024-05-18","2024-05-19",null,{"$f":"INT((N23-LOOKUP(N23,DATE(YEAR(N23)+{-1;0;1},1,3)-WEEKDAY(DATE(YEAR(N23)+{-1;0;1},1,3))+2))/7)+1","v":24},{"$f":"Q22+1","v":"2024-06-10"},{"$f":"K23+1","v":"2024-06-11"},"2024-06-12","2024-06-13","2024-06-14","2024-06-15","2024-06-16",null,{"$f":"INT((W23-LOOKUP(W23,DATE(YEAR(W23)+{-1;0;1},1,3)-WEEKDAY(DATE(YEAR(W23)+{-1;0;1},1,3))+2))/7)+1","v":29},{"$f":"Z22+1","v":"2024-07-15"},{"$f":"T23+1","v":"2024-07-16"},"2024-07-17","2024-07-18","2024-07-19","2024-07-20","2024-07-21"]
[{"$f":"INT((E24-LOOKUP(E24,DATE(YEAR(E24)+{-1;0;1},1,3)-WEEKDAY(DATE(YEAR(E24)+{-1;0;1},1,3))+2))/7)+1","v":21},"2024-05-20",{"$f":"B24+1","v":"2024-05-21"},"2024-05-22","2024-05-23","2024-05-24","2024-05-25","2024-05-26",null,{"$f":"INT((N24-LOOKUP(N24,DATE(YEAR(N24)+{-1;0;1},1,3)-WEEKDAY(DATE(YEAR(N24)+{-1;0;1},1,3))+2))/7)+1","v":25},"2024-06-17",{"$f":"K24+1","v":"2024-06-18"},"2024-06-19","2024-06-20","2024-06-21","2024-06-22","2024-06-23",null,{"$f":"INT((W24-LOOKUP(W24,DATE(YEAR(W24)+{-1;0;1},1,3)-WEEKDAY(DATE(YEAR(W24)+{-1;0;1},1,3))+2))/7)+1","v":30},"2024-07-22",{"$f":"T24+1","v":"2024-07-23"},"2024-07-24","2024-07-25","2024-07-26","2024-07-27","2024-07-28"]
[{"$f":"IF(B25<=EOMONTH(B23,0),INT((E25-LOOKUP(E25,DATE(YEAR(E25)+{-1;0;1},1,3)-WEEKDAY(DATE(YEAR(E25)+{-1;0;1},1,3))+2))/7)+1,\"\")","v":22},"2024-05-27",{"$f":"B25+1","v":"2024-05-28"},"2024-05-29","2024-05-30","2024-05-31","2024-06-01","2024-06-02",null,{"$f":"IF(K25<=EOMONTH(K23,0),INT((N25-LOOKUP(N25,DATE(YEAR(N25)+{-1;0;1},1,3)-WEEKDAY(DATE(YEAR(N25)+{-1;0;1},1,3))+2))/7)+1,\"\")","v":26},"2024-06-24",{"$f":"K25+1","v":"2024-06-25"},"2024-06-26","2024-06-27","2024-06-28","2024-06-29","2024-06-30",null,{"$f":"IF(T25<=EOMONTH(T23,0),INT((W25-LOOKUP(W25,DATE(YEAR(W25)+{-1;0;1},1,3)-WEEKDAY(DATE(YEAR(W25)+{-1;0;1},1,3))+2))/7)+1,\"\")","v":31},"2024-07-29",{"$f":"T25+1","v":"2024-07-30"},"2024-07-31","2024-08-01","2024-08-02","2024-08-03","2024-08-04"]
[{"$f":"IF(B26<=EOMONTH(B24,0),INT((E26-LOOKUP(E26,DATE(YEAR(E26)+{-1;0;1},1,3)-WEEKDAY(DATE(YEAR(E26)+{-1;0;1},1,3))+2))/7)+1,\"\")","v":""},"2024-06-03",{"$f":"B26+1","v":"2024-06-04"},"2024-06-05","2024-06-06","2024-06-07","2024-06-08","2024-06-09",null,{"$f":"IF(K26<=EOMONTH(K24,0),INT((N26-LOOKUP(N26,DATE(YEAR(N26)+{-1;0;1},1,3)-WEEKDAY(DATE(YEAR(N26)+{-1;0;1},1,3))+2))/7)+1,\"\")","v":""},"2024-07-01",{"$f":"K26+1","v":"2024-07-02"},"2024-07-03","2024-07-04","2024-07-05","2024-07-06","2024-07-07",null,{"$f":"IF(T26<=EOMONTH(T24,0),INT((W26-LOOKUP(W26,DATE(YEAR(W26)+{-1;0;1},1,3)-WEEKDAY(DATE(YEAR(W26)+{-1;0;1},1,3))+2))/7)+1,\"\")","v":""},"2024-08-05",{"$f":"T26+1","v":"2024-08-06"},"2024-08-07","2024-08-08","2024-08-09","2024-08-10","2024-08-11"]
[]
[{"$f":"PROPER(TEXT(B31,\"MMMM\"))&\" \"&YEAR(B31)","v":"Août 2024"},null,null,null,null,null,null,null,null,{"$f":"PROPER(TEXT(K31,\"MMMM\"))&\" \"&YEAR(K31)","v":"Septembre 2024"},null,null,null,null,null,null,null,null,{"$f":"PROPER(TEXT(T31,\"MMMM\"))&\" \"&YEAR(T31)","v":"Octobre 2024"}]
["Semaine","Lundi","Mardi","Mercredi","Jeudi","Vendredi","Samedi","Dimanche",null,"Semaine","Lundi","Mardi","Mercredi","Jeudi","Vendredi","Samedi","Dimanche",null,"Semaine","Lundi","Mardi","Mercredi","Jeudi","Vendredi","Samedi","Dimanche"]
[{"$f":"INT((E30-LOOKUP(E30,DATE(YEAR(E30)+{-1;0;1},1,3)-WEEKDAY(DATE(YEAR(E30)+{-1;0;1},1,3))+2))/7)+1","v":31},{"$f":"IF(DAY(DATE(An,MONTH(1&Premier_mois)+9,7)-MOD(DATE(An,MONTH(1&Premier_mois)+9,7)-2,7))>1,DATE(An,MONTH(1&Premier_mois)+9,7)-MOD(DATE(An,MONTH(1&Premier_mois)+9,7)-2,7)-7,DATE(An,MONTH(1&Premier_mois)+9,7)-MOD(DATE(An,MONTH(1&Premier_mois)+9,7)-2,7))","v":"2024-07-29"},{"$f":"B30+1","v":"2024-07-30"},{"$f":"C30+1","v":"2024-07-31"},"2024-08-01","2024-08-02","2024-08-03","2024-08-04",null,{"$f":"INT((N30-LOOKUP(N30,DATE(YEAR(N30)+{-1;0;1},1,3)-WEEKDAY(DATE(YEAR(N30)+{-1;0;1},1,3))+2))/7)+1","v":35},{"$f":"IF(DAY(DATE(An,MONTH(1&Premier_mois)+10,7)-MOD(DATE(An,MONTH(1&Premier_mois)+10,7)-2,7))>1,DATE(An,MONTH(1&Premier_mois)+10,7)-MOD(DATE(An,MONTH(1&Premier_mois)+10,7)-2,7)-7,DATE(An,MONTH(1&Premier_mois)+10,7)-MOD(DATE(An,MONTH(1&Premier_mois)+10,7)-2,7))","v":"2024-08-26"},{"$f":"K30+1","v":"2024-08-27"},{"$f":"L30+1","v":"2024-08-28"},"2024-08-29","2024-08-30","2024-08-31","2024-09-01",null,{"$f":"INT((W30-LOOKUP(W30,DATE(YEAR(W30)+{-1;0;1},1,3)-WEEKDAY(DATE(YEAR(W30)+{-1;0;1},1,3))+2))/7)+1","v":40},{"$f":"IF(DAY(DATE(An,MONTH(1&Premier_mois)+11,7)-MOD(DATE(An,MONTH(1&Premier_mois)+11,7)-2,7))>1,DATE(An,MONTH(1&Premier_mois)+11,7)-MOD(DATE(An,MONTH(1&Premier_mois)+11,7)-2,7)-7,DATE(An,MONTH(1&Premier_mois)+11,7)-MOD(DATE(An,MONTH(1&Premier_mois)+11,7)-2,7))","v":"2024-09-30"},{"$f":"T30+1","v":"2024-10-01"},{"$f":"U30+1","v":"2024-10-02"},"2024-10-03","2024-10-04","2024-10-05","2024-10-06"]
[{"$f":"INT((E31-LOOKUP(E31,DATE(YEAR(E31)+{-1;0;1},1,3)-WEEKDAY(DATE(YEAR(E31)+{-1;0;1},1,3))+2))/7)+1","v":32},{"$f":"H30+1","v":"2024-08-05"},{"$f":"B31+1","v":"2024-08-06"},{"$f":"C31+1","v":"2024-08-07"},"2024-08-08","2024-08-09","2024-08-10","2024-08-11",null,{"$f":"INT((N31-LOOKUP(N31,DATE(YEAR(N31)+{-1;0;1},1,3)-WEEKDAY(DATE(YEAR(N31)+{-1;0;1},1,3))+2))/7)+1","v":36},{"$f":"Q30+1","v":"2024-09-02"},{"$f":"K31+1","v":"2024-09-03"},{"$f":"L31+1","v":"2024-09-04"},"2024-09-05","2024-09-06","2024-09-07","2024-09-08",null,{"$f":"INT((W31-LOOKUP(W31,DATE(YEAR(W31)+{-1;0;1},1,3)-WEEKDAY(DATE(YEAR(W31)+{-1;0;1},1,3))+2))/7)+1","v":41},{"$f":"Z30+1","v":"2024-10-07"},{"$f":"T31+1","v":"2024-10-08"},{"$f":"U31+1","v":"2024-10-09"},"2024-10-10","2024-10-11","2024-10-12","2024-10-13"]
[{"$f":"INT((E32-LOOKUP(E32,DATE(YEAR(E32)+{-1;0;1},1,3)-WEEKDAY(DATE(YEAR(E32)+{-1;0;1},1,3))+2))/7)+1","v":33},{"$f":"H31+1","v":"2024-08-12"},{"$f":"B32+1","v":"2024-08-13"},"2024-08-14","2024-08-15","2024-08-16","2024-08-17","2024-08-18",null,{"$f":"INT((N32-LOOKUP(N32,DATE(YEAR(N32)+{-1;0;1},1,3)-WEEKDAY(DATE(YEAR(N32)+{-1;0;1},1,3))+2))/7)+1","v":37},{"$f":"Q31+1","v":"2024-09-09"},{"$f":"K32+1","v":"2024-09-10"},"2024-09-11","2024-09-12","2024-09-13","2024-09-14","2024-09-15",null,{"$f":"INT((W32-LOOKUP(W32,DATE(YEAR(W32)+{-1;0;1},1,3)-WEEKDAY(DATE(YEAR(W32)+{-1;0;1},1,3))+2))/7)+1","v":42},{"$f":"Z31+1","v":"2024-10-14"},{"$f":"T32+1","v":"2024-10-15"},"2024-10-16","2024-10-17","2024-10-18","2024-10-19","2024-10-20"]
[{"$f":"INT((E33-LOOKUP(E33,DATE(YEAR(E33)+{-1;0;1},1,3)-WEEKDAY(DATE(YEAR(E33)+{-1;0;1},1,3))+2))/7)+1","v":34},"2024-08-19",{"$f":"B33+1","v":"2024-08-20"},"2024-08-21","2024-08-22","2024-08-23","2024-08-24","2024-08-25",null,{"$f":"INT((N33-LOOKUP(N33,DATE(YEAR(N33)+{-1;0;1},1,3)-WEEKDAY(DATE(YEAR(N33)+{-1;0;1},1,3))+2))/7)+1","v":38},"2024-09-16",{"$f":"K33+1","v":"2024-09-17"},"2024-09-18","2024-09-19","2024-09-20","2024-09-21","2024-09-22",null,{"$f":"INT((W33-LOOKUP(W33,DATE(YEAR(W33)+{-1;0;1},1,3)-WEEKDAY(DATE(YEAR(W33)+{-1;0;1},1,3))+2))/7)+1","v":43},"2024-10-21",{"$f":"T33+1","v":"2024-10-22"},"2024-10-23","2024-10-24","2024-10-25","2024-10-26","2024-10-27"]
[{"$f":"IF(B34<=EOMONTH(B32,0),INT((E34-LOOKUP(E34,DATE(YEAR(E34)+{-1;0;1},1,3)-WEEKDAY(DATE(YEAR(E34)+{-1;0;1},1,3))+2))/7)+1,\"\")","v":35},"2024-08-26",{"$f":"B34+1","v":"2024-08-27"},"2024-08-28","2024-08-29","2024-08-30","2024-08-31","2024-09-01",null,{"$f":"IF(K34<=EOMONTH(K32,0),INT((N34-LOOKUP(N34,DATE(YEAR(N34)+{-1;0;1},1,3)-WEEKDAY(DATE(YEAR(N34)+{-1;0;1},1,3))+2))/7)+1,\"\")","v":39},"2024-09-23",{"$f":"K34+1","v":"2024-09-24"},"2024-09-25","2024-09-26","2024-09-27","2024-09-28","2024-09-29",null,{"$f":"IF(T34<=EOMONTH(T32,0),INT((W34-LOOKUP(W34,DATE(YEAR(W34)+{-1;0;1},1,3)-WEEKDAY(DATE(YEAR(W34)+{-1;0;1},1,3))+2))/7)+1,\"\")","v":44},"2024-10-28",{"$f":"T34+1","v":"2024-10-29"},"2024-10-30","2024-10-31","2024-11-01","2024-11-02","2024-11-03"]
[{"$f":"IF(B35<=EOMONTH(B33,0),INT((E35-LOOKUP(E35,DATE(YEAR(E35)+{-1;0;1},1,3)-WEEKDAY(DATE(YEAR(E35)+{-1;0;1},1,3))+2))/7)+1,\"\")","v":""},"2024-09-02",{"$f":"B35+1","v":"2024-09-03"},"2024-09-04","2024-09-05","2024-09-06","2024-09-07","2024-09-08",null,{"$f":"IF(K35<=EOMONTH(K33,0),INT((N35-LOOKUP(N35,DATE(YEAR(N35)+{-1;0;1},1,3)-WEEKDAY(DATE(YEAR(N35)+{-1;0;1},1,3))+2))/7)+1,\"\")","v":40},"2024-09-30",{"$f":"K35+1","v":"2024-10-01"},"2024-10-02","2024-10-03","2024-10-04","2024-10-05","2024-10-06",null,{"$f":"IF(T35<=EOMONTH(T33,0),INT((W35-LOOKUP(W35,DATE(YEAR(W35)+{-1;0;1},1,3)-WEEKDAY(DATE(YEAR(W35)+{-1;0;1},1,3))+2))/7)+1,\"\")","v":""},"2024-11-04",{"$f":"T35+1","v":"2024-11-05"},"2024-11-06","2024-11-07","2024-11-08","2024-11-09","2024-11-10"]