{"text_format":"1","workbook":"xlsx","n_sheets":5,"sheets":["Achats","Plan_de_Cave","Dégusté_le","Tarif","Paramètres"],"not_rendered":{"charts":3,"images":0,"macros":1,"external_links":0,"defined_names":3,"comments":0,"pivot_tables":0},"unopened":[],"bounds":{"document_bytes":16777216,"sheet_cells":100000,"rows_first":2000,"rows_last":500,"rows_between":2000,"halvings":0,"cell_chars":16384,"cell_head_chars":4096},"cells_cut":0,"cells_raw":0,"read":"whole","date_system":"1900"}

{"sheet":"Achats","index":0,"n_rows":1000,"n_cols":17,"rows_kept":1000,"cut":false,"hidden":false,"merged":[[3,14,3,16],[0,14,0,16],[0,13,1,13]]}
["NOM","APPELLATION","COULEUR","ANNÉE","PRIX","DATE\nD'ACHAT","NOMBRE DE\nBOUTEILLES\nACHETÉES","ENSEIGNE /\nREMARQUE","NOMBRE DE\nBOUTEILLES\nCONSOMMÉES","NOMBRE DE\nBOUTEILLES\nRESTANT EN\nCAVE","EMPLACEMENT","NUMÉRO",null,"NOMBRE\nTOTAL\n","NOMBRE\nDE\nBOUTEILLES"]
["Château Lusseau 2014","GRAVES","Rouge",2014,null,"2018-10-04",2,"Caves de la Rocade",{"$f":"IF(A2=\"\",\"\",SUMIF(Dégusté_le!$B$2:$B$10000,\"=\" & A2,Dégusté_le!$C$2:$C$10000))","v":1},{"$f":"IF(A2>0,G2-I2,\"\")","v":1},"Étagère 3","R16",null,null,"\"Rouge\"","\"Blanc\"","\"Champagne\""]
["Château Cap Saint Martin 2015","BLAYE","Rouge",2015,null,"2018-10-04",4,"Caves de la Rocade",{"$f":"IF(A3=\"\",\"\",SUMIF(Dégusté_le!$B$2:$B$10000,\"=\" & A3,Dégusté_le!$C$2:$C$10000))","v":0},{"$f":"IF(A3>0,G3-I3,\"\")","v":4},"Étagère 1","R17",null,{"$f":"O3+P3+Q3","v":146},{"$f":"SUMIF(C:C,\"Rouge\",J:J)","v":63},{"$f":"SUMIF(C:C,\"Blanc\",J:J)","v":53},{"$f":"SUMIF(C:C,\"Champagne\",J:J)","v":30}]
["Lyseras 2017","SAINT JOSEPH","Blanc",2017,null,"2019-01-22",2,"Caves de la Rocade",{"$f":"IF(A4=\"\",\"\",SUMIF(Dégusté_le!$B$2:$B$10000,\"=\" & A4,Dégusté_le!$C$2:$C$10000))","v":1},1,"Étagère 4","B9",null,null,"ANNÉE LA PLUS ANCIENNE"]
["Confidences Prieuré Lichine 2015","MARGAUX","Rouge",2015,27.9,"2019-01-22",2,"Caves de la Rocade",{"$f":"IF(A5=\"\",\"\",SUMIF(Dégusté_le!$B$2:$B$10000,\"=\" & A5,Dégusté_le!$C$2:$C$10000))","v":2},0,"Étagère 2","R7",null,null,{"$f":"_xlfn.MINIFS(D:D,J:J,\">0\",C:C,\"Rouge\")","v":2014},{"$f":"_xlfn.MINIFS(D:D,J:J,\">0\",C:C,\"Blanc\")","v":2017},{"$f":"_xlfn.MINIFS(D:D,J:J,\">0\",C:C,\"Champagne\")","v":2022}]
["La réserve de Malartic 2014","PESSAC LÉOGNAN","Rouge",2014,24.8,"2019-01-22",1,"Caves de la Rocade",{"$f":"IF(A6=\"\",\"\",SUMIF(Dégusté_le!$B$2:$B$10000,\"=\" & A6,Dégusté_le!$C$2:$C$10000))","v":0},1,"Étagère 3","R6"]
["Domaine Fontaine Gagnard 2017","CHASSAGNE MONTRACHET","Blanc",2017,44,"2019-05-01",1,"Caves de la Rocade",{"$f":"IF(A7=\"\",\"\",SUMIF(Dégusté_le!$B$2:$B$10000,\"=\" & A7,Dégusté_le!$C$2:$C$10000))","v":0},1,"Étagère 4","B5"]
["Château Canon St Michel 2015","GRAVES","Rouge",2015,14.8,"2019-05-19",1,"Caves de la Rocade",{"$f":"IF(A8=\"\",\"\",SUMIF(Dégusté_le!$B$2:$B$10000,\"=\" & A8,Dégusté_le!$C$2:$C$10000))","v":0},1,"Étagère 3","R15"]
["Bellissima ","CÔTE RÔTIE","Rouge",2016,19.5,"2019-06-22",2,"Caves de la Rocade",{"$f":"IF(A9=\"\",\"\",SUMIF(Dégusté_le!$B$2:$B$10000,\"=\" & A9,Dégusté_le!$C$2:$C$10000))","v":0},2,"Étagère 2"]
["Au Bas de Poillange 2018","SAINT ROMAIN","Blanc",2018,20,"2019-08-01",6,"Domaine Capitain-Gagnerot",{"$f":"IF(A10=\"\",\"\",SUMIF(Dégusté_le!$B$2:$B$10000,\"=\" & A10,Dégusté_le!$C$2:$C$10000))","v":1},5,"Étagère 4","B8"]
["Aux Ravioles 2017","VOSNE ROMANÉE","Rouge",2017,36,"2019-08-01",5,"Domaine Capitain-Gagnerot",{"$f":"IF(A11=\"\",\"\",SUMIF(Dégusté_le!$B$2:$B$10000,\"=\" & A11,Dégusté_le!$C$2:$C$10000))","v":5},0,"Étagère 2","R11"]
["La Toppe au Vert 2017","ALOXE CORTON","Rouge",2017,28,"2019-08-01",6,"Domaine Capitain-Gagnerot",{"$f":"IF(A12=\"\",\"\",SUMIF(Dégusté_le!$B$2:$B$10000,\"=\" & A12,Dégusté_le!$C$2:$C$10000))","v":4},2,"Étagère 3","R10"]
["Domaine Fontaine Gagnard 2018","CHASSAGNE MONTRACHET","Blanc",2018,44,"2020-01-14",4,"Caves de la Rocade",{"$f":"IF(A13=\"\",\"\",SUMIF(Dégusté_le!$B$2:$B$10000,\"=\" & A13,Dégusté_le!$C$2:$C$10000))","v":1},3,"Étagère 4","B10"]
["Ladoix Les Hautes Mourottes 2018","LADOIX","Blanc",2018,28,"2020-01-31",6,"Domaine Capitain-Gagnerot",{"$f":"IF(A14=\"\",\"\",SUMIF(Dégusté_le!$B$2:$B$10000,\"=\" & A14,Dégusté_le!$C$2:$C$10000))","v":4},2,"Étagère 4","B13"]
["Ladoix Les Gréchons 2018","LADOIX","Blanc",2018,27,"2020-01-31",6,"Domaine Capitain-Gagnerot",{"$f":"IF(A15=\"\",\"\",SUMIF(Dégusté_le!$B$2:$B$10000,\"=\" & A15,Dégusté_le!$C$2:$C$10000))","v":1},5,"Étagère 4","B12"]
["Rully 1er Cru La Pucelle 2018","RULLY","Blanc",2018,15,"2020-05-22",6,"Domaine (Jean Charles)",{"$f":"IF(A16=\"\",\"\",SUMIF(Dégusté_le!$B$2:$B$10000,\"=\" & A16,Dégusté_le!$C$2:$C$10000))","v":1},5,"Étagère 4","B17"]
["Rully 1er Cru Les Crêts 2018","MERCUREY","Rouge",2018,15,"2020-05-22",6,"Domaine (Jean Charles)",{"$f":"IF(A17=\"\",\"\",SUMIF(Dégusté_le!$B$2:$B$10000,\"=\" & A17,Dégusté_le!$C$2:$C$10000))","v":3},3,"Étagère 3","R29"]
["Quintaine 2017","VIRÉ CLESSÉ","Blanc",2017,14,"2020-12-18",24,"Domaine Michel (Ronan)",{"$f":"IF(A18=\"\",\"\",SUMIF(Dégusté_le!$B$2:$B$10000,\"=\" & A18,Dégusté_le!$C$2:$C$10000))","v":24},0,null,"B18"]
["Riesling 2018","RIESLING","Blanc",2018,25,"2021-02-14",2,"Cadeau Sophie St Valentin",{"$f":"IF(A19=\"\",\"\",SUMIF(Dégusté_le!$B$2:$B$10000,\"=\" & A19,Dégusté_le!$C$2:$C$10000))","v":1},1,"Étagère 4","B19"]
["Domaine FERRET 2017","POUILLY FUISSÉ","Blanc",2017,23.99,"2021-03-03",2,"Métro",{"$f":"IF(A20=\"\",\"\",SUMIF(Dégusté_le!$B$2:$B$10000,\"=\" & A20,Dégusté_le!$C$2:$C$10000))","v":1},1,"Étagère 4","B20"]
["Morgeot 1er Cru 2017","CHASSAGNE MONTRACHET","Rouge",2017,31.07,"2021-03-03",3,"Métro",{"$f":"IF(A21=\"\",\"\",SUMIF(Dégusté_le!$B$2:$B$10000,\"=\" & A21,Dégusté_le!$C$2:$C$10000))","v":2},1,"Étagère 3","R32"]
["Ronan By Client 2012","POMEROL","Rouge",2012,6,"2021-03-30",6,"Joyaux des Vignes",{"$f":"IF(A22=\"\",\"\",SUMIF(Dégusté_le!$B$2:$B$10000,\"=\" & A22,Dégusté_le!$C$2:$C$10000))","v":6},0,null,"R36"]
["Clos René 2015","POMEROL","Rouge",2015,28.79,"2021-04-29",8,"Métro",{"$f":"IF(A23=\"\",\"\",SUMIF(Dégusté_le!$B$2:$B$10000,\"=\" & A23,Dégusté_le!$C$2:$C$10000))","v":2},6,"Étagère 1 et 2","R37"]
["Château Montlabert 2015","ST ÉMILION","Rouge",2015,17.39,"2021-04-29",12,"Métro",{"$f":"IF(A24=\"\",\"\",SUMIF(Dégusté_le!$B$2:$B$10000,\"=\" & A24,Dégusté_le!$C$2:$C$10000))","v":4},8,"Étagère 2","R38"]
["Pagus Luminis 2019","CONDRIEU","Blanc",2019,31.89,"2021-07-30",6,"Caves de la Rocade",{"$f":"IF(A25=\"\",\"\",SUMIF(Dégusté_le!$B$2:$B$10000,\"=\" & A25,Dégusté_le!$C$2:$C$10000))","v":1},5,"Étagère 3 et 4","B6"]
["Ermitage 2020","MENETOU SALON","Blanc",2020,8.8699999999999992,"2021-10-05",24,"Métro",{"$f":"IF(A26=\"\",\"\",SUMIF(Dégusté_le!$B$2:$B$10000,\"=\" & A26,Dégusté_le!$C$2:$C$10000))","v":24},0,"Garage"]
["Connétable Talbot 2016","SAINT JULIEN","Rouge",2016,23.99,"2021-10-05",6,"Métro",{"$f":"IF(A27=\"\",\"\",SUMIF(Dégusté_le!$B$2:$B$10000,\"=\" & A27,Dégusté_le!$C$2:$C$10000))","v":1},5,"Étagère 1","R40"]
["Sirène de Giscours 2016","MARGAUX","Rouge",2016,27.11,"2021-10-05",6,"Métro",{"$f":"IF(A28=\"\",\"\",SUMIF(Dégusté_le!$B$2:$B$10000,\"=\" & A28,Dégusté_le!$C$2:$C$10000))","v":0},6,"Étagère 1, 2 et 3","R39"]
["Les Vaumuriens 2017","POMMARD","Rouge",2017,null,"2022-01-01",1,"Cadeau Anthony",{"$f":"IF(A29=\"\",\"\",SUMIF(Dégusté_le!$B$2:$B$10000,\"=\" & A29,Dégusté_le!$C$2:$C$10000))","v":1},0,null,"R44"]
["Les Grésigny 2018","RULLY","Blanc",2018,28,"2022-03-13",6,"Cave Moillard",{"$f":"IF(A30=\"\",\"\",SUMIF(Dégusté_le!$B$2:$B$10000,\"=\" & A30,Dégusté_le!$C$2:$C$10000))","v":0},6,"Étagère 4","B24"]
["Les Hauts Jarrons 2018","SAVIGNY LES BEAUNE","Blanc",2018,34,"2022-03-13",6,"Cave Moillard",{"$f":"IF(A31=\"\",\"\",SUMIF(Dégusté_le!$B$2:$B$10000,\"=\" & A31,Dégusté_le!$C$2:$C$10000))","v":0},6,"Étagère 4","B25"]
["Les Argillats 2019","NUITS ST GEORGES","Rouge",2019,46,"2022-03-13",3,"Cave Moillard",{"$f":"IF(A32=\"\",\"\",SUMIF(Dégusté_le!$B$2:$B$10000,\"=\" & A32,Dégusté_le!$C$2:$C$10000))","v":0},3,"Étagère 1","R48"]
["Les Rugiens 2016","POMMARD","Rouge",2016,58,"2022-03-13",3,"Cave Moillard",{"$f":"IF(A33=\"\",\"\",SUMIF(Dégusté_le!$B$2:$B$10000,\"=\" & A33,Dégusté_le!$C$2:$C$10000))","v":0},3,"Étagère 1","R47"]
["Les Fichots 2018","PERNAND VERGELESS","Rouge",2018,28,"2022-03-13",6,"Cave Moillard",{"$f":"IF(A34=\"\",\"\",SUMIF(Dégusté_le!$B$2:$B$10000,\"=\" & A34,Dégusté_le!$C$2:$C$10000))","v":0},6,"Étagère 1","R46"]
["Château La Peyre 2015","ST ESTÈPHE","Rouge",2015,21.67,"2022-04-21",12,"Ariès Vins",{"$f":"IF(A35=\"\",\"\",SUMIF(Dégusté_le!$B$2:$B$10000,\"=\" & A35,Dégusté_le!$C$2:$C$10000))","v":7},5,"Étagère 3","R49"]
["Etoile by Haut Nouchet blanc 2020","PESSAC LÉOGNAN","Blanc",2020,12.9,"2022-05-06",6,"Domaine Haut Nouchet",{"$f":"IF(A36=\"\",\"\",SUMIF(Dégusté_le!$B$2:$B$10000,\"=\" & A36,Dégusté_le!$C$2:$C$10000))","v":4},2,"Étagère 5","B26"]
["S de Schlumberger 2022","ALSACE","Blanc",2022,12.1,"2022-05-20",30,"Domaine Schlumberger",{"$f":"IF(A37=\"\",\"\",SUMIF(Dégusté_le!$B$2:$B$10000,\"=\" & A37,Dégusté_le!$C$2:$C$10000))","v":28},2,"Cuisine","B27"]
["Naudé-22","CHAMPAGNE","Champagne",2022,18.05,"2022-06-21",24,"Jean Charles",{"$f":"IF(A38=\"\",\"\",SUMIF(Dégusté_le!$B$2:$B$10000,\"=\" & A38,Dégusté_le!$C$2:$C$10000))","v":22},2,"Garage"]
["Quintaine 2019","VIRÉ CLESSÉ","Blanc",2019,15.8,"2022-09-27",4,"Domaine Michel (Ronan)",{"$f":"IF(A39=\"\",\"\",SUMIF(Dégusté_le!$B$2:$B$10000,\"=\" & A39,Dégusté_le!$C$2:$C$10000))","v":0},4,"Étagère 5"]
["Domaine Moillard 2018","HAUTES CÔTES DE NUITS","Blanc",2018,18,"2022-11-25",1,"Cave Moillard",{"$f":"IF(A40=\"\",\"\",SUMIF(Dégusté_le!$B$2:$B$10000,\"=\" & A40,Dégusté_le!$C$2:$C$10000))","v":1},0,"Étagère 4"]
["Au Grand Bussière 2019","SAINT VÉRAN","Blanc",2019,null,"2023-06-18",1,"Cadeau Marie/Alizée",{"$f":"IF(A41=\"\",\"\",SUMIF(Dégusté_le!$B$2:$B$10000,\"=\" & A41,Dégusté_le!$C$2:$C$10000))","v":0},1,"Étagère 3","B44"]
["Champagne Canard Duchêne","CHAMPAGNE","Champagne",2023,null,"2023-06-20",1,"Cadeau Jean Charles/Michèle",{"$f":"IF(A42=\"\",\"\",SUMIF(Dégusté_le!$B$2:$B$10000,\"=\" & A42,Dégusté_le!$C$2:$C$10000))","v":0},1,"Garage"]
["Champagne Tribaut 2023","CHAMPAGNE","Champagne",2023,19.739999999999998,"2023-07-06",6,"Métro",{"$f":"IF(A43=\"\",\"\",SUMIF(Dégusté_le!$B$2:$B$10000,\"=\" & A43,Dégusté_le!$C$2:$C$10000))","v":0},6,"Garage"]
["Aloxe Corton Fanny Sabre 2018","ALOXE CORTON","Rouge",2018,null,"2023-07-06",1,"Cadeau Alizée",{"$f":"IF(A44=\"\",\"\",SUMIF(Dégusté_le!$B$2:$B$10000,\"=\" & A44,Dégusté_le!$C$2:$C$10000))","v":0},1,"Étagère 1","R46"]
["Château Meyney 2016","ST ESTÈPHE","Rouge",2016,23.99,"2023-07-06",1,"Cadeau Marie/Alizée",{"$f":"IF(A45=\"\",\"\",SUMIF(Dégusté_le!$B$2:$B$10000,\"=\" & A45,Dégusté_le!$C$2:$C$10000))","v":0},1,"Étagère 4"]
["Auxey Duresses 2020","AUXEY DURESSES","Rouge",2020,15.48,"2023-07-06",2,"Cadeau Marie/Alizée",{"$f":"IF(A46=\"\",\"\",SUMIF(Dégusté_le!$B$2:$B$10000,\"=\" & A46,Dégusté_le!$C$2:$C$10000))","v":0},2,"Étagère 3"]
["Château de Bligny","CHAMPAGNE","Champagne",2023,null,"2023-07-22",1,"Cadeau Marc/Maria",{"$f":"IF(A47=\"\",\"\",SUMIF(Dégusté_le!$B$2:$B$10000,\"=\" & A47,Dégusté_le!$C$2:$C$10000))","v":0},1,"Garage"]
["Les Chauchoux 2020","RULLY","Rouge",2020,20.39,"2023-08-06",2,"Cadeau Marie/Alizée",{"$f":"IF(A48=\"\",\"\",SUMIF(Dégusté_le!$B$2:$B$10000,\"=\" & A48,Dégusté_le!$C$2:$C$10000))","v":0},2,"Étagère 4"]
["Champagne Drapier","CHAMPAGNE","Champagne",2023,null,"2023-08-14",1,"Cadeau Fred/Béa",{"$f":"IF(A49=\"\",\"\",SUMIF(Dégusté_le!$B$2:$B$10000,\"=\" & A49,Dégusté_le!$C$2:$C$10000))","v":0},1,"Garage"]
["Naudé-23","CHAMPAGNE","Champagne",2023,19.149999999999999,"2023-08-30",18,"Jean Charles",{"$f":"IF(A50=\"\",\"\",SUMIF(Dégusté_le!$B$2:$B$10000,\"=\" & A50,Dégusté_le!$C$2:$C$10000))","v":0},18,"Garage"]
["Les Creux Fraîche Eau 2021","NUITS ST GEORGES","Blanc",2021,32.39,"2023-09-06",2,"Cadeau Marie/Alizée",{"$f":"IF(A51=\"\",\"\",SUMIF(Dégusté_le!$B$2:$B$10000,\"=\" & A51,Dégusté_le!$C$2:$C$10000))","v":0},2,"Étagère 3"]
["Tonelum 2018","POUILLY FUMÉ","Blanc",2018,null,"2023-10-29",1,"Cadeau Marc",{"$f":"IF(A52=\"\",\"\",SUMIF(Dégusté_le!$B$2:$B$10000,\"=\" & A52,Dégusté_le!$C$2:$C$10000))","v":0},1,"Étagère 3","B45"]
["Champagne Moët & Chandon","CHAMPAGNE","Champagne",2023,null,"2023-11-03",1,"Cadeau Claude/Corinne",{"$f":"IF(A53=\"\",\"\",SUMIF(Dégusté_le!$B$2:$B$10000,\"=\" & A53,Dégusté_le!$C$2:$C$10000))","v":0},1,"Garage"]
[null,null,null,null,null,null,null,null,{"$f":"IF(A54=\"\",\"\",SUMIF(Dégusté_le!$B$2:$B$10000,\"=\" & A54,Dégusté_le!$C$2:$C$10000))","v":""},""]
[null,null,null,null,null,null,null,null,{"$f":"IF(A55=\"\",\"\",SUMIF(Dégusté_le!$B$2:$B$10000,\"=\" & A55,Dégusté_le!$C$2:$C$10000))","v":""},""]
[null,null,null,null,null,null,null,null,{"$f":"IF(A56=\"\",\"\",SUMIF(Dégusté_le!$B$2:$B$10000,\"=\" & A56,Dégusté_le!$C$2:$C$10000))","v":""},""]
[null,null,null,null,null,null,null,null,{"$f":"IF(A57=\"\",\"\",SUMIF(Dégusté_le!$B$2:$B$10000,\"=\" & A57,Dégusté_le!$C$2:$C$10000))","v":""},""]
[null,null,null,null,null,null,null,null,{"$f":"IF(A58=\"\",\"\",SUMIF(Dégusté_le!$B$2:$B$10000,\"=\" & A58,Dégusté_le!$C$2:$C$10000))","v":""},""]
[null,null,null,null,null,null,null,null,{"$f":"IF(A59=\"\",\"\",SUMIF(Dégusté_le!$B$2:$B$10000,\"=\" & A59,Dégusté_le!$C$2:$C$10000))","v":""},""]
[null,null,null,null,null,null,null,null,{"$f":"IF(A60=\"\",\"\",SUMIF(Dégusté_le!$B$2:$B$10000,\"=\" & A60,Dégusté_le!$C$2:$C$10000))","v":""},""]
[null,null,null,null,null,null,null,null,{"$f":"IF(A61=\"\",\"\",SUMIF(Dégusté_le!$B$2:$B$10000,\"=\" & A61,Dégusté_le!$C$2:$C$10000))","v":""},""]
[null,null,null,null,null,null,null,null,{"$f":"IF(A62=\"\",\"\",SUMIF(Dégusté_le!$B$2:$B$10000,\"=\" & A62,Dégusté_le!$C$2:$C$10000))","v":""},""]
[null,null,null,null,null,null,null,null,{"$f":"IF(A63=\"\",\"\",SUMIF(Dégusté_le!$B$2:$B$10000,\"=\" & A63,Dégusté_le!$C$2:$C$10000))","v":""},""]
[null,null,null,null,null,null,null,null,{"$f":"IF(A64=\"\",\"\",SUMIF(Dégusté_le!$B$2:$B$10000,\"=\" & A64,Dégusté_le!$C$2:$C$10000))","v":""},""]
[null,null,null,null,null,null,null,null,{"$f":"IF(A65=\"\",\"\",SUMIF(Dégusté_le!$B$2:$B$10000,\"=\" & A65,Dégusté_le!$C$2:$C$10000))","v":""},""]
[null,null,null,null,null,null,null,null,{"$f":"IF(A66=\"\",\"\",SUMIF(Dégusté_le!$B$2:$B$10000,\"=\" & A66,Dégusté_le!$C$2:$C$10000))","v":""},""]
[null,null,null,null,null,null,null,null,{"$f":"IF(A67=\"\",\"\",SUMIF(Dégusté_le!$B$2:$B$10000,\"=\" & A67,Dégusté_le!$C$2:$C$10000))","v":""},{"$f":"IF(A67>0,G67-I67,\"\")","v":""}]
[null,null,null,null,null,null,null,null,{"$f":"IF(A68=\"\",\"\",SUMIF(Dégusté_le!$B$2:$B$10000,\"=\" & A68,Dégusté_le!$C$2:$C$10000))","v":""},""]
[null,null,null,null,null,null,null,null,{"$f":"IF(A69=\"\",\"\",SUMIF(Dégusté_le!$B$2:$B$10000,\"=\" & A69,Dégusté_le!$C$2:$C$10000))","v":""},""]
[null,null,null,null,null,null,null,null,{"$f":"IF(A70=\"\",\"\",SUMIF(Dégusté_le!$B$2:$B$10000,\"=\" & A70,Dégusté_le!$C$2:$C$10000))","v":""},""]
[null,null,null,null,null,null,null,null,{"$f":"IF(A71=\"\",\"\",SUMIF(Dégusté_le!$B$2:$B$10000,\"=\" & A71,Dégusté_le!$C$2:$C$10000))","v":""},""]
[null,null,null,null,null,null,null,null,{"$f":"IF(A72=\"\",\"\",SUMIF(Dégusté_le!$B$2:$B$10000,\"=\" & A72,Dégusté_le!$C$2:$C$10000))","v":""},""]
[null,null,null,null,null,null,null,null,{"$f":"IF(A73=\"\",\"\",SUMIF(Dégusté_le!$B$2:$B$10000,\"=\" & A73,Dégusté_le!$C$2:$C$10000))","v":""},""]
[null,null,null,null,null,null,null,null,{"$f":"IF(A74=\"\",\"\",SUMIF(Dégusté_le!$B$2:$B$10000,\"=\" & A74,Dégusté_le!$C$2:$C$10000))","v":""},""]
[null,null,null,null,null,null,null,null,{"$f":"IF(A75=\"\",\"\",SUMIF(Dégusté_le!$B$2:$B$10000,\"=\" & A75,Dégusté_le!$C$2:$C$10000))","v":""},""]
[null,null,null,null,null,null,null,null,{"$f":"IF(A76=\"\",\"\",SUMIF(Dégusté_le!$B$2:$B$10000,\"=\" & A76,Dégusté_le!$C$2:$C$10000))","v":""},""]
[null,null,null,null,null,null,null,null,{"$f":"IF(A77=\"\",\"\",SUMIF(Dégusté_le!$B$2:$B$10000,\"=\" & A77,Dégusté_le!$C$2:$C$10000))","v":""},""]
[null,null,null,null,null,null,null,null,{"$f":"IF(A78=\"\",\"\",SUMIF(Dégusté_le!$B$2:$B$10000,\"=\" & A78,Dégusté_le!$C$2:$C$10000))","v":""},""]
[null,null,null,null,null,null,null,null,{"$f":"IF(A79=\"\",\"\",SUMIF(Dégusté_le!$B$2:$B$10000,\"=\" & A79,Dégusté_le!$C$2:$C$10000))","v":""},""]
[null,null,null,null,null,null,null,null,{"$f":"IF(A80=\"\",\"\",SUMIF(Dégusté_le!$B$2:$B$10000,\"=\" & A80,Dégusté_le!$C$2:$C$10000))","v":""},""]
[null,null,null,null,null,null,null,null,{"$f":"IF(A81=\"\",\"\",SUMIF(Dégusté_le!$B$2:$B$10000,\"=\" & A81,Dégusté_le!$C$2:$C$10000))","v":""},""]
[null,null,null,null,null,null,null,null,{"$f":"IF(A82=\"\",\"\",SUMIF(Dégusté_le!$B$2:$B$10000,\"=\" & A82,Dégusté_le!$C$2:$C$10000))","v":""},""]
[null,null,null,null,null,null,null,null,{"$f":"IF(A83=\"\",\"\",SUMIF(Dégusté_le!$B$2:$B$10000,\"=\" & A83,Dégusté_le!$C$2:$C$10000))","v":""},""]
[null,null,null,null,null,null,null,null,{"$f":"IF(A84=\"\",\"\",SUMIF(Dégusté_le!$B$2:$B$10000,\"=\" & A84,Dégusté_le!$C$2:$C$10000))","v":""},""]
[null,null,null,null,null,null,null,null,{"$f":"IF(A85=\"\",\"\",SUMIF(Dégusté_le!$B$2:$B$10000,\"=\" & A85,Dégusté_le!$C$2:$C$10000))","v":""},""]
[null,null,null,null,null,null,null,null,{"$f":"IF(A86=\"\",\"\",SUMIF(Dégusté_le!$B$2:$B$10000,\"=\" & A86,Dégusté_le!$C$2:$C$10000))","v":""},""]
[null,null,null,null,null,null,null,null,{"$f":"IF(A87=\"\",\"\",SUMIF(Dégusté_le!$B$2:$B$10000,\"=\" & A87,Dégusté_le!$C$2:$C$10000))","v":""},""]
[null,null,null,null,null,null,null,null,{"$f":"IF(A88=\"\",\"\",SUMIF(Dégusté_le!$B$2:$B$10000,\"=\" & A88,Dégusté_le!$C$2:$C$10000))","v":""},""]
[null,null,null,null,null,null,null,null,{"$f":"IF(A89=\"\",\"\",SUMIF(Dégusté_le!$B$2:$B$10000,\"=\" & A89,Dégusté_le!$C$2:$C$10000))","v":""},""]
[null,null,null,null,null,null,null,null,{"$f":"IF(A90=\"\",\"\",SUMIF(Dégusté_le!$B$2:$B$10000,\"=\" & A90,Dégusté_le!$C$2:$C$10000))","v":""},""]
[null,null,null,null,null,null,null,null,{"$f":"IF(A91=\"\",\"\",SUMIF(Dégusté_le!$B$2:$B$10000,\"=\" & A91,Dégusté_le!$C$2:$C$10000))","v":""},""]
[null,null,null,null,null,null,null,null,{"$f":"IF(A92=\"\",\"\",SUMIF(Dégusté_le!$B$2:$B$10000,\"=\" & A92,Dégusté_le!$C$2:$C$10000))","v":""},""]
[null,null,null,null,null,null,null,null,{"$f":"IF(A93=\"\",\"\",SUMIF(Dégusté_le!$B$2:$B$10000,\"=\" & A93,Dégusté_le!$C$2:$C$10000))","v":""},""]
[null,null,null,null,null,null,null,null,{"$f":"IF(A94=\"\",\"\",SUMIF(Dégusté_le!$B$2:$B$10000,\"=\" & A94,Dégusté_le!$C$2:$C$10000))","v":""},""]
[null,null,null,null,null,null,null,null,{"$f":"IF(A95=\"\",\"\",SUMIF(Dégusté_le!$B$2:$B$10000,\"=\" & A95,Dégusté_le!$C$2:$C$10000))","v":""},""]
[null,null,null,null,null,null,null,null,{"$f":"IF(A96=\"\",\"\",SUMIF(Dégusté_le!$B$2:$B$10000,\"=\" & A96,Dégusté_le!$C$2:$C$10000))","v":""},""]
[null,null,null,null,null,null,null,null,{"$f":"IF(A97=\"\",\"\",SUMIF(Dégusté_le!$B$2:$B$10000,\"=\" & A97,Dégusté_le!$C$2:$C$10000))","v":""},""]
[null,null,null,null,null,null,null,null,{"$f":"IF(A98=\"\",\"\",SUMIF(Dégusté_le!$B$2:$B$10000,\"=\" & A98,Dégusté_le!$C$2:$C$10000))","v":""},""]
[null,null,null,null,null,null,null,null,{"$f":"IF(A99=\"\",\"\",SUMIF(Dégusté_le!$B$2:$B$10000,\"=\" & A99,Dégusté_le!$C$2:$C$10000))","v":""},""]
[null,null,null,null,null,null,null,null,{"$f":"IF(A100=\"\",\"\",SUMIF(Dégusté_le!$B$2:$B$10000,\"=\" & A100,Dégusté_le!$C$2:$C$10000))","v":""},""]
[null,null,null,null,null,null,null,null,{"$f":"IF(A101=\"\",\"\",SUMIF(Dégusté_le!$B$2:$B$10000,\"=\" & A101,Dégusté_le!$C$2:$C$10000))","v":""},""]
[null,null,null,null,null,null,null,null,{"$f":"IF(A102=\"\",\"\",SUMIF(Dégusté_le!$B$2:$B$10000,\"=\" & A102,Dégusté_le!$C$2:$C$10000))","v":""},""]
[null,null,null,null,null,null,null,null,{"$f":"IF(A103=\"\",\"\",SUMIF(Dégusté_le!$B$2:$B$10000,\"=\" & A103,Dégusté_le!$C$2:$C$10000))","v":""},""]
[null,null,null,null,null,null,null,null,{"$f":"IF(A104=\"\",\"\",SUMIF(Dégusté_le!$B$2:$B$10000,\"=\" & A104,Dégusté_le!$C$2:$C$10000))","v":""},""]
[null,null,null,null,null,null,null,null,{"$f":"IF(A105=\"\",\"\",SUMIF(Dégusté_le!$B$2:$B$10000,\"=\" & A105,Dégusté_le!$C$2:$C$10000))","v":""},""]
[null,null,null,null,null,null,null,null,{"$f":"IF(A106=\"\",\"\",SUMIF(Dégusté_le!$B$2:$B$10000,\"=\" & A106,Dégusté_le!$C$2:$C$10000))","v":""},""]
[null,null,null,null,null,null,null,null,{"$f":"IF(A107=\"\",\"\",SUMIF(Dégusté_le!$B$2:$B$10000,\"=\" & A107,Dégusté_le!$C$2:$C$10000))","v":""},""]
[null,null,null,null,null,null,null,null,{"$f":"IF(A108=\"\",\"\",SUMIF(Dégusté_le!$B$2:$B$10000,\"=\" & A108,Dégusté_le!$C$2:$C$10000))","v":""},""]
[null,null,null,null,null,null,null,null,{"$f":"IF(A109=\"\",\"\",SUMIF(Dégusté_le!$B$2:$B$10000,\"=\" & A109,Dégusté_le!$C$2:$C$10000))","v":""},""]
[null,null,null,null,null,null,null,null,{"$f":"IF(A110=\"\",\"\",SUMIF(Dégusté_le!$B$2:$B$10000,\"=\" & A110,Dégusté_le!$C$2:$C$10000))","v":""},""]
[null,null,null,null,null,null,null,null,{"$f":"IF(A111=\"\",\"\",SUMIF(Dégusté_le!$B$2:$B$10000,\"=\" & A111,Dégusté_le!$C$2:$C$10000))","v":""},""]
[null,null,null,null,null,null,null,null,{"$f":"IF(A112=\"\",\"\",SUMIF(Dégusté_le!$B$2:$B$10000,\"=\" & A112,Dégusté_le!$C$2:$C$10000))","v":""},""]
[null,null,null,null,null,null,null,null,{"$f":"IF(A113=\"\",\"\",SUMIF(Dégusté_le!$B$2:$B$10000,\"=\" & A113,Dégusté_le!$C$2:$C$10000))","v":""},""]
[null,null,null,null,null,null,null,null,{"$f":"IF(A114=\"\",\"\",SUMIF(Dégusté_le!$B$2:$B$10000,\"=\" & A114,Dégusté_le!$C$2:$C$10000))","v":""},""]
[null,null,null,null,null,null,null,null,{"$f":"IF(A115=\"\",\"\",SUMIF(Dégusté_le!$B$2:$B$10000,\"=\" & A115,Dégusté_le!$C$2:$C$10000))","v":""},""]
[null,null,null,null,null,null,null,null,{"$f":"IF(A116=\"\",\"\",SUMIF(Dégusté_le!$B$2:$B$10000,\"=\" & A116,Dégusté_le!$C$2:$C$10000))","v":""},""]
[null,null,null,null,null,null,null,null,{"$f":"IF(A117=\"\",\"\",SUMIF(Dégusté_le!$B$2:$B$10000,\"=\" & A117,Dégusté_le!$C$2:$C$10000))","v":""},""]
[null,null,null,null,null,null,null,null,{"$f":"IF(A118=\"\",\"\",SUMIF(Dégusté_le!$B$2:$B$10000,\"=\" & A118,Dégusté_le!$C$2:$C$10000))","v":""},""]
[null,null,null,null,null,null,null,null,{"$f":"IF(A119=\"\",\"\",SUMIF(Dégusté_le!$B$2:$B$10000,\"=\" & A119,Dégusté_le!$C$2:$C$10000))","v":""},""]
[null,null,null,null,null,null,null,null,{"$f":"IF(A120=\"\",\"\",SUMIF(Dégusté_le!$B$2:$B$10000,\"=\" & A120,Dégusté_le!$C$2:$C$10000))","v":""},""]
[null,null,null,null,null,null,null,null,{"$f":"IF(A121=\"\",\"\",SUMIF(Dégusté_le!$B$2:$B$10000,\"=\" & A121,Dégusté_le!$C$2:$C$10000))","v":""},""]
[null,null,null,null,null,null,null,null,{"$f":"IF(A122=\"\",\"\",SUMIF(Dégusté_le!$B$2:$B$10000,\"=\" & A122,Dégusté_le!$C$2:$C$10000))","v":""},""]
[null,null,null,null,null,null,null,null,{"$f":"IF(A123=\"\",\"\",SUMIF(Dégusté_le!$B$2:$B$10000,\"=\" & A123,Dégusté_le!$C$2:$C$10000))","v":""},""]
[null,null,null,null,null,null,null,null,{"$f":"IF(A124=\"\",\"\",SUMIF(Dégusté_le!$B$2:$B$10000,\"=\" & A124,Dégusté_le!$C$2:$C$10000))","v":""},""]
[null,null,null,null,null,null,null,null,{"$f":"IF(A125=\"\",\"\",SUMIF(Dégusté_le!$B$2:$B$10000,\"=\" & A125,Dégusté_le!$C$2:$C$10000))","v":""},""]
[null,null,null,null,null,null,null,null,{"$f":"IF(A126=\"\",\"\",SUMIF(Dégusté_le!$B$2:$B$10000,\"=\" & A126,Dégusté_le!$C$2:$C$10000))","v":""},""]
[null,null,null,null,null,null,null,null,{"$f":"IF(A127=\"\",\"\",SUMIF(Dégusté_le!$B$2:$B$10000,\"=\" & A127,Dégusté_le!$C$2:$C$10000))","v":""},""]
[null,null,null,null,null,null,null,null,{"$f":"IF(A128=\"\",\"\",SUMIF(Dégusté_le!$B$2:$B$10000,\"=\" & A128,Dégusté_le!$C$2:$C$10000))","v":""},""]
[null,null,null,null,null,null,null,null,{"$f":"IF(A129=\"\",\"\",SUMIF(Dégusté_le!$B$2:$B$10000,\"=\" & A129,Dégusté_le!$C$2:$C$10000))","v":""},""]
[null,null,null,null,null,null,null,null,{"$f":"IF(A130=\"\",\"\",SUMIF(Dégusté_le!$B$2:$B$10000,\"=\" & A130,Dégusté_le!$C$2:$C$10000))","v":""},""]
[null,null,null,null,null,null,null,null,{"$f":"IF(A131=\"\",\"\",SUMIF(Dégusté_le!$B$2:$B$10000,\"=\" & A131,Dégusté_le!$C$2:$C$10000))","v":""},{"$f":"IF(A131>0,G131-I131,\"\")","v":""}]
[null,null,null,null,null,null,null,null,{"$f":"IF(A132=\"\",\"\",SUMIF(Dégusté_le!$B$2:$B$10000,\"=\" & A132,Dégusté_le!$C$2:$C$10000))","v":""},""]
[null,null,null,null,null,null,null,null,{"$f":"IF(A133=\"\",\"\",SUMIF(Dégusté_le!$B$2:$B$10000,\"=\" & A133,Dégusté_le!$C$2:$C$10000))","v":""},""]
[null,null,null,null,null,null,null,null,{"$f":"IF(A134=\"\",\"\",SUMIF(Dégusté_le!$B$2:$B$10000,\"=\" & A134,Dégusté_le!$C$2:$C$10000))","v":""},""]
[null,null,null,null,null,null,null,null,{"$f":"IF(A135=\"\",\"\",SUMIF(Dégusté_le!$B$2:$B$10000,\"=\" & A135,Dégusté_le!$C$2:$C$10000))","v":""},""]
[null,null,null,null,null,null,null,null,{"$f":"IF(A136=\"\",\"\",SUMIF(Dégusté_le!$B$2:$B$10000,\"=\" & A136,Dégusté_le!$C$2:$C$10000))","v":""},""]
[null,null,null,null,null,null,null,null,{"$f":"IF(A137=\"\",\"\",SUMIF(Dégusté_le!$B$2:$B$10000,\"=\" & A137,Dégusté_le!$C$2:$C$10000))","v":""},""]
[null,null,null,null,null,null,null,null,{"$f":"IF(A138=\"\",\"\",SUMIF(Dégusté_le!$B$2:$B$10000,\"=\" & A138,Dégusté_le!$C$2:$C$10000))","v":""},""]
[null,null,null,null,null,null,null,null,{"$f":"IF(A139=\"\",\"\",SUMIF(Dégusté_le!$B$2:$B$10000,\"=\" & A139,Dégusté_le!$C$2:$C$10000))","v":""},""]
[null,null,null,null,null,null,null,null,{"$f":"IF(A140=\"\",\"\",SUMIF(Dégusté_le!$B$2:$B$10000,\"=\" & A140,Dégusté_le!$C$2:$C$10000))","v":""},""]
[null,null,null,null,null,null,null,null,{"$f":"IF(A141=\"\",\"\",SUMIF(Dégusté_le!$B$2:$B$10000,\"=\" & A141,Dégusté_le!$C$2:$C$10000))","v":""},""]
[null,null,null,null,null,null,null,null,{"$f":"IF(A142=\"\",\"\",SUMIF(Dégusté_le!$B$2:$B$10000,\"=\" & A142,Dégusté_le!$C$2:$C$10000))","v":""},""]
[null,null,null,null,null,null,null,null,{"$f":"IF(A143=\"\",\"\",SUMIF(Dégusté_le!$B$2:$B$10000,\"=\" & A143,Dégusté_le!$C$2:$C$10000))","v":""},""]
[null,null,null,null,null,null,null,null,{"$f":"IF(A144=\"\",\"\",SUMIF(Dégusté_le!$B$2:$B$10000,\"=\" & A144,Dégusté_le!$C$2:$C$10000))","v":""},""]
[null,null,null,null,null,null,null,null,{"$f":"IF(A145=\"\",\"\",SUMIF(Dégusté_le!$B$2:$B$10000,\"=\" & A145,Dégusté_le!$C$2:$C$10000))","v":""},""]
[null,null,null,null,null,null,null,null,{"$f":"IF(A146=\"\",\"\",SUMIF(Dégusté_le!$B$2:$B$10000,\"=\" & A146,Dégusté_le!$C$2:$C$10000))","v":""},""]
[null,null,null,null,null,null,null,null,{"$f":"IF(A147=\"\",\"\",SUMIF(Dégusté_le!$B$2:$B$10000,\"=\" & A147,Dégusté_le!$C$2:$C$10000))","v":""},""]
[null,null,null,null,null,null,null,null,{"$f":"IF(A148=\"\",\"\",SUMIF(Dégusté_le!$B$2:$B$10000,\"=\" & A148,Dégusté_le!$C$2:$C$10000))","v":""},""]
[null,null,null,null,null,null,null,null,{"$f":"IF(A149=\"\",\"\",SUMIF(Dégusté_le!$B$2:$B$10000,\"=\" & A149,Dégusté_le!$C$2:$C$10000))","v":""},""]
[null,null,null,null,null,null,null,null,{"$f":"IF(A150=\"\",\"\",SUMIF(Dégusté_le!$B$2:$B$10000,\"=\" & A150,Dégusté_le!$C$2:$C$10000))","v":""},""]
[null,null,null,null,null,null,null,null,{"$f":"IF(A151=\"\",\"\",SUMIF(Dégusté_le!$B$2:$B$10000,\"=\" & A151,Dégusté_le!$C$2:$C$10000))","v":""},""]
[null,null,null,null,null,null,null,null,{"$f":"IF(A152=\"\",\"\",SUMIF(Dégusté_le!$B$2:$B$10000,\"=\" & A152,Dégusté_le!$C$2:$C$10000))","v":""},""]
[null,null,null,null,null,null,null,null,{"$f":"IF(A153=\"\",\"\",SUMIF(Dégusté_le!$B$2:$B$10000,\"=\" & A153,Dégusté_le!$C$2:$C$10000))","v":""},""]
[null,null,null,null,null,null,null,null,{"$f":"IF(A154=\"\",\"\",SUMIF(Dégusté_le!$B$2:$B$10000,\"=\" & A154,Dégusté_le!$C$2:$C$10000))","v":""},""]
[null,null,null,null,null,null,null,null,{"$f":"IF(A155=\"\",\"\",SUMIF(Dégusté_le!$B$2:$B$10000,\"=\" & A155,Dégusté_le!$C$2:$C$10000))","v":""},""]
[null,null,null,null,null,null,null,null,{"$f":"IF(A156=\"\",\"\",SUMIF(Dégusté_le!$B$2:$B$10000,\"=\" & A156,Dégusté_le!$C$2:$C$10000))","v":""},""]
[null,null,null,null,null,null,null,null,{"$f":"IF(A157=\"\",\"\",SUMIF(Dégusté_le!$B$2:$B$10000,\"=\" & A157,Dégusté_le!$C$2:$C$10000))","v":""},""]
[null,null,null,null,null,null,null,null,{"$f":"IF(A158=\"\",\"\",SUMIF(Dégusté_le!$B$2:$B$10000,\"=\" & A158,Dégusté_le!$C$2:$C$10000))","v":""},""]
[null,null,null,null,null,null,null,null,{"$f":"IF(A159=\"\",\"\",SUMIF(Dégusté_le!$B$2:$B$10000,\"=\" & A159,Dégusté_le!$C$2:$C$10000))","v":""},""]
[null,null,null,null,null,null,null,null,{"$f":"IF(A160=\"\",\"\",SUMIF(Dégusté_le!$B$2:$B$10000,\"=\" & A160,Dégusté_le!$C$2:$C$10000))","v":""},""]
[null,null,null,null,null,null,null,null,{"$f":"IF(A161=\"\",\"\",SUMIF(Dégusté_le!$B$2:$B$10000,\"=\" & A161,Dégusté_le!$C$2:$C$10000))","v":""},""]
[null,null,null,null,null,null,null,null,{"$f":"IF(A162=\"\",\"\",SUMIF(Dégusté_le!$B$2:$B$10000,\"=\" & A162,Dégusté_le!$C$2:$C$10000))","v":""},""]
[null,null,null,null,null,null,null,null,{"$f":"IF(A163=\"\",\"\",SUMIF(Dégusté_le!$B$2:$B$10000,\"=\" & A163,Dégusté_le!$C$2:$C$10000))","v":""},""]
[null,null,null,null,null,null,null,null,{"$f":"IF(A164=\"\",\"\",SUMIF(Dégusté_le!$B$2:$B$10000,\"=\" & A164,Dégusté_le!$C$2:$C$10000))","v":""},""]
[null,null,null,null,null,null,null,null,{"$f":"IF(A165=\"\",\"\",SUMIF(Dégusté_le!$B$2:$B$10000,\"=\" & A165,Dégusté_le!$C$2:$C$10000))","v":""},""]
[null,null,null,null,null,null,null,null,{"$f":"IF(A166=\"\",\"\",SUMIF(Dégusté_le!$B$2:$B$10000,\"=\" & A166,Dégusté_le!$C$2:$C$10000))","v":""},""]
[null,null,null,null,null,null,null,null,{"$f":"IF(A167=\"\",\"\",SUMIF(Dégusté_le!$B$2:$B$10000,\"=\" & A167,Dégusté_le!$C$2:$C$10000))","v":""},""]
[null,null,null,null,null,null,null,null,{"$f":"IF(A168=\"\",\"\",SUMIF(Dégusté_le!$B$2:$B$10000,\"=\" & A168,Dégusté_le!$C$2:$C$10000))","v":""},""]
[null,null,null,null,null,null,null,null,{"$f":"IF(A169=\"\",\"\",SUMIF(Dégusté_le!$B$2:$B$10000,\"=\" & A169,Dégusté_le!$C$2:$C$10000))","v":""},""]
[null,null,null,null,null,null,null,null,{"$f":"IF(A170=\"\",\"\",SUMIF(Dégusté_le!$B$2:$B$10000,\"=\" & A170,Dégusté_le!$C$2:$C$10000))","v":""},""]
[null,null,null,null,null,null,null,null,{"$f":"IF(A171=\"\",\"\",SUMIF(Dégusté_le!$B$2:$B$10000,\"=\" & A171,Dégusté_le!$C$2:$C$10000))","v":""},""]
[null,null,null,null,null,null,null,null,{"$f":"IF(A172=\"\",\"\",SUMIF(Dégusté_le!$B$2:$B$10000,\"=\" & A172,Dégusté_le!$C$2:$C$10000))","v":""},""]
[null,null,null,null,null,null,null,null,{"$f":"IF(A173=\"\",\"\",SUMIF(Dégusté_le!$B$2:$B$10000,\"=\" & A173,Dégusté_le!$C$2:$C$10000))","v":""},""]
[null,null,null,null,null,null,null,null,{"$f":"IF(A174=\"\",\"\",SUMIF(Dégusté_le!$B$2:$B$10000,\"=\" & A174,Dégusté_le!$C$2:$C$10000))","v":""},""]
[null,null,null,null,null,null,null,null,{"$f":"IF(A175=\"\",\"\",SUMIF(Dégusté_le!$B$2:$B$10000,\"=\" & A175,Dégusté_le!$C$2:$C$10000))","v":""},""]
[null,null,null,null,null,null,null,null,{"$f":"IF(A176=\"\",\"\",SUMIF(Dégusté_le!$B$2:$B$10000,\"=\" & A176,Dégusté_le!$C$2:$C$10000))","v":""},""]
[null,null,null,null,null,null,null,null,{"$f":"IF(A177=\"\",\"\",SUMIF(Dégusté_le!$B$2:$B$10000,\"=\" & A177,Dégusté_le!$C$2:$C$10000))","v":""},""]
[null,null,null,null,null,null,null,null,{"$f":"IF(A178=\"\",\"\",SUMIF(Dégusté_le!$B$2:$B$10000,\"=\" & A178,Dégusté_le!$C$2:$C$10000))","v":""},""]
[null,null,null,null,null,null,null,null,{"$f":"IF(A179=\"\",\"\",SUMIF(Dégusté_le!$B$2:$B$10000,\"=\" & A179,Dégusté_le!$C$2:$C$10000))","v":""},""]
[null,null,null,null,null,null,null,null,{"$f":"IF(A180=\"\",\"\",SUMIF(Dégusté_le!$B$2:$B$10000,\"=\" & A180,Dégusté_le!$C$2:$C$10000))","v":""},""]
[null,null,null,null,null,null,null,null,{"$f":"IF(A181=\"\",\"\",SUMIF(Dégusté_le!$B$2:$B$10000,\"=\" & A181,Dégusté_le!$C$2:$C$10000))","v":""},""]
[null,null,null,null,null,null,null,null,{"$f":"IF(A182=\"\",\"\",SUMIF(Dégusté_le!$B$2:$B$10000,\"=\" & A182,Dégusté_le!$C$2:$C$10000))","v":""},""]
[null,null,null,null,null,null,null,null,{"$f":"IF(A183=\"\",\"\",SUMIF(Dégusté_le!$B$2:$B$10000,\"=\" & A183,Dégusté_le!$C$2:$C$10000))","v":""},""]
[null,null,null,null,null,null,null,null,{"$f":"IF(A184=\"\",\"\",SUMIF(Dégusté_le!$B$2:$B$10000,\"=\" & A184,Dégusté_le!$C$2:$C$10000))","v":""},""]
[null,null,null,null,null,null,null,null,{"$f":"IF(A185=\"\",\"\",SUMIF(Dégusté_le!$B$2:$B$10000,\"=\" & A185,Dégusté_le!$C$2:$C$10000))","v":""},""]
[null,null,null,null,null,null,null,null,{"$f":"IF(A186=\"\",\"\",SUMIF(Dégusté_le!$B$2:$B$10000,\"=\" & A186,Dégusté_le!$C$2:$C$10000))","v":""},""]
[null,null,null,null,null,null,null,null,{"$f":"IF(A187=\"\",\"\",SUMIF(Dégusté_le!$B$2:$B$10000,\"=\" & A187,Dégusté_le!$C$2:$C$10000))","v":""},""]
[null,null,null,null,null,null,null,null,{"$f":"IF(A188=\"\",\"\",SUMIF(Dégusté_le!$B$2:$B$10000,\"=\" & A188,Dégusté_le!$C$2:$C$10000))","v":""},""]
[null,null,null,null,null,null,null,null,{"$f":"IF(A189=\"\",\"\",SUMIF(Dégusté_le!$B$2:$B$10000,\"=\" & A189,Dégusté_le!$C$2:$C$10000))","v":""},""]
[null,null,null,null,null,null,null,null,{"$f":"IF(A190=\"\",\"\",SUMIF(Dégusté_le!$B$2:$B$10000,\"=\" & A190,Dégusté_le!$C$2:$C$10000))","v":""},""]
[null,null,null,null,null,null,null,null,{"$f":"IF(A191=\"\",\"\",SUMIF(Dégusté_le!$B$2:$B$10000,\"=\" & A191,Dégusté_le!$C$2:$C$10000))","v":""},""]
[null,null,null,null,null,null,null,null,{"$f":"IF(A192=\"\",\"\",SUMIF(Dégusté_le!$B$2:$B$10000,\"=\" & A192,Dégusté_le!$C$2:$C$10000))","v":""},""]
[null,null,null,null,null,null,null,null,{"$f":"IF(A193=\"\",\"\",SUMIF(Dégusté_le!$B$2:$B$10000,\"=\" & A193,Dégusté_le!$C$2:$C$10000))","v":""},""]
[null,null,null,null,null,null,null,null,{"$f":"IF(A194=\"\",\"\",SUMIF(Dégusté_le!$B$2:$B$10000,\"=\" & A194,Dégusté_le!$C$2:$C$10000))","v":""},""]
[null,null,null,null,null,null,null,null,{"$f":"IF(A195=\"\",\"\",SUMIF(Dégusté_le!$B$2:$B$10000,\"=\" & A195,Dégusté_le!$C$2:$C$10000))","v":""},{"$f":"IF(A195>0,G195-I195,\"\")","v":""}]
[null,null,null,null,null,null,null,null,{"$f":"IF(A196=\"\",\"\",SUMIF(Dégusté_le!$B$2:$B$10000,\"=\" & A196,Dégusté_le!$C$2:$C$10000))","v":""},""]
[null,null,null,null,null,null,null,null,{"$f":"IF(A197=\"\",\"\",SUMIF(Dégusté_le!$B$2:$B$10000,\"=\" & A197,Dégusté_le!$C$2:$C$10000))","v":""},""]
[null,null,null,null,null,null,null,null,{"$f":"IF(A198=\"\",\"\",SUMIF(Dégusté_le!$B$2:$B$10000,\"=\" & A198,Dégusté_le!$C$2:$C$10000))","v":""},""]
[null,null,null,null,null,null,null,null,{"$f":"IF(A199=\"\",\"\",SUMIF(Dégusté_le!$B$2:$B$10000,\"=\" & A199,Dégusté_le!$C$2:$C$10000))","v":""},""]
[null,null,null,null,null,null,null,null,{"$f":"IF(A200=\"\",\"\",SUMIF(Dégusté_le!$B$2:$B$10000,\"=\" & A200,Dégusté_le!$C$2:$C$10000))","v":""},""]
[null,null,null,null,null,null,null,null,{"$f":"IF(A201=\"\",\"\",SUMIF(Dégusté_le!$B$2:$B$10000,\"=\" & A201,Dégusté_le!$C$2:$C$10000))","v":""},""]
[null,null,null,null,null,null,null,null,{"$f":"IF(A202=\"\",\"\",SUMIF(Dégusté_le!$B$2:$B$10000,\"=\" & A202,Dégusté_le!$C$2:$C$10000))","v":""},""]
[null,null,null,null,null,null,null,null,{"$f":"IF(A203=\"\",\"\",SUMIF(Dégusté_le!$B$2:$B$10000,\"=\" & A203,Dégusté_le!$C$2:$C$10000))","v":""},""]
[null,null,null,null,null,null,null,null,{"$f":"IF(A204=\"\",\"\",SUMIF(Dégusté_le!$B$2:$B$10000,\"=\" & A204,Dégusté_le!$C$2:$C$10000))","v":""},""]
[null,null,null,null,null,null,null,null,{"$f":"IF(A205=\"\",\"\",SUMIF(Dégusté_le!$B$2:$B$10000,\"=\" & A205,Dégusté_le!$C$2:$C$10000))","v":""},""]
[null,null,null,null,null,null,null,null,{"$f":"IF(A206=\"\",\"\",SUMIF(Dégusté_le!$B$2:$B$10000,\"=\" & A206,Dégusté_le!$C$2:$C$10000))","v":""},""]
[null,null,null,null,null,null,null,null,{"$f":"IF(A207=\"\",\"\",SUMIF(Dégusté_le!$B$2:$B$10000,\"=\" & A207,Dégusté_le!$C$2:$C$10000))","v":""},""]
[null,null,null,null,null,null,null,null,{"$f":"IF(A208=\"\",\"\",SUMIF(Dégusté_le!$B$2:$B$10000,\"=\" & A208,Dégusté_le!$C$2:$C$10000))","v":""},""]
[null,null,null,null,null,null,null,null,{"$f":"IF(A209=\"\",\"\",SUMIF(Dégusté_le!$B$2:$B$10000,\"=\" & A209,Dégusté_le!$C$2:$C$10000))","v":""},""]
[null,null,null,null,null,null,null,null,{"$f":"IF(A210=\"\",\"\",SUMIF(Dégusté_le!$B$2:$B$10000,\"=\" & A210,Dégusté_le!$C$2:$C$10000))","v":""},""]
[null,null,null,null,null,null,null,null,{"$f":"IF(A211=\"\",\"\",SUMIF(Dégusté_le!$B$2:$B$10000,\"=\" & A211,Dégusté_le!$C$2:$C$10000))","v":""},""]
[null,null,null,null,null,null,null,null,{"$f":"IF(A212=\"\",\"\",SUMIF(Dégusté_le!$B$2:$B$10000,\"=\" & A212,Dégusté_le!$C$2:$C$10000))","v":""},""]
[null,null,null,null,null,null,null,null,{"$f":"IF(A213=\"\",\"\",SUMIF(Dégusté_le!$B$2:$B$10000,\"=\" & A213,Dégusté_le!$C$2:$C$10000))","v":""},""]
[null,null,null,null,null,null,null,null,{"$f":"IF(A214=\"\",\"\",SUMIF(Dégusté_le!$B$2:$B$10000,\"=\" & A214,Dégusté_le!$C$2:$C$10000))","v":""},""]
[null,null,null,null,null,null,null,null,{"$f":"IF(A215=\"\",\"\",SUMIF(Dégusté_le!$B$2:$B$10000,\"=\" & A215,Dégusté_le!$C$2:$C$10000))","v":""},""]
[null,null,null,null,null,null,null,null,{"$f":"IF(A216=\"\",\"\",SUMIF(Dégusté_le!$B$2:$B$10000,\"=\" & A216,Dégusté_le!$C$2:$C$10000))","v":""},""]
[null,null,null,null,null,null,null,null,{"$f":"IF(A217=\"\",\"\",SUMIF(Dégusté_le!$B$2:$B$10000,\"=\" & A217,Dégusté_le!$C$2:$C$10000))","v":""},""]
[null,null,null,null,null,null,null,null,{"$f":"IF(A218=\"\",\"\",SUMIF(Dégusté_le!$B$2:$B$10000,\"=\" & A218,Dégusté_le!$C$2:$C$10000))","v":""},""]
[null,null,null,null,null,null,null,null,{"$f":"IF(A219=\"\",\"\",SUMIF(Dégusté_le!$B$2:$B$10000,\"=\" & A219,Dégusté_le!$C$2:$C$10000))","v":""},""]
[null,null,null,null,null,null,null,null,{"$f":"IF(A220=\"\",\"\",SUMIF(Dégusté_le!$B$2:$B$10000,\"=\" & A220,Dégusté_le!$C$2:$C$10000))","v":""},""]
[null,null,null,null,null,null,null,null,{"$f":"IF(A221=\"\",\"\",SUMIF(Dégusté_le!$B$2:$B$10000,\"=\" & A221,Dégusté_le!$C$2:$C$10000))","v":""},""]
[null,null,null,null,null,null,null,null,{"$f":"IF(A222=\"\",\"\",SUMIF(Dégusté_le!$B$2:$B$10000,\"=\" & A222,Dégusté_le!$C$2:$C$10000))","v":""},""]
[null,null,null,null,null,null,null,null,{"$f":"IF(A223=\"\",\"\",SUMIF(Dégusté_le!$B$2:$B$10000,\"=\" & A223,Dégusté_le!$C$2:$C$10000))","v":""},""]
[null,null,null,null,null,null,null,null,{"$f":"IF(A224=\"\",\"\",SUMIF(Dégusté_le!$B$2:$B$10000,\"=\" & A224,Dégusté_le!$C$2:$C$10000))","v":""},""]
[null,null,null,null,null,null,null,null,{"$f":"IF(A225=\"\",\"\",SUMIF(Dégusté_le!$B$2:$B$10000,\"=\" & A225,Dégusté_le!$C$2:$C$10000))","v":""},""]
[null,null,null,null,null,null,null,null,{"$f":"IF(A226=\"\",\"\",SUMIF(Dégusté_le!$B$2:$B$10000,\"=\" & A226,Dégusté_le!$C$2:$C$10000))","v":""},""]
[null,null,null,null,null,null,null,null,{"$f":"IF(A227=\"\",\"\",SUMIF(Dégusté_le!$B$2:$B$10000,\"=\" & A227,Dégusté_le!$C$2:$C$10000))","v":""},""]
[null,null,null,null,null,null,null,null,{"$f":"IF(A228=\"\",\"\",SUMIF(Dégusté_le!$B$2:$B$10000,\"=\" & A228,Dégusté_le!$C$2:$C$10000))","v":""},""]
[null,null,null,null,null,null,null,null,{"$f":"IF(A229=\"\",\"\",SUMIF(Dégusté_le!$B$2:$B$10000,\"=\" & A229,Dégusté_le!$C$2:$C$10000))","v":""},""]
[null,null,null,null,null,null,null,null,{"$f":"IF(A230=\"\",\"\",SUMIF(Dégusté_le!$B$2:$B$10000,\"=\" & A230,Dégusté_le!$C$2:$C$10000))","v":""},""]
[null,null,null,null,null,null,null,null,{"$f":"IF(A231=\"\",\"\",SUMIF(Dégusté_le!$B$2:$B$10000,\"=\" & A231,Dégusté_le!$C$2:$C$10000))","v":""},""]
[null,null,null,null,null,null,null,null,{"$f":"IF(A232=\"\",\"\",SUMIF(Dégusté_le!$B$2:$B$10000,\"=\" & A232,Dégusté_le!$C$2:$C$10000))","v":""},""]
[null,null,null,null,null,null,null,null,{"$f":"IF(A233=\"\",\"\",SUMIF(Dégusté_le!$B$2:$B$10000,\"=\" & A233,Dégusté_le!$C$2:$C$10000))","v":""},""]
[null,null,null,null,null,null,null,null,{"$f":"IF(A234=\"\",\"\",SUMIF(Dégusté_le!$B$2:$B$10000,\"=\" & A234,Dégusté_le!$C$2:$C$10000))","v":""},""]
[null,null,null,null,null,null,null,null,{"$f":"IF(A235=\"\",\"\",SUMIF(Dégusté_le!$B$2:$B$10000,\"=\" & A235,Dégusté_le!$C$2:$C$10000))","v":""},""]
[null,null,null,null,null,null,null,null,{"$f":"IF(A236=\"\",\"\",SUMIF(Dégusté_le!$B$2:$B$10000,\"=\" & A236,Dégusté_le!$C$2:$C$10000))","v":""},""]
[null,null,null,null,null,null,null,null,{"$f":"IF(A237=\"\",\"\",SUMIF(Dégusté_le!$B$2:$B$10000,\"=\" & A237,Dégusté_le!$C$2:$C$10000))","v":""},""]
[null,null,null,null,null,null,null,null,{"$f":"IF(A238=\"\",\"\",SUMIF(Dégusté_le!$B$2:$B$10000,\"=\" & A238,Dégusté_le!$C$2:$C$10000))","v":""},""]
[null,null,null,null,null,null,null,null,{"$f":"IF(A239=\"\",\"\",SUMIF(Dégusté_le!$B$2:$B$10000,\"=\" & A239,Dégusté_le!$C$2:$C$10000))","v":""},""]
[null,null,null,null,null,null,null,null,{"$f":"IF(A240=\"\",\"\",SUMIF(Dégusté_le!$B$2:$B$10000,\"=\" & A240,Dégusté_le!$C$2:$C$10000))","v":""},""]
[null,null,null,null,null,null,null,null,{"$f":"IF(A241=\"\",\"\",SUMIF(Dégusté_le!$B$2:$B$10000,\"=\" & A241,Dégusté_le!$C$2:$C$10000))","v":""},""]
[null,null,null,null,null,null,null,null,{"$f":"IF(A242=\"\",\"\",SUMIF(Dégusté_le!$B$2:$B$10000,\"=\" & A242,Dégusté_le!$C$2:$C$10000))","v":""},""]
[null,null,null,null,null,null,null,null,{"$f":"IF(A243=\"\",\"\",SUMIF(Dégusté_le!$B$2:$B$10000,\"=\" & A243,Dégusté_le!$C$2:$C$10000))","v":""},""]
[null,null,null,null,null,null,null,null,{"$f":"IF(A244=\"\",\"\",SUMIF(Dégusté_le!$B$2:$B$10000,\"=\" & A244,Dégusté_le!$C$2:$C$10000))","v":""},""]
[null,null,null,null,null,null,null,null,{"$f":"IF(A245=\"\",\"\",SUMIF(Dégusté_le!$B$2:$B$10000,\"=\" & A245,Dégusté_le!$C$2:$C$10000))","v":""},""]
[null,null,null,null,null,null,null,null,{"$f":"IF(A246=\"\",\"\",SUMIF(Dégusté_le!$B$2:$B$10000,\"=\" & A246,Dégusté_le!$C$2:$C$10000))","v":""},""]
[null,null,null,null,null,null,null,null,{"$f":"IF(A247=\"\",\"\",SUMIF(Dégusté_le!$B$2:$B$10000,\"=\" & A247,Dégusté_le!$C$2:$C$10000))","v":""},""]
[null,null,null,null,null,null,null,null,{"$f":"IF(A248=\"\",\"\",SUMIF(Dégusté_le!$B$2:$B$10000,\"=\" & A248,Dégusté_le!$C$2:$C$10000))","v":""},""]
[null,null,null,null,null,null,null,null,{"$f":"IF(A249=\"\",\"\",SUMIF(Dégusté_le!$B$2:$B$10000,\"=\" & A249,Dégusté_le!$C$2:$C$10000))","v":""},""]
[null,null,null,null,null,null,null,null,{"$f":"IF(A250=\"\",\"\",SUMIF(Dégusté_le!$B$2:$B$10000,\"=\" & A250,Dégusté_le!$C$2:$C$10000))","v":""},""]
[null,null,null,null,null,null,null,null,{"$f":"IF(A251=\"\",\"\",SUMIF(Dégusté_le!$B$2:$B$10000,\"=\" & A251,Dégusté_le!$C$2:$C$10000))","v":""},""]
[null,null,null,null,null,null,null,null,{"$f":"IF(A252=\"\",\"\",SUMIF(Dégusté_le!$B$2:$B$10000,\"=\" & A252,Dégusté_le!$C$2:$C$10000))","v":""},""]
[null,null,null,null,null,null,null,null,{"$f":"IF(A253=\"\",\"\",SUMIF(Dégusté_le!$B$2:$B$10000,\"=\" & A253,Dégusté_le!$C$2:$C$10000))","v":""},""]
[null,null,null,null,null,null,null,null,{"$f":"IF(A254=\"\",\"\",SUMIF(Dégusté_le!$B$2:$B$10000,\"=\" & A254,Dégusté_le!$C$2:$C$10000))","v":""},""]
[null,null,null,null,null,null,null,null,{"$f":"IF(A255=\"\",\"\",SUMIF(Dégusté_le!$B$2:$B$10000,\"=\" & A255,Dégusté_le!$C$2:$C$10000))","v":""},""]
[null,null,null,null,null,null,null,null,{"$f":"IF(A256=\"\",\"\",SUMIF(Dégusté_le!$B$2:$B$10000,\"=\" & A256,Dégusté_le!$C$2:$C$10000))","v":""},""]
[null,null,null,null,null,null,null,null,{"$f":"IF(A257=\"\",\"\",SUMIF(Dégusté_le!$B$2:$B$10000,\"=\" & A257,Dégusté_le!$C$2:$C$10000))","v":""},""]
[null,null,null,null,null,null,null,null,{"$f":"IF(A258=\"\",\"\",SUMIF(Dégusté_le!$B$2:$B$10000,\"=\" & A258,Dégusté_le!$C$2:$C$10000))","v":""},""]
[null,null,null,null,null,null,null,null,{"$f":"IF(A259=\"\",\"\",SUMIF(Dégusté_le!$B$2:$B$10000,\"=\" & A259,Dégusté_le!$C$2:$C$10000))","v":""},{"$f":"IF(A259>0,G259-I259,\"\")","v":""}]
[null,null,null,null,null,null,null,null,{"$f":"IF(A260=\"\",\"\",SUMIF(Dégusté_le!$B$2:$B$10000,\"=\" & A260,Dégusté_le!$C$2:$C$10000))","v":""},""]
[null,null,null,null,null,null,null,null,{"$f":"IF(A261=\"\",\"\",SUMIF(Dégusté_le!$B$2:$B$10000,\"=\" & A261,Dégusté_le!$C$2:$C$10000))","v":""},""]
[null,null,null,null,null,null,null,null,{"$f":"IF(A262=\"\",\"\",SUMIF(Dégusté_le!$B$2:$B$10000,\"=\" & A262,Dégusté_le!$C$2:$C$10000))","v":""},""]
[null,null,null,null,null,null,null,null,{"$f":"IF(A263=\"\",\"\",SUMIF(Dégusté_le!$B$2:$B$10000,\"=\" & A263,Dégusté_le!$C$2:$C$10000))","v":""},""]
[null,null,null,null,null,null,null,null,{"$f":"IF(A264=\"\",\"\",SUMIF(Dégusté_le!$B$2:$B$10000,\"=\" & A264,Dégusté_le!$C$2:$C$10000))","v":""},""]
[null,null,null,null,null,null,null,null,{"$f":"IF(A265=\"\",\"\",SUMIF(Dégusté_le!$B$2:$B$10000,\"=\" & A265,Dégusté_le!$C$2:$C$10000))","v":""},""]
[null,null,null,null,null,null,null,null,{"$f":"IF(A266=\"\",\"\",SUMIF(Dégusté_le!$B$2:$B$10000,\"=\" & A266,Dégusté_le!$C$2:$C$10000))","v":""},""]
[null,null,null,null,null,null,null,null,{"$f":"IF(A267=\"\",\"\",SUMIF(Dégusté_le!$B$2:$B$10000,\"=\" & A267,Dégusté_le!$C$2:$C$10000))","v":""},""]
[null,null,null,null,null,null,null,null,{"$f":"IF(A268=\"\",\"\",SUMIF(Dégusté_le!$B$2:$B$10000,\"=\" & A268,Dégusté_le!$C$2:$C$10000))","v":""},""]
[null,null,null,null,null,null,null,null,{"$f":"IF(A269=\"\",\"\",SUMIF(Dégusté_le!$B$2:$B$10000,\"=\" & A269,Dégusté_le!$C$2:$C$10000))","v":""},""]
[null,null,null,null,null,null,null,null,{"$f":"IF(A270=\"\",\"\",SUMIF(Dégusté_le!$B$2:$B$10000,\"=\" & A270,Dégusté_le!$C$2:$C$10000))","v":""},""]
[null,null,null,null,null,null,null,null,{"$f":"IF(A271=\"\",\"\",SUMIF(Dégusté_le!$B$2:$B$10000,\"=\" & A271,Dégusté_le!$C$2:$C$10000))","v":""},""]
[null,null,null,null,null,null,null,null,{"$f":"IF(A272=\"\",\"\",SUMIF(Dégusté_le!$B$2:$B$10000,\"=\" & A272,Dégusté_le!$C$2:$C$10000))","v":""},""]
[null,null,null,null,null,null,null,null,{"$f":"IF(A273=\"\",\"\",SUMIF(Dégusté_le!$B$2:$B$10000,\"=\" & A273,Dégusté_le!$C$2:$C$10000))","v":""},""]
[null,null,null,null,null,null,null,null,{"$f":"IF(A274=\"\",\"\",SUMIF(Dégusté_le!$B$2:$B$10000,\"=\" & A274,Dégusté_le!$C$2:$C$10000))","v":""},""]
[null,null,null,null,null,null,null,null,{"$f":"IF(A275=\"\",\"\",SUMIF(Dégusté_le!$B$2:$B$10000,\"=\" & A275,Dégusté_le!$C$2:$C$10000))","v":""},""]
[null,null,null,null,null,null,null,null,{"$f":"IF(A276=\"\",\"\",SUMIF(Dégusté_le!$B$2:$B$10000,\"=\" & A276,Dégusté_le!$C$2:$C$10000))","v":""},""]
[null,null,null,null,null,null,null,null,{"$f":"IF(A277=\"\",\"\",SUMIF(Dégusté_le!$B$2:$B$10000,\"=\" & A277,Dégusté_le!$C$2:$C$10000))","v":""},""]
[null,null,null,null,null,null,null,null,{"$f":"IF(A278=\"\",\"\",SUMIF(Dégusté_le!$B$2:$B$10000,\"=\" & A278,Dégusté_le!$C$2:$C$10000))","v":""},""]
[null,null,null,null,null,null,null,null,{"$f":"IF(A279=\"\",\"\",SUMIF(Dégusté_le!$B$2:$B$10000,\"=\" & A279,Dégusté_le!$C$2:$C$10000))","v":""},""]
[null,null,null,null,null,null,null,null,{"$f":"IF(A280=\"\",\"\",SUMIF(Dégusté_le!$B$2:$B$10000,\"=\" & A280,Dégusté_le!$C$2:$C$10000))","v":""},""]
[null,null,null,null,null,null,null,null,{"$f":"IF(A281=\"\",\"\",SUMIF(Dégusté_le!$B$2:$B$10000,\"=\" & A281,Dégusté_le!$C$2:$C$10000))","v":""},""]
[null,null,null,null,null,null,null,null,{"$f":"IF(A282=\"\",\"\",SUMIF(Dégusté_le!$B$2:$B$10000,\"=\" & A282,Dégusté_le!$C$2:$C$10000))","v":""},""]
[null,null,null,null,null,null,null,null,{"$f":"IF(A283=\"\",\"\",SUMIF(Dégusté_le!$B$2:$B$10000,\"=\" & A283,Dégusté_le!$C$2:$C$10000))","v":""},""]
[null,null,null,null,null,null,null,null,{"$f":"IF(A284=\"\",\"\",SUMIF(Dégusté_le!$B$2:$B$10000,\"=\" & A284,Dégusté_le!$C$2:$C$10000))","v":""},""]
[null,null,null,null,null,null,null,null,{"$f":"IF(A285=\"\",\"\",SUMIF(Dégusté_le!$B$2:$B$10000,\"=\" & A285,Dégusté_le!$C$2:$C$10000))","v":""},""]
[null,null,null,null,null,null,null,null,{"$f":"IF(A286=\"\",\"\",SUMIF(Dégusté_le!$B$2:$B$10000,\"=\" & A286,Dégusté_le!$C$2:$C$10000))","v":""},""]
[null,null,null,null,null,null,null,null,{"$f":"IF(A287=\"\",\"\",SUMIF(Dégusté_le!$B$2:$B$10000,\"=\" & A287,Dégusté_le!$C$2:$C$10000))","v":""},""]
[null,null,null,null,null,null,null,null,{"$f":"IF(A288=\"\",\"\",SUMIF(Dégusté_le!$B$2:$B$10000,\"=\" & A288,Dégusté_le!$C$2:$C$10000))","v":""},""]
[null,null,null,null,null,null,null,null,{"$f":"IF(A289=\"\",\"\",SUMIF(Dégusté_le!$B$2:$B$10000,\"=\" & A289,Dégusté_le!$C$2:$C$10000))","v":""},""]
[null,null,null,null,null,null,null,null,{"$f":"IF(A290=\"\",\"\",SUMIF(Dégusté_le!$B$2:$B$10000,\"=\" & A290,Dégusté_le!$C$2:$C$10000))","v":""},""]
[null,null,null,null,null,null,null,null,{"$f":"IF(A291=\"\",\"\",SUMIF(Dégusté_le!$B$2:$B$10000,\"=\" & A291,Dégusté_le!$C$2:$C$10000))","v":""},""]
[null,null,null,null,null,null,null,null,{"$f":"IF(A292=\"\",\"\",SUMIF(Dégusté_le!$B$2:$B$10000,\"=\" & A292,Dégusté_le!$C$2:$C$10000))","v":""},""]
[null,null,null,null,null,null,null,null,{"$f":"IF(A293=\"\",\"\",SUMIF(Dégusté_le!$B$2:$B$10000,\"=\" & A293,Dégusté_le!$C$2:$C$10000))","v":""},""]
[null,null,null,null,null,null,null,null,{"$f":"IF(A294=\"\",\"\",SUMIF(Dégusté_le!$B$2:$B$10000,\"=\" & A294,Dégusté_le!$C$2:$C$10000))","v":""},""]
[null,null,null,null,null,null,null,null,{"$f":"IF(A295=\"\",\"\",SUMIF(Dégusté_le!$B$2:$B$10000,\"=\" & A295,Dégusté_le!$C$2:$C$10000))","v":""},""]
[null,null,null,null,null,null,null,null,{"$f":"IF(A296=\"\",\"\",SUMIF(Dégusté_le!$B$2:$B$10000,\"=\" & A296,Dégusté_le!$C$2:$C$10000))","v":""},""]
[null,null,null,null,null,null,null,null,{"$f":"IF(A297=\"\",\"\",SUMIF(Dégusté_le!$B$2:$B$10000,\"=\" & A297,Dégusté_le!$C$2:$C$10000))","v":""},""]
[null,null,null,null,null,null,null,null,{"$f":"IF(A298=\"\",\"\",SUMIF(Dégusté_le!$B$2:$B$10000,\"=\" & A298,Dégusté_le!$C$2:$C$10000))","v":""},""]
[null,null,null,null,null,null,null,null,{"$f":"IF(A299=\"\",\"\",SUMIF(Dégusté_le!$B$2:$B$10000,\"=\" & A299,Dégusté_le!$C$2:$C$10000))","v":""},""]
[null,null,null,null,null,null,null,null,{"$f":"IF(A300=\"\",\"\",SUMIF(Dégusté_le!$B$2:$B$10000,\"=\" & A300,Dégusté_le!$C$2:$C$10000))","v":""},""]
[null,null,null,null,null,null,null,null,{"$f":"IF(A301=\"\",\"\",SUMIF(Dégusté_le!$B$2:$B$10000,\"=\" & A301,Dégusté_le!$C$2:$C$10000))","v":""},""]
[null,null,null,null,null,null,null,null,{"$f":"IF(A302=\"\",\"\",SUMIF(Dégusté_le!$B$2:$B$10000,\"=\" & A302,Dégusté_le!$C$2:$C$10000))","v":""},""]
[null,null,null,null,null,null,null,null,{"$f":"IF(A303=\"\",\"\",SUMIF(Dégusté_le!$B$2:$B$10000,\"=\" & A303,Dégusté_le!$C$2:$C$10000))","v":""},""]
[null,null,null,null,null,null,null,null,{"$f":"IF(A304=\"\",\"\",SUMIF(Dégusté_le!$B$2:$B$10000,\"=\" & A304,Dégusté_le!$C$2:$C$10000))","v":""},""]
[null,null,null,null,null,null,null,null,{"$f":"IF(A305=\"\",\"\",SUMIF(Dégusté_le!$B$2:$B$10000,\"=\" & A305,Dégusté_le!$C$2:$C$10000))","v":""},""]
[null,null,null,null,null,null,null,null,{"$f":"IF(A306=\"\",\"\",SUMIF(Dégusté_le!$B$2:$B$10000,\"=\" & A306,Dégusté_le!$C$2:$C$10000))","v":""},""]
[null,null,null,null,null,null,null,null,{"$f":"IF(A307=\"\",\"\",SUMIF(Dégusté_le!$B$2:$B$10000,\"=\" & A307,Dégusté_le!$C$2:$C$10000))","v":""},""]
[null,null,null,null,null,null,null,null,{"$f":"IF(A308=\"\",\"\",SUMIF(Dégusté_le!$B$2:$B$10000,\"=\" & A308,Dégusté_le!$C$2:$C$10000))","v":""},""]
[null,null,null,null,null,null,null,null,{"$f":"IF(A309=\"\",\"\",SUMIF(Dégusté_le!$B$2:$B$10000,\"=\" & A309,Dégusté_le!$C$2:$C$10000))","v":""},""]
[null,null,null,null,null,null,null,null,{"$f":"IF(A310=\"\",\"\",SUMIF(Dégusté_le!$B$2:$B$10000,\"=\" & A310,Dégusté_le!$C$2:$C$10000))","v":""},""]
[null,null,null,null,null,null,null,null,{"$f":"IF(A311=\"\",\"\",SUMIF(Dégusté_le!$B$2:$B$10000,\"=\" & A311,Dégusté_le!$C$2:$C$10000))","v":""},""]
[null,null,null,null,null,null,null,null,{"$f":"IF(A312=\"\",\"\",SUMIF(Dégusté_le!$B$2:$B$10000,\"=\" & A312,Dégusté_le!$C$2:$C$10000))","v":""},""]
[null,null,null,null,null,null,null,null,{"$f":"IF(A313=\"\",\"\",SUMIF(Dégusté_le!$B$2:$B$10000,\"=\" & A313,Dégusté_le!$C$2:$C$10000))","v":""},""]
[null,null,null,null,null,null,null,null,{"$f":"IF(A314=\"\",\"\",SUMIF(Dégusté_le!$B$2:$B$10000,\"=\" & A314,Dégusté_le!$C$2:$C$10000))","v":""},""]
[null,null,null,null,null,null,null,null,{"$f":"IF(A315=\"\",\"\",SUMIF(Dégusté_le!$B$2:$B$10000,\"=\" & A315,Dégusté_le!$C$2:$C$10000))","v":""},""]
[null,null,null,null,null,null,null,null,{"$f":"IF(A316=\"\",\"\",SUMIF(Dégusté_le!$B$2:$B$10000,\"=\" & A316,Dégusté_le!$C$2:$C$10000))","v":""},""]
[null,null,null,null,null,null,null,null,{"$f":"IF(A317=\"\",\"\",SUMIF(Dégusté_le!$B$2:$B$10000,\"=\" & A317,Dégusté_le!$C$2:$C$10000))","v":""},""]
[null,null,null,null,null,null,null,null,{"$f":"IF(A318=\"\",\"\",SUMIF(Dégusté_le!$B$2:$B$10000,\"=\" & A318,Dégusté_le!$C$2:$C$10000))","v":""},""]
[null,null,null,null,null,null,null,null,{"$f":"IF(A319=\"\",\"\",SUMIF(Dégusté_le!$B$2:$B$10000,\"=\" & A319,Dégusté_le!$C$2:$C$10000))","v":""},""]
[null,null,null,null,null,null,null,null,{"$f":"IF(A320=\"\",\"\",SUMIF(Dégusté_le!$B$2:$B$10000,\"=\" & A320,Dégusté_le!$C$2:$C$10000))","v":""},""]
[null,null,null,null,null,null,null,null,{"$f":"IF(A321=\"\",\"\",SUMIF(Dégusté_le!$B$2:$B$10000,\"=\" & A321,Dégusté_le!$C$2:$C$10000))","v":""},""]
[null,null,null,null,null,null,null,null,{"$f":"IF(A322=\"\",\"\",SUMIF(Dégusté_le!$B$2:$B$10000,\"=\" & A322,Dégusté_le!$C$2:$C$10000))","v":""},""]
[null,null,null,null,null,null,null,null,{"$f":"IF(A323=\"\",\"\",SUMIF(Dégusté_le!$B$2:$B$10000,\"=\" & A323,Dégusté_le!$C$2:$C$10000))","v":""},{"$f":"IF(A323>0,G323-I323,\"\")","v":""}]
[null,null,null,null,null,null,null,null,{"$f":"IF(A324=\"\",\"\",SUMIF(Dégusté_le!$B$2:$B$10000,\"=\" & A324,Dégusté_le!$C$2:$C$10000))","v":""},""]
[null,null,null,null,null,null,null,null,{"$f":"IF(A325=\"\",\"\",SUMIF(Dégusté_le!$B$2:$B$10000,\"=\" & A325,Dégusté_le!$C$2:$C$10000))","v":""},""]
[null,null,null,null,null,null,null,null,{"$f":"IF(A326=\"\",\"\",SUMIF(Dégusté_le!$B$2:$B$10000,\"=\" & A326,Dégusté_le!$C$2:$C$10000))","v":""},""]
[null,null,null,null,null,null,null,null,{"$f":"IF(A327=\"\",\"\",SUMIF(Dégusté_le!$B$2:$B$10000,\"=\" & A327,Dégusté_le!$C$2:$C$10000))","v":""},""]
[null,null,null,null,null,null,null,null,{"$f":"IF(A328=\"\",\"\",SUMIF(Dégusté_le!$B$2:$B$10000,\"=\" & A328,Dégusté_le!$C$2:$C$10000))","v":""},""]
[null,null,null,null,null,null,null,null,{"$f":"IF(A329=\"\",\"\",SUMIF(Dégusté_le!$B$2:$B$10000,\"=\" & A329,Dégusté_le!$C$2:$C$10000))","v":""},""]
[null,null,null,null,null,null,null,null,{"$f":"IF(A330=\"\",\"\",SUMIF(Dégusté_le!$B$2:$B$10000,\"=\" & A330,Dégusté_le!$C$2:$C$10000))","v":""},""]
[null,null,null,null,null,null,null,null,{"$f":"IF(A331=\"\",\"\",SUMIF(Dégusté_le!$B$2:$B$10000,\"=\" & A331,Dégusté_le!$C$2:$C$10000))","v":""},""]
[null,null,null,null,null,null,null,null,{"$f":"IF(A332=\"\",\"\",SUMIF(Dégusté_le!$B$2:$B$10000,\"=\" & A332,Dégusté_le!$C$2:$C$10000))","v":""},""]
[null,null,null,null,null,null,null,null,{"$f":"IF(A333=\"\",\"\",SUMIF(Dégusté_le!$B$2:$B$10000,\"=\" & A333,Dégusté_le!$C$2:$C$10000))","v":""},""]
[null,null,null,null,null,null,null,null,{"$f":"IF(A334=\"\",\"\",SUMIF(Dégusté_le!$B$2:$B$10000,\"=\" & A334,Dégusté_le!$C$2:$C$10000))","v":""},""]
[null,null,null,null,null,null,null,null,{"$f":"IF(A335=\"\",\"\",SUMIF(Dégusté_le!$B$2:$B$10000,\"=\" & A335,Dégusté_le!$C$2:$C$10000))","v":""},""]
[null,null,null,null,null,null,null,null,{"$f":"IF(A336=\"\",\"\",SUMIF(Dégusté_le!$B$2:$B$10000,\"=\" & A336,Dégusté_le!$C$2:$C$10000))","v":""},""]
[null,null,null,null,null,null,null,null,{"$f":"IF(A337=\"\",\"\",SUMIF(Dégusté_le!$B$2:$B$10000,\"=\" & A337,Dégusté_le!$C$2:$C$10000))","v":""},""]
[null,null,null,null,null,null,null,null,{"$f":"IF(A338=\"\",\"\",SUMIF(Dégusté_le!$B$2:$B$10000,\"=\" & A338,Dégusté_le!$C$2:$C$10000))","v":""},""]
[null,null,null,null,null,null,null,null,{"$f":"IF(A339=\"\",\"\",SUMIF(Dégusté_le!$B$2:$B$10000,\"=\" & A339,Dégusté_le!$C$2:$C$10000))","v":""},""]
[null,null,null,null,null,null,null,null,{"$f":"IF(A340=\"\",\"\",SUMIF(Dégusté_le!$B$2:$B$10000,\"=\" & A340,Dégusté_le!$C$2:$C$10000))","v":""},""]
[null,null,null,null,null,null,null,null,{"$f":"IF(A341=\"\",\"\",SUMIF(Dégusté_le!$B$2:$B$10000,\"=\" & A341,Dégusté_le!$C$2:$C$10000))","v":""},""]
[null,null,null,null,null,null,null,null,{"$f":"IF(A342=\"\",\"\",SUMIF(Dégusté_le!$B$2:$B$10000,\"=\" & A342,Dégusté_le!$C$2:$C$10000))","v":""},""]
[null,null,null,null,null,null,null,null,{"$f":"IF(A343=\"\",\"\",SUMIF(Dégusté_le!$B$2:$B$10000,\"=\" & A343,Dégusté_le!$C$2:$C$10000))","v":""},""]
[null,null,null,null,null,null,null,null,{"$f":"IF(A344=\"\",\"\",SUMIF(Dégusté_le!$B$2:$B$10000,\"=\" & A344,Dégusté_le!$C$2:$C$10000))","v":""},""]
[null,null,null,null,null,null,null,null,{"$f":"IF(A345=\"\",\"\",SUMIF(Dégusté_le!$B$2:$B$10000,\"=\" & A345,Dégusté_le!$C$2:$C$10000))","v":""},""]
[null,null,null,null,null,null,null,null,{"$f":"IF(A346=\"\",\"\",SUMIF(Dégusté_le!$B$2:$B$10000,\"=\" & A346,Dégusté_le!$C$2:$C$10000))","v":""},""]
[null,null,null,null,null,null,null,null,{"$f":"IF(A347=\"\",\"\",SUMIF(Dégusté_le!$B$2:$B$10000,\"=\" & A347,Dégusté_le!$C$2:$C$10000))","v":""},""]
[null,null,null,null,null,null,null,null,{"$f":"IF(A348=\"\",\"\",SUMIF(Dégusté_le!$B$2:$B$10000,\"=\" & A348,Dégusté_le!$C$2:$C$10000))","v":""},""]
[null,null,null,null,null,null,null,null,{"$f":"IF(A349=\"\",\"\",SUMIF(Dégusté_le!$B$2:$B$10000,\"=\" & A349,Dégusté_le!$C$2:$C$10000))","v":""},""]
[null,null,null,null,null,null,null,null,{"$f":"IF(A350=\"\",\"\",SUMIF(Dégusté_le!$B$2:$B$10000,\"=\" & A350,Dégusté_le!$C$2:$C$10000))","v":""},""]
[null,null,null,null,null,null,null,null,{"$f":"IF(A351=\"\",\"\",SUMIF(Dégusté_le!$B$2:$B$10000,\"=\" & A351,Dégusté_le!$C$2:$C$10000))","v":""},""]
[null,null,null,null,null,null,null,null,{"$f":"IF(A352=\"\",\"\",SUMIF(Dégusté_le!$B$2:$B$10000,\"=\" & A352,Dégusté_le!$C$2:$C$10000))","v":""},""]
[null,null,null,null,null,null,null,null,{"$f":"IF(A353=\"\",\"\",SUMIF(Dégusté_le!$B$2:$B$10000,\"=\" & A353,Dégusté_le!$C$2:$C$10000))","v":""},""]
[null,null,null,null,null,null,null,null,{"$f":"IF(A354=\"\",\"\",SUMIF(Dégusté_le!$B$2:$B$10000,\"=\" & A354,Dégusté_le!$C$2:$C$10000))","v":""},""]
[null,null,null,null,null,null,null,null,{"$f":"IF(A355=\"\",\"\",SUMIF(Dégusté_le!$B$2:$B$10000,\"=\" & A355,Dégusté_le!$C$2:$C$10000))","v":""},""]
[null,null,null,null,null,null,null,null,{"$f":"IF(A356=\"\",\"\",SUMIF(Dégusté_le!$B$2:$B$10000,\"=\" & A356,Dégusté_le!$C$2:$C$10000))","v":""},""]
[null,null,null,null,null,null,null,null,{"$f":"IF(A357=\"\",\"\",SUMIF(Dégusté_le!$B$2:$B$10000,\"=\" & A357,Dégusté_le!$C$2:$C$10000))","v":""},""]
[null,null,null,null,null,null,null,null,{"$f":"IF(A358=\"\",\"\",SUMIF(Dégusté_le!$B$2:$B$10000,\"=\" & A358,Dégusté_le!$C$2:$C$10000))","v":""},""]
[null,null,null,null,null,null,null,null,{"$f":"IF(A359=\"\",\"\",SUMIF(Dégusté_le!$B$2:$B$10000,\"=\" & A359,Dégusté_le!$C$2:$C$10000))","v":""},""]
[null,null,null,null,null,null,null,null,{"$f":"IF(A360=\"\",\"\",SUMIF(Dégusté_le!$B$2:$B$10000,\"=\" & A360,Dégusté_le!$C$2:$C$10000))","v":""},""]
[null,null,null,null,null,null,null,null,{"$f":"IF(A361=\"\",\"\",SUMIF(Dégusté_le!$B$2:$B$10000,\"=\" & A361,Dégusté_le!$C$2:$C$10000))","v":""},""]
[null,null,null,null,null,null,null,null,{"$f":"IF(A362=\"\",\"\",SUMIF(Dégusté_le!$B$2:$B$10000,\"=\" & A362,Dégusté_le!$C$2:$C$10000))","v":""},""]
[null,null,null,null,null,null,null,null,{"$f":"IF(A363=\"\",\"\",SUMIF(Dégusté_le!$B$2:$B$10000,\"=\" & A363,Dégusté_le!$C$2:$C$10000))","v":""},""]
[null,null,null,null,null,null,null,null,{"$f":"IF(A364=\"\",\"\",SUMIF(Dégusté_le!$B$2:$B$10000,\"=\" & A364,Dégusté_le!$C$2:$C$10000))","v":""},""]
[null,null,null,null,null,null,null,null,{"$f":"IF(A365=\"\",\"\",SUMIF(Dégusté_le!$B$2:$B$10000,\"=\" & A365,Dégusté_le!$C$2:$C$10000))","v":""},""]
[null,null,null,null,null,null,null,null,{"$f":"IF(A366=\"\",\"\",SUMIF(Dégusté_le!$B$2:$B$10000,\"=\" & A366,Dégusté_le!$C$2:$C$10000))","v":""},""]
[null,null,null,null,null,null,null,null,{"$f":"IF(A367=\"\",\"\",SUMIF(Dégusté_le!$B$2:$B$10000,\"=\" & A367,Dégusté_le!$C$2:$C$10000))","v":""},""]
[null,null,null,null,null,null,null,null,{"$f":"IF(A368=\"\",\"\",SUMIF(Dégusté_le!$B$2:$B$10000,\"=\" & A368,Dégusté_le!$C$2:$C$10000))","v":""},""]
[null,null,null,null,null,null,null,null,{"$f":"IF(A369=\"\",\"\",SUMIF(Dégusté_le!$B$2:$B$10000,\"=\" & A369,Dégusté_le!$C$2:$C$10000))","v":""},""]
[null,null,null,null,null,null,null,null,{"$f":"IF(A370=\"\",\"\",SUMIF(Dégusté_le!$B$2:$B$10000,\"=\" & A370,Dégusté_le!$C$2:$C$10000))","v":""},""]
[null,null,null,null,null,null,null,null,{"$f":"IF(A371=\"\",\"\",SUMIF(Dégusté_le!$B$2:$B$10000,\"=\" & A371,Dégusté_le!$C$2:$C$10000))","v":""},""]
[null,null,null,null,null,null,null,null,{"$f":"IF(A372=\"\",\"\",SUMIF(Dégusté_le!$B$2:$B$10000,\"=\" & A372,Dégusté_le!$C$2:$C$10000))","v":""},""]
[null,null,null,null,null,null,null,null,{"$f":"IF(A373=\"\",\"\",SUMIF(Dégusté_le!$B$2:$B$10000,\"=\" & A373,Dégusté_le!$C$2:$C$10000))","v":""},""]
[null,null,null,null,null,null,null,null,{"$f":"IF(A374=\"\",\"\",SUMIF(Dégusté_le!$B$2:$B$10000,\"=\" & A374,Dégusté_le!$C$2:$C$10000))","v":""},""]
[null,null,null,null,null,null,null,null,{"$f":"IF(A375=\"\",\"\",SUMIF(Dégusté_le!$B$2:$B$10000,\"=\" & A375,Dégusté_le!$C$2:$C$10000))","v":""},""]
[null,null,null,null,null,null,null,null,{"$f":"IF(A376=\"\",\"\",SUMIF(Dégusté_le!$B$2:$B$10000,\"=\" & A376,Dégusté_le!$C$2:$C$10000))","v":""},""]
[null,null,null,null,null,null,null,null,{"$f":"IF(A377=\"\",\"\",SUMIF(Dégusté_le!$B$2:$B$10000,\"=\" & A377,Dégusté_le!$C$2:$C$10000))","v":""},""]
[null,null,null,null,null,null,null,null,{"$f":"IF(A378=\"\",\"\",SUMIF(Dégusté_le!$B$2:$B$10000,\"=\" & A378,Dégusté_le!$C$2:$C$10000))","v":""},""]
[null,null,null,null,null,null,null,null,{"$f":"IF(A379=\"\",\"\",SUMIF(Dégusté_le!$B$2:$B$10000,\"=\" & A379,Dégusté_le!$C$2:$C$10000))","v":""},""]
[null,null,null,null,null,null,null,null,{"$f":"IF(A380=\"\",\"\",SUMIF(Dégusté_le!$B$2:$B$10000,\"=\" & A380,Dégusté_le!$C$2:$C$10000))","v":""},""]
[null,null,null,null,null,null,null,null,{"$f":"IF(A381=\"\",\"\",SUMIF(Dégusté_le!$B$2:$B$10000,\"=\" & A381,Dégusté_le!$C$2:$C$10000))","v":""},""]
[null,null,null,null,null,null,null,null,{"$f":"IF(A382=\"\",\"\",SUMIF(Dégusté_le!$B$2:$B$10000,\"=\" & A382,Dégusté_le!$C$2:$C$10000))","v":""},""]
[null,null,null,null,null,null,null,null,{"$f":"IF(A383=\"\",\"\",SUMIF(Dégusté_le!$B$2:$B$10000,\"=\" & A383,Dégusté_le!$C$2:$C$10000))","v":""},""]
[null,null,null,null,null,null,null,null,{"$f":"IF(A384=\"\",\"\",SUMIF(Dégusté_le!$B$2:$B$10000,\"=\" & A384,Dégusté_le!$C$2:$C$10000))","v":""},""]
[null,null,null,null,null,null,null,null,{"$f":"IF(A385=\"\",\"\",SUMIF(Dégusté_le!$B$2:$B$10000,\"=\" & A385,Dégusté_le!$C$2:$C$10000))","v":""},""]
[null,null,null,null,null,null,null,null,{"$f":"IF(A386=\"\",\"\",SUMIF(Dégusté_le!$B$2:$B$10000,\"=\" & A386,Dégusté_le!$C$2:$C$10000))","v":""},""]
[null,null,null,null,null,null,null,null,{"$f":"IF(A387=\"\",\"\",SUMIF(Dégusté_le!$B$2:$B$10000,\"=\" & A387,Dégusté_le!$C$2:$C$10000))","v":""},{"$f":"IF(A387>0,G387-I387,\"\")","v":""}]
[null,null,null,null,null,null,null,null,{"$f":"IF(A388=\"\",\"\",SUMIF(Dégusté_le!$B$2:$B$10000,\"=\" & A388,Dégusté_le!$C$2:$C$10000))","v":""},""]
[null,null,null,null,null,null,null,null,{"$f":"IF(A389=\"\",\"\",SUMIF(Dégusté_le!$B$2:$B$10000,\"=\" & A389,Dégusté_le!$C$2:$C$10000))","v":""},""]
[null,null,null,null,null,null,null,null,{"$f":"IF(A390=\"\",\"\",SUMIF(Dégusté_le!$B$2:$B$10000,\"=\" & A390,Dégusté_le!$C$2:$C$10000))","v":""},""]
[null,null,null,null,null,null,null,null,{"$f":"IF(A391=\"\",\"\",SUMIF(Dégusté_le!$B$2:$B$10000,\"=\" & A391,Dégusté_le!$C$2:$C$10000))","v":""},""]
[null,null,null,null,null,null,null,null,{"$f":"IF(A392=\"\",\"\",SUMIF(Dégusté_le!$B$2:$B$10000,\"=\" & A392,Dégusté_le!$C$2:$C$10000))","v":""},""]
[null,null,null,null,null,null,null,null,{"$f":"IF(A393=\"\",\"\",SUMIF(Dégusté_le!$B$2:$B$10000,\"=\" & A393,Dégusté_le!$C$2:$C$10000))","v":""},""]
[null,null,null,null,null,null,null,null,{"$f":"IF(A394=\"\",\"\",SUMIF(Dégusté_le!$B$2:$B$10000,\"=\" & A394,Dégusté_le!$C$2:$C$10000))","v":""},""]
[null,null,null,null,null,null,null,null,{"$f":"IF(A395=\"\",\"\",SUMIF(Dégusté_le!$B$2:$B$10000,\"=\" & A395,Dégusté_le!$C$2:$C$10000))","v":""},""]
[null,null,null,null,null,null,null,null,{"$f":"IF(A396=\"\",\"\",SUMIF(Dégusté_le!$B$2:$B$10000,\"=\" & A396,Dégusté_le!$C$2:$C$10000))","v":""},""]
[null,null,null,null,null,null,null,null,{"$f":"IF(A397=\"\",\"\",SUMIF(Dégusté_le!$B$2:$B$10000,\"=\" & A397,Dégusté_le!$C$2:$C$10000))","v":""},""]
[null,null,null,null,null,null,null,null,{"$f":"IF(A398=\"\",\"\",SUMIF(Dégusté_le!$B$2:$B$10000,\"=\" & A398,Dégusté_le!$C$2:$C$10000))","v":""},""]
[null,null,null,null,null,null,null,null,{"$f":"IF(A399=\"\",\"\",SUMIF(Dégusté_le!$B$2:$B$10000,\"=\" & A399,Dégusté_le!$C$2:$C$10000))","v":""},""]
[null,null,null,null,null,null,null,null,{"$f":"IF(A400=\"\",\"\",SUMIF(Dégusté_le!$B$2:$B$10000,\"=\" & A400,Dégusté_le!$C$2:$C$10000))","v":""},""]
[null,null,null,null,null,null,null,null,{"$f":"IF(A401=\"\",\"\",SUMIF(Dégusté_le!$B$2:$B$10000,\"=\" & A401,Dégusté_le!$C$2:$C$10000))","v":""},""]
[null,null,null,null,null,null,null,null,{"$f":"IF(A402=\"\",\"\",SUMIF(Dégusté_le!$B$2:$B$10000,\"=\" & A402,Dégusté_le!$C$2:$C$10000))","v":""},""]
[null,null,null,null,null,null,null,null,{"$f":"IF(A403=\"\",\"\",SUMIF(Dégusté_le!$B$2:$B$10000,\"=\" & A403,Dégusté_le!$C$2:$C$10000))","v":""},""]
[null,null,null,null,null,null,null,null,{"$f":"IF(A404=\"\",\"\",SUMIF(Dégusté_le!$B$2:$B$10000,\"=\" & A404,Dégusté_le!$C$2:$C$10000))","v":""},""]
[null,null,null,null,null,null,null,null,{"$f":"IF(A405=\"\",\"\",SUMIF(Dégusté_le!$B$2:$B$10000,\"=\" & A405,Dégusté_le!$C$2:$C$10000))","v":""},""]
[null,null,null,null,null,null,null,null,{"$f":"IF(A406=\"\",\"\",SUMIF(Dégusté_le!$B$2:$B$10000,\"=\" & A406,Dégusté_le!$C$2:$C$10000))","v":""},""]
[null,null,null,null,null,null,null,null,{"$f":"IF(A407=\"\",\"\",SUMIF(Dégusté_le!$B$2:$B$10000,\"=\" & A407,Dégusté_le!$C$2:$C$10000))","v":""},""]
[null,null,null,null,null,null,null,null,{"$f":"IF(A408=\"\",\"\",SUMIF(Dégusté_le!$B$2:$B$10000,\"=\" & A408,Dégusté_le!$C$2:$C$10000))","v":""},""]
[null,null,null,null,null,null,null,null,{"$f":"IF(A409=\"\",\"\",SUMIF(Dégusté_le!$B$2:$B$10000,\"=\" & A409,Dégusté_le!$C$2:$C$10000))","v":""},""]
[null,null,null,null,null,null,null,null,{"$f":"IF(A410=\"\",\"\",SUMIF(Dégusté_le!$B$2:$B$10000,\"=\" & A410,Dégusté_le!$C$2:$C$10000))","v":""},""]
[null,null,null,null,null,null,null,null,{"$f":"IF(A411=\"\",\"\",SUMIF(Dégusté_le!$B$2:$B$10000,\"=\" & A411,Dégusté_le!$C$2:$C$10000))","v":""},""]
[null,null,null,null,null,null,null,null,{"$f":"IF(A412=\"\",\"\",SUMIF(Dégusté_le!$B$2:$B$10000,\"=\" & A412,Dégusté_le!$C$2:$C$10000))","v":""},""]
[null,null,null,null,null,null,null,null,{"$f":"IF(A413=\"\",\"\",SUMIF(Dégusté_le!$B$2:$B$10000,\"=\" & A413,Dégusté_le!$C$2:$C$10000))","v":""},""]
[null,null,null,null,null,null,null,null,{"$f":"IF(A414=\"\",\"\",SUMIF(Dégusté_le!$B$2:$B$10000,\"=\" & A414,Dégusté_le!$C$2:$C$10000))","v":""},""]
[null,null,null,null,null,null,null,null,{"$f":"IF(A415=\"\",\"\",SUMIF(Dégusté_le!$B$2:$B$10000,\"=\" & A415,Dégusté_le!$C$2:$C$10000))","v":""},""]
[null,null,null,null,null,null,null,null,{"$f":"IF(A416=\"\",\"\",SUMIF(Dégusté_le!$B$2:$B$10000,\"=\" & A416,Dégusté_le!$C$2:$C$10000))","v":""},""]
[null,null,null,null,null,null,null,null,{"$f":"IF(A417=\"\",\"\",SUMIF(Dégusté_le!$B$2:$B$10000,\"=\" & A417,Dégusté_le!$C$2:$C$10000))","v":""},""]
[null,null,null,null,null,null,null,null,{"$f":"IF(A418=\"\",\"\",SUMIF(Dégusté_le!$B$2:$B$10000,\"=\" & A418,Dégusté_le!$C$2:$C$10000))","v":""},""]
[null,null,null,null,null,null,null,null,{"$f":"IF(A419=\"\",\"\",SUMIF(Dégusté_le!$B$2:$B$10000,\"=\" & A419,Dégusté_le!$C$2:$C$10000))","v":""},""]
[null,null,null,null,null,null,null,null,{"$f":"IF(A420=\"\",\"\",SUMIF(Dégusté_le!$B$2:$B$10000,\"=\" & A420,Dégusté_le!$C$2:$C$10000))","v":""},""]
[null,null,null,null,null,null,null,null,{"$f":"IF(A421=\"\",\"\",SUMIF(Dégusté_le!$B$2:$B$10000,\"=\" & A421,Dégusté_le!$C$2:$C$10000))","v":""},""]
[null,null,null,null,null,null,null,null,{"$f":"IF(A422=\"\",\"\",SUMIF(Dégusté_le!$B$2:$B$10000,\"=\" & A422,Dégusté_le!$C$2:$C$10000))","v":""},""]
[null,null,null,null,null,null,null,null,{"$f":"IF(A423=\"\",\"\",SUMIF(Dégusté_le!$B$2:$B$10000,\"=\" & A423,Dégusté_le!$C$2:$C$10000))","v":""},""]
[null,null,null,null,null,null,null,null,{"$f":"IF(A424=\"\",\"\",SUMIF(Dégusté_le!$B$2:$B$10000,\"=\" & A424,Dégusté_le!$C$2:$C$10000))","v":""},""]
[null,null,null,null,null,null,null,null,{"$f":"IF(A425=\"\",\"\",SUMIF(Dégusté_le!$B$2:$B$10000,\"=\" & A425,Dégusté_le!$C$2:$C$10000))","v":""},""]
[null,null,null,null,null,null,null,null,{"$f":"IF(A426=\"\",\"\",SUMIF(Dégusté_le!$B$2:$B$10000,\"=\" & A426,Dégusté_le!$C$2:$C$10000))","v":""},""]
[null,null,null,null,null,null,null,null,{"$f":"IF(A427=\"\",\"\",SUMIF(Dégusté_le!$B$2:$B$10000,\"=\" & A427,Dégusté_le!$C$2:$C$10000))","v":""},""]
[null,null,null,null,null,null,null,null,{"$f":"IF(A428=\"\",\"\",SUMIF(Dégusté_le!$B$2:$B$10000,\"=\" & A428,Dégusté_le!$C$2:$C$10000))","v":""},""]
[null,null,null,null,null,null,null,null,{"$f":"IF(A429=\"\",\"\",SUMIF(Dégusté_le!$B$2:$B$10000,\"=\" & A429,Dégusté_le!$C$2:$C$10000))","v":""},""]
[null,null,null,null,null,null,null,null,{"$f":"IF(A430=\"\",\"\",SUMIF(Dégusté_le!$B$2:$B$10000,\"=\" & A430,Dégusté_le!$C$2:$C$10000))","v":""},""]
[null,null,null,null,null,null,null,null,{"$f":"IF(A431=\"\",\"\",SUMIF(Dégusté_le!$B$2:$B$10000,\"=\" & A431,Dégusté_le!$C$2:$C$10000))","v":""},""]
[null,null,null,null,null,null,null,null,{"$f":"IF(A432=\"\",\"\",SUMIF(Dégusté_le!$B$2:$B$10000,\"=\" & A432,Dégusté_le!$C$2:$C$10000))","v":""},""]
[null,null,null,null,null,null,null,null,{"$f":"IF(A433=\"\",\"\",SUMIF(Dégusté_le!$B$2:$B$10000,\"=\" & A433,Dégusté_le!$C$2:$C$10000))","v":""},""]
[null,null,null,null,null,null,null,null,{"$f":"IF(A434=\"\",\"\",SUMIF(Dégusté_le!$B$2:$B$10000,\"=\" & A434,Dégusté_le!$C$2:$C$10000))","v":""},""]
[null,null,null,null,null,null,null,null,{"$f":"IF(A435=\"\",\"\",SUMIF(Dégusté_le!$B$2:$B$10000,\"=\" & A435,Dégusté_le!$C$2:$C$10000))","v":""},""]
[null,null,null,null,null,null,null,null,{"$f":"IF(A436=\"\",\"\",SUMIF(Dégusté_le!$B$2:$B$10000,\"=\" & A436,Dégusté_le!$C$2:$C$10000))","v":""},""]
[null,null,null,null,null,null,null,null,{"$f":"IF(A437=\"\",\"\",SUMIF(Dégusté_le!$B$2:$B$10000,\"=\" & A437,Dégusté_le!$C$2:$C$10000))","v":""},""]
[null,null,null,null,null,null,null,null,{"$f":"IF(A438=\"\",\"\",SUMIF(Dégusté_le!$B$2:$B$10000,\"=\" & A438,Dégusté_le!$C$2:$C$10000))","v":""},""]
[null,null,null,null,null,null,null,null,{"$f":"IF(A439=\"\",\"\",SUMIF(Dégusté_le!$B$2:$B$10000,\"=\" & A439,Dégusté_le!$C$2:$C$10000))","v":""},""]
[null,null,null,null,null,null,null,null,{"$f":"IF(A440=\"\",\"\",SUMIF(Dégusté_le!$B$2:$B$10000,\"=\" & A440,Dégusté_le!$C$2:$C$10000))","v":""},""]
[null,null,null,null,null,null,null,null,{"$f":"IF(A441=\"\",\"\",SUMIF(Dégusté_le!$B$2:$B$10000,\"=\" & A441,Dégusté_le!$C$2:$C$10000))","v":""},""]
[null,null,null,null,null,null,null,null,{"$f":"IF(A442=\"\",\"\",SUMIF(Dégusté_le!$B$2:$B$10000,\"=\" & A442,Dégusté_le!$C$2:$C$10000))","v":""},""]
[null,null,null,null,null,null,null,null,{"$f":"IF(A443=\"\",\"\",SUMIF(Dégusté_le!$B$2:$B$10000,\"=\" & A443,Dégusté_le!$C$2:$C$10000))","v":""},""]
[null,null,null,null,null,null,null,null,{"$f":"IF(A444=\"\",\"\",SUMIF(Dégusté_le!$B$2:$B$10000,\"=\" & A444,Dégusté_le!$C$2:$C$10000))","v":""},""]
[null,null,null,null,null,null,null,null,{"$f":"IF(A445=\"\",\"\",SUMIF(Dégusté_le!$B$2:$B$10000,\"=\" & A445,Dégusté_le!$C$2:$C$10000))","v":""},""]
[null,null,null,null,null,null,null,null,{"$f":"IF(A446=\"\",\"\",SUMIF(Dégusté_le!$B$2:$B$10000,\"=\" & A446,Dégusté_le!$C$2:$C$10000))","v":""},""]
[null,null,null,null,null,null,null,null,{"$f":"IF(A447=\"\",\"\",SUMIF(Dégusté_le!$B$2:$B$10000,\"=\" & A447,Dégusté_le!$C$2:$C$10000))","v":""},""]
[null,null,null,null,null,null,null,null,{"$f":"IF(A448=\"\",\"\",SUMIF(Dégusté_le!$B$2:$B$10000,\"=\" & A448,Dégusté_le!$C$2:$C$10000))","v":""},""]
[null,null,null,null,null,null,null,null,{"$f":"IF(A449=\"\",\"\",SUMIF(Dégusté_le!$B$2:$B$10000,\"=\" & A449,Dégusté_le!$C$2:$C$10000))","v":""},""]
[null,null,null,null,null,null,null,null,{"$f":"IF(A450=\"\",\"\",SUMIF(Dégusté_le!$B$2:$B$10000,\"=\" & A450,Dégusté_le!$C$2:$C$10000))","v":""},""]
[null,null,null,null,null,null,null,null,{"$f":"IF(A451=\"\",\"\",SUMIF(Dégusté_le!$B$2:$B$10000,\"=\" & A451,Dégusté_le!$C$2:$C$10000))","v":""},{"$f":"IF(A451>0,G451-I451,\"\")","v":""}]
[null,null,null,null,null,null,null,null,{"$f":"IF(A452=\"\",\"\",SUMIF(Dégusté_le!$B$2:$B$10000,\"=\" & A452,Dégusté_le!$C$2:$C$10000))","v":""},""]
[null,null,null,null,null,null,null,null,{"$f":"IF(A453=\"\",\"\",SUMIF(Dégusté_le!$B$2:$B$10000,\"=\" & A453,Dégusté_le!$C$2:$C$10000))","v":""},""]
[null,null,null,null,null,null,null,null,{"$f":"IF(A454=\"\",\"\",SUMIF(Dégusté_le!$B$2:$B$10000,\"=\" & A454,Dégusté_le!$C$2:$C$10000))","v":""},""]
[null,null,null,null,null,null,null,null,{"$f":"IF(A455=\"\",\"\",SUMIF(Dégusté_le!$B$2:$B$10000,\"=\" & A455,Dégusté_le!$C$2:$C$10000))","v":""},""]
[null,null,null,null,null,null,null,null,{"$f":"IF(A456=\"\",\"\",SUMIF(Dégusté_le!$B$2:$B$10000,\"=\" & A456,Dégusté_le!$C$2:$C$10000))","v":""},""]
[null,null,null,null,null,null,null,null,{"$f":"IF(A457=\"\",\"\",SUMIF(Dégusté_le!$B$2:$B$10000,\"=\" & A457,Dégusté_le!$C$2:$C$10000))","v":""},""]
[null,null,null,null,null,null,null,null,{"$f":"IF(A458=\"\",\"\",SUMIF(Dégusté_le!$B$2:$B$10000,\"=\" & A458,Dégusté_le!$C$2:$C$10000))","v":""},""]
[null,null,null,null,null,null,null,null,{"$f":"IF(A459=\"\",\"\",SUMIF(Dégusté_le!$B$2:$B$10000,\"=\" & A459,Dégusté_le!$C$2:$C$10000))","v":""},""]
[null,null,null,null,null,null,null,null,{"$f":"IF(A460=\"\",\"\",SUMIF(Dégusté_le!$B$2:$B$10000,\"=\" & A460,Dégusté_le!$C$2:$C$10000))","v":""},""]
[null,null,null,null,null,null,null,null,{"$f":"IF(A461=\"\",\"\",SUMIF(Dégusté_le!$B$2:$B$10000,\"=\" & A461,Dégusté_le!$C$2:$C$10000))","v":""},""]
[null,null,null,null,null,null,null,null,{"$f":"IF(A462=\"\",\"\",SUMIF(Dégusté_le!$B$2:$B$10000,\"=\" & A462,Dégusté_le!$C$2:$C$10000))","v":""},""]
[null,null,null,null,null,null,null,null,{"$f":"IF(A463=\"\",\"\",SUMIF(Dégusté_le!$B$2:$B$10000,\"=\" & A463,Dégusté_le!$C$2:$C$10000))","v":""},""]
[null,null,null,null,null,null,null,null,{"$f":"IF(A464=\"\",\"\",SUMIF(Dégusté_le!$B$2:$B$10000,\"=\" & A464,Dégusté_le!$C$2:$C$10000))","v":""},""]
[null,null,null,null,null,null,null,null,{"$f":"IF(A465=\"\",\"\",SUMIF(Dégusté_le!$B$2:$B$10000,\"=\" & A465,Dégusté_le!$C$2:$C$10000))","v":""},""]
[null,null,null,null,null,null,null,null,{"$f":"IF(A466=\"\",\"\",SUMIF(Dégusté_le!$B$2:$B$10000,\"=\" & A466,Dégusté_le!$C$2:$C$10000))","v":""},""]
[null,null,null,null,null,null,null,null,{"$f":"IF(A467=\"\",\"\",SUMIF(Dégusté_le!$B$2:$B$10000,\"=\" & A467,Dégusté_le!$C$2:$C$10000))","v":""},""]
[null,null,null,null,null,null,null,null,{"$f":"IF(A468=\"\",\"\",SUMIF(Dégusté_le!$B$2:$B$10000,\"=\" & A468,Dégusté_le!$C$2:$C$10000))","v":""},""]
[null,null,null,null,null,null,null,null,{"$f":"IF(A469=\"\",\"\",SUMIF(Dégusté_le!$B$2:$B$10000,\"=\" & A469,Dégusté_le!$C$2:$C$10000))","v":""},""]
[null,null,null,null,null,null,null,null,{"$f":"IF(A470=\"\",\"\",SUMIF(Dégusté_le!$B$2:$B$10000,\"=\" & A470,Dégusté_le!$C$2:$C$10000))","v":""},""]
[null,null,null,null,null,null,null,null,{"$f":"IF(A471=\"\",\"\",SUMIF(Dégusté_le!$B$2:$B$10000,\"=\" & A471,Dégusté_le!$C$2:$C$10000))","v":""},""]
[null,null,null,null,null,null,null,null,{"$f":"IF(A472=\"\",\"\",SUMIF(Dégusté_le!$B$2:$B$10000,\"=\" & A472,Dégusté_le!$C$2:$C$10000))","v":""},""]
[null,null,null,null,null,null,null,null,{"$f":"IF(A473=\"\",\"\",SUMIF(Dégusté_le!$B$2:$B$10000,\"=\" & A473,Dégusté_le!$C$2:$C$10000))","v":""},""]
[null,null,null,null,null,null,null,null,{"$f":"IF(A474=\"\",\"\",SUMIF(Dégusté_le!$B$2:$B$10000,\"=\" & A474,Dégusté_le!$C$2:$C$10000))","v":""},""]
[null,null,null,null,null,null,null,null,{"$f":"IF(A475=\"\",\"\",SUMIF(Dégusté_le!$B$2:$B$10000,\"=\" & A475,Dégusté_le!$C$2:$C$10000))","v":""},""]
[null,null,null,null,null,null,null,null,{"$f":"IF(A476=\"\",\"\",SUMIF(Dégusté_le!$B$2:$B$10000,\"=\" & A476,Dégusté_le!$C$2:$C$10000))","v":""},""]
[null,null,null,null,null,null,null,null,{"$f":"IF(A477=\"\",\"\",SUMIF(Dégusté_le!$B$2:$B$10000,\"=\" & A477,Dégusté_le!$C$2:$C$10000))","v":""},""]
[null,null,null,null,null,null,null,null,{"$f":"IF(A478=\"\",\"\",SUMIF(Dégusté_le!$B$2:$B$10000,\"=\" & A478,Dégusté_le!$C$2:$C$10000))","v":""},""]
[null,null,null,null,null,null,null,null,{"$f":"IF(A479=\"\",\"\",SUMIF(Dégusté_le!$B$2:$B$10000,\"=\" & A479,Dégusté_le!$C$2:$C$10000))","v":""},""]
[null,null,null,null,null,null,null,null,{"$f":"IF(A480=\"\",\"\",SUMIF(Dégusté_le!$B$2:$B$10000,\"=\" & A480,Dégusté_le!$C$2:$C$10000))","v":""},""]
[null,null,null,null,null,null,null,null,{"$f":"IF(A481=\"\",\"\",SUMIF(Dégusté_le!$B$2:$B$10000,\"=\" & A481,Dégusté_le!$C$2:$C$10000))","v":""},""]
[null,null,null,null,null,null,null,null,{"$f":"IF(A482=\"\",\"\",SUMIF(Dégusté_le!$B$2:$B$10000,\"=\" & A482,Dégusté_le!$C$2:$C$10000))","v":""},""]
[null,null,null,null,null,null,null,null,{"$f":"IF(A483=\"\",\"\",SUMIF(Dégusté_le!$B$2:$B$10000,\"=\" & A483,Dégusté_le!$C$2:$C$10000))","v":""},""]
[null,null,null,null,null,null,null,null,{"$f":"IF(A484=\"\",\"\",SUMIF(Dégusté_le!$B$2:$B$10000,\"=\" & A484,Dégusté_le!$C$2:$C$10000))","v":""},""]
[null,null,null,null,null,null,null,null,{"$f":"IF(A485=\"\",\"\",SUMIF(Dégusté_le!$B$2:$B$10000,\"=\" & A485,Dégusté_le!$C$2:$C$10000))","v":""},""]
[null,null,null,null,null,null,null,null,{"$f":"IF(A486=\"\",\"\",SUMIF(Dégusté_le!$B$2:$B$10000,\"=\" & A486,Dégusté_le!$C$2:$C$10000))","v":""},""]
[null,null,null,null,null,null,null,null,{"$f":"IF(A487=\"\",\"\",SUMIF(Dégusté_le!$B$2:$B$10000,\"=\" & A487,Dégusté_le!$C$2:$C$10000))","v":""},""]
[null,null,null,null,null,null,null,null,{"$f":"IF(A488=\"\",\"\",SUMIF(Dégusté_le!$B$2:$B$10000,\"=\" & A488,Dégusté_le!$C$2:$C$10000))","v":""},""]
[null,null,null,null,null,null,null,null,{"$f":"IF(A489=\"\",\"\",SUMIF(Dégusté_le!$B$2:$B$10000,\"=\" & A489,Dégusté_le!$C$2:$C$10000))","v":""},""]
[null,null,null,null,null,null,null,null,{"$f":"IF(A490=\"\",\"\",SUMIF(Dégusté_le!$B$2:$B$10000,\"=\" & A490,Dégusté_le!$C$2:$C$10000))","v":""},""]
[null,null,null,null,null,null,null,null,{"$f":"IF(A491=\"\",\"\",SUMIF(Dégusté_le!$B$2:$B$10000,\"=\" & A491,Dégusté_le!$C$2:$C$10000))","v":""},""]
[null,null,null,null,null,null,null,null,{"$f":"IF(A492=\"\",\"\",SUMIF(Dégusté_le!$B$2:$B$10000,\"=\" & A492,Dégusté_le!$C$2:$C$10000))","v":""},""]
[null,null,null,null,null,null,null,null,{"$f":"IF(A493=\"\",\"\",SUMIF(Dégusté_le!$B$2:$B$10000,\"=\" & A493,Dégusté_le!$C$2:$C$10000))","v":""},""]
[null,null,null,null,null,null,null,null,{"$f":"IF(A494=\"\",\"\",SUMIF(Dégusté_le!$B$2:$B$10000,\"=\" & A494,Dégusté_le!$C$2:$C$10000))","v":""},""]
[null,null,null,null,null,null,null,null,{"$f":"IF(A495=\"\",\"\",SUMIF(Dégusté_le!$B$2:$B$10000,\"=\" & A495,Dégusté_le!$C$2:$C$10000))","v":""},""]
[null,null,null,null,null,null,null,null,{"$f":"IF(A496=\"\",\"\",SUMIF(Dégusté_le!$B$2:$B$10000,\"=\" & A496,Dégusté_le!$C$2:$C$10000))","v":""},""]
[null,null,null,null,null,null,null,null,{"$f":"IF(A497=\"\",\"\",SUMIF(Dégusté_le!$B$2:$B$10000,\"=\" & A497,Dégusté_le!$C$2:$C$10000))","v":""},""]
[null,null,null,null,null,null,null,null,{"$f":"IF(A498=\"\",\"\",SUMIF(Dégusté_le!$B$2:$B$10000,\"=\" & A498,Dégusté_le!$C$2:$C$10000))","v":""},""]
[null,null,null,null,null,null,null,null,{"$f":"IF(A499=\"\",\"\",SUMIF(Dégusté_le!$B$2:$B$10000,\"=\" & A499,Dégusté_le!$C$2:$C$10000))","v":""},""]
[null,null,null,null,null,null,null,null,{"$f":"IF(A500=\"\",\"\",SUMIF(Dégusté_le!$B$2:$B$10000,\"=\" & A500,Dégusté_le!$C$2:$C$10000))","v":""},""]
[null,null,null,null,null,null,null,null,{"$f":"IF(A501=\"\",\"\",SUMIF(Dégusté_le!$B$2:$B$10000,\"=\" & A501,Dégusté_le!$C$2:$C$10000))","v":""},""]
[null,null,null,null,null,null,null,null,{"$f":"IF(A502=\"\",\"\",SUMIF(Dégusté_le!$B$2:$B$10000,\"=\" & A502,Dégusté_le!$C$2:$C$10000))","v":""},""]
[null,null,null,null,null,null,null,null,{"$f":"IF(A503=\"\",\"\",SUMIF(Dégusté_le!$B$2:$B$10000,\"=\" & A503,Dégusté_le!$C$2:$C$10000))","v":""},""]
[null,null,null,null,null,null,null,null,{"$f":"IF(A504=\"\",\"\",SUMIF(Dégusté_le!$B$2:$B$10000,\"=\" & A504,Dégusté_le!$C$2:$C$10000))","v":""},""]
[null,null,null,null,null,null,null,null,{"$f":"IF(A505=\"\",\"\",SUMIF(Dégusté_le!$B$2:$B$10000,\"=\" & A505,Dégusté_le!$C$2:$C$10000))","v":""},""]
[null,null,null,null,null,null,null,null,{"$f":"IF(A506=\"\",\"\",SUMIF(Dégusté_le!$B$2:$B$10000,\"=\" & A506,Dégusté_le!$C$2:$C$10000))","v":""},""]
[null,null,null,null,null,null,null,null,{"$f":"IF(A507=\"\",\"\",SUMIF(Dégusté_le!$B$2:$B$10000,\"=\" & A507,Dégusté_le!$C$2:$C$10000))","v":""},""]
[null,null,null,null,null,null,null,null,{"$f":"IF(A508=\"\",\"\",SUMIF(Dégusté_le!$B$2:$B$10000,\"=\" & A508,Dégusté_le!$C$2:$C$10000))","v":""},""]
[null,null,null,null,null,null,null,null,{"$f":"IF(A509=\"\",\"\",SUMIF(Dégusté_le!$B$2:$B$10000,\"=\" & A509,Dégusté_le!$C$2:$C$10000))","v":""},""]
[null,null,null,null,null,null,null,null,{"$f":"IF(A510=\"\",\"\",SUMIF(Dégusté_le!$B$2:$B$10000,\"=\" & A510,Dégusté_le!$C$2:$C$10000))","v":""},""]
[null,null,null,null,null,null,null,null,{"$f":"IF(A511=\"\",\"\",SUMIF(Dégusté_le!$B$2:$B$10000,\"=\" & A511,Dégusté_le!$C$2:$C$10000))","v":""},""]
[null,null,null,null,null,null,null,null,{"$f":"IF(A512=\"\",\"\",SUMIF(Dégusté_le!$B$2:$B$10000,\"=\" & A512,Dégusté_le!$C$2:$C$10000))","v":""},""]
[null,null,null,null,null,null,null,null,{"$f":"IF(A513=\"\",\"\",SUMIF(Dégusté_le!$B$2:$B$10000,\"=\" & A513,Dégusté_le!$C$2:$C$10000))","v":""},""]
[null,null,null,null,null,null,null,null,{"$f":"IF(A514=\"\",\"\",SUMIF(Dégusté_le!$B$2:$B$10000,\"=\" & A514,Dégusté_le!$C$2:$C$10000))","v":""},""]
[null,null,null,null,null,null,null,null,{"$f":"IF(A515=\"\",\"\",SUMIF(Dégusté_le!$B$2:$B$10000,\"=\" & A515,Dégusté_le!$C$2:$C$10000))","v":""},{"$f":"IF(A515>0,G515-I515,\"\")","v":""}]
[null,null,null,null,null,null,null,null,{"$f":"IF(A516=\"\",\"\",SUMIF(Dégusté_le!$B$2:$B$10000,\"=\" & A516,Dégusté_le!$C$2:$C$10000))","v":""},""]
[null,null,null,null,null,null,null,null,{"$f":"IF(A517=\"\",\"\",SUMIF(Dégusté_le!$B$2:$B$10000,\"=\" & A517,Dégusté_le!$C$2:$C$10000))","v":""},""]
[null,null,null,null,null,null,null,null,{"$f":"IF(A518=\"\",\"\",SUMIF(Dégusté_le!$B$2:$B$10000,\"=\" & A518,Dégusté_le!$C$2:$C$10000))","v":""},""]
[null,null,null,null,null,null,null,null,{"$f":"IF(A519=\"\",\"\",SUMIF(Dégusté_le!$B$2:$B$10000,\"=\" & A519,Dégusté_le!$C$2:$C$10000))","v":""},""]
[null,null,null,null,null,null,null,null,{"$f":"IF(A520=\"\",\"\",SUMIF(Dégusté_le!$B$2:$B$10000,\"=\" & A520,Dégusté_le!$C$2:$C$10000))","v":""},""]
[null,null,null,null,null,null,null,null,{"$f":"IF(A521=\"\",\"\",SUMIF(Dégusté_le!$B$2:$B$10000,\"=\" & A521,Dégusté_le!$C$2:$C$10000))","v":""},""]
[null,null,null,null,null,null,null,null,{"$f":"IF(A522=\"\",\"\",SUMIF(Dégusté_le!$B$2:$B$10000,\"=\" & A522,Dégusté_le!$C$2:$C$10000))","v":""},""]
[null,null,null,null,null,null,null,null,{"$f":"IF(A523=\"\",\"\",SUMIF(Dégusté_le!$B$2:$B$10000,\"=\" & A523,Dégusté_le!$C$2:$C$10000))","v":""},""]
[null,null,null,null,null,null,null,null,{"$f":"IF(A524=\"\",\"\",SUMIF(Dégusté_le!$B$2:$B$10000,\"=\" & A524,Dégusté_le!$C$2:$C$10000))","v":""},""]
[null,null,null,null,null,null,null,null,{"$f":"IF(A525=\"\",\"\",SUMIF(Dégusté_le!$B$2:$B$10000,\"=\" & A525,Dégusté_le!$C$2:$C$10000))","v":""},""]
[null,null,null,null,null,null,null,null,{"$f":"IF(A526=\"\",\"\",SUMIF(Dégusté_le!$B$2:$B$10000,\"=\" & A526,Dégusté_le!$C$2:$C$10000))","v":""},""]
[null,null,null,null,null,null,null,null,{"$f":"IF(A527=\"\",\"\",SUMIF(Dégusté_le!$B$2:$B$10000,\"=\" & A527,Dégusté_le!$C$2:$C$10000))","v":""},""]
[null,null,null,null,null,null,null,null,{"$f":"IF(A528=\"\",\"\",SUMIF(Dégusté_le!$B$2:$B$10000,\"=\" & A528,Dégusté_le!$C$2:$C$10000))","v":""},""]
[null,null,null,null,null,null,null,null,{"$f":"IF(A529=\"\",\"\",SUMIF(Dégusté_le!$B$2:$B$10000,\"=\" & A529,Dégusté_le!$C$2:$C$10000))","v":""},""]
[null,null,null,null,null,null,null,null,{"$f":"IF(A530=\"\",\"\",SUMIF(Dégusté_le!$B$2:$B$10000,\"=\" & A530,Dégusté_le!$C$2:$C$10000))","v":""},""]
[null,null,null,null,null,null,null,null,{"$f":"IF(A531=\"\",\"\",SUMIF(Dégusté_le!$B$2:$B$10000,\"=\" & A531,Dégusté_le!$C$2:$C$10000))","v":""},""]
[null,null,null,null,null,null,null,null,{"$f":"IF(A532=\"\",\"\",SUMIF(Dégusté_le!$B$2:$B$10000,\"=\" & A532,Dégusté_le!$C$2:$C$10000))","v":""},""]
[null,null,null,null,null,null,null,null,{"$f":"IF(A533=\"\",\"\",SUMIF(Dégusté_le!$B$2:$B$10000,\"=\" & A533,Dégusté_le!$C$2:$C$10000))","v":""},""]
[null,null,null,null,null,null,null,null,{"$f":"IF(A534=\"\",\"\",SUMIF(Dégusté_le!$B$2:$B$10000,\"=\" & A534,Dégusté_le!$C$2:$C$10000))","v":""},""]
[null,null,null,null,null,null,null,null,{"$f":"IF(A535=\"\",\"\",SUMIF(Dégusté_le!$B$2:$B$10000,\"=\" & A535,Dégusté_le!$C$2:$C$10000))","v":""},""]
[null,null,null,null,null,null,null,null,{"$f":"IF(A536=\"\",\"\",SUMIF(Dégusté_le!$B$2:$B$10000,\"=\" & A536,Dégusté_le!$C$2:$C$10000))","v":""},""]
[null,null,null,null,null,null,null,null,{"$f":"IF(A537=\"\",\"\",SUMIF(Dégusté_le!$B$2:$B$10000,\"=\" & A537,Dégusté_le!$C$2:$C$10000))","v":""},""]
[null,null,null,null,null,null,null,null,{"$f":"IF(A538=\"\",\"\",SUMIF(Dégusté_le!$B$2:$B$10000,\"=\" & A538,Dégusté_le!$C$2:$C$10000))","v":""},""]
[null,null,null,null,null,null,null,null,{"$f":"IF(A539=\"\",\"\",SUMIF(Dégusté_le!$B$2:$B$10000,\"=\" & A539,Dégusté_le!$C$2:$C$10000))","v":""},""]
[null,null,null,null,null,null,null,null,{"$f":"IF(A540=\"\",\"\",SUMIF(Dégusté_le!$B$2:$B$10000,\"=\" & A540,Dégusté_le!$C$2:$C$10000))","v":""},""]
[null,null,null,null,null,null,null,null,{"$f":"IF(A541=\"\",\"\",SUMIF(Dégusté_le!$B$2:$B$10000,\"=\" & A541,Dégusté_le!$C$2:$C$10000))","v":""},""]
[null,null,null,null,null,null,null,null,{"$f":"IF(A542=\"\",\"\",SUMIF(Dégusté_le!$B$2:$B$10000,\"=\" & A542,Dégusté_le!$C$2:$C$10000))","v":""},""]
[null,null,null,null,null,null,null,null,{"$f":"IF(A543=\"\",\"\",SUMIF(Dégusté_le!$B$2:$B$10000,\"=\" & A543,Dégusté_le!$C$2:$C$10000))","v":""},""]
[null,null,null,null,null,null,null,null,{"$f":"IF(A544=\"\",\"\",SUMIF(Dégusté_le!$B$2:$B$10000,\"=\" & A544,Dégusté_le!$C$2:$C$10000))","v":""},""]
[null,null,null,null,null,null,null,null,{"$f":"IF(A545=\"\",\"\",SUMIF(Dégusté_le!$B$2:$B$10000,\"=\" & A545,Dégusté_le!$C$2:$C$10000))","v":""},""]
[null,null,null,null,null,null,null,null,{"$f":"IF(A546=\"\",\"\",SUMIF(Dégusté_le!$B$2:$B$10000,\"=\" & A546,Dégusté_le!$C$2:$C$10000))","v":""},""]
[null,null,null,null,null,null,null,null,{"$f":"IF(A547=\"\",\"\",SUMIF(Dégusté_le!$B$2:$B$10000,\"=\" & A547,Dégusté_le!$C$2:$C$10000))","v":""},""]
[null,null,null,null,null,null,null,null,{"$f":"IF(A548=\"\",\"\",SUMIF(Dégusté_le!$B$2:$B$10000,\"=\" & A548,Dégusté_le!$C$2:$C$10000))","v":""},""]
[null,null,null,null,null,null,null,null,{"$f":"IF(A549=\"\",\"\",SUMIF(Dégusté_le!$B$2:$B$10000,\"=\" & A549,Dégusté_le!$C$2:$C$10000))","v":""},""]
[null,null,null,null,null,null,null,null,{"$f":"IF(A550=\"\",\"\",SUMIF(Dégusté_le!$B$2:$B$10000,\"=\" & A550,Dégusté_le!$C$2:$C$10000))","v":""},""]
[null,null,null,null,null,null,null,null,{"$f":"IF(A551=\"\",\"\",SUMIF(Dégusté_le!$B$2:$B$10000,\"=\" & A551,Dégusté_le!$C$2:$C$10000))","v":""},""]
[null,null,null,null,null,null,null,null,{"$f":"IF(A552=\"\",\"\",SUMIF(Dégusté_le!$B$2:$B$10000,\"=\" & A552,Dégusté_le!$C$2:$C$10000))","v":""},""]
[null,null,null,null,null,null,null,null,{"$f":"IF(A553=\"\",\"\",SUMIF(Dégusté_le!$B$2:$B$10000,\"=\" & A553,Dégusté_le!$C$2:$C$10000))","v":""},""]
[null,null,null,null,null,null,null,null,{"$f":"IF(A554=\"\",\"\",SUMIF(Dégusté_le!$B$2:$B$10000,\"=\" & A554,Dégusté_le!$C$2:$C$10000))","v":""},""]
[null,null,null,null,null,null,null,null,{"$f":"IF(A555=\"\",\"\",SUMIF(Dégusté_le!$B$2:$B$10000,\"=\" & A555,Dégusté_le!$C$2:$C$10000))","v":""},""]
[null,null,null,null,null,null,null,null,{"$f":"IF(A556=\"\",\"\",SUMIF(Dégusté_le!$B$2:$B$10000,\"=\" & A556,Dégusté_le!$C$2:$C$10000))","v":""},""]
[null,null,null,null,null,null,null,null,{"$f":"IF(A557=\"\",\"\",SUMIF(Dégusté_le!$B$2:$B$10000,\"=\" & A557,Dégusté_le!$C$2:$C$10000))","v":""},""]
[null,null,null,null,null,null,null,null,{"$f":"IF(A558=\"\",\"\",SUMIF(Dégusté_le!$B$2:$B$10000,\"=\" & A558,Dégusté_le!$C$2:$C$10000))","v":""},""]
[null,null,null,null,null,null,null,null,{"$f":"IF(A559=\"\",\"\",SUMIF(Dégusté_le!$B$2:$B$10000,\"=\" & A559,Dégusté_le!$C$2:$C$10000))","v":""},""]
[null,null,null,null,null,null,null,null,{"$f":"IF(A560=\"\",\"\",SUMIF(Dégusté_le!$B$2:$B$10000,\"=\" & A560,Dégusté_le!$C$2:$C$10000))","v":""},""]
[null,null,null,null,null,null,null,null,{"$f":"IF(A561=\"\",\"\",SUMIF(Dégusté_le!$B$2:$B$10000,\"=\" & A561,Dégusté_le!$C$2:$C$10000))","v":""},""]
[null,null,null,null,null,null,null,null,{"$f":"IF(A562=\"\",\"\",SUMIF(Dégusté_le!$B$2:$B$10000,\"=\" & A562,Dégusté_le!$C$2:$C$10000))","v":""},""]
[null,null,null,null,null,null,null,null,{"$f":"IF(A563=\"\",\"\",SUMIF(Dégusté_le!$B$2:$B$10000,\"=\" & A563,Dégusté_le!$C$2:$C$10000))","v":""},""]
[null,null,null,null,null,null,null,null,{"$f":"IF(A564=\"\",\"\",SUMIF(Dégusté_le!$B$2:$B$10000,\"=\" & A564,Dégusté_le!$C$2:$C$10000))","v":""},""]
[null,null,null,null,null,null,null,null,{"$f":"IF(A565=\"\",\"\",SUMIF(Dégusté_le!$B$2:$B$10000,\"=\" & A565,Dégusté_le!$C$2:$C$10000))","v":""},""]
[null,null,null,null,null,null,null,null,{"$f":"IF(A566=\"\",\"\",SUMIF(Dégusté_le!$B$2:$B$10000,\"=\" & A566,Dégusté_le!$C$2:$C$10000))","v":""},""]
[null,null,null,null,null,null,null,null,{"$f":"IF(A567=\"\",\"\",SUMIF(Dégusté_le!$B$2:$B$10000,\"=\" & A567,Dégusté_le!$C$2:$C$10000))","v":""},""]
[null,null,null,null,null,null,null,null,{"$f":"IF(A568=\"\",\"\",SUMIF(Dégusté_le!$B$2:$B$10000,\"=\" & A568,Dégusté_le!$C$2:$C$10000))","v":""},""]
[null,null,null,null,null,null,null,null,{"$f":"IF(A569=\"\",\"\",SUMIF(Dégusté_le!$B$2:$B$10000,\"=\" & A569,Dégusté_le!$C$2:$C$10000))","v":""},""]
[null,null,null,null,null,null,null,null,{"$f":"IF(A570=\"\",\"\",SUMIF(Dégusté_le!$B$2:$B$10000,\"=\" & A570,Dégusté_le!$C$2:$C$10000))","v":""},""]
[null,null,null,null,null,null,null,null,{"$f":"IF(A571=\"\",\"\",SUMIF(Dégusté_le!$B$2:$B$10000,\"=\" & A571,Dégusté_le!$C$2:$C$10000))","v":""},""]
[null,null,null,null,null,null,null,null,{"$f":"IF(A572=\"\",\"\",SUMIF(Dégusté_le!$B$2:$B$10000,\"=\" & A572,Dégusté_le!$C$2:$C$10000))","v":""},""]
[null,null,null,null,null,null,null,null,{"$f":"IF(A573=\"\",\"\",SUMIF(Dégusté_le!$B$2:$B$10000,\"=\" & A573,Dégusté_le!$C$2:$C$10000))","v":""},""]
[null,null,null,null,null,null,null,null,{"$f":"IF(A574=\"\",\"\",SUMIF(Dégusté_le!$B$2:$B$10000,\"=\" & A574,Dégusté_le!$C$2:$C$10000))","v":""},""]
[null,null,null,null,null,null,null,null,{"$f":"IF(A575=\"\",\"\",SUMIF(Dégusté_le!$B$2:$B$10000,\"=\" & A575,Dégusté_le!$C$2:$C$10000))","v":""},""]
[null,null,null,null,null,null,null,null,{"$f":"IF(A576=\"\",\"\",SUMIF(Dégusté_le!$B$2:$B$10000,\"=\" & A576,Dégusté_le!$C$2:$C$10000))","v":""},""]
[null,null,null,null,null,null,null,null,{"$f":"IF(A577=\"\",\"\",SUMIF(Dégusté_le!$B$2:$B$10000,\"=\" & A577,Dégusté_le!$C$2:$C$10000))","v":""},""]
[null,null,null,null,null,null,null,null,{"$f":"IF(A578=\"\",\"\",SUMIF(Dégusté_le!$B$2:$B$10000,\"=\" & A578,Dégusté_le!$C$2:$C$10000))","v":""},""]
[null,null,null,null,null,null,null,null,{"$f":"IF(A579=\"\",\"\",SUMIF(Dégusté_le!$B$2:$B$10000,\"=\" & A579,Dégusté_le!$C$2:$C$10000))","v":""},{"$f":"IF(A579>0,G579-I579,\"\")","v":""}]
[null,null,null,null,null,null,null,null,{"$f":"IF(A580=\"\",\"\",SUMIF(Dégusté_le!$B$2:$B$10000,\"=\" & A580,Dégusté_le!$C$2:$C$10000))","v":""},""]
[null,null,null,null,null,null,null,null,{"$f":"IF(A581=\"\",\"\",SUMIF(Dégusté_le!$B$2:$B$10000,\"=\" & A581,Dégusté_le!$C$2:$C$10000))","v":""},""]
[null,null,null,null,null,null,null,null,{"$f":"IF(A582=\"\",\"\",SUMIF(Dégusté_le!$B$2:$B$10000,\"=\" & A582,Dégusté_le!$C$2:$C$10000))","v":""},""]
[null,null,null,null,null,null,null,null,{"$f":"IF(A583=\"\",\"\",SUMIF(Dégusté_le!$B$2:$B$10000,\"=\" & A583,Dégusté_le!$C$2:$C$10000))","v":""},""]
[null,null,null,null,null,null,null,null,{"$f":"IF(A584=\"\",\"\",SUMIF(Dégusté_le!$B$2:$B$10000,\"=\" & A584,Dégusté_le!$C$2:$C$10000))","v":""},""]
[null,null,null,null,null,null,null,null,{"$f":"IF(A585=\"\",\"\",SUMIF(Dégusté_le!$B$2:$B$10000,\"=\" & A585,Dégusté_le!$C$2:$C$10000))","v":""},""]
[null,null,null,null,null,null,null,null,{"$f":"IF(A586=\"\",\"\",SUMIF(Dégusté_le!$B$2:$B$10000,\"=\" & A586,Dégusté_le!$C$2:$C$10000))","v":""},""]
[null,null,null,null,null,null,null,null,{"$f":"IF(A587=\"\",\"\",SUMIF(Dégusté_le!$B$2:$B$10000,\"=\" & A587,Dégusté_le!$C$2:$C$10000))","v":""},""]
[null,null,null,null,null,null,null,null,{"$f":"IF(A588=\"\",\"\",SUMIF(Dégusté_le!$B$2:$B$10000,\"=\" & A588,Dégusté_le!$C$2:$C$10000))","v":""},""]
[null,null,null,null,null,null,null,null,{"$f":"IF(A589=\"\",\"\",SUMIF(Dégusté_le!$B$2:$B$10000,\"=\" & A589,Dégusté_le!$C$2:$C$10000))","v":""},""]
[null,null,null,null,null,null,null,null,{"$f":"IF(A590=\"\",\"\",SUMIF(Dégusté_le!$B$2:$B$10000,\"=\" & A590,Dégusté_le!$C$2:$C$10000))","v":""},""]
[null,null,null,null,null,null,null,null,{"$f":"IF(A591=\"\",\"\",SUMIF(Dégusté_le!$B$2:$B$10000,\"=\" & A591,Dégusté_le!$C$2:$C$10000))","v":""},""]
[null,null,null,null,null,null,null,null,{"$f":"IF(A592=\"\",\"\",SUMIF(Dégusté_le!$B$2:$B$10000,\"=\" & A592,Dégusté_le!$C$2:$C$10000))","v":""},""]
[null,null,null,null,null,null,null,null,{"$f":"IF(A593=\"\",\"\",SUMIF(Dégusté_le!$B$2:$B$10000,\"=\" & A593,Dégusté_le!$C$2:$C$10000))","v":""},""]
[null,null,null,null,null,null,null,null,{"$f":"IF(A594=\"\",\"\",SUMIF(Dégusté_le!$B$2:$B$10000,\"=\" & A594,Dégusté_le!$C$2:$C$10000))","v":""},""]
[null,null,null,null,null,null,null,null,{"$f":"IF(A595=\"\",\"\",SUMIF(Dégusté_le!$B$2:$B$10000,\"=\" & A595,Dégusté_le!$C$2:$C$10000))","v":""},""]
[null,null,null,null,null,null,null,null,{"$f":"IF(A596=\"\",\"\",SUMIF(Dégusté_le!$B$2:$B$10000,\"=\" & A596,Dégusté_le!$C$2:$C$10000))","v":""},""]
[null,null,null,null,null,null,null,null,{"$f":"IF(A597=\"\",\"\",SUMIF(Dégusté_le!$B$2:$B$10000,\"=\" & A597,Dégusté_le!$C$2:$C$10000))","v":""},""]
[null,null,null,null,null,null,null,null,{"$f":"IF(A598=\"\",\"\",SUMIF(Dégusté_le!$B$2:$B$10000,\"=\" & A598,Dégusté_le!$C$2:$C$10000))","v":""},""]
[null,null,null,null,null,null,null,null,{"$f":"IF(A599=\"\",\"\",SUMIF(Dégusté_le!$B$2:$B$10000,\"=\" & A599,Dégusté_le!$C$2:$C$10000))","v":""},""]
[null,null,null,null,null,null,null,null,{"$f":"IF(A600=\"\",\"\",SUMIF(Dégusté_le!$B$2:$B$10000,\"=\" & A600,Dégusté_le!$C$2:$C$10000))","v":""},""]
[null,null,null,null,null,null,null,null,{"$f":"IF(A601=\"\",\"\",SUMIF(Dégusté_le!$B$2:$B$10000,\"=\" & A601,Dégusté_le!$C$2:$C$10000))","v":""},""]
[null,null,null,null,null,null,null,null,{"$f":"IF(A602=\"\",\"\",SUMIF(Dégusté_le!$B$2:$B$10000,\"=\" & A602,Dégusté_le!$C$2:$C$10000))","v":""},""]
[null,null,null,null,null,null,null,null,{"$f":"IF(A603=\"\",\"\",SUMIF(Dégusté_le!$B$2:$B$10000,\"=\" & A603,Dégusté_le!$C$2:$C$10000))","v":""},""]
[null,null,null,null,null,null,null,null,{"$f":"IF(A604=\"\",\"\",SUMIF(Dégusté_le!$B$2:$B$10000,\"=\" & A604,Dégusté_le!$C$2:$C$10000))","v":""},""]
[null,null,null,null,null,null,null,null,{"$f":"IF(A605=\"\",\"\",SUMIF(Dégusté_le!$B$2:$B$10000,\"=\" & A605,Dégusté_le!$C$2:$C$10000))","v":""},""]
[null,null,null,null,null,null,null,null,{"$f":"IF(A606=\"\",\"\",SUMIF(Dégusté_le!$B$2:$B$10000,\"=\" & A606,Dégusté_le!$C$2:$C$10000))","v":""},""]
[null,null,null,null,null,null,null,null,{"$f":"IF(A607=\"\",\"\",SUMIF(Dégusté_le!$B$2:$B$10000,\"=\" & A607,Dégusté_le!$C$2:$C$10000))","v":""},""]
[null,null,null,null,null,null,null,null,{"$f":"IF(A608=\"\",\"\",SUMIF(Dégusté_le!$B$2:$B$10000,\"=\" & A608,Dégusté_le!$C$2:$C$10000))","v":""},""]
[null,null,null,null,null,null,null,null,{"$f":"IF(A609=\"\",\"\",SUMIF(Dégusté_le!$B$2:$B$10000,\"=\" & A609,Dégusté_le!$C$2:$C$10000))","v":""},""]
[null,null,null,null,null,null,null,null,{"$f":"IF(A610=\"\",\"\",SUMIF(Dégusté_le!$B$2:$B$10000,\"=\" & A610,Dégusté_le!$C$2:$C$10000))","v":""},""]
[null,null,null,null,null,null,null,null,{"$f":"IF(A611=\"\",\"\",SUMIF(Dégusté_le!$B$2:$B$10000,\"=\" & A611,Dégusté_le!$C$2:$C$10000))","v":""},""]
[null,null,null,null,null,null,null,null,{"$f":"IF(A612=\"\",\"\",SUMIF(Dégusté_le!$B$2:$B$10000,\"=\" & A612,Dégusté_le!$C$2:$C$10000))","v":""},""]
[null,null,null,null,null,null,null,null,{"$f":"IF(A613=\"\",\"\",SUMIF(Dégusté_le!$B$2:$B$10000,\"=\" & A613,Dégusté_le!$C$2:$C$10000))","v":""},""]
[null,null,null,null,null,null,null,null,{"$f":"IF(A614=\"\",\"\",SUMIF(Dégusté_le!$B$2:$B$10000,\"=\" & A614,Dégusté_le!$C$2:$C$10000))","v":""},""]
[null,null,null,null,null,null,null,null,{"$f":"IF(A615=\"\",\"\",SUMIF(Dégusté_le!$B$2:$B$10000,\"=\" & A615,Dégusté_le!$C$2:$C$10000))","v":""},""]
[null,null,null,null,null,null,null,null,{"$f":"IF(A616=\"\",\"\",SUMIF(Dégusté_le!$B$2:$B$10000,\"=\" & A616,Dégusté_le!$C$2:$C$10000))","v":""},""]
[null,null,null,null,null,null,null,null,{"$f":"IF(A617=\"\",\"\",SUMIF(Dégusté_le!$B$2:$B$10000,\"=\" & A617,Dégusté_le!$C$2:$C$10000))","v":""},""]
[null,null,null,null,null,null,null,null,{"$f":"IF(A618=\"\",\"\",SUMIF(Dégusté_le!$B$2:$B$10000,\"=\" & A618,Dégusté_le!$C$2:$C$10000))","v":""},""]
[null,null,null,null,null,null,null,null,{"$f":"IF(A619=\"\",\"\",SUMIF(Dégusté_le!$B$2:$B$10000,\"=\" & A619,Dégusté_le!$C$2:$C$10000))","v":""},""]
[null,null,null,null,null,null,null,null,{"$f":"IF(A620=\"\",\"\",SUMIF(Dégusté_le!$B$2:$B$10000,\"=\" & A620,Dégusté_le!$C$2:$C$10000))","v":""},""]
[null,null,null,null,null,null,null,null,{"$f":"IF(A621=\"\",\"\",SUMIF(Dégusté_le!$B$2:$B$10000,\"=\" & A621,Dégusté_le!$C$2:$C$10000))","v":""},""]
[null,null,null,null,null,null,null,null,{"$f":"IF(A622=\"\",\"\",SUMIF(Dégusté_le!$B$2:$B$10000,\"=\" & A622,Dégusté_le!$C$2:$C$10000))","v":""},""]
[null,null,null,null,null,null,null,null,{"$f":"IF(A623=\"\",\"\",SUMIF(Dégusté_le!$B$2:$B$10000,\"=\" & A623,Dégusté_le!$C$2:$C$10000))","v":""},""]
[null,null,null,null,null,null,null,null,{"$f":"IF(A624=\"\",\"\",SUMIF(Dégusté_le!$B$2:$B$10000,\"=\" & A624,Dégusté_le!$C$2:$C$10000))","v":""},""]
[null,null,null,null,null,null,null,null,{"$f":"IF(A625=\"\",\"\",SUMIF(Dégusté_le!$B$2:$B$10000,\"=\" & A625,Dégusté_le!$C$2:$C$10000))","v":""},""]
[null,null,null,null,null,null,null,null,{"$f":"IF(A626=\"\",\"\",SUMIF(Dégusté_le!$B$2:$B$10000,\"=\" & A626,Dégusté_le!$C$2:$C$10000))","v":""},""]
[null,null,null,null,null,null,null,null,{"$f":"IF(A627=\"\",\"\",SUMIF(Dégusté_le!$B$2:$B$10000,\"=\" & A627,Dégusté_le!$C$2:$C$10000))","v":""},""]
[null,null,null,null,null,null,null,null,{"$f":"IF(A628=\"\",\"\",SUMIF(Dégusté_le!$B$2:$B$10000,\"=\" & A628,Dégusté_le!$C$2:$C$10000))","v":""},""]
[null,null,null,null,null,null,null,null,{"$f":"IF(A629=\"\",\"\",SUMIF(Dégusté_le!$B$2:$B$10000,\"=\" & A629,Dégusté_le!$C$2:$C$10000))","v":""},""]
[null,null,null,null,null,null,null,null,{"$f":"IF(A630=\"\",\"\",SUMIF(Dégusté_le!$B$2:$B$10000,\"=\" & A630,Dégusté_le!$C$2:$C$10000))","v":""},""]
[null,null,null,null,null,null,null,null,{"$f":"IF(A631=\"\",\"\",SUMIF(Dégusté_le!$B$2:$B$10000,\"=\" & A631,Dégusté_le!$C$2:$C$10000))","v":""},""]
[null,null,null,null,null,null,null,null,{"$f":"IF(A632=\"\",\"\",SUMIF(Dégusté_le!$B$2:$B$10000,\"=\" & A632,Dégusté_le!$C$2:$C$10000))","v":""},""]
[null,null,null,null,null,null,null,null,{"$f":"IF(A633=\"\",\"\",SUMIF(Dégusté_le!$B$2:$B$10000,\"=\" & A633,Dégusté_le!$C$2:$C$10000))","v":""},""]
[null,null,null,null,null,null,null,null,{"$f":"IF(A634=\"\",\"\",SUMIF(Dégusté_le!$B$2:$B$10000,\"=\" & A634,Dégusté_le!$C$2:$C$10000))","v":""},""]
[null,null,null,null,null,null,null,null,{"$f":"IF(A635=\"\",\"\",SUMIF(Dégusté_le!$B$2:$B$10000,\"=\" & A635,Dégusté_le!$C$2:$C$10000))","v":""},""]
[null,null,null,null,null,null,null,null,{"$f":"IF(A636=\"\",\"\",SUMIF(Dégusté_le!$B$2:$B$10000,\"=\" & A636,Dégusté_le!$C$2:$C$10000))","v":""},""]
[null,null,null,null,null,null,null,null,{"$f":"IF(A637=\"\",\"\",SUMIF(Dégusté_le!$B$2:$B$10000,\"=\" & A637,Dégusté_le!$C$2:$C$10000))","v":""},""]
[null,null,null,null,null,null,null,null,{"$f":"IF(A638=\"\",\"\",SUMIF(Dégusté_le!$B$2:$B$10000,\"=\" & A638,Dégusté_le!$C$2:$C$10000))","v":""},""]
[null,null,null,null,null,null,null,null,{"$f":"IF(A639=\"\",\"\",SUMIF(Dégusté_le!$B$2:$B$10000,\"=\" & A639,Dégusté_le!$C$2:$C$10000))","v":""},""]
[null,null,null,null,null,null,null,null,{"$f":"IF(A640=\"\",\"\",SUMIF(Dégusté_le!$B$2:$B$10000,\"=\" & A640,Dégusté_le!$C$2:$C$10000))","v":""},""]
[null,null,null,null,null,null,null,null,{"$f":"IF(A641=\"\",\"\",SUMIF(Dégusté_le!$B$2:$B$10000,\"=\" & A641,Dégusté_le!$C$2:$C$10000))","v":""},""]
[null,null,null,null,null,null,null,null,{"$f":"IF(A642=\"\",\"\",SUMIF(Dégusté_le!$B$2:$B$10000,\"=\" & A642,Dégusté_le!$C$2:$C$10000))","v":""},""]
[null,null,null,null,null,null,null,null,{"$f":"IF(A643=\"\",\"\",SUMIF(Dégusté_le!$B$2:$B$10000,\"=\" & A643,Dégusté_le!$C$2:$C$10000))","v":""},{"$f":"IF(A643>0,G643-I643,\"\")","v":""}]
[null,null,null,null,null,null,null,null,{"$f":"IF(A644=\"\",\"\",SUMIF(Dégusté_le!$B$2:$B$10000,\"=\" & A644,Dégusté_le!$C$2:$C$10000))","v":""},""]
[null,null,null,null,null,null,null,null,{"$f":"IF(A645=\"\",\"\",SUMIF(Dégusté_le!$B$2:$B$10000,\"=\" & A645,Dégusté_le!$C$2:$C$10000))","v":""},""]
[null,null,null,null,null,null,null,null,{"$f":"IF(A646=\"\",\"\",SUMIF(Dégusté_le!$B$2:$B$10000,\"=\" & A646,Dégusté_le!$C$2:$C$10000))","v":""},""]
[null,null,null,null,null,null,null,null,{"$f":"IF(A647=\"\",\"\",SUMIF(Dégusté_le!$B$2:$B$10000,\"=\" & A647,Dégusté_le!$C$2:$C$10000))","v":""},""]
[null,null,null,null,null,null,null,null,{"$f":"IF(A648=\"\",\"\",SUMIF(Dégusté_le!$B$2:$B$10000,\"=\" & A648,Dégusté_le!$C$2:$C$10000))","v":""},""]
[null,null,null,null,null,null,null,null,{"$f":"IF(A649=\"\",\"\",SUMIF(Dégusté_le!$B$2:$B$10000,\"=\" & A649,Dégusté_le!$C$2:$C$10000))","v":""},""]
[null,null,null,null,null,null,null,null,{"$f":"IF(A650=\"\",\"\",SUMIF(Dégusté_le!$B$2:$B$10000,\"=\" & A650,Dégusté_le!$C$2:$C$10000))","v":""},""]
[null,null,null,null,null,null,null,null,{"$f":"IF(A651=\"\",\"\",SUMIF(Dégusté_le!$B$2:$B$10000,\"=\" & A651,Dégusté_le!$C$2:$C$10000))","v":""},""]
[null,null,null,null,null,null,null,null,{"$f":"IF(A652=\"\",\"\",SUMIF(Dégusté_le!$B$2:$B$10000,\"=\" & A652,Dégusté_le!$C$2:$C$10000))","v":""},""]
[null,null,null,null,null,null,null,null,{"$f":"IF(A653=\"\",\"\",SUMIF(Dégusté_le!$B$2:$B$10000,\"=\" & A653,Dégusté_le!$C$2:$C$10000))","v":""},""]
[null,null,null,null,null,null,null,null,{"$f":"IF(A654=\"\",\"\",SUMIF(Dégusté_le!$B$2:$B$10000,\"=\" & A654,Dégusté_le!$C$2:$C$10000))","v":""},""]
[null,null,null,null,null,null,null,null,{"$f":"IF(A655=\"\",\"\",SUMIF(Dégusté_le!$B$2:$B$10000,\"=\" & A655,Dégusté_le!$C$2:$C$10000))","v":""},""]
[null,null,null,null,null,null,null,null,{"$f":"IF(A656=\"\",\"\",SUMIF(Dégusté_le!$B$2:$B$10000,\"=\" & A656,Dégusté_le!$C$2:$C$10000))","v":""},""]
[null,null,null,null,null,null,null,null,{"$f":"IF(A657=\"\",\"\",SUMIF(Dégusté_le!$B$2:$B$10000,\"=\" & A657,Dégusté_le!$C$2:$C$10000))","v":""},""]
[null,null,null,null,null,null,null,null,{"$f":"IF(A658=\"\",\"\",SUMIF(Dégusté_le!$B$2:$B$10000,\"=\" & A658,Dégusté_le!$C$2:$C$10000))","v":""},""]
[null,null,null,null,null,null,null,null,{"$f":"IF(A659=\"\",\"\",SUMIF(Dégusté_le!$B$2:$B$10000,\"=\" & A659,Dégusté_le!$C$2:$C$10000))","v":""},""]
[null,null,null,null,null,null,null,null,{"$f":"IF(A660=\"\",\"\",SUMIF(Dégusté_le!$B$2:$B$10000,\"=\" & A660,Dégusté_le!$C$2:$C$10000))","v":""},""]
[null,null,null,null,null,null,null,null,{"$f":"IF(A661=\"\",\"\",SUMIF(Dégusté_le!$B$2:$B$10000,\"=\" & A661,Dégusté_le!$C$2:$C$10000))","v":""},""]
[null,null,null,null,null,null,null,null,{"$f":"IF(A662=\"\",\"\",SUMIF(Dégusté_le!$B$2:$B$10000,\"=\" & A662,Dégusté_le!$C$2:$C$10000))","v":""},""]
[null,null,null,null,null,null,null,null,{"$f":"IF(A663=\"\",\"\",SUMIF(Dégusté_le!$B$2:$B$10000,\"=\" & A663,Dégusté_le!$C$2:$C$10000))","v":""},""]
[null,null,null,null,null,null,null,null,{"$f":"IF(A664=\"\",\"\",SUMIF(Dégusté_le!$B$2:$B$10000,\"=\" & A664,Dégusté_le!$C$2:$C$10000))","v":""},""]
[null,null,null,null,null,null,null,null,{"$f":"IF(A665=\"\",\"\",SUMIF(Dégusté_le!$B$2:$B$10000,\"=\" & A665,Dégusté_le!$C$2:$C$10000))","v":""},""]
[null,null,null,null,null,null,null,null,{"$f":"IF(A666=\"\",\"\",SUMIF(Dégusté_le!$B$2:$B$10000,\"=\" & A666,Dégusté_le!$C$2:$C$10000))","v":""},""]
[null,null,null,null,null,null,null,null,{"$f":"IF(A667=\"\",\"\",SUMIF(Dégusté_le!$B$2:$B$10000,\"=\" & A667,Dégusté_le!$C$2:$C$10000))","v":""},""]
[null,null,null,null,null,null,null,null,{"$f":"IF(A668=\"\",\"\",SUMIF(Dégusté_le!$B$2:$B$10000,\"=\" & A668,Dégusté_le!$C$2:$C$10000))","v":""},""]
[null,null,null,null,null,null,null,null,{"$f":"IF(A669=\"\",\"\",SUMIF(Dégusté_le!$B$2:$B$10000,\"=\" & A669,Dégusté_le!$C$2:$C$10000))","v":""},""]
[null,null,null,null,null,null,null,null,{"$f":"IF(A670=\"\",\"\",SUMIF(Dégusté_le!$B$2:$B$10000,\"=\" & A670,Dégusté_le!$C$2:$C$10000))","v":""},""]
[null,null,null,null,null,null,null,null,{"$f":"IF(A671=\"\",\"\",SUMIF(Dégusté_le!$B$2:$B$10000,\"=\" & A671,Dégusté_le!$C$2:$C$10000))","v":""},""]
[null,null,null,null,null,null,null,null,{"$f":"IF(A672=\"\",\"\",SUMIF(Dégusté_le!$B$2:$B$10000,\"=\" & A672,Dégusté_le!$C$2:$C$10000))","v":""},""]
[null,null,null,null,null,null,null,null,{"$f":"IF(A673=\"\",\"\",SUMIF(Dégusté_le!$B$2:$B$10000,\"=\" & A673,Dégusté_le!$C$2:$C$10000))","v":""},""]
[null,null,null,null,null,null,null,null,{"$f":"IF(A674=\"\",\"\",SUMIF(Dégusté_le!$B$2:$B$10000,\"=\" & A674,Dégusté_le!$C$2:$C$10000))","v":""},""]
[null,null,null,null,null,null,null,null,{"$f":"IF(A675=\"\",\"\",SUMIF(Dégusté_le!$B$2:$B$10000,\"=\" & A675,Dégusté_le!$C$2:$C$10000))","v":""},""]
[null,null,null,null,null,null,null,null,{"$f":"IF(A676=\"\",\"\",SUMIF(Dégusté_le!$B$2:$B$10000,\"=\" & A676,Dégusté_le!$C$2:$C$10000))","v":""},""]
[null,null,null,null,null,null,null,null,{"$f":"IF(A677=\"\",\"\",SUMIF(Dégusté_le!$B$2:$B$10000,\"=\" & A677,Dégusté_le!$C$2:$C$10000))","v":""},""]
[null,null,null,null,null,null,null,null,{"$f":"IF(A678=\"\",\"\",SUMIF(Dégusté_le!$B$2:$B$10000,\"=\" & A678,Dégusté_le!$C$2:$C$10000))","v":""},""]
[null,null,null,null,null,null,null,null,{"$f":"IF(A679=\"\",\"\",SUMIF(Dégusté_le!$B$2:$B$10000,\"=\" & A679,Dégusté_le!$C$2:$C$10000))","v":""},""]
[null,null,null,null,null,null,null,null,{"$f":"IF(A680=\"\",\"\",SUMIF(Dégusté_le!$B$2:$B$10000,\"=\" & A680,Dégusté_le!$C$2:$C$10000))","v":""},""]
[null,null,null,null,null,null,null,null,{"$f":"IF(A681=\"\",\"\",SUMIF(Dégusté_le!$B$2:$B$10000,\"=\" & A681,Dégusté_le!$C$2:$C$10000))","v":""},""]
[null,null,null,null,null,null,null,null,{"$f":"IF(A682=\"\",\"\",SUMIF(Dégusté_le!$B$2:$B$10000,\"=\" & A682,Dégusté_le!$C$2:$C$10000))","v":""},""]
[null,null,null,null,null,null,null,null,{"$f":"IF(A683=\"\",\"\",SUMIF(Dégusté_le!$B$2:$B$10000,\"=\" & A683,Dégusté_le!$C$2:$C$10000))","v":""},""]
[null,null,null,null,null,null,null,null,{"$f":"IF(A684=\"\",\"\",SUMIF(Dégusté_le!$B$2:$B$10000,\"=\" & A684,Dégusté_le!$C$2:$C$10000))","v":""},""]
[null,null,null,null,null,null,null,null,{"$f":"IF(A685=\"\",\"\",SUMIF(Dégusté_le!$B$2:$B$10000,\"=\" & A685,Dégusté_le!$C$2:$C$10000))","v":""},""]
[null,null,null,null,null,null,null,null,{"$f":"IF(A686=\"\",\"\",SUMIF(Dégusté_le!$B$2:$B$10000,\"=\" & A686,Dégusté_le!$C$2:$C$10000))","v":""},""]
[null,null,null,null,null,null,null,null,{"$f":"IF(A687=\"\",\"\",SUMIF(Dégusté_le!$B$2:$B$10000,\"=\" & A687,Dégusté_le!$C$2:$C$10000))","v":""},""]
[null,null,null,null,null,null,null,null,{"$f":"IF(A688=\"\",\"\",SUMIF(Dégusté_le!$B$2:$B$10000,\"=\" & A688,Dégusté_le!$C$2:$C$10000))","v":""},""]
[null,null,null,null,null,null,null,null,{"$f":"IF(A689=\"\",\"\",SUMIF(Dégusté_le!$B$2:$B$10000,\"=\" & A689,Dégusté_le!$C$2:$C$10000))","v":""},""]
[null,null,null,null,null,null,null,null,{"$f":"IF(A690=\"\",\"\",SUMIF(Dégusté_le!$B$2:$B$10000,\"=\" & A690,Dégusté_le!$C$2:$C$10000))","v":""},""]
[null,null,null,null,null,null,null,null,{"$f":"IF(A691=\"\",\"\",SUMIF(Dégusté_le!$B$2:$B$10000,\"=\" & A691,Dégusté_le!$C$2:$C$10000))","v":""},""]
[null,null,null,null,null,null,null,null,{"$f":"IF(A692=\"\",\"\",SUMIF(Dégusté_le!$B$2:$B$10000,\"=\" & A692,Dégusté_le!$C$2:$C$10000))","v":""},""]
[null,null,null,null,null,null,null,null,{"$f":"IF(A693=\"\",\"\",SUMIF(Dégusté_le!$B$2:$B$10000,\"=\" & A693,Dégusté_le!$C$2:$C$10000))","v":""},""]
[null,null,null,null,null,null,null,null,{"$f":"IF(A694=\"\",\"\",SUMIF(Dégusté_le!$B$2:$B$10000,\"=\" & A694,Dégusté_le!$C$2:$C$10000))","v":""},""]
[null,null,null,null,null,null,null,null,{"$f":"IF(A695=\"\",\"\",SUMIF(Dégusté_le!$B$2:$B$10000,\"=\" & A695,Dégusté_le!$C$2:$C$10000))","v":""},""]
[null,null,null,null,null,null,null,null,{"$f":"IF(A696=\"\",\"\",SUMIF(Dégusté_le!$B$2:$B$10000,\"=\" & A696,Dégusté_le!$C$2:$C$10000))","v":""},""]
[null,null,null,null,null,null,null,null,{"$f":"IF(A697=\"\",\"\",SUMIF(Dégusté_le!$B$2:$B$10000,\"=\" & A697,Dégusté_le!$C$2:$C$10000))","v":""},""]
[null,null,null,null,null,null,null,null,{"$f":"IF(A698=\"\",\"\",SUMIF(Dégusté_le!$B$2:$B$10000,\"=\" & A698,Dégusté_le!$C$2:$C$10000))","v":""},""]
[null,null,null,null,null,null,null,null,{"$f":"IF(A699=\"\",\"\",SUMIF(Dégusté_le!$B$2:$B$10000,\"=\" & A699,Dégusté_le!$C$2:$C$10000))","v":""},""]
[null,null,null,null,null,null,null,null,{"$f":"IF(A700=\"\",\"\",SUMIF(Dégusté_le!$B$2:$B$10000,\"=\" & A700,Dégusté_le!$C$2:$C$10000))","v":""},""]
[null,null,null,null,null,null,null,null,{"$f":"IF(A701=\"\",\"\",SUMIF(Dégusté_le!$B$2:$B$10000,\"=\" & A701,Dégusté_le!$C$2:$C$10000))","v":""},""]
[null,null,null,null,null,null,null,null,{"$f":"IF(A702=\"\",\"\",SUMIF(Dégusté_le!$B$2:$B$10000,\"=\" & A702,Dégusté_le!$C$2:$C$10000))","v":""},""]
[null,null,null,null,null,null,null,null,{"$f":"IF(A703=\"\",\"\",SUMIF(Dégusté_le!$B$2:$B$10000,\"=\" & A703,Dégusté_le!$C$2:$C$10000))","v":""},""]
[null,null,null,null,null,null,null,null,{"$f":"IF(A704=\"\",\"\",SUMIF(Dégusté_le!$B$2:$B$10000,\"=\" & A704,Dégusté_le!$C$2:$C$10000))","v":""},""]
[null,null,null,null,null,null,null,null,{"$f":"IF(A705=\"\",\"\",SUMIF(Dégusté_le!$B$2:$B$10000,\"=\" & A705,Dégusté_le!$C$2:$C$10000))","v":""},""]
[null,null,null,null,null,null,null,null,{"$f":"IF(A706=\"\",\"\",SUMIF(Dégusté_le!$B$2:$B$10000,\"=\" & A706,Dégusté_le!$C$2:$C$10000))","v":""},""]
[null,null,null,null,null,null,null,null,{"$f":"IF(A707=\"\",\"\",SUMIF(Dégusté_le!$B$2:$B$10000,\"=\" & A707,Dégusté_le!$C$2:$C$10000))","v":""},{"$f":"IF(A707>0,G707-I707,\"\")","v":""}]
[null,null,null,null,null,null,null,null,{"$f":"IF(A708=\"\",\"\",SUMIF(Dégusté_le!$B$2:$B$10000,\"=\" & A708,Dégusté_le!$C$2:$C$10000))","v":""},""]
[null,null,null,null,null,null,null,null,{"$f":"IF(A709=\"\",\"\",SUMIF(Dégusté_le!$B$2:$B$10000,\"=\" & A709,Dégusté_le!$C$2:$C$10000))","v":""},""]
[null,null,null,null,null,null,null,null,{"$f":"IF(A710=\"\",\"\",SUMIF(Dégusté_le!$B$2:$B$10000,\"=\" & A710,Dégusté_le!$C$2:$C$10000))","v":""},""]
[null,null,null,null,null,null,null,null,{"$f":"IF(A711=\"\",\"\",SUMIF(Dégusté_le!$B$2:$B$10000,\"=\" & A711,Dégusté_le!$C$2:$C$10000))","v":""},""]
[null,null,null,null,null,null,null,null,{"$f":"IF(A712=\"\",\"\",SUMIF(Dégusté_le!$B$2:$B$10000,\"=\" & A712,Dégusté_le!$C$2:$C$10000))","v":""},""]
[null,null,null,null,null,null,null,null,{"$f":"IF(A713=\"\",\"\",SUMIF(Dégusté_le!$B$2:$B$10000,\"=\" & A713,Dégusté_le!$C$2:$C$10000))","v":""},""]
[null,null,null,null,null,null,null,null,{"$f":"IF(A714=\"\",\"\",SUMIF(Dégusté_le!$B$2:$B$10000,\"=\" & A714,Dégusté_le!$C$2:$C$10000))","v":""},""]
[null,null,null,null,null,null,null,null,{"$f":"IF(A715=\"\",\"\",SUMIF(Dégusté_le!$B$2:$B$10000,\"=\" & A715,Dégusté_le!$C$2:$C$10000))","v":""},""]
[null,null,null,null,null,null,null,null,{"$f":"IF(A716=\"\",\"\",SUMIF(Dégusté_le!$B$2:$B$10000,\"=\" & A716,Dégusté_le!$C$2:$C$10000))","v":""},""]
[null,null,null,null,null,null,null,null,{"$f":"IF(A717=\"\",\"\",SUMIF(Dégusté_le!$B$2:$B$10000,\"=\" & A717,Dégusté_le!$C$2:$C$10000))","v":""},""]
[null,null,null,null,null,null,null,null,{"$f":"IF(A718=\"\",\"\",SUMIF(Dégusté_le!$B$2:$B$10000,\"=\" & A718,Dégusté_le!$C$2:$C$10000))","v":""},""]
[null,null,null,null,null,null,null,null,{"$f":"IF(A719=\"\",\"\",SUMIF(Dégusté_le!$B$2:$B$10000,\"=\" & A719,Dégusté_le!$C$2:$C$10000))","v":""},""]
[null,null,null,null,null,null,null,null,{"$f":"IF(A720=\"\",\"\",SUMIF(Dégusté_le!$B$2:$B$10000,\"=\" & A720,Dégusté_le!$C$2:$C$10000))","v":""},""]
[null,null,null,null,null,null,null,null,{"$f":"IF(A721=\"\",\"\",SUMIF(Dégusté_le!$B$2:$B$10000,\"=\" & A721,Dégusté_le!$C$2:$C$10000))","v":""},""]
[null,null,null,null,null,null,null,null,{"$f":"IF(A722=\"\",\"\",SUMIF(Dégusté_le!$B$2:$B$10000,\"=\" & A722,Dégusté_le!$C$2:$C$10000))","v":""},""]
[null,null,null,null,null,null,null,null,{"$f":"IF(A723=\"\",\"\",SUMIF(Dégusté_le!$B$2:$B$10000,\"=\" & A723,Dégusté_le!$C$2:$C$10000))","v":""},""]
[null,null,null,null,null,null,null,null,{"$f":"IF(A724=\"\",\"\",SUMIF(Dégusté_le!$B$2:$B$10000,\"=\" & A724,Dégusté_le!$C$2:$C$10000))","v":""},""]
[null,null,null,null,null,null,null,null,{"$f":"IF(A725=\"\",\"\",SUMIF(Dégusté_le!$B$2:$B$10000,\"=\" & A725,Dégusté_le!$C$2:$C$10000))","v":""},""]
[null,null,null,null,null,null,null,null,{"$f":"IF(A726=\"\",\"\",SUMIF(Dégusté_le!$B$2:$B$10000,\"=\" & A726,Dégusté_le!$C$2:$C$10000))","v":""},""]
[null,null,null,null,null,null,null,null,{"$f":"IF(A727=\"\",\"\",SUMIF(Dégusté_le!$B$2:$B$10000,\"=\" & A727,Dégusté_le!$C$2:$C$10000))","v":""},""]
[null,null,null,null,null,null,null,null,{"$f":"IF(A728=\"\",\"\",SUMIF(Dégusté_le!$B$2:$B$10000,\"=\" & A728,Dégusté_le!$C$2:$C$10000))","v":""},""]
[null,null,null,null,null,null,null,null,{"$f":"IF(A729=\"\",\"\",SUMIF(Dégusté_le!$B$2:$B$10000,\"=\" & A729,Dégusté_le!$C$2:$C$10000))","v":""},""]
[null,null,null,null,null,null,null,null,{"$f":"IF(A730=\"\",\"\",SUMIF(Dégusté_le!$B$2:$B$10000,\"=\" & A730,Dégusté_le!$C$2:$C$10000))","v":""},""]
[null,null,null,null,null,null,null,null,{"$f":"IF(A731=\"\",\"\",SUMIF(Dégusté_le!$B$2:$B$10000,\"=\" & A731,Dégusté_le!$C$2:$C$10000))","v":""},""]
[null,null,null,null,null,null,null,null,{"$f":"IF(A732=\"\",\"\",SUMIF(Dégusté_le!$B$2:$B$10000,\"=\" & A732,Dégusté_le!$C$2:$C$10000))","v":""},""]
[null,null,null,null,null,null,null,null,{"$f":"IF(A733=\"\",\"\",SUMIF(Dégusté_le!$B$2:$B$10000,\"=\" & A733,Dégusté_le!$C$2:$C$10000))","v":""},""]
[null,null,null,null,null,null,null,null,{"$f":"IF(A734=\"\",\"\",SUMIF(Dégusté_le!$B$2:$B$10000,\"=\" & A734,Dégusté_le!$C$2:$C$10000))","v":""},""]
[null,null,null,null,null,null,null,null,{"$f":"IF(A735=\"\",\"\",SUMIF(Dégusté_le!$B$2:$B$10000,\"=\" & A735,Dégusté_le!$C$2:$C$10000))","v":""},""]
[null,null,null,null,null,null,null,null,{"$f":"IF(A736=\"\",\"\",SUMIF(Dégusté_le!$B$2:$B$10000,\"=\" & A736,Dégusté_le!$C$2:$C$10000))","v":""},""]
[null,null,null,null,null,null,null,null,{"$f":"IF(A737=\"\",\"\",SUMIF(Dégusté_le!$B$2:$B$10000,\"=\" & A737,Dégusté_le!$C$2:$C$10000))","v":""},""]
[null,null,null,null,null,null,null,null,{"$f":"IF(A738=\"\",\"\",SUMIF(Dégusté_le!$B$2:$B$10000,\"=\" & A738,Dégusté_le!$C$2:$C$10000))","v":""},""]
[null,null,null,null,null,null,null,null,{"$f":"IF(A739=\"\",\"\",SUMIF(Dégusté_le!$B$2:$B$10000,\"=\" & A739,Dégusté_le!$C$2:$C$10000))","v":""},""]
[null,null,null,null,null,null,null,null,{"$f":"IF(A740=\"\",\"\",SUMIF(Dégusté_le!$B$2:$B$10000,\"=\" & A740,Dégusté_le!$C$2:$C$10000))","v":""},""]
[null,null,null,null,null,null,null,null,{"$f":"IF(A741=\"\",\"\",SUMIF(Dégusté_le!$B$2:$B$10000,\"=\" & A741,Dégusté_le!$C$2:$C$10000))","v":""},""]
[null,null,null,null,null,null,null,null,{"$f":"IF(A742=\"\",\"\",SUMIF(Dégusté_le!$B$2:$B$10000,\"=\" & A742,Dégusté_le!$C$2:$C$10000))","v":""},""]
[null,null,null,null,null,null,null,null,{"$f":"IF(A743=\"\",\"\",SUMIF(Dégusté_le!$B$2:$B$10000,\"=\" & A743,Dégusté_le!$C$2:$C$10000))","v":""},""]
[null,null,null,null,null,null,null,null,{"$f":"IF(A744=\"\",\"\",SUMIF(Dégusté_le!$B$2:$B$10000,\"=\" & A744,Dégusté_le!$C$2:$C$10000))","v":""},""]
[null,null,null,null,null,null,null,null,{"$f":"IF(A745=\"\",\"\",SUMIF(Dégusté_le!$B$2:$B$10000,\"=\" & A745,Dégusté_le!$C$2:$C$10000))","v":""},""]
[null,null,null,null,null,null,null,null,{"$f":"IF(A746=\"\",\"\",SUMIF(Dégusté_le!$B$2:$B$10000,\"=\" & A746,Dégusté_le!$C$2:$C$10000))","v":""},""]
[null,null,null,null,null,null,null,null,{"$f":"IF(A747=\"\",\"\",SUMIF(Dégusté_le!$B$2:$B$10000,\"=\" & A747,Dégusté_le!$C$2:$C$10000))","v":""},""]
[null,null,null,null,null,null,null,null,{"$f":"IF(A748=\"\",\"\",SUMIF(Dégusté_le!$B$2:$B$10000,\"=\" & A748,Dégusté_le!$C$2:$C$10000))","v":""},""]
[null,null,null,null,null,null,null,null,{"$f":"IF(A749=\"\",\"\",SUMIF(Dégusté_le!$B$2:$B$10000,\"=\" & A749,Dégusté_le!$C$2:$C$10000))","v":""},""]
[null,null,null,null,null,null,null,null,{"$f":"IF(A750=\"\",\"\",SUMIF(Dégusté_le!$B$2:$B$10000,\"=\" & A750,Dégusté_le!$C$2:$C$10000))","v":""},""]
[null,null,null,null,null,null,null,null,{"$f":"IF(A751=\"\",\"\",SUMIF(Dégusté_le!$B$2:$B$10000,\"=\" & A751,Dégusté_le!$C$2:$C$10000))","v":""},""]
[null,null,null,null,null,null,null,null,{"$f":"IF(A752=\"\",\"\",SUMIF(Dégusté_le!$B$2:$B$10000,\"=\" & A752,Dégusté_le!$C$2:$C$10000))","v":""},""]
[null,null,null,null,null,null,null,null,{"$f":"IF(A753=\"\",\"\",SUMIF(Dégusté_le!$B$2:$B$10000,\"=\" & A753,Dégusté_le!$C$2:$C$10000))","v":""},""]
[null,null,null,null,null,null,null,null,{"$f":"IF(A754=\"\",\"\",SUMIF(Dégusté_le!$B$2:$B$10000,\"=\" & A754,Dégusté_le!$C$2:$C$10000))","v":""},""]
[null,null,null,null,null,null,null,null,{"$f":"IF(A755=\"\",\"\",SUMIF(Dégusté_le!$B$2:$B$10000,\"=\" & A755,Dégusté_le!$C$2:$C$10000))","v":""},""]
[null,null,null,null,null,null,null,null,{"$f":"IF(A756=\"\",\"\",SUMIF(Dégusté_le!$B$2:$B$10000,\"=\" & A756,Dégusté_le!$C$2:$C$10000))","v":""},""]
[null,null,null,null,null,null,null,null,{"$f":"IF(A757=\"\",\"\",SUMIF(Dégusté_le!$B$2:$B$10000,\"=\" & A757,Dégusté_le!$C$2:$C$10000))","v":""},""]
[null,null,null,null,null,null,null,null,{"$f":"IF(A758=\"\",\"\",SUMIF(Dégusté_le!$B$2:$B$10000,\"=\" & A758,Dégusté_le!$C$2:$C$10000))","v":""},""]
[null,null,null,null,null,null,null,null,{"$f":"IF(A759=\"\",\"\",SUMIF(Dégusté_le!$B$2:$B$10000,\"=\" & A759,Dégusté_le!$C$2:$C$10000))","v":""},""]
[null,null,null,null,null,null,null,null,{"$f":"IF(A760=\"\",\"\",SUMIF(Dégusté_le!$B$2:$B$10000,\"=\" & A760,Dégusté_le!$C$2:$C$10000))","v":""},""]
[null,null,null,null,null,null,null,null,{"$f":"IF(A761=\"\",\"\",SUMIF(Dégusté_le!$B$2:$B$10000,\"=\" & A761,Dégusté_le!$C$2:$C$10000))","v":""},""]
[null,null,null,null,null,null,null,null,{"$f":"IF(A762=\"\",\"\",SUMIF(Dégusté_le!$B$2:$B$10000,\"=\" & A762,Dégusté_le!$C$2:$C$10000))","v":""},""]
[null,null,null,null,null,null,null,null,{"$f":"IF(A763=\"\",\"\",SUMIF(Dégusté_le!$B$2:$B$10000,\"=\" & A763,Dégusté_le!$C$2:$C$10000))","v":""},""]
[null,null,null,null,null,null,null,null,{"$f":"IF(A764=\"\",\"\",SUMIF(Dégusté_le!$B$2:$B$10000,\"=\" & A764,Dégusté_le!$C$2:$C$10000))","v":""},""]
[null,null,null,null,null,null,null,null,{"$f":"IF(A765=\"\",\"\",SUMIF(Dégusté_le!$B$2:$B$10000,\"=\" & A765,Dégusté_le!$C$2:$C$10000))","v":""},""]
[null,null,null,null,null,null,null,null,{"$f":"IF(A766=\"\",\"\",SUMIF(Dégusté_le!$B$2:$B$10000,\"=\" & A766,Dégusté_le!$C$2:$C$10000))","v":""},""]
[null,null,null,null,null,null,null,null,{"$f":"IF(A767=\"\",\"\",SUMIF(Dégusté_le!$B$2:$B$10000,\"=\" & A767,Dégusté_le!$C$2:$C$10000))","v":""},""]
[null,null,null,null,null,null,null,null,{"$f":"IF(A768=\"\",\"\",SUMIF(Dégusté_le!$B$2:$B$10000,\"=\" & A768,Dégusté_le!$C$2:$C$10000))","v":""},""]
[null,null,null,null,null,null,null,null,{"$f":"IF(A769=\"\",\"\",SUMIF(Dégusté_le!$B$2:$B$10000,\"=\" & A769,Dégusté_le!$C$2:$C$10000))","v":""},""]
[null,null,null,null,null,null,null,null,{"$f":"IF(A770=\"\",\"\",SUMIF(Dégusté_le!$B$2:$B$10000,\"=\" & A770,Dégusté_le!$C$2:$C$10000))","v":""},""]
[null,null,null,null,null,null,null,null,{"$f":"IF(A771=\"\",\"\",SUMIF(Dégusté_le!$B$2:$B$10000,\"=\" & A771,Dégusté_le!$C$2:$C$10000))","v":""},{"$f":"IF(A771>0,G771-I771,\"\")","v":""}]
[null,null,null,null,null,null,null,null,{"$f":"IF(A772=\"\",\"\",SUMIF(Dégusté_le!$B$2:$B$10000,\"=\" & A772,Dégusté_le!$C$2:$C$10000))","v":""},""]
[null,null,null,null,null,null,null,null,{"$f":"IF(A773=\"\",\"\",SUMIF(Dégusté_le!$B$2:$B$10000,\"=\" & A773,Dégusté_le!$C$2:$C$10000))","v":""},""]
[null,null,null,null,null,null,null,null,{"$f":"IF(A774=\"\",\"\",SUMIF(Dégusté_le!$B$2:$B$10000,\"=\" & A774,Dégusté_le!$C$2:$C$10000))","v":""},""]
[null,null,null,null,null,null,null,null,{"$f":"IF(A775=\"\",\"\",SUMIF(Dégusté_le!$B$2:$B$10000,\"=\" & A775,Dégusté_le!$C$2:$C$10000))","v":""},""]
[null,null,null,null,null,null,null,null,{"$f":"IF(A776=\"\",\"\",SUMIF(Dégusté_le!$B$2:$B$10000,\"=\" & A776,Dégusté_le!$C$2:$C$10000))","v":""},""]
[null,null,null,null,null,null,null,null,{"$f":"IF(A777=\"\",\"\",SUMIF(Dégusté_le!$B$2:$B$10000,\"=\" & A777,Dégusté_le!$C$2:$C$10000))","v":""},""]
[null,null,null,null,null,null,null,null,{"$f":"IF(A778=\"\",\"\",SUMIF(Dégusté_le!$B$2:$B$10000,\"=\" & A778,Dégusté_le!$C$2:$C$10000))","v":""},""]
[null,null,null,null,null,null,null,null,{"$f":"IF(A779=\"\",\"\",SUMIF(Dégusté_le!$B$2:$B$10000,\"=\" & A779,Dégusté_le!$C$2:$C$10000))","v":""},""]
[null,null,null,null,null,null,null,null,{"$f":"IF(A780=\"\",\"\",SUMIF(Dégusté_le!$B$2:$B$10000,\"=\" & A780,Dégusté_le!$C$2:$C$10000))","v":""},""]
[null,null,null,null,null,null,null,null,{"$f":"IF(A781=\"\",\"\",SUMIF(Dégusté_le!$B$2:$B$10000,\"=\" & A781,Dégusté_le!$C$2:$C$10000))","v":""},""]
[null,null,null,null,null,null,null,null,{"$f":"IF(A782=\"\",\"\",SUMIF(Dégusté_le!$B$2:$B$10000,\"=\" & A782,Dégusté_le!$C$2:$C$10000))","v":""},""]
[null,null,null,null,null,null,null,null,{"$f":"IF(A783=\"\",\"\",SUMIF(Dégusté_le!$B$2:$B$10000,\"=\" & A783,Dégusté_le!$C$2:$C$10000))","v":""},""]
[null,null,null,null,null,null,null,null,{"$f":"IF(A784=\"\",\"\",SUMIF(Dégusté_le!$B$2:$B$10000,\"=\" & A784,Dégusté_le!$C$2:$C$10000))","v":""},""]
[null,null,null,null,null,null,null,null,{"$f":"IF(A785=\"\",\"\",SUMIF(Dégusté_le!$B$2:$B$10000,\"=\" & A785,Dégusté_le!$C$2:$C$10000))","v":""},""]
[null,null,null,null,null,null,null,null,{"$f":"IF(A786=\"\",\"\",SUMIF(Dégusté_le!$B$2:$B$10000,\"=\" & A786,Dégusté_le!$C$2:$C$10000))","v":""},""]
[null,null,null,null,null,null,null,null,{"$f":"IF(A787=\"\",\"\",SUMIF(Dégusté_le!$B$2:$B$10000,\"=\" & A787,Dégusté_le!$C$2:$C$10000))","v":""},""]
[null,null,null,null,null,null,null,null,{"$f":"IF(A788=\"\",\"\",SUMIF(Dégusté_le!$B$2:$B$10000,\"=\" & A788,Dégusté_le!$C$2:$C$10000))","v":""},""]
[null,null,null,null,null,null,null,null,{"$f":"IF(A789=\"\",\"\",SUMIF(Dégusté_le!$B$2:$B$10000,\"=\" & A789,Dégusté_le!$C$2:$C$10000))","v":""},""]
[null,null,null,null,null,null,null,null,{"$f":"IF(A790=\"\",\"\",SUMIF(Dégusté_le!$B$2:$B$10000,\"=\" & A790,Dégusté_le!$C$2:$C$10000))","v":""},""]
[null,null,null,null,null,null,null,null,{"$f":"IF(A791=\"\",\"\",SUMIF(Dégusté_le!$B$2:$B$10000,\"=\" & A791,Dégusté_le!$C$2:$C$10000))","v":""},""]
[null,null,null,null,null,null,null,null,{"$f":"IF(A792=\"\",\"\",SUMIF(Dégusté_le!$B$2:$B$10000,\"=\" & A792,Dégusté_le!$C$2:$C$10000))","v":""},""]
[null,null,null,null,null,null,null,null,{"$f":"IF(A793=\"\",\"\",SUMIF(Dégusté_le!$B$2:$B$10000,\"=\" & A793,Dégusté_le!$C$2:$C$10000))","v":""},""]
[null,null,null,null,null,null,null,null,{"$f":"IF(A794=\"\",\"\",SUMIF(Dégusté_le!$B$2:$B$10000,\"=\" & A794,Dégusté_le!$C$2:$C$10000))","v":""},""]
[null,null,null,null,null,null,null,null,{"$f":"IF(A795=\"\",\"\",SUMIF(Dégusté_le!$B$2:$B$10000,\"=\" & A795,Dégusté_le!$C$2:$C$10000))","v":""},""]
[null,null,null,null,null,null,null,null,{"$f":"IF(A796=\"\",\"\",SUMIF(Dégusté_le!$B$2:$B$10000,\"=\" & A796,Dégusté_le!$C$2:$C$10000))","v":""},""]
[null,null,null,null,null,null,null,null,{"$f":"IF(A797=\"\",\"\",SUMIF(Dégusté_le!$B$2:$B$10000,\"=\" & A797,Dégusté_le!$C$2:$C$10000))","v":""},""]
[null,null,null,null,null,null,null,null,{"$f":"IF(A798=\"\",\"\",SUMIF(Dégusté_le!$B$2:$B$10000,\"=\" & A798,Dégusté_le!$C$2:$C$10000))","v":""},""]
[null,null,null,null,null,null,null,null,{"$f":"IF(A799=\"\",\"\",SUMIF(Dégusté_le!$B$2:$B$10000,\"=\" & A799,Dégusté_le!$C$2:$C$10000))","v":""},""]
[null,null,null,null,null,null,null,null,{"$f":"IF(A800=\"\",\"\",SUMIF(Dégusté_le!$B$2:$B$10000,\"=\" & A800,Dégusté_le!$C$2:$C$10000))","v":""},""]
[null,null,null,null,null,null,null,null,{"$f":"IF(A801=\"\",\"\",SUMIF(Dégusté_le!$B$2:$B$10000,\"=\" & A801,Dégusté_le!$C$2:$C$10000))","v":""},""]
[null,null,null,null,null,null,null,null,{"$f":"IF(A802=\"\",\"\",SUMIF(Dégusté_le!$B$2:$B$10000,\"=\" & A802,Dégusté_le!$C$2:$C$10000))","v":""},""]
[null,null,null,null,null,null,null,null,{"$f":"IF(A803=\"\",\"\",SUMIF(Dégusté_le!$B$2:$B$10000,\"=\" & A803,Dégusté_le!$C$2:$C$10000))","v":""},""]
[null,null,null,null,null,null,null,null,{"$f":"IF(A804=\"\",\"\",SUMIF(Dégusté_le!$B$2:$B$10000,\"=\" & A804,Dégusté_le!$C$2:$C$10000))","v":""},""]
[null,null,null,null,null,null,null,null,{"$f":"IF(A805=\"\",\"\",SUMIF(Dégusté_le!$B$2:$B$10000,\"=\" & A805,Dégusté_le!$C$2:$C$10000))","v":""},""]
[null,null,null,null,null,null,null,null,{"$f":"IF(A806=\"\",\"\",SUMIF(Dégusté_le!$B$2:$B$10000,\"=\" & A806,Dégusté_le!$C$2:$C$10000))","v":""},""]
[null,null,null,null,null,null,null,null,{"$f":"IF(A807=\"\",\"\",SUMIF(Dégusté_le!$B$2:$B$10000,\"=\" & A807,Dégusté_le!$C$2:$C$10000))","v":""},""]
[null,null,null,null,null,null,null,null,{"$f":"IF(A808=\"\",\"\",SUMIF(Dégusté_le!$B$2:$B$10000,\"=\" & A808,Dégusté_le!$C$2:$C$10000))","v":""},""]
[null,null,null,null,null,null,null,null,{"$f":"IF(A809=\"\",\"\",SUMIF(Dégusté_le!$B$2:$B$10000,\"=\" & A809,Dégusté_le!$C$2:$C$10000))","v":""},""]
[null,null,null,null,null,null,null,null,{"$f":"IF(A810=\"\",\"\",SUMIF(Dégusté_le!$B$2:$B$10000,\"=\" & A810,Dégusté_le!$C$2:$C$10000))","v":""},""]
[null,null,null,null,null,null,null,null,{"$f":"IF(A811=\"\",\"\",SUMIF(Dégusté_le!$B$2:$B$10000,\"=\" & A811,Dégusté_le!$C$2:$C$10000))","v":""},""]
[null,null,null,null,null,null,null,null,{"$f":"IF(A812=\"\",\"\",SUMIF(Dégusté_le!$B$2:$B$10000,\"=\" & A812,Dégusté_le!$C$2:$C$10000))","v":""},""]
[null,null,null,null,null,null,null,null,{"$f":"IF(A813=\"\",\"\",SUMIF(Dégusté_le!$B$2:$B$10000,\"=\" & A813,Dégusté_le!$C$2:$C$10000))","v":""},""]
[null,null,null,null,null,null,null,null,{"$f":"IF(A814=\"\",\"\",SUMIF(Dégusté_le!$B$2:$B$10000,\"=\" & A814,Dégusté_le!$C$2:$C$10000))","v":""},""]
[null,null,null,null,null,null,null,null,{"$f":"IF(A815=\"\",\"\",SUMIF(Dégusté_le!$B$2:$B$10000,\"=\" & A815,Dégusté_le!$C$2:$C$10000))","v":""},""]
[null,null,null,null,null,null,null,null,{"$f":"IF(A816=\"\",\"\",SUMIF(Dégusté_le!$B$2:$B$10000,\"=\" & A816,Dégusté_le!$C$2:$C$10000))","v":""},""]
[null,null,null,null,null,null,null,null,{"$f":"IF(A817=\"\",\"\",SUMIF(Dégusté_le!$B$2:$B$10000,\"=\" & A817,Dégusté_le!$C$2:$C$10000))","v":""},""]
[null,null,null,null,null,null,null,null,{"$f":"IF(A818=\"\",\"\",SUMIF(Dégusté_le!$B$2:$B$10000,\"=\" & A818,Dégusté_le!$C$2:$C$10000))","v":""},""]
[null,null,null,null,null,null,null,null,{"$f":"IF(A819=\"\",\"\",SUMIF(Dégusté_le!$B$2:$B$10000,\"=\" & A819,Dégusté_le!$C$2:$C$10000))","v":""},""]
[null,null,null,null,null,null,null,null,{"$f":"IF(A820=\"\",\"\",SUMIF(Dégusté_le!$B$2:$B$10000,\"=\" & A820,Dégusté_le!$C$2:$C$10000))","v":""},""]
[null,null,null,null,null,null,null,null,{"$f":"IF(A821=\"\",\"\",SUMIF(Dégusté_le!$B$2:$B$10000,\"=\" & A821,Dégusté_le!$C$2:$C$10000))","v":""},""]
[null,null,null,null,null,null,null,null,{"$f":"IF(A822=\"\",\"\",SUMIF(Dégusté_le!$B$2:$B$10000,\"=\" & A822,Dégusté_le!$C$2:$C$10000))","v":""},""]
[null,null,null,null,null,null,null,null,{"$f":"IF(A823=\"\",\"\",SUMIF(Dégusté_le!$B$2:$B$10000,\"=\" & A823,Dégusté_le!$C$2:$C$10000))","v":""},""]
[null,null,null,null,null,null,null,null,{"$f":"IF(A824=\"\",\"\",SUMIF(Dégusté_le!$B$2:$B$10000,\"=\" & A824,Dégusté_le!$C$2:$C$10000))","v":""},""]
[null,null,null,null,null,null,null,null,{"$f":"IF(A825=\"\",\"\",SUMIF(Dégusté_le!$B$2:$B$10000,\"=\" & A825,Dégusté_le!$C$2:$C$10000))","v":""},""]
[null,null,null,null,null,null,null,null,{"$f":"IF(A826=\"\",\"\",SUMIF(Dégusté_le!$B$2:$B$10000,\"=\" & A826,Dégusté_le!$C$2:$C$10000))","v":""},""]
[null,null,null,null,null,null,null,null,{"$f":"IF(A827=\"\",\"\",SUMIF(Dégusté_le!$B$2:$B$10000,\"=\" & A827,Dégusté_le!$C$2:$C$10000))","v":""},""]
[null,null,null,null,null,null,null,null,{"$f":"IF(A828=\"\",\"\",SUMIF(Dégusté_le!$B$2:$B$10000,\"=\" & A828,Dégusté_le!$C$2:$C$10000))","v":""},""]
[null,null,null,null,null,null,null,null,{"$f":"IF(A829=\"\",\"\",SUMIF(Dégusté_le!$B$2:$B$10000,\"=\" & A829,Dégusté_le!$C$2:$C$10000))","v":""},""]
[null,null,null,null,null,null,null,null,{"$f":"IF(A830=\"\",\"\",SUMIF(Dégusté_le!$B$2:$B$10000,\"=\" & A830,Dégusté_le!$C$2:$C$10000))","v":""},""]
[null,null,null,null,null,null,null,null,{"$f":"IF(A831=\"\",\"\",SUMIF(Dégusté_le!$B$2:$B$10000,\"=\" & A831,Dégusté_le!$C$2:$C$10000))","v":""},""]
[null,null,null,null,null,null,null,null,{"$f":"IF(A832=\"\",\"\",SUMIF(Dégusté_le!$B$2:$B$10000,\"=\" & A832,Dégusté_le!$C$2:$C$10000))","v":""},""]
[null,null,null,null,null,null,null,null,{"$f":"IF(A833=\"\",\"\",SUMIF(Dégusté_le!$B$2:$B$10000,\"=\" & A833,Dégusté_le!$C$2:$C$10000))","v":""},""]
[null,null,null,null,null,null,null,null,{"$f":"IF(A834=\"\",\"\",SUMIF(Dégusté_le!$B$2:$B$10000,\"=\" & A834,Dégusté_le!$C$2:$C$10000))","v":""},""]
[null,null,null,null,null,null,null,null,{"$f":"IF(A835=\"\",\"\",SUMIF(Dégusté_le!$B$2:$B$10000,\"=\" & A835,Dégusté_le!$C$2:$C$10000))","v":""},{"$f":"IF(A835>0,G835-I835,\"\")","v":""}]
[null,null,null,null,null,null,null,null,{"$f":"IF(A836=\"\",\"\",SUMIF(Dégusté_le!$B$2:$B$10000,\"=\" & A836,Dégusté_le!$C$2:$C$10000))","v":""},""]
[null,null,null,null,null,null,null,null,{"$f":"IF(A837=\"\",\"\",SUMIF(Dégusté_le!$B$2:$B$10000,\"=\" & A837,Dégusté_le!$C$2:$C$10000))","v":""},""]
[null,null,null,null,null,null,null,null,{"$f":"IF(A838=\"\",\"\",SUMIF(Dégusté_le!$B$2:$B$10000,\"=\" & A838,Dégusté_le!$C$2:$C$10000))","v":""},""]
[null,null,null,null,null,null,null,null,{"$f":"IF(A839=\"\",\"\",SUMIF(Dégusté_le!$B$2:$B$10000,\"=\" & A839,Dégusté_le!$C$2:$C$10000))","v":""},""]
[null,null,null,null,null,null,null,null,{"$f":"IF(A840=\"\",\"\",SUMIF(Dégusté_le!$B$2:$B$10000,\"=\" & A840,Dégusté_le!$C$2:$C$10000))","v":""},""]
[null,null,null,null,null,null,null,null,{"$f":"IF(A841=\"\",\"\",SUMIF(Dégusté_le!$B$2:$B$10000,\"=\" & A841,Dégusté_le!$C$2:$C$10000))","v":""},""]
[null,null,null,null,null,null,null,null,{"$f":"IF(A842=\"\",\"\",SUMIF(Dégusté_le!$B$2:$B$10000,\"=\" & A842,Dégusté_le!$C$2:$C$10000))","v":""},""]
[null,null,null,null,null,null,null,null,{"$f":"IF(A843=\"\",\"\",SUMIF(Dégusté_le!$B$2:$B$10000,\"=\" & A843,Dégusté_le!$C$2:$C$10000))","v":""},""]
[null,null,null,null,null,null,null,null,{"$f":"IF(A844=\"\",\"\",SUMIF(Dégusté_le!$B$2:$B$10000,\"=\" & A844,Dégusté_le!$C$2:$C$10000))","v":""},""]
[null,null,null,null,null,null,null,null,{"$f":"IF(A845=\"\",\"\",SUMIF(Dégusté_le!$B$2:$B$10000,\"=\" & A845,Dégusté_le!$C$2:$C$10000))","v":""},""]
[null,null,null,null,null,null,null,null,{"$f":"IF(A846=\"\",\"\",SUMIF(Dégusté_le!$B$2:$B$10000,\"=\" & A846,Dégusté_le!$C$2:$C$10000))","v":""},""]
[null,null,null,null,null,null,null,null,{"$f":"IF(A847=\"\",\"\",SUMIF(Dégusté_le!$B$2:$B$10000,\"=\" & A847,Dégusté_le!$C$2:$C$10000))","v":""},""]
[null,null,null,null,null,null,null,null,{"$f":"IF(A848=\"\",\"\",SUMIF(Dégusté_le!$B$2:$B$10000,\"=\" & A848,Dégusté_le!$C$2:$C$10000))","v":""},""]
[null,null,null,null,null,null,null,null,{"$f":"IF(A849=\"\",\"\",SUMIF(Dégusté_le!$B$2:$B$10000,\"=\" & A849,Dégusté_le!$C$2:$C$10000))","v":""},""]
[null,null,null,null,null,null,null,null,{"$f":"IF(A850=\"\",\"\",SUMIF(Dégusté_le!$B$2:$B$10000,\"=\" & A850,Dégusté_le!$C$2:$C$10000))","v":""},""]
[null,null,null,null,null,null,null,null,{"$f":"IF(A851=\"\",\"\",SUMIF(Dégusté_le!$B$2:$B$10000,\"=\" & A851,Dégusté_le!$C$2:$C$10000))","v":""},""]
[null,null,null,null,null,null,null,null,{"$f":"IF(A852=\"\",\"\",SUMIF(Dégusté_le!$B$2:$B$10000,\"=\" & A852,Dégusté_le!$C$2:$C$10000))","v":""},""]
[null,null,null,null,null,null,null,null,{"$f":"IF(A853=\"\",\"\",SUMIF(Dégusté_le!$B$2:$B$10000,\"=\" & A853,Dégusté_le!$C$2:$C$10000))","v":""},""]
[null,null,null,null,null,null,null,null,{"$f":"IF(A854=\"\",\"\",SUMIF(Dégusté_le!$B$2:$B$10000,\"=\" & A854,Dégusté_le!$C$2:$C$10000))","v":""},""]
[null,null,null,null,null,null,null,null,{"$f":"IF(A855=\"\",\"\",SUMIF(Dégusté_le!$B$2:$B$10000,\"=\" & A855,Dégusté_le!$C$2:$C$10000))","v":""},""]
[null,null,null,null,null,null,null,null,{"$f":"IF(A856=\"\",\"\",SUMIF(Dégusté_le!$B$2:$B$10000,\"=\" & A856,Dégusté_le!$C$2:$C$10000))","v":""},""]
[null,null,null,null,null,null,null,null,{"$f":"IF(A857=\"\",\"\",SUMIF(Dégusté_le!$B$2:$B$10000,\"=\" & A857,Dégusté_le!$C$2:$C$10000))","v":""},""]
[null,null,null,null,null,null,null,null,{"$f":"IF(A858=\"\",\"\",SUMIF(Dégusté_le!$B$2:$B$10000,\"=\" & A858,Dégusté_le!$C$2:$C$10000))","v":""},""]
[null,null,null,null,null,null,null,null,{"$f":"IF(A859=\"\",\"\",SUMIF(Dégusté_le!$B$2:$B$10000,\"=\" & A859,Dégusté_le!$C$2:$C$10000))","v":""},""]
[null,null,null,null,null,null,null,null,{"$f":"IF(A860=\"\",\"\",SUMIF(Dégusté_le!$B$2:$B$10000,\"=\" & A860,Dégusté_le!$C$2:$C$10000))","v":""},""]
[null,null,null,null,null,null,null,null,{"$f":"IF(A861=\"\",\"\",SUMIF(Dégusté_le!$B$2:$B$10000,\"=\" & A861,Dégusté_le!$C$2:$C$10000))","v":""},""]
[null,null,null,null,null,null,null,null,{"$f":"IF(A862=\"\",\"\",SUMIF(Dégusté_le!$B$2:$B$10000,\"=\" & A862,Dégusté_le!$C$2:$C$10000))","v":""},""]
[null,null,null,null,null,null,null,null,{"$f":"IF(A863=\"\",\"\",SUMIF(Dégusté_le!$B$2:$B$10000,\"=\" & A863,Dégusté_le!$C$2:$C$10000))","v":""},""]
[null,null,null,null,null,null,null,null,{"$f":"IF(A864=\"\",\"\",SUMIF(Dégusté_le!$B$2:$B$10000,\"=\" & A864,Dégusté_le!$C$2:$C$10000))","v":""},""]
[null,null,null,null,null,null,null,null,{"$f":"IF(A865=\"\",\"\",SUMIF(Dégusté_le!$B$2:$B$10000,\"=\" & A865,Dégusté_le!$C$2:$C$10000))","v":""},""]
[null,null,null,null,null,null,null,null,{"$f":"IF(A866=\"\",\"\",SUMIF(Dégusté_le!$B$2:$B$10000,\"=\" & A866,Dégusté_le!$C$2:$C$10000))","v":""},""]
[null,null,null,null,null,null,null,null,{"$f":"IF(A867=\"\",\"\",SUMIF(Dégusté_le!$B$2:$B$10000,\"=\" & A867,Dégusté_le!$C$2:$C$10000))","v":""},""]
[null,null,null,null,null,null,null,null,{"$f":"IF(A868=\"\",\"\",SUMIF(Dégusté_le!$B$2:$B$10000,\"=\" & A868,Dégusté_le!$C$2:$C$10000))","v":""},""]
[null,null,null,null,null,null,null,null,{"$f":"IF(A869=\"\",\"\",SUMIF(Dégusté_le!$B$2:$B$10000,\"=\" & A869,Dégusté_le!$C$2:$C$10000))","v":""},""]
[null,null,null,null,null,null,null,null,{"$f":"IF(A870=\"\",\"\",SUMIF(Dégusté_le!$B$2:$B$10000,\"=\" & A870,Dégusté_le!$C$2:$C$10000))","v":""},""]
[null,null,null,null,null,null,null,null,{"$f":"IF(A871=\"\",\"\",SUMIF(Dégusté_le!$B$2:$B$10000,\"=\" & A871,Dégusté_le!$C$2:$C$10000))","v":""},""]
[null,null,null,null,null,null,null,null,{"$f":"IF(A872=\"\",\"\",SUMIF(Dégusté_le!$B$2:$B$10000,\"=\" & A872,Dégusté_le!$C$2:$C$10000))","v":""},""]
[null,null,null,null,null,null,null,null,{"$f":"IF(A873=\"\",\"\",SUMIF(Dégusté_le!$B$2:$B$10000,\"=\" & A873,Dégusté_le!$C$2:$C$10000))","v":""},""]
[null,null,null,null,null,null,null,null,{"$f":"IF(A874=\"\",\"\",SUMIF(Dégusté_le!$B$2:$B$10000,\"=\" & A874,Dégusté_le!$C$2:$C$10000))","v":""},""]
[null,null,null,null,null,null,null,null,{"$f":"IF(A875=\"\",\"\",SUMIF(Dégusté_le!$B$2:$B$10000,\"=\" & A875,Dégusté_le!$C$2:$C$10000))","v":""},""]
[null,null,null,null,null,null,null,null,{"$f":"IF(A876=\"\",\"\",SUMIF(Dégusté_le!$B$2:$B$10000,\"=\" & A876,Dégusté_le!$C$2:$C$10000))","v":""},""]
[null,null,null,null,null,null,null,null,{"$f":"IF(A877=\"\",\"\",SUMIF(Dégusté_le!$B$2:$B$10000,\"=\" & A877,Dégusté_le!$C$2:$C$10000))","v":""},""]
[null,null,null,null,null,null,null,null,{"$f":"IF(A878=\"\",\"\",SUMIF(Dégusté_le!$B$2:$B$10000,\"=\" & A878,Dégusté_le!$C$2:$C$10000))","v":""},""]
[null,null,null,null,null,null,null,null,{"$f":"IF(A879=\"\",\"\",SUMIF(Dégusté_le!$B$2:$B$10000,\"=\" & A879,Dégusté_le!$C$2:$C$10000))","v":""},""]
[null,null,null,null,null,null,null,null,{"$f":"IF(A880=\"\",\"\",SUMIF(Dégusté_le!$B$2:$B$10000,\"=\" & A880,Dégusté_le!$C$2:$C$10000))","v":""},""]
[null,null,null,null,null,null,null,null,{"$f":"IF(A881=\"\",\"\",SUMIF(Dégusté_le!$B$2:$B$10000,\"=\" & A881,Dégusté_le!$C$2:$C$10000))","v":""},""]
[null,null,null,null,null,null,null,null,{"$f":"IF(A882=\"\",\"\",SUMIF(Dégusté_le!$B$2:$B$10000,\"=\" & A882,Dégusté_le!$C$2:$C$10000))","v":""},""]
[null,null,null,null,null,null,null,null,{"$f":"IF(A883=\"\",\"\",SUMIF(Dégusté_le!$B$2:$B$10000,\"=\" & A883,Dégusté_le!$C$2:$C$10000))","v":""},""]
[null,null,null,null,null,null,null,null,{"$f":"IF(A884=\"\",\"\",SUMIF(Dégusté_le!$B$2:$B$10000,\"=\" & A884,Dégusté_le!$C$2:$C$10000))","v":""},""]
[null,null,null,null,null,null,null,null,{"$f":"IF(A885=\"\",\"\",SUMIF(Dégusté_le!$B$2:$B$10000,\"=\" & A885,Dégusté_le!$C$2:$C$10000))","v":""},""]
[null,null,null,null,null,null,null,null,{"$f":"IF(A886=\"\",\"\",SUMIF(Dégusté_le!$B$2:$B$10000,\"=\" & A886,Dégusté_le!$C$2:$C$10000))","v":""},""]
[null,null,null,null,null,null,null,null,{"$f":"IF(A887=\"\",\"\",SUMIF(Dégusté_le!$B$2:$B$10000,\"=\" & A887,Dégusté_le!$C$2:$C$10000))","v":""},""]
[null,null,null,null,null,null,null,null,{"$f":"IF(A888=\"\",\"\",SUMIF(Dégusté_le!$B$2:$B$10000,\"=\" & A888,Dégusté_le!$C$2:$C$10000))","v":""},""]
[null,null,null,null,null,null,null,null,{"$f":"IF(A889=\"\",\"\",SUMIF(Dégusté_le!$B$2:$B$10000,\"=\" & A889,Dégusté_le!$C$2:$C$10000))","v":""},""]
[null,null,null,null,null,null,null,null,{"$f":"IF(A890=\"\",\"\",SUMIF(Dégusté_le!$B$2:$B$10000,\"=\" & A890,Dégusté_le!$C$2:$C$10000))","v":""},""]
[null,null,null,null,null,null,null,null,{"$f":"IF(A891=\"\",\"\",SUMIF(Dégusté_le!$B$2:$B$10000,\"=\" & A891,Dégusté_le!$C$2:$C$10000))","v":""},""]
[null,null,null,null,null,null,null,null,{"$f":"IF(A892=\"\",\"\",SUMIF(Dégusté_le!$B$2:$B$10000,\"=\" & A892,Dégusté_le!$C$2:$C$10000))","v":""},""]
[null,null,null,null,null,null,null,null,{"$f":"IF(A893=\"\",\"\",SUMIF(Dégusté_le!$B$2:$B$10000,\"=\" & A893,Dégusté_le!$C$2:$C$10000))","v":""},""]
[null,null,null,null,null,null,null,null,{"$f":"IF(A894=\"\",\"\",SUMIF(Dégusté_le!$B$2:$B$10000,\"=\" & A894,Dégusté_le!$C$2:$C$10000))","v":""},""]
[null,null,null,null,null,null,null,null,{"$f":"IF(A895=\"\",\"\",SUMIF(Dégusté_le!$B$2:$B$10000,\"=\" & A895,Dégusté_le!$C$2:$C$10000))","v":""},""]
[null,null,null,null,null,null,null,null,{"$f":"IF(A896=\"\",\"\",SUMIF(Dégusté_le!$B$2:$B$10000,\"=\" & A896,Dégusté_le!$C$2:$C$10000))","v":""},""]
[null,null,null,null,null,null,null,null,{"$f":"IF(A897=\"\",\"\",SUMIF(Dégusté_le!$B$2:$B$10000,\"=\" & A897,Dégusté_le!$C$2:$C$10000))","v":""},""]
[null,null,null,null,null,null,null,null,{"$f":"IF(A898=\"\",\"\",SUMIF(Dégusté_le!$B$2:$B$10000,\"=\" & A898,Dégusté_le!$C$2:$C$10000))","v":""},""]
[null,null,null,null,null,null,null,null,{"$f":"IF(A899=\"\",\"\",SUMIF(Dégusté_le!$B$2:$B$10000,\"=\" & A899,Dégusté_le!$C$2:$C$10000))","v":""},{"$f":"IF(A899>0,G899-I899,\"\")","v":""}]
[null,null,null,null,null,null,null,null,{"$f":"IF(A900=\"\",\"\",SUMIF(Dégusté_le!$B$2:$B$10000,\"=\" & A900,Dégusté_le!$C$2:$C$10000))","v":""},""]
[null,null,null,null,null,null,null,null,{"$f":"IF(A901=\"\",\"\",SUMIF(Dégusté_le!$B$2:$B$10000,\"=\" & A901,Dégusté_le!$C$2:$C$10000))","v":""},""]
[null,null,null,null,null,null,null,null,{"$f":"IF(A902=\"\",\"\",SUMIF(Dégusté_le!$B$2:$B$10000,\"=\" & A902,Dégusté_le!$C$2:$C$10000))","v":""},""]
[null,null,null,null,null,null,null,null,{"$f":"IF(A903=\"\",\"\",SUMIF(Dégusté_le!$B$2:$B$10000,\"=\" & A903,Dégusté_le!$C$2:$C$10000))","v":""},""]
[null,null,null,null,null,null,null,null,{"$f":"IF(A904=\"\",\"\",SUMIF(Dégusté_le!$B$2:$B$10000,\"=\" & A904,Dégusté_le!$C$2:$C$10000))","v":""},""]
[null,null,null,null,null,null,null,null,{"$f":"IF(A905=\"\",\"\",SUMIF(Dégusté_le!$B$2:$B$10000,\"=\" & A905,Dégusté_le!$C$2:$C$10000))","v":""},""]
[null,null,null,null,null,null,null,null,{"$f":"IF(A906=\"\",\"\",SUMIF(Dégusté_le!$B$2:$B$10000,\"=\" & A906,Dégusté_le!$C$2:$C$10000))","v":""},""]
[null,null,null,null,null,null,null,null,{"$f":"IF(A907=\"\",\"\",SUMIF(Dégusté_le!$B$2:$B$10000,\"=\" & A907,Dégusté_le!$C$2:$C$10000))","v":""},""]
[null,null,null,null,null,null,null,null,{"$f":"IF(A908=\"\",\"\",SUMIF(Dégusté_le!$B$2:$B$10000,\"=\" & A908,Dégusté_le!$C$2:$C$10000))","v":""},""]
[null,null,null,null,null,null,null,null,{"$f":"IF(A909=\"\",\"\",SUMIF(Dégusté_le!$B$2:$B$10000,\"=\" & A909,Dégusté_le!$C$2:$C$10000))","v":""},""]
[null,null,null,null,null,null,null,null,{"$f":"IF(A910=\"\",\"\",SUMIF(Dégusté_le!$B$2:$B$10000,\"=\" & A910,Dégusté_le!$C$2:$C$10000))","v":""},""]
[null,null,null,null,null,null,null,null,{"$f":"IF(A911=\"\",\"\",SUMIF(Dégusté_le!$B$2:$B$10000,\"=\" & A911,Dégusté_le!$C$2:$C$10000))","v":""},""]
[null,null,null,null,null,null,null,null,{"$f":"IF(A912=\"\",\"\",SUMIF(Dégusté_le!$B$2:$B$10000,\"=\" & A912,Dégusté_le!$C$2:$C$10000))","v":""},""]
[null,null,null,null,null,null,null,null,{"$f":"IF(A913=\"\",\"\",SUMIF(Dégusté_le!$B$2:$B$10000,\"=\" & A913,Dégusté_le!$C$2:$C$10000))","v":""},""]
[null,null,null,null,null,null,null,null,{"$f":"IF(A914=\"\",\"\",SUMIF(Dégusté_le!$B$2:$B$10000,\"=\" & A914,Dégusté_le!$C$2:$C$10000))","v":""},""]
[null,null,null,null,null,null,null,null,{"$f":"IF(A915=\"\",\"\",SUMIF(Dégusté_le!$B$2:$B$10000,\"=\" & A915,Dégusté_le!$C$2:$C$10000))","v":""},""]
[null,null,null,null,null,null,null,null,{"$f":"IF(A916=\"\",\"\",SUMIF(Dégusté_le!$B$2:$B$10000,\"=\" & A916,Dégusté_le!$C$2:$C$10000))","v":""},""]
[null,null,null,null,null,null,null,null,{"$f":"IF(A917=\"\",\"\",SUMIF(Dégusté_le!$B$2:$B$10000,\"=\" & A917,Dégusté_le!$C$2:$C$10000))","v":""},""]
[null,null,null,null,null,null,null,null,{"$f":"IF(A918=\"\",\"\",SUMIF(Dégusté_le!$B$2:$B$10000,\"=\" & A918,Dégusté_le!$C$2:$C$10000))","v":""},""]
[null,null,null,null,null,null,null,null,{"$f":"IF(A919=\"\",\"\",SUMIF(Dégusté_le!$B$2:$B$10000,\"=\" & A919,Dégusté_le!$C$2:$C$10000))","v":""},""]
[null,null,null,null,null,null,null,null,{"$f":"IF(A920=\"\",\"\",SUMIF(Dégusté_le!$B$2:$B$10000,\"=\" & A920,Dégusté_le!$C$2:$C$10000))","v":""},""]
[null,null,null,null,null,null,null,null,{"$f":"IF(A921=\"\",\"\",SUMIF(Dégusté_le!$B$2:$B$10000,\"=\" & A921,Dégusté_le!$C$2:$C$10000))","v":""},""]
[null,null,null,null,null,null,null,null,{"$f":"IF(A922=\"\",\"\",SUMIF(Dégusté_le!$B$2:$B$10000,\"=\" & A922,Dégusté_le!$C$2:$C$10000))","v":""},""]
[null,null,null,null,null,null,null,null,{"$f":"IF(A923=\"\",\"\",SUMIF(Dégusté_le!$B$2:$B$10000,\"=\" & A923,Dégusté_le!$C$2:$C$10000))","v":""},""]
[null,null,null,null,null,null,null,null,{"$f":"IF(A924=\"\",\"\",SUMIF(Dégusté_le!$B$2:$B$10000,\"=\" & A924,Dégusté_le!$C$2:$C$10000))","v":""},""]
[null,null,null,null,null,null,null,null,{"$f":"IF(A925=\"\",\"\",SUMIF(Dégusté_le!$B$2:$B$10000,\"=\" & A925,Dégusté_le!$C$2:$C$10000))","v":""},""]
[null,null,null,null,null,null,null,null,{"$f":"IF(A926=\"\",\"\",SUMIF(Dégusté_le!$B$2:$B$10000,\"=\" & A926,Dégusté_le!$C$2:$C$10000))","v":""},""]
[null,null,null,null,null,null,null,null,{"$f":"IF(A927=\"\",\"\",SUMIF(Dégusté_le!$B$2:$B$10000,\"=\" & A927,Dégusté_le!$C$2:$C$10000))","v":""},""]
[null,null,null,null,null,null,null,null,{"$f":"IF(A928=\"\",\"\",SUMIF(Dégusté_le!$B$2:$B$10000,\"=\" & A928,Dégusté_le!$C$2:$C$10000))","v":""},""]
[null,null,null,null,null,null,null,null,{"$f":"IF(A929=\"\",\"\",SUMIF(Dégusté_le!$B$2:$B$10000,\"=\" & A929,Dégusté_le!$C$2:$C$10000))","v":""},""]
[null,null,null,null,null,null,null,null,{"$f":"IF(A930=\"\",\"\",SUMIF(Dégusté_le!$B$2:$B$10000,\"=\" & A930,Dégusté_le!$C$2:$C$10000))","v":""},""]
[null,null,null,null,null,null,null,null,{"$f":"IF(A931=\"\",\"\",SUMIF(Dégusté_le!$B$2:$B$10000,\"=\" & A931,Dégusté_le!$C$2:$C$10000))","v":""},""]
[null,null,null,null,null,null,null,null,{"$f":"IF(A932=\"\",\"\",SUMIF(Dégusté_le!$B$2:$B$10000,\"=\" & A932,Dégusté_le!$C$2:$C$10000))","v":""},""]
[null,null,null,null,null,null,null,null,{"$f":"IF(A933=\"\",\"\",SUMIF(Dégusté_le!$B$2:$B$10000,\"=\" & A933,Dégusté_le!$C$2:$C$10000))","v":""},""]
[null,null,null,null,null,null,null,null,{"$f":"IF(A934=\"\",\"\",SUMIF(Dégusté_le!$B$2:$B$10000,\"=\" & A934,Dégusté_le!$C$2:$C$10000))","v":""},""]
[null,null,null,null,null,null,null,null,{"$f":"IF(A935=\"\",\"\",SUMIF(Dégusté_le!$B$2:$B$10000,\"=\" & A935,Dégusté_le!$C$2:$C$10000))","v":""},""]
[null,null,null,null,null,null,null,null,{"$f":"IF(A936=\"\",\"\",SUMIF(Dégusté_le!$B$2:$B$10000,\"=\" & A936,Dégusté_le!$C$2:$C$10000))","v":""},""]
[null,null,null,null,null,null,null,null,{"$f":"IF(A937=\"\",\"\",SUMIF(Dégusté_le!$B$2:$B$10000,\"=\" & A937,Dégusté_le!$C$2:$C$10000))","v":""},""]
[null,null,null,null,null,null,null,null,{"$f":"IF(A938=\"\",\"\",SUMIF(Dégusté_le!$B$2:$B$10000,\"=\" & A938,Dégusté_le!$C$2:$C$10000))","v":""},""]
[null,null,null,null,null,null,null,null,{"$f":"IF(A939=\"\",\"\",SUMIF(Dégusté_le!$B$2:$B$10000,\"=\" & A939,Dégusté_le!$C$2:$C$10000))","v":""},""]
[null,null,null,null,null,null,null,null,{"$f":"IF(A940=\"\",\"\",SUMIF(Dégusté_le!$B$2:$B$10000,\"=\" & A940,Dégusté_le!$C$2:$C$10000))","v":""},""]
[null,null,null,null,null,null,null,null,{"$f":"IF(A941=\"\",\"\",SUMIF(Dégusté_le!$B$2:$B$10000,\"=\" & A941,Dégusté_le!$C$2:$C$10000))","v":""},""]
[null,null,null,null,null,null,null,null,{"$f":"IF(A942=\"\",\"\",SUMIF(Dégusté_le!$B$2:$B$10000,\"=\" & A942,Dégusté_le!$C$2:$C$10000))","v":""},""]
[null,null,null,null,null,null,null,null,{"$f":"IF(A943=\"\",\"\",SUMIF(Dégusté_le!$B$2:$B$10000,\"=\" & A943,Dégusté_le!$C$2:$C$10000))","v":""},""]
[null,null,null,null,null,null,null,null,{"$f":"IF(A944=\"\",\"\",SUMIF(Dégusté_le!$B$2:$B$10000,\"=\" & A944,Dégusté_le!$C$2:$C$10000))","v":""},""]
[null,null,null,null,null,null,null,null,{"$f":"IF(A945=\"\",\"\",SUMIF(Dégusté_le!$B$2:$B$10000,\"=\" & A945,Dégusté_le!$C$2:$C$10000))","v":""},""]
[null,null,null,null,null,null,null,null,{"$f":"IF(A946=\"\",\"\",SUMIF(Dégusté_le!$B$2:$B$10000,\"=\" & A946,Dégusté_le!$C$2:$C$10000))","v":""},""]
[null,null,null,null,null,null,null,null,{"$f":"IF(A947=\"\",\"\",SUMIF(Dégusté_le!$B$2:$B$10000,\"=\" & A947,Dégusté_le!$C$2:$C$10000))","v":""},""]
[null,null,null,null,null,null,null,null,{"$f":"IF(A948=\"\",\"\",SUMIF(Dégusté_le!$B$2:$B$10000,\"=\" & A948,Dégusté_le!$C$2:$C$10000))","v":""},""]
[null,null,null,null,null,null,null,null,{"$f":"IF(A949=\"\",\"\",SUMIF(Dégusté_le!$B$2:$B$10000,\"=\" & A949,Dégusté_le!$C$2:$C$10000))","v":""},""]
[null,null,null,null,null,null,null,null,{"$f":"IF(A950=\"\",\"\",SUMIF(Dégusté_le!$B$2:$B$10000,\"=\" & A950,Dégusté_le!$C$2:$C$10000))","v":""},""]
[null,null,null,null,null,null,null,null,{"$f":"IF(A951=\"\",\"\",SUMIF(Dégusté_le!$B$2:$B$10000,\"=\" & A951,Dégusté_le!$C$2:$C$10000))","v":""},""]
[null,null,null,null,null,null,null,null,{"$f":"IF(A952=\"\",\"\",SUMIF(Dégusté_le!$B$2:$B$10000,\"=\" & A952,Dégusté_le!$C$2:$C$10000))","v":""},""]
[null,null,null,null,null,null,null,null,{"$f":"IF(A953=\"\",\"\",SUMIF(Dégusté_le!$B$2:$B$10000,\"=\" & A953,Dégusté_le!$C$2:$C$10000))","v":""},""]
[null,null,null,null,null,null,null,null,{"$f":"IF(A954=\"\",\"\",SUMIF(Dégusté_le!$B$2:$B$10000,\"=\" & A954,Dégusté_le!$C$2:$C$10000))","v":""},""]
[null,null,null,null,null,null,null,null,{"$f":"IF(A955=\"\",\"\",SUMIF(Dégusté_le!$B$2:$B$10000,\"=\" & A955,Dégusté_le!$C$2:$C$10000))","v":""},""]
[null,null,null,null,null,null,null,null,{"$f":"IF(A956=\"\",\"\",SUMIF(Dégusté_le!$B$2:$B$10000,\"=\" & A956,Dégusté_le!$C$2:$C$10000))","v":""},""]
[null,null,null,null,null,null,null,null,{"$f":"IF(A957=\"\",\"\",SUMIF(Dégusté_le!$B$2:$B$10000,\"=\" & A957,Dégusté_le!$C$2:$C$10000))","v":""},""]
[null,null,null,null,null,null,null,null,{"$f":"IF(A958=\"\",\"\",SUMIF(Dégusté_le!$B$2:$B$10000,\"=\" & A958,Dégusté_le!$C$2:$C$10000))","v":""},""]
[null,null,null,null,null,null,null,null,{"$f":"IF(A959=\"\",\"\",SUMIF(Dégusté_le!$B$2:$B$10000,\"=\" & A959,Dégusté_le!$C$2:$C$10000))","v":""},""]
[null,null,null,null,null,null,null,null,{"$f":"IF(A960=\"\",\"\",SUMIF(Dégusté_le!$B$2:$B$10000,\"=\" & A960,Dégusté_le!$C$2:$C$10000))","v":""},""]
[null,null,null,null,null,null,null,null,{"$f":"IF(A961=\"\",\"\",SUMIF(Dégusté_le!$B$2:$B$10000,\"=\" & A961,Dégusté_le!$C$2:$C$10000))","v":""},""]
[null,null,null,null,null,null,null,null,{"$f":"IF(A962=\"\",\"\",SUMIF(Dégusté_le!$B$2:$B$10000,\"=\" & A962,Dégusté_le!$C$2:$C$10000))","v":""},""]
[null,null,null,null,null,null,null,null,{"$f":"IF(A963=\"\",\"\",SUMIF(Dégusté_le!$B$2:$B$10000,\"=\" & A963,Dégusté_le!$C$2:$C$10000))","v":""},{"$f":"IF(A963>0,G963-I963,\"\")","v":""}]
[null,null,null,null,null,null,null,null,{"$f":"IF(A964=\"\",\"\",SUMIF(Dégusté_le!$B$2:$B$10000,\"=\" & A964,Dégusté_le!$C$2:$C$10000))","v":""},""]
[null,null,null,null,null,null,null,null,{"$f":"IF(A965=\"\",\"\",SUMIF(Dégusté_le!$B$2:$B$10000,\"=\" & A965,Dégusté_le!$C$2:$C$10000))","v":""},""]
[null,null,null,null,null,null,null,null,{"$f":"IF(A966=\"\",\"\",SUMIF(Dégusté_le!$B$2:$B$10000,\"=\" & A966,Dégusté_le!$C$2:$C$10000))","v":""},""]
[null,null,null,null,null,null,null,null,{"$f":"IF(A967=\"\",\"\",SUMIF(Dégusté_le!$B$2:$B$10000,\"=\" & A967,Dégusté_le!$C$2:$C$10000))","v":""},""]
[null,null,null,null,null,null,null,null,{"$f":"IF(A968=\"\",\"\",SUMIF(Dégusté_le!$B$2:$B$10000,\"=\" & A968,Dégusté_le!$C$2:$C$10000))","v":""},""]
[null,null,null,null,null,null,null,null,{"$f":"IF(A969=\"\",\"\",SUMIF(Dégusté_le!$B$2:$B$10000,\"=\" & A969,Dégusté_le!$C$2:$C$10000))","v":""},""]
[null,null,null,null,null,null,null,null,{"$f":"IF(A970=\"\",\"\",SUMIF(Dégusté_le!$B$2:$B$10000,\"=\" & A970,Dégusté_le!$C$2:$C$10000))","v":""},""]
[null,null,null,null,null,null,null,null,{"$f":"IF(A971=\"\",\"\",SUMIF(Dégusté_le!$B$2:$B$10000,\"=\" & A971,Dégusté_le!$C$2:$C$10000))","v":""},""]
[null,null,null,null,null,null,null,null,{"$f":"IF(A972=\"\",\"\",SUMIF(Dégusté_le!$B$2:$B$10000,\"=\" & A972,Dégusté_le!$C$2:$C$10000))","v":""},""]
[null,null,null,null,null,null,null,null,{"$f":"IF(A973=\"\",\"\",SUMIF(Dégusté_le!$B$2:$B$10000,\"=\" & A973,Dégusté_le!$C$2:$C$10000))","v":""},""]
[null,null,null,null,null,null,null,null,{"$f":"IF(A974=\"\",\"\",SUMIF(Dégusté_le!$B$2:$B$10000,\"=\" & A974,Dégusté_le!$C$2:$C$10000))","v":""},""]
[null,null,null,null,null,null,null,null,{"$f":"IF(A975=\"\",\"\",SUMIF(Dégusté_le!$B$2:$B$10000,\"=\" & A975,Dégusté_le!$C$2:$C$10000))","v":""},""]
[null,null,null,null,null,null,null,null,{"$f":"IF(A976=\"\",\"\",SUMIF(Dégusté_le!$B$2:$B$10000,\"=\" & A976,Dégusté_le!$C$2:$C$10000))","v":""},""]
[null,null,null,null,null,null,null,null,{"$f":"IF(A977=\"\",\"\",SUMIF(Dégusté_le!$B$2:$B$10000,\"=\" & A977,Dégusté_le!$C$2:$C$10000))","v":""},""]
[null,null,null,null,null,null,null,null,{"$f":"IF(A978=\"\",\"\",SUMIF(Dégusté_le!$B$2:$B$10000,\"=\" & A978,Dégusté_le!$C$2:$C$10000))","v":""},""]
[null,null,null,null,null,null,null,null,{"$f":"IF(A979=\"\",\"\",SUMIF(Dégusté_le!$B$2:$B$10000,\"=\" & A979,Dégusté_le!$C$2:$C$10000))","v":""},""]
[null,null,null,null,null,null,null,null,{"$f":"IF(A980=\"\",\"\",SUMIF(Dégusté_le!$B$2:$B$10000,\"=\" & A980,Dégusté_le!$C$2:$C$10000))","v":""},""]
[null,null,null,null,null,null,null,null,{"$f":"IF(A981=\"\",\"\",SUMIF(Dégusté_le!$B$2:$B$10000,\"=\" & A981,Dégusté_le!$C$2:$C$10000))","v":""},""]
[null,null,null,null,null,null,null,null,{"$f":"IF(A982=\"\",\"\",SUMIF(Dégusté_le!$B$2:$B$10000,\"=\" & A982,Dégusté_le!$C$2:$C$10000))","v":""},""]
[null,null,null,null,null,null,null,null,{"$f":"IF(A983=\"\",\"\",SUMIF(Dégusté_le!$B$2:$B$10000,\"=\" & A983,Dégusté_le!$C$2:$C$10000))","v":""},""]
[null,null,null,null,null,null,null,null,{"$f":"IF(A984=\"\",\"\",SUMIF(Dégusté_le!$B$2:$B$10000,\"=\" & A984,Dégusté_le!$C$2:$C$10000))","v":""},""]
[null,null,null,null,null,null,null,null,{"$f":"IF(A985=\"\",\"\",SUMIF(Dégusté_le!$B$2:$B$10000,\"=\" & A985,Dégusté_le!$C$2:$C$10000))","v":""},""]
[null,null,null,null,null,null,null,null,{"$f":"IF(A986=\"\",\"\",SUMIF(Dégusté_le!$B$2:$B$10000,\"=\" & A986,Dégusté_le!$C$2:$C$10000))","v":""},""]
[null,null,null,null,null,null,null,null,{"$f":"IF(A987=\"\",\"\",SUMIF(Dégusté_le!$B$2:$B$10000,\"=\" & A987,Dégusté_le!$C$2:$C$10000))","v":""},""]
[null,null,null,null,null,null,null,null,{"$f":"IF(A988=\"\",\"\",SUMIF(Dégusté_le!$B$2:$B$10000,\"=\" & A988,Dégusté_le!$C$2:$C$10000))","v":""},""]
[null,null,null,null,null,null,null,null,{"$f":"IF(A989=\"\",\"\",SUMIF(Dégusté_le!$B$2:$B$10000,\"=\" & A989,Dégusté_le!$C$2:$C$10000))","v":""},""]
[null,null,null,null,null,null,null,null,{"$f":"IF(A990=\"\",\"\",SUMIF(Dégusté_le!$B$2:$B$10000,\"=\" & A990,Dégusté_le!$C$2:$C$10000))","v":""},""]
[null,null,null,null,null,null,null,null,{"$f":"IF(A991=\"\",\"\",SUMIF(Dégusté_le!$B$2:$B$10000,\"=\" & A991,Dégusté_le!$C$2:$C$10000))","v":""},""]
[null,null,null,null,null,null,null,null,{"$f":"IF(A992=\"\",\"\",SUMIF(Dégusté_le!$B$2:$B$10000,\"=\" & A992,Dégusté_le!$C$2:$C$10000))","v":""},""]
[null,null,null,null,null,null,null,null,{"$f":"IF(A993=\"\",\"\",SUMIF(Dégusté_le!$B$2:$B$10000,\"=\" & A993,Dégusté_le!$C$2:$C$10000))","v":""},""]
[null,null,null,null,null,null,null,null,{"$f":"IF(A994=\"\",\"\",SUMIF(Dégusté_le!$B$2:$B$10000,\"=\" & A994,Dégusté_le!$C$2:$C$10000))","v":""},""]
[null,null,null,null,null,null,null,null,{"$f":"IF(A995=\"\",\"\",SUMIF(Dégusté_le!$B$2:$B$10000,\"=\" & A995,Dégusté_le!$C$2:$C$10000))","v":""},""]
[null,null,null,null,null,null,null,null,{"$f":"IF(A996=\"\",\"\",SUMIF(Dégusté_le!$B$2:$B$10000,\"=\" & A996,Dégusté_le!$C$2:$C$10000))","v":""},""]
[null,null,null,null,null,null,null,null,{"$f":"IF(A997=\"\",\"\",SUMIF(Dégusté_le!$B$2:$B$10000,\"=\" & A997,Dégusté_le!$C$2:$C$10000))","v":""},""]
[null,null,null,null,null,null,null,null,{"$f":"IF(A998=\"\",\"\",SUMIF(Dégusté_le!$B$2:$B$10000,\"=\" & A998,Dégusté_le!$C$2:$C$10000))","v":""},""]
[null,null,null,null,null,null,null,null,{"$f":"IF(A999=\"\",\"\",SUMIF(Dégusté_le!$B$2:$B$10000,\"=\" & A999,Dégusté_le!$C$2:$C$10000))","v":""},""]
[null,null,null,null,null,null,null,null,{"$f":"IF(A1000=\"\",\"\",SUMIF(Dégusté_le!$B$2:$B$10000,\"=\" & A1000,Dégusté_le!$C$2:$C$10000))","v":""},""]

{"sheet":"Plan_de_Cave","index":1,"n_rows":34,"n_cols":33,"rows_kept":34,"cut":false,"hidden":false,"merged":[[27,10,27,11],[28,10,28,11],[28,0,30,0],[23,15,23,16],[21,13,21,14],[21,15,21,16],[21,17,21,18],[26,3,26,5],[28,3,30,3],[17,0,23,0],[22,3,22,4],[21,2,21,3],[18,12,18,13],[18,14,18,15],[21,19,21,20],[22,12,22,13],[22,14,22,15],[19,6,19,7],[19,8,19,9],[19,13,19,14],[26,12,26,14],[26,15,26,17],[26,18,26,20],[22,5,22,6],[22,7,22,8],[22,9,22,10],[21,4,21,5],[21,6,21,7],[21,8,21,9],[20,3,20,4],[20,9,20,10],[20,14,20,15],[20,16,20,17],[20,18,20,19],[20,5,20,6],[20,7,20,8],[20,12,20,13],[11,13,11,14],[11,15,11,16],[11,17,11,18],[11,19,11,20],[25,0,26,0],[22,16,22,17],[22,18,22,19],[23,2,23,3],[23,4,23,5],[23,6,23,7],[23,8,23,9],[23,13,23,14],[23,17,23,18],[23,19,23,20],[25,5,25,6],[25,8,25,9],[25,11,25,12],[25,14,25,15],[25,17,25,18],[26,6,26,8],[26,9,26,11],[18,18,18,19],[19,2,19,3],[19,4,19,5],[16,2,16,10],[19,17,19,18],[19,19,19,20],[18,3,18,4],[18,5,18,6],[18,7,18,8],[18,9,18,10],[19,15,19,16],[18,16,18,17],[17,13,17,14],[17,15,17,16],[17,17,17,18],[17,19,17,20],[17,2,17,3],[17,4,17,5],[17,6,17,7],[17,8,17,9],[14,3,14,4],[14,5,14,6],[14,7,14,8],[14,9,14,10],[14,12,14,13],[14,14,14,15],[14,16,14,17],[14,18,14,19],[15,2,15,3],[15,4,15,5],[15,6,15,7],[15,8,15,9],[15,13,15,14],[15,15,15,16],[15,17,15,18],[15,19,15,20],[9,2,9,3],[10,2,10,10],[10,12,10,20],[11,0,15,0],[11,2,11,3],[11,4,11,5],[11,6,11,7],[11,8,11,9],[12,3,12,4],[12,5,12,6],[12,7,12,8],[12,9,12,10],[12,12,12,13],[12,14,12,15],[12,16,12,17],[12,18,12,19],[13,2,13,3],[13,4,13,5],[13,6,13,7],[13,8,13,9],[13,13,13,14],[13,15,13,16],[13,17,13,18],[13,19,13,20],[4,19,4,20],[8,12,8,13],[8,14,8,15],[2,23,2,24],[3,3,3,4],[3,5,3,6],[3,7,3,8],[3,9,3,10],[3,12,3,13],[3,14,3,15],[3,16,3,17],[3,18,3,19],[2,17,2,18],[2,19,2,20],[7,4,7,5],[7,6,7,7],[7,8,7,9],[7,13,7,14],[7,15,7,16],[7,17,7,18],[8,16,8,17],[8,18,8,19],[2,0,4,0],[2,2,2,3],[2,4,2,5],[2,6,2,7],[2,8,2,9],[2,13,2,14],[2,15,2,16],[6,0,9,0],[6,3,6,4],[6,5,6,6],[6,7,6,8],[6,9,6,10],[6,12,6,13],[6,14,6,15],[6,16,6,17],[5,2,5,3],[5,4,5,5],[5,6,5,7],[5,8,5,9],[5,13,5,14],[5,15,5,16],[7,2,7,3],[4,2,4,3],[4,4,4,5],[0,2,0,10],[0,12,0,20],[1,2,1,10],[1,12,1,20],[5,17,5,18],[5,19,5,20],[6,18,6,19],[7,19,7,20],[9,4,9,5],[9,6,9,7],[9,8,9,9],[9,13,9,14],[9,15,9,16],[9,17,9,18],[9,19,9,20],[8,3,8,4],[8,5,8,6],[8,7,8,8],[8,9,8,10],[4,6,4,7],[4,8,4,9],[4,13,4,14],[4,15,4,16],[4,17,4,18],[43,5,43,6],[43,7,43,8],[43,9,43,10],[37,5,37,6],[37,7,37,8],[37,9,37,10],[37,11,37,12],[39,5,39,6],[39,7,39,8],[39,9,39,10],[39,11,39,12],[33,24,33,25],[47,5,47,6],[47,7,47,8],[47,9,47,10],[47,11,47,12],[31,4,31,5],[31,7,31,8],[45,5,45,6],[45,7,45,8],[45,9,45,10],[45,11,45,12],[46,4,46,5],[46,6,46,7],[46,8,46,9],[46,10,46,11],[41,3,41,4],[41,5,41,6],[41,7,41,8],[41,9,41,10],[42,4,42,5],[42,6,42,7],[42,8,42,9],[42,10,42,11],[43,3,43,4]]}
[null,null,"AU FOND",null,null,null,null,null,null,null,null,null,"DEVANT",null,null,null,null,null,null,null,null,null,null,"Rouge","Blanc","Total"]
[null,null,null,null,null,null,null,null,null,null,null,null,null,null,null,null,null,null,null,null,null,null,null,{"$f":"#REF!","v":{"$error":"#REF!"}},{"$f":"#REF!","v":{"$error":"#REF!"}},{"$f":"SUM(X2:Y2)","v":{"$error":"#REF!"}}]
["ETAGERE 1",null,"R47",null,"R47",null,"R47",null,"R46",null,null,null,null,"R17",null,"R17",null,"R17",null,"R17"]
[null,null,null,"R46",null,"R46",null,"R46",null,"R46",null,null,null,null,"R40",null,"R37",null,"R39"]
[null,null,"R48",null,"R48",null,"R48",null,"R46",null,null,null,null,"R40",null,"R40",null,"R40",null,"R40"]
[]
["ETAGERE 2"]
[null,null,"R21",null,"R39",null,"R39",null,"R39",null,null,null,null,"R38"]
[null,null,null,"R37",null,"R28",null,"R21",null,"R21",null,null,"R38",null,"R38",null,"R38",null,"R38"]
[null,null,"R37",null,"R37",null,null,null,null,null,null,null,null,"R38",null,"R38",null,"R38",null,"R38"]
[null,null,null,null,null,null,null,null,null,null,null,null,null,null,null,null,null,null,null,null,null,null,null,null,null,null,null,null,1]
["ETAGERE 3",null,"R49",null,null,null,null,null,null,null,null,null,null,null,null,null,null,null,null,null,null,null,null,null,null,null,null,null,{"$f":"AC11-AC13","v":0.34355828220858897}]
[null,null,null,"R7",null,"R16",null,null,null,"R49",null,null,null,null,"R49",null,null,null,null,null,null,null,null,null,null,null,null,null,{"$f":"AE14","v":0.65644171779141103}]
[null,null,null,null,"R10",null,null,null,null,null,null,null,null,"R15",null,null,null,null,null,"R45",null,null,null,null,null,null,null,null,null,null,{"$f":"Y18/Y22","v":0.65644171779141103},null,{"$f":"100%-AE14","v":0.34355828220858897}]
[null,null,null,"R29",null,"R29",null,"R10",null,"R39"]
[null,null,"R11",null,"R32",null,null,null,"R29",null,null,null,null,"R49",null,"R49",null,"R49",null,"R6"]
[]
["ETAGERE 4",null,"B25",null,"B25",null,null,null,"B25",null,null,null,null,null,null,null,null,null,null,null,null,null,null,"Nombre d'emplacements occupés:",{"$f":"COUNTA(C3:U27)","v":107},null,null,null,"Vert",33]
[null,null,null,"B19",null,"B25",null,"B25",null,"B25",null,null,"B24",null,"B24",null,"B24",null,"B24",null,null,null,null,null,null,null,null,null,"Orange",33]
[null,null,null,null,"B13",null,"B13",null,"B13",null,null,null,null,"B24",null,"B20",null,"B24",null,null,null,null,null,"Nombre d'emplacements libres:",{"$f":"Y22-Y18","v":56},null,null,null,"Rouge",33]
[null,null,null,"B8",null,"B8",null,"B8",null,"B8",null,null,"B8",null,"B17",null,null,null,null,null,null,null,null,null,null,null,null,null,"Invisible",{"$f":"SUM(AD18:AD20)","v":99}]
[null,null,"B12",null,"B12",null,"B12",null,"B12",null,null,null,null,"B17",null,"B17",null,"B17",null,"B17",null,null,null,"Nombre total d'emplacements:",{"$f":"12+12+16+16+20+20+28+28+11","v":163}]
[null,null,null,"B10",null,"B10",null,"B10",null,null,null,null,"B10",null,"B12",null,null,null,"B9",null,null,null,null,null,null,null,null,null,"Valeur aiguille",{"$f":"AE14*100","v":65.644171779141104}]
[null,null,"B21",null,"B21",null,"B21",null,"B21",null,null,null,null,null,null,null,null,null,null,null,null,null,null,"Nombre total de bouteilles",{"$f":"Y18+D29+D33","v":123},null,null,null,"Largeur aiguille",1.5]
[null,null,null,null,null,null,null,null,null,null,null,null,null,null,null,null,null,null,null,null,null,null,"En haut","Rouges meilleurs crus",null,null,null,null,"Invisible",{"$f":"SUM(AD18:AD21)-(AD24+AD23)","v":130.85582822085888}]
["ETAGERE 5",null,null,null,null,"B26",null,null,"B26",null,null,null,null,null,null,null,null,null,null,null,null,null,"Milieu","Rouges et rosés"]
[null,null,null,"B23",null,null,"B23",null,null,"B23",null,null,null,null,null,null,null,null,null,null,null,null,"En bas","Blancs",null,null,null,null,"Rien"]
[null,null,null,null,null,null,null,null,null,null,null,null,null,null,null,null,null,null,null,null,null,null,null,null,null,null,null,null,"Aiguille",{"$f":"AD23","v":65.644171779141104}]
["MAISON",null,null,{"$f":"COUNTA(E29:U31)","v":8},"B23","B23",null,null,null,null,null,null,null,null,null,null,null,null,null,null,null,null,null,null,null,null,null,null,"Rien"]
[null,null,null,null,"B27","B27","B27","B27","B27"]
[null,null,null,null,"R50"]
[]
["GARAGE",null,null,{"$f":"COUNTA(E33:U37)","v":8},"B23","B23"]
[null,null,null,null,"B27","B27","B27","B27","B27","B27"]

{"sheet":"Dégusté_le","index":2,"n_rows":216,"n_cols":4,"rows_kept":216,"cut":false,"hidden":false,"merged":[]}
["Date","Millésime","Nombre","Remarque"]
["2019-11-09","Au Bas de Poillange 2018",1]
["2019-11-23","Vranken Demoiselle",1,"Cadeau à Christian"]
["2019-12-14","Vranken Demoiselle",1]
["2019-12-24","Naudé-22",1,"Cadeau à Valérie et Serge"]
["2019-12-25","Chateau de Meursault",1,"Réveillon avec les enfants"]
["2019-12-31","Naudé",1,"Réveillon Alizée"]
["2019-12-31","Naudé",2,"Réveillon à la maison"]
["2019-12-31","Aux Ravioles 2017",1,"Réveillon à la maison"]
["2019-12-31","Confidences Prieuré Lichine 2015",1,"Réveillon à la maison"]
["2019-12-31","La Toppe au Vert 2017",1,"Réveillon à la maison"]
["2019-12-31","Chassagne Montrachet 2017",1,"Réveillon à la maison"]
["2020-01-25","Vranken Demoiselle",1,"Nous 2"]
["2020-02-17","Naudé",1,"Repas avec JC et Michelle"]
["2020-03-19","Les Gréchons 2018",1,"Nous 4"]
["2020-06-02","Les Gréchons 2017",1,"Anniversaire Marie"]
["2020-06-17","Naudé",1,"Achat du GLC"]
["2020-06-25","Rully 1er Cru Les Crêts 2018",2,"Repas avec Claude et Corinne"]
["2020-06-25","Naudé",1,"Repas avec Claude et Corinne"]
["2020-07-07","Naudé",1,"Clôture cours de tennis Sophie"]
["2020-07-19","Rully 1er Cru Les Crêts 2018",1,"Repas avec Ronan et Gaëlle"]
["2020-07-24","Naudé",1,"Repas d'Alizée chez les parents de Lucas"]
["2020-08-01","Rully 1er Cru La Pucelle 2018",1,"Homard avec Marie"]
["2020-10-19","Naudé",1,"Ormeaux chez Ronan"]
["2020-11-08","Lyseras 2017",1,"Repas à la maison avec Alizée et Lucas"]
["2020-11-21","Arpège 2011",1,"Repas à la maison avec Alizée et Lucas"]
["2020-12-20","Quintaine 2017",1,"Repas"]
["2020-12-24","Domaine Capitain 2013",1,"Réveillon de Noël"]
["2020-12-24","Naudé",3,"Réveillon de Noël"]
["2020-12-24","Quintaine 2017",2,"Réveillon de Noël"]
["2020-12-31","Arpège 2011",1,"Réveillon 31 avec Marie et Anthony"]
["2020-12-31","Haut Nouchet 2013",1,"Réveillon 31 avec Marie et Anthony"]
["2020-12-31","Naudé",2,"Réveillon 31 avec Marie et Anthony"]
["2020-12-31","Quintaine 2017",1,"Réveillon 31 avec Marie et Anthony"]
["2021-02-19","Quintaine 2017",2,"Diner nous 6"]
["2021-03-03","Quintaine 2017",1,"Anniversaire Gérard"]
["2021-03-07","La Toppe au Vert 2017",2,"Repas avec les 4 Guillou, Christian, Pascale et Patrick"]
["2021-04-03","Ronan By Client 2012",1,"Nous 2"]
["2021-04-05","Naudé",1,"Brunch avec Alizée et Lucas"]
["2021-04-17","Château Montlabert",1,"Dégustation nous 2"]
["2021-04-21","Naudé-22",1,"Nous 2 avec Alizée"]
["2021-05-06","Quintaine 2017",1,"Nous 2, Marie et Anthony, Alizée"]
["2021-05-09","Château Montlabert",1,"Brunch nous 6"]
["2021-05-09","Pagus Luminis Condrieu 2015",1,"Brunch nous 6"]
["2021-05-18","Ronan By Client 2012",1,"Cadeau à Patrick (70 ans)"]
["2021-06-17","Givry 1er cru Clos du Cellier aux Moines 2016",2,"Repas avec Michelle, Martine, JC et Lionel"]
["2021-06-17","Naudé-22",2,"Repas avec Michelle, Martine, JC et Lionel"]
["2021-06-22","Quintaine 2017",1,"Anniversaire de mariage"]
["2021-07-13","Pagus Luminis Condrieu 2015",1,"Homards avec Marie, Anthony et Alizée"]
["2021-07-16","Les Coteaux d'Albret",4,"Divers"]
["2021-08-01","Quintaine 2017",1,"Envie de Sophie"]
["2021-08-05","Château Montlabert",1,"Repas avec Claude et Corinne"]
["2021-08-05","Sarget de Gruaud Larose",1,"Repas avec Claude et Corinne"]
["2021-08-05","Connétable TALBOT St Julien 2006",1,"Repas avec Claude et Corinne"]
["2021-08-05","Quintaine 2017",1,"Repas avec Claude et Corinne"]
["2021-08-24","Château Siaurac 2014",2,"Repas avec les parents de Lucas, Marie, Anthony, Alizée et Lucas"]
["2021-08-24","Naudé-22",2,"Repas avec les parents de Lucas, Marie, Anthony, Alizée et Lucas"]
["2021-09-15","Les Coteaux d'Albret",1,"Nous 2"]
["2021-10-06","Ermitage 2020",1,"Dégustation avec Alizée et Lucas"]
["2021-10-04","Les Coteaux d'Albret",2,"Nous"]
["2021-10-09","Auxey-Duresses Louis Jadot 2017",2,"Dégustation nous 2"]
["2021-10-12","Auxey-Duresses Louis Jadot 2017",1,"Repas avec Arzel"]
["2021-10-12","Ronan By Client 2012",1,"Repas avec Arzel"]
["2021-10-12","Ermitage 2020",1,"Repas avec Arzel"]
["2021-10-14","Ermitage 2020",1,"Nous"]
["2021-10-15","Quintaine 2017",1,"Nous, Marie, Anthony et Alizée"]
["2021-10-17","Ermitage 2020",1,"Nous 6"]
["2021-10-18","Château Nénine 2014",2,"Nous 2"]
["2021-10-23","Ermitage 2020",1,"Nous 2"]
["2021-10-29","Les Coteaux d'Albret",1,"Nous 2"]
["2021-11-01","Pauillac 2013",1,"Brunch avec les Guillou, Alizée et Lucas"]
["2021-11-01","Les Coteaux d'Albret",2,"Brunch avec les Guillou, Alizée et Lucas"]
["2021-11-05","Bellissima",1,"Dîner avec Ronan et Gaëlle"]
["2021-11-06","Château Nénine 2014",1,"Nous 2"]
["2021-11-09","Ermitage 2020",1,"Dégustation avec Alizée et Lucas"]
["2021-11-10","Ermitage 2020",1,"Nous"]
["2021-11-10","Les Coteaux d'Albret",7,"Nous 2"]
["2021-11-12","Auxey-Duresses Louis Jadot 2017",3,"Nous 2"]
["2021-11-12","Ermitage 2020",1,"Nous 2"]
["2021-11-15","Les Coteaux d'Albret",1,"Arrosage de la Tesla"]
["2021-11-16","Ermitage 2020",1,"Raclette avec Alizée et Lucas"]
["2021-11-18","Ermitage 2020",1,"Nous 2"]
["2021-11-24","Ermitage 2020",1,"Raclette avec Alizée et Lucas"]
["2021-11-27","Ermitage 2020",1,"Nous 2"]
["2021-11-28","Les Coteaux d'Albret",2,"Nous 2"]
["2021-11-30","Ermitage 2020",1,"Nous 2"]
["2021-12-01","Ronan By Client 2012",1,"Repas avec Jean Charles et Michelle"]
["2021-12-01","Quintaine 2017",2,"Repas avec Jean Charles et Michelle"]
["2021-12-01","Les Coteaux d'Albret",1,"Repas avec Jean Charles et Michelle"]
["2021-12-04","Ronan By Client 2012",1,"Avec Marie et Anthony à Paris"]
["2021-12-04","Quintaine 2017",2,"Avec Marie et Anthony à Paris"]
["2021-12-04","VRANKEN Diamant",1,"Avec Marie et Anthony à Paris"]
["2021-12-10","Ermitage 2020",1,"Nous 2"]
["2021-12-16","Ermitage 2020",8,"Nous 2 avec Alizée et Lucas"]
["2021-12-17","St Joseph 2017",1,"Repas avec Martine et Lionel"]
["2021-12-17","Quintaine 2017",1,"Repas avec Martine et Lionel"]
["2021-12-18","Ermitage 2020",1,"Nous 2"]
["2021-12-20","Ermitage 2020",1,"Nous 2"]
["2021-12-23","Les Coteaux d'Albret",2,"Nous 2 avec Marion"]
["2021-12-25","Domaine Augustin 2016",1,"Réveillon de Noël"]
["2021-12-25","VRANKEN Demoiselle",1,"Réveillon de Noël"]
["2021-12-22","Naudé-22",7,"Nous 6"]
["2021-12-27","Chassagne Montrachet 2015",1,"Baeckoffe nous 6"]
["2021-12-27","VRANKEN Demoiselle",1,"Baeckoffe nous 6"]
["2022-01-01","Confidences Prieuré Lichine 2015",1,"Réveillon du 1er avec Marie et Anthony"]
["2022-01-01","Chassagne Montrachet 2017",1,"Réveillon du 1er avec Marie et Anthony"]
["2022-01-02","Quintaine 2017",3,"Cadeau à Marie et Anthony"]
["2022-01-16","Château Lafleur 2011",1,"Galette avec Jean Charles, Michelle, Lionel, Martine et Chantal"]
["2022-01-16","Les Coteaux d'Albret",1,"Nous 2"]
["2022-02-13","Domaine de Suremain 2015",1,"Nous 2 avec Marie, Alizée et Lucas"]
["2022-03-01","Quintaine 2017",1,"Repas avec Claude et Corinne"]
["2022-03-01","St Estèphe 2015",1,"Repas avec Claude et Corinne"]
["2022-03-16","Quintaine 2017",1,"Nous 2 avec Alizée et Lucas"]
["2022-03-23","Domaine de Valmoissine",1,"Nous 2 avec Alizée et Lucas"]
["2022-03-27","Givry 1er cru Clos du Cellier aux Moines 2016",1,"Nous 2"]
["2022-04-01","Moulins de Citran Haut Médoc 2009",1,"Repas avec Chantal et René Hillion"]
["2022-04-01","Quintaine 2017",1,"Repas avec Chantal et René Hillion"]
["2022-04-03","Givry 1er cru Servoisine 2016",1,"Nous 2"]
["2022-04-09","Côte Rôtie Madinière 2016",1,"Repas avec les Guillou et Marion"]
["2022-04-10","Château Nénine 2014",3,"Nous 2"]
["2022-04-17","Château Cassagne Haut Canon 2010",1,"Nous 2 avec Alizée et Lucas"]
["2022-04-30","Quintaine 2017",1,"Nous 2, Marie et Anthony"]
["2022-04-30","Domaine FERRET 2017",1,"Nous 6"]
["2022-05-01","Givry 1er cru Servoisine 2016",1,"Nous 6"]
["2022-05-07","La Chapelle Haut Nouchet 2016",1,"Repas avec Fred et Béa"]
["2022-05-07","Etoile by Haut Nouchet blanc 2020",1,"Repas avec Fred et Béa"]
["2022-05-15","Château Cassagne Haut Canon 2010",1,"Repas à la maison avec Alizée et Lucas"]
["2022-05-15","Chablis 1er cru 2016",1,"Repas nous 2"]
["2022-05-15","Quintaine 2018",2,"Repas à la maison avec Alizée et Lucas"]
["2022-05-20","Riesling 2018",1,"Repas nous 2"]
["2022-05-22","La Chapelle Haut Nouchet 2016",1,"Nous 6"]
["2022-05-25","Château La Peyre 2015",2,"Nous 2 avec Marie, Alizée et Lucas"]
["2022-05-25","S de Schlumberger 2022",2,"Nous 2 avec Marie, Alizée et Lucas"]
["2022-05-27","S de Schlumberger 2022",2,"Nous 2 avec Marie"]
["2022-05-29","Givry 1er cru Servoisine 2016",1,"Nous 2 avec Marie"]
["2022-05-30","S de Schlumberger 2022",2,"Sophie chez Marie et Anthony"]
["2022-06-01","S de Schlumberger 2022",2,"Nous 2"]
["2022-06-05","La Chapelle Haut Nouchet 2016",1,"Nous 2 avec Alizée et Lucas"]
["2022-06-06","La Chapelle Haut Nouchet 2016",1,"Nous 2 avec Alizée et Lucas"]
["2022-06-07","Etoile by Haut Nouchet blanc 2020",1,"Nous 2"]
["2022-06-09","S de Schlumberger 2022",1,"Nous 2"]
["2022-06-12","La Chapelle Haut Nouchet 2016",1,"Nous 2"]
["2022-06-13","Quintaine 2018",2,"Nous 2 avec Alizée et Lucas"]
["2022-06-14","S de Schlumberger 2022",1,"Cadeau à Claude et Corinne"]
["2022-06-19","La Chapelle Haut Nouchet 2016",1,"Nous 2,Alizée et Lucas, Valérie, Serge, Marion"]
["2022-06-19","Naudé-22",1,"Nous 2,Alizée et Lucas, Valérie, Serge, Marion"]
["2022-06-22","S de Schlumberger 2022",1,"Nous 2"]
["2022-06-26","Quintaine 2018",1,"Séjour chez Marie et Anthony"]
["2022-06-26","La Chapelle Haut Nouchet 2016",1]
["2022-06-26","Naudé-22",1]
["2022-07-01","La Chapelle Haut Nouchet 2016",1,"Nous 2"]
["2022-07-14","La Chapelle Haut Nouchet 2016",1,"Nous 2"]
["2022-07-18","S de Schlumberger 2022",1,"Nous 2"]
["2022-07-23","Château La Peyre 2015",2,"Repas avec Jean Charles et Michelle, Martine et Lionel"]
["2022-07-23","S de Schlumberger 2022",3,"Repas avec Jean Charles et Michelle, Martine et Lionel"]
["2022-07-23","Naudé-22",1,"Repas avec Jean Charles et Michelle, Martine et Lionel"]
["2022-07-28","Quintaine 2018",1,"Repas avec les parents de Lou-Anne et leurs 2 garçons"]
["2022-07-28","La Chapelle Haut Nouchet 2016",1,"Repas avec les parents de Lou-Anne et leurs 2 garçons"]
["2022-08-05","Ladoix Les Hautes Mourottes 2018",2,"Repas avec Claude et Corinne"]
["2022-08-05","Connétable Talbot 2016",1,"Repas avec Claude et Corinne"]
["2022-08-05","Naudé-22",1,"Repas avec Claude et Corinne"]
["2022-08-14","S de Schlumberger 2022",1,"Apéro avec Marie et Anthony"]
["2022-08-14","La Chapelle Haut Nouchet 2016",1,"Nous 6"]
["2022-08-17","Quintaine 2018",1,"Nous 2, Marie et Anthony"]
["2022-08-21","Bellissima",1,"Nous 2, Marie et Anthony"]
["2022-08-21","S de Schlumberger 2022",1,"Nous 2, Marie et Anthony"]
["2022-08-21","Côte Rôtie Madinière 2016",1,"Nous 6"]
["2022-08-21","Naudé-22",1,"Nous 6"]
["2022-09-08","ROEDERER Brut",1,"Nous 6 en Corse"]
["2022-09-11","S de Schlumberger 2022",1,"Nous 2"]
["2022-09-20","Naudé-22",1,"Repas chez Isabelle "]
["2022-09-24","Château Siaurac 2014",1,"Nous 2"]
["2022-09-25","Château La Peyre 2015",1,"Nous 2 avec Alizée et Lucas"]
["2022-09-27","Quintaine 2018",1,"Repas avec Ronan et Gaëlle"]
["2022-09-27","S de Schlumberger 2022",2,"Repas avec Ronan et Gaëlle"]
["2022-10-01","Quintaine 2018",1,"Week end de Sophie chez Marie et Anthony"]
["2022-10-01","S de Schlumberger 2022",3,"Week end de Sophie chez Marie et Anthony"]
["2022-10-08","Quintaine 2018",1,"Repas avec Marie, Alizée et Lucas"]
["2022-10-09","Naudé-22",1,"Inauguration maison d'Alizée avec Papy, Mamie, Marie, Alizée, Lucas et nous 2"]
["2022-10-14","Etoile by Haut Nouchet blanc 2020",1,"Nous 2"]
["2022-10-19","S de Schlumberger 2022",1,"Nous 2"]
["2022-11-27","S de Schlumberger 2022",3,"Nous avec Marie, Anthony et Alizée"]
["2022-11-28","Aux Ravioles 2017",1,"Nous avec Marie, Anthony et Alizée"]
["2022-11-28","Château Montlabert 2015",1,"Nous avec Marie, Anthony, Alizée et Lucas"]
["2022-12-02","S de Schlumberger 2022",1,"Nous 2"]
["2022-12-04","Château La Peyre 2015",1,"Nous 2"]
["2022-12-10","Morgeot 1er Cru 2017",1,"Nous 2 avec Ronan et Gaëlle"]
["2022-12-24","Ladoix Les Gréchons 2018",1,"Nous 2,Valérie, Serge, Nico et Marion"]
["2022-12-24","Ladoix Les Hautes Mourottes 2018",1,"Nous 2,Valérie, Serge, Nico et Marion"]
["2022-12-24","La Toppe au Vert 2017",1,"Nous 2,Valérie, Serge, Nico et Marion"]
["2022-12-24","Naudé-22",1,"Nous 2,Valérie, Serge, Nico et Marion"]
["2022-12-31","Morgeot 1er Cru 2017",1,"Nous 2, Marie et Anthony"]
["2022-12-31","Domaine Fontaine Gagnard 2018",1,"Nous 2, Marie et Anthony"]
["2023-01-01","Les Vaumuriens 2017",1,"Nous 2, Marie, Anthony, Alizée et Lucas"]
["2023-01-01","Chassagne Montrachet 2017",1,"Nous 2, Marie, Anthony, Alizée et Lucas"]
["2023-01-06","Quintaine 2018",1,"Nous 2"]
["2023-01-09","Naudé-22",1,"Galette avec Ronan et Gaëlle"]
["2023-01-30","Quintaine 2018",1,"Nous 2"]
["2023-02-19","Quintaine 2018",1,"Nous 2, Alizée et Lucas"]
["2023-02-20","Quintaine 2018",1,"Nous 2"]
["2023-02-22","Quintaine 2018",1,"Nous 2, Alizée et Lucas"]
["2023-02-26","Etoile by Haut Nouchet blanc 2020",1,"Nous 2"]
["2023-03-03","Ronan By Client 2012",1,"Nous 2, Alizée et Lucas, Valérie"]
["2023-04-08","Château Montlabert 2015",2,"Repas avec Jean Charles et Michelle, Martine et Lionel"]
["2023-04-11","Château Lusseau 2014",1,"Nous 2 avec Ronan et Gaëlle"]
["2023-06-22","Quintaine 2018",1,"Repas d'anniversaire de mariage nous 2"]
["2023-07-06","Château La Peyre 2015",1,"Nous 2 avec Ronan et Gaëlle"]
["2023-07-22","Aux Ravioles 2017",2,"Nous 2 avec Maria, Corinne, Éric et Marc"]
["2023-07-22","Quintaine 2018",1,"Nous 2 avec Maria, Corinne, Éric et Marc"]
["2023-08-04","Aux Ravioles 2017",1,"Nous 2 avec Martine et Lionel"]
["2023-10-29","Clos René 2015",1,"Soirée raclette avec Maria, Corinne, Eric et Marc"]
["2023-11-03","Clos René 2015",1,"Soirée avec Claude et Corinne"]
["2023-11-03","Pagus Luminis 2019",1,"Soirée avec Claude et Corinne"]
["2023-11-08","Ladoix Les Hautes Mourottes 2018",1,"Soirée avec Lionel et Martine"]
["2023-11-08","Château Montlabert 2015",1,"Soirée avec Lionel et Martine"]
["2023-11-17","Domaine Moillard 2018",1,"Nous 2, Marie et Anthony"]

{"sheet":"Tarif","index":3,"n_rows":1000,"n_cols":10,"rows_kept":1000,"cut":false,"hidden":false,"merged":[]}
["DATE","NOM","PRIX TTC","OÙ",null,"DATE","NOM","OÙ","PRIX TTC","ORDRE"]
[{"$f":"INDEX(F:J,MATCH(ROW()-ROW($B$1),J:J,0),1)","v":"2022-07-13"},{"$f":"INDEX(F:J,MATCH(ROW()-ROW($B$1),J:J,0),2)","v":"1664 25cl Intermarché 13/07/22"},{"$f":"INDEX(F:J,MATCH(ROW()-ROW($C$1),J:J,0),4)","v":0.37749999999999995},{"$f":"IFERROR(INDEX(F:J,MATCH(ROW()-ROW($D$1),J:J,0),3),\"\")","v":"Intermarché"},null,"2021-02-12","Absolute Vodka Métro","Métro",14.69,{"$f":"COUNTIF(Vins,\"<=\"&G2)","v":3}]
[{"$f":"IFERROR(INDEX(F:J,MATCH(ROW()-ROW($B$1),J:J,0),1),\"\")","v":"2022-06-18"},"1664 bouteille 25CL par 20 juin 2022",0.55200000000000005,"Métro",null,"2021-02-12","Bayles Métro","Métro",10.57,8]
[{"$f":"IFERROR(INDEX(F:J,MATCH(ROW()-ROW($B$1),J:J,0),1),\"\")","v":"2021-02-12"},"Absolute Vodka Métro",14.69,"Métro",null,"2021-02-12","Botanist Métro","Métro",28.39,12]
["2021-02-19","Anjou Rouge Petit Clocher",8.9,"Joyaux des Vignes",null,"2021-02-19","Anjou Rouge Petit Clocher","Joyaux des Vignes",8.9,4]
["2021-10-05","Auxey-Duresses JADOT métro 05-10-21",14.891999999999999,"Métro",null,"2021-02-19","UBY Bio","Joyaux des Vignes",7.9,80]
["2023-06-09","Baileys 09-06-2023",12.587999999999999,"Métro",null,"2021-02-19","UBY Blanc 5 litres","Joyaux des Vignes",35.9,81]
["2022-06-18","Bayles juin 2022",10.536,"Métro",null,"2021-02-19","UBY Classique Joyaux des Vignes","Joyaux des Vignes",6.6,82]
["2021-02-12","Bayles Métro",10.57,"Métro",null,"2021-02-19","UBY Rosé 5 litres","Joyaux des Vignes",35.9,84]
["2021-10-05","Bayles Métro 05-10-21",10.98,"Métro",null,"2021-03-03","Gin Generous Métro","Métro",25.367999999999999,42]
["2021-05-12","Bayles Métro 12-05",12.6,"Métro",null,"2021-03-03","Pouilly Fuissé Ferret","Métro",23.988,61]
["2021-11-19","Beaujolais Nouveau Trichard 19-11-21",7.25,"Caves de la Rocade",null,"2021-03-03","Rhum Clément 1 litre","Métro",16.283999999999999,68]
["2021-02-12","Botanist Métro",28.39,"Métro",null,"2021-03-03","Ricard 1,5 litre","Métro",25.14,70]
["2021-04-29","Bourgogne Clos du Château Meursault 2018",20.388000000000002,"Métro",null,"2021-04-29","Bourgogne Clos du Château Meursault 2018","Métro",20.388000000000002,13]
["2021-04-29","Chablis Grand Cru Les Preuses 2018",31.8,"Métro",null,"2021-04-29","Chablis Grand Cru Les Preuses 2018","Métro",31.8,14]
["2023-08-30","Champagne Naudé Août 2023",19.149999999999999,"Jean Charles",null,"2021-04-29","Chassagne Montrachet Jadot 2018","Métro",41.988,18]
["2023-07-06","Champagne Tribaut Juillet 2023",19.739999999999998,"Métro",null,"2021-04-29","Château Montlabert 2015","Métro",17.388000000000002,20]
["2019-05-01","Chassagne Montrachet Gagnard 2017",44,"Caves de la Rocade",null,"2021-04-29","Clos René 2015 Métro","Métro",28.788,24]
["2021-04-29","Chassagne Montrachet Jadot 2018",41.988,"Métro",null,"2021-04-29","Côtes de Provence Château Cavalier Rosé","Métro",7.9080000000000004,30]
["2022-04-25","Château La Peyre 2015",20,"Aries",null,"2021-04-29","Crémant de Bourgogne","Caves de la Rocade",9.67,31]
["2021-04-29","Château Montlabert 2015",17.388000000000002,"Métro",null,"2021-04-29","Diplomatico  Métro avril 21","Métro",32.988,35]
["2021-10-08","Château Nénine Métro 08-10-2021",5.7096,"Métro",null,"2021-04-29","Domaine de Terra Vecchia (A Paesana) Bio Rosé 5 litres avril 21","Métro",28.187999999999999,39]
["2023-07-25","Chinon rosé 5L 25-07-2023",27.48,"Métro",null,"2021-04-29","Languedoc Cote des Roses ","Métro",6.8280000000000003,45]
["2020-03-03","Clos René 2015 Caves de la Rocade",49,"Caves de la Rocade",null,"2021-04-29","Macon Lugny 2018 Jadot","Métro",10.068,54]
["2021-04-29","Clos René 2015 Métro",28.788,"Métro",null,"2021-04-29","Meursault du Château 2018","Métro",37.188000000000002,57]
["2021-07-30","Condrieu Pagus Luminis 2019 ",31.89,"Caves de la Rocade",null,"2021-04-29","Meursault Les Tillets 2018","Métro",31.187999999999999,58]
["2021-07-01","Corona 01/07/21",1.284,"Métro",null,"2021-04-29","Pernand Vergelesses Domaine Rollin 2018","Métro",21.588000000000001,59]
["2023-08-07","Corona 07-08-2023",0.65150000000000008,"Carrefour Plomeur",null,"2021-04-29","Puligny Montrachet Les Aubues (JC Bachelet)","Métro",51.588000000000001,64]
["2022-07-09","Corona 09/07/22",1.272,"Métro",null,"2021-04-29","Saint Veran Prestige Lassarat 2018","Métro",11.628,78]
["2022-07-14",{"$f":"IFERROR(INDEX(F:J,MATCH(ROW()-ROW($B$1),J:J,0),2),\"\")","v":"Corona Intermarché Promo 30% 14/07/22"},{"$f":"IFERROR(INDEX(F:J,MATCH(ROW()-ROW($C$1),J:J,0),4),\"\")","v":0.84},"Intermarché",null,"2020-03-03","Clos René 2015 Caves de la Rocade","Caves de la Rocade",49,23]
["2021-04-29","Côtes de Provence Château Cavalier Rosé",7.9080000000000004,"Métro",null,"2019-05-01","Chassagne Montrachet Gagnard 2017","Caves de la Rocade",44,17]
["2021-04-29","Crémant de Bourgogne",9.67,"Caves de la Rocade",null,"2020-12-18","Viré Clessé Quintaine 2017","Domaine (Ronan)",14,88]
["2023-07-25","Crémant de Bourgogne Vignot 25-07-2023",8.3879999999999999,"Métro",null,"2021-05-12","Bayles Métro 12-05","Métro",12.6,10]
["2022-03-13","Crément 2019 Moillard",9.9,{"$f":"IFERROR(INDEX(F:J,MATCH(ROW()-ROW($D$1),J:J,0),3),\"\")","v":"Cave Moillard"},null,"2021-05-12","Uby Classique Métro 12-05","Métro",4.7880000000000003,83]
["2022-03-13","Crément Prestige 2019 Moillard",12.5,"Cave Moillard",null,"2021-05-12","Rosé Languedoc Côtes des Roses Métro","Métro",6.8280000000000003,74]
["2021-04-29","Diplomatico  Métro avril 21",32.988,"Métro",null,"2021-05-12","Lignane Rouge Caves de la Rocade 12-05","Caves de la Rocade",7.95,51]
["2021-06-18","Diplomatico  Métro juin 21",29.687999999999999,"Métro",null,"2021-05-12","Rouge Cerise La Croix Gratiot 12-05","Caves de la Rocade",9.9499999999999993,76]
["2022-06-18","Diplomatico juin 2022",30.564,"Métro",null,"2021-04-23","Liqueur St Germain","Métro",35.89,53]
["2021-10-05","Diplomatico Métro 05-10-21",32.988,"Métro",null,"2021-06-18","Diplomatico  Métro juin 21","Métro",29.687999999999999,36]
["2021-04-29","Domaine de Terra Vecchia (A Paesana) Bio Rosé 5 litres avril 21",28.187999999999999,"Métro",null,"2021-06-18","Domaine de Terra Vecchia (A Paesana) Bio Rosé 5 litres juin 21","Métro",35.988,40]
["2021-06-18","Domaine de Terra Vecchia (A Paesana) Bio Rosé 5 litres juin 21",35.988,"Métro",null,"2021-07-01","Gin Generous Métro 01/07","Métro",25.367999999999999,43]
["2022-05-06","Etoile by Haut Nouchet blanc 2020",12.9,"Domaine Haut Nouchet",null,"2021-07-01","Rhum Clément 1 litre 01/07","Métro",16.283999999999999,69]
["2021-03-03","Gin Generous Métro",25.367999999999999,"Métro",null,"2021-07-01","Corona 01/07/21","Métro",1.284,26]
["2021-07-01","Gin Generous Métro 01/07",25.367999999999999,"Métro",null,"2021-07-10","Lignane blanc 10/07/21","Caves de la Rocade",7.95,49]
["2022-05-06","La Chapelle Haut Nouchet 2016",16.899999999999999,"Domaine Haut Nouchet",null,"2021-07-10","Le Clos du Merle 10/07/21","Caves de la Rocade",6.65,46]
["2021-04-29","Languedoc Cote des Roses ",6.8280000000000003,"Métro",null,"2021-07-30","Condrieu Pagus Luminis 2019 ","Caves de la Rocade",31.89,25]
["2021-07-10","Le Clos du Merle 10/07/21",6.65,"Caves de la Rocade",null,"2021-10-05","Vodka Métro 1L 05-10-21","Métro",20.327999999999999,89]
["2021-11-19","Le Clos du Merle 19/11/21",7.1,"Caves de la Rocade",null,"2021-10-05","Vieille Prune Métro 05-10-21","Métro",21.48,87]
["2021-12-23","Le Clos du Merle 23-12-21",7.1,"Caves de la Rocade",null,"2021-10-05","Diplomatico Métro 05-10-21","Métro",32.988,38]
["2021-07-10","Lignane blanc 10/07/21",7.95,"Caves de la Rocade",null,"2021-10-05","Rhum arrangé Orange 05_10_21","Métro",24.948,66]
["2021-12-23","Lignane blanc 23-12-21",7.95,"Caves de la Rocade",null,"2021-10-05","Bayles Métro 05-10-21","Métro",10.98,9]
["2021-05-12","Lignane Rouge Caves de la Rocade 12-05",7.95,"Caves de la Rocade",null,"2021-10-05","Ricard Métro 1L5 05-10-21","Métro",25.14,72]
["2022-06-18","Liqueur de menthe juin 2022",13.068,"Métro",null,"2021-10-05","St Julien Connétable Talbot 2016","Métro",23.988,79]
["2021-04-23","Liqueur St Germain",35.89,"Métro",null,"2021-10-05","Margaux Sirène de Giscours 2016","Métro",27.108000000000001,55]
["2021-04-29","Macon Lugny 2018 Jadot",10.068,"Métro",null,"2021-10-05","Menetou Salon blanc Métro 05-10-21","Métro",8.8680000000000003,56]
["2021-10-05","Margaux Sirène de Giscours 2016",27.108000000000001,"Métro",null,"2021-10-08","Château Nénine Métro 08-10-2021","Métro",5.7096,21]
["2021-10-05","Menetou Salon blanc Métro 05-10-21",8.8680000000000003,"Métro",null,"2021-10-05","Auxey-Duresses JADOT métro 05-10-21","Métro",14.891999999999999,5]
["2021-04-29","Meursault du Château 2018",37.188000000000002,"Métro",null,"2021-11-19","Le Clos du Merle 19/11/21","Caves de la Rocade",7.1,47]
["2021-04-29","Meursault Les Tillets 2018",31.187999999999999,"Métro",null,"2021-11-19","Beaujolais Nouveau Trichard 19-11-21","Caves de la Rocade",7.25,11]
["2021-04-29","Pernand Vergelesses Domaine Rollin 2018",21.588000000000001,"Métro",null,"2021-12-23","Lignane blanc 23-12-21","Caves de la Rocade",7.95,50]
["2023-07-25","Pic St Loup 25-07-2023",8.1479999999999997,"Métro",null,"2021-12-23","Le Clos du Merle 23-12-21","Caves de la Rocade",7.1,48]
["2021-03-03",{"$f":"IFERROR(INDEX(F:J,MATCH(ROW()-ROW($B$1),J:J,0),2),\"\")","v":"Pouilly Fuissé Ferret"},{"$f":"IFERROR(INDEX(F:J,MATCH(ROW()-ROW($C$1),J:J,0),4),\"\")","v":23.988},"Métro",null,"2022-03-13","Crément 2019 Moillard","Cave Moillard",9.9,33]
["2023-07-25","Préjugés vin blanc 25-07-2023",6.3479999999999999,"Métro",null,"2022-03-13","Crément Prestige 2019 Moillard","Cave Moillard",12.5,34]
["2023-07-25","Prosecco Alberto Torresi 25-07-2023",5.0279999999999996,"Métro",null,"2022-04-25","Château La Peyre 2015","Aries",20,19]
["2021-04-29","Puligny Montrachet Les Aubues (JC Bachelet)",51.588000000000001,"Métro",null,"2022-05-06","La Chapelle Haut Nouchet 2016","Domaine Haut Nouchet",16.899999999999999,44]
["2023-06-09","Rhum ambré 3 Rivières 70 cl",13.704000000000001,{"$f":"IFERROR(INDEX(F:J,MATCH(ROW()-ROW($D$1),J:J,0),3),\"\")","v":"Métro"},null,"2022-05-06","Etoile by Haut Nouchet blanc 2020","Domaine Haut Nouchet",12.9,{"$f":"COUNTIF(Vins,\"<=\"&G66)","v":41}]
["2021-10-05","Rhum arrangé Orange 05_10_21",24.948,"Métro",null,"2022-05-20","S de Schlumberger ","Domaine Schlumberger",12.1,77]
[{"$f":"IFERROR(INDEX(F:J,MATCH(ROW()-ROW($B$1),J:J,0),1),\"\")","v":"2023-06-09"},"Rhum Baie Trésor de Pluie 70 cl",33.744,"Métro",null,"2022-06-18","Diplomatico juin 2022","Métro",30.564,37]
["2021-03-03","Rhum Clément 1 litre",16.283999999999999,"Métro",null,"2022-06-18","Bayles juin 2022","Métro",10.536,7]
["2021-07-01","Rhum Clément 1 litre 01/07",16.283999999999999,"Métro",null,"2022-06-18","Liqueur de menthe juin 2022","Métro",13.068,52]
["2021-03-03","Ricard 1,5 litre",25.14,"Métro",null,"2022-06-18","1664 bouteille 25CL par 20 juin 2022","Métro",0.55200000000000005,2]
["2023-07-25","Ricard 1,5L Métro 25-07-2023",23.064,"Métro",null,"2022-06-18","Rosé Languedoc Côtes des Roses juin 2022","Métro",7.1879999999999997,73]
["2021-10-05","Ricard Métro 1L5 05-10-21",25.14,"Métro",null,"2022-07-09","Vodka Métro 70cl 09-07-22","Métro",15.096,90]
["2022-06-18","Rosé Languedoc Côtes des Roses juin 2022",7.1879999999999997,"Métro",null,"2022-07-09","Rosé Languedoc Côtes des Roses Métro Magnum 09-07-22","Métro",15.348000000000001,75]
["2021-05-12","Rosé Languedoc Côtes des Roses Métro",6.8280000000000003,"Métro",null,"2022-07-09","Corona 09/07/22","Métro",1.272,28]
["2022-07-09","Rosé Languedoc Côtes des Roses Métro Magnum 09-07-22",15.348000000000001,"Métro",null,"2022-07-13","1664 25cl Intermarché 13/07/22","Intermarché",{"$f":"(25.9-7.78)/48","v":0.37749999999999995},1]
["2021-05-12","Rouge Cerise La Croix Gratiot 12-05",9.9499999999999993,"Caves de la Rocade",null,"2022-07-14","Corona Intermarché Promo 30% 14/07/22","Intermarché",0.84,29]
["2022-05-20","S de Schlumberger ",12.1,"Domaine Schlumberger",null,"2023-06-09","Vodka Métro 70cl 09-07-23","Métro",15.384,91]
["2021-04-29","Saint Veran Prestige Lassarat 2018",11.628,"Métro",null,"2023-06-09","Rhum ambré 3 Rivières 70 cl","Métro",13.704000000000001,65]
["2021-10-05","St Julien Connétable Talbot 2016",23.988,"Métro",null,"2023-06-09","Rhum Baie Trésor de Pluie 70 cl","Métro",33.744,67]
["2021-02-19","UBY Bio",7.9,"Joyaux des Vignes",null,"2023-06-09","Baileys 09-06-2023","Métro",12.587999999999999,6]
["2021-02-19","UBY Blanc 5 litres",35.9,"Joyaux des Vignes",null,"2023-06-09","Valrona 55% 3 kg 09-06-2023","Métro",50.935400000000001,85]
["2021-02-19","UBY Classique Joyaux des Vignes",6.6,"Joyaux des Vignes",null,"2023-06-09","Valrona 66% 3 kg 09-06-2023","Métro",63.658700000000003,86]
["2021-05-12","Uby Classique Métro 12-05",4.7880000000000003,"Métro",null,"2023-07-25","Ricard 1,5L Métro 25-07-2023","Métro",23.064,71]
["2021-02-19","UBY Rosé 5 litres",35.9,"Joyaux des Vignes",null,"2023-07-25","Pic St Loup 25-07-2023","Métro",8.1479999999999997,60]
["2023-06-09","Valrona 55% 3 kg 09-06-2023",50.935400000000001,"Métro",null,"2023-07-25","Chinon rosé 5L 25-07-2023","Métro",27.48,22]
["2023-06-09","Valrona 66% 3 kg 09-06-2023",63.658700000000003,"Métro",null,"2023-07-25","Préjugés vin blanc 25-07-2023","Métro",6.3479999999999999,62]
["2021-10-05","Vieille Prune Métro 05-10-21",21.48,"Métro",null,"2023-07-25","Crémant de Bourgogne Vignot 25-07-2023","Métro",8.3879999999999999,32]
["2020-12-18","Viré Clessé Quintaine 2017",14,"Domaine (Ronan)",null,"2023-07-25","Prosecco Alberto Torresi 25-07-2023","Métro",5.0279999999999996,63]
["2021-10-05","Vodka Métro 1L 05-10-21",20.327999999999999,"Métro",null,"2023-08-07","Corona 07-08-2023","Carrefour Plomeur",{"$f":"(19.75-6.72)/20","v":0.65150000000000008},27]
["2022-07-09","Vodka Métro 70cl 09-07-22",15.096,"Métro",null,"2023-08-30","Champagne Naudé Août 2023","Jean Charles",19.149999999999999,15]
["2023-06-09","Vodka Métro 70cl 09-07-23",15.384,"Métro",null,"2023-07-06","Champagne Tribaut Juillet 2023","Métro",19.739999999999998,16]
[{"$f":"IFERROR(INDEX(F:J,MATCH(ROW()-ROW($B$1),J:J,0),1),\"\")","v":""},{"$f":"IFERROR(INDEX(F:J,MATCH(ROW()-ROW($B$1),J:J,0),2),\"\")","v":""},{"$f":"IFERROR(INDEX(F:J,MATCH(ROW()-ROW($C$1),J:J,0),4),\"\")","v":""},{"$f":"IFERROR(INDEX(F:J,MATCH(ROW()-ROW($D$1),J:J,0),3),\"\")","v":""},null,null,null,null,null,0]
["","","","",null,null,null,null,null,0]
["","","","",null,null,null,null,null,0]
["","","","",null,null,null,null,null,0]
["","","","",null,null,null,null,null,0]
["","","","",null,null,null,null,null,0]
["","","","",null,null,null,null,null,0]
["","","","",null,null,null,null,null,0]
["","","","",null,null,null,null,null,0]
["","","","",null,null,null,null,null,0]
["","","","",null,null,null,null,null,0]
["","","","",null,null,null,null,null,0]
["","","","",null,null,null,null,null,0]
["","","","",null,null,null,null,null,0]
["","","","",null,null,null,null,null,0]
["","","","",null,null,null,null,null,0]
["","","","",null,null,null,null,null,0]
["","","","",null,null,null,null,null,0]
["","","","",null,null,null,null,null,0]
["","","","",null,null,null,null,null,0]
["","","","",null,null,null,null,null,0]
["","","","",null,null,null,null,null,0]
["","","","",null,null,null,null,null,0]
["","","","",null,null,null,null,null,0]
["","","","",null,null,null,null,null,0]
["","","","",null,null,null,null,null,0]
["","","","",null,null,null,null,null,0]
["","","","",null,null,null,null,null,0]
["","","","",null,null,null,null,null,0]
["","","","",null,null,null,null,null,0]
["","","","",null,null,null,null,null,0]
["","","","",null,null,null,null,null,0]
["","","","",null,null,null,null,null,0]
["","","","",null,null,null,null,null,0]
["","","","",null,null,null,null,null,0]
["","","","",null,null,null,null,null,0]
["","","","",null,null,null,null,null,0]
["","","","",null,null,null,null,null,{"$f":"COUNTIF(Vins,\"<=\"&G130)","v":0}]
["","","","",null,null,null,null,null,0]
["","","","",null,null,null,null,null,0]
["","","","",null,null,null,null,null,0]
["","","","",null,null,null,null,null,0]
["","","","",null,null,null,null,null,0]
["","","","",null,null,null,null,null,0]
["","","","",null,null,null,null,null,0]
["","","","",null,null,null,null,null,0]
["","","","",null,null,null,null,null,0]
["","","","",null,null,null,null,null,0]
["","","","",null,null,null,null,null,0]
["","","","",null,null,null,null,null,0]
["","","","",null,null,null,null,null,0]
["","","","",null,null,null,null,null,0]
["","","","",null,null,null,null,null,0]
["","","","",null,null,null,null,null,0]
["","","","",null,null,null,null,null,0]
["","","","",null,null,null,null,null,0]
["","","","",null,null,null,null,null,0]
["","","","",null,null,null,null,null,0]
["","","","",null,null,null,null,null,0]
["","","","",null,null,null,null,null,0]
["","","","",null,null,null,null,null,0]
["","","","",null,null,null,null,null,0]
["","","","",null,null,null,null,null,0]
["","","","",null,null,null,null,null,0]
[{"$f":"IFERROR(INDEX(F:J,MATCH(ROW()-ROW($B$1),J:J,0),1),\"\")","v":""},{"$f":"IFERROR(INDEX(F:J,MATCH(ROW()-ROW($B$1),J:J,0),2),\"\")","v":""},{"$f":"IFERROR(INDEX(F:J,MATCH(ROW()-ROW($C$1),J:J,0),4),\"\")","v":""},{"$f":"IFERROR(INDEX(F:J,MATCH(ROW()-ROW($D$1),J:J,0),3),\"\")","v":""},null,null,null,null,null,0]
["","","","",null,null,null,null,null,0]
["","","","",null,null,null,null,null,0]
["","","","",null,null,null,null,null,0]
["","","","",null,null,null,null,null,0]
["","","","",null,null,null,null,null,0]
["","","","",null,null,null,null,null,0]
["","","","",null,null,null,null,null,0]
["","","","",null,null,null,null,null,0]
["","","","",null,null,null,null,null,0]
["","","","",null,null,null,null,null,0]
["","","","",null,null,null,null,null,0]
["","","","",null,null,null,null,null,0]
["","","","",null,null,null,null,null,0]
["","","","",null,null,null,null,null,0]
["","","","",null,null,null,null,null,0]
["","","","",null,null,null,null,null,0]
["","","","",null,null,null,null,null,0]
["","","","",null,null,null,null,null,0]
["","","","",null,null,null,null,null,0]
["","","","",null,null,null,null,null,0]
["","","","",null,null,null,null,null,0]
["","","","",null,null,null,null,null,0]
["","","","",null,null,null,null,null,0]
["","","","",null,null,null,null,null,0]
["","","","",null,null,null,null,null,0]
["","","","",null,null,null,null,null,0]
["","","","",null,null,null,null,null,0]
["","","","",null,null,null,null,null,0]
["","","","",null,null,null,null,null,0]
["","","","",null,null,null,null,null,0]
["","","","",null,null,null,null,null,0]
["","","","",null,null,null,null,null,0]
["","","","",null,null,null,null,null,0]
["","","","",null,null,null,null,null,0]
["","","","",null,null,null,null,null,0]
["","","","",null,null,null,null,null,0]
["","","","",null,null,null,null,null,{"$f":"COUNTIF(Vins,\"<=\"&G194)","v":0}]
["","","","",null,null,null,null,null,0]
["","","","",null,null,null,null,null,0]
["","","","",null,null,null,null,null,0]
["","","","",null,null,null,null,null,0]
["","","","",null,null,null,null,null,0]
["","","","",null,null,null,null,null,0]
["","","","",null,null,null,null,null,0]
["","","","",null,null,null,null,null,0]
["","","","",null,null,null,null,null,0]
["","","","",null,null,null,null,null,0]
["","","","",null,null,null,null,null,0]
["","","","",null,null,null,null,null,0]
["","","","",null,null,null,null,null,0]
["","","","",null,null,null,null,null,0]
["","","","",null,null,null,null,null,0]
["","","","",null,null,null,null,null,0]
["","","","",null,null,null,null,null,0]
["","","","",null,null,null,null,null,0]
["","","","",null,null,null,null,null,0]
["","","","",null,null,null,null,null,0]
["","","","",null,null,null,null,null,0]
["","","","",null,null,null,null,null,0]
["","","","",null,null,null,null,null,0]
["","","","",null,null,null,null,null,0]
["","","","",null,null,null,null,null,0]
["","","","",null,null,null,null,null,0]
[{"$f":"IFERROR(INDEX(F:J,MATCH(ROW()-ROW($B$1),J:J,0),1),\"\")","v":""},{"$f":"IFERROR(INDEX(F:J,MATCH(ROW()-ROW($B$1),J:J,0),2),\"\")","v":""},{"$f":"IFERROR(INDEX(F:J,MATCH(ROW()-ROW($C$1),J:J,0),4),\"\")","v":""},{"$f":"IFERROR(INDEX(F:J,MATCH(ROW()-ROW($D$1),J:J,0),3),\"\")","v":""},null,null,null,null,null,0]
["","","","",null,null,null,null,null,0]
["","","","",null,null,null,null,null,0]
["","","","",null,null,null,null,null,0]
["","","","",null,null,null,null,null,0]
["","","","",null,null,null,null,null,0]
["","","","",null,null,null,null,null,0]
["","","","",null,null,null,null,null,0]
["","","","",null,null,null,null,null,0]
["","","","",null,null,null,null,null,0]
["","","","",null,null,null,null,null,0]
["","","","",null,null,null,null,null,0]
["","","","",null,null,null,null,null,0]
["","","","",null,null,null,null,null,0]
["","","","",null,null,null,null,null,0]
["","","","",null,null,null,null,null,0]
["","","","",null,null,null,null,null,0]
["","","","",null,null,null,null,null,0]
["","","","",null,null,null,null,null,0]
["","","","",null,null,null,null,null,0]
["","","","",null,null,null,null,null,0]
["","","","",null,null,null,null,null,0]
["","","","",null,null,null,null,null,0]
["","","","",null,null,null,null,null,0]
["","","","",null,null,null,null,null,0]
["","","","",null,null,null,null,null,0]
["","","","",null,null,null,null,null,0]
["","","","",null,null,null,null,null,0]
["","","","",null,null,null,null,null,0]
["","","","",null,null,null,null,null,0]
["","","","",null,null,null,null,null,0]
["","","","",null,null,null,null,null,0]
["","","","",null,null,null,null,null,0]
["","","","",null,null,null,null,null,0]
["","","","",null,null,null,null,null,0]
["","","","",null,null,null,null,null,0]
["","","","",null,null,null,null,null,0]
["","","","",null,null,null,null,null,{"$f":"COUNTIF(Vins,\"<=\"&G258)","v":0}]
["","","","",null,null,null,null,null,0]
["","","","",null,null,null,null,null,0]
["","","","",null,null,null,null,null,0]
["","","","",null,null,null,null,null,0]
["","","","",null,null,null,null,null,0]
["","","","",null,null,null,null,null,0]
["","","","",null,null,null,null,null,0]
["","","","",null,null,null,null,null,0]
["","","","",null,null,null,null,null,0]
["","","","",null,null,null,null,null,0]
["","","","",null,null,null,null,null,0]
["","","","",null,null,null,null,null,0]
["","","","",null,null,null,null,null,0]
["","","","",null,null,null,null,null,0]
["","","","",null,null,null,null,null,0]
["","","","",null,null,null,null,null,0]
["","","","",null,null,null,null,null,0]
["","","","",null,null,null,null,null,0]
["","","","",null,null,null,null,null,0]
["","","","",null,null,null,null,null,0]
["","","","",null,null,null,null,null,0]
["","","","",null,null,null,null,null,0]
["","","","",null,null,null,null,null,0]
["","","","",null,null,null,null,null,0]
["","","","",null,null,null,null,null,0]
["","","","",null,null,null,null,null,0]
[{"$f":"IFERROR(INDEX(F:J,MATCH(ROW()-ROW($B$1),J:J,0),1),\"\")","v":""},{"$f":"IFERROR(INDEX(F:J,MATCH(ROW()-ROW($B$1),J:J,0),2),\"\")","v":""},{"$f":"IFERROR(INDEX(F:J,MATCH(ROW()-ROW($C$1),J:J,0),4),\"\")","v":""},{"$f":"IFERROR(INDEX(F:J,MATCH(ROW()-ROW($D$1),J:J,0),3),\"\")","v":""},null,null,null,null,null,0]
["","","","",null,null,null,null,null,0]
["","","","",null,null,null,null,null,0]
["","","","",null,null,null,null,null,0]
["","","","",null,null,null,null,null,0]
["","","","",null,null,null,null,null,0]
["","","","",null,null,null,null,null,0]
["","","","",null,null,null,null,null,0]
["","","","",null,null,null,null,null,0]
["","","","",null,null,null,null,null,0]
["","","","",null,null,null,null,null,0]
["","","","",null,null,null,null,null,0]
["","","","",null,null,null,null,null,0]
["","","","",null,null,null,null,null,0]
["","","","",null,null,null,null,null,0]
["","","","",null,null,null,null,null,0]
["","","","",null,null,null,null,null,0]
["","","","",null,null,null,null,null,0]
["","","","",null,null,null,null,null,0]
["","","","",null,null,null,null,null,0]
["","","","",null,null,null,null,null,0]
["","","","",null,null,null,null,null,0]
["","","","",null,null,null,null,null,0]
["","","","",null,null,null,null,null,0]
["","","","",null,null,null,null,null,0]
["","","","",null,null,null,null,null,0]
["","","","",null,null,null,null,null,0]
["","","","",null,null,null,null,null,0]
["","","","",null,null,null,null,null,0]
["","","","",null,null,null,null,null,0]
["","","","",null,null,null,null,null,0]
["","","","",null,null,null,null,null,0]
["","","","",null,null,null,null,null,0]
["","","","",null,null,null,null,null,0]
["","","","",null,null,null,null,null,0]
["","","","",null,null,null,null,null,0]
["","","","",null,null,null,null,null,0]
["","","","",null,null,null,null,null,{"$f":"COUNTIF(Vins,\"<=\"&G322)","v":0}]
["","","","",null,null,null,null,null,0]
["","","","",null,null,null,null,null,0]
["","","","",null,null,null,null,null,0]
["","","","",null,null,null,null,null,0]
["","","","",null,null,null,null,null,0]
["","","","",null,null,null,null,null,0]
["","","","",null,null,null,null,null,0]
["","","","",null,null,null,null,null,0]
["","","","",null,null,null,null,null,0]
["","","","",null,null,null,null,null,0]
["","","","",null,null,null,null,null,0]
["","","","",null,null,null,null,null,0]
["","","","",null,null,null,null,null,0]
["","","","",null,null,null,null,null,0]
["","","","",null,null,null,null,null,0]
["","","","",null,null,null,null,null,0]
["","","","",null,null,null,null,null,0]
["","","","",null,null,null,null,null,0]
["","","","",null,null,null,null,null,0]
["","","","",null,null,null,null,null,0]
["","","","",null,null,null,null,null,0]
["","","","",null,null,null,null,null,0]
["","","","",null,null,null,null,null,0]
["","","","",null,null,null,null,null,0]
["","","","",null,null,null,null,null,0]
["","","","",null,null,null,null,null,0]
[{"$f":"IFERROR(INDEX(F:J,MATCH(ROW()-ROW($B$1),J:J,0),1),\"\")","v":""},{"$f":"IFERROR(INDEX(F:J,MATCH(ROW()-ROW($B$1),J:J,0),2),\"\")","v":""},{"$f":"IFERROR(INDEX(F:J,MATCH(ROW()-ROW($C$1),J:J,0),4),\"\")","v":""},{"$f":"IFERROR(INDEX(F:J,MATCH(ROW()-ROW($D$1),J:J,0),3),\"\")","v":""},null,null,null,null,null,0]
["","","","",null,null,null,null,null,0]
["","","","",null,null,null,null,null,0]
["","","","",null,null,null,null,null,0]
["","","","",null,null,null,null,null,0]
["","","","",null,null,null,null,null,0]
["","","","",null,null,null,null,null,0]
["","","","",null,null,null,null,null,0]
["","","","",null,null,null,null,null,0]
["","","","",null,null,null,null,null,0]
["","","","",null,null,null,null,null,0]
["","","","",null,null,null,null,null,0]
["","","","",null,null,null,null,null,0]
["","","","",null,null,null,null,null,0]
["","","","",null,null,null,null,null,0]
["","","","",null,null,null,null,null,0]
["","","","",null,null,null,null,null,0]
["","","","",null,null,null,null,null,0]
["","","","",null,null,null,null,null,0]
["","","","",null,null,null,null,null,0]
["","","","",null,null,null,null,null,0]
["","","","",null,null,null,null,null,0]
["","","","",null,null,null,null,null,0]
["","","","",null,null,null,null,null,0]
["","","","",null,null,null,null,null,0]
["","","","",null,null,null,null,null,0]
["","","","",null,null,null,null,null,0]
["","","","",null,null,null,null,null,0]
["","","","",null,null,null,null,null,0]
["","","","",null,null,null,null,null,0]
["","","","",null,null,null,null,null,0]
["","","","",null,null,null,null,null,0]
["","","","",null,null,null,null,null,0]
["","","","",null,null,null,null,null,0]
["","","","",null,null,null,null,null,0]
["","","","",null,null,null,null,null,0]
["","","","",null,null,null,null,null,0]
["","","","",null,null,null,null,null,{"$f":"COUNTIF(Vins,\"<=\"&G386)","v":0}]
["","","","",null,null,null,null,null,0]
["","","","",null,null,null,null,null,0]
["","","","",null,null,null,null,null,0]
["","","","",null,null,null,null,null,0]
["","","","",null,null,null,null,null,0]
["","","","",null,null,null,null,null,0]
["","","","",null,null,null,null,null,0]
["","","","",null,null,null,null,null,0]
["","","","",null,null,null,null,null,0]
["","","","",null,null,null,null,null,0]
["","","","",null,null,null,null,null,0]
["","","","",null,null,null,null,null,0]
["","","","",null,null,null,null,null,0]
["","","","",null,null,null,null,null,0]
["","","","",null,null,null,null,null,0]
["","","","",null,null,null,null,null,0]
["","","","",null,null,null,null,null,0]
["","","","",null,null,null,null,null,0]
["","","","",null,null,null,null,null,0]
["","","","",null,null,null,null,null,0]
["","","","",null,null,null,null,null,0]
["","","","",null,null,null,null,null,0]
["","","","",null,null,null,null,null,0]
["","","","",null,null,null,null,null,0]
["","","","",null,null,null,null,null,0]
["","","","",null,null,null,null,null,0]
[{"$f":"IFERROR(INDEX(F:J,MATCH(ROW()-ROW($B$1),J:J,0),1),\"\")","v":""},{"$f":"IFERROR(INDEX(F:J,MATCH(ROW()-ROW($B$1),J:J,0),2),\"\")","v":""},{"$f":"IFERROR(INDEX(F:J,MATCH(ROW()-ROW($C$1),J:J,0),4),\"\")","v":""},{"$f":"IFERROR(INDEX(F:J,MATCH(ROW()-ROW($D$1),J:J,0),3),\"\")","v":""},null,null,null,null,null,0]
["","","","",null,null,null,null,null,0]
["","","","",null,null,null,null,null,0]
["","","","",null,null,null,null,null,0]
["","","","",null,null,null,null,null,0]
["","","","",null,null,null,null,null,0]
["","","","",null,null,null,null,null,0]
["","","","",null,null,null,null,null,0]
["","","","",null,null,null,null,null,0]
["","","","",null,null,null,null,null,0]
["","","","",null,null,null,null,null,0]
["","","","",null,null,null,null,null,0]
["","","","",null,null,null,null,null,0]
["","","","",null,null,null,null,null,0]
["","","","",null,null,null,null,null,0]
["","","","",null,null,null,null,null,0]
["","","","",null,null,null,null,null,0]
["","","","",null,null,null,null,null,0]
["","","","",null,null,null,null,null,0]
["","","","",null,null,null,null,null,0]
["","","","",null,null,null,null,null,0]
["","","","",null,null,null,null,null,0]
["","","","",null,null,null,null,null,0]
["","","","",null,null,null,null,null,0]
["","","","",null,null,null,null,null,0]
["","","","",null,null,null,null,null,0]
["","","","",null,null,null,null,null,0]
["","","","",null,null,null,null,null,0]
["","","","",null,null,null,null,null,0]
["","","","",null,null,null,null,null,0]
["","","","",null,null,null,null,null,0]
["","","","",null,null,null,null,null,0]
["","","","",null,null,null,null,null,0]
["","","","",null,null,null,null,null,0]
["","","","",null,null,null,null,null,0]
["","","","",null,null,null,null,null,0]
["","","","",null,null,null,null,null,0]
["","","","",null,null,null,null,null,{"$f":"COUNTIF(Vins,\"<=\"&G450)","v":0}]
["","","","",null,null,null,null,null,0]
["","","","",null,null,null,null,null,0]
["","","","",null,null,null,null,null,0]
["","","","",null,null,null,null,null,0]
["","","","",null,null,null,null,null,0]
["","","","",null,null,null,null,null,0]
["","","","",null,null,null,null,null,0]
["","","","",null,null,null,null,null,0]
["","","","",null,null,null,null,null,0]
["","","","",null,null,null,null,null,0]
["","","","",null,null,null,null,null,0]
["","","","",null,null,null,null,null,0]
["","","","",null,null,null,null,null,0]
["","","","",null,null,null,null,null,0]
["","","","",null,null,null,null,null,0]
["","","","",null,null,null,null,null,0]
["","","","",null,null,null,null,null,0]
["","","","",null,null,null,null,null,0]
["","","","",null,null,null,null,null,0]
["","","","",null,null,null,null,null,0]
["","","","",null,null,null,null,null,0]
["","","","",null,null,null,null,null,0]
["","","","",null,null,null,null,null,0]
["","","","",null,null,null,null,null,0]
["","","","",null,null,null,null,null,0]
["","","","",null,null,null,null,null,0]
[{"$f":"IFERROR(INDEX(F:J,MATCH(ROW()-ROW($B$1),J:J,0),1),\"\")","v":""},{"$f":"IFERROR(INDEX(F:J,MATCH(ROW()-ROW($B$1),J:J,0),2),\"\")","v":""},{"$f":"IFERROR(INDEX(F:J,MATCH(ROW()-ROW($C$1),J:J,0),4),\"\")","v":""},{"$f":"IFERROR(INDEX(F:J,MATCH(ROW()-ROW($D$1),J:J,0),3),\"\")","v":""},null,null,null,null,null,0]
["","","","",null,null,null,null,null,0]
["","","","",null,null,null,null,null,0]
["","","","",null,null,null,null,null,0]
["","","","",null,null,null,null,null,0]
["","","","",null,null,null,null,null,0]
["","","","",null,null,null,null,null,0]
["","","","",null,null,null,null,null,0]
["","","","",null,null,null,null,null,0]
["","","","",null,null,null,null,null,0]
["","","","",null,null,null,null,null,0]
["","","","",null,null,null,null,null,0]
["","","","",null,null,null,null,null,0]
["","","","",null,null,null,null,null,0]
["","","","",null,null,null,null,null,0]
["","","","",null,null,null,null,null,0]
["","","","",null,null,null,null,null,0]
["","","","",null,null,null,null,null,0]
["","","","",null,null,null,null,null,0]
["","","","",null,null,null,null,null,0]
["","","","",null,null,null,null,null,0]
["","","","",null,null,null,null,null,0]
["","","","",null,null,null,null,null,0]
["","","","",null,null,null,null,null,0]
["","","","",null,null,null,null,null,0]
["","","","",null,null,null,null,null,0]
["","","","",null,null,null,null,null,0]
["","","","",null,null,null,null,null,0]
["","","","",null,null,null,null,null,0]
["","","","",null,null,null,null,null,0]
["","","","",null,null,null,null,null,0]
["","","","",null,null,null,null,null,0]
["","","","",null,null,null,null,null,0]
["","","","",null,null,null,null,null,0]
["","","","",null,null,null,null,null,0]
["","","","",null,null,null,null,null,0]
["","","","",null,null,null,null,null,0]
["","","","",null,null,null,null,null,{"$f":"COUNTIF(Vins,\"<=\"&G514)","v":0}]
["","","","",null,null,null,null,null,0]
["","","","",null,null,null,null,null,0]
["","","","",null,null,null,null,null,0]
["","","","",null,null,null,null,null,0]
["","","","",null,null,null,null,null,0]
["","","","",null,null,null,null,null,0]
["","","","",null,null,null,null,null,0]
["","","","",null,null,null,null,null,0]
["","","","",null,null,null,null,null,0]
["","","","",null,null,null,null,null,0]
["","","","",null,null,null,null,null,0]
["","","","",null,null,null,null,null,0]
["","","","",null,null,null,null,null,0]
["","","","",null,null,null,null,null,0]
["","","","",null,null,null,null,null,0]
["","","","",null,null,null,null,null,0]
["","","","",null,null,null,null,null,0]
["","","","",null,null,null,null,null,0]
["","","","",null,null,null,null,null,0]
["","","","",null,null,null,null,null,0]
["","","","",null,null,null,null,null,0]
["","","","",null,null,null,null,null,0]
["","","","",null,null,null,null,null,0]
["","","","",null,null,null,null,null,0]
["","","","",null,null,null,null,null,0]
["","","","",null,null,null,null,null,0]
[{"$f":"IFERROR(INDEX(F:J,MATCH(ROW()-ROW($B$1),J:J,0),1),\"\")","v":""},{"$f":"IFERROR(INDEX(F:J,MATCH(ROW()-ROW($B$1),J:J,0),2),\"\")","v":""},{"$f":"IFERROR(INDEX(F:J,MATCH(ROW()-ROW($C$1),J:J,0),4),\"\")","v":""},{"$f":"IFERROR(INDEX(F:J,MATCH(ROW()-ROW($D$1),J:J,0),3),\"\")","v":""},null,null,null,null,null,0]
["","","","",null,null,null,null,null,0]
["","","","",null,null,null,null,null,0]
["","","","",null,null,null,null,null,0]
["","","","",null,null,null,null,null,0]
["","","","",null,null,null,null,null,0]
["","","","",null,null,null,null,null,0]
["","","","",null,null,null,null,null,0]
["","","","",null,null,null,null,null,0]
["","","","",null,null,null,null,null,0]
["","","","",null,null,null,null,null,0]
["","","","",null,null,null,null,null,0]
["","","","",null,null,null,null,null,0]
["","","","",null,null,null,null,null,0]
["","","","",null,null,null,null,null,0]
["","","","",null,null,null,null,null,0]
["","","","",null,null,null,null,null,0]
["","","","",null,null,null,null,null,0]
["","","","",null,null,null,null,null,0]
["","","","",null,null,null,null,null,0]
["","","","",null,null,null,null,null,0]
["","","","",null,null,null,null,null,0]
["","","","",null,null,null,null,null,0]
["","","","",null,null,null,null,null,0]
["","","","",null,null,null,null,null,0]
["","","","",null,null,null,null,null,0]
["","","","",null,null,null,null,null,0]
["","","","",null,null,null,null,null,0]
["","","","",null,null,null,null,null,0]
["","","","",null,null,null,null,null,0]
["","","","",null,null,null,null,null,0]
["","","","",null,null,null,null,null,0]
["","","","",null,null,null,null,null,0]
["","","","",null,null,null,null,null,0]
["","","","",null,null,null,null,null,0]
["","","","",null,null,null,null,null,0]
["","","","",null,null,null,null,null,0]
["","","","",null,null,null,null,null,{"$f":"COUNTIF(Vins,\"<=\"&G578)","v":0}]
["","","","",null,null,null,null,null,0]
["","","","",null,null,null,null,null,0]
["","","","",null,null,null,null,null,0]
["","","","",null,null,null,null,null,0]
["","","","",null,null,null,null,null,0]
["","","","",null,null,null,null,null,0]
["","","","",null,null,null,null,null,0]
["","","","",null,null,null,null,null,0]
["","","","",null,null,null,null,null,0]
["","","","",null,null,null,null,null,0]
["","","","",null,null,null,null,null,0]
["","","","",null,null,null,null,null,0]
["","","","",null,null,null,null,null,0]
["","","","",null,null,null,null,null,0]
["","","","",null,null,null,null,null,0]
["","","","",null,null,null,null,null,0]
["","","","",null,null,null,null,null,0]
["","","","",null,null,null,null,null,0]
["","","","",null,null,null,null,null,0]
["","","","",null,null,null,null,null,0]
["","","","",null,null,null,null,null,0]
["","","","",null,null,null,null,null,0]
["","","","",null,null,null,null,null,0]
["","","","",null,null,null,null,null,0]
["","","","",null,null,null,null,null,0]
["","","","",null,null,null,null,null,0]
[{"$f":"IFERROR(INDEX(F:J,MATCH(ROW()-ROW($B$1),J:J,0),1),\"\")","v":""},{"$f":"IFERROR(INDEX(F:J,MATCH(ROW()-ROW($B$1),J:J,0),2),\"\")","v":""},{"$f":"IFERROR(INDEX(F:J,MATCH(ROW()-ROW($C$1),J:J,0),4),\"\")","v":""},{"$f":"IFERROR(INDEX(F:J,MATCH(ROW()-ROW($D$1),J:J,0),3),\"\")","v":""},null,null,null,null,null,0]
["","","","",null,null,null,null,null,0]
["","","","",null,null,null,null,null,0]
["","","","",null,null,null,null,null,0]
["","","","",null,null,null,null,null,0]
["","","","",null,null,null,null,null,0]
["","","","",null,null,null,null,null,0]
["","","","",null,null,null,null,null,0]
["","","","",null,null,null,null,null,0]
["","","","",null,null,null,null,null,0]
["","","","",null,null,null,null,null,0]
["","","","",null,null,null,null,null,0]
["","","","",null,null,null,null,null,0]
["","","","",null,null,null,null,null,0]
["","","","",null,null,null,null,null,0]
["","","","",null,null,null,null,null,0]
["","","","",null,null,null,null,null,0]
["","","","",null,null,null,null,null,0]
["","","","",null,null,null,null,null,0]
["","","","",null,null,null,null,null,0]
["","","","",null,null,null,null,null,0]
["","","","",null,null,null,null,null,0]
["","","","",null,null,null,null,null,0]
["","","","",null,null,null,null,null,0]
["","","","",null,null,null,null,null,0]
["","","","",null,null,null,null,null,0]
["","","","",null,null,null,null,null,0]
["","","","",null,null,null,null,null,0]
["","","","",null,null,null,null,null,0]
["","","","",null,null,null,null,null,0]
["","","","",null,null,null,null,null,0]
["","","","",null,null,null,null,null,0]
["","","","",null,null,null,null,null,0]
["","","","",null,null,null,null,null,0]
["","","","",null,null,null,null,null,0]
["","","","",null,null,null,null,null,0]
["","","","",null,null,null,null,null,0]
["","","","",null,null,null,null,null,{"$f":"COUNTIF(Vins,\"<=\"&G642)","v":0}]
["","","","",null,null,null,null,null,0]
["","","","",null,null,null,null,null,0]
["","","","",null,null,null,null,null,0]
["","","","",null,null,null,null,null,0]
["","","","",null,null,null,null,null,0]
["","","","",null,null,null,null,null,0]
["","","","",null,null,null,null,null,0]
["","","","",null,null,null,null,null,0]
["","","","",null,null,null,null,null,0]
["","","","",null,null,null,null,null,0]
["","","","",null,null,null,null,null,0]
["","","","",null,null,null,null,null,0]
["","","","",null,null,null,null,null,0]
["","","","",null,null,null,null,null,0]
["","","","",null,null,null,null,null,0]
["","","","",null,null,null,null,null,0]
["","","","",null,null,null,null,null,0]
["","","","",null,null,null,null,null,0]
["","","","",null,null,null,null,null,0]
["","","","",null,null,null,null,null,0]
["","","","",null,null,null,null,null,0]
["","","","",null,null,null,null,null,0]
["","","","",null,null,null,null,null,0]
["","","","",null,null,null,null,null,0]
["","","","",null,null,null,null,null,0]
["","","","",null,null,null,null,null,0]
[{"$f":"IFERROR(INDEX(F:J,MATCH(ROW()-ROW($B$1),J:J,0),1),\"\")","v":""},{"$f":"IFERROR(INDEX(F:J,MATCH(ROW()-ROW($B$1),J:J,0),2),\"\")","v":""},{"$f":"IFERROR(INDEX(F:J,MATCH(ROW()-ROW($C$1),J:J,0),4),\"\")","v":""},{"$f":"IFERROR(INDEX(F:J,MATCH(ROW()-ROW($D$1),J:J,0),3),\"\")","v":""},null,null,null,null,null,0]
["","","","",null,null,null,null,null,0]
["","","","",null,null,null,null,null,0]
["","","","",null,null,null,null,null,0]
["","","","",null,null,null,null,null,0]
["","","","",null,null,null,null,null,0]
["","","","",null,null,null,null,null,0]
["","","","",null,null,null,null,null,0]
["","","","",null,null,null,null,null,0]
["","","","",null,null,null,null,null,0]
["","","","",null,null,null,null,null,0]
["","","","",null,null,null,null,null,0]
["","","","",null,null,null,null,null,0]
["","","","",null,null,null,null,null,0]
["","","","",null,null,null,null,null,0]
["","","","",null,null,null,null,null,0]
["","","","",null,null,null,null,null,0]
["","","","",null,null,null,null,null,0]
["","","","",null,null,null,null,null,0]
["","","","",null,null,null,null,null,0]
["","","","",null,null,null,null,null,0]
["","","","",null,null,null,null,null,0]
["","","","",null,null,null,null,null,0]
["","","","",null,null,null,null,null,0]
["","","","",null,null,null,null,null,0]
["","","","",null,null,null,null,null,0]
["","","","",null,null,null,null,null,0]
["","","","",null,null,null,null,null,0]
["","","","",null,null,null,null,null,0]
["","","","",null,null,null,null,null,0]
["","","","",null,null,null,null,null,0]
["","","","",null,null,null,null,null,0]
["","","","",null,null,null,null,null,0]
["","","","",null,null,null,null,null,0]
["","","","",null,null,null,null,null,0]
["","","","",null,null,null,null,null,0]
["","","","",null,null,null,null,null,0]
["","","","",null,null,null,null,null,{"$f":"COUNTIF(Vins,\"<=\"&G706)","v":0}]
["","","","",null,null,null,null,null,0]
["","","","",null,null,null,null,null,0]
["","","","",null,null,null,null,null,0]
["","","","",null,null,null,null,null,0]
["","","","",null,null,null,null,null,0]
["","","","",null,null,null,null,null,0]
["","","","",null,null,null,null,null,0]
["","","","",null,null,null,null,null,0]
["","","","",null,null,null,null,null,0]
["","","","",null,null,null,null,null,0]
["","","","",null,null,null,null,null,0]
["","","","",null,null,null,null,null,0]
["","","","",null,null,null,null,null,0]
["","","","",null,null,null,null,null,0]
["","","","",null,null,null,null,null,0]
["","","","",null,null,null,null,null,0]
["","","","",null,null,null,null,null,0]
["","","","",null,null,null,null,null,0]
["","","","",null,null,null,null,null,0]
["","","","",null,null,null,null,null,0]
["","","","",null,null,null,null,null,0]
["","","","",null,null,null,null,null,0]
["","","","",null,null,null,null,null,0]
["","","","",null,null,null,null,null,0]
["","","","",null,null,null,null,null,0]
["","","","",null,null,null,null,null,0]
[{"$f":"IFERROR(INDEX(F:J,MATCH(ROW()-ROW($B$1),J:J,0),1),\"\")","v":""},{"$f":"IFERROR(INDEX(F:J,MATCH(ROW()-ROW($B$1),J:J,0),2),\"\")","v":""},{"$f":"IFERROR(INDEX(F:J,MATCH(ROW()-ROW($C$1),J:J,0),4),\"\")","v":""},{"$f":"IFERROR(INDEX(F:J,MATCH(ROW()-ROW($D$1),J:J,0),3),\"\")","v":""},null,null,null,null,null,0]
["","","","",null,null,null,null,null,0]
["","","","",null,null,null,null,null,0]
["","","","",null,null,null,null,null,0]
["","","","",null,null,null,null,null,0]
["","","","",null,null,null,null,null,0]
["","","","",null,null,null,null,null,0]
["","","","",null,null,null,null,null,0]
["","","","",null,null,null,null,null,0]
["","","","",null,null,null,null,null,0]
["","","","",null,null,null,null,null,0]
["","","","",null,null,null,null,null,0]
["","","","",null,null,null,null,null,0]
["","","","",null,null,null,null,null,0]
["","","","",null,null,null,null,null,0]
["","","","",null,null,null,null,null,0]
["","","","",null,null,null,null,null,0]
["","","","",null,null,null,null,null,0]
["","","","",null,null,null,null,null,0]
["","","","",null,null,null,null,null,0]
["","","","",null,null,null,null,null,0]
["","","","",null,null,null,null,null,0]
["","","","",null,null,null,null,null,0]
["","","","",null,null,null,null,null,0]
["","","","",null,null,null,null,null,0]
["","","","",null,null,null,null,null,0]
["","","","",null,null,null,null,null,0]
["","","","",null,null,null,null,null,0]
["","","","",null,null,null,null,null,0]
["","","","",null,null,null,null,null,0]
["","","","",null,null,null,null,null,0]
["","","","",null,null,null,null,null,0]
["","","","",null,null,null,null,null,0]
["","","","",null,null,null,null,null,0]
["","","","",null,null,null,null,null,0]
["","","","",null,null,null,null,null,0]
["","","","",null,null,null,null,null,0]
["","","","",null,null,null,null,null,{"$f":"COUNTIF(Vins,\"<=\"&G770)","v":0}]
["","","","",null,null,null,null,null,0]
["","","","",null,null,null,null,null,0]
["","","","",null,null,null,null,null,0]
["","","","",null,null,null,null,null,0]
["","","","",null,null,null,null,null,0]
["","","","",null,null,null,null,null,0]
["","","","",null,null,null,null,null,0]
["","","","",null,null,null,null,null,0]
["","","","",null,null,null,null,null,0]
["","","","",null,null,null,null,null,0]
["","","","",null,null,null,null,null,0]
["","","","",null,null,null,null,null,0]
["","","","",null,null,null,null,null,0]
["","","","",null,null,null,null,null,0]
["","","","",null,null,null,null,null,0]
["","","","",null,null,null,null,null,0]
["","","","",null,null,null,null,null,0]
["","","","",null,null,null,null,null,0]
["","","","",null,null,null,null,null,0]
["","","","",null,null,null,null,null,0]
["","","","",null,null,null,null,null,0]
["","","","",null,null,null,null,null,0]
["","","","",null,null,null,null,null,0]
["","","","",null,null,null,null,null,0]
["","","","",null,null,null,null,null,0]
["","","","",null,null,null,null,null,0]
[{"$f":"IFERROR(INDEX(F:J,MATCH(ROW()-ROW($B$1),J:J,0),1),\"\")","v":""},{"$f":"IFERROR(INDEX(F:J,MATCH(ROW()-ROW($B$1),J:J,0),2),\"\")","v":""},{"$f":"IFERROR(INDEX(F:J,MATCH(ROW()-ROW($C$1),J:J,0),4),\"\")","v":""},{"$f":"IFERROR(INDEX(F:J,MATCH(ROW()-ROW($D$1),J:J,0),3),\"\")","v":""},null,null,null,null,null,0]
["","","","",null,null,null,null,null,0]
["","","","",null,null,null,null,null,0]
["","","","",null,null,null,null,null,0]
["","","","",null,null,null,null,null,0]
["","","","",null,null,null,null,null,0]
["","","","",null,null,null,null,null,0]
["","","","",null,null,null,null,null,0]
["","","","",null,null,null,null,null,0]
["","","","",null,null,null,null,null,0]
["","","","",null,null,null,null,null,0]
["","","","",null,null,null,null,null,0]
["","","","",null,null,null,null,null,0]
["","","","",null,null,null,null,null,0]
["","","","",null,null,null,null,null,0]
["","","","",null,null,null,null,null,0]
["","","","",null,null,null,null,null,0]
["","","","",null,null,null,null,null,0]
["","","","",null,null,null,null,null,0]
["","","","",null,null,null,null,null,0]
["","","","",null,null,null,null,null,0]
["","","","",null,null,null,null,null,0]
["","","","",null,null,null,null,null,0]
["","","","",null,null,null,null,null,0]
["","","","",null,null,null,null,null,0]
["","","","",null,null,null,null,null,0]
["","","","",null,null,null,null,null,0]
["","","","",null,null,null,null,null,0]
["","","","",null,null,null,null,null,0]
["","","","",null,null,null,null,null,0]
["","","","",null,null,null,null,null,0]
["","","","",null,null,null,null,null,0]
["","","","",null,null,null,null,null,0]
["","","","",null,null,null,null,null,0]
["","","","",null,null,null,null,null,0]
["","","","",null,null,null,null,null,0]
["","","","",null,null,null,null,null,0]
["","","","",null,null,null,null,null,{"$f":"COUNTIF(Vins,\"<=\"&G834)","v":0}]
["","","","",null,null,null,null,null,0]
["","","","",null,null,null,null,null,0]
["","","","",null,null,null,null,null,0]
["","","","",null,null,null,null,null,0]
["","","","",null,null,null,null,null,0]
["","","","",null,null,null,null,null,0]
["","","","",null,null,null,null,null,0]
["","","","",null,null,null,null,null,0]
["","","","",null,null,null,null,null,0]
["","","","",null,null,null,null,null,0]
["","","","",null,null,null,null,null,0]
["","","","",null,null,null,null,null,0]
["","","","",null,null,null,null,null,0]
["","","","",null,null,null,null,null,0]
["","","","",null,null,null,null,null,0]
["","","","",null,null,null,null,null,0]
["","","","",null,null,null,null,null,0]
["","","","",null,null,null,null,null,0]
["","","","",null,null,null,null,null,0]
["","","","",null,null,null,null,null,0]
["","","","",null,null,null,null,null,0]
["","","","",null,null,null,null,null,0]
["","","","",null,null,null,null,null,0]
["","","","",null,null,null,null,null,0]
["","","","",null,null,null,null,null,0]
["","","","",null,null,null,null,null,0]
[{"$f":"IFERROR(INDEX(F:J,MATCH(ROW()-ROW($B$1),J:J,0),1),\"\")","v":""},{"$f":"IFERROR(INDEX(F:J,MATCH(ROW()-ROW($B$1),J:J,0),2),\"\")","v":""},{"$f":"IFERROR(INDEX(F:J,MATCH(ROW()-ROW($C$1),J:J,0),4),\"\")","v":""},{"$f":"IFERROR(INDEX(F:J,MATCH(ROW()-ROW($D$1),J:J,0),3),\"\")","v":""},null,null,null,null,null,0]
["","","","",null,null,null,null,null,0]
["","","","",null,null,null,null,null,0]
["","","","",null,null,null,null,null,0]
["","","","",null,null,null,null,null,0]
["","","","",null,null,null,null,null,0]
["","","","",null,null,null,null,null,0]
["","","","",null,null,null,null,null,0]
["","","","",null,null,null,null,null,0]
["","","","",null,null,null,null,null,0]
["","","","",null,null,null,null,null,0]
["","","","",null,null,null,null,null,0]
["","","","",null,null,null,null,null,0]
["","","","",null,null,null,null,null,0]
["","","","",null,null,null,null,null,0]
["","","","",null,null,null,null,null,0]
["","","","",null,null,null,null,null,0]
["","","","",null,null,null,null,null,0]
["","","","",null,null,null,null,null,0]
["","","","",null,null,null,null,null,0]
["","","","",null,null,null,null,null,0]
["","","","",null,null,null,null,null,0]
["","","","",null,null,null,null,null,0]
["","","","",null,null,null,null,null,0]
["","","","",null,null,null,null,null,0]
["","","","",null,null,null,null,null,0]
["","","","",null,null,null,null,null,0]
["","","","",null,null,null,null,null,0]
["","","","",null,null,null,null,null,0]
["","","","",null,null,null,null,null,0]
["","","","",null,null,null,null,null,0]
["","","","",null,null,null,null,null,0]
["","","","",null,null,null,null,null,0]
["","","","",null,null,null,null,null,0]
["","","","",null,null,null,null,null,0]
["","","","",null,null,null,null,null,0]
["","","","",null,null,null,null,null,0]
["","","","",null,null,null,null,null,{"$f":"COUNTIF(Vins,\"<=\"&G898)","v":0}]
["","","","",null,null,null,null,null,0]
["","","","",null,null,null,null,null,0]
["","","","",null,null,null,null,null,0]
["","","","",null,null,null,null,null,0]
["","","","",null,null,null,null,null,0]
["","","","",null,null,null,null,null,0]
["","","","",null,null,null,null,null,0]
["","","","",null,null,null,null,null,0]
["","","","",null,null,null,null,null,0]
["","","","",null,null,null,null,null,0]
["","","","",null,null,null,null,null,0]
["","","","",null,null,null,null,null,0]
["","","","",null,null,null,null,null,0]
["","","","",null,null,null,null,null,0]
["","","","",null,null,null,null,null,0]
["","","","",null,null,null,null,null,0]
["","","","",null,null,null,null,null,0]
["","","","",null,null,null,null,null,0]
["","","","",null,null,null,null,null,0]
["","","","",null,null,null,null,null,0]
["","","","",null,null,null,null,null,0]
["","","","",null,null,null,null,null,0]
["","","","",null,null,null,null,null,0]
["","","","",null,null,null,null,null,0]
["","","","",null,null,null,null,null,0]
["","","","",null,null,null,null,null,0]
[{"$f":"IFERROR(INDEX(F:J,MATCH(ROW()-ROW($B$1),J:J,0),1),\"\")","v":""},{"$f":"IFERROR(INDEX(F:J,MATCH(ROW()-ROW($B$1),J:J,0),2),\"\")","v":""},{"$f":"IFERROR(INDEX(F:J,MATCH(ROW()-ROW($C$1),J:J,0),4),\"\")","v":""},{"$f":"IFERROR(INDEX(F:J,MATCH(ROW()-ROW($D$1),J:J,0),3),\"\")","v":""},null,null,null,null,null,0]
["","","","",null,null,null,null,null,0]
["","","","",null,null,null,null,null,0]
["","","","",null,null,null,null,null,0]
["","","","",null,null,null,null,null,0]
["","","","",null,null,null,null,null,0]
["","","","",null,null,null,null,null,0]
["","","","",null,null,null,null,null,0]
["","","","",null,null,null,null,null,0]
["","","","",null,null,null,null,null,0]
["","","","",null,null,null,null,null,0]
["","","","",null,null,null,null,null,0]
["","","","",null,null,null,null,null,0]
["","","","",null,null,null,null,null,0]
["","","","",null,null,null,null,null,0]
["","","","",null,null,null,null,null,0]
["","","","",null,null,null,null,null,0]
["","","","",null,null,null,null,null,0]
["","","","",null,null,null,null,null,0]
["","","","",null,null,null,null,null,0]
["","","","",null,null,null,null,null,0]
["","","","",null,null,null,null,null,0]
["","","","",null,null,null,null,null,0]
["","","","",null,null,null,null,null,0]
["","","","",null,null,null,null,null,0]
["","","","",null,null,null,null,null,0]
["","","","",null,null,null,null,null,0]
["","","","",null,null,null,null,null,0]
["","","","",null,null,null,null,null,0]
["","","","",null,null,null,null,null,0]
["","","","",null,null,null,null,null,0]
["","","","",null,null,null,null,null,0]
["","","","",null,null,null,null,null,0]
["","","","",null,null,null,null,null,0]
["","","","",null,null,null,null,null,0]
["","","","",null,null,null,null,null,0]
["","","","",null,null,null,null,null,0]
["","","","",null,null,null,null,null,{"$f":"COUNTIF(Vins,\"<=\"&G962)","v":0}]
["","","","",null,null,null,null,null,0]
["","","","",null,null,null,null,null,0]
["","","","",null,null,null,null,null,0]
["","","","",null,null,null,null,null,0]
["","","","",null,null,null,null,null,0]
["","","","",null,null,null,null,null,0]
["","","","",null,null,null,null,null,0]
["","","","",null,null,null,null,null,0]
["","","","",null,null,null,null,null,0]
["","","","",null,null,null,null,null,0]
["","","","",null,null,null,null,null,0]
["","","","",null,null,null,null,null,0]
["","","","",null,null,null,null,null,0]
["","","","",null,null,null,null,null,0]
["","","","",null,null,null,null,null,0]
["","","","",null,null,null,null,null,0]
["","","","",null,null,null,null,null,0]
["","","","",null,null,null,null,null,0]
["","","","",null,null,null,null,null,0]
["","","","",null,null,null,null,null,0]
["","","","",null,null,null,null,null,0]
["","","","",null,null,null,null,null,0]
["","","","",null,null,null,null,null,0]
["","","","",null,null,null,null,null,0]
["","","","",null,null,null,null,null,0]
["","","","",null,null,null,null,null,0]
[{"$f":"IFERROR(INDEX(F:J,MATCH(ROW()-ROW($B$1),J:J,0),1),\"\")","v":""},{"$f":"IFERROR(INDEX(F:J,MATCH(ROW()-ROW($B$1),J:J,0),2),\"\")","v":""},{"$f":"IFERROR(INDEX(F:J,MATCH(ROW()-ROW($C$1),J:J,0),4),\"\")","v":""},{"$f":"IFERROR(INDEX(F:J,MATCH(ROW()-ROW($D$1),J:J,0),3),\"\")","v":""},null,null,null,null,null,0]
["","","","",null,null,null,null,null,0]
["","","","",null,null,null,null,null,0]
["","","","",null,null,null,null,null,0]
["","","","",null,null,null,null,null,0]
["","","","",null,null,null,null,null,0]
["","","","",null,null,null,null,null,0]
["","","","",null,null,null,null,null,0]
["","","","",null,null,null,null,null,0]
["","","","",null,null,null,null,null,0]
["","","","",null,null,null,null,null,0]
["","","","",null,null,null,null,null,0]

{"sheet":"Paramètres","index":4,"n_rows":46,"n_cols":6,"rows_kept":46,"cut":false,"hidden":false,"merged":[]}
["APPELLATION","NOMBRE\nD'APPELLATION",null,"VINS DISPONIBLES\n(ordre alphabétique)",null,"LIEUX"]
["ALOXE CORTON",{"$f":"COUNTA(A:A)-1","v":32},null,"Aloxe Corton Fanny Sabre 2018",null,"Étagère 1"]
["ALSACE",null,null,"Au Bas de Poillange 2018",null,"Étagère 1 et 2"]
["AUXEY DURESSES",null,null,"Au Grand Bussière 2019",null,"Étagère 1, 2 et 3"]
["BLAYE",null,null,"Auxey Duresses 2020",null,"Étagère 2"]
["CHAMPAGNE",null,null,"Bellissima ",null,"Étagère 3"]
["CHASSAGNE MONTRACHET",null,null,"Champagne Canard Duchêne",null,"Étagère 3 et 4"]
["CONDRIEU",null,null,"Champagne Drapier",null,"Étagère 4"]
["CÔTES DE BORDEAUX",null,null,"Champagne Moët & Chandon",null,"Étagère 5"]
["GRAVES",null,null,"Champagne Tribaut 2023",null,"Cuisine "]
["HAUTES CÔTES DE NUITS",null,null,"Château Canon St Michel 2015",null,"Garage"]
["LADOIX",null,null,"Château Cap Saint Martin 2015"]
["MARGAUX",null,null,"Château de Bligny"]
["MENETOU SALON",null,null,"Château La Peyre 2015"]
["MERCUREY",null,null,"Château Lusseau 2014"]
["NUITS ST GEORGES",null,null,"Château Meyney 2016"]
["PERNAND VERGELESS",null,null,"Château Montlabert 2015"]
["PESSAC LÉOGNAN",null,null,"Clos René 2015"]
["POMEROL",null,null,"Connétable Talbot 2016"]
["POMMARD",null,null,"Domaine FERRET 2017"]
["POUILLY FUISSÉ",null,null,"Domaine Fontaine Gagnard 2017"]
["POUILLY FUMÉ",null,null,"Domaine Fontaine Gagnard 2018"]
["RIESLING",null,null,"Etoile by Haut Nouchet blanc 2020"]
["RULLY",null,null,"La réserve de Malartic 2014"]
["SAINT ÉMILION",null,null,"La Toppe au Vert 2017"]
["SAINT ESTÈPHE",null,null,"Ladoix Les Gréchons 2018"]
["SAINT JOSEPH",null,null,"Ladoix Les Hautes Mourottes 2018"]
["SAINT ROMAIN",null,null,"Les Argillats 2019"]
["SAINT VÉRAN",null,null,"Les Chauchoux 2020"]
["SAVIGNY LES BEAUNE",null,null,"Les Creux Fraîche Eau 2021"]
["ST JULIEN",null,null,"Les Fichots 2018"]
["VIRÉ CLESSÉ",null,null,"Les Grésigny 2018"]
["VOSNE ROMANÉE",null,null,"Les Hauts Jarrons 2018"]
[null,null,null,"Les Rugiens 2016"]
[null,null,null,"Lyseras 2017"]
[null,null,null,"Morgeot 1er Cru 2017"]
[null,null,null,"Naudé-22"]
[null,null,null,"Naudé-23"]
[null,null,null,"Pagus Luminis 2019"]
[null,null,null,"Quintaine 2019"]
[null,null,null,"Riesling 2018"]
[null,null,null,"Rully 1er Cru La Pucelle 2018"]
[null,null,null,"Rully 1er Cru Les Crêts 2018"]
[null,null,null,"S de Schlumberger 2022"]
[null,null,null,"Sirène de Giscours 2016"]
[null,null,null,"Tonelum 2018"]