{"text_format":"1","workbook":"xlsx","n_sheets":6,"sheets":["Achats","Plan_de_Cave","Dégusté_le","Listedevins","Tarif","Paramètres"],"not_rendered":{"charts":3,"images":0,"macros":1,"external_links":0,"defined_names":7,"comments":0,"pivot_tables":0},"unopened":[],"bounds":{"document_bytes":16777216,"sheet_cells":100000,"rows_first":2000,"rows_last":500,"rows_between":2000,"halvings":0,"cell_chars":16384,"cell_head_chars":4096},"cells_cut":0,"cells_raw":0,"read":"whole","date_system":"1900"}

{"sheet":"Achats","index":0,"n_rows":1000,"n_cols":16,"rows_kept":1000,"cut":false,"hidden":false,"merged":[[2,13,2,15]]}
["NOM","APPELLATION","COULEUR","ANNÉE","PRIX","DATE D'ACHAT","NOMBRE DE BOUTEILLES ACHETÉES","ENSEIGNE / REMARQUE","NOMBRE DE BOUTEILLES CONSOMMÉES","NOMBRE DE BOUTEILLES RESTANT EN CAVE","EMPLACEMENT","NUMÉRO","NOMBRE TOTAL","NOMBRE DE BOUTEILLES \"Rouge\"","NOMBRE DE BOUTEILLES \"Blanc\"","NOMBRE DE BOUTEILLES \"Champagne\""]
["Château Lusseau 2014","GRAVES","Rouge",2014,null,"2018-10-04",2,"Caves de la Rocade",{"$f":"SUMIF(Dégusté_le!$B$2:$B$10000,\"=Château Lusseau 2014\",Dégusté_le!$C$2:$C$10000)","v":1},{"$f":"IF(A2>0,(G2-I2),\"\")","v":1},"Étagère 3","R16",{"$f":"SUM(N2:P2)","v":144},{"$f":"SUMIFS(J:J,C:C,\"Rouge\")","v":61},{"$f":"SUMIFS($J:$J,$C:$C,\"Blanc\")","v":53},{"$f":"SUMIFS($J:$J,$C:$C,\"Champagne\")","v":30}]
["Château Cap Saint Martin 2015","BLAYE","Rouge",2015,null,"2018-10-04",4,"Caves de la Rocade",{"$f":"SUMIF(Dégusté_le!$B$2:$B$10000,\"=Château Cap Saint Martin 2015\",Dégusté_le!$C$2:$C$10000)","v":0},4,"Étagère 1","R17",null,"ANNÉE LA PLUS ANCIENNE"]
["Lyseras 2017","SAINT JOSEPH","Blanc",2017,null,"2019-01-22",2,"Caves de la Rocade",{"$f":"SUMIF(Dégusté_le!$B$2:$B$10000,\"=Lyseras 2017\",Dégusté_le!$C$2:$C$10000)","v":1},1,"Étagère 4","B9",null,{"$f":"_xlfn.MINIFS(D:D,J:J,\">0\",C:C,\"Rouge\")","v":2014},{"$f":"_xlfn.MINIFS($D:$D,$J:$J,\">0\",$C:$C,\"Blanc\")","v":2017},{"$f":"_xlfn.MINIFS($D:$D,$J:$J,\">0\",$C:$C,\"Champagne\")","v":2022}]
["Confidences Prieuré Lichine 2015","MARGAUX","Rouge",2015,27.9,"2019-01-22",2,"Caves de la Rocade",{"$f":"SUMIF(Dégusté_le!$B$2:$B$10000,\"=Confidences Prieuré Lichine 2015\",Dégusté_le!$C$2:$C$10000)","v":2},0,"Étagère 2","R7"]
["La réserve de Malartic 2014","PESSAC LÉOGNAN","Rouge",2014,24.8,"2019-01-22",1,"Caves de la Rocade",{"$f":"SUMIF(Dégusté_le!$B$2:$B$10000,\"=La réserve de Malartic 2014\",Dégusté_le!$C$2:$C$10000)","v":0},1,"Étagère 3","R6"]
["Domaine Fontaine Gagnard 2017","CHASSAGNE MONTRACHET","Blanc",2017,44,"2019-05-01",1,"Caves de la Rocade",{"$f":"SUMIF(Dégusté_le!$B$2:$B$10000,\"=Domaine Fontaine Gagnard 2017\",Dégusté_le!$C$2:$C$10000)","v":0},1,"Étagère 4","B5"]
["Château Canon St Michel 2015","GRAVES","Rouge",2015,14.8,"2019-05-19",1,"Caves de la Rocade",{"$f":"SUMIF(Dégusté_le!$B$2:$B$10000,\"=Château Canon St Michel 2015\",Dégusté_le!$C$2:$C$10000)","v":0},1,"Étagère 3","R15"]
["Bellissima ","CÔTE RÔTIE","Rouge",2016,19.5,"2019-06-22",2,"Caves de la Rocade",{"$f":"SUMIF(Dégusté_le!$B$2:$B$10000,\"=Bellissima\",Dégusté_le!$C$2:$C$10000)","v":2},0,"Étagère 2"]
["Au Bas de Poillange 2018","SAINT ROMAIN","Blanc",2018,20,"2019-08-01",6,"Domaine Capitain-Gagnerot",{"$f":"SUMIF(Dégusté_le!$B$2:$B$10000,\"=Au Bas de Poillange 2018\",Dégusté_le!$C$2:$C$10000)","v":1},5,"Étagère 4","B8"]
["Aux Ravioles 2017","VOSNE ROMANÉE","Rouge",2017,36,"2019-08-01",5,"Domaine Capitain-Gagnerot",{"$f":"SUMIF(Dégusté_le!$B$2:$B$10000,\"=Aux Ravioles 2017\",Dégusté_le!$C$2:$C$10000)","v":5},0,"Étagère 2","R11"]
["La Toppe au Vert 2017","ALOXE CORTON","Rouge",2017,28,"2019-08-01",6,"Domaine Capitain-Gagnerot",{"$f":"SUMIF(Dégusté_le!$B$2:$B$10000,\"=La Toppe au Vert 2017\",Dégusté_le!$C$2:$C$10000)","v":4},2,"Étagère 3","R10"]
["Domaine Fontaine Gagnard 2018","CHASSAGNE MONTRACHET","Blanc",2018,44,"2020-01-14",4,"Caves de la Rocade",{"$f":"SUMIF(Dégusté_le!$B$2:$B$10000,\"=Domaine Fontaine Gagnard 2018\",Dégusté_le!$C$2:$C$10000)","v":1},3,"Étagère 4","B10"]
["Ladoix Les Hautes Mourottes 2018","LADOIX","Blanc",2018,28,"2020-01-31",6,"Domaine Capitain-Gagnerot",{"$f":"SUMIF(Dégusté_le!$B$2:$B$10000,\"=Ladoix Les Hautes Mourottes 2018\",Dégusté_le!$C$2:$C$10000)","v":4},2,"Étagère 4","B13"]
["Ladoix Les Gréchons 2018","LADOIX","Blanc",2018,27,"2020-01-31",6,"Domaine Capitain-Gagnerot",{"$f":"SUMIF(Dégusté_le!$B$2:$B$10000,\"=Ladoix Les Gréchons 2018\",Dégusté_le!$C$2:$C$10000)","v":1},5,"Étagère 4","B12"]
["Rully 1er Cru La Pucelle 2018","RULLY","Blanc",2018,15,"2020-05-22",6,"Domaine (Jean Charles)",{"$f":"SUMIF(Dégusté_le!$B$2:$B$10000,\"=Rully 1er Cru La Pucelle 2018\",Dégusté_le!$C$2:$C$10000)","v":1},5,"Étagère 4","B17"]
["Rully 1er Cru Les Crêts 2018","MERCUREY","Rouge",2018,15,"2020-05-22",6,"Domaine (Jean Charles)",{"$f":"SUMIF(Dégusté_le!$B$2:$B$10000,\"=Rully 1er Cru Les Crêts 2018\",Dégusté_le!$C$2:$C$10000)","v":3},3,"Étagère 3","R29"]
["Quintaine 2017","VIRÉ CLESSÉ","Blanc",2017,14,"2020-12-18",24,"Domaine Michel (Ronan)",{"$f":"SUMIF(Dégusté_le!$B$2:$B$10000,\"=Quintaine 2017\",Dégusté_le!$C$2:$C$10000)","v":24},0,null,"B18"]
["Riesling 2018","RIESLING","Blanc",2018,25,"2021-02-14",2,"Cadeau Sophie St Valentin",{"$f":"SUMIF(Dégusté_le!$B$2:$B$10000,\"=Riesling 2018\",Dégusté_le!$C$2:$C$10000)","v":1},1,"Étagère 4","B19"]
["Domaine FERRET 2017","POUILLY FUISSÉ","Blanc",2017,23.99,"2021-03-03",2,"Métro",{"$f":"SUMIF(Dégusté_le!$B$2:$B$10000,\"=Domaine FERRET 2017\",Dégusté_le!$C$2:$C$10000)","v":1},1,"Étagère 4","B20"]
["Morgeot 1er Cru 2017","CHASSAGNE MONTRACHET","Rouge",2017,31.07,"2021-03-03",3,"Métro",{"$f":"SUMIF(Dégusté_le!$B$2:$B$10000,\"=Morgeot 1er Cru 2017\",Dégusté_le!$C$2:$C$10000)","v":2},1,"Étagère 3","R32"]
["Ronan By Client 2012","POMEROL","Rouge",2012,6,"2021-03-30",6,"Joyaux des Vignes",{"$f":"SUMIF(Dégusté_le!$B$2:$B$10000,\"=Ronan By Client 2012\",Dégusté_le!$C$2:$C$10000)","v":6},0,null,"R36"]
["Clos René 2015","POMEROL","Rouge",2015,28.79,"2021-04-29",8,"Métro",{"$f":"SUMIF(Dégusté_le!$B$2:$B$10000,\"=Clos René 2015\",Dégusté_le!$C$2:$C$10000)","v":2},6,"Étagère 1 et 2","R37"]
["Château Montlabert 2015","ST ÉMILION","Rouge",2015,17.39,"2021-04-29",12,"Métro",{"$f":"SUMIF(Dégusté_le!$B$2:$B$10000,\"=Château Montlabert 2015\",Dégusté_le!$C$2:$C$10000)","v":4},8,"Étagère 2","R38"]
["Pagus Luminis 2019","CONDRIEU","Blanc",2019,31.89,"2021-07-30",6,"Caves de la Rocade",{"$f":"SUMIF(Dégusté_le!$B$2:$B$10000,\"=Pagus Luminis 2019\",Dégusté_le!$C$2:$C$10000)","v":1},5,"Étagère 3 et 4","B6"]
["Ermitage 2020","MENETOU SALON","Blanc",2020,8.8699999999999992,"2021-10-05",24,"Métro",{"$f":"SUMIF(Dégusté_le!$B$2:$B$10000,\"=Ermitage 2020\",Dégusté_le!$C$2:$C$10000)","v":24},0,"Garage"]
["Connétable Talbot 2016","SAINT JULIEN","Rouge",2016,23.99,"2021-10-05",6,"Métro",{"$f":"SUMIF(Dégusté_le!$B$2:$B$10000,\"=Connétable Talbot 2016\",Dégusté_le!$C$2:$C$10000)","v":1},5,"Étagère 1","R40"]
["Sirène de Giscours 2016","MARGAUX","Rouge",2016,27.11,"2021-10-05",6,"Métro",{"$f":"SUMIF(Dégusté_le!$B$2:$B$10000,\"=Sirène de Giscours 2016\",Dégusté_le!$C$2:$C$10000)","v":0},6,"Étagère 1, 2 et 3","R39"]
["Les Vaumuriens 2017","POMMARD","Rouge",2017,null,"2022-01-01",1,"Cadeau Anthony",{"$f":"SUMIF(Dégusté_le!$B$2:$B$10000,\"=Les Vaumuriens 2017\",Dégusté_le!$C$2:$C$10000)","v":1},0,null,"R44"]
["Les Grésigny 2018","RULLY","Blanc",2018,28,"2022-03-13",6,"Cave Moillard",{"$f":"SUMIF(Dégusté_le!$B$2:$B$10000,\"=Les Grésigny 2018\",Dégusté_le!$C$2:$C$10000)","v":0},6,"Étagère 4","B24"]
["Les Hauts Jarrons 2018","SAVIGNY LES BEAUNE","Blanc",2018,34,"2022-03-13",6,"Cave Moillard",{"$f":"SUMIF(Dégusté_le!$B$2:$B$10000,\"=Les Hauts Jarrons 2018\",Dégusté_le!$C$2:$C$10000)","v":0},6,"Étagère 4","B25"]
["Les Argillats 2019","NUITS ST GEORGES","Rouge",2019,46,"2022-03-13",3,"Cave Moillard",{"$f":"SUMIF(Dégusté_le!$B$2:$B$10000,\"=Les Argillats 2019\",Dégusté_le!$C$2:$C$10000)","v":0},3,"Étagère 1","R48"]
["Les Rugiens 2016","POMMARD","Rouge",2016,58,"2022-03-13",3,"Cave Moillard",{"$f":"SUMIF(Dégusté_le!$B$2:$B$10000,\"=Les Rugiens 2016\",Dégusté_le!$C$2:$C$10000)","v":0},3,"Étagère 1","R47"]
["Les Fichots 2018","PERNAND VERGELESS","Rouge",2018,28,"2022-03-13",6,"Cave Moillard",{"$f":"SUMIF(Dégusté_le!$B$2:$B$10000,\"=Les Fichots 2018\",Dégusté_le!$C$2:$C$10000)","v":0},6,"Étagère 1","R46"]
["Château La Peyre 2015","ST ESTÈPHE","Rouge",2015,21.67,"2022-04-21",12,"Ariès Vins",{"$f":"SUMIF(Dégusté_le!$B$2:$B$10000,\"=Château La Peyre 2015\",Dégusté_le!$C$2:$C$10000)","v":7},5,"Étagère 3","R49"]
["Etoile by Haut Nouchet blanc 2020","PESSAC LÉOGNAN","Blanc",2020,12.9,"2022-05-06",6,"Domaine Haut Nouchet",{"$f":"SUMIF(Dégusté_le!$B$2:$B$10000,\"=Etoile by Haut Nouchet blanc 2020\",Dégusté_le!$C$2:$C$10000)","v":4},2,"Étagère 5","B26"]
["S de Schlumberger 2022","ALSACE","Blanc",2022,12.1,"2022-05-20",30,"Domaine Schlumberger",{"$f":"SUMIF(Dégusté_le!$B$2:$B$10000,\"=S de Schlumberger 2022\",Dégusté_le!$C$2:$C$10000)","v":28},2,"Cuisine","B27"]
["Naudé-22","CHAMPAGNE","Champagne",2022,18.05,"2022-06-21",24,"Jean Charles",{"$f":"SUMIF(Dégusté_le!$B$2:$B$10000,\"=Naudé-22\",Dégusté_le!$C$2:$C$10000)","v":22},2,"Garage"]
["Quintaine 2019","VIRÉ CLESSÉ","Blanc",2019,15.8,"2022-09-27",4,"Domaine Michel (Ronan)",{"$f":"SUMIF(Dégusté_le!$B$2:$B$10000,\"=Quintaine 2019\",Dégusté_le!$C$2:$C$10000)","v":0},4,"Étagère 5"]
["Domaine Moillard 2018","HAUTES CÔTES DE NUITS","Blanc",2018,18,"2022-11-25",1,"Cave Moillard",{"$f":"SUMIF(Dégusté_le!$B$2:$B$10000,\"=Domaine Moillard 2018\",Dégusté_le!$C$2:$C$10000)","v":1},0,"Étagère 4"]
["Au Grand Bussière 2019","SAINT VÉRAN","Blanc",2019,null,"2023-06-18",1,"Cadeau Marie/Alizée",{"$f":"SUMIF(Dégusté_le!$B$2:$B$10000,\"=Au Grand Bussière 2019\",Dégusté_le!$C$2:$C$10000)","v":0},1,"Étagère 3","B44"]
["Champagne Canard Duchêne","CHAMPAGNE","Champagne",2023,null,"2023-06-20",1,"Cadeau Jean Charles/Michèle",{"$f":"SUMIF(Dégusté_le!$B$2:$B$10000,\"=Champagne Canard Duchêne\",Dégusté_le!$C$2:$C$10000)","v":0},1,"Garage"]
["Champagne Tribaut 2023","CHAMPAGNE","Champagne",2023,19.739999999999998,"2023-07-06",6,"Métro",{"$f":"SUMIF(Dégusté_le!$B$2:$B$10000,\"=Champagne Tribaut 2023\",Dégusté_le!$C$2:$C$10000)","v":0},6,"Garage"]
["Aloxe Corton Fanny Sabre 2018","ALOXE CORTON","Rouge",2018,null,"2023-07-06",1,"Cadeau Alizée",{"$f":"SUMIF(Dégusté_le!$B$2:$B$10000,\"=Aloxe Corton Fanny Sabre 2018\",Dégusté_le!$C$2:$C$10000)","v":0},1,"Étagère 1","R46"]
["Château Meyney 2016","ST ESTÈPHE","Rouge",2016,23.99,"2023-07-06",1,"Cadeau Marie/Alizée",{"$f":"SUMIF(Dégusté_le!$B$2:$B$10000,\"=Château Meyney 2016\",Dégusté_le!$C$2:$C$10000)","v":0},1,"Étagère 4"]
["Auxey Duresses 2020","AUXEY DURESSES","Rouge",2020,15.48,"2023-07-06",2,"Cadeau Marie/Alizée",{"$f":"SUMIF(Dégusté_le!$B$2:$B$10000,\"=Auxey Duresses 2020\",Dégusté_le!$C$2:$C$10000)","v":0},2,"Étagère 3"]
["Château de Bligny","CHAMPAGNE","Champagne",2023,null,"2023-07-22",1,"Cadeau Marc/Maria",{"$f":"SUMIF(Dégusté_le!$B$2:$B$10000,\"=Château de Bligny\",Dégusté_le!$C$2:$C$10000)","v":0},1,"Garage"]
["Les Chauchoux 2020","RULLY","Rouge",2020,20.39,"2023-08-06",2,"Cadeau Marie/Alizée",{"$f":"SUMIF(Dégusté_le!$B$2:$B$10000,\"=Les Chauchoux 2020\",Dégusté_le!$C$2:$C$10000)","v":0},2,"Étagère 4"]
["Champagne Drapier","CHAMPAGNE","Champagne",2023,null,"2023-08-14",1,"Cadeau Fred/Béa",{"$f":"SUMIF(Dégusté_le!$B$2:$B$10000,\"=Champagne Drapier\",Dégusté_le!$C$2:$C$10000)","v":0},1,"Garage"]
["Naudé 23","CHAMPAGNE","Champagne",2023,19.149999999999999,"2023-08-30",18,"Jean Charles",{"$f":"SUMIF(Dégusté_le!$B$2:$B$10000,\"=Naudé-23\",Dégusté_le!$C$2:$C$10000)","v":0},18,"Garage"]
["Les Creux Fraîche Eau 2021","NUITS ST GEORGES","Blanc",2021,32.39,"2023-09-06",2,"Cadeau Marie/Alizée",{"$f":"SUMIF(Dégusté_le!$B$2:$B$10000,\"=Les Creux Fraîche Eau 2021\",Dégusté_le!$C$2:$C$10000)","v":0},2,"Étagère 3"]
["Tonelum 2018","POUILLY FUMÉ","Blanc",2018,null,"2023-10-29",1,"Cadeau Marc",{"$f":"SUMIF(Dégusté_le!$B$2:$B$10000,\"=Tonelum 2018\",Dégusté_le!$C$2:$C$10000)","v":0},1,"Étagère 3","B45"]
["Champagne Moët & Chandon","CHAMPAGNE","Champagne",2023,null,"2023-11-03",1,"Cadeau Claude/Corinne",{"$f":"SUMIF(Dégusté_le!$B$2:$B$10000,\"=Champagne Moët & Chandon\",Dégusté_le!$C$2:$C$10000)","v":0},1,"Garage"]
[null,null,null,null,null,null,null,null,null,""]
[null,null,null,null,null,null,null,null,null,""]
[null,null,null,null,null,null,null,null,null,""]
[null,null,null,null,null,null,null,null,null,""]
[null,null,null,null,null,null,null,null,null,""]
[null,null,null,null,null,null,null,null,null,""]
[null,null,null,null,null,null,null,null,null,""]
[null,null,null,null,null,null,null,null,null,""]
[null,null,null,null,null,null,null,null,null,""]
[null,null,null,null,null,null,null,null,null,""]
[null,null,null,null,null,null,null,null,null,""]
[null,null,null,null,null,null,null,null,null,""]
[null,null,null,null,null,null,null,null,null,{"$f":"IF(A66>0,(G66-I66),\"\")","v":""}]
[null,null,null,null,null,null,null,null,null,""]
[null,null,null,null,null,null,null,null,null,""]
[null,null,null,null,null,null,null,null,null,""]
[null,null,null,null,null,null,null,null,null,""]
[null,null,null,null,null,null,null,null,null,""]
[null,null,null,null,null,null,null,null,null,""]
[null,null,null,null,null,null,null,null,null,""]
[null,null,null,null,null,null,null,null,null,""]
[null,null,null,null,null,null,null,null,null,""]
[null,null,null,null,null,null,null,null,null,""]
[null,null,null,null,null,null,null,null,null,""]
[null,null,null,null,null,null,null,null,null,""]
[null,null,null,null,null,null,null,null,null,""]
[null,null,null,null,null,null,null,null,null,""]
[null,null,null,null,null,null,null,null,null,""]
[null,null,null,null,null,null,null,null,null,""]
[null,null,null,null,null,null,null,null,null,""]
[null,null,null,null,null,null,null,null,null,""]
[null,null,null,null,null,null,null,null,null,""]
[null,null,null,null,null,null,null,null,null,""]
[null,null,null,null,null,null,null,null,null,""]
[null,null,null,null,null,null,null,null,null,""]
[null,null,null,null,null,null,null,null,null,""]
[null,null,null,null,null,null,null,null,null,""]
[null,null,null,null,null,null,null,null,null,""]
[null,null,null,null,null,null,null,null,null,""]
[null,null,null,null,null,null,null,null,null,""]
[null,null,null,null,null,null,null,null,null,""]
[null,null,null,null,null,null,null,null,null,""]
[null,null,null,null,null,null,null,null,null,""]
[null,null,null,null,null,null,null,null,null,""]
[null,null,null,null,null,null,null,null,null,""]
[null,null,null,null,null,null,null,null,null,""]
[null,null,null,null,null,null,null,null,null,""]
[null,null,null,null,null,null,null,null,null,""]
[null,null,null,null,null,null,null,null,null,""]
[null,null,null,null,null,null,null,null,null,""]
[null,null,null,null,null,null,null,null,null,""]
[null,null,null,null,null,null,null,null,null,""]
[null,null,null,null,null,null,null,null,null,""]
[null,null,null,null,null,null,null,null,null,""]
[null,null,null,null,null,null,null,null,null,""]
[null,null,null,null,null,null,null,null,null,""]
[null,null,null,null,null,null,null,null,null,""]
[null,null,null,null,null,null,null,null,null,""]
[null,null,null,null,null,null,null,null,null,""]
[null,null,null,null,null,null,null,null,null,""]
[null,null,null,null,null,null,null,null,null,""]
[null,null,null,null,null,null,null,null,null,""]
[null,null,null,null,null,null,null,null,null,""]
[null,null,null,null,null,null,null,null,null,""]
[null,null,null,null,null,null,null,null,null,""]
[null,null,null,null,null,null,null,null,null,""]
[null,null,null,null,null,null,null,null,null,""]
[null,null,null,null,null,null,null,null,null,""]
[null,null,null,null,null,null,null,null,null,""]
[null,null,null,null,null,null,null,null,null,""]
[null,null,null,null,null,null,null,null,null,""]
[null,null,null,null,null,null,null,null,null,""]
[null,null,null,null,null,null,null,null,null,""]
[null,null,null,null,null,null,null,null,null,""]
[null,null,null,null,null,null,null,null,null,""]
[null,null,null,null,null,null,null,null,null,""]
[null,null,null,null,null,null,null,null,null,{"$f":"IF(A130>0,(G130-I130),\"\")","v":""}]
[null,null,null,null,null,null,null,null,null,""]
[null,null,null,null,null,null,null,null,null,""]
[null,null,null,null,null,null,null,null,null,""]
[null,null,null,null,null,null,null,null,null,""]
[null,null,null,null,null,null,null,null,null,""]
[null,null,null,null,null,null,null,null,null,""]
[null,null,null,null,null,null,null,null,null,""]
[null,null,null,null,null,null,null,null,null,""]
[null,null,null,null,null,null,null,null,null,""]
[null,null,null,null,null,null,null,null,null,""]
[null,null,null,null,null,null,null,null,null,""]
[null,null,null,null,null,null,null,null,null,""]
[null,null,null,null,null,null,null,null,null,""]
[null,null,null,null,null,null,null,null,null,""]
[null,null,null,null,null,null,null,null,null,""]
[null,null,null,null,null,null,null,null,null,""]
[null,null,null,null,null,null,null,null,null,""]
[null,null,null,null,null,null,null,null,null,""]
[null,null,null,null,null,null,null,null,null,""]
[null,null,null,null,null,null,null,null,null,""]
[null,null,null,null,null,null,null,null,null,""]
[null,null,null,null,null,null,null,null,null,""]
[null,null,null,null,null,null,null,null,null,""]
[null,null,null,null,null,null,null,null,null,""]
[null,null,null,null,null,null,null,null,null,""]
[null,null,null,null,null,null,null,null,null,""]
[null,null,null,null,null,null,null,null,null,""]
[null,null,null,null,null,null,null,null,null,""]
[null,null,null,null,null,null,null,null,null,""]
[null,null,null,null,null,null,null,null,null,""]
[null,null,null,null,null,null,null,null,null,""]
[null,null,null,null,null,null,null,null,null,""]
[null,null,null,null,null,null,null,null,null,""]
[null,null,null,null,null,null,null,null,null,""]
[null,null,null,null,null,null,null,null,null,""]
[null,null,null,null,null,null,null,null,null,""]
[null,null,null,null,null,null,null,null,null,""]
[null,null,null,null,null,null,null,null,null,""]
[null,null,null,null,null,null,null,null,null,""]
[null,null,null,null,null,null,null,null,null,""]
[null,null,null,null,null,null,null,null,null,""]
[null,null,null,null,null,null,null,null,null,""]
[null,null,null,null,null,null,null,null,null,""]
[null,null,null,null,null,null,null,null,null,""]
[null,null,null,null,null,null,null,null,null,""]
[null,null,null,null,null,null,null,null,null,""]
[null,null,null,null,null,null,null,null,null,""]
[null,null,null,null,null,null,null,null,null,""]
[null,null,null,null,null,null,null,null,null,""]
[null,null,null,null,null,null,null,null,null,""]
[null,null,null,null,null,null,null,null,null,""]
[null,null,null,null,null,null,null,null,null,""]
[null,null,null,null,null,null,null,null,null,""]
[null,null,null,null,null,null,null,null,null,""]
[null,null,null,null,null,null,null,null,null,""]
[null,null,null,null,null,null,null,null,null,""]
[null,null,null,null,null,null,null,null,null,""]
[null,null,null,null,null,null,null,null,null,""]
[null,null,null,null,null,null,null,null,null,""]
[null,null,null,null,null,null,null,null,null,""]
[null,null,null,null,null,null,null,null,null,""]
[null,null,null,null,null,null,null,null,null,""]
[null,null,null,null,null,null,null,null,null,""]
[null,null,null,null,null,null,null,null,null,{"$f":"IF(A194>0,(G194-I194),\"\")","v":""}]
[null,null,null,null,null,null,null,null,null,""]
[null,null,null,null,null,null,null,null,null,""]
[null,null,null,null,null,null,null,null,null,""]
[null,null,null,null,null,null,null,null,null,""]
[null,null,null,null,null,null,null,null,null,""]
[null,null,null,null,null,null,null,null,null,""]
[null,null,null,null,null,null,null,null,null,""]
[null,null,null,null,null,null,null,null,null,""]
[null,null,null,null,null,null,null,null,null,""]
[null,null,null,null,null,null,null,null,null,""]
[null,null,null,null,null,null,null,null,null,""]
[null,null,null,null,null,null,null,null,null,""]
[null,null,null,null,null,null,null,null,null,""]
[null,null,null,null,null,null,null,null,null,""]
[null,null,null,null,null,null,null,null,null,""]
[null,null,null,null,null,null,null,null,null,""]
[null,null,null,null,null,null,null,null,null,""]
[null,null,null,null,null,null,null,null,null,""]
[null,null,null,null,null,null,null,null,null,""]
[null,null,null,null,null,null,null,null,null,""]
[null,null,null,null,null,null,null,null,null,""]
[null,null,null,null,null,null,null,null,null,""]
[null,null,null,null,null,null,null,null,null,""]
[null,null,null,null,null,null,null,null,null,""]
[null,null,null,null,null,null,null,null,null,""]
[null,null,null,null,null,null,null,null,null,""]
[null,null,null,null,null,null,null,null,null,""]
[null,null,null,null,null,null,null,null,null,""]
[null,null,null,null,null,null,null,null,null,""]
[null,null,null,null,null,null,null,null,null,""]
[null,null,null,null,null,null,null,null,null,""]
[null,null,null,null,null,null,null,null,null,""]
[null,null,null,null,null,null,null,null,null,""]
[null,null,null,null,null,null,null,null,null,""]
[null,null,null,null,null,null,null,null,null,""]
[null,null,null,null,null,null,null,null,null,""]
[null,null,null,null,null,null,null,null,null,""]
[null,null,null,null,null,null,null,null,null,""]
[null,null,null,null,null,null,null,null,null,""]
[null,null,null,null,null,null,null,null,null,""]
[null,null,null,null,null,null,null,null,null,""]
[null,null,null,null,null,null,null,null,null,""]
[null,null,null,null,null,null,null,null,null,""]
[null,null,null,null,null,null,null,null,null,""]
[null,null,null,null,null,null,null,null,null,""]
[null,null,null,null,null,null,null,null,null,""]
[null,null,null,null,null,null,null,null,null,""]
[null,null,null,null,null,null,null,null,null,""]
[null,null,null,null,null,null,null,null,null,""]
[null,null,null,null,null,null,null,null,null,""]
[null,null,null,null,null,null,null,null,null,""]
[null,null,null,null,null,null,null,null,null,""]
[null,null,null,null,null,null,null,null,null,""]
[null,null,null,null,null,null,null,null,null,""]
[null,null,null,null,null,null,null,null,null,""]
[null,null,null,null,null,null,null,null,null,""]
[null,null,null,null,null,null,null,null,null,""]
[null,null,null,null,null,null,null,null,null,""]
[null,null,null,null,null,null,null,null,null,""]
[null,null,null,null,null,null,null,null,null,""]
[null,null,null,null,null,null,null,null,null,""]
[null,null,null,null,null,null,null,null,null,""]
[null,null,null,null,null,null,null,null,null,""]
[null,null,null,null,null,null,null,null,null,{"$f":"IF(A258>0,(G258-I258),\"\")","v":""}]
[null,null,null,null,null,null,null,null,null,""]
[null,null,null,null,null,null,null,null,null,""]
[null,null,null,null,null,null,null,null,null,""]
[null,null,null,null,null,null,null,null,null,""]
[null,null,null,null,null,null,null,null,null,""]
[null,null,null,null,null,null,null,null,null,""]
[null,null,null,null,null,null,null,null,null,""]
[null,null,null,null,null,null,null,null,null,""]
[null,null,null,null,null,null,null,null,null,""]
[null,null,null,null,null,null,null,null,null,""]
[null,null,null,null,null,null,null,null,null,""]
[null,null,null,null,null,null,null,null,null,""]
[null,null,null,null,null,null,null,null,null,""]
[null,null,null,null,null,null,null,null,null,""]
[null,null,null,null,null,null,null,null,null,""]
[null,null,null,null,null,null,null,null,null,""]
[null,null,null,null,null,null,null,null,null,""]
[null,null,null,null,null,null,null,null,null,""]
[null,null,null,null,null,null,null,null,null,""]
[null,null,null,null,null,null,null,null,null,""]
[null,null,null,null,null,null,null,null,null,""]
[null,null,null,null,null,null,null,null,null,""]
[null,null,null,null,null,null,null,null,null,""]
[null,null,null,null,null,null,null,null,null,""]
[null,null,null,null,null,null,null,null,null,""]
[null,null,null,null,null,null,null,null,null,""]
[null,null,null,null,null,null,null,null,null,""]
[null,null,null,null,null,null,null,null,null,""]
[null,null,null,null,null,null,null,null,null,""]
[null,null,null,null,null,null,null,null,null,""]
[null,null,null,null,null,null,null,null,null,""]
[null,null,null,null,null,null,null,null,null,""]
[null,null,null,null,null,null,null,null,null,""]
[null,null,null,null,null,null,null,null,null,""]
[null,null,null,null,null,null,null,null,null,""]
[null,null,null,null,null,null,null,null,null,""]
[null,null,null,null,null,null,null,null,null,""]
[null,null,null,null,null,null,null,null,null,""]
[null,null,null,null,null,null,null,null,null,""]
[null,null,null,null,null,null,null,null,null,""]
[null,null,null,null,null,null,null,null,null,""]
[null,null,null,null,null,null,null,null,null,""]
[null,null,null,null,null,null,null,null,null,""]
[null,null,null,null,null,null,null,null,null,""]
[null,null,null,null,null,null,null,null,null,""]
[null,null,null,null,null,null,null,null,null,""]
[null,null,null,null,null,null,null,null,null,""]
[null,null,null,null,null,null,null,null,null,""]
[null,null,null,null,null,null,null,null,null,""]
[null,null,null,null,null,null,null,null,null,""]
[null,null,null,null,null,null,null,null,null,""]
[null,null,null,null,null,null,null,null,null,""]
[null,null,null,null,null,null,null,null,null,""]
[null,null,null,null,null,null,null,null,null,""]
[null,null,null,null,null,null,null,null,null,""]
[null,null,null,null,null,null,null,null,null,""]
[null,null,null,null,null,null,null,null,null,""]
[null,null,null,null,null,null,null,null,null,""]
[null,null,null,null,null,null,null,null,null,""]
[null,null,null,null,null,null,null,null,null,""]
[null,null,null,null,null,null,null,null,null,""]
[null,null,null,null,null,null,null,null,null,""]
[null,null,null,null,null,null,null,null,null,""]
[null,null,null,null,null,null,null,null,null,{"$f":"IF(A322>0,(G322-I322),\"\")","v":""}]
[null,null,null,null,null,null,null,null,null,""]
[null,null,null,null,null,null,null,null,null,""]
[null,null,null,null,null,null,null,null,null,""]
[null,null,null,null,null,null,null,null,null,""]
[null,null,null,null,null,null,null,null,null,""]
[null,null,null,null,null,null,null,null,null,""]
[null,null,null,null,null,null,null,null,null,""]
[null,null,null,null,null,null,null,null,null,""]
[null,null,null,null,null,null,null,null,null,""]
[null,null,null,null,null,null,null,null,null,""]
[null,null,null,null,null,null,null,null,null,""]
[null,null,null,null,null,null,null,null,null,""]
[null,null,null,null,null,null,null,null,null,""]
[null,null,null,null,null,null,null,null,null,""]
[null,null,null,null,null,null,null,null,null,""]
[null,null,null,null,null,null,null,null,null,""]
[null,null,null,null,null,null,null,null,null,""]
[null,null,null,null,null,null,null,null,null,""]
[null,null,null,null,null,null,null,null,null,""]
[null,null,null,null,null,null,null,null,null,""]
[null,null,null,null,null,null,null,null,null,""]
[null,null,null,null,null,null,null,null,null,""]
[null,null,null,null,null,null,null,null,null,""]
[null,null,null,null,null,null,null,null,null,""]
[null,null,null,null,null,null,null,null,null,""]
[null,null,null,null,null,null,null,null,null,""]
[null,null,null,null,null,null,null,null,null,""]
[null,null,null,null,null,null,null,null,null,""]
[null,null,null,null,null,null,null,null,null,""]
[null,null,null,null,null,null,null,null,null,""]
[null,null,null,null,null,null,null,null,null,""]
[null,null,null,null,null,null,null,null,null,""]
[null,null,null,null,null,null,null,null,null,""]
[null,null,null,null,null,null,null,null,null,""]
[null,null,null,null,null,null,null,null,null,""]
[null,null,null,null,null,null,null,null,null,""]
[null,null,null,null,null,null,null,null,null,""]
[null,null,null,null,null,null,null,null,null,""]
[null,null,null,null,null,null,null,null,null,""]
[null,null,null,null,null,null,null,null,null,""]
[null,null,null,null,null,null,null,null,null,""]
[null,null,null,null,null,null,null,null,null,""]
[null,null,null,null,null,null,null,null,null,""]
[null,null,null,null,null,null,null,null,null,""]
[null,null,null,null,null,null,null,null,null,""]
[null,null,null,null,null,null,null,null,null,""]
[null,null,null,null,null,null,null,null,null,""]
[null,null,null,null,null,null,null,null,null,""]
[null,null,null,null,null,null,null,null,null,""]
[null,null,null,null,null,null,null,null,null,""]
[null,null,null,null,null,null,null,null,null,""]
[null,null,null,null,null,null,null,null,null,""]
[null,null,null,null,null,null,null,null,null,""]
[null,null,null,null,null,null,null,null,null,""]
[null,null,null,null,null,null,null,null,null,""]
[null,null,null,null,null,null,null,null,null,""]
[null,null,null,null,null,null,null,null,null,""]
[null,null,null,null,null,null,null,null,null,""]
[null,null,null,null,null,null,null,null,null,""]
[null,null,null,null,null,null,null,null,null,""]
[null,null,null,null,null,null,null,null,null,""]
[null,null,null,null,null,null,null,null,null,""]
[null,null,null,null,null,null,null,null,null,""]
[null,null,null,null,null,null,null,null,null,{"$f":"IF(A386>0,(G386-I386),\"\")","v":""}]
[null,null,null,null,null,null,null,null,null,""]
[null,null,null,null,null,null,null,null,null,""]
[null,null,null,null,null,null,null,null,null,""]
[null,null,null,null,null,null,null,null,null,""]
[null,null,null,null,null,null,null,null,null,""]
[null,null,null,null,null,null,null,null,null,""]
[null,null,null,null,null,null,null,null,null,""]
[null,null,null,null,null,null,null,null,null,""]
[null,null,null,null,null,null,null,null,null,""]
[null,null,null,null,null,null,null,null,null,""]
[null,null,null,null,null,null,null,null,null,""]
[null,null,null,null,null,null,null,null,null,""]
[null,null,null,null,null,null,null,null,null,""]
[null,null,null,null,null,null,null,null,null,""]
[null,null,null,null,null,null,null,null,null,""]
[null,null,null,null,null,null,null,null,null,""]
[null,null,null,null,null,null,null,null,null,""]
[null,null,null,null,null,null,null,null,null,""]
[null,null,null,null,null,null,null,null,null,""]
[null,null,null,null,null,null,null,null,null,""]
[null,null,null,null,null,null,null,null,null,""]
[null,null,null,null,null,null,null,null,null,""]
[null,null,null,null,null,null,null,null,null,""]
[null,null,null,null,null,null,null,null,null,""]
[null,null,null,null,null,null,null,null,null,""]
[null,null,null,null,null,null,null,null,null,""]
[null,null,null,null,null,null,null,null,null,""]
[null,null,null,null,null,null,null,null,null,""]
[null,null,null,null,null,null,null,null,null,""]
[null,null,null,null,null,null,null,null,null,""]
[null,null,null,null,null,null,null,null,null,""]
[null,null,null,null,null,null,null,null,null,""]
[null,null,null,null,null,null,null,null,null,""]
[null,null,null,null,null,null,null,null,null,""]
[null,null,null,null,null,null,null,null,null,""]
[null,null,null,null,null,null,null,null,null,""]
[null,null,null,null,null,null,null,null,null,""]
[null,null,null,null,null,null,null,null,null,""]
[null,null,null,null,null,null,null,null,null,""]
[null,null,null,null,null,null,null,null,null,""]
[null,null,null,null,null,null,null,null,null,""]
[null,null,null,null,null,null,null,null,null,""]
[null,null,null,null,null,null,null,null,null,""]
[null,null,null,null,null,null,null,null,null,""]
[null,null,null,null,null,null,null,null,null,""]
[null,null,null,null,null,null,null,null,null,""]
[null,null,null,null,null,null,null,null,null,""]
[null,null,null,null,null,null,null,null,null,""]
[null,null,null,null,null,null,null,null,null,""]
[null,null,null,null,null,null,null,null,null,""]
[null,null,null,null,null,null,null,null,null,""]
[null,null,null,null,null,null,null,null,null,""]
[null,null,null,null,null,null,null,null,null,""]
[null,null,null,null,null,null,null,null,null,""]
[null,null,null,null,null,null,null,null,null,""]
[null,null,null,null,null,null,null,null,null,""]
[null,null,null,null,null,null,null,null,null,""]
[null,null,null,null,null,null,null,null,null,""]
[null,null,null,null,null,null,null,null,null,""]
[null,null,null,null,null,null,null,null,null,""]
[null,null,null,null,null,null,null,null,null,""]
[null,null,null,null,null,null,null,null,null,""]
[null,null,null,null,null,null,null,null,null,""]
[null,null,null,null,null,null,null,null,null,{"$f":"IF(A450>0,(G450-I450),\"\")","v":""}]
[null,null,null,null,null,null,null,null,null,""]
[null,null,null,null,null,null,null,null,null,""]
[null,null,null,null,null,null,null,null,null,""]
[null,null,null,null,null,null,null,null,null,""]
[null,null,null,null,null,null,null,null,null,""]
[null,null,null,null,null,null,null,null,null,""]
[null,null,null,null,null,null,null,null,null,""]
[null,null,null,null,null,null,null,null,null,""]
[null,null,null,null,null,null,null,null,null,""]
[null,null,null,null,null,null,null,null,null,""]
[null,null,null,null,null,null,null,null,null,""]
[null,null,null,null,null,null,null,null,null,""]
[null,null,null,null,null,null,null,null,null,""]
[null,null,null,null,null,null,null,null,null,""]
[null,null,null,null,null,null,null,null,null,""]
[null,null,null,null,null,null,null,null,null,""]
[null,null,null,null,null,null,null,null,null,""]
[null,null,null,null,null,null,null,null,null,""]
[null,null,null,null,null,null,null,null,null,""]
[null,null,null,null,null,null,null,null,null,""]
[null,null,null,null,null,null,null,null,null,""]
[null,null,null,null,null,null,null,null,null,""]
[null,null,null,null,null,null,null,null,null,""]
[null,null,null,null,null,null,null,null,null,""]
[null,null,null,null,null,null,null,null,null,""]
[null,null,null,null,null,null,null,null,null,""]
[null,null,null,null,null,null,null,null,null,""]
[null,null,null,null,null,null,null,null,null,""]
[null,null,null,null,null,null,null,null,null,""]
[null,null,null,null,null,null,null,null,null,""]
[null,null,null,null,null,null,null,null,null,""]
[null,null,null,null,null,null,null,null,null,""]
[null,null,null,null,null,null,null,null,null,""]
[null,null,null,null,null,null,null,null,null,""]
[null,null,null,null,null,null,null,null,null,""]
[null,null,null,null,null,null,null,null,null,""]
[null,null,null,null,null,null,null,null,null,""]
[null,null,null,null,null,null,null,null,null,""]
[null,null,null,null,null,null,null,null,null,""]
[null,null,null,null,null,null,null,null,null,""]
[null,null,null,null,null,null,null,null,null,""]
[null,null,null,null,null,null,null,null,null,""]
[null,null,null,null,null,null,null,null,null,""]
[null,null,null,null,null,null,null,null,null,""]
[null,null,null,null,null,null,null,null,null,""]
[null,null,null,null,null,null,null,null,null,""]
[null,null,null,null,null,null,null,null,null,""]
[null,null,null,null,null,null,null,null,null,""]
[null,null,null,null,null,null,null,null,null,""]
[null,null,null,null,null,null,null,null,null,""]
[null,null,null,null,null,null,null,null,null,""]
[null,null,null,null,null,null,null,null,null,""]
[null,null,null,null,null,null,null,null,null,""]
[null,null,null,null,null,null,null,null,null,""]
[null,null,null,null,null,null,null,null,null,""]
[null,null,null,null,null,null,null,null,null,""]
[null,null,null,null,null,null,null,null,null,""]
[null,null,null,null,null,null,null,null,null,""]
[null,null,null,null,null,null,null,null,null,""]
[null,null,null,null,null,null,null,null,null,""]
[null,null,null,null,null,null,null,null,null,""]
[null,null,null,null,null,null,null,null,null,""]
[null,null,null,null,null,null,null,null,null,""]
[null,null,null,null,null,null,null,null,null,{"$f":"IF(A514>0,(G514-I514),\"\")","v":""}]
[null,null,null,null,null,null,null,null,null,""]
[null,null,null,null,null,null,null,null,null,""]
[null,null,null,null,null,null,null,null,null,""]
[null,null,null,null,null,null,null,null,null,""]
[null,null,null,null,null,null,null,null,null,""]
[null,null,null,null,null,null,null,null,null,""]
[null,null,null,null,null,null,null,null,null,""]
[null,null,null,null,null,null,null,null,null,""]
[null,null,null,null,null,null,null,null,null,""]
[null,null,null,null,null,null,null,null,null,""]
[null,null,null,null,null,null,null,null,null,""]
[null,null,null,null,null,null,null,null,null,""]
[null,null,null,null,null,null,null,null,null,""]
[null,null,null,null,null,null,null,null,null,""]
[null,null,null,null,null,null,null,null,null,""]
[null,null,null,null,null,null,null,null,null,""]
[null,null,null,null,null,null,null,null,null,""]
[null,null,null,null,null,null,null,null,null,""]
[null,null,null,null,null,null,null,null,null,""]
[null,null,null,null,null,null,null,null,null,""]
[null,null,null,null,null,null,null,null,null,""]
[null,null,null,null,null,null,null,null,null,""]
[null,null,null,null,null,null,null,null,null,""]
[null,null,null,null,null,null,null,null,null,""]
[null,null,null,null,null,null,null,null,null,""]
[null,null,null,null,null,null,null,null,null,""]
[null,null,null,null,null,null,null,null,null,""]
[null,null,null,null,null,null,null,null,null,""]
[null,null,null,null,null,null,null,null,null,""]
[null,null,null,null,null,null,null,null,null,""]
[null,null,null,null,null,null,null,null,null,""]
[null,null,null,null,null,null,null,null,null,""]
[null,null,null,null,null,null,null,null,null,""]
[null,null,null,null,null,null,null,null,null,""]
[null,null,null,null,null,null,null,null,null,""]
[null,null,null,null,null,null,null,null,null,""]
[null,null,null,null,null,null,null,null,null,""]
[null,null,null,null,null,null,null,null,null,""]
[null,null,null,null,null,null,null,null,null,""]
[null,null,null,null,null,null,null,null,null,""]
[null,null,null,null,null,null,null,null,null,""]
[null,null,null,null,null,null,null,null,null,""]
[null,null,null,null,null,null,null,null,null,""]
[null,null,null,null,null,null,null,null,null,""]
[null,null,null,null,null,null,null,null,null,""]
[null,null,null,null,null,null,null,null,null,""]
[null,null,null,null,null,null,null,null,null,""]
[null,null,null,null,null,null,null,null,null,""]
[null,null,null,null,null,null,null,null,null,""]
[null,null,null,null,null,null,null,null,null,""]
[null,null,null,null,null,null,null,null,null,""]
[null,null,null,null,null,null,null,null,null,""]
[null,null,null,null,null,null,null,null,null,""]
[null,null,null,null,null,null,null,null,null,""]
[null,null,null,null,null,null,null,null,null,""]
[null,null,null,null,null,null,null,null,null,""]
[null,null,null,null,null,null,null,null,null,""]
[null,null,null,null,null,null,null,null,null,""]
[null,null,null,null,null,null,null,null,null,""]
[null,null,null,null,null,null,null,null,null,""]
[null,null,null,null,null,null,null,null,null,""]
[null,null,null,null,null,null,null,null,null,""]
[null,null,null,null,null,null,null,null,null,""]
[null,null,null,null,null,null,null,null,null,{"$f":"IF(A578>0,(G578-I578),\"\")","v":""}]
[null,null,null,null,null,null,null,null,null,""]
[null,null,null,null,null,null,null,null,null,""]
[null,null,null,null,null,null,null,null,null,""]
[null,null,null,null,null,null,null,null,null,""]
[null,null,null,null,null,null,null,null,null,""]
[null,null,null,null,null,null,null,null,null,""]
[null,null,null,null,null,null,null,null,null,""]
[null,null,null,null,null,null,null,null,null,""]
[null,null,null,null,null,null,null,null,null,""]
[null,null,null,null,null,null,null,null,null,""]
[null,null,null,null,null,null,null,null,null,""]
[null,null,null,null,null,null,null,null,null,""]
[null,null,null,null,null,null,null,null,null,""]
[null,null,null,null,null,null,null,null,null,""]
[null,null,null,null,null,null,null,null,null,""]
[null,null,null,null,null,null,null,null,null,""]
[null,null,null,null,null,null,null,null,null,""]
[null,null,null,null,null,null,null,null,null,""]
[null,null,null,null,null,null,null,null,null,""]
[null,null,null,null,null,null,null,null,null,""]
[null,null,null,null,null,null,null,null,null,""]
[null,null,null,null,null,null,null,null,null,""]
[null,null,null,null,null,null,null,null,null,""]
[null,null,null,null,null,null,null,null,null,""]
[null,null,null,null,null,null,null,null,null,""]
[null,null,null,null,null,null,null,null,null,""]
[null,null,null,null,null,null,null,null,null,""]
[null,null,null,null,null,null,null,null,null,""]
[null,null,null,null,null,null,null,null,null,""]
[null,null,null,null,null,null,null,null,null,""]
[null,null,null,null,null,null,null,null,null,""]
[null,null,null,null,null,null,null,null,null,""]
[null,null,null,null,null,null,null,null,null,""]
[null,null,null,null,null,null,null,null,null,""]
[null,null,null,null,null,null,null,null,null,""]
[null,null,null,null,null,null,null,null,null,""]
[null,null,null,null,null,null,null,null,null,""]
[null,null,null,null,null,null,null,null,null,""]
[null,null,null,null,null,null,null,null,null,""]
[null,null,null,null,null,null,null,null,null,""]
[null,null,null,null,null,null,null,null,null,""]
[null,null,null,null,null,null,null,null,null,""]
[null,null,null,null,null,null,null,null,null,""]
[null,null,null,null,null,null,null,null,null,""]
[null,null,null,null,null,null,null,null,null,""]
[null,null,null,null,null,null,null,null,null,""]
[null,null,null,null,null,null,null,null,null,""]
[null,null,null,null,null,null,null,null,null,""]
[null,null,null,null,null,null,null,null,null,""]
[null,null,null,null,null,null,null,null,null,""]
[null,null,null,null,null,null,null,null,null,""]
[null,null,null,null,null,null,null,null,null,""]
[null,null,null,null,null,null,null,null,null,""]
[null,null,null,null,null,null,null,null,null,""]
[null,null,null,null,null,null,null,null,null,""]
[null,null,null,null,null,null,null,null,null,""]
[null,null,null,null,null,null,null,null,null,""]
[null,null,null,null,null,null,null,null,null,""]
[null,null,null,null,null,null,null,null,null,""]
[null,null,null,null,null,null,null,null,null,""]
[null,null,null,null,null,null,null,null,null,""]
[null,null,null,null,null,null,null,null,null,""]
[null,null,null,null,null,null,null,null,null,""]
[null,null,null,null,null,null,null,null,null,{"$f":"IF(A642>0,(G642-I642),\"\")","v":""}]
[null,null,null,null,null,null,null,null,null,""]
[null,null,null,null,null,null,null,null,null,""]
[null,null,null,null,null,null,null,null,null,""]
[null,null,null,null,null,null,null,null,null,""]
[null,null,null,null,null,null,null,null,null,""]
[null,null,null,null,null,null,null,null,null,""]
[null,null,null,null,null,null,null,null,null,""]
[null,null,null,null,null,null,null,null,null,""]
[null,null,null,null,null,null,null,null,null,""]
[null,null,null,null,null,null,null,null,null,""]
[null,null,null,null,null,null,null,null,null,""]
[null,null,null,null,null,null,null,null,null,""]
[null,null,null,null,null,null,null,null,null,""]
[null,null,null,null,null,null,null,null,null,""]
[null,null,null,null,null,null,null,null,null,""]
[null,null,null,null,null,null,null,null,null,""]
[null,null,null,null,null,null,null,null,null,""]
[null,null,null,null,null,null,null,null,null,""]
[null,null,null,null,null,null,null,null,null,""]
[null,null,null,null,null,null,null,null,null,""]
[null,null,null,null,null,null,null,null,null,""]
[null,null,null,null,null,null,null,null,null,""]
[null,null,null,null,null,null,null,null,null,""]
[null,null,null,null,null,null,null,null,null,""]
[null,null,null,null,null,null,null,null,null,""]
[null,null,null,null,null,null,null,null,null,""]
[null,null,null,null,null,null,null,null,null,""]
[null,null,null,null,null,null,null,null,null,""]
[null,null,null,null,null,null,null,null,null,""]
[null,null,null,null,null,null,null,null,null,""]
[null,null,null,null,null,null,null,null,null,""]
[null,null,null,null,null,null,null,null,null,""]
[null,null,null,null,null,null,null,null,null,""]
[null,null,null,null,null,null,null,null,null,""]
[null,null,null,null,null,null,null,null,null,""]
[null,null,null,null,null,null,null,null,null,""]
[null,null,null,null,null,null,null,null,null,""]
[null,null,null,null,null,null,null,null,null,""]
[null,null,null,null,null,null,null,null,null,""]
[null,null,null,null,null,null,null,null,null,""]
[null,null,null,null,null,null,null,null,null,""]
[null,null,null,null,null,null,null,null,null,""]
[null,null,null,null,null,null,null,null,null,""]
[null,null,null,null,null,null,null,null,null,""]
[null,null,null,null,null,null,null,null,null,""]
[null,null,null,null,null,null,null,null,null,""]
[null,null,null,null,null,null,null,null,null,""]
[null,null,null,null,null,null,null,null,null,""]
[null,null,null,null,null,null,null,null,null,""]
[null,null,null,null,null,null,null,null,null,""]
[null,null,null,null,null,null,null,null,null,""]
[null,null,null,null,null,null,null,null,null,""]
[null,null,null,null,null,null,null,null,null,""]
[null,null,null,null,null,null,null,null,null,""]
[null,null,null,null,null,null,null,null,null,""]
[null,null,null,null,null,null,null,null,null,""]
[null,null,null,null,null,null,null,null,null,""]
[null,null,null,null,null,null,null,null,null,""]
[null,null,null,null,null,null,null,null,null,""]
[null,null,null,null,null,null,null,null,null,""]
[null,null,null,null,null,null,null,null,null,""]
[null,null,null,null,null,null,null,null,null,""]
[null,null,null,null,null,null,null,null,null,""]
[null,null,null,null,null,null,null,null,null,{"$f":"IF(A706>0,(G706-I706),\"\")","v":""}]
[null,null,null,null,null,null,null,null,null,""]
[null,null,null,null,null,null,null,null,null,""]
[null,null,null,null,null,null,null,null,null,""]
[null,null,null,null,null,null,null,null,null,""]
[null,null,null,null,null,null,null,null,null,""]
[null,null,null,null,null,null,null,null,null,""]
[null,null,null,null,null,null,null,null,null,""]
[null,null,null,null,null,null,null,null,null,""]
[null,null,null,null,null,null,null,null,null,""]
[null,null,null,null,null,null,null,null,null,""]
[null,null,null,null,null,null,null,null,null,""]
[null,null,null,null,null,null,null,null,null,""]
[null,null,null,null,null,null,null,null,null,""]
[null,null,null,null,null,null,null,null,null,""]
[null,null,null,null,null,null,null,null,null,""]
[null,null,null,null,null,null,null,null,null,""]
[null,null,null,null,null,null,null,null,null,""]
[null,null,null,null,null,null,null,null,null,""]
[null,null,null,null,null,null,null,null,null,""]
[null,null,null,null,null,null,null,null,null,""]
[null,null,null,null,null,null,null,null,null,""]
[null,null,null,null,null,null,null,null,null,""]
[null,null,null,null,null,null,null,null,null,""]
[null,null,null,null,null,null,null,null,null,""]
[null,null,null,null,null,null,null,null,null,""]
[null,null,null,null,null,null,null,null,null,""]
[null,null,null,null,null,null,null,null,null,""]
[null,null,null,null,null,null,null,null,null,""]
[null,null,null,null,null,null,null,null,null,""]
[null,null,null,null,null,null,null,null,null,""]
[null,null,null,null,null,null,null,null,null,""]
[null,null,null,null,null,null,null,null,null,""]
[null,null,null,null,null,null,null,null,null,""]
[null,null,null,null,null,null,null,null,null,""]
[null,null,null,null,null,null,null,null,null,""]
[null,null,null,null,null,null,null,null,null,""]
[null,null,null,null,null,null,null,null,null,""]
[null,null,null,null,null,null,null,null,null,""]
[null,null,null,null,null,null,null,null,null,""]
[null,null,null,null,null,null,null,null,null,""]
[null,null,null,null,null,null,null,null,null,""]
[null,null,null,null,null,null,null,null,null,""]
[null,null,null,null,null,null,null,null,null,""]
[null,null,null,null,null,null,null,null,null,""]
[null,null,null,null,null,null,null,null,null,""]
[null,null,null,null,null,null,null,null,null,""]
[null,null,null,null,null,null,null,null,null,""]
[null,null,null,null,null,null,null,null,null,""]
[null,null,null,null,null,null,null,null,null,""]
[null,null,null,null,null,null,null,null,null,""]
[null,null,null,null,null,null,null,null,null,""]
[null,null,null,null,null,null,null,null,null,""]
[null,null,null,null,null,null,null,null,null,""]
[null,null,null,null,null,null,null,null,null,""]
[null,null,null,null,null,null,null,null,null,""]
[null,null,null,null,null,null,null,null,null,""]
[null,null,null,null,null,null,null,null,null,""]
[null,null,null,null,null,null,null,null,null,""]
[null,null,null,null,null,null,null,null,null,""]
[null,null,null,null,null,null,null,null,null,""]
[null,null,null,null,null,null,null,null,null,""]
[null,null,null,null,null,null,null,null,null,""]
[null,null,null,null,null,null,null,null,null,""]
[null,null,null,null,null,null,null,null,null,{"$f":"IF(A770>0,(G770-I770),\"\")","v":""}]
[null,null,null,null,null,null,null,null,null,""]
[null,null,null,null,null,null,null,null,null,""]
[null,null,null,null,null,null,null,null,null,""]
[null,null,null,null,null,null,null,null,null,""]
[null,null,null,null,null,null,null,null,null,""]
[null,null,null,null,null,null,null,null,null,""]
[null,null,null,null,null,null,null,null,null,""]
[null,null,null,null,null,null,null,null,null,""]
[null,null,null,null,null,null,null,null,null,""]
[null,null,null,null,null,null,null,null,null,""]
[null,null,null,null,null,null,null,null,null,""]
[null,null,null,null,null,null,null,null,null,""]
[null,null,null,null,null,null,null,null,null,""]
[null,null,null,null,null,null,null,null,null,""]
[null,null,null,null,null,null,null,null,null,""]
[null,null,null,null,null,null,null,null,null,""]
[null,null,null,null,null,null,null,null,null,""]
[null,null,null,null,null,null,null,null,null,""]
[null,null,null,null,null,null,null,null,null,""]
[null,null,null,null,null,null,null,null,null,""]
[null,null,null,null,null,null,null,null,null,""]
[null,null,null,null,null,null,null,null,null,""]
[null,null,null,null,null,null,null,null,null,""]
[null,null,null,null,null,null,null,null,null,""]
[null,null,null,null,null,null,null,null,null,""]
[null,null,null,null,null,null,null,null,null,""]
[null,null,null,null,null,null,null,null,null,""]
[null,null,null,null,null,null,null,null,null,""]
[null,null,null,null,null,null,null,null,null,""]
[null,null,null,null,null,null,null,null,null,""]
[null,null,null,null,null,null,null,null,null,""]
[null,null,null,null,null,null,null,null,null,""]
[null,null,null,null,null,null,null,null,null,""]
[null,null,null,null,null,null,null,null,null,""]
[null,null,null,null,null,null,null,null,null,""]
[null,null,null,null,null,null,null,null,null,""]
[null,null,null,null,null,null,null,null,null,""]
[null,null,null,null,null,null,null,null,null,""]
[null,null,null,null,null,null,null,null,null,""]
[null,null,null,null,null,null,null,null,null,""]
[null,null,null,null,null,null,null,null,null,""]
[null,null,null,null,null,null,null,null,null,""]
[null,null,null,null,null,null,null,null,null,""]
[null,null,null,null,null,null,null,null,null,""]
[null,null,null,null,null,null,null,null,null,""]
[null,null,null,null,null,null,null,null,null,""]
[null,null,null,null,null,null,null,null,null,""]
[null,null,null,null,null,null,null,null,null,""]
[null,null,null,null,null,null,null,null,null,""]
[null,null,null,null,null,null,null,null,null,""]
[null,null,null,null,null,null,null,null,null,""]
[null,null,null,null,null,null,null,null,null,""]
[null,null,null,null,null,null,null,null,null,""]
[null,null,null,null,null,null,null,null,null,""]
[null,null,null,null,null,null,null,null,null,""]
[null,null,null,null,null,null,null,null,null,""]
[null,null,null,null,null,null,null,null,null,""]
[null,null,null,null,null,null,null,null,null,""]
[null,null,null,null,null,null,null,null,null,""]
[null,null,null,null,null,null,null,null,null,""]
[null,null,null,null,null,null,null,null,null,""]
[null,null,null,null,null,null,null,null,null,""]
[null,null,null,null,null,null,null,null,null,""]
[null,null,null,null,null,null,null,null,null,{"$f":"IF(A834>0,(G834-I834),\"\")","v":""}]
[null,null,null,null,null,null,null,null,null,""]
[null,null,null,null,null,null,null,null,null,""]
[null,null,null,null,null,null,null,null,null,""]
[null,null,null,null,null,null,null,null,null,""]
[null,null,null,null,null,null,null,null,null,""]
[null,null,null,null,null,null,null,null,null,""]
[null,null,null,null,null,null,null,null,null,""]
[null,null,null,null,null,null,null,null,null,""]
[null,null,null,null,null,null,null,null,null,""]
[null,null,null,null,null,null,null,null,null,""]
[null,null,null,null,null,null,null,null,null,""]
[null,null,null,null,null,null,null,null,null,""]
[null,null,null,null,null,null,null,null,null,""]
[null,null,null,null,null,null,null,null,null,""]
[null,null,null,null,null,null,null,null,null,""]
[null,null,null,null,null,null,null,null,null,""]
[null,null,null,null,null,null,null,null,null,""]
[null,null,null,null,null,null,null,null,null,""]
[null,null,null,null,null,null,null,null,null,""]
[null,null,null,null,null,null,null,null,null,""]
[null,null,null,null,null,null,null,null,null,""]
[null,null,null,null,null,null,null,null,null,""]
[null,null,null,null,null,null,null,null,null,""]
[null,null,null,null,null,null,null,null,null,""]
[null,null,null,null,null,null,null,null,null,""]
[null,null,null,null,null,null,null,null,null,""]
[null,null,null,null,null,null,null,null,null,""]
[null,null,null,null,null,null,null,null,null,""]
[null,null,null,null,null,null,null,null,null,""]
[null,null,null,null,null,null,null,null,null,""]
[null,null,null,null,null,null,null,null,null,""]
[null,null,null,null,null,null,null,null,null,""]
[null,null,null,null,null,null,null,null,null,""]
[null,null,null,null,null,null,null,null,null,""]
[null,null,null,null,null,null,null,null,null,""]
[null,null,null,null,null,null,null,null,null,""]
[null,null,null,null,null,null,null,null,null,""]
[null,null,null,null,null,null,null,null,null,""]
[null,null,null,null,null,null,null,null,null,""]
[null,null,null,null,null,null,null,null,null,""]
[null,null,null,null,null,null,null,null,null,""]
[null,null,null,null,null,null,null,null,null,""]
[null,null,null,null,null,null,null,null,null,""]
[null,null,null,null,null,null,null,null,null,""]
[null,null,null,null,null,null,null,null,null,""]
[null,null,null,null,null,null,null,null,null,""]
[null,null,null,null,null,null,null,null,null,""]
[null,null,null,null,null,null,null,null,null,""]
[null,null,null,null,null,null,null,null,null,""]
[null,null,null,null,null,null,null,null,null,""]
[null,null,null,null,null,null,null,null,null,""]
[null,null,null,null,null,null,null,null,null,""]
[null,null,null,null,null,null,null,null,null,""]
[null,null,null,null,null,null,null,null,null,""]
[null,null,null,null,null,null,null,null,null,""]
[null,null,null,null,null,null,null,null,null,""]
[null,null,null,null,null,null,null,null,null,""]
[null,null,null,null,null,null,null,null,null,""]
[null,null,null,null,null,null,null,null,null,""]
[null,null,null,null,null,null,null,null,null,""]
[null,null,null,null,null,null,null,null,null,""]
[null,null,null,null,null,null,null,null,null,""]
[null,null,null,null,null,null,null,null,null,""]
[null,null,null,null,null,null,null,null,null,{"$f":"IF(A898>0,(G898-I898),\"\")","v":""}]
[null,null,null,null,null,null,null,null,null,""]
[null,null,null,null,null,null,null,null,null,""]
[null,null,null,null,null,null,null,null,null,""]
[null,null,null,null,null,null,null,null,null,""]
[null,null,null,null,null,null,null,null,null,""]
[null,null,null,null,null,null,null,null,null,""]
[null,null,null,null,null,null,null,null,null,""]
[null,null,null,null,null,null,null,null,null,""]
[null,null,null,null,null,null,null,null,null,""]
[null,null,null,null,null,null,null,null,null,""]
[null,null,null,null,null,null,null,null,null,""]
[null,null,null,null,null,null,null,null,null,""]
[null,null,null,null,null,null,null,null,null,""]
[null,null,null,null,null,null,null,null,null,""]
[null,null,null,null,null,null,null,null,null,""]
[null,null,null,null,null,null,null,null,null,""]
[null,null,null,null,null,null,null,null,null,""]
[null,null,null,null,null,null,null,null,null,""]
[null,null,null,null,null,null,null,null,null,""]
[null,null,null,null,null,null,null,null,null,""]
[null,null,null,null,null,null,null,null,null,""]
[null,null,null,null,null,null,null,null,null,""]
[null,null,null,null,null,null,null,null,null,""]
[null,null,null,null,null,null,null,null,null,""]
[null,null,null,null,null,null,null,null,null,""]
[null,null,null,null,null,null,null,null,null,""]
[null,null,null,null,null,null,null,null,null,""]
[null,null,null,null,null,null,null,null,null,""]
[null,null,null,null,null,null,null,null,null,""]
[null,null,null,null,null,null,null,null,null,""]
[null,null,null,null,null,null,null,null,null,""]
[null,null,null,null,null,null,null,null,null,""]
[null,null,null,null,null,null,null,null,null,""]
[null,null,null,null,null,null,null,null,null,""]
[null,null,null,null,null,null,null,null,null,""]
[null,null,null,null,null,null,null,null,null,""]
[null,null,null,null,null,null,null,null,null,""]
[null,null,null,null,null,null,null,null,null,""]
[null,null,null,null,null,null,null,null,null,""]
[null,null,null,null,null,null,null,null,null,""]
[null,null,null,null,null,null,null,null,null,""]
[null,null,null,null,null,null,null,null,null,""]
[null,null,null,null,null,null,null,null,null,""]
[null,null,null,null,null,null,null,null,null,""]
[null,null,null,null,null,null,null,null,null,""]
[null,null,null,null,null,null,null,null,null,""]
[null,null,null,null,null,null,null,null,null,""]
[null,null,null,null,null,null,null,null,null,""]
[null,null,null,null,null,null,null,null,null,""]
[null,null,null,null,null,null,null,null,null,""]
[null,null,null,null,null,null,null,null,null,""]
[null,null,null,null,null,null,null,null,null,""]
[null,null,null,null,null,null,null,null,null,""]
[null,null,null,null,null,null,null,null,null,""]
[null,null,null,null,null,null,null,null,null,""]
[null,null,null,null,null,null,null,null,null,""]
[null,null,null,null,null,null,null,null,null,""]
[null,null,null,null,null,null,null,null,null,""]
[null,null,null,null,null,null,null,null,null,""]
[null,null,null,null,null,null,null,null,null,""]
[null,null,null,null,null,null,null,null,null,""]
[null,null,null,null,null,null,null,null,null,""]
[null,null,null,null,null,null,null,null,null,""]
[null,null,null,null,null,null,null,null,null,{"$f":"IF(A962>0,(G962-I962),\"\")","v":""}]
[null,null,null,null,null,null,null,null,null,""]
[null,null,null,null,null,null,null,null,null,""]
[null,null,null,null,null,null,null,null,null,""]
[null,null,null,null,null,null,null,null,null,""]
[null,null,null,null,null,null,null,null,null,""]
[null,null,null,null,null,null,null,null,null,""]
[null,null,null,null,null,null,null,null,null,""]
[null,null,null,null,null,null,null,null,null,""]
[null,null,null,null,null,null,null,null,null,""]
[null,null,null,null,null,null,null,null,null,""]
[null,null,null,null,null,null,null,null,null,""]
[null,null,null,null,null,null,null,null,null,""]
[null,null,null,null,null,null,null,null,null,""]
[null,null,null,null,null,null,null,null,null,""]
[null,null,null,null,null,null,null,null,null,""]
[null,null,null,null,null,null,null,null,null,""]
[null,null,null,null,null,null,null,null,null,""]
[null,null,null,null,null,null,null,null,null,""]
[null,null,null,null,null,null,null,null,null,""]
[null,null,null,null,null,null,null,null,null,""]
[null,null,null,null,null,null,null,null,null,""]
[null,null,null,null,null,null,null,null,null,""]
[null,null,null,null,null,null,null,null,null,""]
[null,null,null,null,null,null,null,null,null,""]
[null,null,null,null,null,null,null,null,null,""]
[null,null,null,null,null,null,null,null,null,""]
[null,null,null,null,null,null,null,null,null,""]
[null,null,null,null,null,null,null,null,null,""]
[null,null,null,null,null,null,null,null,null,""]
[null,null,null,null,null,null,null,null,null,""]
[null,null,null,null,null,null,null,null,null,""]
[null,null,null,null,null,null,null,null,null,""]
[null,null,null,null,null,null,null,null,null,""]
[null,null,null,null,null,null,null,null,null,""]
[null,null,null,null,null,null,null,null,null,""]
[null,null,null,null,null,null,null,null,null,""]
[null,null,null,null,null,null,null,null,null,""]
[null,null,null,null,null,null,null,null,null,""]

{"sheet":"Plan_de_Cave","index":1,"n_rows":34,"n_cols":33,"rows_kept":34,"cut":false,"hidden":false,"merged":[[27,10,27,11],[28,10,28,11],[28,0,30,0],[23,15,23,16],[21,13,21,14],[21,15,21,16],[21,17,21,18],[26,3,26,5],[28,3,30,3],[17,0,23,0],[22,3,22,4],[21,2,21,3],[18,12,18,13],[18,14,18,15],[21,19,21,20],[22,12,22,13],[22,14,22,15],[19,6,19,7],[19,8,19,9],[19,13,19,14],[26,12,26,14],[26,15,26,17],[26,18,26,20],[22,5,22,6],[22,7,22,8],[22,9,22,10],[21,4,21,5],[21,6,21,7],[21,8,21,9],[20,3,20,4],[20,9,20,10],[20,14,20,15],[20,16,20,17],[20,18,20,19],[20,5,20,6],[20,7,20,8],[20,12,20,13],[11,13,11,14],[11,15,11,16],[11,17,11,18],[11,19,11,20],[25,0,26,0],[22,16,22,17],[22,18,22,19],[23,2,23,3],[23,4,23,5],[23,6,23,7],[23,8,23,9],[23,13,23,14],[23,17,23,18],[23,19,23,20],[25,5,25,6],[25,8,25,9],[25,11,25,12],[25,14,25,15],[25,17,25,18],[26,6,26,8],[26,9,26,11],[18,18,18,19],[19,2,19,3],[19,4,19,5],[16,2,16,10],[19,17,19,18],[19,19,19,20],[18,3,18,4],[18,5,18,6],[18,7,18,8],[18,9,18,10],[19,15,19,16],[18,16,18,17],[17,13,17,14],[17,15,17,16],[17,17,17,18],[17,19,17,20],[17,2,17,3],[17,4,17,5],[17,6,17,7],[17,8,17,9],[14,3,14,4],[14,5,14,6],[14,7,14,8],[14,9,14,10],[14,12,14,13],[14,14,14,15],[14,16,14,17],[14,18,14,19],[15,2,15,3],[15,4,15,5],[15,6,15,7],[15,8,15,9],[15,13,15,14],[15,15,15,16],[15,17,15,18],[15,19,15,20],[9,2,9,3],[10,2,10,10],[10,12,10,20],[11,0,15,0],[11,2,11,3],[11,4,11,5],[11,6,11,7],[11,8,11,9],[12,3,12,4],[12,5,12,6],[12,7,12,8],[12,9,12,10],[12,12,12,13],[12,14,12,15],[12,16,12,17],[12,18,12,19],[13,2,13,3],[13,4,13,5],[13,6,13,7],[13,8,13,9],[13,13,13,14],[13,15,13,16],[13,17,13,18],[13,19,13,20],[4,19,4,20],[8,12,8,13],[8,14,8,15],[2,23,2,24],[3,3,3,4],[3,5,3,6],[3,7,3,8],[3,9,3,10],[3,12,3,13],[3,14,3,15],[3,16,3,17],[3,18,3,19],[2,17,2,18],[2,19,2,20],[7,4,7,5],[7,6,7,7],[7,8,7,9],[7,13,7,14],[7,15,7,16],[7,17,7,18],[8,16,8,17],[8,18,8,19],[2,0,4,0],[2,2,2,3],[2,4,2,5],[2,6,2,7],[2,8,2,9],[2,13,2,14],[2,15,2,16],[6,0,9,0],[6,3,6,4],[6,5,6,6],[6,7,6,8],[6,9,6,10],[6,12,6,13],[6,14,6,15],[6,16,6,17],[5,2,5,3],[5,4,5,5],[5,6,5,7],[5,8,5,9],[5,13,5,14],[5,15,5,16],[7,2,7,3],[4,2,4,3],[4,4,4,5],[0,2,0,10],[0,12,0,20],[1,2,1,10],[1,12,1,20],[5,17,5,18],[5,19,5,20],[6,18,6,19],[7,19,7,20],[9,4,9,5],[9,6,9,7],[9,8,9,9],[9,13,9,14],[9,15,9,16],[9,17,9,18],[9,19,9,20],[8,3,8,4],[8,5,8,6],[8,7,8,8],[8,9,8,10],[4,6,4,7],[4,8,4,9],[4,13,4,14],[4,15,4,16],[4,17,4,18],[43,5,43,6],[43,7,43,8],[43,9,43,10],[37,5,37,6],[37,7,37,8],[37,9,37,10],[37,11,37,12],[39,5,39,6],[39,7,39,8],[39,9,39,10],[39,11,39,12],[33,24,33,25],[47,5,47,6],[47,7,47,8],[47,9,47,10],[47,11,47,12],[31,4,31,5],[31,7,31,8],[45,5,45,6],[45,7,45,8],[45,9,45,10],[45,11,45,12],[46,4,46,5],[46,6,46,7],[46,8,46,9],[46,10,46,11],[41,3,41,4],[41,5,41,6],[41,7,41,8],[41,9,41,10],[42,4,42,5],[42,6,42,7],[42,8,42,9],[42,10,42,11],[43,3,43,4]]}
[null,null,"AU FOND",null,null,null,null,null,null,null,null,null,"DEVANT",null,null,null,null,null,null,null,null,null,null,"Rouge","Blanc","Total"]
[null,null,null,null,null,null,null,null,null,null,null,null,null,null,null,null,null,null,null,null,null,null,null,{"$f":"#REF!","v":{"$error":"#REF!"}},{"$f":"#REF!","v":{"$error":"#REF!"}},{"$f":"SUM(X2:Y2)","v":{"$error":"#REF!"}}]
["ETAGERE 1",null,"R47",null,"R47",null,"R47",null,"R46",null,null,null,null,"R17",null,"R17",null,"R17",null,"R17"]
[null,null,null,"R46",null,"R46",null,"R46",null,"R46",null,null,null,null,"R40",null,"R37",null,"R39"]
[null,null,"R48",null,"R48",null,"R48",null,"R46",null,null,null,null,"R40",null,"R40",null,"R40",null,"R40"]
[]
["ETAGERE 2"]
[null,null,"R21",null,"R39",null,"R39",null,"R39",null,null,null,null,"R38"]
[null,null,null,"R37",null,"R28",null,"R21",null,"R21",null,null,"R38",null,"R38",null,"R38",null,"R38"]
[null,null,"R37",null,"R37",null,null,null,null,null,null,null,null,"R38",null,"R38",null,"R38",null,"R38"]
[null,null,null,null,null,null,null,null,null,null,null,null,null,null,null,null,null,null,null,null,null,null,null,null,null,null,null,null,1]
["ETAGERE 3",null,"R49",null,null,null,null,null,null,null,null,null,null,null,null,null,null,null,null,null,null,null,null,null,null,null,null,null,{"$f":"AC11-AC13","v":0.34355828220858897}]
[null,null,null,"R7",null,"R16",null,null,null,"R49",null,null,null,null,"R49",null,null,null,null,null,null,null,null,null,null,null,null,null,{"$f":"AE14","v":0.65644171779141103}]
[null,null,null,null,"R10",null,null,null,null,null,null,null,null,"R15",null,null,null,null,null,"R45",null,null,null,null,null,null,null,null,null,null,{"$f":"Y18/Y22","v":0.65644171779141103},null,{"$f":"100%-AE14","v":0.34355828220858897}]
[null,null,null,"R29",null,"R29",null,"R10",null,"R39"]
[null,null,"R11",null,"R32",null,null,null,"R29",null,null,null,null,"R49",null,"R49",null,"R49",null,"R6"]
[]
["ETAGERE 4",null,"B25",null,"B25",null,null,null,"B25",null,null,null,null,null,null,null,null,null,null,null,null,null,null,"Nombre d'emplacements occupés:",{"$f":"COUNTA(C3:U27)","v":107},null,null,null,"Vert",33]
[null,null,null,"B19",null,"B25",null,"B25",null,"B25",null,null,"B24",null,"B24",null,"B24",null,"B24",null,null,null,null,null,null,null,null,null,"Orange",33]
[null,null,null,null,"B13",null,"B13",null,"B13",null,null,null,null,"B24",null,"B20",null,"B24",null,null,null,null,null,"Nombre d'emplacements libres:",{"$f":"Y22-Y18","v":56},null,null,null,"Rouge",33]
[null,null,null,"B8",null,"B8",null,"B8",null,"B8",null,null,"B8",null,"B17",null,null,null,null,null,null,null,null,null,null,null,null,null,"Invisible",{"$f":"SUM(AD18:AD20)","v":99}]
[null,null,"B12",null,"B12",null,"B12",null,"B12",null,null,null,null,"B17",null,"B17",null,"B17",null,"B17",null,null,null,"Nombre total d'emplacements:",{"$f":"12+12+16+16+20+20+28+28+11","v":163}]
[null,null,null,"B10",null,"B10",null,"B10",null,null,null,null,"B10",null,"B12",null,null,null,"B9",null,null,null,null,null,null,null,null,null,"Valeur aiguille",{"$f":"AE14*100","v":65.644171779141104}]
[null,null,"B21",null,"B21",null,"B21",null,"B21",null,null,null,null,null,null,null,null,null,null,null,null,null,null,"Nombre total de bouteilles",{"$f":"Y18+D29+D33","v":123},null,null,null,"Largeur aiguille",1.5]
[null,null,null,null,null,null,null,null,null,null,null,null,null,null,null,null,null,null,null,null,null,null,"En haut","Rouges meilleurs crus",null,null,null,null,"Invisible",{"$f":"SUM(AD18:AD21)-(AD24+AD23)","v":130.85582822085888}]
["ETAGERE 5",null,null,null,null,"B26",null,null,"B26",null,null,null,null,null,null,null,null,null,null,null,null,null,"Milieu","Rouges et rosés"]
[null,null,null,"B23",null,null,"B23",null,null,"B23",null,null,null,null,null,null,null,null,null,null,null,null,"En bas","Blancs",null,null,null,null,"Rien"]
[null,null,null,null,null,null,null,null,null,null,null,null,null,null,null,null,null,null,null,null,null,null,null,null,null,null,null,null,"Aiguille",{"$f":"AD23","v":65.644171779141104}]
["MAISON",null,null,{"$f":"COUNTA(E29:U31)","v":8},"B23","B23",null,null,null,null,null,null,null,null,null,null,null,null,null,null,null,null,null,null,null,null,null,null,"Rien"]
[null,null,null,null,"B27","B27","B27","B27","B27"]
[null,null,null,null,"R50"]
[]
["GARAGE",null,null,{"$f":"COUNTA(E33:U37)","v":8},"B23","B23"]
[null,null,null,null,"B27","B27","B27","B27","B27","B27"]

{"sheet":"Dégusté_le","index":2,"n_rows":216,"n_cols":4,"rows_kept":216,"cut":false,"hidden":false,"merged":[]}
["Date","Millésime","Nombre","Remarque"]
["2019-11-09","Au Bas de Poillange 2018",1]
["2019-11-23","Vranken Demoiselle",1,"Cadeau à Christian"]
["2019-12-14","Vranken Demoiselle",1]
["2019-12-24","Naudé-22",1,"Cadeau à Valérie et Serge"]
["2019-12-25","Chateau de Meursault",1,"Réveillon avec les enfants"]
["2019-12-31","Naudé",1,"Réveillon Alizée"]
["2019-12-31","Naudé",2,"Réveillon à la maison"]
["2019-12-31","Aux Ravioles 2017",1,"Réveillon à la maison"]
["2019-12-31","Confidences Prieuré Lichine 2015",1,"Réveillon à la maison"]
["2019-12-31","La Toppe au Vert 2017",1,"Réveillon à la maison"]
["2019-12-31","Chassagne Montrachet 2017",1,"Réveillon à la maison"]
["2020-01-25","Vranken Demoiselle",1,"Nous 2"]
["2020-02-17","Naudé",1,"Repas avec JC et Michelle"]
["2020-03-19","Les Gréchons 2018",1,"Nous 4"]
["2020-06-02","Les Gréchons 2017",1,"Anniversaire Marie"]
["2020-06-17","Naudé",1,"Achat du GLC"]
["2020-06-25","Rully 1er Cru Les Crêts 2018",2,"Repas avec Claude et Corinne"]
["2020-06-25","Naudé",1,"Repas avec Claude et Corinne"]
["2020-07-07","Naudé",1,"Clôture cours de tennis Sophie"]
["2020-07-19","Rully 1er Cru Les Crêts 2018",1,"Repas avec Ronan et Gaëlle"]
["2020-07-24","Naudé",1,"Repas d'Alizée chez les parents de Lucas"]
["2020-08-01","Rully 1er Cru La Pucelle 2018",1,"Homard avec Marie"]
["2020-10-19","Naudé",1,"Ormeaux chez Ronan"]
["2020-11-08","Lyseras 2017",1,"Repas à la maison avec Alizée et Lucas"]
["2020-11-21","Arpège 2011",1,"Repas à la maison avec Alizée et Lucas"]
["2020-12-20","Quintaine 2017",1,"Repas"]
["2020-12-24","Domaine Capitain 2013",1,"Réveillon de Noël"]
["2020-12-24","Naudé",3,"Réveillon de Noël"]
["2020-12-24","Quintaine 2017",2,"Réveillon de Noël"]
["2020-12-31","Arpège 2011",1,"Réveillon 31 avec Marie et Anthony"]
["2020-12-31","Haut Nouchet 2013",1,"Réveillon 31 avec Marie et Anthony"]
["2020-12-31","Naudé",2,"Réveillon 31 avec Marie et Anthony"]
["2020-12-31","Quintaine 2017",1,"Réveillon 31 avec Marie et Anthony"]
["2021-02-19","Quintaine 2017",2,"Diner nous 6"]
["2021-03-03","Quintaine 2017",1,"Anniversaire Gérard"]
["2021-03-07","La Toppe au Vert 2017",2,"Repas avec les 4 Guillou, Christian, Pascale et Patrick"]
["2021-04-03","Ronan By Client 2012",1,"Nous 2"]
["2021-04-05","Naudé",1,"Brunch avec Alizée et Lucas"]
["2021-04-17","Château Montlabert",1,"Dégustation nous 2"]
["2021-04-21","Naudé-22",1,"Nous 2 avec Alizée"]
["2021-05-06","Quintaine 2017",1,"Nous 2, Marie et Anthony, Alizée"]
["2021-05-09","Château Montlabert",1,"Brunch nous 6"]
["2021-05-09","Pagus Luminis Condrieu 2015",1,"Brunch nous 6"]
["2021-05-18","Ronan By Client 2012",1,"Cadeau à Patrick (70 ans)"]
["2021-06-17","Givry 1er cru Clos du Cellier aux Moines 2016",2,"Repas avec Michelle, Martine, JC et Lionel"]
["2021-06-17","Naudé-22",2,"Repas avec Michelle, Martine, JC et Lionel"]
["2021-06-22","Quintaine 2017",1,"Anniversaire de mariage"]
["2021-07-13","Pagus Luminis Condrieu 2015",1,"Homards avec Marie, Anthony et Alizée"]
["2021-07-16","Les Coteaux d'Albret",4,"Divers"]
["2021-08-01","Quintaine 2017",1,"Envie de Sophie"]
["2021-08-05","Château Montlabert",1,"Repas avec Claude et Corinne"]
["2021-08-05","Sarget de Gruaud Larose",1,"Repas avec Claude et Corinne"]
["2021-08-05","Connétable TALBOT St Julien 2006",1,"Repas avec Claude et Corinne"]
["2021-08-05","Quintaine 2017",1,"Repas avec Claude et Corinne"]
["2021-08-24","Château Siaurac 2014",2,"Repas avec les parents de Lucas, Marie, Anthony, Alizée et Lucas"]
["2021-08-24","Naudé-22",2,"Repas avec les parents de Lucas, Marie, Anthony, Alizée et Lucas"]
["2021-09-15","Les Coteaux d'Albret",1,"Nous 2"]
["2021-10-06","Ermitage 2020",1,"Dégustation avec Alizée et Lucas"]
["2021-10-04","Les Coteaux d'Albret",2,"Nous"]
["2021-10-09","Auxey-Duresses Louis Jadot 2017",2,"Dégustation nous 2"]
["2021-10-12","Auxey-Duresses Louis Jadot 2017",1,"Repas avec Arzel"]
["2021-10-12","Ronan By Client 2012",1,"Repas avec Arzel"]
["2021-10-12","Ermitage 2020",1,"Repas avec Arzel"]
["2021-10-14","Ermitage 2020",1,"Nous"]
["2021-10-15","Quintaine 2017",1,"Nous, Marie, Anthony et Alizée"]
["2021-10-17","Ermitage 2020",1,"Nous 6"]
["2021-10-18","Château Nénine 2014",2,"Nous 2"]
["2021-10-23","Ermitage 2020",1,"Nous 2"]
["2021-10-29","Les Coteaux d'Albret",1,"Nous 2"]
["2021-11-01","Pauillac 2013",1,"Brunch avec les Guillou, Alizée et Lucas"]
["2021-11-01","Les Coteaux d'Albret",2,"Brunch avec les Guillou, Alizée et Lucas"]
["2021-11-05","Bellissima",1,"Dîner avec Ronan et Gaëlle"]
["2021-11-06","Château Nénine 2014",1,"Nous 2"]
["2021-11-09","Ermitage 2020",1,"Dégustation avec Alizée et Lucas"]
["2021-11-10","Ermitage 2020",1,"Nous"]
["2021-11-10","Les Coteaux d'Albret",7,"Nous 2"]
["2021-11-12","Auxey-Duresses Louis Jadot 2017",3,"Nous 2"]
["2021-11-12","Ermitage 2020",1,"Nous 2"]
["2021-11-15","Les Coteaux d'Albret",1,"Arrosage de la Tesla"]
["2021-11-16","Ermitage 2020",1,"Raclette avec Alizée et Lucas"]
["2021-11-18","Ermitage 2020",1,"Nous 2"]
["2021-11-24","Ermitage 2020",1,"Raclette avec Alizée et Lucas"]
["2021-11-27","Ermitage 2020",1,"Nous 2"]
["2021-11-28","Les Coteaux d'Albret",2,"Nous 2"]
["2021-11-30","Ermitage 2020",1,"Nous 2"]
["2021-12-01","Ronan By Client 2012",1,"Repas avec Jean Charles et Michelle"]
["2021-12-01","Quintaine 2017",2,"Repas avec Jean Charles et Michelle"]
["2021-12-01","Les Coteaux d'Albret",1,"Repas avec Jean Charles et Michelle"]
["2021-12-04","Ronan By Client 2012",1,"Avec Marie et Anthony à Paris"]
["2021-12-04","Quintaine 2017",2,"Avec Marie et Anthony à Paris"]
["2021-12-04","VRANKEN Diamant",1,"Avec Marie et Anthony à Paris"]
["2021-12-10","Ermitage 2020",1,"Nous 2"]
["2021-12-16","Ermitage 2020",8,"Nous 2 avec Alizée et Lucas"]
["2021-12-17","St Joseph 2017",1,"Repas avec Martine et Lionel"]
["2021-12-17","Quintaine 2017",1,"Repas avec Martine et Lionel"]
["2021-12-18","Ermitage 2020",1,"Nous 2"]
["2021-12-20","Ermitage 2020",1,"Nous 2"]
["2021-12-23","Les Coteaux d'Albret",2,"Nous 2 avec Marion"]
["2021-12-25","Domaine Augustin 2016",1,"Réveillon de Noël"]
["2021-12-25","VRANKEN Demoiselle",1,"Réveillon de Noël"]
["2021-12-22","Naudé-22",7,"Nous 6"]
["2021-12-27","Chassagne Montrachet 2015",1,"Baeckoffe nous 6"]
["2021-12-27","VRANKEN Demoiselle",1,"Baeckoffe nous 6"]
["2022-01-01","Confidences Prieuré Lichine 2015",1,"Réveillon du 1er avec Marie et Anthony"]
["2022-01-01","Chassagne Montrachet 2017",1,"Réveillon du 1er avec Marie et Anthony"]
["2022-01-02","Quintaine 2017",3,"Cadeau à Marie et Anthony"]
["2022-01-16","Château Lafleur 2011",1,"Galette avec Jean Charles, Michelle, Lionel, Martine et Chantal"]
["2022-01-16","Les Coteaux d'Albret",1,"Nous 2"]
["2022-02-13","Domaine de Suremain 2015",1,"Nous 2 avec Marie, Alizée et Lucas"]
["2022-03-01","Quintaine 2017",1,"Repas avec Claude et Corinne"]
["2022-03-01","St Estèphe 2015",1,"Repas avec Claude et Corinne"]
["2022-03-16","Quintaine 2017",1,"Nous 2 avec Alizée et Lucas"]
["2022-03-23","Domaine de Valmoissine",1,"Nous 2 avec Alizée et Lucas"]
["2022-03-27","Givry 1er cru Clos du Cellier aux Moines 2016",1,"Nous 2"]
["2022-04-01","Moulins de Citran Haut Médoc 2009",1,"Repas avec Chantal et René Hillion"]
["2022-04-01","Quintaine 2017",1,"Repas avec Chantal et René Hillion"]
["2022-04-03","Givry 1er cru Servoisine 2016",1,"Nous 2"]
["2022-04-09","Côte Rôtie Madinière 2016",1,"Repas avec les Guillou et Marion"]
["2022-04-10","Château Nénine 2014",3,"Nous 2"]
["2022-04-17","Château Cassagne Haut Canon 2010",1,"Nous 2 avec Alizée et Lucas"]
["2022-04-30","Quintaine 2017",1,"Nous 2, Marie et Anthony"]
["2022-04-30","Domaine FERRET 2017",1,"Nous 6"]
["2022-05-01","Givry 1er cru Servoisine 2016",1,"Nous 6"]
["2022-05-07","La Chapelle Haut Nouchet 2016",1,"Repas avec Fred et Béa"]
["2022-05-07","Etoile by Haut Nouchet blanc 2020",1,"Repas avec Fred et Béa"]
["2022-05-15","Château Cassagne Haut Canon 2010",1,"Repas à la maison avec Alizée et Lucas"]
["2022-05-15","Chablis 1er cru 2016",1,"Repas nous 2"]
["2022-05-15","Quintaine 2018",2,"Repas à la maison avec Alizée et Lucas"]
["2022-05-20","Riesling 2018",1,"Repas nous 2"]
["2022-05-22","La Chapelle Haut Nouchet 2016",1,"Nous 6"]
["2022-05-25","Château La Peyre 2015",2,"Nous 2 avec Marie, Alizée et Lucas"]
["2022-05-25","S de Schlumberger 2022",2,"Nous 2 avec Marie, Alizée et Lucas"]
["2022-05-27","S de Schlumberger 2022",2,"Nous 2 avec Marie"]
["2022-05-29","Givry 1er cru Servoisine 2016",1,"Nous 2 avec Marie"]
["2022-05-30","S de Schlumberger 2022",2,"Sophie chez Marie et Anthony"]
["2022-06-01","S de Schlumberger 2022",2,"Nous 2"]
["2022-06-05","La Chapelle Haut Nouchet 2016",1,"Nous 2 avec Alizée et Lucas"]
["2022-06-06","La Chapelle Haut Nouchet 2016",1,"Nous 2 avec Alizée et Lucas"]
["2022-06-07","Etoile by Haut Nouchet blanc 2020",1,"Nous 2"]
["2022-06-09","S de Schlumberger 2022",1,"Nous 2"]
["2022-06-12","La Chapelle Haut Nouchet 2016",1,"Nous 2"]
["2022-06-13","Quintaine 2018",2,"Nous 2 avec Alizée et Lucas"]
["2022-06-14","S de Schlumberger 2022",1,"Cadeau à Claude et Corinne"]
["2022-06-19","La Chapelle Haut Nouchet 2016",1,"Nous 2,Alizée et Lucas, Valérie, Serge, Marion"]
["2022-06-19","Naudé-22",1,"Nous 2,Alizée et Lucas, Valérie, Serge, Marion"]
["2022-06-22","S de Schlumberger 2022",1,"Nous 2"]
["2022-06-26","Quintaine 2018",1,"Séjour chez Marie et Anthony"]
["2022-06-26","La Chapelle Haut Nouchet 2016",1]
["2022-06-26","Naudé-22",1]
["2022-07-01","La Chapelle Haut Nouchet 2016",1,"Nous 2"]
["2022-07-14","La Chapelle Haut Nouchet 2016",1,"Nous 2"]
["2022-07-18","S de Schlumberger 2022",1,"Nous 2"]
["2022-07-23","Château La Peyre 2015",2,"Repas avec Jean Charles et Michelle, Martine et Lionel"]
["2022-07-23","S de Schlumberger 2022",3,"Repas avec Jean Charles et Michelle, Martine et Lionel"]
["2022-07-23","Naudé-22",1,"Repas avec Jean Charles et Michelle, Martine et Lionel"]
["2022-07-28","Quintaine 2018",1,"Repas avec les parents de Lou-Anne et leurs 2 garçons"]
["2022-07-28","La Chapelle Haut Nouchet 2016",1,"Repas avec les parents de Lou-Anne et leurs 2 garçons"]
["2022-08-05","Ladoix Les Hautes Mourottes 2018",2,"Repas avec Claude et Corinne"]
["2022-08-05","Connétable Talbot 2016",1,"Repas avec Claude et Corinne"]
["2022-08-05","Naudé-22",1,"Repas avec Claude et Corinne"]
["2022-08-14","S de Schlumberger 2022",1,"Apéro avec Marie et Anthony"]
["2022-08-14","La Chapelle Haut Nouchet 2016",1,"Nous 6"]
["2022-08-17","Quintaine 2018",1,"Nous 2, Marie et Anthony"]
["2022-08-21","Bellissima",1,"Nous 2, Marie et Anthony"]
["2022-08-21","S de Schlumberger 2022",1,"Nous 2, Marie et Anthony"]
["2022-08-21","Côte Rôtie Madinière 2016",1,"Nous 6"]
["2022-08-21","Naudé-22",1,"Nous 6"]
["2022-09-08","ROEDERER Brut",1,"Nous 6 en Corse"]
["2022-09-11","S de Schlumberger 2022",1,"Nous 2"]
["2022-09-20","Naudé-22",1,"Repas chez Isabelle "]
["2022-09-24","Château Siaurac 2014",1,"Nous 2"]
["2022-09-25","Château La Peyre 2015",1,"Nous 2 avec Alizée et Lucas"]
["2022-09-27","Quintaine 2018",1,"Repas avec Ronan et Gaëlle"]
["2022-09-27","S de Schlumberger 2022",2,"Repas avec Ronan et Gaëlle"]
["2022-10-01","Quintaine 2018",1,"Week end de Sophie chez Marie et Anthony"]
["2022-10-01","S de Schlumberger 2022",3,"Week end de Sophie chez Marie et Anthony"]
["2022-10-08","Quintaine 2018",1,"Repas avec Marie, Alizée et Lucas"]
["2022-10-09","Naudé-22",1,"Inauguration maison d'Alizée avec Papy, Mamie, Marie, Alizée, Lucas et nous 2"]
["2022-10-14","Etoile by Haut Nouchet blanc 2020",1,"Nous 2"]
["2022-10-19","S de Schlumberger 2022",1,"Nous 2"]
["2022-11-27","S de Schlumberger 2022",3,"Nous avec Marie, Anthony et Alizée"]
["2022-11-28","Aux Ravioles 2017",1,"Nous avec Marie, Anthony et Alizée"]
["2022-11-28","Château Montlabert 2015",1,"Nous avec Marie, Anthony, Alizée et Lucas"]
["2022-12-02","S de Schlumberger 2022",1,"Nous 2"]
["2022-12-04","Château La Peyre 2015",1,"Nous 2"]
["2022-12-10","Morgeot 1er Cru 2017",1,"Nous 2 avec Ronan et Gaëlle"]
["2022-12-24","Ladoix Les Gréchons 2018",1,"Nous 2,Valérie, Serge, Nico et Marion"]
["2022-12-24","Ladoix Les Hautes Mourottes 2018",1,"Nous 2,Valérie, Serge, Nico et Marion"]
["2022-12-24","La Toppe au Vert 2017",1,"Nous 2,Valérie, Serge, Nico et Marion"]
["2022-12-24","Naudé-22",1,"Nous 2,Valérie, Serge, Nico et Marion"]
["2022-12-31","Morgeot 1er Cru 2017",1,"Nous 2, Marie et Anthony"]
["2022-12-31","Domaine Fontaine Gagnard 2018",1,"Nous 2, Marie et Anthony"]
["2023-01-01","Les Vaumuriens 2017",1,"Nous 2, Marie, Anthony, Alizée et Lucas"]
["2023-01-01","Chassagne Montrachet 2017",1,"Nous 2, Marie, Anthony, Alizée et Lucas"]
["2023-01-06","Quintaine 2018",1,"Nous 2"]
["2023-01-09","Naudé-22",1,"Galette avec Ronan et Gaëlle"]
["2023-01-30","Quintaine 2018",1,"Nous 2"]
["2023-02-19","Quintaine 2018",1,"Nous 2, Alizée et Lucas"]
["2023-02-20","Quintaine 2018",1,"Nous 2"]
["2023-02-22","Quintaine 2018",1,"Nous 2, Alizée et Lucas"]
["2023-02-26","Etoile by Haut Nouchet blanc 2020",1,"Nous 2"]
["2023-03-03","Ronan By Client 2012",1,"Nous 2, Alizée et Lucas, Valérie"]
["2023-04-08","Château Montlabert 2015",2,"Repas avec Jean Charles et Michelle, Martine et Lionel"]
["2023-04-11","Château Lusseau 2014",1,"Nous 2 avec Ronan et Gaëlle"]
["2023-06-22","Quintaine 2018",1,"Repas d'anniversaire de mariage nous 2"]
["2023-07-06","Château La Peyre 2015",1,"Nous 2 avec Ronan et Gaëlle"]
["2023-07-22","Aux Ravioles 2017",2,"Nous 2 avec Maria, Corinne, Éric et Marc"]
["2023-07-22","Quintaine 2018",1,"Nous 2 avec Maria, Corinne, Éric et Marc"]
["2023-08-04","Aux Ravioles 2017",1,"Nous 2 avec Martine et Lionel"]
["2023-10-29","Clos René 2015",1,"Soirée raclette avec Maria, Corinne, Eric et Marc"]
["2023-11-03","Clos René 2015",1,"Soirée avec Claude et Corinne"]
["2023-11-03","Pagus Luminis 2019",1,"Soirée avec Claude et Corinne"]
["2023-11-08","Ladoix Les Hautes Mourottes 2018",1,"Soirée avec Lionel et Martine"]
["2023-11-08","Château Montlabert 2015",1,"Soirée avec Lionel et Martine"]
["2023-11-17","Domaine Moillard 2018",1,"Nous 2, Marie et Anthony"]

{"sheet":"Listedevins","index":3,"n_rows":1000,"n_cols":14,"rows_kept":1000,"cut":false,"hidden":false,"merged":[]}
["NOM","STOCK","RANG",null,"NOM PAR ORDRE ALPHABÉTIQUE","STOCK","RANG",null,"NOM PAR ORDRE ALPHABÉTIQUE","RANG"]
[{"$f":"Achats!A2","v":"Château Lusseau 2014"},{"$f":"Achats!$J2","v":1},{"$f":"IF(A2>0,COUNTIF($A$2:$A$1000,\"<=\"&$A2),\"\")","v":15},null,{"$f":"IFERROR(INDEX(A:C,MATCH(ROW()-ROW($E$1),C:C,0),1),\"\")","v":"Aloxe Corton Fanny Sabre 2018"},{"$f":"IFERROR(INDEX($A:$C,MATCH(ROW()-ROW($E$1),C:C,0),2),\"\")","v":1},{"$f":"IF($E2>0,1)","v":1},null,{"$f":"IFERROR(IF($F2>0,INDEX($E:$G,MATCH(ROW()-ROW($E$1),$G:$G,0),1),\"\"),\"\")","v":"Aloxe Corton Fanny Sabre 2018"},{"$f":"IF(E2>0,1)","v":1},null,null,null,{"$f":"IF(ISERROR(INDEX(OFFSET($A$2:$C$100,O12,),MATCH(\"*\"&\"\",OFFSET($A$2:$C$100,O12,),0),2)),\"\",INDEX(OFFSET($A$2:$C$100,IO2,),MATCH(\"*\"&\"\",OFFSET($C$2:$C$100,O12,),0),2))","v":""}]
[{"$f":"Achats!A3","v":"Château Cap Saint Martin 2015"},{"$f":"Achats!$J3","v":4},{"$f":"IF(A3>0,COUNTIF($A$2:$A$1000,\"<=\"&$A3),\"\")","v":12},null,"Au Bas de Poillange 2018",5,{"$f":"IF($A3>0,$G2+1,\"\")","v":2},null,{"$f":"IFERROR(IF($F3>0,INDEX($E:$G,MATCH(ROW()-ROW($E$1),$G:$G,0),1),\"\"),\"\")","v":"Au Bas de Poillange 2018"},{"$f":"IF(A3<>0,$J2+1,\"\")","v":2}]
[{"$f":"Achats!A4","v":"Lyseras 2017"},{"$f":"Achats!$J4","v":1},39,null,"Au Grand Bussière 2019",1,3,null,"Au Grand Bussière 2019",{"$f":"IF(A4<>0,$J3+1,\"\")","v":3}]
[{"$f":"Achats!A5","v":"Confidences Prieuré Lichine 2015"},{"$f":"Achats!$J5","v":0},19,null,"Aux Ravioles 2017",0,4,null,"",4]
[{"$f":"Achats!A6","v":"La réserve de Malartic 2014"},{"$f":"Achats!$J6","v":1},27,null,"Auxey Duresses 2020",2,5,null,"Auxey Duresses 2020",5]
[{"$f":"Achats!A7","v":"Domaine Fontaine Gagnard 2017"},{"$f":"Achats!$J7","v":1},22,null,"Bellissima ",0,6,null,"",6]
[{"$f":"Achats!A8","v":"Château Canon St Michel 2015"},{"$f":"Achats!$J8","v":1},11,null,"Champagne Canard Duchêne",1,7,null,"Champagne Canard Duchêne",7]
[{"$f":"Achats!A9","v":"Bellissima "},{"$f":"Achats!$J9","v":0},6,null,"Champagne Drapier",1,8,null,"Champagne Drapier",8]
[{"$f":"Achats!A10","v":"Au Bas de Poillange 2018"},{"$f":"Achats!$J10","v":5},2,null,"Champagne Moët & Chandon",1,9,null,"Champagne Moët & Chandon",9]
[{"$f":"Achats!A11","v":"Aux Ravioles 2017"},{"$f":"Achats!$J11","v":0},4,null,"Champagne Tribaut 2023",6,10,null,"Champagne Tribaut 2023",10]
[{"$f":"Achats!A12","v":"La Toppe au Vert 2017"},{"$f":"Achats!$J12","v":2},28,null,"Château Canon St Michel 2015",1,11,null,"Château Canon St Michel 2015",11]
[{"$f":"Achats!A13","v":"Domaine Fontaine Gagnard 2018"},{"$f":"Achats!$J13","v":3},23,null,"Château Cap Saint Martin 2015",4,12,null,"Château Cap Saint Martin 2015",12]
[{"$f":"Achats!A14","v":"Ladoix Les Hautes Mourottes 2018"},{"$f":"Achats!$J14","v":2},30,null,"Château de Bligny",1,13,null,"Château de Bligny",13]
[{"$f":"Achats!A15","v":"Ladoix Les Gréchons 2018"},{"$f":"Achats!$J15","v":5},29,null,"Château La Peyre 2015",5,14,null,"Château La Peyre 2015",14]
[{"$f":"Achats!A16","v":"Rully 1er Cru La Pucelle 2018"},{"$f":"Achats!$J16","v":5},48,null,"Château Lusseau 2014",1,15,null,"Château Lusseau 2014",15]
[{"$f":"Achats!A17","v":"Rully 1er Cru Les Crêts 2018"},{"$f":"Achats!$J17","v":3},49,null,"Château Meyney 2016",1,16,null,"Château Meyney 2016",16]
[{"$f":"Achats!A18","v":"Quintaine 2017"},{"$f":"Achats!$J18","v":0},44,null,"Château Montlabert 2015",8,17,null,"Château Montlabert 2015",17]
[{"$f":"Achats!A19","v":"Riesling 2018"},{"$f":"Achats!$J19","v":1},46,null,"Clos René 2015",6,18,null,"Clos René 2015",18]
[{"$f":"Achats!A20","v":"Domaine FERRET 2017"},{"$f":"Achats!$J20","v":1},21,null,"Confidences Prieuré Lichine 2015",0,19,null,"",19]
[{"$f":"Achats!A21","v":"Morgeot 1er Cru 2017"},{"$f":"Achats!$J21","v":1},40,null,"Connétable Talbot 2016",5,20,null,"Connétable Talbot 2016",20]
[{"$f":"Achats!A22","v":"Ronan By Client 2012"},{"$f":"Achats!$J22","v":0},47,null,"Domaine FERRET 2017",1,21,null,"Domaine FERRET 2017",21]
[{"$f":"Achats!A23","v":"Clos René 2015"},{"$f":"Achats!$J23","v":6},18,null,"Domaine Fontaine Gagnard 2017",1,22,null,"Domaine Fontaine Gagnard 2017",22]
[{"$f":"Achats!A24","v":"Château Montlabert 2015"},{"$f":"Achats!$J24","v":8},17,null,"Domaine Fontaine Gagnard 2018",3,23,null,"Domaine Fontaine Gagnard 2018",23]
[{"$f":"Achats!A25","v":"Pagus Luminis 2019"},{"$f":"Achats!$J25","v":5},43,null,"Domaine Moillard 2018",0,24,null,"",24]
[{"$f":"Achats!A26","v":"Ermitage 2020"},{"$f":"Achats!$J26","v":0},25,null,"Ermitage 2020",0,25,null,"",25]
[{"$f":"Achats!A27","v":"Connétable Talbot 2016"},{"$f":"Achats!$J27","v":5},20,null,"Etoile by Haut Nouchet blanc 2020",2,26,null,"Etoile by Haut Nouchet blanc 2020",26]
[{"$f":"Achats!A28","v":"Sirène de Giscours 2016"},{"$f":"Achats!$J28","v":6},51,null,"La réserve de Malartic 2014",1,27,null,"La réserve de Malartic 2014",27]
[{"$f":"Achats!A29","v":"Les Vaumuriens 2017"},{"$f":"Achats!$J29","v":0},38,null,"La Toppe au Vert 2017",2,28,null,"La Toppe au Vert 2017",28]
[{"$f":"Achats!A30","v":"Les Grésigny 2018"},{"$f":"Achats!$J30","v":6},35,null,"Ladoix Les Gréchons 2018",5,29,null,"Ladoix Les Gréchons 2018",29]
[{"$f":"Achats!A31","v":"Les Hauts Jarrons 2018"},{"$f":"Achats!$J31","v":6},36,null,"Ladoix Les Hautes Mourottes 2018",2,30,null,"Ladoix Les Hautes Mourottes 2018",30]
[{"$f":"Achats!A32","v":"Les Argillats 2019"},{"$f":"Achats!$J32","v":3},31,null,"Les Argillats 2019",3,31,null,"Les Argillats 2019",31]
[{"$f":"Achats!A33","v":"Les Rugiens 2016"},{"$f":"Achats!$J33","v":3},37,null,"Les Chauchoux 2020",2,32,null,"Les Chauchoux 2020",32]
[{"$f":"Achats!A34","v":"Les Fichots 2018"},{"$f":"Achats!$J34","v":6},34,null,{"$f":"IFERROR(INDEX(A:C,MATCH(ROW()-ROW($E$1),C:C,0),1),\"\")","v":"Les Creux Fraîche Eau 2021"},{"$f":"IFERROR(INDEX($A:$C,MATCH(ROW()-ROW($E$1),C:C,0),2),\"\")","v":2},33,null,"Les Creux Fraîche Eau 2021",33]
[{"$f":"Achats!A35","v":"Château La Peyre 2015"},{"$f":"Achats!$J35","v":5},14,null,"Les Fichots 2018",6,{"$f":"IF($A35>0,$G34+1,\"\")","v":34},null,"Les Fichots 2018",34]
[{"$f":"Achats!A36","v":"Etoile by Haut Nouchet blanc 2020"},{"$f":"Achats!$J36","v":2},26,null,"Les Grésigny 2018",6,35,null,"Les Grésigny 2018",35]
[{"$f":"Achats!A37","v":"S de Schlumberger 2022"},{"$f":"Achats!$J37","v":2},50,null,"Les Hauts Jarrons 2018",6,36,null,"Les Hauts Jarrons 2018",36]
[{"$f":"Achats!A38","v":"Naudé-22"},{"$f":"Achats!$J38","v":2},42,null,"Les Rugiens 2016",3,37,null,"Les Rugiens 2016",37]
[{"$f":"Achats!A39","v":"Quintaine 2019"},{"$f":"Achats!$J39","v":4},45,null,"Les Vaumuriens 2017",0,38,null,"",38]
[{"$f":"Achats!A40","v":"Domaine Moillard 2018"},{"$f":"Achats!$J40","v":0},24,null,"Lyseras 2017",1,39,null,"Lyseras 2017",39]
[{"$f":"Achats!A41","v":"Au Grand Bussière 2019"},{"$f":"Achats!$J41","v":1},3,null,"Morgeot 1er Cru 2017",1,40,null,"Morgeot 1er Cru 2017",40]
[{"$f":"Achats!A42","v":"Champagne Canard Duchêne"},{"$f":"Achats!$J42","v":1},7,null,"Naudé 23",18,41,null,"Naudé 23",41]
[{"$f":"Achats!A43","v":"Champagne Tribaut 2023"},{"$f":"Achats!$J43","v":6},10,null,"Naudé-22",2,42,null,"Naudé-22",42]
[{"$f":"Achats!A44","v":"Aloxe Corton Fanny Sabre 2018"},{"$f":"Achats!$J44","v":1},1,null,"Pagus Luminis 2019",5,43,null,"Pagus Luminis 2019",43]
[{"$f":"Achats!A45","v":"Château Meyney 2016"},{"$f":"Achats!$J45","v":1},16,null,"Quintaine 2017",0,44,null,"",44]
[{"$f":"Achats!A46","v":"Auxey Duresses 2020"},{"$f":"Achats!$J46","v":2},5,null,"Quintaine 2019",4,45,null,"Quintaine 2019",45]
[{"$f":"Achats!A47","v":"Château de Bligny"},{"$f":"Achats!$J47","v":1},13,null,"Riesling 2018",1,46,null,"Riesling 2018",46]
[{"$f":"Achats!A48","v":"Les Chauchoux 2020"},{"$f":"Achats!$J48","v":2},32,null,"Ronan By Client 2012",0,47,null,"",47]
[{"$f":"Achats!A49","v":"Champagne Drapier"},{"$f":"Achats!$J49","v":1},8,null,"Rully 1er Cru La Pucelle 2018",5,48,null,"Rully 1er Cru La Pucelle 2018",48]
[{"$f":"Achats!A50","v":"Naudé 23"},{"$f":"Achats!$J50","v":18},41,null,"Rully 1er Cru Les Crêts 2018",3,49,null,"Rully 1er Cru Les Crêts 2018",49]
[{"$f":"Achats!A51","v":"Les Creux Fraîche Eau 2021"},{"$f":"Achats!$J51","v":2},33,null,"S de Schlumberger 2022",2,50,null,"S de Schlumberger 2022",50]
[{"$f":"Achats!A52","v":"Tonelum 2018"},{"$f":"Achats!$J52","v":1},52,null,"Sirène de Giscours 2016",6,51,null,"Sirène de Giscours 2016",51]
[{"$f":"Achats!A53","v":"Champagne Moët & Chandon"},{"$f":"Achats!$J53","v":1},9,null,"Tonelum 2018",1,52,null,"Tonelum 2018",52]
[{"$f":"Achats!A54","v":0},{"$f":"Achats!$J54","v":""},"",null,"","","",null,"",""]
[{"$f":"Achats!A55","v":0},{"$f":"Achats!$J55","v":""},"",null,"","","",null,"",""]
[{"$f":"Achats!A56","v":0},{"$f":"Achats!$J56","v":""},"",null,"","","",null,"",""]
[{"$f":"Achats!A57","v":0},{"$f":"Achats!$J57","v":""},"",null,"","","",null,"",""]
[{"$f":"Achats!A58","v":0},{"$f":"Achats!$J58","v":""},"",null,"","","",null,"",""]
[{"$f":"Achats!A59","v":0},{"$f":"Achats!$J59","v":""},"",null,"","","",null,"",""]
[{"$f":"Achats!A60","v":0},{"$f":"Achats!$J60","v":""},"",null,"","","",null,"",""]
[{"$f":"Achats!A61","v":0},{"$f":"Achats!$J61","v":""},"",null,{"$f":"IFERROR(INDEX(A:C,MATCH(ROW()-ROW($E$1),C:C,0),1),\"\")","v":""},{"$f":"IFERROR(INDEX($A:$C,MATCH(ROW()-ROW($E$1),C:C,0),2),\"\")","v":""},{"$f":"IF($A61>0,$G60+1,\"\")","v":""},null,"",""]
[{"$f":"Achats!A62","v":0},{"$f":"Achats!$J62","v":""},"",null,"","","",null,"",""]
[{"$f":"Achats!A63","v":0},{"$f":"Achats!$J63","v":""},"",null,"","","",null,"",""]
[{"$f":"Achats!A64","v":0},{"$f":"Achats!$J64","v":""},"",null,"","","",null,"",""]
[{"$f":"Achats!A65","v":0},{"$f":"Achats!$J65","v":""},"",null,"","","",null,"",""]
[{"$f":"Achats!A66","v":0},{"$f":"Achats!$J66","v":""},"",null,{"$f":"IFERROR(INDEX(A:C,MATCH(ROW()-ROW($E$1),C:C,0),1),\"\")","v":""},"","",null,"",""]
[{"$f":"Achats!A67","v":0},{"$f":"Achats!$J67","v":""},{"$f":"IF(A67>0,COUNTIF($A$2:$A$1000,\"<=\"&$A67),\"\")","v":""},null,"",{"$f":"IFERROR(INDEX($A:$C,MATCH(ROW()-ROW($E$1),C:C,0),2),\"\")","v":""},"",null,{"$f":"IFERROR(IF($F67>0,INDEX($E:$G,MATCH(ROW()-ROW($E$1),$G:$G,0),1),\"\"),\"\")","v":""},""]
[{"$f":"Achats!A68","v":0},{"$f":"Achats!$J68","v":""},"",null,"","",{"$f":"IF($A68>0,$G67+1,\"\")","v":""},null,"",{"$f":"IF(A68<>0,$J67+1,\"\")","v":""}]
[{"$f":"Achats!A69","v":0},{"$f":"Achats!$J69","v":""},"",null,"","","",null,"",""]
[{"$f":"Achats!A70","v":0},{"$f":"Achats!$J70","v":""},"",null,"","","",null,"",""]
[{"$f":"Achats!A71","v":0},{"$f":"Achats!$J71","v":""},"",null,"","","",null,"",""]
[{"$f":"Achats!A72","v":0},{"$f":"Achats!$J72","v":""},"",null,"","","",null,"",""]
[{"$f":"Achats!A73","v":0},{"$f":"Achats!$J73","v":""},"",null,"","","",null,"",""]
[{"$f":"Achats!A74","v":0},{"$f":"Achats!$J74","v":""},"",null,"","","",null,"",""]
[{"$f":"Achats!A75","v":0},{"$f":"Achats!$J75","v":""},"",null,"","","",null,"",""]
[{"$f":"Achats!A76","v":0},{"$f":"Achats!$J76","v":""},"",null,"","","",null,"",""]
[{"$f":"Achats!A77","v":0},{"$f":"Achats!$J77","v":""},"",null,"","","",null,"",""]
[{"$f":"Achats!A78","v":0},{"$f":"Achats!$J78","v":""},"",null,"","","",null,"",""]
[{"$f":"Achats!A79","v":0},{"$f":"Achats!$J79","v":""},"",null,"","","",null,"",""]
[{"$f":"Achats!A80","v":0},{"$f":"Achats!$J80","v":""},"",null,"","","",null,"",""]
[{"$f":"Achats!A81","v":0},{"$f":"Achats!$J81","v":""},"",null,"","","",null,"",""]
[{"$f":"Achats!A82","v":0},{"$f":"Achats!$J82","v":""},"",null,"","","",null,"",""]
[{"$f":"Achats!A83","v":0},{"$f":"Achats!$J83","v":""},"",null,"","","",null,"",""]
[{"$f":"Achats!A84","v":0},{"$f":"Achats!$J84","v":""},"",null,"","","",null,"",""]
[{"$f":"Achats!A85","v":0},{"$f":"Achats!$J85","v":""},"",null,"","","",null,"",""]
[{"$f":"Achats!A86","v":0},{"$f":"Achats!$J86","v":""},"",null,"","","",null,"",""]
[{"$f":"Achats!A87","v":0},{"$f":"Achats!$J87","v":""},"",null,"","","",null,"",""]
[{"$f":"Achats!A88","v":0},{"$f":"Achats!$J88","v":""},"",null,"","","",null,"",""]
[{"$f":"Achats!A89","v":0},{"$f":"Achats!$J89","v":""},"",null,"","","",null,"",""]
[{"$f":"Achats!A90","v":0},{"$f":"Achats!$J90","v":""},"",null,"","","",null,"",""]
[{"$f":"Achats!A91","v":0},{"$f":"Achats!$J91","v":""},"",null,"","","",null,"",""]
[{"$f":"Achats!A92","v":0},{"$f":"Achats!$J92","v":""},"",null,"","","",null,"",""]
[{"$f":"Achats!A93","v":0},{"$f":"Achats!$J93","v":""},"",null,"","","",null,"",""]
[{"$f":"Achats!A94","v":0},{"$f":"Achats!$J94","v":""},"",null,"","","",null,"",""]
[{"$f":"Achats!A95","v":0},{"$f":"Achats!$J95","v":""},"",null,"","","",null,"",""]
[{"$f":"Achats!A96","v":0},{"$f":"Achats!$J96","v":""},"",null,"","","",null,"",""]
[{"$f":"Achats!A97","v":0},{"$f":"Achats!$J97","v":""},"",null,"","","",null,"",""]
[{"$f":"Achats!A98","v":0},{"$f":"Achats!$J98","v":""},"",null,"","","",null,"",""]
[{"$f":"Achats!A99","v":0},{"$f":"Achats!$J99","v":""},"",null,"","","",null,"",""]
[{"$f":"Achats!A100","v":0},{"$f":"Achats!$J100","v":""},"",null,"","","",null,"",""]
[null,{"$f":"Achats!$J101","v":""},"",null,"","","",null,"",""]
[null,{"$f":"Achats!$J102","v":""},"",null,"","","",null,"",""]
[null,{"$f":"Achats!$J103","v":""},"",null,"","","",null,"",""]
[null,{"$f":"Achats!$J104","v":""},"",null,"","","",null,"",""]
[null,{"$f":"Achats!$J105","v":""},"",null,"","","",null,"",""]
[null,{"$f":"Achats!$J106","v":""},"",null,"","","",null,"",""]
[null,{"$f":"Achats!$J107","v":""},"",null,"","","",null,"",""]
[null,{"$f":"Achats!$J108","v":""},"",null,"","","",null,"",""]
[null,{"$f":"Achats!$J109","v":""},"",null,"","","",null,"",""]
[null,{"$f":"Achats!$J110","v":""},"",null,"","","",null,"",""]
[null,{"$f":"Achats!$J111","v":""},"",null,"","","",null,"",""]
[null,{"$f":"Achats!$J112","v":""},"",null,"","","",null,"",""]
[null,{"$f":"Achats!$J113","v":""},"",null,"","","",null,"",""]
[null,{"$f":"Achats!$J114","v":""},"",null,"","","",null,"",""]
[null,{"$f":"Achats!$J115","v":""},"",null,"","","",null,"",""]
[null,{"$f":"Achats!$J116","v":""},"",null,"","","",null,"",""]
[null,{"$f":"Achats!$J117","v":""},"",null,"","","",null,"",""]
[null,{"$f":"Achats!$J118","v":""},"",null,"","","",null,"",""]
[null,{"$f":"Achats!$J119","v":""},"",null,"","","",null,"",""]
[null,{"$f":"Achats!$J120","v":""},"",null,"","","",null,"",""]
[null,{"$f":"Achats!$J121","v":""},"",null,"","","",null,"",""]
[null,{"$f":"Achats!$J122","v":""},"",null,"","","",null,"",""]
[null,{"$f":"Achats!$J123","v":""},"",null,"","","",null,"",""]
[null,{"$f":"Achats!$J124","v":""},"",null,"","","",null,"",""]
[null,{"$f":"Achats!$J125","v":""},"",null,"","","",null,"",""]
[null,{"$f":"Achats!$J126","v":""},"",null,"","","",null,"",""]
[null,{"$f":"Achats!$J127","v":""},"",null,"","","",null,"",""]
[null,{"$f":"Achats!$J128","v":""},"",null,"","","",null,"",""]
[null,{"$f":"Achats!$J129","v":""},"",null,"","","",null,"",""]
[null,{"$f":"Achats!$J130","v":""},"",null,{"$f":"IFERROR(INDEX(A:C,MATCH(ROW()-ROW($E$1),C:C,0),1),\"\")","v":""},"","",null,"",""]
[null,{"$f":"Achats!$J131","v":""},{"$f":"IF(A131>0,COUNTIF($A$2:$A$1000,\"<=\"&$A131),\"\")","v":""},null,"",{"$f":"IFERROR(INDEX($A:$C,MATCH(ROW()-ROW($E$1),C:C,0),2),\"\")","v":""},"",null,{"$f":"IFERROR(IF($F131>0,INDEX($E:$G,MATCH(ROW()-ROW($E$1),$G:$G,0),1),\"\"),\"\")","v":""},""]
[null,{"$f":"Achats!$J132","v":""},"",null,"","",{"$f":"IF($A132>0,$G131+1,\"\")","v":""},null,"",{"$f":"IF(A132<>0,$J131+1,\"\")","v":""}]
[null,{"$f":"Achats!$J133","v":""},"",null,"","","",null,"",""]
[null,{"$f":"Achats!$J134","v":""},"",null,"","","",null,"",""]
[null,{"$f":"Achats!$J135","v":""},"",null,"","","",null,"",""]
[null,{"$f":"Achats!$J136","v":""},"",null,"","","",null,"",""]
[null,{"$f":"Achats!$J137","v":""},"",null,"","","",null,"",""]
[null,{"$f":"Achats!$J138","v":""},"",null,"","","",null,"",""]
[null,{"$f":"Achats!$J139","v":""},"",null,"","","",null,"",""]
[null,{"$f":"Achats!$J140","v":""},"",null,"","","",null,"",""]
[null,{"$f":"Achats!$J141","v":""},"",null,"","","",null,"",""]
[null,{"$f":"Achats!$J142","v":""},"",null,"","","",null,"",""]
[null,{"$f":"Achats!$J143","v":""},"",null,"","","",null,"",""]
[null,{"$f":"Achats!$J144","v":""},"",null,"","","",null,"",""]
[null,{"$f":"Achats!$J145","v":""},"",null,"","","",null,"",""]
[null,{"$f":"Achats!$J146","v":""},"",null,"","","",null,"",""]
[null,{"$f":"Achats!$J147","v":""},"",null,"","","",null,"",""]
[null,{"$f":"Achats!$J148","v":""},"",null,"","","",null,"",""]
[null,{"$f":"Achats!$J149","v":""},"",null,"","","",null,"",""]
[null,{"$f":"Achats!$J150","v":""},"",null,"","","",null,"",""]
[null,{"$f":"Achats!$J151","v":""},"",null,"","","",null,"",""]
[null,{"$f":"Achats!$J152","v":""},"",null,"","","",null,"",""]
[null,{"$f":"Achats!$J153","v":""},"",null,"","","",null,"",""]
[null,{"$f":"Achats!$J154","v":""},"",null,"","","",null,"",""]
[null,{"$f":"Achats!$J155","v":""},"",null,"","","",null,"",""]
[null,{"$f":"Achats!$J156","v":""},"",null,"","","",null,"",""]
[null,{"$f":"Achats!$J157","v":""},"",null,"","","",null,"",""]
[null,{"$f":"Achats!$J158","v":""},"",null,"","","",null,"",""]
[null,{"$f":"Achats!$J159","v":""},"",null,"","","",null,"",""]
[null,{"$f":"Achats!$J160","v":""},"",null,"","","",null,"",""]
[null,{"$f":"Achats!$J161","v":""},"",null,"","","",null,"",""]
[null,{"$f":"Achats!$J162","v":""},"",null,"","","",null,"",""]
[null,{"$f":"Achats!$J163","v":""},"",null,"","","",null,"",""]
[null,{"$f":"Achats!$J164","v":""},"",null,"","","",null,"",""]
[null,{"$f":"Achats!$J165","v":""},"",null,"","","",null,"",""]
[null,{"$f":"Achats!$J166","v":""},"",null,"","","",null,"",""]
[null,{"$f":"Achats!$J167","v":""},"",null,"","","",null,"",""]
[null,{"$f":"Achats!$J168","v":""},"",null,"","","",null,"",""]
[null,{"$f":"Achats!$J169","v":""},"",null,"","","",null,"",""]
[null,{"$f":"Achats!$J170","v":""},"",null,"","","",null,"",""]
[null,{"$f":"Achats!$J171","v":""},"",null,"","","",null,"",""]
[null,{"$f":"Achats!$J172","v":""},"",null,"","","",null,"",""]
[null,{"$f":"Achats!$J173","v":""},"",null,"","","",null,"",""]
[null,{"$f":"Achats!$J174","v":""},"",null,"","","",null,"",""]
[null,{"$f":"Achats!$J175","v":""},"",null,"","","",null,"",""]
[null,{"$f":"Achats!$J176","v":""},"",null,"","","",null,"",""]
[null,{"$f":"Achats!$J177","v":""},"",null,"","","",null,"",""]
[null,{"$f":"Achats!$J178","v":""},"",null,"","","",null,"",""]
[null,{"$f":"Achats!$J179","v":""},"",null,"","","",null,"",""]
[null,{"$f":"Achats!$J180","v":""},"",null,"","","",null,"",""]
[null,{"$f":"Achats!$J181","v":""},"",null,"","","",null,"",""]
[null,{"$f":"Achats!$J182","v":""},"",null,"","","",null,"",""]
[null,{"$f":"Achats!$J183","v":""},"",null,"","","",null,"",""]
[null,{"$f":"Achats!$J184","v":""},"",null,"","","",null,"",""]
[null,{"$f":"Achats!$J185","v":""},"",null,"","","",null,"",""]
[null,{"$f":"Achats!$J186","v":""},"",null,"","","",null,"",""]
[null,{"$f":"Achats!$J187","v":""},"",null,"","","",null,"",""]
[null,{"$f":"Achats!$J188","v":""},"",null,"","","",null,"",""]
[null,{"$f":"Achats!$J189","v":""},"",null,"","","",null,"",""]
[null,{"$f":"Achats!$J190","v":""},"",null,"","","",null,"",""]
[null,{"$f":"Achats!$J191","v":""},"",null,"","","",null,"",""]
[null,{"$f":"Achats!$J192","v":""},"",null,"","","",null,"",""]
[null,{"$f":"Achats!$J193","v":""},"",null,"","","",null,"",""]
[null,{"$f":"Achats!$J194","v":""},"",null,{"$f":"IFERROR(INDEX(A:C,MATCH(ROW()-ROW($E$1),C:C,0),1),\"\")","v":""},"","",null,"",""]
[null,{"$f":"Achats!$J195","v":""},{"$f":"IF(A195>0,COUNTIF($A$2:$A$1000,\"<=\"&$A195),\"\")","v":""},null,"",{"$f":"IFERROR(INDEX($A:$C,MATCH(ROW()-ROW($E$1),C:C,0),2),\"\")","v":""},"",null,{"$f":"IFERROR(IF($F195>0,INDEX($E:$G,MATCH(ROW()-ROW($E$1),$G:$G,0),1),\"\"),\"\")","v":""},""]
[null,{"$f":"Achats!$J196","v":""},"",null,"","",{"$f":"IF($A196>0,$G195+1,\"\")","v":""},null,"",{"$f":"IF(A196<>0,$J195+1,\"\")","v":""}]
[null,{"$f":"Achats!$J197","v":""},"",null,"","","",null,"",""]
[null,{"$f":"Achats!$J198","v":""},"",null,"","","",null,"",""]
[null,{"$f":"Achats!$J199","v":""},"",null,"","","",null,"",""]
[null,{"$f":"Achats!$J200","v":""},"",null,"","","",null,"",""]
[null,{"$f":"Achats!$J201","v":""},"",null,"","","",null,"",""]
[null,{"$f":"Achats!$J202","v":""},"",null,"","","",null,"",""]
[null,{"$f":"Achats!$J203","v":""},"",null,"","","",null,"",""]
[null,{"$f":"Achats!$J204","v":""},"",null,"","","",null,"",""]
[null,{"$f":"Achats!$J205","v":""},"",null,"","","",null,"",""]
[null,{"$f":"Achats!$J206","v":""},"",null,"","","",null,"",""]
[null,{"$f":"Achats!$J207","v":""},"",null,"","","",null,"",""]
[null,{"$f":"Achats!$J208","v":""},"",null,"","","",null,"",""]
[null,{"$f":"Achats!$J209","v":""},"",null,"","","",null,"",""]
[null,{"$f":"Achats!$J210","v":""},"",null,"","","",null,"",""]
[null,{"$f":"Achats!$J211","v":""},"",null,"","","",null,"",""]
[null,{"$f":"Achats!$J212","v":""},"",null,"","","",null,"",""]
[null,{"$f":"Achats!$J213","v":""},"",null,"","","",null,"",""]
[null,{"$f":"Achats!$J214","v":""},"",null,"","","",null,"",""]
[null,{"$f":"Achats!$J215","v":""},"",null,"","","",null,"",""]
[null,{"$f":"Achats!$J216","v":""},"",null,"","","",null,"",""]
[null,{"$f":"Achats!$J217","v":""},"",null,"","","",null,"",""]
[null,{"$f":"Achats!$J218","v":""},"",null,"","","",null,"",""]
[null,{"$f":"Achats!$J219","v":""},"",null,"","","",null,"",""]
[null,{"$f":"Achats!$J220","v":""},"",null,"","","",null,"",""]
[null,{"$f":"Achats!$J221","v":""},"",null,"","","",null,"",""]
[null,{"$f":"Achats!$J222","v":""},"",null,"","","",null,"",""]
[null,{"$f":"Achats!$J223","v":""},"",null,"","","",null,"",""]
[null,{"$f":"Achats!$J224","v":""},"",null,"","","",null,"",""]
[null,{"$f":"Achats!$J225","v":""},"",null,"","","",null,"",""]
[null,{"$f":"Achats!$J226","v":""},"",null,"","","",null,"",""]
[null,{"$f":"Achats!$J227","v":""},"",null,"","","",null,"",""]
[null,{"$f":"Achats!$J228","v":""},"",null,"","","",null,"",""]
[null,{"$f":"Achats!$J229","v":""},"",null,"","","",null,"",""]
[null,{"$f":"Achats!$J230","v":""},"",null,"","","",null,"",""]
[null,{"$f":"Achats!$J231","v":""},"",null,"","","",null,"",""]
[null,{"$f":"Achats!$J232","v":""},"",null,"","","",null,"",""]
[null,{"$f":"Achats!$J233","v":""},"",null,"","","",null,"",""]
[null,{"$f":"Achats!$J234","v":""},"",null,"","","",null,"",""]
[null,{"$f":"Achats!$J235","v":""},"",null,"","","",null,"",""]
[null,{"$f":"Achats!$J236","v":""},"",null,"","","",null,"",""]
[null,{"$f":"Achats!$J237","v":""},"",null,"","","",null,"",""]
[null,{"$f":"Achats!$J238","v":""},"",null,"","","",null,"",""]
[null,{"$f":"Achats!$J239","v":""},"",null,"","","",null,"",""]
[null,{"$f":"Achats!$J240","v":""},"",null,"","","",null,"",""]
[null,{"$f":"Achats!$J241","v":""},"",null,"","","",null,"",""]
[null,{"$f":"Achats!$J242","v":""},"",null,"","","",null,"",""]
[null,{"$f":"Achats!$J243","v":""},"",null,"","","",null,"",""]
[null,{"$f":"Achats!$J244","v":""},"",null,"","","",null,"",""]
[null,{"$f":"Achats!$J245","v":""},"",null,"","","",null,"",""]
[null,{"$f":"Achats!$J246","v":""},"",null,"","","",null,"",""]
[null,{"$f":"Achats!$J247","v":""},"",null,"","","",null,"",""]
[null,{"$f":"Achats!$J248","v":""},"",null,"","","",null,"",""]
[null,{"$f":"Achats!$J249","v":""},"",null,"","","",null,"",""]
[null,{"$f":"Achats!$J250","v":""},"",null,"","","",null,"",""]
[null,{"$f":"Achats!$J251","v":""},"",null,"","","",null,"",""]
[null,{"$f":"Achats!$J252","v":""},"",null,"","","",null,"",""]
[null,{"$f":"Achats!$J253","v":""},"",null,"","","",null,"",""]
[null,{"$f":"Achats!$J254","v":""},"",null,"","","",null,"",""]
[null,{"$f":"Achats!$J255","v":""},"",null,"","","",null,"",""]
[null,{"$f":"Achats!$J256","v":""},"",null,"","","",null,"",""]
[null,{"$f":"Achats!$J257","v":""},"",null,"","","",null,"",""]
[null,{"$f":"Achats!$J258","v":""},"",null,{"$f":"IFERROR(INDEX(A:C,MATCH(ROW()-ROW($E$1),C:C,0),1),\"\")","v":""},"","",null,"",""]
[null,{"$f":"Achats!$J259","v":""},{"$f":"IF(A259>0,COUNTIF($A$2:$A$1000,\"<=\"&$A259),\"\")","v":""},null,"",{"$f":"IFERROR(INDEX($A:$C,MATCH(ROW()-ROW($E$1),C:C,0),2),\"\")","v":""},"",null,{"$f":"IFERROR(IF($F259>0,INDEX($E:$G,MATCH(ROW()-ROW($E$1),$G:$G,0),1),\"\"),\"\")","v":""},""]
[null,{"$f":"Achats!$J260","v":""},"",null,"","",{"$f":"IF($A260>0,$G259+1,\"\")","v":""},null,"",{"$f":"IF(A260<>0,$J259+1,\"\")","v":""}]
[null,{"$f":"Achats!$J261","v":""},"",null,"","","",null,"",""]
[null,{"$f":"Achats!$J262","v":""},"",null,"","","",null,"",""]
[null,{"$f":"Achats!$J263","v":""},"",null,"","","",null,"",""]
[null,{"$f":"Achats!$J264","v":""},"",null,"","","",null,"",""]
[null,{"$f":"Achats!$J265","v":""},"",null,"","","",null,"",""]
[null,{"$f":"Achats!$J266","v":""},"",null,"","","",null,"",""]
[null,{"$f":"Achats!$J267","v":""},"",null,"","","",null,"",""]
[null,{"$f":"Achats!$J268","v":""},"",null,"","","",null,"",""]
[null,{"$f":"Achats!$J269","v":""},"",null,"","","",null,"",""]
[null,{"$f":"Achats!$J270","v":""},"",null,"","","",null,"",""]
[null,{"$f":"Achats!$J271","v":""},"",null,"","","",null,"",""]
[null,{"$f":"Achats!$J272","v":""},"",null,"","","",null,"",""]
[null,{"$f":"Achats!$J273","v":""},"",null,"","","",null,"",""]
[null,{"$f":"Achats!$J274","v":""},"",null,"","","",null,"",""]
[null,{"$f":"Achats!$J275","v":""},"",null,"","","",null,"",""]
[null,{"$f":"Achats!$J276","v":""},"",null,"","","",null,"",""]
[null,{"$f":"Achats!$J277","v":""},"",null,"","","",null,"",""]
[null,{"$f":"Achats!$J278","v":""},"",null,"","","",null,"",""]
[null,{"$f":"Achats!$J279","v":""},"",null,"","","",null,"",""]
[null,{"$f":"Achats!$J280","v":""},"",null,"","","",null,"",""]
[null,{"$f":"Achats!$J281","v":""},"",null,"","","",null,"",""]
[null,{"$f":"Achats!$J282","v":""},"",null,"","","",null,"",""]
[null,{"$f":"Achats!$J283","v":""},"",null,"","","",null,"",""]
[null,{"$f":"Achats!$J284","v":""},"",null,"","","",null,"",""]
[null,{"$f":"Achats!$J285","v":""},"",null,"","","",null,"",""]
[null,{"$f":"Achats!$J286","v":""},"",null,"","","",null,"",""]
[null,{"$f":"Achats!$J287","v":""},"",null,"","","",null,"",""]
[null,{"$f":"Achats!$J288","v":""},"",null,"","","",null,"",""]
[null,{"$f":"Achats!$J289","v":""},"",null,"","","",null,"",""]
[null,{"$f":"Achats!$J290","v":""},"",null,"","","",null,"",""]
[null,{"$f":"Achats!$J291","v":""},"",null,"","","",null,"",""]
[null,{"$f":"Achats!$J292","v":""},"",null,"","","",null,"",""]
[null,{"$f":"Achats!$J293","v":""},"",null,"","","",null,"",""]
[null,{"$f":"Achats!$J294","v":""},"",null,"","","",null,"",""]
[null,{"$f":"Achats!$J295","v":""},"",null,"","","",null,"",""]
[null,{"$f":"Achats!$J296","v":""},"",null,"","","",null,"",""]
[null,{"$f":"Achats!$J297","v":""},"",null,"","","",null,"",""]
[null,{"$f":"Achats!$J298","v":""},"",null,"","","",null,"",""]
[null,{"$f":"Achats!$J299","v":""},"",null,"","","",null,"",""]
[null,{"$f":"Achats!$J300","v":""},"",null,"","","",null,"",""]
[null,{"$f":"Achats!$J301","v":""},"",null,"","","",null,"",""]
[null,{"$f":"Achats!$J302","v":""},"",null,"","","",null,"",""]
[null,{"$f":"Achats!$J303","v":""},"",null,"","","",null,"",""]
[null,{"$f":"Achats!$J304","v":""},"",null,"","","",null,"",""]
[null,{"$f":"Achats!$J305","v":""},"",null,"","","",null,"",""]
[null,{"$f":"Achats!$J306","v":""},"",null,"","","",null,"",""]
[null,{"$f":"Achats!$J307","v":""},"",null,"","","",null,"",""]
[null,{"$f":"Achats!$J308","v":""},"",null,"","","",null,"",""]
[null,{"$f":"Achats!$J309","v":""},"",null,"","","",null,"",""]
[null,{"$f":"Achats!$J310","v":""},"",null,"","","",null,"",""]
[null,{"$f":"Achats!$J311","v":""},"",null,"","","",null,"",""]
[null,{"$f":"Achats!$J312","v":""},"",null,"","","",null,"",""]
[null,{"$f":"Achats!$J313","v":""},"",null,"","","",null,"",""]
[null,{"$f":"Achats!$J314","v":""},"",null,"","","",null,"",""]
[null,{"$f":"Achats!$J315","v":""},"",null,"","","",null,"",""]
[null,{"$f":"Achats!$J316","v":""},"",null,"","","",null,"",""]
[null,{"$f":"Achats!$J317","v":""},"",null,"","","",null,"",""]
[null,{"$f":"Achats!$J318","v":""},"",null,"","","",null,"",""]
[null,{"$f":"Achats!$J319","v":""},"",null,"","","",null,"",""]
[null,{"$f":"Achats!$J320","v":""},"",null,"","","",null,"",""]
[null,{"$f":"Achats!$J321","v":""},"",null,"","","",null,"",""]
[null,{"$f":"Achats!$J322","v":""},"",null,{"$f":"IFERROR(INDEX(A:C,MATCH(ROW()-ROW($E$1),C:C,0),1),\"\")","v":""},"","",null,"",""]
[null,{"$f":"Achats!$J323","v":""},{"$f":"IF(A323>0,COUNTIF($A$2:$A$1000,\"<=\"&$A323),\"\")","v":""},null,"",{"$f":"IFERROR(INDEX($A:$C,MATCH(ROW()-ROW($E$1),C:C,0),2),\"\")","v":""},"",null,{"$f":"IFERROR(IF($F323>0,INDEX($E:$G,MATCH(ROW()-ROW($E$1),$G:$G,0),1),\"\"),\"\")","v":""},""]
[null,{"$f":"Achats!$J324","v":""},"",null,"","",{"$f":"IF($A324>0,$G323+1,\"\")","v":""},null,"",{"$f":"IF(A324<>0,$J323+1,\"\")","v":""}]
[null,{"$f":"Achats!$J325","v":""},"",null,"","","",null,"",""]
[null,{"$f":"Achats!$J326","v":""},"",null,"","","",null,"",""]
[null,{"$f":"Achats!$J327","v":""},"",null,"","","",null,"",""]
[null,{"$f":"Achats!$J328","v":""},"",null,"","","",null,"",""]
[null,{"$f":"Achats!$J329","v":""},"",null,"","","",null,"",""]
[null,{"$f":"Achats!$J330","v":""},"",null,"","","",null,"",""]
[null,{"$f":"Achats!$J331","v":""},"",null,"","","",null,"",""]
[null,{"$f":"Achats!$J332","v":""},"",null,"","","",null,"",""]
[null,{"$f":"Achats!$J333","v":""},"",null,"","","",null,"",""]
[null,{"$f":"Achats!$J334","v":""},"",null,"","","",null,"",""]
[null,{"$f":"Achats!$J335","v":""},"",null,"","","",null,"",""]
[null,{"$f":"Achats!$J336","v":""},"",null,"","","",null,"",""]
[null,{"$f":"Achats!$J337","v":""},"",null,"","","",null,"",""]
[null,{"$f":"Achats!$J338","v":""},"",null,"","","",null,"",""]
[null,{"$f":"Achats!$J339","v":""},"",null,"","","",null,"",""]
[null,{"$f":"Achats!$J340","v":""},"",null,"","","",null,"",""]
[null,{"$f":"Achats!$J341","v":""},"",null,"","","",null,"",""]
[null,{"$f":"Achats!$J342","v":""},"",null,"","","",null,"",""]
[null,{"$f":"Achats!$J343","v":""},"",null,"","","",null,"",""]
[null,{"$f":"Achats!$J344","v":""},"",null,"","","",null,"",""]
[null,{"$f":"Achats!$J345","v":""},"",null,"","","",null,"",""]
[null,{"$f":"Achats!$J346","v":""},"",null,"","","",null,"",""]
[null,{"$f":"Achats!$J347","v":""},"",null,"","","",null,"",""]
[null,{"$f":"Achats!$J348","v":""},"",null,"","","",null,"",""]
[null,{"$f":"Achats!$J349","v":""},"",null,"","","",null,"",""]
[null,{"$f":"Achats!$J350","v":""},"",null,"","","",null,"",""]
[null,{"$f":"Achats!$J351","v":""},"",null,"","","",null,"",""]
[null,{"$f":"Achats!$J352","v":""},"",null,"","","",null,"",""]
[null,{"$f":"Achats!$J353","v":""},"",null,"","","",null,"",""]
[null,{"$f":"Achats!$J354","v":""},"",null,"","","",null,"",""]
[null,{"$f":"Achats!$J355","v":""},"",null,"","","",null,"",""]
[null,{"$f":"Achats!$J356","v":""},"",null,"","","",null,"",""]
[null,{"$f":"Achats!$J357","v":""},"",null,"","","",null,"",""]
[null,{"$f":"Achats!$J358","v":""},"",null,"","","",null,"",""]
[null,{"$f":"Achats!$J359","v":""},"",null,"","","",null,"",""]
[null,{"$f":"Achats!$J360","v":""},"",null,"","","",null,"",""]
[null,{"$f":"Achats!$J361","v":""},"",null,"","","",null,"",""]
[null,{"$f":"Achats!$J362","v":""},"",null,"","","",null,"",""]
[null,{"$f":"Achats!$J363","v":""},"",null,"","","",null,"",""]
[null,{"$f":"Achats!$J364","v":""},"",null,"","","",null,"",""]
[null,{"$f":"Achats!$J365","v":""},"",null,"","","",null,"",""]
[null,{"$f":"Achats!$J366","v":""},"",null,"","","",null,"",""]
[null,{"$f":"Achats!$J367","v":""},"",null,"","","",null,"",""]
[null,{"$f":"Achats!$J368","v":""},"",null,"","","",null,"",""]
[null,{"$f":"Achats!$J369","v":""},"",null,"","","",null,"",""]
[null,{"$f":"Achats!$J370","v":""},"",null,"","","",null,"",""]
[null,{"$f":"Achats!$J371","v":""},"",null,"","","",null,"",""]
[null,{"$f":"Achats!$J372","v":""},"",null,"","","",null,"",""]
[null,{"$f":"Achats!$J373","v":""},"",null,"","","",null,"",""]
[null,{"$f":"Achats!$J374","v":""},"",null,"","","",null,"",""]
[null,{"$f":"Achats!$J375","v":""},"",null,"","","",null,"",""]
[null,{"$f":"Achats!$J376","v":""},"",null,"","","",null,"",""]
[null,{"$f":"Achats!$J377","v":""},"",null,"","","",null,"",""]
[null,{"$f":"Achats!$J378","v":""},"",null,"","","",null,"",""]
[null,{"$f":"Achats!$J379","v":""},"",null,"","","",null,"",""]
[null,{"$f":"Achats!$J380","v":""},"",null,"","","",null,"",""]
[null,{"$f":"Achats!$J381","v":""},"",null,"","","",null,"",""]
[null,{"$f":"Achats!$J382","v":""},"",null,"","","",null,"",""]
[null,{"$f":"Achats!$J383","v":""},"",null,"","","",null,"",""]
[null,{"$f":"Achats!$J384","v":""},"",null,"","","",null,"",""]
[null,{"$f":"Achats!$J385","v":""},"",null,"","","",null,"",""]
[null,{"$f":"Achats!$J386","v":""},"",null,{"$f":"IFERROR(INDEX(A:C,MATCH(ROW()-ROW($E$1),C:C,0),1),\"\")","v":""},"","",null,"",""]
[null,{"$f":"Achats!$J387","v":""},{"$f":"IF(A387>0,COUNTIF($A$2:$A$1000,\"<=\"&$A387),\"\")","v":""},null,"",{"$f":"IFERROR(INDEX($A:$C,MATCH(ROW()-ROW($E$1),C:C,0),2),\"\")","v":""},"",null,{"$f":"IFERROR(IF($F387>0,INDEX($E:$G,MATCH(ROW()-ROW($E$1),$G:$G,0),1),\"\"),\"\")","v":""},""]
[null,{"$f":"Achats!$J388","v":""},"",null,"","",{"$f":"IF($A388>0,$G387+1,\"\")","v":""},null,"",{"$f":"IF(A388<>0,$J387+1,\"\")","v":""}]
[null,{"$f":"Achats!$J389","v":""},"",null,"","","",null,"",""]
[null,{"$f":"Achats!$J390","v":""},"",null,"","","",null,"",""]
[null,{"$f":"Achats!$J391","v":""},"",null,"","","",null,"",""]
[null,{"$f":"Achats!$J392","v":""},"",null,"","","",null,"",""]
[null,{"$f":"Achats!$J393","v":""},"",null,"","","",null,"",""]
[null,{"$f":"Achats!$J394","v":""},"",null,"","","",null,"",""]
[null,{"$f":"Achats!$J395","v":""},"",null,"","","",null,"",""]
[null,{"$f":"Achats!$J396","v":""},"",null,"","","",null,"",""]
[null,{"$f":"Achats!$J397","v":""},"",null,"","","",null,"",""]
[null,{"$f":"Achats!$J398","v":""},"",null,"","","",null,"",""]
[null,{"$f":"Achats!$J399","v":""},"",null,"","","",null,"",""]
[null,{"$f":"Achats!$J400","v":""},"",null,"","","",null,"",""]
[null,{"$f":"Achats!$J401","v":""},"",null,"","","",null,"",""]
[null,{"$f":"Achats!$J402","v":""},"",null,"","","",null,"",""]
[null,{"$f":"Achats!$J403","v":""},"",null,"","","",null,"",""]
[null,{"$f":"Achats!$J404","v":""},"",null,"","","",null,"",""]
[null,{"$f":"Achats!$J405","v":""},"",null,"","","",null,"",""]
[null,{"$f":"Achats!$J406","v":""},"",null,"","","",null,"",""]
[null,{"$f":"Achats!$J407","v":""},"",null,"","","",null,"",""]
[null,{"$f":"Achats!$J408","v":""},"",null,"","","",null,"",""]
[null,{"$f":"Achats!$J409","v":""},"",null,"","","",null,"",""]
[null,{"$f":"Achats!$J410","v":""},"",null,"","","",null,"",""]
[null,{"$f":"Achats!$J411","v":""},"",null,"","","",null,"",""]
[null,{"$f":"Achats!$J412","v":""},"",null,"","","",null,"",""]
[null,{"$f":"Achats!$J413","v":""},"",null,"","","",null,"",""]
[null,{"$f":"Achats!$J414","v":""},"",null,"","","",null,"",""]
[null,{"$f":"Achats!$J415","v":""},"",null,"","","",null,"",""]
[null,{"$f":"Achats!$J416","v":""},"",null,"","","",null,"",""]
[null,{"$f":"Achats!$J417","v":""},"",null,"","","",null,"",""]
[null,{"$f":"Achats!$J418","v":""},"",null,"","","",null,"",""]
[null,{"$f":"Achats!$J419","v":""},"",null,"","","",null,"",""]
[null,{"$f":"Achats!$J420","v":""},"",null,"","","",null,"",""]
[null,{"$f":"Achats!$J421","v":""},"",null,"","","",null,"",""]
[null,{"$f":"Achats!$J422","v":""},"",null,"","","",null,"",""]
[null,{"$f":"Achats!$J423","v":""},"",null,"","","",null,"",""]
[null,{"$f":"Achats!$J424","v":""},"",null,"","","",null,"",""]
[null,{"$f":"Achats!$J425","v":""},"",null,"","","",null,"",""]
[null,{"$f":"Achats!$J426","v":""},"",null,"","","",null,"",""]
[null,{"$f":"Achats!$J427","v":""},"",null,"","","",null,"",""]
[null,{"$f":"Achats!$J428","v":""},"",null,"","","",null,"",""]
[null,{"$f":"Achats!$J429","v":""},"",null,"","","",null,"",""]
[null,{"$f":"Achats!$J430","v":""},"",null,"","","",null,"",""]
[null,{"$f":"Achats!$J431","v":""},"",null,"","","",null,"",""]
[null,{"$f":"Achats!$J432","v":""},"",null,"","","",null,"",""]
[null,{"$f":"Achats!$J433","v":""},"",null,"","","",null,"",""]
[null,{"$f":"Achats!$J434","v":""},"",null,"","","",null,"",""]
[null,{"$f":"Achats!$J435","v":""},"",null,"","","",null,"",""]
[null,{"$f":"Achats!$J436","v":""},"",null,"","","",null,"",""]
[null,{"$f":"Achats!$J437","v":""},"",null,"","","",null,"",""]
[null,{"$f":"Achats!$J438","v":""},"",null,"","","",null,"",""]
[null,{"$f":"Achats!$J439","v":""},"",null,"","","",null,"",""]
[null,{"$f":"Achats!$J440","v":""},"",null,"","","",null,"",""]
[null,{"$f":"Achats!$J441","v":""},"",null,"","","",null,"",""]
[null,{"$f":"Achats!$J442","v":""},"",null,"","","",null,"",""]
[null,{"$f":"Achats!$J443","v":""},"",null,"","","",null,"",""]
[null,{"$f":"Achats!$J444","v":""},"",null,"","","",null,"",""]
[null,{"$f":"Achats!$J445","v":""},"",null,"","","",null,"",""]
[null,{"$f":"Achats!$J446","v":""},"",null,"","","",null,"",""]
[null,{"$f":"Achats!$J447","v":""},"",null,"","","",null,"",""]
[null,{"$f":"Achats!$J448","v":""},"",null,"","","",null,"",""]
[null,{"$f":"Achats!$J449","v":""},"",null,"","","",null,"",""]
[null,{"$f":"Achats!$J450","v":""},"",null,{"$f":"IFERROR(INDEX(A:C,MATCH(ROW()-ROW($E$1),C:C,0),1),\"\")","v":""},"","",null,"",""]
[null,{"$f":"Achats!$J451","v":""},{"$f":"IF(A451>0,COUNTIF($A$2:$A$1000,\"<=\"&$A451),\"\")","v":""},null,"",{"$f":"IFERROR(INDEX($A:$C,MATCH(ROW()-ROW($E$1),C:C,0),2),\"\")","v":""},"",null,{"$f":"IFERROR(IF($F451>0,INDEX($E:$G,MATCH(ROW()-ROW($E$1),$G:$G,0),1),\"\"),\"\")","v":""},""]
[null,{"$f":"Achats!$J452","v":""},"",null,"","",{"$f":"IF($A452>0,$G451+1,\"\")","v":""},null,"",{"$f":"IF(A452<>0,$J451+1,\"\")","v":""}]
[null,{"$f":"Achats!$J453","v":""},"",null,"","","",null,"",""]
[null,{"$f":"Achats!$J454","v":""},"",null,"","","",null,"",""]
[null,{"$f":"Achats!$J455","v":""},"",null,"","","",null,"",""]
[null,{"$f":"Achats!$J456","v":""},"",null,"","","",null,"",""]
[null,{"$f":"Achats!$J457","v":""},"",null,"","","",null,"",""]
[null,{"$f":"Achats!$J458","v":""},"",null,"","","",null,"",""]
[null,{"$f":"Achats!$J459","v":""},"",null,"","","",null,"",""]
[null,{"$f":"Achats!$J460","v":""},"",null,"","","",null,"",""]
[null,{"$f":"Achats!$J461","v":""},"",null,"","","",null,"",""]
[null,{"$f":"Achats!$J462","v":""},"",null,"","","",null,"",""]
[null,{"$f":"Achats!$J463","v":""},"",null,"","","",null,"",""]
[null,{"$f":"Achats!$J464","v":""},"",null,"","","",null,"",""]
[null,{"$f":"Achats!$J465","v":""},"",null,"","","",null,"",""]
[null,{"$f":"Achats!$J466","v":""},"",null,"","","",null,"",""]
[null,{"$f":"Achats!$J467","v":""},"",null,"","","",null,"",""]
[null,{"$f":"Achats!$J468","v":""},"",null,"","","",null,"",""]
[null,{"$f":"Achats!$J469","v":""},"",null,"","","",null,"",""]
[null,{"$f":"Achats!$J470","v":""},"",null,"","","",null,"",""]
[null,{"$f":"Achats!$J471","v":""},"",null,"","","",null,"",""]
[null,{"$f":"Achats!$J472","v":""},"",null,"","","",null,"",""]
[null,{"$f":"Achats!$J473","v":""},"",null,"","","",null,"",""]
[null,{"$f":"Achats!$J474","v":""},"",null,"","","",null,"",""]
[null,{"$f":"Achats!$J475","v":""},"",null,"","","",null,"",""]
[null,{"$f":"Achats!$J476","v":""},"",null,"","","",null,"",""]
[null,{"$f":"Achats!$J477","v":""},"",null,"","","",null,"",""]
[null,{"$f":"Achats!$J478","v":""},"",null,"","","",null,"",""]
[null,{"$f":"Achats!$J479","v":""},"",null,"","","",null,"",""]
[null,{"$f":"Achats!$J480","v":""},"",null,"","","",null,"",""]
[null,{"$f":"Achats!$J481","v":""},"",null,"","","",null,"",""]
[null,{"$f":"Achats!$J482","v":""},"",null,"","","",null,"",""]
[null,{"$f":"Achats!$J483","v":""},"",null,"","","",null,"",""]
[null,{"$f":"Achats!$J484","v":""},"",null,"","","",null,"",""]
[null,{"$f":"Achats!$J485","v":""},"",null,"","","",null,"",""]
[null,{"$f":"Achats!$J486","v":""},"",null,"","","",null,"",""]
[null,{"$f":"Achats!$J487","v":""},"",null,"","","",null,"",""]
[null,{"$f":"Achats!$J488","v":""},"",null,"","","",null,"",""]
[null,{"$f":"Achats!$J489","v":""},"",null,"","","",null,"",""]
[null,{"$f":"Achats!$J490","v":""},"",null,"","","",null,"",""]
[null,{"$f":"Achats!$J491","v":""},"",null,"","","",null,"",""]
[null,{"$f":"Achats!$J492","v":""},"",null,"","","",null,"",""]
[null,{"$f":"Achats!$J493","v":""},"",null,"","","",null,"",""]
[null,{"$f":"Achats!$J494","v":""},"",null,"","","",null,"",""]
[null,{"$f":"Achats!$J495","v":""},"",null,"","","",null,"",""]
[null,{"$f":"Achats!$J496","v":""},"",null,"","","",null,"",""]
[null,{"$f":"Achats!$J497","v":""},"",null,"","","",null,"",""]
[null,{"$f":"Achats!$J498","v":""},"",null,"","","",null,"",""]
[null,{"$f":"Achats!$J499","v":""},"",null,"","","",null,"",""]
[null,{"$f":"Achats!$J500","v":""},"",null,"","","",null,"",""]
[null,{"$f":"Achats!$J501","v":""},"",null,"","","",null,"",""]
[null,{"$f":"Achats!$J502","v":""},"",null,"","","",null,"",""]
[null,{"$f":"Achats!$J503","v":""},"",null,"","","",null,"",""]
[null,{"$f":"Achats!$J504","v":""},"",null,"","","",null,"",""]
[null,{"$f":"Achats!$J505","v":""},"",null,"","","",null,"",""]
[null,{"$f":"Achats!$J506","v":""},"",null,"","","",null,"",""]
[null,{"$f":"Achats!$J507","v":""},"",null,"","","",null,"",""]
[null,{"$f":"Achats!$J508","v":""},"",null,"","","",null,"",""]
[null,{"$f":"Achats!$J509","v":""},"",null,"","","",null,"",""]
[null,{"$f":"Achats!$J510","v":""},"",null,"","","",null,"",""]
[null,{"$f":"Achats!$J511","v":""},"",null,"","","",null,"",""]
[null,{"$f":"Achats!$J512","v":""},"",null,"","","",null,"",""]
[null,{"$f":"Achats!$J513","v":""},"",null,"","","",null,"",""]
[null,{"$f":"Achats!$J514","v":""},"",null,{"$f":"IFERROR(INDEX(A:C,MATCH(ROW()-ROW($E$1),C:C,0),1),\"\")","v":""},"","",null,"",""]
[null,{"$f":"Achats!$J515","v":""},{"$f":"IF(A515>0,COUNTIF($A$2:$A$1000,\"<=\"&$A515),\"\")","v":""},null,"",{"$f":"IFERROR(INDEX($A:$C,MATCH(ROW()-ROW($E$1),C:C,0),2),\"\")","v":""},"",null,{"$f":"IFERROR(IF($F515>0,INDEX($E:$G,MATCH(ROW()-ROW($E$1),$G:$G,0),1),\"\"),\"\")","v":""},""]
[null,{"$f":"Achats!$J516","v":""},"",null,"","",{"$f":"IF($A516>0,$G515+1,\"\")","v":""},null,"",{"$f":"IF(A516<>0,$J515+1,\"\")","v":""}]
[null,{"$f":"Achats!$J517","v":""},"",null,"","","",null,"",""]
[null,{"$f":"Achats!$J518","v":""},"",null,"","","",null,"",""]
[null,{"$f":"Achats!$J519","v":""},"",null,"","","",null,"",""]
[null,{"$f":"Achats!$J520","v":""},"",null,"","","",null,"",""]
[null,{"$f":"Achats!$J521","v":""},"",null,"","","",null,"",""]
[null,{"$f":"Achats!$J522","v":""},"",null,"","","",null,"",""]
[null,{"$f":"Achats!$J523","v":""},"",null,"","","",null,"",""]
[null,{"$f":"Achats!$J524","v":""},"",null,"","","",null,"",""]
[null,{"$f":"Achats!$J525","v":""},"",null,"","","",null,"",""]
[null,{"$f":"Achats!$J526","v":""},"",null,"","","",null,"",""]
[null,{"$f":"Achats!$J527","v":""},"",null,"","","",null,"",""]
[null,{"$f":"Achats!$J528","v":""},"",null,"","","",null,"",""]
[null,{"$f":"Achats!$J529","v":""},"",null,"","","",null,"",""]
[null,{"$f":"Achats!$J530","v":""},"",null,"","","",null,"",""]
[null,{"$f":"Achats!$J531","v":""},"",null,"","","",null,"",""]
[null,{"$f":"Achats!$J532","v":""},"",null,"","","",null,"",""]
[null,{"$f":"Achats!$J533","v":""},"",null,"","","",null,"",""]
[null,{"$f":"Achats!$J534","v":""},"",null,"","","",null,"",""]
[null,{"$f":"Achats!$J535","v":""},"",null,"","","",null,"",""]
[null,{"$f":"Achats!$J536","v":""},"",null,"","","",null,"",""]
[null,{"$f":"Achats!$J537","v":""},"",null,"","","",null,"",""]
[null,{"$f":"Achats!$J538","v":""},"",null,"","","",null,"",""]
[null,{"$f":"Achats!$J539","v":""},"",null,"","","",null,"",""]
[null,{"$f":"Achats!$J540","v":""},"",null,"","","",null,"",""]
[null,{"$f":"Achats!$J541","v":""},"",null,"","","",null,"",""]
[null,{"$f":"Achats!$J542","v":""},"",null,"","","",null,"",""]
[null,{"$f":"Achats!$J543","v":""},"",null,"","","",null,"",""]
[null,{"$f":"Achats!$J544","v":""},"",null,"","","",null,"",""]
[null,{"$f":"Achats!$J545","v":""},"",null,"","","",null,"",""]
[null,{"$f":"Achats!$J546","v":""},"",null,"","","",null,"",""]
[null,{"$f":"Achats!$J547","v":""},"",null,"","","",null,"",""]
[null,{"$f":"Achats!$J548","v":""},"",null,"","","",null,"",""]
[null,{"$f":"Achats!$J549","v":""},"",null,"","","",null,"",""]
[null,{"$f":"Achats!$J550","v":""},"",null,"","","",null,"",""]
[null,{"$f":"Achats!$J551","v":""},"",null,"","","",null,"",""]
[null,{"$f":"Achats!$J552","v":""},"",null,"","","",null,"",""]
[null,{"$f":"Achats!$J553","v":""},"",null,"","","",null,"",""]
[null,{"$f":"Achats!$J554","v":""},"",null,"","","",null,"",""]
[null,{"$f":"Achats!$J555","v":""},"",null,"","","",null,"",""]
[null,{"$f":"Achats!$J556","v":""},"",null,"","","",null,"",""]
[null,{"$f":"Achats!$J557","v":""},"",null,"","","",null,"",""]
[null,{"$f":"Achats!$J558","v":""},"",null,"","","",null,"",""]
[null,{"$f":"Achats!$J559","v":""},"",null,"","","",null,"",""]
[null,{"$f":"Achats!$J560","v":""},"",null,"","","",null,"",""]
[null,{"$f":"Achats!$J561","v":""},"",null,"","","",null,"",""]
[null,{"$f":"Achats!$J562","v":""},"",null,"","","",null,"",""]
[null,{"$f":"Achats!$J563","v":""},"",null,"","","",null,"",""]
[null,{"$f":"Achats!$J564","v":""},"",null,"","","",null,"",""]
[null,{"$f":"Achats!$J565","v":""},"",null,"","","",null,"",""]
[null,{"$f":"Achats!$J566","v":""},"",null,"","","",null,"",""]
[null,{"$f":"Achats!$J567","v":""},"",null,"","","",null,"",""]
[null,{"$f":"Achats!$J568","v":""},"",null,"","","",null,"",""]
[null,{"$f":"Achats!$J569","v":""},"",null,"","","",null,"",""]
[null,{"$f":"Achats!$J570","v":""},"",null,"","","",null,"",""]
[null,{"$f":"Achats!$J571","v":""},"",null,"","","",null,"",""]
[null,{"$f":"Achats!$J572","v":""},"",null,"","","",null,"",""]
[null,{"$f":"Achats!$J573","v":""},"",null,"","","",null,"",""]
[null,{"$f":"Achats!$J574","v":""},"",null,"","","",null,"",""]
[null,{"$f":"Achats!$J575","v":""},"",null,"","","",null,"",""]
[null,{"$f":"Achats!$J576","v":""},"",null,"","","",null,"",""]
[null,{"$f":"Achats!$J577","v":""},"",null,"","","",null,"",""]
[null,{"$f":"Achats!$J578","v":""},"",null,{"$f":"IFERROR(INDEX(A:C,MATCH(ROW()-ROW($E$1),C:C,0),1),\"\")","v":""},"","",null,"",""]
[null,{"$f":"Achats!$J579","v":""},{"$f":"IF(A579>0,COUNTIF($A$2:$A$1000,\"<=\"&$A579),\"\")","v":""},null,"",{"$f":"IFERROR(INDEX($A:$C,MATCH(ROW()-ROW($E$1),C:C,0),2),\"\")","v":""},"",null,{"$f":"IFERROR(IF($F579>0,INDEX($E:$G,MATCH(ROW()-ROW($E$1),$G:$G,0),1),\"\"),\"\")","v":""},""]
[null,{"$f":"Achats!$J580","v":""},"",null,"","",{"$f":"IF($A580>0,$G579+1,\"\")","v":""},null,"",{"$f":"IF(A580<>0,$J579+1,\"\")","v":""}]
[null,{"$f":"Achats!$J581","v":""},"",null,"","","",null,"",""]
[null,{"$f":"Achats!$J582","v":""},"",null,"","","",null,"",""]
[null,{"$f":"Achats!$J583","v":""},"",null,"","","",null,"",""]
[null,{"$f":"Achats!$J584","v":""},"",null,"","","",null,"",""]
[null,{"$f":"Achats!$J585","v":""},"",null,"","","",null,"",""]
[null,{"$f":"Achats!$J586","v":""},"",null,"","","",null,"",""]
[null,{"$f":"Achats!$J587","v":""},"",null,"","","",null,"",""]
[null,{"$f":"Achats!$J588","v":""},"",null,"","","",null,"",""]
[null,{"$f":"Achats!$J589","v":""},"",null,"","","",null,"",""]
[null,{"$f":"Achats!$J590","v":""},"",null,"","","",null,"",""]
[null,{"$f":"Achats!$J591","v":""},"",null,"","","",null,"",""]
[null,{"$f":"Achats!$J592","v":""},"",null,"","","",null,"",""]
[null,{"$f":"Achats!$J593","v":""},"",null,"","","",null,"",""]
[null,{"$f":"Achats!$J594","v":""},"",null,"","","",null,"",""]
[null,{"$f":"Achats!$J595","v":""},"",null,"","","",null,"",""]
[null,{"$f":"Achats!$J596","v":""},"",null,"","","",null,"",""]
[null,{"$f":"Achats!$J597","v":""},"",null,"","","",null,"",""]
[null,{"$f":"Achats!$J598","v":""},"",null,"","","",null,"",""]
[null,{"$f":"Achats!$J599","v":""},"",null,"","","",null,"",""]
[null,{"$f":"Achats!$J600","v":""},"",null,"","","",null,"",""]
[null,{"$f":"Achats!$J601","v":""},"",null,"","","",null,"",""]
[null,{"$f":"Achats!$J602","v":""},"",null,"","","",null,"",""]
[null,{"$f":"Achats!$J603","v":""},"",null,"","","",null,"",""]
[null,{"$f":"Achats!$J604","v":""},"",null,"","","",null,"",""]
[null,{"$f":"Achats!$J605","v":""},"",null,"","","",null,"",""]
[null,{"$f":"Achats!$J606","v":""},"",null,"","","",null,"",""]
[null,{"$f":"Achats!$J607","v":""},"",null,"","","",null,"",""]
[null,{"$f":"Achats!$J608","v":""},"",null,"","","",null,"",""]
[null,{"$f":"Achats!$J609","v":""},"",null,"","","",null,"",""]
[null,{"$f":"Achats!$J610","v":""},"",null,"","","",null,"",""]
[null,{"$f":"Achats!$J611","v":""},"",null,"","","",null,"",""]
[null,{"$f":"Achats!$J612","v":""},"",null,"","","",null,"",""]
[null,{"$f":"Achats!$J613","v":""},"",null,"","","",null,"",""]
[null,{"$f":"Achats!$J614","v":""},"",null,"","","",null,"",""]
[null,{"$f":"Achats!$J615","v":""},"",null,"","","",null,"",""]
[null,{"$f":"Achats!$J616","v":""},"",null,"","","",null,"",""]
[null,{"$f":"Achats!$J617","v":""},"",null,"","","",null,"",""]
[null,{"$f":"Achats!$J618","v":""},"",null,"","","",null,"",""]
[null,{"$f":"Achats!$J619","v":""},"",null,"","","",null,"",""]
[null,{"$f":"Achats!$J620","v":""},"",null,"","","",null,"",""]
[null,{"$f":"Achats!$J621","v":""},"",null,"","","",null,"",""]
[null,{"$f":"Achats!$J622","v":""},"",null,"","","",null,"",""]
[null,{"$f":"Achats!$J623","v":""},"",null,"","","",null,"",""]
[null,{"$f":"Achats!$J624","v":""},"",null,"","","",null,"",""]
[null,{"$f":"Achats!$J625","v":""},"",null,"","","",null,"",""]
[null,{"$f":"Achats!$J626","v":""},"",null,"","","",null,"",""]
[null,{"$f":"Achats!$J627","v":""},"",null,"","","",null,"",""]
[null,{"$f":"Achats!$J628","v":""},"",null,"","","",null,"",""]
[null,{"$f":"Achats!$J629","v":""},"",null,"","","",null,"",""]
[null,{"$f":"Achats!$J630","v":""},"",null,"","","",null,"",""]
[null,{"$f":"Achats!$J631","v":""},"",null,"","","",null,"",""]
[null,{"$f":"Achats!$J632","v":""},"",null,"","","",null,"",""]
[null,{"$f":"Achats!$J633","v":""},"",null,"","","",null,"",""]
[null,{"$f":"Achats!$J634","v":""},"",null,"","","",null,"",""]
[null,{"$f":"Achats!$J635","v":""},"",null,"","","",null,"",""]
[null,{"$f":"Achats!$J636","v":""},"",null,"","","",null,"",""]
[null,{"$f":"Achats!$J637","v":""},"",null,"","","",null,"",""]
[null,{"$f":"Achats!$J638","v":""},"",null,"","","",null,"",""]
[null,{"$f":"Achats!$J639","v":""},"",null,"","","",null,"",""]
[null,{"$f":"Achats!$J640","v":""},"",null,"","","",null,"",""]
[null,{"$f":"Achats!$J641","v":""},"",null,"","","",null,"",""]
[null,{"$f":"Achats!$J642","v":""},"",null,{"$f":"IFERROR(INDEX(A:C,MATCH(ROW()-ROW($E$1),C:C,0),1),\"\")","v":""},"","",null,"",""]
[null,{"$f":"Achats!$J643","v":""},{"$f":"IF(A643>0,COUNTIF($A$2:$A$1000,\"<=\"&$A643),\"\")","v":""},null,"",{"$f":"IFERROR(INDEX($A:$C,MATCH(ROW()-ROW($E$1),C:C,0),2),\"\")","v":""},"",null,{"$f":"IFERROR(IF($F643>0,INDEX($E:$G,MATCH(ROW()-ROW($E$1),$G:$G,0),1),\"\"),\"\")","v":""},""]
[null,{"$f":"Achats!$J644","v":""},"",null,"","",{"$f":"IF($A644>0,$G643+1,\"\")","v":""},null,"",{"$f":"IF(A644<>0,$J643+1,\"\")","v":""}]
[null,{"$f":"Achats!$J645","v":""},"",null,"","","",null,"",""]
[null,{"$f":"Achats!$J646","v":""},"",null,"","","",null,"",""]
[null,{"$f":"Achats!$J647","v":""},"",null,"","","",null,"",""]
[null,{"$f":"Achats!$J648","v":""},"",null,"","","",null,"",""]
[null,{"$f":"Achats!$J649","v":""},"",null,"","","",null,"",""]
[null,{"$f":"Achats!$J650","v":""},"",null,"","","",null,"",""]
[null,{"$f":"Achats!$J651","v":""},"",null,"","","",null,"",""]
[null,{"$f":"Achats!$J652","v":""},"",null,"","","",null,"",""]
[null,{"$f":"Achats!$J653","v":""},"",null,"","","",null,"",""]
[null,{"$f":"Achats!$J654","v":""},"",null,"","","",null,"",""]
[null,{"$f":"Achats!$J655","v":""},"",null,"","","",null,"",""]
[null,{"$f":"Achats!$J656","v":""},"",null,"","","",null,"",""]
[null,{"$f":"Achats!$J657","v":""},"",null,"","","",null,"",""]
[null,{"$f":"Achats!$J658","v":""},"",null,"","","",null,"",""]
[null,{"$f":"Achats!$J659","v":""},"",null,"","","",null,"",""]
[null,{"$f":"Achats!$J660","v":""},"",null,"","","",null,"",""]
[null,{"$f":"Achats!$J661","v":""},"",null,"","","",null,"",""]
[null,{"$f":"Achats!$J662","v":""},"",null,"","","",null,"",""]
[null,{"$f":"Achats!$J663","v":""},"",null,"","","",null,"",""]
[null,{"$f":"Achats!$J664","v":""},"",null,"","","",null,"",""]
[null,{"$f":"Achats!$J665","v":""},"",null,"","","",null,"",""]
[null,{"$f":"Achats!$J666","v":""},"",null,"","","",null,"",""]
[null,{"$f":"Achats!$J667","v":""},"",null,"","","",null,"",""]
[null,{"$f":"Achats!$J668","v":""},"",null,"","","",null,"",""]
[null,{"$f":"Achats!$J669","v":""},"",null,"","","",null,"",""]
[null,{"$f":"Achats!$J670","v":""},"",null,"","","",null,"",""]
[null,{"$f":"Achats!$J671","v":""},"",null,"","","",null,"",""]
[null,{"$f":"Achats!$J672","v":""},"",null,"","","",null,"",""]
[null,{"$f":"Achats!$J673","v":""},"",null,"","","",null,"",""]
[null,{"$f":"Achats!$J674","v":""},"",null,"","","",null,"",""]
[null,{"$f":"Achats!$J675","v":""},"",null,"","","",null,"",""]
[null,{"$f":"Achats!$J676","v":""},"",null,"","","",null,"",""]
[null,{"$f":"Achats!$J677","v":""},"",null,"","","",null,"",""]
[null,{"$f":"Achats!$J678","v":""},"",null,"","","",null,"",""]
[null,{"$f":"Achats!$J679","v":""},"",null,"","","",null,"",""]
[null,{"$f":"Achats!$J680","v":""},"",null,"","","",null,"",""]
[null,{"$f":"Achats!$J681","v":""},"",null,"","","",null,"",""]
[null,{"$f":"Achats!$J682","v":""},"",null,"","","",null,"",""]
[null,{"$f":"Achats!$J683","v":""},"",null,"","","",null,"",""]
[null,{"$f":"Achats!$J684","v":""},"",null,"","","",null,"",""]
[null,{"$f":"Achats!$J685","v":""},"",null,"","","",null,"",""]
[null,{"$f":"Achats!$J686","v":""},"",null,"","","",null,"",""]
[null,{"$f":"Achats!$J687","v":""},"",null,"","","",null,"",""]
[null,{"$f":"Achats!$J688","v":""},"",null,"","","",null,"",""]
[null,{"$f":"Achats!$J689","v":""},"",null,"","","",null,"",""]
[null,{"$f":"Achats!$J690","v":""},"",null,"","","",null,"",""]
[null,{"$f":"Achats!$J691","v":""},"",null,"","","",null,"",""]
[null,{"$f":"Achats!$J692","v":""},"",null,"","","",null,"",""]
[null,{"$f":"Achats!$J693","v":""},"",null,"","","",null,"",""]
[null,{"$f":"Achats!$J694","v":""},"",null,"","","",null,"",""]
[null,{"$f":"Achats!$J695","v":""},"",null,"","","",null,"",""]
[null,{"$f":"Achats!$J696","v":""},"",null,"","","",null,"",""]
[null,{"$f":"Achats!$J697","v":""},"",null,"","","",null,"",""]
[null,{"$f":"Achats!$J698","v":""},"",null,"","","",null,"",""]
[null,{"$f":"Achats!$J699","v":""},"",null,"","","",null,"",""]
[null,{"$f":"Achats!$J700","v":""},"",null,"","","",null,"",""]
[null,{"$f":"Achats!$J701","v":""},"",null,"","","",null,"",""]
[null,{"$f":"Achats!$J702","v":""},"",null,"","","",null,"",""]
[null,{"$f":"Achats!$J703","v":""},"",null,"","","",null,"",""]
[null,{"$f":"Achats!$J704","v":""},"",null,"","","",null,"",""]
[null,{"$f":"Achats!$J705","v":""},"",null,"","","",null,"",""]
[null,{"$f":"Achats!$J706","v":""},"",null,{"$f":"IFERROR(INDEX(A:C,MATCH(ROW()-ROW($E$1),C:C,0),1),\"\")","v":""},"","",null,"",""]
[null,{"$f":"Achats!$J707","v":""},{"$f":"IF(A707>0,COUNTIF($A$2:$A$1000,\"<=\"&$A707),\"\")","v":""},null,"",{"$f":"IFERROR(INDEX($A:$C,MATCH(ROW()-ROW($E$1),C:C,0),2),\"\")","v":""},"",null,{"$f":"IFERROR(IF($F707>0,INDEX($E:$G,MATCH(ROW()-ROW($E$1),$G:$G,0),1),\"\"),\"\")","v":""},""]
[null,{"$f":"Achats!$J708","v":""},"",null,"","",{"$f":"IF($A708>0,$G707+1,\"\")","v":""},null,"",{"$f":"IF(A708<>0,$J707+1,\"\")","v":""}]
[null,{"$f":"Achats!$J709","v":""},"",null,"","","",null,"",""]
[null,{"$f":"Achats!$J710","v":""},"",null,"","","",null,"",""]
[null,{"$f":"Achats!$J711","v":""},"",null,"","","",null,"",""]
[null,{"$f":"Achats!$J712","v":""},"",null,"","","",null,"",""]
[null,{"$f":"Achats!$J713","v":""},"",null,"","","",null,"",""]
[null,{"$f":"Achats!$J714","v":""},"",null,"","","",null,"",""]
[null,{"$f":"Achats!$J715","v":""},"",null,"","","",null,"",""]
[null,{"$f":"Achats!$J716","v":""},"",null,"","","",null,"",""]
[null,{"$f":"Achats!$J717","v":""},"",null,"","","",null,"",""]
[null,{"$f":"Achats!$J718","v":""},"",null,"","","",null,"",""]
[null,{"$f":"Achats!$J719","v":""},"",null,"","","",null,"",""]
[null,{"$f":"Achats!$J720","v":""},"",null,"","","",null,"",""]
[null,{"$f":"Achats!$J721","v":""},"",null,"","","",null,"",""]
[null,{"$f":"Achats!$J722","v":""},"",null,"","","",null,"",""]
[null,{"$f":"Achats!$J723","v":""},"",null,"","","",null,"",""]
[null,{"$f":"Achats!$J724","v":""},"",null,"","","",null,"",""]
[null,{"$f":"Achats!$J725","v":""},"",null,"","","",null,"",""]
[null,{"$f":"Achats!$J726","v":""},"",null,"","","",null,"",""]
[null,{"$f":"Achats!$J727","v":""},"",null,"","","",null,"",""]
[null,{"$f":"Achats!$J728","v":""},"",null,"","","",null,"",""]
[null,{"$f":"Achats!$J729","v":""},"",null,"","","",null,"",""]
[null,{"$f":"Achats!$J730","v":""},"",null,"","","",null,"",""]
[null,{"$f":"Achats!$J731","v":""},"",null,"","","",null,"",""]
[null,{"$f":"Achats!$J732","v":""},"",null,"","","",null,"",""]
[null,{"$f":"Achats!$J733","v":""},"",null,"","","",null,"",""]
[null,{"$f":"Achats!$J734","v":""},"",null,"","","",null,"",""]
[null,{"$f":"Achats!$J735","v":""},"",null,"","","",null,"",""]
[null,{"$f":"Achats!$J736","v":""},"",null,"","","",null,"",""]
[null,{"$f":"Achats!$J737","v":""},"",null,"","","",null,"",""]
[null,{"$f":"Achats!$J738","v":""},"",null,"","","",null,"",""]
[null,{"$f":"Achats!$J739","v":""},"",null,"","","",null,"",""]
[null,{"$f":"Achats!$J740","v":""},"",null,"","","",null,"",""]
[null,{"$f":"Achats!$J741","v":""},"",null,"","","",null,"",""]
[null,{"$f":"Achats!$J742","v":""},"",null,"","","",null,"",""]
[null,{"$f":"Achats!$J743","v":""},"",null,"","","",null,"",""]
[null,{"$f":"Achats!$J744","v":""},"",null,"","","",null,"",""]
[null,{"$f":"Achats!$J745","v":""},"",null,"","","",null,"",""]
[null,{"$f":"Achats!$J746","v":""},"",null,"","","",null,"",""]
[null,{"$f":"Achats!$J747","v":""},"",null,"","","",null,"",""]
[null,{"$f":"Achats!$J748","v":""},"",null,"","","",null,"",""]
[null,{"$f":"Achats!$J749","v":""},"",null,"","","",null,"",""]
[null,{"$f":"Achats!$J750","v":""},"",null,"","","",null,"",""]
[null,{"$f":"Achats!$J751","v":""},"",null,"","","",null,"",""]
[null,{"$f":"Achats!$J752","v":""},"",null,"","","",null,"",""]
[null,{"$f":"Achats!$J753","v":""},"",null,"","","",null,"",""]
[null,{"$f":"Achats!$J754","v":""},"",null,"","","",null,"",""]
[null,{"$f":"Achats!$J755","v":""},"",null,"","","",null,"",""]
[null,{"$f":"Achats!$J756","v":""},"",null,"","","",null,"",""]
[null,{"$f":"Achats!$J757","v":""},"",null,"","","",null,"",""]
[null,{"$f":"Achats!$J758","v":""},"",null,"","","",null,"",""]
[null,{"$f":"Achats!$J759","v":""},"",null,"","","",null,"",""]
[null,{"$f":"Achats!$J760","v":""},"",null,"","","",null,"",""]
[null,{"$f":"Achats!$J761","v":""},"",null,"","","",null,"",""]
[null,{"$f":"Achats!$J762","v":""},"",null,"","","",null,"",""]
[null,{"$f":"Achats!$J763","v":""},"",null,"","","",null,"",""]
[null,{"$f":"Achats!$J764","v":""},"",null,"","","",null,"",""]
[null,{"$f":"Achats!$J765","v":""},"",null,"","","",null,"",""]
[null,{"$f":"Achats!$J766","v":""},"",null,"","","",null,"",""]
[null,{"$f":"Achats!$J767","v":""},"",null,"","","",null,"",""]
[null,{"$f":"Achats!$J768","v":""},"",null,"","","",null,"",""]
[null,{"$f":"Achats!$J769","v":""},"",null,"","","",null,"",""]
[null,{"$f":"Achats!$J770","v":""},"",null,{"$f":"IFERROR(INDEX(A:C,MATCH(ROW()-ROW($E$1),C:C,0),1),\"\")","v":""},"","",null,"",""]
[null,{"$f":"Achats!$J771","v":""},{"$f":"IF(A771>0,COUNTIF($A$2:$A$1000,\"<=\"&$A771),\"\")","v":""},null,"",{"$f":"IFERROR(INDEX($A:$C,MATCH(ROW()-ROW($E$1),C:C,0),2),\"\")","v":""},"",null,{"$f":"IFERROR(IF($F771>0,INDEX($E:$G,MATCH(ROW()-ROW($E$1),$G:$G,0),1),\"\"),\"\")","v":""},""]
[null,{"$f":"Achats!$J772","v":""},"",null,"","",{"$f":"IF($A772>0,$G771+1,\"\")","v":""},null,"",{"$f":"IF(A772<>0,$J771+1,\"\")","v":""}]
[null,{"$f":"Achats!$J773","v":""},"",null,"","","",null,"",""]
[null,{"$f":"Achats!$J774","v":""},"",null,"","","",null,"",""]
[null,{"$f":"Achats!$J775","v":""},"",null,"","","",null,"",""]
[null,{"$f":"Achats!$J776","v":""},"",null,"","","",null,"",""]
[null,{"$f":"Achats!$J777","v":""},"",null,"","","",null,"",""]
[null,{"$f":"Achats!$J778","v":""},"",null,"","","",null,"",""]
[null,{"$f":"Achats!$J779","v":""},"",null,"","","",null,"",""]
[null,{"$f":"Achats!$J780","v":""},"",null,"","","",null,"",""]
[null,{"$f":"Achats!$J781","v":""},"",null,"","","",null,"",""]
[null,{"$f":"Achats!$J782","v":""},"",null,"","","",null,"",""]
[null,{"$f":"Achats!$J783","v":""},"",null,"","","",null,"",""]
[null,{"$f":"Achats!$J784","v":""},"",null,"","","",null,"",""]
[null,{"$f":"Achats!$J785","v":""},"",null,"","","",null,"",""]
[null,{"$f":"Achats!$J786","v":""},"",null,"","","",null,"",""]
[null,{"$f":"Achats!$J787","v":""},"",null,"","","",null,"",""]
[null,{"$f":"Achats!$J788","v":""},"",null,"","","",null,"",""]
[null,{"$f":"Achats!$J789","v":""},"",null,"","","",null,"",""]
[null,{"$f":"Achats!$J790","v":""},"",null,"","","",null,"",""]
[null,{"$f":"Achats!$J791","v":""},"",null,"","","",null,"",""]
[null,{"$f":"Achats!$J792","v":""},"",null,"","","",null,"",""]
[null,{"$f":"Achats!$J793","v":""},"",null,"","","",null,"",""]
[null,{"$f":"Achats!$J794","v":""},"",null,"","","",null,"",""]
[null,{"$f":"Achats!$J795","v":""},"",null,"","","",null,"",""]
[null,{"$f":"Achats!$J796","v":""},"",null,"","","",null,"",""]
[null,{"$f":"Achats!$J797","v":""},"",null,"","","",null,"",""]
[null,{"$f":"Achats!$J798","v":""},"",null,"","","",null,"",""]
[null,{"$f":"Achats!$J799","v":""},"",null,"","","",null,"",""]
[null,{"$f":"Achats!$J800","v":""},"",null,"","","",null,"",""]
[null,{"$f":"Achats!$J801","v":""},"",null,"","","",null,"",""]
[null,{"$f":"Achats!$J802","v":""},"",null,"","","",null,"",""]
[null,{"$f":"Achats!$J803","v":""},"",null,"","","",null,"",""]
[null,{"$f":"Achats!$J804","v":""},"",null,"","","",null,"",""]
[null,{"$f":"Achats!$J805","v":""},"",null,"","","",null,"",""]
[null,{"$f":"Achats!$J806","v":""},"",null,"","","",null,"",""]
[null,{"$f":"Achats!$J807","v":""},"",null,"","","",null,"",""]
[null,{"$f":"Achats!$J808","v":""},"",null,"","","",null,"",""]
[null,{"$f":"Achats!$J809","v":""},"",null,"","","",null,"",""]
[null,{"$f":"Achats!$J810","v":""},"",null,"","","",null,"",""]
[null,{"$f":"Achats!$J811","v":""},"",null,"","","",null,"",""]
[null,{"$f":"Achats!$J812","v":""},"",null,"","","",null,"",""]
[null,{"$f":"Achats!$J813","v":""},"",null,"","","",null,"",""]
[null,{"$f":"Achats!$J814","v":""},"",null,"","","",null,"",""]
[null,{"$f":"Achats!$J815","v":""},"",null,"","","",null,"",""]
[null,{"$f":"Achats!$J816","v":""},"",null,"","","",null,"",""]
[null,{"$f":"Achats!$J817","v":""},"",null,"","","",null,"",""]
[null,{"$f":"Achats!$J818","v":""},"",null,"","","",null,"",""]
[null,{"$f":"Achats!$J819","v":""},"",null,"","","",null,"",""]
[null,{"$f":"Achats!$J820","v":""},"",null,"","","",null,"",""]
[null,{"$f":"Achats!$J821","v":""},"",null,"","","",null,"",""]
[null,{"$f":"Achats!$J822","v":""},"",null,"","","",null,"",""]
[null,{"$f":"Achats!$J823","v":""},"",null,"","","",null,"",""]
[null,{"$f":"Achats!$J824","v":""},"",null,"","","",null,"",""]
[null,{"$f":"Achats!$J825","v":""},"",null,"","","",null,"",""]
[null,{"$f":"Achats!$J826","v":""},"",null,"","","",null,"",""]
[null,{"$f":"Achats!$J827","v":""},"",null,"","","",null,"",""]
[null,{"$f":"Achats!$J828","v":""},"",null,"","","",null,"",""]
[null,{"$f":"Achats!$J829","v":""},"",null,"","","",null,"",""]
[null,{"$f":"Achats!$J830","v":""},"",null,"","","",null,"",""]
[null,{"$f":"Achats!$J831","v":""},"",null,"","","",null,"",""]
[null,{"$f":"Achats!$J832","v":""},"",null,"","","",null,"",""]
[null,{"$f":"Achats!$J833","v":""},"",null,"","","",null,"",""]
[null,{"$f":"Achats!$J834","v":""},"",null,{"$f":"IFERROR(INDEX(A:C,MATCH(ROW()-ROW($E$1),C:C,0),1),\"\")","v":""},"","",null,"",""]
[null,{"$f":"Achats!$J835","v":""},{"$f":"IF(A835>0,COUNTIF($A$2:$A$1000,\"<=\"&$A835),\"\")","v":""},null,"",{"$f":"IFERROR(INDEX($A:$C,MATCH(ROW()-ROW($E$1),C:C,0),2),\"\")","v":""},"",null,{"$f":"IFERROR(IF($F835>0,INDEX($E:$G,MATCH(ROW()-ROW($E$1),$G:$G,0),1),\"\"),\"\")","v":""},""]
[null,{"$f":"Achats!$J836","v":""},"",null,"","",{"$f":"IF($A836>0,$G835+1,\"\")","v":""},null,"",{"$f":"IF(A836<>0,$J835+1,\"\")","v":""}]
[null,{"$f":"Achats!$J837","v":""},"",null,"","","",null,"",""]
[null,{"$f":"Achats!$J838","v":""},"",null,"","","",null,"",""]
[null,{"$f":"Achats!$J839","v":""},"",null,"","","",null,"",""]
[null,{"$f":"Achats!$J840","v":""},"",null,"","","",null,"",""]
[null,{"$f":"Achats!$J841","v":""},"",null,"","","",null,"",""]
[null,{"$f":"Achats!$J842","v":""},"",null,"","","",null,"",""]
[null,{"$f":"Achats!$J843","v":""},"",null,"","","",null,"",""]
[null,{"$f":"Achats!$J844","v":""},"",null,"","","",null,"",""]
[null,{"$f":"Achats!$J845","v":""},"",null,"","","",null,"",""]
[null,{"$f":"Achats!$J846","v":""},"",null,"","","",null,"",""]
[null,{"$f":"Achats!$J847","v":""},"",null,"","","",null,"",""]
[null,{"$f":"Achats!$J848","v":""},"",null,"","","",null,"",""]
[null,{"$f":"Achats!$J849","v":""},"",null,"","","",null,"",""]
[null,{"$f":"Achats!$J850","v":""},"",null,"","","",null,"",""]
[null,{"$f":"Achats!$J851","v":""},"",null,"","","",null,"",""]
[null,{"$f":"Achats!$J852","v":""},"",null,"","","",null,"",""]
[null,{"$f":"Achats!$J853","v":""},"",null,"","","",null,"",""]
[null,{"$f":"Achats!$J854","v":""},"",null,"","","",null,"",""]
[null,{"$f":"Achats!$J855","v":""},"",null,"","","",null,"",""]
[null,{"$f":"Achats!$J856","v":""},"",null,"","","",null,"",""]
[null,{"$f":"Achats!$J857","v":""},"",null,"","","",null,"",""]
[null,{"$f":"Achats!$J858","v":""},"",null,"","","",null,"",""]
[null,{"$f":"Achats!$J859","v":""},"",null,"","","",null,"",""]
[null,{"$f":"Achats!$J860","v":""},"",null,"","","",null,"",""]
[null,{"$f":"Achats!$J861","v":""},"",null,"","","",null,"",""]
[null,{"$f":"Achats!$J862","v":""},"",null,"","","",null,"",""]
[null,{"$f":"Achats!$J863","v":""},"",null,"","","",null,"",""]
[null,{"$f":"Achats!$J864","v":""},"",null,"","","",null,"",""]
[null,{"$f":"Achats!$J865","v":""},"",null,"","","",null,"",""]
[null,{"$f":"Achats!$J866","v":""},"",null,"","","",null,"",""]
[null,{"$f":"Achats!$J867","v":""},"",null,"","","",null,"",""]
[null,{"$f":"Achats!$J868","v":""},"",null,"","","",null,"",""]
[null,{"$f":"Achats!$J869","v":""},"",null,"","","",null,"",""]
[null,{"$f":"Achats!$J870","v":""},"",null,"","","",null,"",""]
[null,{"$f":"Achats!$J871","v":""},"",null,"","","",null,"",""]
[null,{"$f":"Achats!$J872","v":""},"",null,"","","",null,"",""]
[null,{"$f":"Achats!$J873","v":""},"",null,"","","",null,"",""]
[null,{"$f":"Achats!$J874","v":""},"",null,"","","",null,"",""]
[null,{"$f":"Achats!$J875","v":""},"",null,"","","",null,"",""]
[null,{"$f":"Achats!$J876","v":""},"",null,"","","",null,"",""]
[null,{"$f":"Achats!$J877","v":""},"",null,"","","",null,"",""]
[null,{"$f":"Achats!$J878","v":""},"",null,"","","",null,"",""]
[null,{"$f":"Achats!$J879","v":""},"",null,"","","",null,"",""]
[null,{"$f":"Achats!$J880","v":""},"",null,"","","",null,"",""]
[null,{"$f":"Achats!$J881","v":""},"",null,"","","",null,"",""]
[null,{"$f":"Achats!$J882","v":""},"",null,"","","",null,"",""]
[null,{"$f":"Achats!$J883","v":""},"",null,"","","",null,"",""]
[null,{"$f":"Achats!$J884","v":""},"",null,"","","",null,"",""]
[null,{"$f":"Achats!$J885","v":""},"",null,"","","",null,"",""]
[null,{"$f":"Achats!$J886","v":""},"",null,"","","",null,"",""]
[null,{"$f":"Achats!$J887","v":""},"",null,"","","",null,"",""]
[null,{"$f":"Achats!$J888","v":""},"",null,"","","",null,"",""]
[null,{"$f":"Achats!$J889","v":""},"",null,"","","",null,"",""]
[null,{"$f":"Achats!$J890","v":""},"",null,"","","",null,"",""]
[null,{"$f":"Achats!$J891","v":""},"",null,"","","",null,"",""]
[null,{"$f":"Achats!$J892","v":""},"",null,"","","",null,"",""]
[null,{"$f":"Achats!$J893","v":""},"",null,"","","",null,"",""]
[null,{"$f":"Achats!$J894","v":""},"",null,"","","",null,"",""]
[null,{"$f":"Achats!$J895","v":""},"",null,"","","",null,"",""]
[null,{"$f":"Achats!$J896","v":""},"",null,"","","",null,"",""]
[null,{"$f":"Achats!$J897","v":""},"",null,"","","",null,"",""]
[null,{"$f":"Achats!$J898","v":""},"",null,{"$f":"IFERROR(INDEX(A:C,MATCH(ROW()-ROW($E$1),C:C,0),1),\"\")","v":""},"","",null,"",""]
[null,{"$f":"Achats!$J899","v":""},{"$f":"IF(A899>0,COUNTIF($A$2:$A$1000,\"<=\"&$A899),\"\")","v":""},null,"",{"$f":"IFERROR(INDEX($A:$C,MATCH(ROW()-ROW($E$1),C:C,0),2),\"\")","v":""},"",null,{"$f":"IFERROR(IF($F899>0,INDEX($E:$G,MATCH(ROW()-ROW($E$1),$G:$G,0),1),\"\"),\"\")","v":""},""]
[null,{"$f":"Achats!$J900","v":""},"",null,"","",{"$f":"IF($A900>0,$G899+1,\"\")","v":""},null,"",{"$f":"IF(A900<>0,$J899+1,\"\")","v":""}]
[null,{"$f":"Achats!$J901","v":""},"",null,"","","",null,"",""]
[null,{"$f":"Achats!$J902","v":""},"",null,"","","",null,"",""]
[null,{"$f":"Achats!$J903","v":""},"",null,"","","",null,"",""]
[null,{"$f":"Achats!$J904","v":""},"",null,"","","",null,"",""]
[null,{"$f":"Achats!$J905","v":""},"",null,"","","",null,"",""]
[null,{"$f":"Achats!$J906","v":""},"",null,"","","",null,"",""]
[null,{"$f":"Achats!$J907","v":""},"",null,"","","",null,"",""]
[null,{"$f":"Achats!$J908","v":""},"",null,"","","",null,"",""]
[null,{"$f":"Achats!$J909","v":""},"",null,"","","",null,"",""]
[null,{"$f":"Achats!$J910","v":""},"",null,"","","",null,"",""]
[null,{"$f":"Achats!$J911","v":""},"",null,"","","",null,"",""]
[null,{"$f":"Achats!$J912","v":""},"",null,"","","",null,"",""]
[null,{"$f":"Achats!$J913","v":""},"",null,"","","",null,"",""]
[null,{"$f":"Achats!$J914","v":""},"",null,"","","",null,"",""]
[null,{"$f":"Achats!$J915","v":""},"",null,"","","",null,"",""]
[null,{"$f":"Achats!$J916","v":""},"",null,"","","",null,"",""]
[null,{"$f":"Achats!$J917","v":""},"",null,"","","",null,"",""]
[null,{"$f":"Achats!$J918","v":""},"",null,"","","",null,"",""]
[null,{"$f":"Achats!$J919","v":""},"",null,"","","",null,"",""]
[null,{"$f":"Achats!$J920","v":""},"",null,"","","",null,"",""]
[null,{"$f":"Achats!$J921","v":""},"",null,"","","",null,"",""]
[null,{"$f":"Achats!$J922","v":""},"",null,"","","",null,"",""]
[null,{"$f":"Achats!$J923","v":""},"",null,"","","",null,"",""]
[null,{"$f":"Achats!$J924","v":""},"",null,"","","",null,"",""]
[null,{"$f":"Achats!$J925","v":""},"",null,"","","",null,"",""]
[null,{"$f":"Achats!$J926","v":""},"",null,"","","",null,"",""]
[null,{"$f":"Achats!$J927","v":""},"",null,"","","",null,"",""]
[null,{"$f":"Achats!$J928","v":""},"",null,"","","",null,"",""]
[null,{"$f":"Achats!$J929","v":""},"",null,"","","",null,"",""]
[null,{"$f":"Achats!$J930","v":""},"",null,"","","",null,"",""]
[null,{"$f":"Achats!$J931","v":""},"",null,"","","",null,"",""]
[null,{"$f":"Achats!$J932","v":""},"",null,"","","",null,"",""]
[null,{"$f":"Achats!$J933","v":""},"",null,"","","",null,"",""]
[null,{"$f":"Achats!$J934","v":""},"",null,"","","",null,"",""]
[null,{"$f":"Achats!$J935","v":""},"",null,"","","",null,"",""]
[null,{"$f":"Achats!$J936","v":""},"",null,"","","",null,"",""]
[null,{"$f":"Achats!$J937","v":""},"",null,"","","",null,"",""]
[null,{"$f":"Achats!$J938","v":""},"",null,"","","",null,"",""]
[null,{"$f":"Achats!$J939","v":""},"",null,"","","",null,"",""]
[null,{"$f":"Achats!$J940","v":""},"",null,"","","",null,"",""]
[null,{"$f":"Achats!$J941","v":""},"",null,"","","",null,"",""]
[null,{"$f":"Achats!$J942","v":""},"",null,"","","",null,"",""]
[null,{"$f":"Achats!$J943","v":""},"",null,"","","",null,"",""]
[null,{"$f":"Achats!$J944","v":""},"",null,"","","",null,"",""]
[null,{"$f":"Achats!$J945","v":""},"",null,"","","",null,"",""]
[null,{"$f":"Achats!$J946","v":""},"",null,"","","",null,"",""]
[null,{"$f":"Achats!$J947","v":""},"",null,"","","",null,"",""]
[null,{"$f":"Achats!$J948","v":""},"",null,"","","",null,"",""]
[null,{"$f":"Achats!$J949","v":""},"",null,"","","",null,"",""]
[null,{"$f":"Achats!$J950","v":""},"",null,"","","",null,"",""]
[null,{"$f":"Achats!$J951","v":""},"",null,"","","",null,"",""]
[null,{"$f":"Achats!$J952","v":""},"",null,"","","",null,"",""]
[null,{"$f":"Achats!$J953","v":""},"",null,"","","",null,"",""]
[null,{"$f":"Achats!$J954","v":""},"",null,"","","",null,"",""]
[null,{"$f":"Achats!$J955","v":""},"",null,"","","",null,"",""]
[null,{"$f":"Achats!$J956","v":""},"",null,"","","",null,"",""]
[null,{"$f":"Achats!$J957","v":""},"",null,"","","",null,"",""]
[null,{"$f":"Achats!$J958","v":""},"",null,"","","",null,"",""]
[null,{"$f":"Achats!$J959","v":""},"",null,"","","",null,"",""]
[null,{"$f":"Achats!$J960","v":""},"",null,"","","",null,"",""]
[null,{"$f":"Achats!$J961","v":""},"",null,"","","",null,"",""]
[null,{"$f":"Achats!$J962","v":""},"",null,{"$f":"IFERROR(INDEX(A:C,MATCH(ROW()-ROW($E$1),C:C,0),1),\"\")","v":""},"","",null,"",""]
[null,{"$f":"Achats!$J963","v":""},{"$f":"IF(A963>0,COUNTIF($A$2:$A$1000,\"<=\"&$A963),\"\")","v":""},null,"",{"$f":"IFERROR(INDEX($A:$C,MATCH(ROW()-ROW($E$1),C:C,0),2),\"\")","v":""},"",null,{"$f":"IFERROR(IF($F963>0,INDEX($E:$G,MATCH(ROW()-ROW($E$1),$G:$G,0),1),\"\"),\"\")","v":""},""]
[null,{"$f":"Achats!$J964","v":""},"",null,"","",{"$f":"IF($A964>0,$G963+1,\"\")","v":""},null,"",{"$f":"IF(A964<>0,$J963+1,\"\")","v":""}]
[null,{"$f":"Achats!$J965","v":""},"",null,"","","",null,"",""]
[null,{"$f":"Achats!$J966","v":""},"",null,"","","",null,"",""]
[null,{"$f":"Achats!$J967","v":""},"",null,"","","",null,"",""]
[null,{"$f":"Achats!$J968","v":""},"",null,"","","",null,"",""]
[null,{"$f":"Achats!$J969","v":""},"",null,"","","",null,"",""]
[null,{"$f":"Achats!$J970","v":""},"",null,"","","",null,"",""]
[null,{"$f":"Achats!$J971","v":""},"",null,"","","",null,"",""]
[null,{"$f":"Achats!$J972","v":""},"",null,"","","",null,"",""]
[null,{"$f":"Achats!$J973","v":""},"",null,"","","",null,"",""]
[null,{"$f":"Achats!$J974","v":""},"",null,"","","",null,"",""]
[null,{"$f":"Achats!$J975","v":""},"",null,"","","",null,"",""]
[null,{"$f":"Achats!$J976","v":""},"",null,"","","",null,"",""]
[null,{"$f":"Achats!$J977","v":""},"",null,"","","",null,"",""]
[null,{"$f":"Achats!$J978","v":""},"",null,"","","",null,"",""]
[null,{"$f":"Achats!$J979","v":""},"",null,"","","",null,"",""]
[null,{"$f":"Achats!$J980","v":""},"",null,"","","",null,"",""]
[null,{"$f":"Achats!$J981","v":""},"",null,"","","",null,"",""]
[null,{"$f":"Achats!$J982","v":""},"",null,"","","",null,"",""]
[null,{"$f":"Achats!$J983","v":""},"",null,"","","",null,"",""]
[null,{"$f":"Achats!$J984","v":""},"",null,"","","",null,"",""]
[null,{"$f":"Achats!$J985","v":""},"",null,"","","",null,"",""]
[null,{"$f":"Achats!$J986","v":""},"",null,"","","",null,"",""]
[null,{"$f":"Achats!$J987","v":""},"",null,"","","",null,"",""]
[null,{"$f":"Achats!$J988","v":""},"",null,"","","",null,"",""]
[null,{"$f":"Achats!$J989","v":""},"",null,"","","",null,"",""]
[null,{"$f":"Achats!$J990","v":""},"",null,"","","",null,"",""]
[null,{"$f":"Achats!$J991","v":""},"",null,"","","",null,"",""]
[null,{"$f":"Achats!$J992","v":""},"",null,"","","",null,"",""]
[null,{"$f":"Achats!$J993","v":""},"",null,"","","",null,"",""]
[null,{"$f":"Achats!$J994","v":""},"",null,"","","",null,"",""]
[null,{"$f":"Achats!$J995","v":""},"",null,"","","",null,"",""]
[null,{"$f":"Achats!$J996","v":""},"",null,"","","",null,"",""]
[null,{"$f":"Achats!$J997","v":""},"",null,"","","",null,"",""]
[null,{"$f":"Achats!$J998","v":""},"",null,"","","",null,"",""]
[null,{"$f":"Achats!$J999","v":""},"",null,"","","",null,"",""]
[null,{"$f":"Achats!$J1000","v":""},"",null,"","","",null,"",""]

{"sheet":"Tarif","index":4,"n_rows":1000,"n_cols":10,"rows_kept":1000,"cut":false,"hidden":false,"merged":[]}
["DATE","NOM","PRIX TTC","OU",null,"DATE","NOM","OU","PRIX TTC","ORDRE &"]
[{"$f":"INDEX(F:J,MATCH(ROW()-ROW($B$1),J:J,0),1)","v":"2022-07-13"},{"$f":"INDEX(F:J,MATCH(ROW()-ROW($B$1),J:J,0),2)","v":"1664 25cl Intermarché 13/07/22"},{"$f":"INDEX(F:J,MATCH(ROW()-ROW($C$1),J:J,0),4)","v":0.37749999999999995},{"$f":"IFERROR(INDEX(F:J,MATCH(ROW()-ROW($D$1),J:J,0),3),\"\")","v":"Intermarché"},null,"2021-02-12","Absolute Vodka Métro","Métro",14.69,{"$f":"COUNTIF(Vins,\"<=\"&G2)","v":3}]
[{"$f":"IFERROR(INDEX(F:J,MATCH(ROW()-ROW($B$1),J:J,0),1),\"\")","v":"2022-06-18"},"1664 bouteille 25CL par 20 juin 2022",0.55200000000000005,"Métro",null,"2021-02-12","Bayles Métro","Métro",10.57,8]
[{"$f":"IFERROR(INDEX(F:J,MATCH(ROW()-ROW($B$1),J:J,0),1),\"\")","v":"2021-02-12"},"Absolute Vodka Métro",14.69,"Métro",null,"2021-02-12","Botanist Métro","Métro",28.39,12]
["2021-02-19","Anjou Rouge Petit Clocher",8.9,"Joyaux des Vignes",null,"2021-02-19","Anjou Rouge Petit Clocher","Joyaux des Vignes",8.9,4]
["2021-10-05","Auxey-Duresses JADOT métro 05-10-21",14.891999999999999,"Métro",null,"2021-02-19","UBY Bio","Joyaux des Vignes",7.9,80]
["2023-06-09","Baileys 09-06-2023",12.587999999999999,"Métro",null,"2021-02-19","UBY Blanc 5 litres","Joyaux des Vignes",35.9,81]
["2022-06-18","Bayles juin 2022",10.536,"Métro",null,"2021-02-19","UBY Classique Joyaux des Vignes","Joyaux des Vignes",6.6,82]
["2021-02-12","Bayles Métro",10.57,"Métro",null,"2021-02-19","UBY Rosé 5 litres","Joyaux des Vignes",35.9,84]
["2021-10-05","Bayles Métro 05-10-21",10.98,"Métro",null,"2021-03-03","Gin Generous Métro","Métro",25.367999999999999,42]
["2021-05-12","Bayles Métro 12-05",12.6,"Métro",null,"2021-03-03","Pouilly Fuissé Ferret","Métro",23.988,61]
["2021-11-19","Beaujolais Nouveau Trichard 19-11-21",7.25,"Caves de la Rocade",null,"2021-03-03","Rhum Clément 1 litre","Métro",16.283999999999999,68]
["2021-02-12","Botanist Métro",28.39,"Métro",null,"2021-03-03","Ricard 1,5 litre","Métro",25.14,70]
["2021-04-29","Bourgogne Clos du Château Meursault 2018",20.388000000000002,"Métro",null,"2021-04-29","Bourgogne Clos du Château Meursault 2018","Métro",20.388000000000002,13]
["2021-04-29","Chablis Grand Cru Les Preuses 2018",31.8,"Métro",null,"2021-04-29","Chablis Grand Cru Les Preuses 2018","Métro",31.8,14]
["2023-08-30","Champagne Naudé Août 2023",19.149999999999999,"Jean Charles",null,"2021-04-29","Chassagne Montrachet Jadot 2018","Métro",41.988,18]
["2023-07-06","Champagne Tribaut Juillet 2023",19.739999999999998,"Métro",null,"2021-04-29","Château Montlabert 2015","Métro",17.388000000000002,20]
["2019-05-01","Chassagne Montrachet Gagnard 2017",44,"Caves de la Rocade",null,"2021-04-29","Clos René 2015 Métro","Métro",28.788,24]
["2021-04-29","Chassagne Montrachet Jadot 2018",41.988,"Métro",null,"2021-04-29","Côtes de Provence Château Cavalier Rosé","Métro",7.9080000000000004,30]
["2022-04-25","Château La Peyre 2015",20,"Aries",null,"2021-04-29","Crémant de Bourgogne","Caves de la Rocade",9.67,31]
["2021-04-29","Château Montlabert 2015",17.388000000000002,"Métro",null,"2021-04-29","Diplomatico  Métro avril 21","Métro",32.988,35]
["2021-10-08","Château Nénine Métro 08-10-2021",5.7096,"Métro",null,"2021-04-29","Domaine de Terra Vecchia (A Paesana) Bio Rosé 5 litres avril 21","Métro",28.187999999999999,39]
["2023-07-25","Chinon rosé 5L 25-07-2023",27.48,"Métro",null,"2021-04-29","Languedoc Cote des Roses ","Métro",6.8280000000000003,45]
["2020-03-03","Clos René 2015 Caves de la Rocade",49,"Caves de la Rocade",null,"2021-04-29","Macon Lugny 2018 Jadot","Métro",10.068,54]
["2021-04-29","Clos René 2015 Métro",28.788,"Métro",null,"2021-04-29","Meursault du Château 2018","Métro",37.188000000000002,57]
["2021-07-30","Condrieu Pagus Luminis 2019 ",31.89,"Caves de la Rocade",null,"2021-04-29","Meursault Les Tillets 2018","Métro",31.187999999999999,58]
["2021-07-01","Corona 01/07/21",1.284,"Métro",null,"2021-04-29","Pernand Vergelesses Domaine Rollin 2018","Métro",21.588000000000001,59]
["2023-08-07","Corona 07-08-2023",0.65150000000000008,"Carrefour Plomeur",null,"2021-04-29","Puligny Montrachet Les Aubues (JC Bachelet)","Métro",51.588000000000001,64]
["2022-07-09","Corona 09/07/22",1.272,"Métro",null,"2021-04-29","Saint Veran Prestige Lassarat 2018","Métro",11.628,78]
["2022-07-14",{"$f":"IFERROR(INDEX(F:J,MATCH(ROW()-ROW($B$1),J:J,0),2),\"\")","v":"Corona Intermarché Promo 30% 14/07/22"},{"$f":"IFERROR(INDEX(F:J,MATCH(ROW()-ROW($C$1),J:J,0),4),\"\")","v":0.84},"Intermarché",null,"2020-03-03","Clos René 2015 Caves de la Rocade","Caves de la Rocade",49,23]
["2021-04-29","Côtes de Provence Château Cavalier Rosé",7.9080000000000004,"Métro",null,"2019-05-01","Chassagne Montrachet Gagnard 2017","Caves de la Rocade",44,17]
["2021-04-29","Crémant de Bourgogne",9.67,"Caves de la Rocade",null,"2020-12-18","Viré Clessé Quintaine 2017","Domaine (Ronan)",14,88]
["2023-07-25","Crémant de Bourgogne Vignot 25-07-2023",8.3879999999999999,"Métro",null,"2021-05-12","Bayles Métro 12-05","Métro",12.6,10]
["2022-03-13","Crément 2019 Moillard",9.9,{"$f":"IFERROR(INDEX(F:J,MATCH(ROW()-ROW($D$1),J:J,0),3),\"\")","v":"Cave Moillard"},null,"2021-05-12","Uby Classique Métro 12-05","Métro",4.7880000000000003,83]
["2022-03-13","Crément Prestige 2019 Moillard",12.5,"Cave Moillard",null,"2021-05-12","Rosé Languedoc Côtes des Roses Métro","Métro",6.8280000000000003,74]
["2021-04-29","Diplomatico  Métro avril 21",32.988,"Métro",null,"2021-05-12","Lignane Rouge Caves de la Rocade 12-05","Caves de la Rocade",7.95,51]
["2021-06-18","Diplomatico  Métro juin 21",29.687999999999999,"Métro",null,"2021-05-12","Rouge Cerise La Croix Gratiot 12-05","Caves de la Rocade",9.9499999999999993,76]
["2022-06-18","Diplomatico juin 2022",30.564,"Métro",null,"2021-04-23","Liqueur St Germain","Métro",35.89,53]
["2021-10-05","Diplomatico Métro 05-10-21",32.988,"Métro",null,"2021-06-18","Diplomatico  Métro juin 21","Métro",29.687999999999999,36]
["2021-04-29","Domaine de Terra Vecchia (A Paesana) Bio Rosé 5 litres avril 21",28.187999999999999,"Métro",null,"2021-06-18","Domaine de Terra Vecchia (A Paesana) Bio Rosé 5 litres juin 21","Métro",35.988,40]
["2021-06-18","Domaine de Terra Vecchia (A Paesana) Bio Rosé 5 litres juin 21",35.988,"Métro",null,"2021-07-01","Gin Generous Métro 01/07","Métro",25.367999999999999,43]
["2022-05-06","Etoile by Haut Nouchet blanc 2020",12.9,"Domaine Haut Nouchet",null,"2021-07-01","Rhum Clément 1 litre 01/07","Métro",16.283999999999999,69]
["2021-03-03","Gin Generous Métro",25.367999999999999,"Métro",null,"2021-07-01","Corona 01/07/21","Métro",1.284,26]
["2021-07-01","Gin Generous Métro 01/07",25.367999999999999,"Métro",null,"2021-07-10","Lignane blanc 10/07/21","Caves de la Rocade",7.95,49]
["2022-05-06","La Chapelle Haut Nouchet 2016",16.899999999999999,"Domaine Haut Nouchet",null,"2021-07-10","Le Clos du Merle 10/07/21","Caves de la Rocade",6.65,46]
["2021-04-29","Languedoc Cote des Roses ",6.8280000000000003,"Métro",null,"2021-07-30","Condrieu Pagus Luminis 2019 ","Caves de la Rocade",31.89,25]
["2021-07-10","Le Clos du Merle 10/07/21",6.65,"Caves de la Rocade",null,"2021-10-05","Vodka Métro 1L 05-10-21","Métro",20.327999999999999,89]
["2021-11-19","Le Clos du Merle 19/11/21",7.1,"Caves de la Rocade",null,"2021-10-05","Vieille Prune Métro 05-10-21","Métro",21.48,87]
["2021-12-23","Le Clos du Merle 23-12-21",7.1,"Caves de la Rocade",null,"2021-10-05","Diplomatico Métro 05-10-21","Métro",32.988,38]
["2021-07-10","Lignane blanc 10/07/21",7.95,"Caves de la Rocade",null,"2021-10-05","Rhum arrangé Orange 05_10_21","Métro",24.948,66]
["2021-12-23","Lignane blanc 23-12-21",7.95,"Caves de la Rocade",null,"2021-10-05","Bayles Métro 05-10-21","Métro",10.98,9]
["2021-05-12","Lignane Rouge Caves de la Rocade 12-05",7.95,"Caves de la Rocade",null,"2021-10-05","Ricard Métro 1L5 05-10-21","Métro",25.14,72]
["2022-06-18","Liqueur de menthe juin 2022",13.068,"Métro",null,"2021-10-05","St Julien Connétable Talbot 2016","Métro",23.988,79]
["2021-04-23","Liqueur St Germain",35.89,"Métro",null,"2021-10-05","Margaux Sirène de Giscours 2016","Métro",27.108000000000001,55]
["2021-04-29","Macon Lugny 2018 Jadot",10.068,"Métro",null,"2021-10-05","Menetou Salon blanc Métro 05-10-21","Métro",8.8680000000000003,56]
["2021-10-05","Margaux Sirène de Giscours 2016",27.108000000000001,"Métro",null,"2021-10-08","Château Nénine Métro 08-10-2021","Métro",5.7096,21]
["2021-10-05","Menetou Salon blanc Métro 05-10-21",8.8680000000000003,"Métro",null,"2021-10-05","Auxey-Duresses JADOT métro 05-10-21","Métro",14.891999999999999,5]
["2021-04-29","Meursault du Château 2018",37.188000000000002,"Métro",null,"2021-11-19","Le Clos du Merle 19/11/21","Caves de la Rocade",7.1,47]
["2021-04-29","Meursault Les Tillets 2018",31.187999999999999,"Métro",null,"2021-11-19","Beaujolais Nouveau Trichard 19-11-21","Caves de la Rocade",7.25,11]
["2021-04-29","Pernand Vergelesses Domaine Rollin 2018",21.588000000000001,"Métro",null,"2021-12-23","Lignane blanc 23-12-21","Caves de la Rocade",7.95,50]
["2023-07-25","Pic St Loup 25-07-2023",8.1479999999999997,"Métro",null,"2021-12-23","Le Clos du Merle 23-12-21","Caves de la Rocade",7.1,48]
["2021-03-03",{"$f":"IFERROR(INDEX(F:J,MATCH(ROW()-ROW($B$1),J:J,0),2),\"\")","v":"Pouilly Fuissé Ferret"},{"$f":"IFERROR(INDEX(F:J,MATCH(ROW()-ROW($C$1),J:J,0),4),\"\")","v":23.988},"Métro",null,"2022-03-13","Crément 2019 Moillard","Cave Moillard",9.9,33]
["2023-07-25","Préjugés vin blanc 25-07-2023",6.3479999999999999,"Métro",null,"2022-03-13","Crément Prestige 2019 Moillard","Cave Moillard",12.5,34]
["2023-07-25","Prosecco Alberto Torresi 25-07-2023",5.0279999999999996,"Métro",null,"2022-04-25","Château La Peyre 2015","Aries",20,19]
["2021-04-29","Puligny Montrachet Les Aubues (JC Bachelet)",51.588000000000001,"Métro",null,"2022-05-06","La Chapelle Haut Nouchet 2016","Domaine Haut Nouchet",16.899999999999999,44]
["2023-06-09","Rhum ambré 3 Rivières 70 cl",13.704000000000001,{"$f":"IFERROR(INDEX(F:J,MATCH(ROW()-ROW($D$1),J:J,0),3),\"\")","v":"Métro"},null,"2022-05-06","Etoile by Haut Nouchet blanc 2020","Domaine Haut Nouchet",12.9,{"$f":"COUNTIF(Vins,\"<=\"&G66)","v":41}]
["2021-10-05","Rhum arrangé Orange 05_10_21",24.948,"Métro",null,"2022-05-20","S de Schlumberger ","Domaine Schlumberger",12.1,77]
[{"$f":"IFERROR(INDEX(F:J,MATCH(ROW()-ROW($B$1),J:J,0),1),\"\")","v":"2023-06-09"},"Rhum Baie Trésor de Pluie 70 cl",33.744,"Métro",null,"2022-06-18","Diplomatico juin 2022","Métro",30.564,37]
["2021-03-03","Rhum Clément 1 litre",16.283999999999999,"Métro",null,"2022-06-18","Bayles juin 2022","Métro",10.536,7]
["2021-07-01","Rhum Clément 1 litre 01/07",16.283999999999999,"Métro",null,"2022-06-18","Liqueur de menthe juin 2022","Métro",13.068,52]
["2021-03-03","Ricard 1,5 litre",25.14,"Métro",null,"2022-06-18","1664 bouteille 25CL par 20 juin 2022","Métro",0.55200000000000005,2]
["2023-07-25","Ricard 1,5L Métro 25-07-2023",23.064,"Métro",null,"2022-06-18","Rosé Languedoc Côtes des Roses juin 2022","Métro",7.1879999999999997,73]
["2021-10-05","Ricard Métro 1L5 05-10-21",25.14,"Métro",null,"2022-07-09","Vodka Métro 70cl 09-07-22","Métro",15.096,90]
["2022-06-18","Rosé Languedoc Côtes des Roses juin 2022",7.1879999999999997,"Métro",null,"2022-07-09","Rosé Languedoc Côtes des Roses Métro Magnum 09-07-22","Métro",15.348000000000001,75]
["2021-05-12","Rosé Languedoc Côtes des Roses Métro",6.8280000000000003,"Métro",null,"2022-07-09","Corona 09/07/22","Métro",1.272,28]
["2022-07-09","Rosé Languedoc Côtes des Roses Métro Magnum 09-07-22",15.348000000000001,"Métro",null,"2022-07-13","1664 25cl Intermarché 13/07/22","Intermarché",{"$f":"(25.9-7.78)/48","v":0.37749999999999995},1]
["2021-05-12","Rouge Cerise La Croix Gratiot 12-05",9.9499999999999993,"Caves de la Rocade",null,"2022-07-14","Corona Intermarché Promo 30% 14/07/22","Intermarché",0.84,29]
["2022-05-20","S de Schlumberger ",12.1,"Domaine Schlumberger",null,"2023-06-09","Vodka Métro 70cl 09-07-23","Métro",15.384,91]
["2021-04-29","Saint Veran Prestige Lassarat 2018",11.628,"Métro",null,"2023-06-09","Rhum ambré 3 Rivières 70 cl","Métro",13.704000000000001,65]
["2021-10-05","St Julien Connétable Talbot 2016",23.988,"Métro",null,"2023-06-09","Rhum Baie Trésor de Pluie 70 cl","Métro",33.744,67]
["2021-02-19","UBY Bio",7.9,"Joyaux des Vignes",null,"2023-06-09","Baileys 09-06-2023","Métro",12.587999999999999,6]
["2021-02-19","UBY Blanc 5 litres",35.9,"Joyaux des Vignes",null,"2023-06-09","Valrona 55% 3 kg 09-06-2023","Métro",50.935400000000001,85]
["2021-02-19","UBY Classique Joyaux des Vignes",6.6,"Joyaux des Vignes",null,"2023-06-09","Valrona 66% 3 kg 09-06-2023","Métro",63.658700000000003,86]
["2021-05-12","Uby Classique Métro 12-05",4.7880000000000003,"Métro",null,"2023-07-25","Ricard 1,5L Métro 25-07-2023","Métro",23.064,71]
["2021-02-19","UBY Rosé 5 litres",35.9,"Joyaux des Vignes",null,"2023-07-25","Pic St Loup 25-07-2023","Métro",8.1479999999999997,60]
["2023-06-09","Valrona 55% 3 kg 09-06-2023",50.935400000000001,"Métro",null,"2023-07-25","Chinon rosé 5L 25-07-2023","Métro",27.48,22]
["2023-06-09","Valrona 66% 3 kg 09-06-2023",63.658700000000003,"Métro",null,"2023-07-25","Préjugés vin blanc 25-07-2023","Métro",6.3479999999999999,62]
["2021-10-05","Vieille Prune Métro 05-10-21",21.48,"Métro",null,"2023-07-25","Crémant de Bourgogne Vignot 25-07-2023","Métro",8.3879999999999999,32]
["2020-12-18","Viré Clessé Quintaine 2017",14,"Domaine (Ronan)",null,"2023-07-25","Prosecco Alberto Torresi 25-07-2023","Métro",5.0279999999999996,63]
["2021-10-05","Vodka Métro 1L 05-10-21",20.327999999999999,"Métro",null,"2023-08-07","Corona 07-08-2023","Carrefour Plomeur",{"$f":"(19.75-6.72)/20","v":0.65150000000000008},27]
["2022-07-09","Vodka Métro 70cl 09-07-22",15.096,"Métro",null,"2023-08-30","Champagne Naudé Août 2023","Jean Charles",19.149999999999999,15]
["2023-06-09","Vodka Métro 70cl 09-07-23",15.384,"Métro",null,"2023-07-06","Champagne Tribaut Juillet 2023","Métro",19.739999999999998,16]
[{"$f":"IFERROR(INDEX(F:J,MATCH(ROW()-ROW($B$1),J:J,0),1),\"\")","v":""},{"$f":"IFERROR(INDEX(F:J,MATCH(ROW()-ROW($B$1),J:J,0),2),\"\")","v":""},{"$f":"IFERROR(INDEX(F:J,MATCH(ROW()-ROW($C$1),J:J,0),4),\"\")","v":""},{"$f":"IFERROR(INDEX(F:J,MATCH(ROW()-ROW($D$1),J:J,0),3),\"\")","v":""},null,null,null,null,null,0]
["","","","",null,null,null,null,null,0]
["","","","",null,null,null,null,null,0]
["","","","",null,null,null,null,null,0]
["","","","",null,null,null,null,null,0]
["","","","",null,null,null,null,null,0]
["","","","",null,null,null,null,null,0]
["","","","",null,null,null,null,null,0]
["","","","",null,null,null,null,null,0]
["","","","",null,null,null,null,null,0]
["","","","",null,null,null,null,null,0]
["","","","",null,null,null,null,null,0]
["","","","",null,null,null,null,null,0]
["","","","",null,null,null,null,null,0]
["","","","",null,null,null,null,null,0]
["","","","",null,null,null,null,null,0]
["","","","",null,null,null,null,null,0]
["","","","",null,null,null,null,null,0]
["","","","",null,null,null,null,null,0]
["","","","",null,null,null,null,null,0]
["","","","",null,null,null,null,null,0]
["","","","",null,null,null,null,null,0]
["","","","",null,null,null,null,null,0]
["","","","",null,null,null,null,null,0]
["","","","",null,null,null,null,null,0]
["","","","",null,null,null,null,null,0]
["","","","",null,null,null,null,null,0]
["","","","",null,null,null,null,null,0]
["","","","",null,null,null,null,null,0]
["","","","",null,null,null,null,null,0]
["","","","",null,null,null,null,null,0]
["","","","",null,null,null,null,null,0]
["","","","",null,null,null,null,null,0]
["","","","",null,null,null,null,null,0]
["","","","",null,null,null,null,null,0]
["","","","",null,null,null,null,null,0]
["","","","",null,null,null,null,null,0]
["","","","",null,null,null,null,null,{"$f":"COUNTIF(Vins,\"<=\"&G130)","v":0}]
["","","","",null,null,null,null,null,0]
["","","","",null,null,null,null,null,0]
["","","","",null,null,null,null,null,0]
["","","","",null,null,null,null,null,0]
["","","","",null,null,null,null,null,0]
["","","","",null,null,null,null,null,0]
["","","","",null,null,null,null,null,0]
["","","","",null,null,null,null,null,0]
["","","","",null,null,null,null,null,0]
["","","","",null,null,null,null,null,0]
["","","","",null,null,null,null,null,0]
["","","","",null,null,null,null,null,0]
["","","","",null,null,null,null,null,0]
["","","","",null,null,null,null,null,0]
["","","","",null,null,null,null,null,0]
["","","","",null,null,null,null,null,0]
["","","","",null,null,null,null,null,0]
["","","","",null,null,null,null,null,0]
["","","","",null,null,null,null,null,0]
["","","","",null,null,null,null,null,0]
["","","","",null,null,null,null,null,0]
["","","","",null,null,null,null,null,0]
["","","","",null,null,null,null,null,0]
["","","","",null,null,null,null,null,0]
["","","","",null,null,null,null,null,0]
["","","","",null,null,null,null,null,0]
[{"$f":"IFERROR(INDEX(F:J,MATCH(ROW()-ROW($B$1),J:J,0),1),\"\")","v":""},{"$f":"IFERROR(INDEX(F:J,MATCH(ROW()-ROW($B$1),J:J,0),2),\"\")","v":""},{"$f":"IFERROR(INDEX(F:J,MATCH(ROW()-ROW($C$1),J:J,0),4),\"\")","v":""},{"$f":"IFERROR(INDEX(F:J,MATCH(ROW()-ROW($D$1),J:J,0),3),\"\")","v":""},null,null,null,null,null,0]
["","","","",null,null,null,null,null,0]
["","","","",null,null,null,null,null,0]
["","","","",null,null,null,null,null,0]
["","","","",null,null,null,null,null,0]
["","","","",null,null,null,null,null,0]
["","","","",null,null,null,null,null,0]
["","","","",null,null,null,null,null,0]
["","","","",null,null,null,null,null,0]
["","","","",null,null,null,null,null,0]
["","","","",null,null,null,null,null,0]
["","","","",null,null,null,null,null,0]
["","","","",null,null,null,null,null,0]
["","","","",null,null,null,null,null,0]
["","","","",null,null,null,null,null,0]
["","","","",null,null,null,null,null,0]
["","","","",null,null,null,null,null,0]
["","","","",null,null,null,null,null,0]
["","","","",null,null,null,null,null,0]
["","","","",null,null,null,null,null,0]
["","","","",null,null,null,null,null,0]
["","","","",null,null,null,null,null,0]
["","","","",null,null,null,null,null,0]
["","","","",null,null,null,null,null,0]
["","","","",null,null,null,null,null,0]
["","","","",null,null,null,null,null,0]
["","","","",null,null,null,null,null,0]
["","","","",null,null,null,null,null,0]
["","","","",null,null,null,null,null,0]
["","","","",null,null,null,null,null,0]
["","","","",null,null,null,null,null,0]
["","","","",null,null,null,null,null,0]
["","","","",null,null,null,null,null,0]
["","","","",null,null,null,null,null,0]
["","","","",null,null,null,null,null,0]
["","","","",null,null,null,null,null,0]
["","","","",null,null,null,null,null,0]
["","","","",null,null,null,null,null,{"$f":"COUNTIF(Vins,\"<=\"&G194)","v":0}]
["","","","",null,null,null,null,null,0]
["","","","",null,null,null,null,null,0]
["","","","",null,null,null,null,null,0]
["","","","",null,null,null,null,null,0]
["","","","",null,null,null,null,null,0]
["","","","",null,null,null,null,null,0]
["","","","",null,null,null,null,null,0]
["","","","",null,null,null,null,null,0]
["","","","",null,null,null,null,null,0]
["","","","",null,null,null,null,null,0]
["","","","",null,null,null,null,null,0]
["","","","",null,null,null,null,null,0]
["","","","",null,null,null,null,null,0]
["","","","",null,null,null,null,null,0]
["","","","",null,null,null,null,null,0]
["","","","",null,null,null,null,null,0]
["","","","",null,null,null,null,null,0]
["","","","",null,null,null,null,null,0]
["","","","",null,null,null,null,null,0]
["","","","",null,null,null,null,null,0]
["","","","",null,null,null,null,null,0]
["","","","",null,null,null,null,null,0]
["","","","",null,null,null,null,null,0]
["","","","",null,null,null,null,null,0]
["","","","",null,null,null,null,null,0]
["","","","",null,null,null,null,null,0]
[{"$f":"IFERROR(INDEX(F:J,MATCH(ROW()-ROW($B$1),J:J,0),1),\"\")","v":""},{"$f":"IFERROR(INDEX(F:J,MATCH(ROW()-ROW($B$1),J:J,0),2),\"\")","v":""},{"$f":"IFERROR(INDEX(F:J,MATCH(ROW()-ROW($C$1),J:J,0),4),\"\")","v":""},{"$f":"IFERROR(INDEX(F:J,MATCH(ROW()-ROW($D$1),J:J,0),3),\"\")","v":""},null,null,null,null,null,0]
["","","","",null,null,null,null,null,0]
["","","","",null,null,null,null,null,0]
["","","","",null,null,null,null,null,0]
["","","","",null,null,null,null,null,0]
["","","","",null,null,null,null,null,0]
["","","","",null,null,null,null,null,0]
["","","","",null,null,null,null,null,0]
["","","","",null,null,null,null,null,0]
["","","","",null,null,null,null,null,0]
["","","","",null,null,null,null,null,0]
["","","","",null,null,null,null,null,0]
["","","","",null,null,null,null,null,0]
["","","","",null,null,null,null,null,0]
["","","","",null,null,null,null,null,0]
["","","","",null,null,null,null,null,0]
["","","","",null,null,null,null,null,0]
["","","","",null,null,null,null,null,0]
["","","","",null,null,null,null,null,0]
["","","","",null,null,null,null,null,0]
["","","","",null,null,null,null,null,0]
["","","","",null,null,null,null,null,0]
["","","","",null,null,null,null,null,0]
["","","","",null,null,null,null,null,0]
["","","","",null,null,null,null,null,0]
["","","","",null,null,null,null,null,0]
["","","","",null,null,null,null,null,0]
["","","","",null,null,null,null,null,0]
["","","","",null,null,null,null,null,0]
["","","","",null,null,null,null,null,0]
["","","","",null,null,null,null,null,0]
["","","","",null,null,null,null,null,0]
["","","","",null,null,null,null,null,0]
["","","","",null,null,null,null,null,0]
["","","","",null,null,null,null,null,0]
["","","","",null,null,null,null,null,0]
["","","","",null,null,null,null,null,0]
["","","","",null,null,null,null,null,{"$f":"COUNTIF(Vins,\"<=\"&G258)","v":0}]
["","","","",null,null,null,null,null,0]
["","","","",null,null,null,null,null,0]
["","","","",null,null,null,null,null,0]
["","","","",null,null,null,null,null,0]
["","","","",null,null,null,null,null,0]
["","","","",null,null,null,null,null,0]
["","","","",null,null,null,null,null,0]
["","","","",null,null,null,null,null,0]
["","","","",null,null,null,null,null,0]
["","","","",null,null,null,null,null,0]
["","","","",null,null,null,null,null,0]
["","","","",null,null,null,null,null,0]
["","","","",null,null,null,null,null,0]
["","","","",null,null,null,null,null,0]
["","","","",null,null,null,null,null,0]
["","","","",null,null,null,null,null,0]
["","","","",null,null,null,null,null,0]
["","","","",null,null,null,null,null,0]
["","","","",null,null,null,null,null,0]
["","","","",null,null,null,null,null,0]
["","","","",null,null,null,null,null,0]
["","","","",null,null,null,null,null,0]
["","","","",null,null,null,null,null,0]
["","","","",null,null,null,null,null,0]
["","","","",null,null,null,null,null,0]
["","","","",null,null,null,null,null,0]
[{"$f":"IFERROR(INDEX(F:J,MATCH(ROW()-ROW($B$1),J:J,0),1),\"\")","v":""},{"$f":"IFERROR(INDEX(F:J,MATCH(ROW()-ROW($B$1),J:J,0),2),\"\")","v":""},{"$f":"IFERROR(INDEX(F:J,MATCH(ROW()-ROW($C$1),J:J,0),4),\"\")","v":""},{"$f":"IFERROR(INDEX(F:J,MATCH(ROW()-ROW($D$1),J:J,0),3),\"\")","v":""},null,null,null,null,null,0]
["","","","",null,null,null,null,null,0]
["","","","",null,null,null,null,null,0]
["","","","",null,null,null,null,null,0]
["","","","",null,null,null,null,null,0]
["","","","",null,null,null,null,null,0]
["","","","",null,null,null,null,null,0]
["","","","",null,null,null,null,null,0]
["","","","",null,null,null,null,null,0]
["","","","",null,null,null,null,null,0]
["","","","",null,null,null,null,null,0]
["","","","",null,null,null,null,null,0]
["","","","",null,null,null,null,null,0]
["","","","",null,null,null,null,null,0]
["","","","",null,null,null,null,null,0]
["","","","",null,null,null,null,null,0]
["","","","",null,null,null,null,null,0]
["","","","",null,null,null,null,null,0]
["","","","",null,null,null,null,null,0]
["","","","",null,null,null,null,null,0]
["","","","",null,null,null,null,null,0]
["","","","",null,null,null,null,null,0]
["","","","",null,null,null,null,null,0]
["","","","",null,null,null,null,null,0]
["","","","",null,null,null,null,null,0]
["","","","",null,null,null,null,null,0]
["","","","",null,null,null,null,null,0]
["","","","",null,null,null,null,null,0]
["","","","",null,null,null,null,null,0]
["","","","",null,null,null,null,null,0]
["","","","",null,null,null,null,null,0]
["","","","",null,null,null,null,null,0]
["","","","",null,null,null,null,null,0]
["","","","",null,null,null,null,null,0]
["","","","",null,null,null,null,null,0]
["","","","",null,null,null,null,null,0]
["","","","",null,null,null,null,null,0]
["","","","",null,null,null,null,null,{"$f":"COUNTIF(Vins,\"<=\"&G322)","v":0}]
["","","","",null,null,null,null,null,0]
["","","","",null,null,null,null,null,0]
["","","","",null,null,null,null,null,0]
["","","","",null,null,null,null,null,0]
["","","","",null,null,null,null,null,0]
["","","","",null,null,null,null,null,0]
["","","","",null,null,null,null,null,0]
["","","","",null,null,null,null,null,0]
["","","","",null,null,null,null,null,0]
["","","","",null,null,null,null,null,0]
["","","","",null,null,null,null,null,0]
["","","","",null,null,null,null,null,0]
["","","","",null,null,null,null,null,0]
["","","","",null,null,null,null,null,0]
["","","","",null,null,null,null,null,0]
["","","","",null,null,null,null,null,0]
["","","","",null,null,null,null,null,0]
["","","","",null,null,null,null,null,0]
["","","","",null,null,null,null,null,0]
["","","","",null,null,null,null,null,0]
["","","","",null,null,null,null,null,0]
["","","","",null,null,null,null,null,0]
["","","","",null,null,null,null,null,0]
["","","","",null,null,null,null,null,0]
["","","","",null,null,null,null,null,0]
["","","","",null,null,null,null,null,0]
[{"$f":"IFERROR(INDEX(F:J,MATCH(ROW()-ROW($B$1),J:J,0),1),\"\")","v":""},{"$f":"IFERROR(INDEX(F:J,MATCH(ROW()-ROW($B$1),J:J,0),2),\"\")","v":""},{"$f":"IFERROR(INDEX(F:J,MATCH(ROW()-ROW($C$1),J:J,0),4),\"\")","v":""},{"$f":"IFERROR(INDEX(F:J,MATCH(ROW()-ROW($D$1),J:J,0),3),\"\")","v":""},null,null,null,null,null,0]
["","","","",null,null,null,null,null,0]
["","","","",null,null,null,null,null,0]
["","","","",null,null,null,null,null,0]
["","","","",null,null,null,null,null,0]
["","","","",null,null,null,null,null,0]
["","","","",null,null,null,null,null,0]
["","","","",null,null,null,null,null,0]
["","","","",null,null,null,null,null,0]
["","","","",null,null,null,null,null,0]
["","","","",null,null,null,null,null,0]
["","","","",null,null,null,null,null,0]
["","","","",null,null,null,null,null,0]
["","","","",null,null,null,null,null,0]
["","","","",null,null,null,null,null,0]
["","","","",null,null,null,null,null,0]
["","","","",null,null,null,null,null,0]
["","","","",null,null,null,null,null,0]
["","","","",null,null,null,null,null,0]
["","","","",null,null,null,null,null,0]
["","","","",null,null,null,null,null,0]
["","","","",null,null,null,null,null,0]
["","","","",null,null,null,null,null,0]
["","","","",null,null,null,null,null,0]
["","","","",null,null,null,null,null,0]
["","","","",null,null,null,null,null,0]
["","","","",null,null,null,null,null,0]
["","","","",null,null,null,null,null,0]
["","","","",null,null,null,null,null,0]
["","","","",null,null,null,null,null,0]
["","","","",null,null,null,null,null,0]
["","","","",null,null,null,null,null,0]
["","","","",null,null,null,null,null,0]
["","","","",null,null,null,null,null,0]
["","","","",null,null,null,null,null,0]
["","","","",null,null,null,null,null,0]
["","","","",null,null,null,null,null,0]
["","","","",null,null,null,null,null,{"$f":"COUNTIF(Vins,\"<=\"&G386)","v":0}]
["","","","",null,null,null,null,null,0]
["","","","",null,null,null,null,null,0]
["","","","",null,null,null,null,null,0]
["","","","",null,null,null,null,null,0]
["","","","",null,null,null,null,null,0]
["","","","",null,null,null,null,null,0]
["","","","",null,null,null,null,null,0]
["","","","",null,null,null,null,null,0]
["","","","",null,null,null,null,null,0]
["","","","",null,null,null,null,null,0]
["","","","",null,null,null,null,null,0]
["","","","",null,null,null,null,null,0]
["","","","",null,null,null,null,null,0]
["","","","",null,null,null,null,null,0]
["","","","",null,null,null,null,null,0]
["","","","",null,null,null,null,null,0]
["","","","",null,null,null,null,null,0]
["","","","",null,null,null,null,null,0]
["","","","",null,null,null,null,null,0]
["","","","",null,null,null,null,null,0]
["","","","",null,null,null,null,null,0]
["","","","",null,null,null,null,null,0]
["","","","",null,null,null,null,null,0]
["","","","",null,null,null,null,null,0]
["","","","",null,null,null,null,null,0]
["","","","",null,null,null,null,null,0]
[{"$f":"IFERROR(INDEX(F:J,MATCH(ROW()-ROW($B$1),J:J,0),1),\"\")","v":""},{"$f":"IFERROR(INDEX(F:J,MATCH(ROW()-ROW($B$1),J:J,0),2),\"\")","v":""},{"$f":"IFERROR(INDEX(F:J,MATCH(ROW()-ROW($C$1),J:J,0),4),\"\")","v":""},{"$f":"IFERROR(INDEX(F:J,MATCH(ROW()-ROW($D$1),J:J,0),3),\"\")","v":""},null,null,null,null,null,0]
["","","","",null,null,null,null,null,0]
["","","","",null,null,null,null,null,0]
["","","","",null,null,null,null,null,0]
["","","","",null,null,null,null,null,0]
["","","","",null,null,null,null,null,0]
["","","","",null,null,null,null,null,0]
["","","","",null,null,null,null,null,0]
["","","","",null,null,null,null,null,0]
["","","","",null,null,null,null,null,0]
["","","","",null,null,null,null,null,0]
["","","","",null,null,null,null,null,0]
["","","","",null,null,null,null,null,0]
["","","","",null,null,null,null,null,0]
["","","","",null,null,null,null,null,0]
["","","","",null,null,null,null,null,0]
["","","","",null,null,null,null,null,0]
["","","","",null,null,null,null,null,0]
["","","","",null,null,null,null,null,0]
["","","","",null,null,null,null,null,0]
["","","","",null,null,null,null,null,0]
["","","","",null,null,null,null,null,0]
["","","","",null,null,null,null,null,0]
["","","","",null,null,null,null,null,0]
["","","","",null,null,null,null,null,0]
["","","","",null,null,null,null,null,0]
["","","","",null,null,null,null,null,0]
["","","","",null,null,null,null,null,0]
["","","","",null,null,null,null,null,0]
["","","","",null,null,null,null,null,0]
["","","","",null,null,null,null,null,0]
["","","","",null,null,null,null,null,0]
["","","","",null,null,null,null,null,0]
["","","","",null,null,null,null,null,0]
["","","","",null,null,null,null,null,0]
["","","","",null,null,null,null,null,0]
["","","","",null,null,null,null,null,0]
["","","","",null,null,null,null,null,{"$f":"COUNTIF(Vins,\"<=\"&G450)","v":0}]
["","","","",null,null,null,null,null,0]
["","","","",null,null,null,null,null,0]
["","","","",null,null,null,null,null,0]
["","","","",null,null,null,null,null,0]
["","","","",null,null,null,null,null,0]
["","","","",null,null,null,null,null,0]
["","","","",null,null,null,null,null,0]
["","","","",null,null,null,null,null,0]
["","","","",null,null,null,null,null,0]
["","","","",null,null,null,null,null,0]
["","","","",null,null,null,null,null,0]
["","","","",null,null,null,null,null,0]
["","","","",null,null,null,null,null,0]
["","","","",null,null,null,null,null,0]
["","","","",null,null,null,null,null,0]
["","","","",null,null,null,null,null,0]
["","","","",null,null,null,null,null,0]
["","","","",null,null,null,null,null,0]
["","","","",null,null,null,null,null,0]
["","","","",null,null,null,null,null,0]
["","","","",null,null,null,null,null,0]
["","","","",null,null,null,null,null,0]
["","","","",null,null,null,null,null,0]
["","","","",null,null,null,null,null,0]
["","","","",null,null,null,null,null,0]
["","","","",null,null,null,null,null,0]
[{"$f":"IFERROR(INDEX(F:J,MATCH(ROW()-ROW($B$1),J:J,0),1),\"\")","v":""},{"$f":"IFERROR(INDEX(F:J,MATCH(ROW()-ROW($B$1),J:J,0),2),\"\")","v":""},{"$f":"IFERROR(INDEX(F:J,MATCH(ROW()-ROW($C$1),J:J,0),4),\"\")","v":""},{"$f":"IFERROR(INDEX(F:J,MATCH(ROW()-ROW($D$1),J:J,0),3),\"\")","v":""},null,null,null,null,null,0]
["","","","",null,null,null,null,null,0]
["","","","",null,null,null,null,null,0]
["","","","",null,null,null,null,null,0]
["","","","",null,null,null,null,null,0]
["","","","",null,null,null,null,null,0]
["","","","",null,null,null,null,null,0]
["","","","",null,null,null,null,null,0]
["","","","",null,null,null,null,null,0]
["","","","",null,null,null,null,null,0]
["","","","",null,null,null,null,null,0]
["","","","",null,null,null,null,null,0]
["","","","",null,null,null,null,null,0]
["","","","",null,null,null,null,null,0]
["","","","",null,null,null,null,null,0]
["","","","",null,null,null,null,null,0]
["","","","",null,null,null,null,null,0]
["","","","",null,null,null,null,null,0]
["","","","",null,null,null,null,null,0]
["","","","",null,null,null,null,null,0]
["","","","",null,null,null,null,null,0]
["","","","",null,null,null,null,null,0]
["","","","",null,null,null,null,null,0]
["","","","",null,null,null,null,null,0]
["","","","",null,null,null,null,null,0]
["","","","",null,null,null,null,null,0]
["","","","",null,null,null,null,null,0]
["","","","",null,null,null,null,null,0]
["","","","",null,null,null,null,null,0]
["","","","",null,null,null,null,null,0]
["","","","",null,null,null,null,null,0]
["","","","",null,null,null,null,null,0]
["","","","",null,null,null,null,null,0]
["","","","",null,null,null,null,null,0]
["","","","",null,null,null,null,null,0]
["","","","",null,null,null,null,null,0]
["","","","",null,null,null,null,null,0]
["","","","",null,null,null,null,null,{"$f":"COUNTIF(Vins,\"<=\"&G514)","v":0}]
["","","","",null,null,null,null,null,0]
["","","","",null,null,null,null,null,0]
["","","","",null,null,null,null,null,0]
["","","","",null,null,null,null,null,0]
["","","","",null,null,null,null,null,0]
["","","","",null,null,null,null,null,0]
["","","","",null,null,null,null,null,0]
["","","","",null,null,null,null,null,0]
["","","","",null,null,null,null,null,0]
["","","","",null,null,null,null,null,0]
["","","","",null,null,null,null,null,0]
["","","","",null,null,null,null,null,0]
["","","","",null,null,null,null,null,0]
["","","","",null,null,null,null,null,0]
["","","","",null,null,null,null,null,0]
["","","","",null,null,null,null,null,0]
["","","","",null,null,null,null,null,0]
["","","","",null,null,null,null,null,0]
["","","","",null,null,null,null,null,0]
["","","","",null,null,null,null,null,0]
["","","","",null,null,null,null,null,0]
["","","","",null,null,null,null,null,0]
["","","","",null,null,null,null,null,0]
["","","","",null,null,null,null,null,0]
["","","","",null,null,null,null,null,0]
["","","","",null,null,null,null,null,0]
[{"$f":"IFERROR(INDEX(F:J,MATCH(ROW()-ROW($B$1),J:J,0),1),\"\")","v":""},{"$f":"IFERROR(INDEX(F:J,MATCH(ROW()-ROW($B$1),J:J,0),2),\"\")","v":""},{"$f":"IFERROR(INDEX(F:J,MATCH(ROW()-ROW($C$1),J:J,0),4),\"\")","v":""},{"$f":"IFERROR(INDEX(F:J,MATCH(ROW()-ROW($D$1),J:J,0),3),\"\")","v":""},null,null,null,null,null,0]
["","","","",null,null,null,null,null,0]
["","","","",null,null,null,null,null,0]
["","","","",null,null,null,null,null,0]
["","","","",null,null,null,null,null,0]
["","","","",null,null,null,null,null,0]
["","","","",null,null,null,null,null,0]
["","","","",null,null,null,null,null,0]
["","","","",null,null,null,null,null,0]
["","","","",null,null,null,null,null,0]
["","","","",null,null,null,null,null,0]
["","","","",null,null,null,null,null,0]
["","","","",null,null,null,null,null,0]
["","","","",null,null,null,null,null,0]
["","","","",null,null,null,null,null,0]
["","","","",null,null,null,null,null,0]
["","","","",null,null,null,null,null,0]
["","","","",null,null,null,null,null,0]
["","","","",null,null,null,null,null,0]
["","","","",null,null,null,null,null,0]
["","","","",null,null,null,null,null,0]
["","","","",null,null,null,null,null,0]
["","","","",null,null,null,null,null,0]
["","","","",null,null,null,null,null,0]
["","","","",null,null,null,null,null,0]
["","","","",null,null,null,null,null,0]
["","","","",null,null,null,null,null,0]
["","","","",null,null,null,null,null,0]
["","","","",null,null,null,null,null,0]
["","","","",null,null,null,null,null,0]
["","","","",null,null,null,null,null,0]
["","","","",null,null,null,null,null,0]
["","","","",null,null,null,null,null,0]
["","","","",null,null,null,null,null,0]
["","","","",null,null,null,null,null,0]
["","","","",null,null,null,null,null,0]
["","","","",null,null,null,null,null,0]
["","","","",null,null,null,null,null,{"$f":"COUNTIF(Vins,\"<=\"&G578)","v":0}]
["","","","",null,null,null,null,null,0]
["","","","",null,null,null,null,null,0]
["","","","",null,null,null,null,null,0]
["","","","",null,null,null,null,null,0]
["","","","",null,null,null,null,null,0]
["","","","",null,null,null,null,null,0]
["","","","",null,null,null,null,null,0]
["","","","",null,null,null,null,null,0]
["","","","",null,null,null,null,null,0]
["","","","",null,null,null,null,null,0]
["","","","",null,null,null,null,null,0]
["","","","",null,null,null,null,null,0]
["","","","",null,null,null,null,null,0]
["","","","",null,null,null,null,null,0]
["","","","",null,null,null,null,null,0]
["","","","",null,null,null,null,null,0]
["","","","",null,null,null,null,null,0]
["","","","",null,null,null,null,null,0]
["","","","",null,null,null,null,null,0]
["","","","",null,null,null,null,null,0]
["","","","",null,null,null,null,null,0]
["","","","",null,null,null,null,null,0]
["","","","",null,null,null,null,null,0]
["","","","",null,null,null,null,null,0]
["","","","",null,null,null,null,null,0]
["","","","",null,null,null,null,null,0]
[{"$f":"IFERROR(INDEX(F:J,MATCH(ROW()-ROW($B$1),J:J,0),1),\"\")","v":""},{"$f":"IFERROR(INDEX(F:J,MATCH(ROW()-ROW($B$1),J:J,0),2),\"\")","v":""},{"$f":"IFERROR(INDEX(F:J,MATCH(ROW()-ROW($C$1),J:J,0),4),\"\")","v":""},{"$f":"IFERROR(INDEX(F:J,MATCH(ROW()-ROW($D$1),J:J,0),3),\"\")","v":""},null,null,null,null,null,0]
["","","","",null,null,null,null,null,0]
["","","","",null,null,null,null,null,0]
["","","","",null,null,null,null,null,0]
["","","","",null,null,null,null,null,0]
["","","","",null,null,null,null,null,0]
["","","","",null,null,null,null,null,0]
["","","","",null,null,null,null,null,0]
["","","","",null,null,null,null,null,0]
["","","","",null,null,null,null,null,0]
["","","","",null,null,null,null,null,0]
["","","","",null,null,null,null,null,0]
["","","","",null,null,null,null,null,0]
["","","","",null,null,null,null,null,0]
["","","","",null,null,null,null,null,0]
["","","","",null,null,null,null,null,0]
["","","","",null,null,null,null,null,0]
["","","","",null,null,null,null,null,0]
["","","","",null,null,null,null,null,0]
["","","","",null,null,null,null,null,0]
["","","","",null,null,null,null,null,0]
["","","","",null,null,null,null,null,0]
["","","","",null,null,null,null,null,0]
["","","","",null,null,null,null,null,0]
["","","","",null,null,null,null,null,0]
["","","","",null,null,null,null,null,0]
["","","","",null,null,null,null,null,0]
["","","","",null,null,null,null,null,0]
["","","","",null,null,null,null,null,0]
["","","","",null,null,null,null,null,0]
["","","","",null,null,null,null,null,0]
["","","","",null,null,null,null,null,0]
["","","","",null,null,null,null,null,0]
["","","","",null,null,null,null,null,0]
["","","","",null,null,null,null,null,0]
["","","","",null,null,null,null,null,0]
["","","","",null,null,null,null,null,0]
["","","","",null,null,null,null,null,{"$f":"COUNTIF(Vins,\"<=\"&G642)","v":0}]
["","","","",null,null,null,null,null,0]
["","","","",null,null,null,null,null,0]
["","","","",null,null,null,null,null,0]
["","","","",null,null,null,null,null,0]
["","","","",null,null,null,null,null,0]
["","","","",null,null,null,null,null,0]
["","","","",null,null,null,null,null,0]
["","","","",null,null,null,null,null,0]
["","","","",null,null,null,null,null,0]
["","","","",null,null,null,null,null,0]
["","","","",null,null,null,null,null,0]
["","","","",null,null,null,null,null,0]
["","","","",null,null,null,null,null,0]
["","","","",null,null,null,null,null,0]
["","","","",null,null,null,null,null,0]
["","","","",null,null,null,null,null,0]
["","","","",null,null,null,null,null,0]
["","","","",null,null,null,null,null,0]
["","","","",null,null,null,null,null,0]
["","","","",null,null,null,null,null,0]
["","","","",null,null,null,null,null,0]
["","","","",null,null,null,null,null,0]
["","","","",null,null,null,null,null,0]
["","","","",null,null,null,null,null,0]
["","","","",null,null,null,null,null,0]
["","","","",null,null,null,null,null,0]
[{"$f":"IFERROR(INDEX(F:J,MATCH(ROW()-ROW($B$1),J:J,0),1),\"\")","v":""},{"$f":"IFERROR(INDEX(F:J,MATCH(ROW()-ROW($B$1),J:J,0),2),\"\")","v":""},{"$f":"IFERROR(INDEX(F:J,MATCH(ROW()-ROW($C$1),J:J,0),4),\"\")","v":""},{"$f":"IFERROR(INDEX(F:J,MATCH(ROW()-ROW($D$1),J:J,0),3),\"\")","v":""},null,null,null,null,null,0]
["","","","",null,null,null,null,null,0]
["","","","",null,null,null,null,null,0]
["","","","",null,null,null,null,null,0]
["","","","",null,null,null,null,null,0]
["","","","",null,null,null,null,null,0]
["","","","",null,null,null,null,null,0]
["","","","",null,null,null,null,null,0]
["","","","",null,null,null,null,null,0]
["","","","",null,null,null,null,null,0]
["","","","",null,null,null,null,null,0]
["","","","",null,null,null,null,null,0]
["","","","",null,null,null,null,null,0]
["","","","",null,null,null,null,null,0]
["","","","",null,null,null,null,null,0]
["","","","",null,null,null,null,null,0]
["","","","",null,null,null,null,null,0]
["","","","",null,null,null,null,null,0]
["","","","",null,null,null,null,null,0]
["","","","",null,null,null,null,null,0]
["","","","",null,null,null,null,null,0]
["","","","",null,null,null,null,null,0]
["","","","",null,null,null,null,null,0]
["","","","",null,null,null,null,null,0]
["","","","",null,null,null,null,null,0]
["","","","",null,null,null,null,null,0]
["","","","",null,null,null,null,null,0]
["","","","",null,null,null,null,null,0]
["","","","",null,null,null,null,null,0]
["","","","",null,null,null,null,null,0]
["","","","",null,null,null,null,null,0]
["","","","",null,null,null,null,null,0]
["","","","",null,null,null,null,null,0]
["","","","",null,null,null,null,null,0]
["","","","",null,null,null,null,null,0]
["","","","",null,null,null,null,null,0]
["","","","",null,null,null,null,null,0]
["","","","",null,null,null,null,null,{"$f":"COUNTIF(Vins,\"<=\"&G706)","v":0}]
["","","","",null,null,null,null,null,0]
["","","","",null,null,null,null,null,0]
["","","","",null,null,null,null,null,0]
["","","","",null,null,null,null,null,0]
["","","","",null,null,null,null,null,0]
["","","","",null,null,null,null,null,0]
["","","","",null,null,null,null,null,0]
["","","","",null,null,null,null,null,0]
["","","","",null,null,null,null,null,0]
["","","","",null,null,null,null,null,0]
["","","","",null,null,null,null,null,0]
["","","","",null,null,null,null,null,0]
["","","","",null,null,null,null,null,0]
["","","","",null,null,null,null,null,0]
["","","","",null,null,null,null,null,0]
["","","","",null,null,null,null,null,0]
["","","","",null,null,null,null,null,0]
["","","","",null,null,null,null,null,0]
["","","","",null,null,null,null,null,0]
["","","","",null,null,null,null,null,0]
["","","","",null,null,null,null,null,0]
["","","","",null,null,null,null,null,0]
["","","","",null,null,null,null,null,0]
["","","","",null,null,null,null,null,0]
["","","","",null,null,null,null,null,0]
["","","","",null,null,null,null,null,0]
[{"$f":"IFERROR(INDEX(F:J,MATCH(ROW()-ROW($B$1),J:J,0),1),\"\")","v":""},{"$f":"IFERROR(INDEX(F:J,MATCH(ROW()-ROW($B$1),J:J,0),2),\"\")","v":""},{"$f":"IFERROR(INDEX(F:J,MATCH(ROW()-ROW($C$1),J:J,0),4),\"\")","v":""},{"$f":"IFERROR(INDEX(F:J,MATCH(ROW()-ROW($D$1),J:J,0),3),\"\")","v":""},null,null,null,null,null,0]
["","","","",null,null,null,null,null,0]
["","","","",null,null,null,null,null,0]
["","","","",null,null,null,null,null,0]
["","","","",null,null,null,null,null,0]
["","","","",null,null,null,null,null,0]
["","","","",null,null,null,null,null,0]
["","","","",null,null,null,null,null,0]
["","","","",null,null,null,null,null,0]
["","","","",null,null,null,null,null,0]
["","","","",null,null,null,null,null,0]
["","","","",null,null,null,null,null,0]
["","","","",null,null,null,null,null,0]
["","","","",null,null,null,null,null,0]
["","","","",null,null,null,null,null,0]
["","","","",null,null,null,null,null,0]
["","","","",null,null,null,null,null,0]
["","","","",null,null,null,null,null,0]
["","","","",null,null,null,null,null,0]
["","","","",null,null,null,null,null,0]
["","","","",null,null,null,null,null,0]
["","","","",null,null,null,null,null,0]
["","","","",null,null,null,null,null,0]
["","","","",null,null,null,null,null,0]
["","","","",null,null,null,null,null,0]
["","","","",null,null,null,null,null,0]
["","","","",null,null,null,null,null,0]
["","","","",null,null,null,null,null,0]
["","","","",null,null,null,null,null,0]
["","","","",null,null,null,null,null,0]
["","","","",null,null,null,null,null,0]
["","","","",null,null,null,null,null,0]
["","","","",null,null,null,null,null,0]
["","","","",null,null,null,null,null,0]
["","","","",null,null,null,null,null,0]
["","","","",null,null,null,null,null,0]
["","","","",null,null,null,null,null,0]
["","","","",null,null,null,null,null,{"$f":"COUNTIF(Vins,\"<=\"&G770)","v":0}]
["","","","",null,null,null,null,null,0]
["","","","",null,null,null,null,null,0]
["","","","",null,null,null,null,null,0]
["","","","",null,null,null,null,null,0]
["","","","",null,null,null,null,null,0]
["","","","",null,null,null,null,null,0]
["","","","",null,null,null,null,null,0]
["","","","",null,null,null,null,null,0]
["","","","",null,null,null,null,null,0]
["","","","",null,null,null,null,null,0]
["","","","",null,null,null,null,null,0]
["","","","",null,null,null,null,null,0]
["","","","",null,null,null,null,null,0]
["","","","",null,null,null,null,null,0]
["","","","",null,null,null,null,null,0]
["","","","",null,null,null,null,null,0]
["","","","",null,null,null,null,null,0]
["","","","",null,null,null,null,null,0]
["","","","",null,null,null,null,null,0]
["","","","",null,null,null,null,null,0]
["","","","",null,null,null,null,null,0]
["","","","",null,null,null,null,null,0]
["","","","",null,null,null,null,null,0]
["","","","",null,null,null,null,null,0]
["","","","",null,null,null,null,null,0]
["","","","",null,null,null,null,null,0]
[{"$f":"IFERROR(INDEX(F:J,MATCH(ROW()-ROW($B$1),J:J,0),1),\"\")","v":""},{"$f":"IFERROR(INDEX(F:J,MATCH(ROW()-ROW($B$1),J:J,0),2),\"\")","v":""},{"$f":"IFERROR(INDEX(F:J,MATCH(ROW()-ROW($C$1),J:J,0),4),\"\")","v":""},{"$f":"IFERROR(INDEX(F:J,MATCH(ROW()-ROW($D$1),J:J,0),3),\"\")","v":""},null,null,null,null,null,0]
["","","","",null,null,null,null,null,0]
["","","","",null,null,null,null,null,0]
["","","","",null,null,null,null,null,0]
["","","","",null,null,null,null,null,0]
["","","","",null,null,null,null,null,0]
["","","","",null,null,null,null,null,0]
["","","","",null,null,null,null,null,0]
["","","","",null,null,null,null,null,0]
["","","","",null,null,null,null,null,0]
["","","","",null,null,null,null,null,0]
["","","","",null,null,null,null,null,0]
["","","","",null,null,null,null,null,0]
["","","","",null,null,null,null,null,0]
["","","","",null,null,null,null,null,0]
["","","","",null,null,null,null,null,0]
["","","","",null,null,null,null,null,0]
["","","","",null,null,null,null,null,0]
["","","","",null,null,null,null,null,0]
["","","","",null,null,null,null,null,0]
["","","","",null,null,null,null,null,0]
["","","","",null,null,null,null,null,0]
["","","","",null,null,null,null,null,0]
["","","","",null,null,null,null,null,0]
["","","","",null,null,null,null,null,0]
["","","","",null,null,null,null,null,0]
["","","","",null,null,null,null,null,0]
["","","","",null,null,null,null,null,0]
["","","","",null,null,null,null,null,0]
["","","","",null,null,null,null,null,0]
["","","","",null,null,null,null,null,0]
["","","","",null,null,null,null,null,0]
["","","","",null,null,null,null,null,0]
["","","","",null,null,null,null,null,0]
["","","","",null,null,null,null,null,0]
["","","","",null,null,null,null,null,0]
["","","","",null,null,null,null,null,0]
["","","","",null,null,null,null,null,{"$f":"COUNTIF(Vins,\"<=\"&G834)","v":0}]
["","","","",null,null,null,null,null,0]
["","","","",null,null,null,null,null,0]
["","","","",null,null,null,null,null,0]
["","","","",null,null,null,null,null,0]
["","","","",null,null,null,null,null,0]
["","","","",null,null,null,null,null,0]
["","","","",null,null,null,null,null,0]
["","","","",null,null,null,null,null,0]
["","","","",null,null,null,null,null,0]
["","","","",null,null,null,null,null,0]
["","","","",null,null,null,null,null,0]
["","","","",null,null,null,null,null,0]
["","","","",null,null,null,null,null,0]
["","","","",null,null,null,null,null,0]
["","","","",null,null,null,null,null,0]
["","","","",null,null,null,null,null,0]
["","","","",null,null,null,null,null,0]
["","","","",null,null,null,null,null,0]
["","","","",null,null,null,null,null,0]
["","","","",null,null,null,null,null,0]
["","","","",null,null,null,null,null,0]
["","","","",null,null,null,null,null,0]
["","","","",null,null,null,null,null,0]
["","","","",null,null,null,null,null,0]
["","","","",null,null,null,null,null,0]
["","","","",null,null,null,null,null,0]
[{"$f":"IFERROR(INDEX(F:J,MATCH(ROW()-ROW($B$1),J:J,0),1),\"\")","v":""},{"$f":"IFERROR(INDEX(F:J,MATCH(ROW()-ROW($B$1),J:J,0),2),\"\")","v":""},{"$f":"IFERROR(INDEX(F:J,MATCH(ROW()-ROW($C$1),J:J,0),4),\"\")","v":""},{"$f":"IFERROR(INDEX(F:J,MATCH(ROW()-ROW($D$1),J:J,0),3),\"\")","v":""},null,null,null,null,null,0]
["","","","",null,null,null,null,null,0]
["","","","",null,null,null,null,null,0]
["","","","",null,null,null,null,null,0]
["","","","",null,null,null,null,null,0]
["","","","",null,null,null,null,null,0]
["","","","",null,null,null,null,null,0]
["","","","",null,null,null,null,null,0]
["","","","",null,null,null,null,null,0]
["","","","",null,null,null,null,null,0]
["","","","",null,null,null,null,null,0]
["","","","",null,null,null,null,null,0]
["","","","",null,null,null,null,null,0]
["","","","",null,null,null,null,null,0]
["","","","",null,null,null,null,null,0]
["","","","",null,null,null,null,null,0]
["","","","",null,null,null,null,null,0]
["","","","",null,null,null,null,null,0]
["","","","",null,null,null,null,null,0]
["","","","",null,null,null,null,null,0]
["","","","",null,null,null,null,null,0]
["","","","",null,null,null,null,null,0]
["","","","",null,null,null,null,null,0]
["","","","",null,null,null,null,null,0]
["","","","",null,null,null,null,null,0]
["","","","",null,null,null,null,null,0]
["","","","",null,null,null,null,null,0]
["","","","",null,null,null,null,null,0]
["","","","",null,null,null,null,null,0]
["","","","",null,null,null,null,null,0]
["","","","",null,null,null,null,null,0]
["","","","",null,null,null,null,null,0]
["","","","",null,null,null,null,null,0]
["","","","",null,null,null,null,null,0]
["","","","",null,null,null,null,null,0]
["","","","",null,null,null,null,null,0]
["","","","",null,null,null,null,null,0]
["","","","",null,null,null,null,null,{"$f":"COUNTIF(Vins,\"<=\"&G898)","v":0}]
["","","","",null,null,null,null,null,0]
["","","","",null,null,null,null,null,0]
["","","","",null,null,null,null,null,0]
["","","","",null,null,null,null,null,0]
["","","","",null,null,null,null,null,0]
["","","","",null,null,null,null,null,0]
["","","","",null,null,null,null,null,0]
["","","","",null,null,null,null,null,0]
["","","","",null,null,null,null,null,0]
["","","","",null,null,null,null,null,0]
["","","","",null,null,null,null,null,0]
["","","","",null,null,null,null,null,0]
["","","","",null,null,null,null,null,0]
["","","","",null,null,null,null,null,0]
["","","","",null,null,null,null,null,0]
["","","","",null,null,null,null,null,0]
["","","","",null,null,null,null,null,0]
["","","","",null,null,null,null,null,0]
["","","","",null,null,null,null,null,0]
["","","","",null,null,null,null,null,0]
["","","","",null,null,null,null,null,0]
["","","","",null,null,null,null,null,0]
["","","","",null,null,null,null,null,0]
["","","","",null,null,null,null,null,0]
["","","","",null,null,null,null,null,0]
["","","","",null,null,null,null,null,0]
[{"$f":"IFERROR(INDEX(F:J,MATCH(ROW()-ROW($B$1),J:J,0),1),\"\")","v":""},{"$f":"IFERROR(INDEX(F:J,MATCH(ROW()-ROW($B$1),J:J,0),2),\"\")","v":""},{"$f":"IFERROR(INDEX(F:J,MATCH(ROW()-ROW($C$1),J:J,0),4),\"\")","v":""},{"$f":"IFERROR(INDEX(F:J,MATCH(ROW()-ROW($D$1),J:J,0),3),\"\")","v":""},null,null,null,null,null,0]
["","","","",null,null,null,null,null,0]
["","","","",null,null,null,null,null,0]
["","","","",null,null,null,null,null,0]
["","","","",null,null,null,null,null,0]
["","","","",null,null,null,null,null,0]
["","","","",null,null,null,null,null,0]
["","","","",null,null,null,null,null,0]
["","","","",null,null,null,null,null,0]
["","","","",null,null,null,null,null,0]
["","","","",null,null,null,null,null,0]
["","","","",null,null,null,null,null,0]
["","","","",null,null,null,null,null,0]
["","","","",null,null,null,null,null,0]
["","","","",null,null,null,null,null,0]
["","","","",null,null,null,null,null,0]
["","","","",null,null,null,null,null,0]
["","","","",null,null,null,null,null,0]
["","","","",null,null,null,null,null,0]
["","","","",null,null,null,null,null,0]
["","","","",null,null,null,null,null,0]
["","","","",null,null,null,null,null,0]
["","","","",null,null,null,null,null,0]
["","","","",null,null,null,null,null,0]
["","","","",null,null,null,null,null,0]
["","","","",null,null,null,null,null,0]
["","","","",null,null,null,null,null,0]
["","","","",null,null,null,null,null,0]
["","","","",null,null,null,null,null,0]
["","","","",null,null,null,null,null,0]
["","","","",null,null,null,null,null,0]
["","","","",null,null,null,null,null,0]
["","","","",null,null,null,null,null,0]
["","","","",null,null,null,null,null,0]
["","","","",null,null,null,null,null,0]
["","","","",null,null,null,null,null,0]
["","","","",null,null,null,null,null,0]
["","","","",null,null,null,null,null,{"$f":"COUNTIF(Vins,\"<=\"&G962)","v":0}]
["","","","",null,null,null,null,null,0]
["","","","",null,null,null,null,null,0]
["","","","",null,null,null,null,null,0]
["","","","",null,null,null,null,null,0]
["","","","",null,null,null,null,null,0]
["","","","",null,null,null,null,null,0]
["","","","",null,null,null,null,null,0]
["","","","",null,null,null,null,null,0]
["","","","",null,null,null,null,null,0]
["","","","",null,null,null,null,null,0]
["","","","",null,null,null,null,null,0]
["","","","",null,null,null,null,null,0]
["","","","",null,null,null,null,null,0]
["","","","",null,null,null,null,null,0]
["","","","",null,null,null,null,null,0]
["","","","",null,null,null,null,null,0]
["","","","",null,null,null,null,null,0]
["","","","",null,null,null,null,null,0]
["","","","",null,null,null,null,null,0]
["","","","",null,null,null,null,null,0]
["","","","",null,null,null,null,null,0]
["","","","",null,null,null,null,null,0]
["","","","",null,null,null,null,null,0]
["","","","",null,null,null,null,null,0]
["","","","",null,null,null,null,null,0]
["","","","",null,null,null,null,null,0]
[{"$f":"IFERROR(INDEX(F:J,MATCH(ROW()-ROW($B$1),J:J,0),1),\"\")","v":""},{"$f":"IFERROR(INDEX(F:J,MATCH(ROW()-ROW($B$1),J:J,0),2),\"\")","v":""},{"$f":"IFERROR(INDEX(F:J,MATCH(ROW()-ROW($C$1),J:J,0),4),\"\")","v":""},{"$f":"IFERROR(INDEX(F:J,MATCH(ROW()-ROW($D$1),J:J,0),3),\"\")","v":""},null,null,null,null,null,0]
["","","","",null,null,null,null,null,0]
["","","","",null,null,null,null,null,0]
["","","","",null,null,null,null,null,0]
["","","","",null,null,null,null,null,0]
["","","","",null,null,null,null,null,0]
["","","","",null,null,null,null,null,0]
["","","","",null,null,null,null,null,0]
["","","","",null,null,null,null,null,0]
["","","","",null,null,null,null,null,0]
["","","","",null,null,null,null,null,0]
["","","","",null,null,null,null,null,0]

{"sheet":"Paramètres","index":5,"n_rows":100,"n_cols":8,"rows_kept":100,"cut":false,"hidden":false,"merged":[]}
["APPELLATION","NOMBRE D'APPELLATION",{"$f":"LOOKUP(9^9,B:B)","v":32}]
["ALOXE CORTON",{"$f":"IF(A2>0,1)","v":1},null,null,null,null,null,"Étagère 1"]
["ALSACE",{"$f":"IF(A3<>0,$B2+1,\"\")","v":2},null,null,null,null,null,"Étagère 1 et 2"]
["AUXEY DURESSES",3,null,null,null,null,null,"Étagère 1, 2 et 3"]
["BLAYE",4,null,null,null,null,null,"Étagère 2"]
["CHAMPAGNE",5,null,null,null,null,null,"Étagère 3"]
["CHASSAGNE MONTRACHET",6,null,null,null,null,null,"Étagère 3 et 4"]
["CONDRIEU",7,null,null,null,null,null,"Étagère 4"]
["CÔTES DE BORDEAUX",8,null,null,null,null,null,"Étagère 5"]
["GRAVES",9,null,null,null,null,null,"Cuisine "]
["HAUTES CÔTES DE NUITS",10,null,null,null,null,null,"Garage"]
["LADOIX",11]
["MARGAUX",12]
["MENETOU SALON",13]
["MERCUREY",14]
["NUITS ST GEORGES",15]
["PERNAND VERGELESS",16]
["PESSAC LÉOGNAN",17]
["POMEROL",18]
["POMMARD",19]
["POUILLY FUISSÉ",20]
["POUILLY FUMÉ",21]
["RIESLING",22]
["RULLY",23]
["SAINT ÉMILION",24]
["SAINT ESTÈPHE",25]
["SAINT JOSEPH",26]
["SAINT ROMAIN",27]
["SAINT VÉRAN",28]
["SAVIGNY LES BEAUNE",29]
["ST JULIEN",30]
["VIRÉ CLESSÉ",31]
["VOSNE ROMANÉE",32]
[null,""]
[null,{"$f":"IF(A35<>0,$B34+1,\"\")","v":""}]
[null,""]
[null,""]
[null,""]
[null,""]
[null,""]
[null,""]
[null,""]
[null,""]
[null,""]
[null,""]
[null,""]
[null,""]
[null,""]
[null,""]
[null,""]
[null,""]
[null,""]
[null,""]
[null,""]
[null,""]
[null,""]
[null,""]
[null,""]
[null,""]
[null,""]
[null,""]
[null,""]
[null,""]
[null,""]
[null,""]
[null,""]
[null,{"$f":"IF(A67<>0,$B66+1,\"\")","v":""}]
[null,""]
[null,""]
[null,""]
[null,""]
[null,""]
[null,""]
[null,""]
[null,""]
[null,""]
[null,""]
[null,""]
[null,""]
[null,""]
[null,""]
[null,""]
[null,""]
[null,""]
[null,""]
[null,""]
[null,""]
[null,""]
[null,""]
[null,""]
[null,""]
[null,""]
[null,""]
[null,""]
[null,""]
[null,""]
[null,""]
[null,""]
[null,{"$f":"IF(A99<>0,$B98+1,\"\")","v":""}]
[null,""]