{"text_format":"1","workbook":"xlsx","n_sheets":3,"sheets":["Feuil3","SUIVIS","FICHIER "],"not_rendered":{"charts":0,"images":0,"macros":1,"external_links":0,"defined_names":0,"comments":0,"pivot_tables":0},"unopened":[],"bounds":{"document_bytes":16777216,"sheet_cells":100000,"rows_first":2000,"rows_last":500,"rows_between":2000,"halvings":0,"cell_chars":16384,"cell_head_chars":4096},"cells_cut":0,"cells_raw":0,"read":"whole","date_system":"1900"}

{"sheet":"Feuil3","index":0,"n_rows":20,"n_cols":6,"rows_kept":20,"cut":false,"hidden":false,"merged":[]}
[]
[]
[]
[]
[]
[]
[]
[]
[]
[null,null,null,"CLIENT                                   PROSPECT ",null,"PARTICULIER                           PROFESSIONNEL "]
[]
[null,null,null,"Client",null,"Professionnel"]
[]
[null,null,null,"RAISON SOCIALE",null,"kkkk"]
[]
[null,null,null,"N° SIRET",null,"kkkk"]
[]
[null,null,null,"PRENOM",null,"kkkkk"]
[]
[null,null,null,"NOM",null,"kkk"]
{"$rows_left_out":1}
{"sheet":"SUIVIS","index":1,"n_rows":50,"n_cols":8,"rows_kept":50,"cut":false,"hidden":false,"merged":[]}
[]
[]
[]
[]
[]
[null,null,"CLIENT PROSPECT","PARTICULIER PROFESSIONNEL","RAISON SOCIALE","N° SIRET","PRENOM","NOM"]
[null,null,{"$f":"IFERROR(INDEX(Tableau2[CLIENT PROSPECT],_xlfn.AGGREGATE(15,6,ROW(Tableau2[SUIVIS])-ROW('FICHIER '!$I$7)+1/(Tableau2[]=\"oui\"),ROW(1:1))),\"\")","v":"CLIENT"},{"$f":"IFERROR(INDEX(Tableau2[PARTICULIER PROFESSIONNEL],_xlfn.AGGREGATE(15,6,ROW(Tableau2[CLIENT PROSPECT])-ROW('FICHIER '!$I$7)+1/(Tableau2[]=\"oui\"),ROW(1:1))),\"\")","v":"PARTICULIER"},{"$f":"IFERROR(INDEX(Tableau2[RAISON SOCIALE],_xlfn.AGGREGATE(15,6,ROW(Tableau2[PARTICULIER PROFESSIONNEL])-ROW('FICHIER '!$I$7)+1/(Tableau2[]=\"oui\"),ROW(1:1))),\"\")","v":"aaaa"},{"$f":"IFERROR(INDEX(Tableau2[N° SIRET],_xlfn.AGGREGATE(15,6,ROW(Tableau2[RAISON SOCIALE])-ROW('FICHIER '!$I$7)+1/(Tableau2[]=\"oui\"),ROW(1:1))),\"\")","v":0},{"$f":"IFERROR(INDEX(Tableau2[PRENOM],_xlfn.AGGREGATE(15,6,ROW(Tableau2[N° SIRET])-ROW('FICHIER '!$I$7)+1/(Tableau2[]=\"oui\"),ROW(1:1))),\"\")","v":"FREDERIC"},{"$f":"IFERROR(INDEX(Tableau2[NOM],_xlfn.AGGREGATE(15,6,ROW(Tableau2[PRENOM])-ROW('FICHIER '!$I$7)+1/(Tableau2[]=\"oui\"),ROW(1:1))),\"\")","v":"DURAND"}]
[null,null,{"$f":"IFERROR(INDEX(Tableau2[CLIENT PROSPECT],_xlfn.AGGREGATE(15,6,ROW(Tableau2[SUIVIS])-ROW('FICHIER '!$I$7)+1/(Tableau2[]=\"oui\"),ROW(2:2))),\"\")","v":"CLIENT"},{"$f":"IFERROR(INDEX(Tableau2[PARTICULIER PROFESSIONNEL],_xlfn.AGGREGATE(15,6,ROW(Tableau2[CLIENT PROSPECT])-ROW('FICHIER '!$I$7)+1/(Tableau2[]=\"oui\"),ROW(2:2))),\"\")","v":"PARTICULIER"},{"$f":"IFERROR(INDEX(Tableau2[RAISON SOCIALE],_xlfn.AGGREGATE(15,6,ROW(Tableau2[PARTICULIER PROFESSIONNEL])-ROW('FICHIER '!$I$7)+1/(Tableau2[]=\"oui\"),ROW(2:2))),\"\")","v":0},{"$f":"IFERROR(INDEX(Tableau2[N° SIRET],_xlfn.AGGREGATE(15,6,ROW(Tableau2[RAISON SOCIALE])-ROW('FICHIER '!$I$7)+1/(Tableau2[]=\"oui\"),ROW(2:2))),\"\")","v":0},{"$f":"IFERROR(INDEX(Tableau2[PRENOM],_xlfn.AGGREGATE(15,6,ROW(Tableau2[N° SIRET])-ROW('FICHIER '!$I$7)+1/(Tableau2[]=\"oui\"),ROW(2:2))),\"\")","v":"FLORIAN"},{"$f":"IFERROR(INDEX(Tableau2[NOM],_xlfn.AGGREGATE(15,6,ROW(Tableau2[PRENOM])-ROW('FICHIER '!$I$7)+1/(Tableau2[]=\"oui\"),ROW(2:2))),\"\")","v":"FERNANDEZ"}]
[null,null,{"$f":"IFERROR(INDEX(Tableau2[CLIENT PROSPECT],_xlfn.AGGREGATE(15,6,ROW(Tableau2[SUIVIS])-ROW('FICHIER '!$I$7)+1/(Tableau2[]=\"oui\"),ROW(3:3))),\"\")","v":"PROSPECT"},{"$f":"IFERROR(INDEX(Tableau2[PARTICULIER PROFESSIONNEL],_xlfn.AGGREGATE(15,6,ROW(Tableau2[CLIENT PROSPECT])-ROW('FICHIER '!$I$7)+1/(Tableau2[]=\"oui\"),ROW(3:3))),\"\")","v":"PARTCULIER"},{"$f":"IFERROR(INDEX(Tableau2[RAISON SOCIALE],_xlfn.AGGREGATE(15,6,ROW(Tableau2[PARTICULIER PROFESSIONNEL])-ROW('FICHIER '!$I$7)+1/(Tableau2[]=\"oui\"),ROW(3:3))),\"\")","v":0},{"$f":"IFERROR(INDEX(Tableau2[N° SIRET],_xlfn.AGGREGATE(15,6,ROW(Tableau2[RAISON SOCIALE])-ROW('FICHIER '!$I$7)+1/(Tableau2[]=\"oui\"),ROW(3:3))),\"\")","v":0},{"$f":"IFERROR(INDEX(Tableau2[PRENOM],_xlfn.AGGREGATE(15,6,ROW(Tableau2[N° SIRET])-ROW('FICHIER '!$I$7)+1/(Tableau2[]=\"oui\"),ROW(3:3))),\"\")","v":"FERNAND"},{"$f":"IFERROR(INDEX(Tableau2[NOM],_xlfn.AGGREGATE(15,6,ROW(Tableau2[PRENOM])-ROW('FICHIER '!$I$7)+1/(Tableau2[]=\"oui\"),ROW(3:3))),\"\")","v":"LOPEZ"}]
[null,null,{"$f":"IFERROR(INDEX(Tableau2[CLIENT PROSPECT],_xlfn.AGGREGATE(15,6,ROW(Tableau2[SUIVIS])-ROW('FICHIER '!$I$7)+1/(Tableau2[]=\"oui\"),ROW(4:4))),\"\")","v":"PROSPECT"},{"$f":"IFERROR(INDEX(Tableau2[PARTICULIER PROFESSIONNEL],_xlfn.AGGREGATE(15,6,ROW(Tableau2[CLIENT PROSPECT])-ROW('FICHIER '!$I$7)+1/(Tableau2[]=\"oui\"),ROW(4:4))),\"\")","v":"PROFESSIONNEL"},{"$f":"IFERROR(INDEX(Tableau2[RAISON SOCIALE],_xlfn.AGGREGATE(15,6,ROW(Tableau2[PARTICULIER PROFESSIONNEL])-ROW('FICHIER '!$I$7)+1/(Tableau2[]=\"oui\"),ROW(4:4))),\"\")","v":0},{"$f":"IFERROR(INDEX(Tableau2[N° SIRET],_xlfn.AGGREGATE(15,6,ROW(Tableau2[RAISON SOCIALE])-ROW('FICHIER '!$I$7)+1/(Tableau2[]=\"oui\"),ROW(4:4))),\"\")","v":0},{"$f":"IFERROR(INDEX(Tableau2[PRENOM],_xlfn.AGGREGATE(15,6,ROW(Tableau2[N° SIRET])-ROW('FICHIER '!$I$7)+1/(Tableau2[]=\"oui\"),ROW(4:4))),\"\")","v":"LOIC"},{"$f":"IFERROR(INDEX(Tableau2[NOM],_xlfn.AGGREGATE(15,6,ROW(Tableau2[PRENOM])-ROW('FICHIER '!$I$7)+1/(Tableau2[]=\"oui\"),ROW(4:4))),\"\")","v":"PEREZ"}]
[null,null,{"$f":"IFERROR(INDEX(Tableau2[CLIENT PROSPECT],_xlfn.AGGREGATE(15,6,ROW(Tableau2[SUIVIS])-ROW('FICHIER '!$I$7)+1/(Tableau2[]=\"oui\"),ROW(5:5))),\"\")","v":"CLIENT"},{"$f":"IFERROR(INDEX(Tableau2[PARTICULIER PROFESSIONNEL],_xlfn.AGGREGATE(15,6,ROW(Tableau2[CLIENT PROSPECT])-ROW('FICHIER '!$I$7)+1/(Tableau2[]=\"oui\"),ROW(5:5))),\"\")","v":"PARTICULIER"},{"$f":"IFERROR(INDEX(Tableau2[RAISON SOCIALE],_xlfn.AGGREGATE(15,6,ROW(Tableau2[PARTICULIER PROFESSIONNEL])-ROW('FICHIER '!$I$7)+1/(Tableau2[]=\"oui\"),ROW(5:5))),\"\")","v":0},{"$f":"IFERROR(INDEX(Tableau2[N° SIRET],_xlfn.AGGREGATE(15,6,ROW(Tableau2[RAISON SOCIALE])-ROW('FICHIER '!$I$7)+1/(Tableau2[]=\"oui\"),ROW(5:5))),\"\")","v":0},{"$f":"IFERROR(INDEX(Tableau2[PRENOM],_xlfn.AGGREGATE(15,6,ROW(Tableau2[N° SIRET])-ROW('FICHIER '!$I$7)+1/(Tableau2[]=\"oui\"),ROW(5:5))),\"\")","v":"REMY"},{"$f":"IFERROR(INDEX(Tableau2[NOM],_xlfn.AGGREGATE(15,6,ROW(Tableau2[PRENOM])-ROW('FICHIER '!$I$7)+1/(Tableau2[]=\"oui\"),ROW(5:5))),\"\")","v":"DURAND"}]
[null,null,{"$f":"IFERROR(INDEX(Tableau2[CLIENT PROSPECT],_xlfn.AGGREGATE(15,6,ROW(Tableau2[SUIVIS])-ROW('FICHIER '!$I$7)+1/(Tableau2[]=\"oui\"),ROW(6:6))),\"\")","v":"CLIENT"},{"$f":"IFERROR(INDEX(Tableau2[PARTICULIER PROFESSIONNEL],_xlfn.AGGREGATE(15,6,ROW(Tableau2[CLIENT PROSPECT])-ROW('FICHIER '!$I$7)+1/(Tableau2[]=\"oui\"),ROW(6:6))),\"\")","v":"PARTICULIER"},{"$f":"IFERROR(INDEX(Tableau2[RAISON SOCIALE],_xlfn.AGGREGATE(15,6,ROW(Tableau2[PARTICULIER PROFESSIONNEL])-ROW('FICHIER '!$I$7)+1/(Tableau2[]=\"oui\"),ROW(6:6))),\"\")","v":0},{"$f":"IFERROR(INDEX(Tableau2[N° SIRET],_xlfn.AGGREGATE(15,6,ROW(Tableau2[RAISON SOCIALE])-ROW('FICHIER '!$I$7)+1/(Tableau2[]=\"oui\"),ROW(6:6))),\"\")","v":0},{"$f":"IFERROR(INDEX(Tableau2[PRENOM],_xlfn.AGGREGATE(15,6,ROW(Tableau2[N° SIRET])-ROW('FICHIER '!$I$7)+1/(Tableau2[]=\"oui\"),ROW(6:6))),\"\")","v":"MARTIN"},{"$f":"IFERROR(INDEX(Tableau2[NOM],_xlfn.AGGREGATE(15,6,ROW(Tableau2[PRENOM])-ROW('FICHIER '!$I$7)+1/(Tableau2[]=\"oui\"),ROW(6:6))),\"\")","v":"FERNANDEZ"}]
[null,null,{"$f":"IFERROR(INDEX(Tableau2[CLIENT PROSPECT],_xlfn.AGGREGATE(15,6,ROW(Tableau2[SUIVIS])-ROW('FICHIER '!$I$7)+1/(Tableau2[]=\"oui\"),ROW(7:7))),\"\")","v":""},{"$f":"IFERROR(INDEX(Tableau2[PARTICULIER PROFESSIONNEL],_xlfn.AGGREGATE(15,6,ROW(Tableau2[CLIENT PROSPECT])-ROW('FICHIER '!$I$7)+1/(Tableau2[]=\"oui\"),ROW(7:7))),\"\")","v":""},{"$f":"IFERROR(INDEX(Tableau2[RAISON SOCIALE],_xlfn.AGGREGATE(15,6,ROW(Tableau2[PARTICULIER PROFESSIONNEL])-ROW('FICHIER '!$I$7)+1/(Tableau2[]=\"oui\"),ROW(7:7))),\"\")","v":""},{"$f":"IFERROR(INDEX(Tableau2[N° SIRET],_xlfn.AGGREGATE(15,6,ROW(Tableau2[RAISON SOCIALE])-ROW('FICHIER '!$I$7)+1/(Tableau2[]=\"oui\"),ROW(7:7))),\"\")","v":""},{"$f":"IFERROR(INDEX(Tableau2[PRENOM],_xlfn.AGGREGATE(15,6,ROW(Tableau2[N° SIRET])-ROW('FICHIER '!$I$7)+1/(Tableau2[]=\"oui\"),ROW(7:7))),\"\")","v":""},{"$f":"IFERROR(INDEX(Tableau2[NOM],_xlfn.AGGREGATE(15,6,ROW(Tableau2[PRENOM])-ROW('FICHIER '!$I$7)+1/(Tableau2[]=\"oui\"),ROW(7:7))),\"\")","v":""}]
[null,null,{"$f":"IFERROR(INDEX(Tableau2[CLIENT PROSPECT],_xlfn.AGGREGATE(15,6,ROW(Tableau2[SUIVIS])-ROW('FICHIER '!$I$7)+1/(Tableau2[]=\"oui\"),ROW(8:8))),\"\")","v":""},{"$f":"IFERROR(INDEX(Tableau2[PARTICULIER PROFESSIONNEL],_xlfn.AGGREGATE(15,6,ROW(Tableau2[CLIENT PROSPECT])-ROW('FICHIER '!$I$7)+1/(Tableau2[]=\"oui\"),ROW(8:8))),\"\")","v":""},{"$f":"IFERROR(INDEX(Tableau2[RAISON SOCIALE],_xlfn.AGGREGATE(15,6,ROW(Tableau2[PARTICULIER PROFESSIONNEL])-ROW('FICHIER '!$I$7)+1/(Tableau2[]=\"oui\"),ROW(8:8))),\"\")","v":""},{"$f":"IFERROR(INDEX(Tableau2[N° SIRET],_xlfn.AGGREGATE(15,6,ROW(Tableau2[RAISON SOCIALE])-ROW('FICHIER '!$I$7)+1/(Tableau2[]=\"oui\"),ROW(8:8))),\"\")","v":""},{"$f":"IFERROR(INDEX(Tableau2[PRENOM],_xlfn.AGGREGATE(15,6,ROW(Tableau2[N° SIRET])-ROW('FICHIER '!$I$7)+1/(Tableau2[]=\"oui\"),ROW(8:8))),\"\")","v":""},{"$f":"IFERROR(INDEX(Tableau2[NOM],_xlfn.AGGREGATE(15,6,ROW(Tableau2[PRENOM])-ROW('FICHIER '!$I$7)+1/(Tableau2[]=\"oui\"),ROW(8:8))),\"\")","v":""}]
[null,null,{"$f":"IFERROR(INDEX(Tableau2[CLIENT PROSPECT],_xlfn.AGGREGATE(15,6,ROW(Tableau2[SUIVIS])-ROW('FICHIER '!$I$7)+1/(Tableau2[]=\"oui\"),ROW(9:9))),\"\")","v":""},{"$f":"IFERROR(INDEX(Tableau2[PARTICULIER PROFESSIONNEL],_xlfn.AGGREGATE(15,6,ROW(Tableau2[CLIENT PROSPECT])-ROW('FICHIER '!$I$7)+1/(Tableau2[]=\"oui\"),ROW(9:9))),\"\")","v":""},{"$f":"IFERROR(INDEX(Tableau2[RAISON SOCIALE],_xlfn.AGGREGATE(15,6,ROW(Tableau2[PARTICULIER PROFESSIONNEL])-ROW('FICHIER '!$I$7)+1/(Tableau2[]=\"oui\"),ROW(9:9))),\"\")","v":""},{"$f":"IFERROR(INDEX(Tableau2[N° SIRET],_xlfn.AGGREGATE(15,6,ROW(Tableau2[RAISON SOCIALE])-ROW('FICHIER '!$I$7)+1/(Tableau2[]=\"oui\"),ROW(9:9))),\"\")","v":""},{"$f":"IFERROR(INDEX(Tableau2[PRENOM],_xlfn.AGGREGATE(15,6,ROW(Tableau2[N° SIRET])-ROW('FICHIER '!$I$7)+1/(Tableau2[]=\"oui\"),ROW(9:9))),\"\")","v":""},{"$f":"IFERROR(INDEX(Tableau2[NOM],_xlfn.AGGREGATE(15,6,ROW(Tableau2[PRENOM])-ROW('FICHIER '!$I$7)+1/(Tableau2[]=\"oui\"),ROW(9:9))),\"\")","v":""}]
[null,null,{"$f":"IFERROR(INDEX(Tableau2[CLIENT PROSPECT],_xlfn.AGGREGATE(15,6,ROW(Tableau2[SUIVIS])-ROW('FICHIER '!$I$7)+1/(Tableau2[]=\"oui\"),ROW(10:10))),\"\")","v":""},{"$f":"IFERROR(INDEX(Tableau2[PARTICULIER PROFESSIONNEL],_xlfn.AGGREGATE(15,6,ROW(Tableau2[CLIENT PROSPECT])-ROW('FICHIER '!$I$7)+1/(Tableau2[]=\"oui\"),ROW(10:10))),\"\")","v":""},{"$f":"IFERROR(INDEX(Tableau2[RAISON SOCIALE],_xlfn.AGGREGATE(15,6,ROW(Tableau2[PARTICULIER PROFESSIONNEL])-ROW('FICHIER '!$I$7)+1/(Tableau2[]=\"oui\"),ROW(10:10))),\"\")","v":""},{"$f":"IFERROR(INDEX(Tableau2[N° SIRET],_xlfn.AGGREGATE(15,6,ROW(Tableau2[RAISON SOCIALE])-ROW('FICHIER '!$I$7)+1/(Tableau2[]=\"oui\"),ROW(10:10))),\"\")","v":""},{"$f":"IFERROR(INDEX(Tableau2[PRENOM],_xlfn.AGGREGATE(15,6,ROW(Tableau2[N° SIRET])-ROW('FICHIER '!$I$7)+1/(Tableau2[]=\"oui\"),ROW(10:10))),\"\")","v":""},{"$f":"IFERROR(INDEX(Tableau2[NOM],_xlfn.AGGREGATE(15,6,ROW(Tableau2[PRENOM])-ROW('FICHIER '!$I$7)+1/(Tableau2[]=\"oui\"),ROW(10:10))),\"\")","v":""}]
[null,null,{"$f":"IFERROR(INDEX(Tableau2[CLIENT PROSPECT],_xlfn.AGGREGATE(15,6,ROW(Tableau2[SUIVIS])-ROW('FICHIER '!$I$7)+1/(Tableau2[]=\"oui\"),ROW(11:11))),\"\")","v":""},{"$f":"IFERROR(INDEX(Tableau2[PARTICULIER PROFESSIONNEL],_xlfn.AGGREGATE(15,6,ROW(Tableau2[CLIENT PROSPECT])-ROW('FICHIER '!$I$7)+1/(Tableau2[]=\"oui\"),ROW(11:11))),\"\")","v":""},{"$f":"IFERROR(INDEX(Tableau2[RAISON SOCIALE],_xlfn.AGGREGATE(15,6,ROW(Tableau2[PARTICULIER PROFESSIONNEL])-ROW('FICHIER '!$I$7)+1/(Tableau2[]=\"oui\"),ROW(11:11))),\"\")","v":""},{"$f":"IFERROR(INDEX(Tableau2[N° SIRET],_xlfn.AGGREGATE(15,6,ROW(Tableau2[RAISON SOCIALE])-ROW('FICHIER '!$I$7)+1/(Tableau2[]=\"oui\"),ROW(11:11))),\"\")","v":""},{"$f":"IFERROR(INDEX(Tableau2[PRENOM],_xlfn.AGGREGATE(15,6,ROW(Tableau2[N° SIRET])-ROW('FICHIER '!$I$7)+1/(Tableau2[]=\"oui\"),ROW(11:11))),\"\")","v":""},{"$f":"IFERROR(INDEX(Tableau2[NOM],_xlfn.AGGREGATE(15,6,ROW(Tableau2[PRENOM])-ROW('FICHIER '!$I$7)+1/(Tableau2[]=\"oui\"),ROW(11:11))),\"\")","v":""}]
[null,null,{"$f":"IFERROR(INDEX(Tableau2[CLIENT PROSPECT],_xlfn.AGGREGATE(15,6,ROW(Tableau2[SUIVIS])-ROW('FICHIER '!$I$7)+1/(Tableau2[]=\"oui\"),ROW(12:12))),\"\")","v":""},{"$f":"IFERROR(INDEX(Tableau2[PARTICULIER PROFESSIONNEL],_xlfn.AGGREGATE(15,6,ROW(Tableau2[CLIENT PROSPECT])-ROW('FICHIER '!$I$7)+1/(Tableau2[]=\"oui\"),ROW(12:12))),\"\")","v":""},{"$f":"IFERROR(INDEX(Tableau2[RAISON SOCIALE],_xlfn.AGGREGATE(15,6,ROW(Tableau2[PARTICULIER PROFESSIONNEL])-ROW('FICHIER '!$I$7)+1/(Tableau2[]=\"oui\"),ROW(12:12))),\"\")","v":""},{"$f":"IFERROR(INDEX(Tableau2[N° SIRET],_xlfn.AGGREGATE(15,6,ROW(Tableau2[RAISON SOCIALE])-ROW('FICHIER '!$I$7)+1/(Tableau2[]=\"oui\"),ROW(12:12))),\"\")","v":""},{"$f":"IFERROR(INDEX(Tableau2[PRENOM],_xlfn.AGGREGATE(15,6,ROW(Tableau2[N° SIRET])-ROW('FICHIER '!$I$7)+1/(Tableau2[]=\"oui\"),ROW(12:12))),\"\")","v":""},{"$f":"IFERROR(INDEX(Tableau2[NOM],_xlfn.AGGREGATE(15,6,ROW(Tableau2[PRENOM])-ROW('FICHIER '!$I$7)+1/(Tableau2[]=\"oui\"),ROW(12:12))),\"\")","v":""}]
[null,null,{"$f":"IFERROR(INDEX(Tableau2[CLIENT PROSPECT],_xlfn.AGGREGATE(15,6,ROW(Tableau2[SUIVIS])-ROW('FICHIER '!$I$7)+1/(Tableau2[]=\"oui\"),ROW(13:13))),\"\")","v":""},{"$f":"IFERROR(INDEX(Tableau2[PARTICULIER PROFESSIONNEL],_xlfn.AGGREGATE(15,6,ROW(Tableau2[CLIENT PROSPECT])-ROW('FICHIER '!$I$7)+1/(Tableau2[]=\"oui\"),ROW(13:13))),\"\")","v":""},{"$f":"IFERROR(INDEX(Tableau2[RAISON SOCIALE],_xlfn.AGGREGATE(15,6,ROW(Tableau2[PARTICULIER PROFESSIONNEL])-ROW('FICHIER '!$I$7)+1/(Tableau2[]=\"oui\"),ROW(13:13))),\"\")","v":""},{"$f":"IFERROR(INDEX(Tableau2[N° SIRET],_xlfn.AGGREGATE(15,6,ROW(Tableau2[RAISON SOCIALE])-ROW('FICHIER '!$I$7)+1/(Tableau2[]=\"oui\"),ROW(13:13))),\"\")","v":""},{"$f":"IFERROR(INDEX(Tableau2[PRENOM],_xlfn.AGGREGATE(15,6,ROW(Tableau2[N° SIRET])-ROW('FICHIER '!$I$7)+1/(Tableau2[]=\"oui\"),ROW(13:13))),\"\")","v":""},{"$f":"IFERROR(INDEX(Tableau2[NOM],_xlfn.AGGREGATE(15,6,ROW(Tableau2[PRENOM])-ROW('FICHIER '!$I$7)+1/(Tableau2[]=\"oui\"),ROW(13:13))),\"\")","v":""}]
[null,null,{"$f":"IFERROR(INDEX(Tableau2[CLIENT PROSPECT],_xlfn.AGGREGATE(15,6,ROW(Tableau2[SUIVIS])-ROW('FICHIER '!$I$7)+1/(Tableau2[]=\"oui\"),ROW(14:14))),\"\")","v":""},{"$f":"IFERROR(INDEX(Tableau2[PARTICULIER PROFESSIONNEL],_xlfn.AGGREGATE(15,6,ROW(Tableau2[CLIENT PROSPECT])-ROW('FICHIER '!$I$7)+1/(Tableau2[]=\"oui\"),ROW(14:14))),\"\")","v":""},{"$f":"IFERROR(INDEX(Tableau2[RAISON SOCIALE],_xlfn.AGGREGATE(15,6,ROW(Tableau2[PARTICULIER PROFESSIONNEL])-ROW('FICHIER '!$I$7)+1/(Tableau2[]=\"oui\"),ROW(14:14))),\"\")","v":""},{"$f":"IFERROR(INDEX(Tableau2[N° SIRET],_xlfn.AGGREGATE(15,6,ROW(Tableau2[RAISON SOCIALE])-ROW('FICHIER '!$I$7)+1/(Tableau2[]=\"oui\"),ROW(14:14))),\"\")","v":""},{"$f":"IFERROR(INDEX(Tableau2[PRENOM],_xlfn.AGGREGATE(15,6,ROW(Tableau2[N° SIRET])-ROW('FICHIER '!$I$7)+1/(Tableau2[]=\"oui\"),ROW(14:14))),\"\")","v":""},{"$f":"IFERROR(INDEX(Tableau2[NOM],_xlfn.AGGREGATE(15,6,ROW(Tableau2[PRENOM])-ROW('FICHIER '!$I$7)+1/(Tableau2[]=\"oui\"),ROW(14:14))),\"\")","v":""}]
{"$rows_left_out":31}
{"sheet":"FICHIER ","index":2,"n_rows":18,"n_cols":9,"rows_kept":18,"cut":false,"hidden":false,"merged":[]}
[]
[]
[]
[]
[]
[null,null,"CLIENT PROSPECT","PARTICULIER PROFESSIONNEL","RAISON SOCIALE","N° SIRET","PRENOM","NOM","SUIVIS"]
[null,null,"CLIENT","PARTICULIER","aaaa",null,"FREDERIC","DURAND","oui"]
[null,null,"CLIENT","PARTICULIER",null,null,"FLORIAN","FERNANDEZ","oui"]
[null,null,"PROSPECT","PARTCULIER",null,null,"FERNAND","LOPEZ","oui"]
[null,null,"PROSPECT","PROFESSIONNEL",null,null,"LOIC","PEREZ","oui"]
[null,null,"CLIENT","PARTICULIER",null,null,"REMY","DURAND","oui"]
[null,null,"CLIENT","PARTICULIER",null,null,"MARTIN","FERNANDEZ","oui"]
[null,null,null,null,null,null,"lid","lid"]
[null,null,null,null,null,null,"fsd","fds"]
[null,null,null,null,null,null,"kok","ko"]
[null,null,null,null,null,null,"jk","jk"]
[null,null,null,null,null,null,"ljh","dsq"]
[null,null,null,null,null,null,"pop","dsq"]