{"text_format":"1","workbook":"xlsx","n_sheets":3,"sheets":["Menu","Saisie1","Liste1"],"not_rendered":{"charts":0,"images":1,"macros":1,"external_links":0,"defined_names":12,"comments":1,"pivot_tables":0},"unopened":[],"bounds":{"document_bytes":16777216,"sheet_cells":100000,"rows_first":2000,"rows_last":500,"rows_between":2000,"halvings":0,"cell_chars":16384,"cell_head_chars":4096},"cells_cut":0,"cells_raw":0,"read":"whole","date_system":"1900"}

{"sheet":"Menu","index":0,"n_rows":0,"n_cols":0,"rows_kept":0,"cut":false,"hidden":true,"merged":[]}

{"sheet":"Saisie1","index":1,"n_rows":606,"n_cols":24,"rows_kept":606,"cut":false,"hidden":false,"merged":[[6,8,7,8],[4,9,5,9],[0,0,0,16],[2,0,2,16],[4,8,5,8],[4,3,5,4],[4,2,5,2],[4,0,5,1],[6,3,6,4],[7,3,7,4]]}
["Largeur des colonnes"]
[9.43,3,23,8.86,3,"zéro","zéro",24.14,11.57,11.57,"zéro","zéro","zéro","zéro",2,"zéro",69.569999999999993,14.29]
["Totaux des colonnes"]
[null,null,null,null,null,null,{"$f":"SUM(G12:G3071)","v":-210},null,{"$f":"SUM(I12:I3071)","v":8463.1299999999956},{"$f":"SUM(J12:J3071)","v":5260},null,null,null,null,null,{"$f":"SUM(P12:P3071)","v":-210}]
[]
[null,null,null,null,null,null,null,"All"]
[null,null,null,null,null,null,null,{"$f":"SUMIF($H$11:$H$2202,H6,$I$11:$I$2202)","v":0}]
[null,null,null,null,null,null,{"$f":"SUM(G12:G479)","v":-210},{"$f":"SUMIF($H$11:$H$2202,H6,$J$11:$J$2202)","v":0}]
[null,null,null,null,null,"Prévisions","Cumul prévis",null,null,null,"1 auto prévis","Cumul","pointé débit","pointé crédit",0.5,"tous pointés"]
[]
[null,null,null,null,null,null,null," "]
["2023-01-01",5,{"$f":"IF(B12=\"\",\"\",VLOOKUP(B12,Liste1!$F$2:$I$9,2))","v":"Essai 5"},null,1,{"$f":"IF(B12=Liste1!$F$9,Liste1!$F$9*E12*100+MONTH($A12),0)","v":0},{"$f":"IF(B12=Liste1!$F$9,J12-I12,0)","v":0},{"$f":"IF(E12=\"\",\"\",VLOOKUP(E12,Liste1!$A$2:$B$41,2))","v":"Harry Cover"},50,null,{"$f":"IF($B12=Liste1!$F$9,1,0)","v":0},{"$f":"IF(I12+J12=0,\"\",(E12*100+(YEAR($A12)+MONTH($A12)+MONTH($A12)))/((YEAR($A12))))","v":1.0504201680672269},{"$f":"IF(O12+K12>0,I12,\"\")","v":""},{"$f":"IF(O12+K12>0,J12,\"\")","v":""},null,{"$f":"IF(O12+K12=0,\"\",(J12-I12))","v":""}]
["2023-01-03",5,{"$f":"IF(B13=\"\",\"\",VLOOKUP(B13,Liste1!$F$2:$I$9,2))","v":"Essai 5"},null,1,{"$f":"IF(B13=Liste1!$F$9,Liste1!$F$9*E13*100+MONTH($A13),0)","v":0},{"$f":"IF(B13=Liste1!$F$9,J13-I13,0)","v":0},{"$f":"IF(E13=\"\",\"\",VLOOKUP(E13,Liste1!$A$2:$B$41,2))","v":"Harry Cover"},55,null,{"$f":"IF($B13=Liste1!$F$9,1,0)","v":0},{"$f":"IF(I13+J13=0,\"\",(E13*100+(YEAR($A13)+MONTH($A13)+MONTH($A13)))/((YEAR($A13))))","v":1.0504201680672269},{"$f":"IF(O13+K13>0,I13,\"\")","v":""},{"$f":"IF(O13+K13>0,J13,\"\")","v":""},null,{"$f":"IF(O13+K13=0,\"\",(J13-I13))","v":""}]
["2023-02-01",5,{"$f":"IF(B14=\"\",\"\",VLOOKUP(B14,Liste1!$F$2:$I$9,2))","v":"Essai 5"},null,1,{"$f":"IF(B14=Liste1!$F$9,Liste1!$F$9*E14*100+MONTH($A14),0)","v":0},{"$f":"IF(B14=Liste1!$F$9,J14-I14,0)","v":0},{"$f":"IF(E14=\"\",\"\",VLOOKUP(E14,Liste1!$A$2:$B$41,2))","v":"Harry Cover"},46,null,{"$f":"IF($B14=Liste1!$F$9,1,0)","v":0},{"$f":"IF(I14+J14=0,\"\",(E14*100+(YEAR($A14)+MONTH($A14)+MONTH($A14)))/((YEAR($A14))))","v":1.0514087988136431},{"$f":"IF(O14+K14>0,I14,\"\")","v":""},{"$f":"IF(O14+K14>0,J14,\"\")","v":""},null,{"$f":"IF(O14+K14=0,\"\",(J14-I14))","v":""}]
["2023-03-01",5,{"$f":"IF(B15=\"\",\"\",VLOOKUP(B15,Liste1!$F$2:$I$9,2))","v":"Essai 5"},null,1,{"$f":"IF(B15=Liste1!$F$9,Liste1!$F$9*E15*100+MONTH($A15),0)","v":0},{"$f":"IF(B15=Liste1!$F$9,J15-I15,0)","v":0},{"$f":"IF(E15=\"\",\"\",VLOOKUP(E15,Liste1!$A$2:$B$41,2))","v":"Harry Cover"},78,null,{"$f":"IF($B15=Liste1!$F$9,1,0)","v":0},{"$f":"IF(I15+J15=0,\"\",(E15*100+(YEAR($A15)+MONTH($A15)+MONTH($A15)))/((YEAR($A15))))","v":1.0523974295600593},{"$f":"IF(O15+K15>0,I15,\"\")","v":""},{"$f":"IF(O15+K15>0,J15,\"\")","v":""},null,{"$f":"IF(O15+K15=0,\"\",(J15-I15))","v":""}]
["2023-04-03",5,{"$f":"IF(B16=\"\",\"\",VLOOKUP(B16,Liste1!$F$2:$I$9,2))","v":"Essai 5"},null,1,{"$f":"IF(B16=Liste1!$F$9,Liste1!$F$9*E16*100+MONTH($A16),0)","v":0},{"$f":"IF(B16=Liste1!$F$9,J16-I16,0)","v":0},{"$f":"IF(E16=\"\",\"\",VLOOKUP(E16,Liste1!$A$2:$B$41,2))","v":"Harry Cover"},32,null,{"$f":"IF($B16=Liste1!$F$9,1,0)","v":0},{"$f":"IF(I16+J16=0,\"\",(E16*100+(YEAR($A16)+MONTH($A16)+MONTH($A16)))/((YEAR($A16))))","v":1.0533860603064755},{"$f":"IF(O16+K16>0,I16,\"\")","v":""},{"$f":"IF(O16+K16>0,J16,\"\")","v":""},null,{"$f":"IF(O16+K16=0,\"\",(J16-I16))","v":""}]
["2023-05-03",5,{"$f":"IF(B17=\"\",\"\",VLOOKUP(B17,Liste1!$F$2:$I$9,2))","v":"Essai 5"},null,1,{"$f":"IF(B17=Liste1!$F$9,Liste1!$F$9*E17*100+MONTH($A17),0)","v":0},{"$f":"IF(B17=Liste1!$F$9,J17-I17,0)","v":0},{"$f":"IF(E17=\"\",\"\",VLOOKUP(E17,Liste1!$A$2:$B$41,2))","v":"Harry Cover"},72,null,{"$f":"IF($B17=Liste1!$F$9,1,0)","v":0},{"$f":"IF(I17+J17=0,\"\",(E17*100+(YEAR($A17)+MONTH($A17)+MONTH($A17)))/((YEAR($A17))))","v":1.0543746910528917},{"$f":"IF(O17+K17>0,I17,\"\")","v":""},{"$f":"IF(O17+K17>0,J17,\"\")","v":""},null,{"$f":"IF(O17+K17=0,\"\",(J17-I17))","v":""}]
["2023-06-03",5,{"$f":"IF(B18=\"\",\"\",VLOOKUP(B18,Liste1!$F$2:$I$9,2))","v":"Essai 5"},null,1,{"$f":"IF(B18=Liste1!$F$9,Liste1!$F$9*E18*100+MONTH($A18),0)","v":0},{"$f":"IF(B18=Liste1!$F$9,J18-I18,0)","v":0},{"$f":"IF(E18=\"\",\"\",VLOOKUP(E18,Liste1!$A$2:$B$41,2))","v":"Harry Cover"},120,null,{"$f":"IF($B18=Liste1!$F$9,1,0)","v":0},{"$f":"IF(B18=7,\"\",(E18*100+(YEAR($A18)+MONTH($A18)+MONTH($A18)))/((YEAR($A18))))","v":1.0553633217993079},{"$f":"IF(O18+K18>0,I18,\"\")","v":""},{"$f":"IF(O18+K18>0,J18,\"\")","v":""},null,{"$f":"IF(O18+K18=0,\"\",(J18-I18))","v":""}]
["2023-07-03",5,{"$f":"IF(B19=\"\",\"\",VLOOKUP(B19,Liste1!$F$2:$I$9,2))","v":"Essai 5"},null,1,{"$f":"IF(B19=Liste1!$F$9,Liste1!$F$9*E19*100+MONTH($A19),0)","v":0},{"$f":"IF(B19=Liste1!$F$9,J19-I19,0)","v":0},{"$f":"IF(E19=\"\",\"\",VLOOKUP(E19,Liste1!$A$2:$B$41,2))","v":"Harry Cover"},null,1000,{"$f":"IF($B19=Liste1!$F$9,1,0)","v":0},{"$f":"IF(B19=7,\"\",(E19*100+(YEAR($A19)+MONTH($A19)+MONTH($A19)))/((YEAR($A19))))","v":1.0563519525457241},{"$f":"IF(O19+K19>0,I19,\"\")","v":""},{"$f":"IF(O19+K19>0,J19,\"\")","v":""},null,{"$f":"IF(O19+K19=0,\"\",(J19-I19))","v":""}]
["2023-08-10",5,{"$f":"IF(B20=\"\",\"\",VLOOKUP(B20,Liste1!$F$2:$I$9,2))","v":"Essai 5"},null,1,{"$f":"IF(B20=Liste1!$F$9,Liste1!$F$9*E20*100+MONTH($A20),0)","v":0},{"$f":"IF(B20=Liste1!$F$9,J20-I20,0)","v":0},{"$f":"IF(E20=\"\",\"\",VLOOKUP(E20,Liste1!$A$2:$B$41,2))","v":"Harry Cover"},null,1000,{"$f":"IF($B20=Liste1!$F$9,1,0)","v":0},{"$f":"IF(B20=7,\"\",(E20*100+(YEAR($A20)+MONTH($A20)+MONTH($A20)))/((YEAR($A20))))","v":1.0573405832921403},{"$f":"IF(O20+K20>0,I20,\"\")","v":""},{"$f":"IF(O20+K20>0,J20,\"\")","v":""},null,{"$f":"IF(O20+K20=0,\"\",(J20-I20))","v":""}]
["2023-09-10",5,{"$f":"IF(B21=\"\",\"\",VLOOKUP(B21,Liste1!$F$2:$I$9,2))","v":"Essai 5"},null,1,{"$f":"IF(B21=Liste1!$F$9,Liste1!$F$9*E21*100+MONTH($A21),0)","v":0},{"$f":"IF(B21=Liste1!$F$9,J21-I21,0)","v":0},{"$f":"IF(E21=\"\",\"\",VLOOKUP(E21,Liste1!$A$2:$B$41,2))","v":"Harry Cover"},null,1000,{"$f":"IF($B21=Liste1!$F$9,1,0)","v":0},{"$f":"IF(I21+J21=0,\"\",(E21*100+(YEAR($A21)+MONTH($A21)+MONTH($A21)))/((YEAR($A21))))","v":1.0583292140385565},{"$f":"IF(O21+K21>0,I21,\"\")","v":""},{"$f":"IF(O21+K21>0,J21,\"\")","v":""},null,{"$f":"IF(O21+K21=0,\"\",(J21-I21))","v":""}]
["2023-10-10",5,{"$f":"IF(B22=\"\",\"\",VLOOKUP(B22,Liste1!$F$2:$I$9,2))","v":"Essai 5"},null,1,{"$f":"IF(B22=Liste1!$F$9,Liste1!$F$9*E22*100+MONTH($A22),0)","v":0},{"$f":"IF(B22=Liste1!$F$9,J22-I22,0)","v":0},{"$f":"IF(E22=\"\",\"\",VLOOKUP(E22,Liste1!$A$2:$B$41,2))","v":"Harry Cover"},null,1000,{"$f":"IF($B22=Liste1!$F$9,1,0)","v":0},{"$f":"IF(I22+J22=0,\"\",(E22*100+(YEAR($A22)+MONTH($A22)+MONTH($A22)))/((YEAR($A22))))","v":1.0593178447849727},{"$f":"IF(O22+K22>0,I22,\"\")","v":""},{"$f":"IF(O22+K22>0,J22,\"\")","v":""},null,{"$f":"IF(O22+K22=0,\"\",(J22-I22))","v":""}]
["2023-01-01",5,{"$f":"IF(B23=\"\",\"\",VLOOKUP(B23,Liste1!$F$2:$I$9,2))","v":"Essai 5"},null,2,{"$f":"IF(B23=Liste1!$F$9,Liste1!$F$9*E23*100+MONTH($A23),0)","v":0},{"$f":"IF(B23=Liste1!$F$9,J23-I23,0)","v":0},{"$f":"IF(E23=\"\",\"\",VLOOKUP(E23,Liste1!$A$2:$B$41,2))","v":"Gérard Menvussat"},100,null,{"$f":"IF($B23=Liste1!$F$9,1,0)","v":0},{"$f":"IF(I23+J23=0,\"\",(E23*100+(YEAR($A23)+MONTH($A23)+MONTH($A23)))/((YEAR($A23))))","v":1.0998517053880377},{"$f":"IF(O23+K23>0,I23,\"\")","v":""},{"$f":"IF(O23+K23>0,J23,\"\")","v":""},null,{"$f":"IF(O23+K23=0,\"\",(J23-I23))","v":""}]
["2023-02-01",5,{"$f":"IF(B24=\"\",\"\",VLOOKUP(B24,Liste1!$F$2:$I$9,2))","v":"Essai 5"},null,2,{"$f":"IF(B24=Liste1!$F$9,Liste1!$F$9*E24*100+MONTH($A24),0)","v":0},{"$f":"IF(B24=Liste1!$F$9,J24-I24,0)","v":0},{"$f":"IF(E24=\"\",\"\",VLOOKUP(E24,Liste1!$A$2:$B$41,2))","v":"Gérard Menvussat"},100,null,{"$f":"IF($B24=Liste1!$F$9,1,0)","v":0},{"$f":"IF(I24+J24=0,\"\",(E24*100+(YEAR($A24)+MONTH($A24)+MONTH($A24)))/((YEAR($A24))))","v":1.1008403361344539},{"$f":"IF(O24+K24>0,I24,\"\")","v":""},{"$f":"IF(O24+K24>0,J24,\"\")","v":""},null,{"$f":"IF(O24+K24=0,\"\",(J24-I24))","v":""}]
["2023-03-01",5,{"$f":"IF(B25=\"\",\"\",VLOOKUP(B25,Liste1!$F$2:$I$9,2))","v":"Essai 5"},null,2,{"$f":"IF(B25=Liste1!$F$9,Liste1!$F$9*E25*100+MONTH($A25),0)","v":0},{"$f":"IF(B25=Liste1!$F$9,J25-I25,0)","v":0},{"$f":"IF(E25=\"\",\"\",VLOOKUP(E25,Liste1!$A$2:$B$41,2))","v":"Gérard Menvussat"},null,700,{"$f":"IF($B25=Liste1!$F$9,1,0)","v":0},{"$f":"IF(I25+J25=0,\"\",(E25*100+(YEAR($A25)+MONTH($A25)+MONTH($A25)))/((YEAR($A25))))","v":1.1018289668808701},{"$f":"IF(O25+K25>0,I25,\"\")","v":""},{"$f":"IF(O25+K25>0,J25,\"\")","v":""},null,{"$f":"IF(O25+K25=0,\"\",(J25-I25))","v":""}]
["2023-04-03",5,{"$f":"IF(B26=\"\",\"\",VLOOKUP(B26,Liste1!$F$2:$I$9,2))","v":"Essai 5"},null,2,{"$f":"IF(B26=Liste1!$F$9,Liste1!$F$9*E26*100+MONTH($A26),0)","v":0},{"$f":"IF(B26=Liste1!$F$9,J26-I26,0)","v":0},{"$f":"IF(E26=\"\",\"\",VLOOKUP(E26,Liste1!$A$2:$B$41,2))","v":"Gérard Menvussat"},700,null,{"$f":"IF($B26=Liste1!$F$9,1,0)","v":0},{"$f":"IF(I26+J26=0,\"\",(E26*100+(YEAR($A26)+MONTH($A26)+MONTH($A26)))/((YEAR($A26))))","v":1.1028175976272863},{"$f":"IF(O26+K26>0,I26,\"\")","v":""},{"$f":"IF(O26+K26>0,J26,\"\")","v":""},null,{"$f":"IF(O26+K26=0,\"\",(J26-I26))","v":""}]
["2023-05-03",5,{"$f":"IF(B27=\"\",\"\",VLOOKUP(B27,Liste1!$F$2:$I$9,2))","v":"Essai 5"},null,2,{"$f":"IF(B27=Liste1!$F$9,Liste1!$F$9*E27*100+MONTH($A27),0)","v":0},{"$f":"IF(B27=Liste1!$F$9,J27-I27,0)","v":0},{"$f":"IF(E27=\"\",\"\",VLOOKUP(E27,Liste1!$A$2:$B$41,2))","v":"Gérard Menvussat"},700,null,{"$f":"IF($B27=Liste1!$F$9,1,0)","v":0},{"$f":"IF(I27+J27=0,\"\",(E27*100+(YEAR($A27)+MONTH($A27)+MONTH($A27)))/((YEAR($A27))))","v":1.1038062283737025},{"$f":"IF(O27+K27>0,I27,\"\")","v":""},{"$f":"IF(O27+K27>0,J27,\"\")","v":""},null,{"$f":"IF(O27+K27=0,\"\",(J27-I27))","v":""}]
["2023-06-03",5,{"$f":"IF(B28=\"\",\"\",VLOOKUP(B28,Liste1!$F$2:$I$9,2))","v":"Essai 5"},null,2,{"$f":"IF(B28=Liste1!$F$9,Liste1!$F$9*E28*100+MONTH($A28),0)","v":0},{"$f":"IF(B28=Liste1!$F$9,J28-I28,0)","v":0},{"$f":"IF(E28=\"\",\"\",VLOOKUP(E28,Liste1!$A$2:$B$41,2))","v":"Gérard Menvussat"},700,null,{"$f":"IF($B28=Liste1!$F$9,1,0)","v":0},{"$f":"IF(B28=7,\"\",(E28*100+(YEAR($A28)+MONTH($A28)+MONTH($A28)))/((YEAR($A28))))","v":1.1047948591201187},{"$f":"IF(O28+K28>0,I28,\"\")","v":""},{"$f":"IF(O28+K28>0,J28,\"\")","v":""},null,{"$f":"IF(O28+K28=0,\"\",(J28-I28))","v":""}]
["2023-07-03",5,{"$f":"IF(B29=\"\",\"\",VLOOKUP(B29,Liste1!$F$2:$I$9,2))","v":"Essai 5"},null,2,{"$f":"IF(B29=Liste1!$F$9,Liste1!$F$9*E29*100+MONTH($A29),0)","v":0},{"$f":"IF(B29=Liste1!$F$9,J29-I29,0)","v":0},{"$f":"IF(E29=\"\",\"\",VLOOKUP(E29,Liste1!$A$2:$B$41,2))","v":"Gérard Menvussat"},null,15,{"$f":"IF($B29=Liste1!$F$9,1,0)","v":0},{"$f":"IF(B29=7,\"\",(E29*100+(YEAR($A29)+MONTH($A29)+MONTH($A29)))/((YEAR($A29))))","v":1.1057834898665349},{"$f":"IF(O29+K29>0,I29,\"\")","v":""},{"$f":"IF(O29+K29>0,J29,\"\")","v":""},null,{"$f":"IF(O29+K29=0,\"\",(J29-I29))","v":""}]
["2023-08-01",5,{"$f":"IF(B30=\"\",\"\",VLOOKUP(B30,Liste1!$F$2:$I$9,2))","v":"Essai 5"},null,2,{"$f":"IF(B30=Liste1!$F$9,Liste1!$F$9*E30*100+MONTH($A30),0)","v":0},{"$f":"IF(B30=Liste1!$F$9,J30-I30,0)","v":0},{"$f":"IF(E30=\"\",\"\",VLOOKUP(E30,Liste1!$A$2:$B$41,2))","v":"Gérard Menvussat"},null,15,{"$f":"IF($B30=Liste1!$F$9,1,0)","v":0},{"$f":"IF(B30=7,\"\",(E30*100+(YEAR($A30)+MONTH($A30)+MONTH($A30)))/((YEAR($A30))))","v":1.106772120612951},{"$f":"IF(O30+K30>0,I30,\"\")","v":""},{"$f":"IF(O30+K30>0,J30,\"\")","v":""},null,{"$f":"IF(O30+K30=0,\"\",(J30-I30))","v":""}]
["2023-09-01",5,{"$f":"IF(B31=\"\",\"\",VLOOKUP(B31,Liste1!$F$2:$I$9,2))","v":"Essai 5"},null,2,{"$f":"IF(B31=Liste1!$F$9,Liste1!$F$9*E31*100+MONTH($A31),0)","v":0},{"$f":"IF(B31=Liste1!$F$9,J31-I31,0)","v":0},{"$f":"IF(E31=\"\",\"\",VLOOKUP(E31,Liste1!$A$2:$B$41,2))","v":"Gérard Menvussat"},null,16,{"$f":"IF($B31=Liste1!$F$9,1,0)","v":0},{"$f":"IF(I31+J31=0,\"\",(E31*100+(YEAR($A31)+MONTH($A31)+MONTH($A31)))/((YEAR($A31))))","v":1.1077607513593672},{"$f":"IF(O31+K31>0,I31,\"\")","v":""},{"$f":"IF(O31+K31>0,J31,\"\")","v":""},null,{"$f":"IF(O31+K31=0,\"\",(J31-I31))","v":""}]
["2023-10-01",5,{"$f":"IF(B32=\"\",\"\",VLOOKUP(B32,Liste1!$F$2:$I$9,2))","v":"Essai 5"},null,2,{"$f":"IF(B32=Liste1!$F$9,Liste1!$F$9*E32*100+MONTH($A32),0)","v":0},{"$f":"IF(B32=Liste1!$F$9,J32-I32,0)","v":0},{"$f":"IF(E32=\"\",\"\",VLOOKUP(E32,Liste1!$A$2:$B$41,2))","v":"Gérard Menvussat"},null,19,{"$f":"IF($B32=Liste1!$F$9,1,0)","v":0},{"$f":"IF(I32+J32=0,\"\",(E32*100+(YEAR($A32)+MONTH($A32)+MONTH($A32)))/((YEAR($A32))))","v":1.1087493821057834},{"$f":"IF(O32+K32>0,I32,\"\")","v":""},{"$f":"IF(O32+K32>0,J32,\"\")","v":""},null,{"$f":"IF(O32+K32=0,\"\",(J32-I32))","v":""}]
["2023-07-02",3,{"$f":"IF(B33=\"\",\"\",VLOOKUP(B33,Liste1!$F$2:$I$9,2))","v":"Essai 3"},null,3,{"$f":"IF(B33=Liste1!$F$9,Liste1!$F$9*E33*100+MONTH($A33),0)","v":0},{"$f":"IF(B33=Liste1!$F$9,J33-I33,0)","v":0},{"$f":"IF(E33=\"\",\"\",VLOOKUP(E33,Liste1!$A$2:$B$41,2))","v":"Sarah Pelle"},300,null,{"$f":"IF($B33=Liste1!$F$9,1,0)","v":0},{"$f":"IF(B33=7,\"\",(E33*100+(YEAR($A33)+MONTH($A33)+MONTH($A33)))/((YEAR($A33))))","v":1.1552150271873456},{"$f":"IF(O33+K33>0,I33,\"\")","v":""},{"$f":"IF(O33+K33>0,J33,\"\")","v":""},null,{"$f":"IF(O33+K33=0,\"\",(J33-I33))","v":""}]
["2023-07-02",3,{"$f":"IF(B34=\"\",\"\",VLOOKUP(B34,Liste1!$F$2:$I$9,2))","v":"Essai 3"},null,3,{"$f":"IF(B34=Liste1!$F$9,Liste1!$F$9*E34*100+MONTH($A34),0)","v":0},{"$f":"IF(B34=Liste1!$F$9,J34-I34,0)","v":0},{"$f":"IF(E34=\"\",\"\",VLOOKUP(E34,Liste1!$A$2:$B$41,2))","v":"Sarah Pelle"},40,null,{"$f":"IF($B34=Liste1!$F$9,1,0)","v":0},{"$f":"IF(B34=7,\"\",(E34*100+(YEAR($A34)+MONTH($A34)+MONTH($A34)))/((YEAR($A34))))","v":1.1552150271873456},{"$f":"IF(O34+K34>0,I34,\"\")","v":""},{"$f":"IF(O34+K34>0,J34,\"\")","v":""},null,{"$f":"IF(O34+K34=0,\"\",(J34-I34))","v":""}]
["2023-07-02",5,{"$f":"IF(B35=\"\",\"\",VLOOKUP(B35,Liste1!$F$2:$I$9,2))","v":"Essai 5"},null,3,{"$f":"IF(B35=Liste1!$F$9,Liste1!$F$9*E35*100+MONTH($A35),0)","v":0},{"$f":"IF(B35=Liste1!$F$9,J35-I35,0)","v":0},{"$f":"IF(E35=\"\",\"\",VLOOKUP(E35,Liste1!$A$2:$B$41,2))","v":"Sarah Pelle"},null,64,{"$f":"IF($B35=Liste1!$F$9,1,0)","v":0},{"$f":"IF(B35=7,\"\",(E35*100+(YEAR($A35)+MONTH($A35)+MONTH($A35)))/((YEAR($A35))))","v":1.1552150271873456},{"$f":"IF(O35+K35>0,I35,\"\")","v":""},{"$f":"IF(O35+K35>0,J35,\"\")","v":""},null,{"$f":"IF(O35+K35=0,\"\",(J35-I35))","v":""}]
["2023-07-02",5,{"$f":"IF(B36=\"\",\"\",VLOOKUP(B36,Liste1!$F$2:$I$9,2))","v":"Essai 5"},null,3,{"$f":"IF(B36=Liste1!$F$9,Liste1!$F$9*E36*100+MONTH($A36),0)","v":0},{"$f":"IF(B36=Liste1!$F$9,J36-I36,0)","v":0},{"$f":"IF(E36=\"\",\"\",VLOOKUP(E36,Liste1!$A$2:$B$41,2))","v":"Sarah Pelle"},null,32,{"$f":"IF($B36=Liste1!$F$9,1,0)","v":0},{"$f":"IF(B36=7,\"\",(E36*100+(YEAR($A36)+MONTH($A36)+MONTH($A36)))/((YEAR($A36))))","v":1.1552150271873456},{"$f":"IF(O36+K36>0,I36,\"\")","v":""},{"$f":"IF(O36+K36>0,J36,\"\")","v":""},null,{"$f":"IF(O36+K36=0,\"\",(J36-I36))","v":""}]
["2023-03-10",3,{"$f":"IF(B37=\"\",\"\",VLOOKUP(B37,Liste1!$F$2:$I$9,2))","v":"Essai 3"},null,4,{"$f":"IF(B37=Liste1!$F$9,Liste1!$F$9*E37*100+MONTH($A37),0)","v":0},{"$f":"IF(B37=Liste1!$F$9,J37-I37,0)","v":0},{"$f":"IF(E37=\"\",\"\",VLOOKUP(E37,Liste1!$A$2:$B$41,2))","v":"Aldo Berman"},100,null,{"$f":"IF($B37=Liste1!$F$9,1,0)","v":0},{"$f":"IF(I37+J37=0,\"\",(E37*100+(YEAR($A37)+MONTH($A37)+MONTH($A37)))/((YEAR($A37))))","v":1.2006920415224913},{"$f":"IF(O37+K37>0,I37,\"\")","v":""},{"$f":"IF(O37+K37>0,J37,\"\")","v":""},null,{"$f":"IF(O37+K37=0,\"\",(J37-I37))","v":""}]
["2023-04-10",3,{"$f":"IF(B38=\"\",\"\",VLOOKUP(B38,Liste1!$F$2:$I$9,2))","v":"Essai 3"},null,4,{"$f":"IF(B38=Liste1!$F$9,Liste1!$F$9*E38*100+MONTH($A38),0)","v":0},{"$f":"IF(B38=Liste1!$F$9,J38-I38,0)","v":0},{"$f":"IF(E38=\"\",\"\",VLOOKUP(E38,Liste1!$A$2:$B$41,2))","v":"Aldo Berman"},100,null,{"$f":"IF($B38=Liste1!$F$9,1,0)","v":0},{"$f":"IF(I38+J38=0,\"\",(E38*100+(YEAR($A38)+MONTH($A38)+MONTH($A38)))/((YEAR($A38))))","v":1.2016806722689075},{"$f":"IF(O38+K38>0,I38,\"\")","v":""},{"$f":"IF(O38+K38>0,J38,\"\")","v":""},null,{"$f":"IF(O38+K38=0,\"\",(J38-I38))","v":""}]
["2023-05-10",3,{"$f":"IF(B39=\"\",\"\",VLOOKUP(B39,Liste1!$F$2:$I$9,2))","v":"Essai 3"},null,4,{"$f":"IF(B39=Liste1!$F$9,Liste1!$F$9*E39*100+MONTH($A39),0)","v":0},{"$f":"IF(B39=Liste1!$F$9,J39-I39,0)","v":0},{"$f":"IF(E39=\"\",\"\",VLOOKUP(E39,Liste1!$A$2:$B$41,2))","v":"Aldo Berman"},100,null,{"$f":"IF($B39=Liste1!$F$9,1,0)","v":0},{"$f":"IF(B39=7,\"\",(E39*100+(YEAR($A39)+MONTH($A39)+MONTH($A39)))/((YEAR($A39))))","v":1.2026693030153237},{"$f":"IF(O39+K39>0,I39,\"\")","v":""},{"$f":"IF(O39+K39>0,J39,\"\")","v":""},null,{"$f":"IF(O39+K39=0,\"\",(J39-I39))","v":""}]
["2023-06-10",3,{"$f":"IF(B40=\"\",\"\",VLOOKUP(B40,Liste1!$F$2:$I$9,2))","v":"Essai 3"},null,4,{"$f":"IF(B40=Liste1!$F$9,Liste1!$F$9*E40*100+MONTH($A40),0)","v":0},{"$f":"IF(B40=Liste1!$F$9,J40-I40,0)","v":0},{"$f":"IF(E40=\"\",\"\",VLOOKUP(E40,Liste1!$A$2:$B$41,2))","v":"Aldo Berman"},100,null,{"$f":"IF($B40=Liste1!$F$9,1,0)","v":0},{"$f":"IF(B40=7,\"\",(E40*100+(YEAR($A40)+MONTH($A40)+MONTH($A40)))/((YEAR($A40))))","v":1.2036579337617399},{"$f":"IF(O40+K40>0,I40,\"\")","v":""},{"$f":"IF(O40+K40>0,J40,\"\")","v":""},null,{"$f":"IF(O40+K40=0,\"\",(J40-I40))","v":""}]
["2023-07-10",3,{"$f":"IF(B41=\"\",\"\",VLOOKUP(B41,Liste1!$F$2:$I$9,2))","v":"Essai 3"},null,4,{"$f":"IF(B41=Liste1!$F$9,Liste1!$F$9*E41*100+MONTH($A41),0)","v":0},{"$f":"IF(B41=Liste1!$F$9,J41-I41,0)","v":0},{"$f":"IF(E41=\"\",\"\",VLOOKUP(E41,Liste1!$A$2:$B$41,2))","v":"Aldo Berman"},100,null,{"$f":"IF($B41=Liste1!$F$9,1,0)","v":0},{"$f":"IF(B41=7,\"\",(E41*100+(YEAR($A41)+MONTH($A41)+MONTH($A41)))/((YEAR($A41))))","v":1.2046465645081561},{"$f":"IF(O41+K41>0,I41,\"\")","v":""},{"$f":"IF(O41+K41>0,J41,\"\")","v":""},null,{"$f":"IF(O41+K41=0,\"\",(J41-I41))","v":""}]
["2023-08-10",3,{"$f":"IF(B42=\"\",\"\",VLOOKUP(B42,Liste1!$F$2:$I$9,2))","v":"Essai 3"},null,4,{"$f":"IF(B42=Liste1!$F$9,Liste1!$F$9*E42*100+MONTH($A42),0)","v":0},{"$f":"IF(B42=Liste1!$F$9,J42-I42,0)","v":0},{"$f":"IF(E42=\"\",\"\",VLOOKUP(E42,Liste1!$A$2:$B$41,2))","v":"Aldo Berman"},100,null,{"$f":"IF($B42=Liste1!$F$9,1,0)","v":0},{"$f":"IF(I42+J42=0,\"\",(E42*100+(YEAR($A42)+MONTH($A42)+MONTH($A42)))/((YEAR($A42))))","v":1.2056351952545725},{"$f":"IF(O42+K42>0,I42,\"\")","v":""},{"$f":"IF(O42+K42>0,J42,\"\")","v":""},null,{"$f":"IF(O42+K42=0,\"\",(J42-I42))","v":""}]
["2023-09-10",3,{"$f":"IF(B43=\"\",\"\",VLOOKUP(B43,Liste1!$F$2:$I$9,2))","v":"Essai 3"},null,4,{"$f":"IF(B43=Liste1!$F$9,Liste1!$F$9*E43*100+MONTH($A43),0)","v":0},{"$f":"IF(B43=Liste1!$F$9,J43-I43,0)","v":0},{"$f":"IF(E43=\"\",\"\",VLOOKUP(E43,Liste1!$A$2:$B$41,2))","v":"Aldo Berman"},100,null,{"$f":"IF(Saisie1!$B1038=Liste1!$F$9,1,0)","v":0},{"$f":"IF(I43+J43=0,\"\",(Saisie1!E1038*100+(YEAR(Saisie1!$A1038)+MONTH(Saisie1!$A1038)+MONTH(Saisie1!$A1038)))/((YEAR(Saisie1!$A1038))))","v":1.0010526315789474},{"$f":"IF(O43+K43>0,I43,\"\")","v":""},{"$f":"IF(O43+K43>0,J43,\"\")","v":""},null,{"$f":"IF(O43+K43=0,\"\",(J43-I43))","v":""}]
["2023-10-10",3,{"$f":"IF(B44=\"\",\"\",VLOOKUP(B44,Liste1!$F$2:$I$9,2))","v":"Essai 3"},null,4,{"$f":"IF(B44=Liste1!$F$9,Liste1!$F$9*E44*100+MONTH($A44),0)","v":0},{"$f":"IF(B44=Liste1!$F$9,J44-I44,0)","v":0},{"$f":"IF(E44=\"\",\"\",VLOOKUP(E44,Liste1!$A$2:$B$41,2))","v":"Aldo Berman"},100,null,{"$f":"IF(Saisie1!$B1118=Liste1!$F$9,1,0)","v":0},{"$f":"IF(Saisie1!B1118=7,\"\",(Saisie1!E1118*100+(YEAR(Saisie1!$A1118)+MONTH(Saisie1!$A1118)+MONTH(Saisie1!$A1118)))/((YEAR(Saisie1!$A1118))))","v":1.0010526315789474},{"$f":"IF(O44+K44>0,I44,\"\")","v":""},{"$f":"IF(O44+K44>0,J44,\"\")","v":""},null,{"$f":"IF(O44+K44=0,\"\",(J44-I44))","v":""}]
["2023-01-09",1,{"$f":"IF(B45=\"\",\"\",VLOOKUP(B45,Liste1!$F$2:$I$9,2))","v":"Essai 1"},null,5,{"$f":"IF(B45=Liste1!$F$9,Liste1!$F$9*E45*100+MONTH($A45),0)","v":0},{"$f":"IF(B45=Liste1!$F$9,J45-I45,0)","v":0},{"$f":"IF(E45=\"\",\"\",VLOOKUP(E45,Liste1!$A$2:$B$41,2))","v":"Alex Térieur"},600,null,{"$f":"IF($B45=Liste1!$F$9,1,0)","v":0},{"$f":"IF(I45+J45=0,\"\",(E45*100+(YEAR($A45)+MONTH($A45)+MONTH($A45)))/((YEAR($A45))))","v":1.2481463173504697},{"$f":"IF(O45+K45>0,I45,\"\")","v":""},{"$f":"IF(O45+K45>0,J45,\"\")","v":""},null,{"$f":"IF(O45+K45=0,\"\",(J45-I45))","v":""}]
["2023-01-20",5,{"$f":"IF(B46=\"\",\"\",VLOOKUP(B46,Liste1!$F$2:$I$9,2))","v":"Essai 5"},null,5,{"$f":"IF(B46=Liste1!$F$9,Liste1!$F$9*E46*100+MONTH($A46),0)","v":0},{"$f":"IF(B46=Liste1!$F$9,J46-I46,0)","v":0},{"$f":"IF(E46=\"\",\"\",VLOOKUP(E46,Liste1!$A$2:$B$41,2))","v":"Alex Térieur"},null,100,{"$f":"IF($B46=Liste1!$F$9,1,0)","v":0},{"$f":"IF(I46+J46=0,\"\",(E46*100+(YEAR($A46)+MONTH($A46)+MONTH($A46)))/((YEAR($A46))))","v":1.2481463173504697},{"$f":"IF(O46+K46>0,I46,\"\")","v":""},{"$f":"IF(O46+K46>0,J46,\"\")","v":""},null,{"$f":"IF(O46+K46=0,\"\",(J46-I46))","v":""}]
["2023-01-23",3,{"$f":"IF(B47=\"\",\"\",VLOOKUP(B47,Liste1!$F$2:$I$9,2))","v":"Essai 3"},null,5,{"$f":"IF(B47=Liste1!$F$9,Liste1!$F$9*E47*100+MONTH($A47),0)","v":0},{"$f":"IF(B47=Liste1!$F$9,J47-I47,0)","v":0},{"$f":"IF(E47=\"\",\"\",VLOOKUP(E47,Liste1!$A$2:$B$41,2))","v":"Alex Térieur"},70,null,{"$f":"IF($B47=Liste1!$F$9,1,0)","v":0},{"$f":"IF(I47+J47=0,\"\",(E47*100+(YEAR($A47)+MONTH($A47)+MONTH($A47)))/((YEAR($A47))))","v":1.2481463173504697},{"$f":"IF(O47+K47>0,I47,\"\")","v":""},{"$f":"IF(O47+K47>0,J47,\"\")","v":""},null,{"$f":"IF(O47+K47=0,\"\",(J47-I47))","v":""}]
["2023-02-01",3,{"$f":"IF(B48=\"\",\"\",VLOOKUP(B48,Liste1!$F$2:$I$9,2))","v":"Essai 3"},null,5,{"$f":"IF(B48=Liste1!$F$9,Liste1!$F$9*E48*100+MONTH($A48),0)","v":0},{"$f":"IF(B48=Liste1!$F$9,J48-I48,0)","v":0},{"$f":"IF(E48=\"\",\"\",VLOOKUP(E48,Liste1!$A$2:$B$41,2))","v":"Alex Térieur"},70,null,{"$f":"IF($B48=Liste1!$F$9,1,0)","v":0},{"$f":"IF(I48+J48=0,\"\",(E48*100+(YEAR($A48)+MONTH($A48)+MONTH($A48)))/((YEAR($A48))))","v":1.2491349480968859},{"$f":"IF(O48+K48>0,I48,\"\")","v":""},{"$f":"IF(O48+K48>0,J48,\"\")","v":""},null,{"$f":"IF(O48+K48=0,\"\",(J48-I48))","v":""}]
["2023-03-04",3,{"$f":"IF(B49=\"\",\"\",VLOOKUP(B49,Liste1!$F$2:$I$9,2))","v":"Essai 3"},null,5,{"$f":"IF(B49=Liste1!$F$9,Liste1!$F$9*E49*100+MONTH($A49),0)","v":0},{"$f":"IF(B49=Liste1!$F$9,J49-I49,0)","v":0},{"$f":"IF(E49=\"\",\"\",VLOOKUP(E49,Liste1!$A$2:$B$41,2))","v":"Alex Térieur"},70,null,{"$f":"IF($B49=Liste1!$F$9,1,0)","v":0},{"$f":"IF(I49+J49=0,\"\",(E49*100+(YEAR($A49)+MONTH($A49)+MONTH($A49)))/((YEAR($A49))))","v":1.2501235788433021},{"$f":"IF(O49+K49>0,I49,\"\")","v":""},{"$f":"IF(O49+K49>0,J49,\"\")","v":""},null,{"$f":"IF(O49+K49=0,\"\",(J49-I49))","v":""}]
["2023-04-03",3,{"$f":"IF(B50=\"\",\"\",VLOOKUP(B50,Liste1!$F$2:$I$9,2))","v":"Essai 3"},null,5,{"$f":"IF(B50=Liste1!$F$9,Liste1!$F$9*E50*100+MONTH($A50),0)","v":0},{"$f":"IF(B50=Liste1!$F$9,J50-I50,0)","v":0},{"$f":"IF(E50=\"\",\"\",VLOOKUP(E50,Liste1!$A$2:$B$41,2))","v":"Alex Térieur"},70,null,{"$f":"IF($B50=Liste1!$F$9,1,0)","v":0},{"$f":"IF(I50+J50=0,\"\",(E50*100+(YEAR($A50)+MONTH($A50)+MONTH($A50)))/((YEAR($A50))))","v":1.2511122095897182},{"$f":"IF(O50+K50>0,I50,\"\")","v":""},{"$f":"IF(O50+K50>0,J50,\"\")","v":""},null,{"$f":"IF(O50+K50=0,\"\",(J50-I50))","v":""}]
["2023-05-03",3,{"$f":"IF(B51=\"\",\"\",VLOOKUP(B51,Liste1!$F$2:$I$9,2))","v":"Essai 3"},null,5,{"$f":"IF(B51=Liste1!$F$9,Liste1!$F$9*E51*100+MONTH($A51),0)","v":0},{"$f":"IF(B51=Liste1!$F$9,J51-I51,0)","v":0},{"$f":"IF(E51=\"\",\"\",VLOOKUP(E51,Liste1!$A$2:$B$41,2))","v":"Alex Térieur"},70,null,{"$f":"IF($B51=Liste1!$F$9,1,0)","v":0},{"$f":"IF(I51+J51=0,\"\",(E51*100+(YEAR($A51)+MONTH($A51)+MONTH($A51)))/((YEAR($A51))))","v":1.2521008403361344},{"$f":"IF(O51+K51>0,I51,\"\")","v":""},{"$f":"IF(O51+K51>0,J51,\"\")","v":""},null,{"$f":"IF(O51+K51=0,\"\",(J51-I51))","v":""}]
["2023-06-03",3,{"$f":"IF(B52=\"\",\"\",VLOOKUP(B52,Liste1!$F$2:$I$9,2))","v":"Essai 3"},null,5,{"$f":"IF(B52=Liste1!$F$9,Liste1!$F$9*E52*100+MONTH($A52),0)","v":0},{"$f":"IF(B52=Liste1!$F$9,J52-I52,0)","v":0},{"$f":"IF(E52=\"\",\"\",VLOOKUP(E52,Liste1!$A$2:$B$41,2))","v":"Alex Térieur"},70,null,{"$f":"IF($B52=Liste1!$F$9,1,0)","v":0},{"$f":"IF(I52+J52=0,\"\",(E52*100+(YEAR($A52)+MONTH($A52)+MONTH($A52)))/((YEAR($A52))))","v":1.2530894710825506},{"$f":"IF(O52+K52>0,I52,\"\")","v":""},{"$f":"IF(O52+K52>0,J52,\"\")","v":""},null,{"$f":"IF(O52+K52=0,\"\",(J52-I52))","v":""}]
["2023-07-03",3,{"$f":"IF(B53=\"\",\"\",VLOOKUP(B53,Liste1!$F$2:$I$9,2))","v":"Essai 3"},null,5,{"$f":"IF(B53=Liste1!$F$9,Liste1!$F$9*E53*100+MONTH($A53),0)","v":0},{"$f":"IF(B53=Liste1!$F$9,J53-I53,0)","v":0},{"$f":"IF(E53=\"\",\"\",VLOOKUP(E53,Liste1!$A$2:$B$41,2))","v":"Alex Térieur"},44,null,{"$f":"IF($B53=Liste1!$F$9,1,0)","v":0},{"$f":"IF(I53+J53=0,\"\",(E53*100+(YEAR($A53)+MONTH($A53)+MONTH($A53)))/((YEAR($A53))))","v":1.2540781018289668},{"$f":"IF(O53+K53>0,I53,\"\")","v":""},{"$f":"IF(O53+K53>0,J53,\"\")","v":""},null,{"$f":"IF(O53+K53=0,\"\",(J53-I53))","v":""}]
["2023-08-03",3,{"$f":"IF(B54=\"\",\"\",VLOOKUP(B54,Liste1!$F$2:$I$9,2))","v":"Essai 3"},null,5,{"$f":"IF(B54=Liste1!$F$9,Liste1!$F$9*E54*100+MONTH($A54),0)","v":0},{"$f":"IF(B54=Liste1!$F$9,J54-I54,0)","v":0},{"$f":"IF(E54=\"\",\"\",VLOOKUP(E54,Liste1!$A$2:$B$41,2))","v":"Alex Térieur"},44,null,{"$f":"IF($B54=Liste1!$F$9,1,0)","v":0},{"$f":"IF(B54=7,\"\",(E54*100+(YEAR($A54)+MONTH($A54)+MONTH($A54)))/((YEAR($A54))))","v":1.255066732575383},{"$f":"IF(O54+K54>0,I54,\"\")","v":""},{"$f":"IF(O54+K54>0,J54,\"\")","v":""},null,{"$f":"IF(O54+K54=0,\"\",(J54-I54))","v":""}]
["2023-09-03",3,{"$f":"IF(B55=\"\",\"\",VLOOKUP(B55,Liste1!$F$2:$I$9,2))","v":"Essai 3"},null,5,{"$f":"IF(B55=Liste1!$F$9,Liste1!$F$9*E55*100+MONTH($A55),0)","v":0},{"$f":"IF(B55=Liste1!$F$9,J55-I55,0)","v":0},{"$f":"IF(E55=\"\",\"\",VLOOKUP(E55,Liste1!$A$2:$B$41,2))","v":"Alex Térieur"},44,null,{"$f":"IF($B55=Liste1!$F$9,1,0)","v":0},{"$f":"IF(B55=7,\"\",(E55*100+(YEAR($A55)+MONTH($A55)+MONTH($A55)))/((YEAR($A55))))","v":1.2560553633217992},{"$f":"IF(O55+K55>0,I55,\"\")","v":""},{"$f":"IF(O55+K55>0,J55,\"\")","v":""},null,{"$f":"IF(O55+K55=0,\"\",(J55-I55))","v":""}]
["2023-09-04",4,{"$f":"IF(B56=\"\",\"\",VLOOKUP(B56,Liste1!$F$2:$I$9,2))","v":"Essai 4"},null,5,{"$f":"IF(B56=Liste1!$F$9,Liste1!$F$9*E56*100+MONTH($A56),0)","v":0},{"$f":"IF(B56=Liste1!$F$9,J56-I56,0)","v":0},{"$f":"IF(E56=\"\",\"\",VLOOKUP(E56,Liste1!$A$2:$B$41,2))","v":"Alex Térieur"},44,null,{"$f":"IF($B56=Liste1!$F$9,1,0)","v":0},{"$f":"IF(B56=7,\"\",(E56*100+(YEAR($A56)+MONTH($A56)+MONTH($A56)))/((YEAR($A56))))","v":1.2560553633217992},{"$f":"IF(O56+K56>0,I56,\"\")","v":""},{"$f":"IF(O56+K56>0,J56,\"\")","v":""},null,{"$f":"IF(O56+K56=0,\"\",(J56-I56))","v":""}]
["2023-09-05",5,{"$f":"IF(B57=\"\",\"\",VLOOKUP(B57,Liste1!$F$2:$I$9,2))","v":"Essai 5"},null,5,{"$f":"IF(B57=Liste1!$F$9,Liste1!$F$9*E57*100+MONTH($A57),0)","v":0},{"$f":"IF(B57=Liste1!$F$9,J57-I57,0)","v":0},{"$f":"IF(E57=\"\",\"\",VLOOKUP(E57,Liste1!$A$2:$B$41,2))","v":"Alex Térieur"},null,60,{"$f":"IF($B57=Liste1!$F$9,1,0)","v":0},{"$f":"IF(B57=7,\"\",(E57*100+(YEAR($A57)+MONTH($A57)+MONTH($A57)))/((YEAR($A57))))","v":1.2560553633217992},{"$f":"IF(O57+K57>0,I57,\"\")","v":""},{"$f":"IF(O57+K57>0,J57,\"\")","v":""},null,{"$f":"IF(O57+K57=0,\"\",(J57-I57))","v":""}]
["2023-09-30",5,{"$f":"IF(B58=\"\",\"\",VLOOKUP(B58,Liste1!$F$2:$I$9,2))","v":"Essai 5"},null,5,{"$f":"IF(B58=Liste1!$F$9,Liste1!$F$9*E58*100+MONTH($A58),0)","v":0},{"$f":"IF(B58=Liste1!$F$9,J58-I58,0)","v":0},{"$f":"IF(E58=\"\",\"\",VLOOKUP(E58,Liste1!$A$2:$B$41,2))","v":"Alex Térieur"},null,40,{"$f":"IF($B58=Liste1!$F$9,1,0)","v":0},{"$f":"IF(B58=7,\"\",(E58*100+(YEAR($A58)+MONTH($A58)+MONTH($A58)))/((YEAR($A58))))","v":1.2560553633217992},{"$f":"IF(O58+K58>0,I58,\"\")","v":""},{"$f":"IF(O58+K58>0,J58,\"\")","v":""},null,{"$f":"IF(O58+K58=0,\"\",(J58-I58))","v":""}]
["2023-10-03",3,{"$f":"IF(B59=\"\",\"\",VLOOKUP(B59,Liste1!$F$2:$I$9,2))","v":"Essai 3"},null,5,{"$f":"IF(B59=Liste1!$F$9,Liste1!$F$9*E59*100+MONTH($A59),0)","v":0},{"$f":"IF(B59=Liste1!$F$9,J59-I59,0)","v":0},{"$f":"IF(E59=\"\",\"\",VLOOKUP(E59,Liste1!$A$2:$B$41,2))","v":"Alex Térieur"},60,null,{"$f":"IF($B59=Liste1!$F$9,1,0)","v":0},{"$f":"IF(B59=7,\"\",(E59*100+(YEAR($A59)+MONTH($A59)+MONTH($A59)))/((YEAR($A59))))","v":1.2570439940682154},{"$f":"IF(O59+K59>0,I59,\"\")","v":""},{"$f":"IF(O59+K59>0,J59,\"\")","v":""},null,{"$f":"IF(O59+K59=0,\"\",(J59-I59))","v":""}]
["2023-01-12",3,{"$f":"IF(B60=\"\",\"\",VLOOKUP(B60,Liste1!$F$2:$I$9,2))","v":"Essai 3"},null,6,{"$f":"IF(B60=Liste1!$F$9,Liste1!$F$9*E60*100+MONTH($A60),0)","v":0},{"$f":"IF(B60=Liste1!$F$9,J60-I60,0)","v":0},{"$f":"IF(E60=\"\",\"\",VLOOKUP(E60,Liste1!$A$2:$B$41,2))","v":"Elsa Dorsa"},4.7300000000000004,null,{"$f":"IF($B60=Liste1!$F$9,1,0)","v":0},{"$f":"IF(I60+J60=0,\"\",(E60*100+(YEAR($A60)+MONTH($A60)+MONTH($A60)))/((YEAR($A60))))","v":1.2975778546712802},{"$f":"IF(O60+K60>0,I60,\"\")","v":""},{"$f":"IF(O60+K60>0,J60,\"\")","v":""},null,{"$f":"IF(O60+K60=0,\"\",(J60-I60))","v":""}]
["2023-02-10",3,{"$f":"IF(B61=\"\",\"\",VLOOKUP(B61,Liste1!$F$2:$I$9,2))","v":"Essai 3"},null,6,{"$f":"IF(B61=Liste1!$F$9,Liste1!$F$9*E61*100+MONTH($A61),0)","v":0},{"$f":"IF(B61=Liste1!$F$9,J61-I61,0)","v":0},{"$f":"IF(E61=\"\",\"\",VLOOKUP(E61,Liste1!$A$2:$B$41,2))","v":"Elsa Dorsa"},4.7300000000000004,null,{"$f":"IF($B61=Liste1!$F$9,1,0)","v":0},{"$f":"IF(I61+J61=0,\"\",(E61*100+(YEAR($A61)+MONTH($A61)+MONTH($A61)))/((YEAR($A61))))","v":1.2985664854176966},{"$f":"IF(O61+K61>0,I61,\"\")","v":""},{"$f":"IF(O61+K61>0,J61,\"\")","v":""},null,{"$f":"IF(O61+K61=0,\"\",(J61-I61))","v":""}]
["2023-03-10",3,{"$f":"IF(B62=\"\",\"\",VLOOKUP(B62,Liste1!$F$2:$I$9,2))","v":"Essai 3"},null,6,{"$f":"IF(B62=Liste1!$F$9,Liste1!$F$9*E62*100+MONTH($A62),0)","v":0},{"$f":"IF(B62=Liste1!$F$9,J62-I62,0)","v":0},{"$f":"IF(E62=\"\",\"\",VLOOKUP(E62,Liste1!$A$2:$B$41,2))","v":"Elsa Dorsa"},4.7300000000000004,null,{"$f":"IF($B62=Liste1!$F$9,1,0)","v":0},{"$f":"IF(I62+J62=0,\"\",(E62*100+(YEAR($A62)+MONTH($A62)+MONTH($A62)))/((YEAR($A62))))","v":1.2995551161641128},{"$f":"IF(O62+K62>0,I62,\"\")","v":""},{"$f":"IF(O62+K62>0,J62,\"\")","v":""},null,{"$f":"IF(O62+K62=0,\"\",(J62-I62))","v":""}]
["2023-04-10",3,{"$f":"IF(B63=\"\",\"\",VLOOKUP(B63,Liste1!$F$2:$I$9,2))","v":"Essai 3"},null,6,{"$f":"IF(B63=Liste1!$F$9,Liste1!$F$9*E63*100+MONTH($A63),0)","v":0},{"$f":"IF(B63=Liste1!$F$9,J63-I63,0)","v":0},{"$f":"IF(E63=\"\",\"\",VLOOKUP(E63,Liste1!$A$2:$B$41,2))","v":"Elsa Dorsa"},4.7300000000000004,null,{"$f":"IF($B63=Liste1!$F$9,1,0)","v":0},{"$f":"IF(I63+J63=0,\"\",(E63*100+(YEAR($A63)+MONTH($A63)+MONTH($A63)))/((YEAR($A63))))","v":1.300543746910529},{"$f":"IF(O63+K63>0,I63,\"\")","v":""},{"$f":"IF(O63+K63>0,J63,\"\")","v":""},null,{"$f":"IF(O63+K63=0,\"\",(J63-I63))","v":""}]
["2023-05-10",3,{"$f":"IF(B64=\"\",\"\",VLOOKUP(B64,Liste1!$F$2:$I$9,2))","v":"Essai 3"},null,6,{"$f":"IF(B64=Liste1!$F$9,Liste1!$F$9*E64*100+MONTH($A64),0)","v":0},{"$f":"IF(B64=Liste1!$F$9,J64-I64,0)","v":0},{"$f":"IF(E64=\"\",\"\",VLOOKUP(E64,Liste1!$A$2:$B$41,2))","v":"Elsa Dorsa"},4.7300000000000004,null,{"$f":"IF($B64=Liste1!$F$9,1,0)","v":0},{"$f":"IF(B64=7,\"\",(E64*100+(YEAR($A64)+MONTH($A64)+MONTH($A64)))/((YEAR($A64))))","v":1.3015323776569452},{"$f":"IF(O64+K64>0,I64,\"\")","v":""},{"$f":"IF(O64+K64>0,J64,\"\")","v":""},null,{"$f":"IF(O64+K64=0,\"\",(J64-I64))","v":""}]
["2023-06-10",3,{"$f":"IF(B65=\"\",\"\",VLOOKUP(B65,Liste1!$F$2:$I$9,2))","v":"Essai 3"},null,6,{"$f":"IF(B65=Liste1!$F$9,Liste1!$F$9*E65*100+MONTH($A65),0)","v":0},{"$f":"IF(B65=Liste1!$F$9,J65-I65,0)","v":0},{"$f":"IF(E65=\"\",\"\",VLOOKUP(E65,Liste1!$A$2:$B$41,2))","v":"Elsa Dorsa"},4.7300000000000004,null,{"$f":"IF($B65=Liste1!$F$9,1,0)","v":0},{"$f":"IF(B65=7,\"\",(E65*100+(YEAR($A65)+MONTH($A65)+MONTH($A65)))/((YEAR($A65))))","v":1.3025210084033614},{"$f":"IF(O65+K65>0,I65,\"\")","v":""},{"$f":"IF(O65+K65>0,J65,\"\")","v":""},null,{"$f":"IF(O65+K65=0,\"\",(J65-I65))","v":""}]
["2023-07-10",3,{"$f":"IF(B66=\"\",\"\",VLOOKUP(B66,Liste1!$F$2:$I$9,2))","v":"Essai 3"},null,6,{"$f":"IF(B66=Liste1!$F$9,Liste1!$F$9*E66*100+MONTH($A66),0)","v":0},{"$f":"IF(B66=Liste1!$F$9,J66-I66,0)","v":0},{"$f":"IF(E66=\"\",\"\",VLOOKUP(E66,Liste1!$A$2:$B$41,2))","v":"Elsa Dorsa"},4.7300000000000004,null,{"$f":"IF($B66=Liste1!$F$9,1,0)","v":0},{"$f":"IF(B66=7,\"\",(E66*100+(YEAR($A66)+MONTH($A66)+MONTH($A66)))/((YEAR($A66))))","v":1.3035096391497776},{"$f":"IF(O66+K66>0,I66,\"\")","v":""},{"$f":"IF(O66+K66>0,J66,\"\")","v":""},null,{"$f":"IF(O66+K66=0,\"\",(J66-I66))","v":""}]
["2023-08-10",3,{"$f":"IF(B67=\"\",\"\",VLOOKUP(B67,Liste1!$F$2:$I$9,2))","v":"Essai 3"},null,6,{"$f":"IF(B67=Liste1!$F$9,Liste1!$F$9*E67*100+MONTH($A67),0)","v":0},{"$f":"IF(B67=Liste1!$F$9,J67-I67,0)","v":0},{"$f":"IF(E67=\"\",\"\",VLOOKUP(E67,Liste1!$A$2:$B$41,2))","v":"Elsa Dorsa"},4.7300000000000004,null,{"$f":"IF($B67=Liste1!$F$9,1,0)","v":0},{"$f":"IF(B67=7,\"\",(E67*100+(YEAR($A67)+MONTH($A67)+MONTH($A67)))/((YEAR($A67))))","v":1.3044982698961938},{"$f":"IF(O67+K67>0,I67,\"\")","v":""},{"$f":"IF(O67+K67>0,J67,\"\")","v":""},null,{"$f":"IF(O67+K67=0,\"\",(J67-I67))","v":""}]
["2023-09-11",3,{"$f":"IF(B68=\"\",\"\",VLOOKUP(B68,Liste1!$F$2:$I$9,2))","v":"Essai 3"},null,6,{"$f":"IF(B68=Liste1!$F$9,Liste1!$F$9*E68*100+MONTH($A68),0)","v":0},{"$f":"IF(B68=Liste1!$F$9,J68-I68,0)","v":0},{"$f":"IF(E68=\"\",\"\",VLOOKUP(E68,Liste1!$A$2:$B$41,2))","v":"Elsa Dorsa"},4.7300000000000004,null,{"$f":"IF($B68=Liste1!$F$9,1,0)","v":0},{"$f":"IF(B68=7,\"\",(E68*100+(YEAR($A68)+MONTH($A68)+MONTH($A68)))/((YEAR($A68))))","v":1.30548690064261},{"$f":"IF(O68+K68>0,I68,\"\")","v":""},{"$f":"IF(O68+K68>0,J68,\"\")","v":""},null,{"$f":"IF(O68+K68=0,\"\",(J68-I68))","v":""}]
["2023-10-10",3,{"$f":"IF(B69=\"\",\"\",VLOOKUP(B69,Liste1!$F$2:$I$9,2))","v":"Essai 3"},null,6,{"$f":"IF(B69=Liste1!$F$9,Liste1!$F$9*E69*100+MONTH($A69),0)","v":0},{"$f":"IF(B69=Liste1!$F$9,J69-I69,0)","v":0},{"$f":"IF(E69=\"\",\"\",VLOOKUP(E69,Liste1!$A$2:$B$41,2))","v":"Elsa Dorsa"},4.7300000000000004,null,{"$f":"IF($B69=Liste1!$F$9,1,0)","v":0},{"$f":"IF(B69=7,\"\",(E69*100+(YEAR($A69)+MONTH($A69)+MONTH($A69)))/((YEAR($A69))))","v":1.3064755313890262},{"$f":"IF(O69+K69>0,I69,\"\")","v":""},{"$f":"IF(O69+K69>0,J69,\"\")","v":""},null,{"$f":"IF(O69+K69=0,\"\",(J69-I69))","v":""}]
["2023-01-09",3,{"$f":"IF(B70=\"\",\"\",VLOOKUP(B70,Liste1!$F$2:$I$9,2))","v":"Essai 3"},null,7,{"$f":"IF(B70=Liste1!$F$9,Liste1!$F$9*E70*100+MONTH($A70),0)","v":0},{"$f":"IF(B70=Liste1!$F$9,J70-I70,0)","v":0},{"$f":"IF(E70=\"\",\"\",VLOOKUP(E70,Liste1!$A$2:$B$41,2))","v":"Elvire Horouge"},3,null,{"$f":"IF($B70=Liste1!$F$9,1,0)","v":0},{"$f":"IF(I70+J70=0,\"\",(E70*100+(YEAR($A70)+MONTH($A70)+MONTH($A70)))/((YEAR($A70))))","v":1.3470093919920909},{"$f":"IF(O70+K70>0,I70,\"\")","v":""},{"$f":"IF(O70+K70>0,J70,\"\")","v":""},null,{"$f":"IF(O70+K70=0,\"\",(J70-I70))","v":""}]
["2023-01-11",3,{"$f":"IF(B71=\"\",\"\",VLOOKUP(B71,Liste1!$F$2:$I$9,2))","v":"Essai 3"},null,7,{"$f":"IF(B71=Liste1!$F$9,Liste1!$F$9*E71*100+MONTH($A71),0)","v":0},{"$f":"IF(B71=Liste1!$F$9,J71-I71,0)","v":0},{"$f":"IF(E71=\"\",\"\",VLOOKUP(E71,Liste1!$A$2:$B$41,2))","v":"Elvire Horouge"},44,null,{"$f":"IF($B71=Liste1!$F$9,1,0)","v":0},{"$f":"IF(I71+J71=0,\"\",(E71*100+(YEAR($A71)+MONTH($A71)+MONTH($A71)))/((YEAR($A71))))","v":1.3470093919920909},{"$f":"IF(O71+K71>0,I71,\"\")","v":""},{"$f":"IF(O71+K71>0,J71,\"\")","v":""},null,{"$f":"IF(O71+K71=0,\"\",(J71-I71))","v":""}]
["2023-01-13",5,{"$f":"IF(B72=\"\",\"\",VLOOKUP(B72,Liste1!$F$2:$I$9,2))","v":"Essai 5"},null,7,{"$f":"IF(B72=Liste1!$F$9,Liste1!$F$9*E72*100+MONTH($A72),0)","v":0},{"$f":"IF(B72=Liste1!$F$9,J72-I72,0)","v":0},{"$f":"IF(E72=\"\",\"\",VLOOKUP(E72,Liste1!$A$2:$B$41,2))","v":"Elvire Horouge"},null,35,{"$f":"IF($B72=Liste1!$F$9,1,0)","v":0},{"$f":"IF(I72+J72=0,\"\",(E72*100+(YEAR($A72)+MONTH($A72)+MONTH($A72)))/((YEAR($A72))))","v":1.3470093919920909},{"$f":"IF(O72+K72>0,I72,\"\")","v":""},{"$f":"IF(O72+K72>0,J72,\"\")","v":""},null,{"$f":"IF(O72+K72=0,\"\",(J72-I72))","v":""}]
["2023-02-10",3,{"$f":"IF(B73=\"\",\"\",VLOOKUP(B73,Liste1!$F$2:$I$9,2))","v":"Essai 3"},null,7,{"$f":"IF(B73=Liste1!$F$9,Liste1!$F$9*E73*100+MONTH($A73),0)","v":0},{"$f":"IF(B73=Liste1!$F$9,J73-I73,0)","v":0},{"$f":"IF(E73=\"\",\"\",VLOOKUP(E73,Liste1!$A$2:$B$41,2))","v":"Elvire Horouge"},3,null,{"$f":"IF($B73=Liste1!$F$9,1,0)","v":0},{"$f":"IF(I73+J73=0,\"\",(E73*100+(YEAR($A73)+MONTH($A73)+MONTH($A73)))/((YEAR($A73))))","v":1.3479980227385071},{"$f":"IF(O73+K73>0,I73,\"\")","v":""},{"$f":"IF(O73+K73>0,J73,\"\")","v":""},null,{"$f":"IF(O73+K73=0,\"\",(J73-I73))","v":""}]
["2023-03-10",3,{"$f":"IF(B74=\"\",\"\",VLOOKUP(B74,Liste1!$F$2:$I$9,2))","v":"Essai 3"},null,7,{"$f":"IF(B74=Liste1!$F$9,Liste1!$F$9*E74*100+MONTH($A74),0)","v":0},{"$f":"IF(B74=Liste1!$F$9,J74-I74,0)","v":0},{"$f":"IF(E74=\"\",\"\",VLOOKUP(E74,Liste1!$A$2:$B$41,2))","v":"Elvire Horouge"},4,null,{"$f":"IF($B74=Liste1!$F$9,1,0)","v":0},{"$f":"IF(I74+J74=0,\"\",(E74*100+(YEAR($A74)+MONTH($A74)+MONTH($A74)))/((YEAR($A74))))","v":1.3489866534849233},{"$f":"IF(O74+K74>0,I74,\"\")","v":""},{"$f":"IF(O74+K74>0,J74,\"\")","v":""},null,{"$f":"IF(O74+K74=0,\"\",(J74-I74))","v":""}]
["2023-04-10",3,{"$f":"IF(B75=\"\",\"\",VLOOKUP(B75,Liste1!$F$2:$I$9,2))","v":"Essai 3"},null,7,{"$f":"IF(B75=Liste1!$F$9,Liste1!$F$9*E75*100+MONTH($A75),0)","v":0},{"$f":"IF(B75=Liste1!$F$9,J75-I75,0)","v":0},{"$f":"IF(E75=\"\",\"\",VLOOKUP(E75,Liste1!$A$2:$B$41,2))","v":"Elvire Horouge"},4,null,{"$f":"IF($B75=Liste1!$F$9,1,0)","v":0},{"$f":"IF(I75+J75=0,\"\",(E75*100+(YEAR($A75)+MONTH($A75)+MONTH($A75)))/((YEAR($A75))))","v":1.3499752842313395},{"$f":"IF(O75+K75>0,I75,\"\")","v":""},{"$f":"IF(O75+K75>0,J75,\"\")","v":""},null,{"$f":"IF(O75+K75=0,\"\",(J75-I75))","v":""}]
["2023-05-10",3,{"$f":"IF(B76=\"\",\"\",VLOOKUP(B76,Liste1!$F$2:$I$9,2))","v":"Essai 3"},null,7,{"$f":"IF(B76=Liste1!$F$9,Liste1!$F$9*E76*100+MONTH($A76),0)","v":0},{"$f":"IF(B76=Liste1!$F$9,J76-I76,0)","v":0},{"$f":"IF(E76=\"\",\"\",VLOOKUP(E76,Liste1!$A$2:$B$41,2))","v":"Elvire Horouge"},4,null,{"$f":"IF($B76=Liste1!$F$9,1,0)","v":0},{"$f":"IF(B76=7,\"\",(E76*100+(YEAR($A76)+MONTH($A76)+MONTH($A76)))/((YEAR($A76))))","v":1.3509639149777557},{"$f":"IF(O76+K76>0,I76,\"\")","v":""},{"$f":"IF(O76+K76>0,J76,\"\")","v":""},null,{"$f":"IF(O76+K76=0,\"\",(J76-I76))","v":""}]
["2023-06-10",3,{"$f":"IF(B77=\"\",\"\",VLOOKUP(B77,Liste1!$F$2:$I$9,2))","v":"Essai 3"},null,7,{"$f":"IF(B77=Liste1!$F$9,Liste1!$F$9*E77*100+MONTH($A77),0)","v":0},{"$f":"IF(B77=Liste1!$F$9,J77-I77,0)","v":0},{"$f":"IF(E77=\"\",\"\",VLOOKUP(E77,Liste1!$A$2:$B$41,2))","v":"Elvire Horouge"},4,null,{"$f":"IF($B77=Liste1!$F$9,1,0)","v":0},{"$f":"IF(B77=7,\"\",(E77*100+(YEAR($A77)+MONTH($A77)+MONTH($A77)))/((YEAR($A77))))","v":1.3519525457241721},{"$f":"IF(O77+K77>0,I77,\"\")","v":""},{"$f":"IF(O77+K77>0,J77,\"\")","v":""},null,{"$f":"IF(O77+K77=0,\"\",(J77-I77))","v":""}]
["2023-07-10",3,{"$f":"IF(B78=\"\",\"\",VLOOKUP(B78,Liste1!$F$2:$I$9,2))","v":"Essai 3"},null,7,{"$f":"IF(B78=Liste1!$F$9,Liste1!$F$9*E78*100+MONTH($A78),0)","v":0},{"$f":"IF(B78=Liste1!$F$9,J78-I78,0)","v":0},{"$f":"IF(E78=\"\",\"\",VLOOKUP(E78,Liste1!$A$2:$B$41,2))","v":"Elvire Horouge"},4,null,{"$f":"IF($B78=Liste1!$F$9,1,0)","v":0},{"$f":"IF(B78=7,\"\",(E78*100+(YEAR($A78)+MONTH($A78)+MONTH($A78)))/((YEAR($A78))))","v":1.3529411764705883},{"$f":"IF(O78+K78>0,I78,\"\")","v":""},{"$f":"IF(O78+K78>0,J78,\"\")","v":""},null,{"$f":"IF(O78+K78=0,\"\",(J78-I78))","v":""}]
["2023-08-10",3,{"$f":"IF(B79=\"\",\"\",VLOOKUP(B79,Liste1!$F$2:$I$9,2))","v":"Essai 3"},null,7,{"$f":"IF(B79=Liste1!$F$9,Liste1!$F$9*E79*100+MONTH($A79),0)","v":0},{"$f":"IF(B79=Liste1!$F$9,J79-I79,0)","v":0},{"$f":"IF(E79=\"\",\"\",VLOOKUP(E79,Liste1!$A$2:$B$41,2))","v":"Elvire Horouge"},4,null,{"$f":"IF($B79=Liste1!$F$9,1,0)","v":0},{"$f":"IF(B79=7,\"\",(E79*100+(YEAR($A79)+MONTH($A79)+MONTH($A79)))/((YEAR($A79))))","v":1.3539298072170045},{"$f":"IF(O79+K79>0,I79,\"\")","v":""},{"$f":"IF(O79+K79>0,J79,\"\")","v":""},null,{"$f":"IF(O79+K79=0,\"\",(J79-I79))","v":""}]
["2023-09-10",3,{"$f":"IF(B80=\"\",\"\",VLOOKUP(B80,Liste1!$F$2:$I$9,2))","v":"Essai 3"},null,7,{"$f":"IF(B80=Liste1!$F$9,Liste1!$F$9*E80*100+MONTH($A80),0)","v":0},{"$f":"IF(B80=Liste1!$F$9,J80-I80,0)","v":0},{"$f":"IF(E80=\"\",\"\",VLOOKUP(E80,Liste1!$A$2:$B$41,2))","v":"Elvire Horouge"},4,null,{"$f":"IF(Saisie1!$B1035=Liste1!$F$9,1,0)","v":0},{"$f":"IF(Saisie1!B1035=7,\"\",(Saisie1!E1035*100+(YEAR(Saisie1!$A1035)+MONTH(Saisie1!$A1035)+MONTH(Saisie1!$A1035)))/((YEAR(Saisie1!$A1035))))","v":1.0010526315789474},{"$f":"IF(O80+K80>0,I80,\"\")","v":""},{"$f":"IF(O80+K80>0,J80,\"\")","v":""},null,{"$f":"IF(O80+K80=0,\"\",(J80-I80))","v":""}]
["2023-10-10",3,{"$f":"IF(B81=\"\",\"\",VLOOKUP(B81,Liste1!$F$2:$I$9,2))","v":"Essai 3"},null,7,{"$f":"IF(B81=Liste1!$F$9,Liste1!$F$9*E81*100+MONTH($A81),0)","v":0},{"$f":"IF(B81=Liste1!$F$9,J81-I81,0)","v":0},{"$f":"IF(E81=\"\",\"\",VLOOKUP(E81,Liste1!$A$2:$B$41,2))","v":"Elvire Horouge"},5,null,{"$f":"IF(Saisie1!$B1115=Liste1!$F$9,1,0)","v":0},{"$f":"IF(Saisie1!B1115=7,\"\",(Saisie1!E1115*100+(YEAR(Saisie1!$A1115)+MONTH(Saisie1!$A1115)+MONTH(Saisie1!$A1115)))/((YEAR(Saisie1!$A1115))))","v":1.0010526315789474},{"$f":"IF(O81+K81>0,I81,\"\")","v":""},{"$f":"IF(O81+K81>0,J81,\"\")","v":""},null,{"$f":"IF(O81+K81=0,\"\",(J81-I81))","v":""}]
["2023-01-02",2,{"$f":"IF(B82=\"\",\"\",VLOOKUP(B82,Liste1!$F$2:$I$9,2))","v":"Essai 2"},null,8,{"$f":"IF(B82=Liste1!$F$9,Liste1!$F$9*E82*100+MONTH($A82),0)","v":0},{"$f":"IF(B82=Liste1!$F$9,J82-I82,0)","v":0},{"$f":"IF(E82=\"\",\"\",VLOOKUP(E82,Liste1!$A$2:$B$41,2))","v":"Léon Dit"},16.5,null,{"$f":"IF($B82=Liste1!$F$9,1,0)","v":0},{"$f":"IF(I82+J82=0,\"\",(E82*100+(YEAR($A82)+MONTH($A82)+MONTH($A82)))/((YEAR($A82))))","v":1.3964409293129016},{"$f":"IF(O82+K82>0,I82,\"\")","v":""},{"$f":"IF(O82+K82>0,J82,\"\")","v":""},null,{"$f":"IF(O82+K82=0,\"\",(J82-I82))","v":""}]
["2023-01-05",2,{"$f":"IF(B83=\"\",\"\",VLOOKUP(B83,Liste1!$F$2:$I$9,2))","v":"Essai 2"},null,8,{"$f":"IF(B83=Liste1!$F$9,Liste1!$F$9*E83*100+MONTH($A83),0)","v":0},{"$f":"IF(B83=Liste1!$F$9,J83-I83,0)","v":0},{"$f":"IF(E83=\"\",\"\",VLOOKUP(E83,Liste1!$A$2:$B$41,2))","v":"Léon Dit"},47.62,null,{"$f":"IF($B83=Liste1!$F$9,1,0)","v":0},{"$f":"IF(I83+J83=0,\"\",(E83*100+(YEAR($A83)+MONTH($A83)+MONTH($A83)))/((YEAR($A83))))","v":1.3964409293129016},{"$f":"IF(O83+K83>0,I83,\"\")","v":""},{"$f":"IF(O83+K83>0,J83,\"\")","v":""},null,{"$f":"IF(O83+K83=0,\"\",(J83-I83))","v":""}]
["2023-01-05",2,{"$f":"IF(B84=\"\",\"\",VLOOKUP(B84,Liste1!$F$2:$I$9,2))","v":"Essai 2"},null,8,{"$f":"IF(B84=Liste1!$F$9,Liste1!$F$9*E84*100+MONTH($A84),0)","v":0},{"$f":"IF(B84=Liste1!$F$9,J84-I84,0)","v":0},{"$f":"IF(E84=\"\",\"\",VLOOKUP(E84,Liste1!$A$2:$B$41,2))","v":"Léon Dit"},9.7100000000000009,null,{"$f":"IF($B84=Liste1!$F$9,1,0)","v":0},{"$f":"IF(I84+J84=0,\"\",(E84*100+(YEAR($A84)+MONTH($A84)+MONTH($A84)))/((YEAR($A84))))","v":1.3964409293129016},{"$f":"IF(O84+K84>0,I84,\"\")","v":""},{"$f":"IF(O84+K84>0,J84,\"\")","v":""},null,{"$f":"IF(O84+K84=0,\"\",(J84-I84))","v":""}]
["2023-01-07",2,{"$f":"IF(B85=\"\",\"\",VLOOKUP(B85,Liste1!$F$2:$I$9,2))","v":"Essai 2"},null,8,{"$f":"IF(B85=Liste1!$F$9,Liste1!$F$9*E85*100+MONTH($A85),0)","v":0},{"$f":"IF(B85=Liste1!$F$9,J85-I85,0)","v":0},{"$f":"IF(E85=\"\",\"\",VLOOKUP(E85,Liste1!$A$2:$B$41,2))","v":"Léon Dit"},14.45,null,{"$f":"IF($B85=Liste1!$F$9,1,0)","v":0},{"$f":"IF(I85+J85=0,\"\",(E85*100+(YEAR($A85)+MONTH($A85)+MONTH($A85)))/((YEAR($A85))))","v":1.3964409293129016},{"$f":"IF(O85+K85>0,I85,\"\")","v":""},{"$f":"IF(O85+K85>0,J85,\"\")","v":""},null,{"$f":"IF(O85+K85=0,\"\",(J85-I85))","v":""}]
["2023-01-09",2,{"$f":"IF(B86=\"\",\"\",VLOOKUP(B86,Liste1!$F$2:$I$9,2))","v":"Essai 2"},null,8,{"$f":"IF(B86=Liste1!$F$9,Liste1!$F$9*E86*100+MONTH($A86),0)","v":0},{"$f":"IF(B86=Liste1!$F$9,J86-I86,0)","v":0},{"$f":"IF(E86=\"\",\"\",VLOOKUP(E86,Liste1!$A$2:$B$41,2))","v":"Léon Dit"},23.64,null,{"$f":"IF($B86=Liste1!$F$9,1,0)","v":0},{"$f":"IF(I86+J86=0,\"\",(E86*100+(YEAR($A86)+MONTH($A86)+MONTH($A86)))/((YEAR($A86))))","v":1.3964409293129016},{"$f":"IF(O86+K86>0,I86,\"\")","v":""},{"$f":"IF(O86+K86>0,J86,\"\")","v":""},null,{"$f":"IF(O86+K86=0,\"\",(J86-I86))","v":""}]
["2023-01-09",2,{"$f":"IF(B87=\"\",\"\",VLOOKUP(B87,Liste1!$F$2:$I$9,2))","v":"Essai 2"},null,8,{"$f":"IF(B87=Liste1!$F$9,Liste1!$F$9*E87*100+MONTH($A87),0)","v":0},{"$f":"IF(B87=Liste1!$F$9,J87-I87,0)","v":0},{"$f":"IF(E87=\"\",\"\",VLOOKUP(E87,Liste1!$A$2:$B$41,2))","v":"Léon Dit"},null,130,{"$f":"IF($B87=Liste1!$F$9,1,0)","v":0},{"$f":"IF(I87+J87=0,\"\",(E87*100+(YEAR($A87)+MONTH($A87)+MONTH($A87)))/((YEAR($A87))))","v":1.3964409293129016},{"$f":"IF(O87+K87>0,I87,\"\")","v":""},{"$f":"IF(O87+K87>0,J87,\"\")","v":""},null,{"$f":"IF(O87+K87=0,\"\",(J87-I87))","v":""}]
["2023-01-12",2,{"$f":"IF(B88=\"\",\"\",VLOOKUP(B88,Liste1!$F$2:$I$9,2))","v":"Essai 2"},null,8,{"$f":"IF(B88=Liste1!$F$9,Liste1!$F$9*E88*100+MONTH($A88),0)","v":0},{"$f":"IF(B88=Liste1!$F$9,J88-I88,0)","v":0},{"$f":"IF(E88=\"\",\"\",VLOOKUP(E88,Liste1!$A$2:$B$41,2))","v":"Léon Dit"},22.12,null,{"$f":"IF($B88=Liste1!$F$9,1,0)","v":0},{"$f":"IF(I88+J88=0,\"\",(E88*100+(YEAR($A88)+MONTH($A88)+MONTH($A88)))/((YEAR($A88))))","v":1.3964409293129016},{"$f":"IF(O88+K88>0,I88,\"\")","v":""},{"$f":"IF(O88+K88>0,J88,\"\")","v":""},null,{"$f":"IF(O88+K88=0,\"\",(J88-I88))","v":""}]
["2023-01-12",2,{"$f":"IF(B89=\"\",\"\",VLOOKUP(B89,Liste1!$F$2:$I$9,2))","v":"Essai 2"},null,8,{"$f":"IF(B89=Liste1!$F$9,Liste1!$F$9*E89*100+MONTH($A89),0)","v":0},{"$f":"IF(B89=Liste1!$F$9,J89-I89,0)","v":0},{"$f":"IF(E89=\"\",\"\",VLOOKUP(E89,Liste1!$A$2:$B$41,2))","v":"Léon Dit"},3.94,null,{"$f":"IF($B89=Liste1!$F$9,1,0)","v":0},{"$f":"IF(I89+J89=0,\"\",(E89*100+(YEAR($A89)+MONTH($A89)+MONTH($A89)))/((YEAR($A89))))","v":1.3964409293129016},{"$f":"IF(O89+K89>0,I89,\"\")","v":""},{"$f":"IF(O89+K89>0,J89,\"\")","v":""},null,{"$f":"IF(O89+K89=0,\"\",(J89-I89))","v":""}]
["2023-01-14",2,{"$f":"IF(B90=\"\",\"\",VLOOKUP(B90,Liste1!$F$2:$I$9,2))","v":"Essai 2"},null,8,{"$f":"IF(B90=Liste1!$F$9,Liste1!$F$9*E90*100+MONTH($A90),0)","v":0},{"$f":"IF(B90=Liste1!$F$9,J90-I90,0)","v":0},{"$f":"IF(E90=\"\",\"\",VLOOKUP(E90,Liste1!$A$2:$B$41,2))","v":"Léon Dit"},19.38,null,{"$f":"IF($B90=Liste1!$F$9,1,0)","v":0},{"$f":"IF(I90+J90=0,\"\",(E90*100+(YEAR($A90)+MONTH($A90)+MONTH($A90)))/((YEAR($A90))))","v":1.3964409293129016},{"$f":"IF(O90+K90>0,I90,\"\")","v":""},{"$f":"IF(O90+K90>0,J90,\"\")","v":""},null,{"$f":"IF(O90+K90=0,\"\",(J90-I90))","v":""}]
["2023-01-16",2,{"$f":"IF(B91=\"\",\"\",VLOOKUP(B91,Liste1!$F$2:$I$9,2))","v":"Essai 2"},null,8,{"$f":"IF(B91=Liste1!$F$9,Liste1!$F$9*E91*100+MONTH($A91),0)","v":0},{"$f":"IF(B91=Liste1!$F$9,J91-I91,0)","v":0},{"$f":"IF(E91=\"\",\"\",VLOOKUP(E91,Liste1!$A$2:$B$41,2))","v":"Léon Dit"},37.369999999999997,null,{"$f":"IF($B91=Liste1!$F$9,1,0)","v":0},{"$f":"IF(I91+J91=0,\"\",(E91*100+(YEAR($A91)+MONTH($A91)+MONTH($A91)))/((YEAR($A91))))","v":1.3964409293129016},{"$f":"IF(O91+K91>0,I91,\"\")","v":""},{"$f":"IF(O91+K91>0,J91,\"\")","v":""},null,{"$f":"IF(O91+K91=0,\"\",(J91-I91))","v":""}]
["2023-01-16",2,{"$f":"IF(B92=\"\",\"\",VLOOKUP(B92,Liste1!$F$2:$I$9,2))","v":"Essai 2"},null,8,{"$f":"IF(B92=Liste1!$F$9,Liste1!$F$9*E92*100+MONTH($A92),0)","v":0},{"$f":"IF(B92=Liste1!$F$9,J92-I92,0)","v":0},{"$f":"IF(E92=\"\",\"\",VLOOKUP(E92,Liste1!$A$2:$B$41,2))","v":"Léon Dit"},16.010000000000002,null,{"$f":"IF($B92=Liste1!$F$9,1,0)","v":0},{"$f":"IF(I92+J92=0,\"\",(E92*100+(YEAR($A92)+MONTH($A92)+MONTH($A92)))/((YEAR($A92))))","v":1.3964409293129016},{"$f":"IF(O92+K92>0,I92,\"\")","v":""},{"$f":"IF(O92+K92>0,J92,\"\")","v":""},null,{"$f":"IF(O92+K92=0,\"\",(J92-I92))","v":""}]
["2023-01-19",2,{"$f":"IF(B93=\"\",\"\",VLOOKUP(B93,Liste1!$F$2:$I$9,2))","v":"Essai 2"},null,8,{"$f":"IF(B93=Liste1!$F$9,Liste1!$F$9*E93*100+MONTH($A93),0)","v":0},{"$f":"IF(B93=Liste1!$F$9,J93-I93,0)","v":0},{"$f":"IF(E93=\"\",\"\",VLOOKUP(E93,Liste1!$A$2:$B$41,2))","v":"Léon Dit"},13.01,null,{"$f":"IF($B93=Liste1!$F$9,1,0)","v":0},{"$f":"IF(I93+J93=0,\"\",(E93*100+(YEAR($A93)+MONTH($A93)+MONTH($A93)))/((YEAR($A93))))","v":1.3964409293129016},{"$f":"IF(O93+K93>0,I93,\"\")","v":""},{"$f":"IF(O93+K93>0,J93,\"\")","v":""},null,{"$f":"IF(O93+K93=0,\"\",(J93-I93))","v":""}]
["2023-01-24",2,{"$f":"IF(B94=\"\",\"\",VLOOKUP(B94,Liste1!$F$2:$I$9,2))","v":"Essai 2"},null,8,{"$f":"IF(B94=Liste1!$F$9,Liste1!$F$9*E94*100+MONTH($A94),0)","v":0},{"$f":"IF(B94=Liste1!$F$9,J94-I94,0)","v":0},{"$f":"IF(E94=\"\",\"\",VLOOKUP(E94,Liste1!$A$2:$B$41,2))","v":"Léon Dit"},21.66,null,{"$f":"IF($B94=Liste1!$F$9,1,0)","v":0},{"$f":"IF(I94+J94=0,\"\",(E94*100+(YEAR($A94)+MONTH($A94)+MONTH($A94)))/((YEAR($A94))))","v":1.3964409293129016},{"$f":"IF(O94+K94>0,I94,\"\")","v":""},{"$f":"IF(O94+K94>0,J94,\"\")","v":""},null,{"$f":"IF(O94+K94=0,\"\",(J94-I94))","v":""}]
["2023-01-27",2,{"$f":"IF(B95=\"\",\"\",VLOOKUP(B95,Liste1!$F$2:$I$9,2))","v":"Essai 2"},null,8,{"$f":"IF(B95=Liste1!$F$9,Liste1!$F$9*E95*100+MONTH($A95),0)","v":0},{"$f":"IF(B95=Liste1!$F$9,J95-I95,0)","v":0},{"$f":"IF(E95=\"\",\"\",VLOOKUP(E95,Liste1!$A$2:$B$41,2))","v":"Léon Dit"},17.47,null,{"$f":"IF($B95=Liste1!$F$9,1,0)","v":0},{"$f":"IF(I95+J95=0,\"\",(E95*100+(YEAR($A95)+MONTH($A95)+MONTH($A95)))/((YEAR($A95))))","v":1.3964409293129016},{"$f":"IF(O95+K95>0,I95,\"\")","v":""},{"$f":"IF(O95+K95>0,J95,\"\")","v":""},null,{"$f":"IF(O95+K95=0,\"\",(J95-I95))","v":""}]
["2023-02-01",2,{"$f":"IF(B96=\"\",\"\",VLOOKUP(B96,Liste1!$F$2:$I$9,2))","v":"Essai 2"},null,8,{"$f":"IF(B96=Liste1!$F$9,Liste1!$F$9*E96*100+MONTH($A96),0)","v":0},{"$f":"IF(B96=Liste1!$F$9,J96-I96,0)","v":0},{"$f":"IF(E96=\"\",\"\",VLOOKUP(E96,Liste1!$A$2:$B$41,2))","v":"Léon Dit"},54.26,null,{"$f":"IF($B96=Liste1!$F$9,1,0)","v":0},{"$f":"IF(I96+J96=0,\"\",(E96*100+(YEAR($A96)+MONTH($A96)+MONTH($A96)))/((YEAR($A96))))","v":1.3974295600593178},{"$f":"IF(O96+K96>0,I96,\"\")","v":""},{"$f":"IF(O96+K96>0,J96,\"\")","v":""},null,{"$f":"IF(O96+K96=0,\"\",(J96-I96))","v":""}]
["2023-02-03",2,{"$f":"IF(B97=\"\",\"\",VLOOKUP(B97,Liste1!$F$2:$I$9,2))","v":"Essai 2"},null,8,{"$f":"IF(B97=Liste1!$F$9,Liste1!$F$9*E97*100+MONTH($A97),0)","v":0},{"$f":"IF(B97=Liste1!$F$9,J97-I97,0)","v":0},{"$f":"IF(E97=\"\",\"\",VLOOKUP(E97,Liste1!$A$2:$B$41,2))","v":"Léon Dit"},34.86,null,{"$f":"IF($B97=Liste1!$F$9,1,0)","v":0},{"$f":"IF(I97+J97=0,\"\",(E97*100+(YEAR($A97)+MONTH($A97)+MONTH($A97)))/((YEAR($A97))))","v":1.3974295600593178},{"$f":"IF(O97+K97>0,I97,\"\")","v":""},{"$f":"IF(O97+K97>0,J97,\"\")","v":""},null,{"$f":"IF(O97+K97=0,\"\",(J97-I97))","v":""}]
["2023-02-03",2,{"$f":"IF(B98=\"\",\"\",VLOOKUP(B98,Liste1!$F$2:$I$9,2))","v":"Essai 2"},null,8,{"$f":"IF(B98=Liste1!$F$9,Liste1!$F$9*E98*100+MONTH($A98),0)","v":0},{"$f":"IF(B98=Liste1!$F$9,J98-I98,0)","v":0},{"$f":"IF(E98=\"\",\"\",VLOOKUP(E98,Liste1!$A$2:$B$41,2))","v":"Léon Dit"},13.43,null,{"$f":"IF($B98=Liste1!$F$9,1,0)","v":0},{"$f":"IF(I98+J98=0,\"\",(E98*100+(YEAR($A98)+MONTH($A98)+MONTH($A98)))/((YEAR($A98))))","v":1.3974295600593178},{"$f":"IF(O98+K98>0,I98,\"\")","v":""},{"$f":"IF(O98+K98>0,J98,\"\")","v":""},null,{"$f":"IF(O98+K98=0,\"\",(J98-I98))","v":""}]
["2023-02-06",2,{"$f":"IF(B99=\"\",\"\",VLOOKUP(B99,Liste1!$F$2:$I$9,2))","v":"Essai 2"},null,8,{"$f":"IF(B99=Liste1!$F$9,Liste1!$F$9*E99*100+MONTH($A99),0)","v":0},{"$f":"IF(B99=Liste1!$F$9,J99-I99,0)","v":0},{"$f":"IF(E99=\"\",\"\",VLOOKUP(E99,Liste1!$A$2:$B$41,2))","v":"Léon Dit"},19.440000000000001,null,{"$f":"IF($B99=Liste1!$F$9,1,0)","v":0},{"$f":"IF(I99+J99=0,\"\",(E99*100+(YEAR($A99)+MONTH($A99)+MONTH($A99)))/((YEAR($A99))))","v":1.3974295600593178},{"$f":"IF(O99+K99>0,I99,\"\")","v":""},{"$f":"IF(O99+K99>0,J99,\"\")","v":""},null,{"$f":"IF(O99+K99=0,\"\",(J99-I99))","v":""}]
["2023-02-10",2,{"$f":"IF(B100=\"\",\"\",VLOOKUP(B100,Liste1!$F$2:$I$9,2))","v":"Essai 2"},null,8,{"$f":"IF(B100=Liste1!$F$9,Liste1!$F$9*E100*100+MONTH($A100),0)","v":0},{"$f":"IF(B100=Liste1!$F$9,J100-I100,0)","v":0},{"$f":"IF(E100=\"\",\"\",VLOOKUP(E100,Liste1!$A$2:$B$41,2))","v":"Léon Dit"},48.22,null,{"$f":"IF($B100=Liste1!$F$9,1,0)","v":0},{"$f":"IF(I100+J100=0,\"\",(E100*100+(YEAR($A100)+MONTH($A100)+MONTH($A100)))/((YEAR($A100))))","v":1.3974295600593178},{"$f":"IF(O100+K100>0,I100,\"\")","v":""},{"$f":"IF(O100+K100>0,J100,\"\")","v":""},null,{"$f":"IF(O100+K100=0,\"\",(J100-I100))","v":""}]
["2023-02-14",2,{"$f":"IF(B101=\"\",\"\",VLOOKUP(B101,Liste1!$F$2:$I$9,2))","v":"Essai 2"},null,8,{"$f":"IF(B101=Liste1!$F$9,Liste1!$F$9*E101*100+MONTH($A101),0)","v":0},{"$f":"IF(B101=Liste1!$F$9,J101-I101,0)","v":0},{"$f":"IF(E101=\"\",\"\",VLOOKUP(E101,Liste1!$A$2:$B$41,2))","v":"Léon Dit"},48.06,null,{"$f":"IF($B101=Liste1!$F$9,1,0)","v":0},{"$f":"IF(I101+J101=0,\"\",(E101*100+(YEAR($A101)+MONTH($A101)+MONTH($A101)))/((YEAR($A101))))","v":1.3974295600593178},{"$f":"IF(O101+K101>0,I101,\"\")","v":""},{"$f":"IF(O101+K101>0,J101,\"\")","v":""},null,{"$f":"IF(O101+K101=0,\"\",(J101-I101))","v":""}]
["2023-02-14",2,{"$f":"IF(B102=\"\",\"\",VLOOKUP(B102,Liste1!$F$2:$I$9,2))","v":"Essai 2"},null,8,{"$f":"IF(B102=Liste1!$F$9,Liste1!$F$9*E102*100+MONTH($A102),0)","v":0},{"$f":"IF(B102=Liste1!$F$9,J102-I102,0)","v":0},{"$f":"IF(E102=\"\",\"\",VLOOKUP(E102,Liste1!$A$2:$B$41,2))","v":"Léon Dit"},10.65,null,{"$f":"IF($B102=Liste1!$F$9,1,0)","v":0},{"$f":"IF(I102+J102=0,\"\",(E102*100+(YEAR($A102)+MONTH($A102)+MONTH($A102)))/((YEAR($A102))))","v":1.3974295600593178},{"$f":"IF(O102+K102>0,I102,\"\")","v":""},{"$f":"IF(O102+K102>0,J102,\"\")","v":""},null,{"$f":"IF(O102+K102=0,\"\",(J102-I102))","v":""}]
["2023-02-21",2,{"$f":"IF(B103=\"\",\"\",VLOOKUP(B103,Liste1!$F$2:$I$9,2))","v":"Essai 2"},null,8,{"$f":"IF(B103=Liste1!$F$9,Liste1!$F$9*E103*100+MONTH($A103),0)","v":0},{"$f":"IF(B103=Liste1!$F$9,J103-I103,0)","v":0},{"$f":"IF(E103=\"\",\"\",VLOOKUP(E103,Liste1!$A$2:$B$41,2))","v":"Léon Dit"},36.909999999999997,null,{"$f":"IF($B103=Liste1!$F$9,1,0)","v":0},{"$f":"IF(I103+J103=0,\"\",(E103*100+(YEAR($A103)+MONTH($A103)+MONTH($A103)))/((YEAR($A103))))","v":1.3974295600593178},{"$f":"IF(O103+K103>0,I103,\"\")","v":""},{"$f":"IF(O103+K103>0,J103,\"\")","v":""},null,{"$f":"IF(O103+K103=0,\"\",(J103-I103))","v":""}]
["2023-02-21",2,{"$f":"IF(B104=\"\",\"\",VLOOKUP(B104,Liste1!$F$2:$I$9,2))","v":"Essai 2"},null,8,{"$f":"IF(B104=Liste1!$F$9,Liste1!$F$9*E104*100+MONTH($A104),0)","v":0},{"$f":"IF(B104=Liste1!$F$9,J104-I104,0)","v":0},{"$f":"IF(E104=\"\",\"\",VLOOKUP(E104,Liste1!$A$2:$B$41,2))","v":"Léon Dit"},31.38,null,{"$f":"IF($B104=Liste1!$F$9,1,0)","v":0},{"$f":"IF(I104+J104=0,\"\",(E104*100+(YEAR($A104)+MONTH($A104)+MONTH($A104)))/((YEAR($A104))))","v":1.3974295600593178},{"$f":"IF(O104+K104>0,I104,\"\")","v":""},{"$f":"IF(O104+K104>0,J104,\"\")","v":""},null,{"$f":"IF(O104+K104=0,\"\",(J104-I104))","v":""}]
["2023-02-28",2,{"$f":"IF(B105=\"\",\"\",VLOOKUP(B105,Liste1!$F$2:$I$9,2))","v":"Essai 2"},null,8,{"$f":"IF(B105=Liste1!$F$9,Liste1!$F$9*E105*100+MONTH($A105),0)","v":0},{"$f":"IF(B105=Liste1!$F$9,J105-I105,0)","v":0},{"$f":"IF(E105=\"\",\"\",VLOOKUP(E105,Liste1!$A$2:$B$41,2))","v":"Léon Dit"},54.59,null,{"$f":"IF($B105=Liste1!$F$9,1,0)","v":0},{"$f":"IF(I105+J105=0,\"\",(E105*100+(YEAR($A105)+MONTH($A105)+MONTH($A105)))/((YEAR($A105))))","v":1.3974295600593178},{"$f":"IF(O105+K105>0,I105,\"\")","v":""},{"$f":"IF(O105+K105>0,J105,\"\")","v":""},null,{"$f":"IF(O105+K105=0,\"\",(J105-I105))","v":""}]
["2023-02-28",2,{"$f":"IF(B106=\"\",\"\",VLOOKUP(B106,Liste1!$F$2:$I$9,2))","v":"Essai 2"},null,8,{"$f":"IF(B106=Liste1!$F$9,Liste1!$F$9*E106*100+MONTH($A106),0)","v":0},{"$f":"IF(B106=Liste1!$F$9,J106-I106,0)","v":0},{"$f":"IF(E106=\"\",\"\",VLOOKUP(E106,Liste1!$A$2:$B$41,2))","v":"Léon Dit"},24.76,null,{"$f":"IF($B106=Liste1!$F$9,1,0)","v":0},{"$f":"IF(I106+J106=0,\"\",(E106*100+(YEAR($A106)+MONTH($A106)+MONTH($A106)))/((YEAR($A106))))","v":1.3974295600593178},{"$f":"IF(O106+K106>0,I106,\"\")","v":""},{"$f":"IF(O106+K106>0,J106,\"\")","v":""},null,{"$f":"IF(O106+K106=0,\"\",(J106-I106))","v":""}]
["2023-03-03",2,{"$f":"IF(B107=\"\",\"\",VLOOKUP(B107,Liste1!$F$2:$I$9,2))","v":"Essai 2"},null,8,{"$f":"IF(B107=Liste1!$F$9,Liste1!$F$9*E107*100+MONTH($A107),0)","v":0},{"$f":"IF(B107=Liste1!$F$9,J107-I107,0)","v":0},{"$f":"IF(E107=\"\",\"\",VLOOKUP(E107,Liste1!$A$2:$B$41,2))","v":"Léon Dit"},14.26,null,{"$f":"IF($B107=Liste1!$F$9,1,0)","v":0},{"$f":"IF(I107+J107=0,\"\",(E107*100+(YEAR($A107)+MONTH($A107)+MONTH($A107)))/((YEAR($A107))))","v":1.398418190805734},{"$f":"IF(O107+K107>0,I107,\"\")","v":""},{"$f":"IF(O107+K107>0,J107,\"\")","v":""},null,{"$f":"IF(O107+K107=0,\"\",(J107-I107))","v":""}]
["2023-03-08",2,{"$f":"IF(B108=\"\",\"\",VLOOKUP(B108,Liste1!$F$2:$I$9,2))","v":"Essai 2"},null,8,{"$f":"IF(B108=Liste1!$F$9,Liste1!$F$9*E108*100+MONTH($A108),0)","v":0},{"$f":"IF(B108=Liste1!$F$9,J108-I108,0)","v":0},{"$f":"IF(E108=\"\",\"\",VLOOKUP(E108,Liste1!$A$2:$B$41,2))","v":"Léon Dit"},45.65,null,{"$f":"IF($B108=Liste1!$F$9,1,0)","v":0},{"$f":"IF(I108+J108=0,\"\",(E108*100+(YEAR($A108)+MONTH($A108)+MONTH($A108)))/((YEAR($A108))))","v":1.398418190805734},{"$f":"IF(O108+K108>0,I108,\"\")","v":""},{"$f":"IF(O108+K108>0,J108,\"\")","v":""},null,{"$f":"IF(O108+K108=0,\"\",(J108-I108))","v":""}]
["2023-03-08",2,{"$f":"IF(B109=\"\",\"\",VLOOKUP(B109,Liste1!$F$2:$I$9,2))","v":"Essai 2"},null,8,{"$f":"IF(B109=Liste1!$F$9,Liste1!$F$9*E109*100+MONTH($A109),0)","v":0},{"$f":"IF(B109=Liste1!$F$9,J109-I109,0)","v":0},{"$f":"IF(E109=\"\",\"\",VLOOKUP(E109,Liste1!$A$2:$B$41,2))","v":"Léon Dit"},25.07,null,{"$f":"IF($B109=Liste1!$F$9,1,0)","v":0},{"$f":"IF(I109+J109=0,\"\",(E109*100+(YEAR($A109)+MONTH($A109)+MONTH($A109)))/((YEAR($A109))))","v":1.398418190805734},{"$f":"IF(O109+K109>0,I109,\"\")","v":""},{"$f":"IF(O109+K109>0,J109,\"\")","v":""},null,{"$f":"IF(O109+K109=0,\"\",(J109-I109))","v":""}]
["2023-03-08",2,{"$f":"IF(B110=\"\",\"\",VLOOKUP(B110,Liste1!$F$2:$I$9,2))","v":"Essai 2"},null,8,{"$f":"IF(B110=Liste1!$F$9,Liste1!$F$9*E110*100+MONTH($A110),0)","v":0},{"$f":"IF(B110=Liste1!$F$9,J110-I110,0)","v":0},{"$f":"IF(E110=\"\",\"\",VLOOKUP(E110,Liste1!$A$2:$B$41,2))","v":"Léon Dit"},17.03,null,{"$f":"IF($B110=Liste1!$F$9,1,0)","v":0},{"$f":"IF(I110+J110=0,\"\",(E110*100+(YEAR($A110)+MONTH($A110)+MONTH($A110)))/((YEAR($A110))))","v":1.398418190805734},{"$f":"IF(O110+K110>0,I110,\"\")","v":""},{"$f":"IF(O110+K110>0,J110,\"\")","v":""},null,{"$f":"IF(O110+K110=0,\"\",(J110-I110))","v":""}]
["2023-03-10",2,{"$f":"IF(B111=\"\",\"\",VLOOKUP(B111,Liste1!$F$2:$I$9,2))","v":"Essai 2"},null,8,{"$f":"IF(B111=Liste1!$F$9,Liste1!$F$9*E111*100+MONTH($A111),0)","v":0},{"$f":"IF(B111=Liste1!$F$9,J111-I111,0)","v":0},{"$f":"IF(E111=\"\",\"\",VLOOKUP(E111,Liste1!$A$2:$B$41,2))","v":"Léon Dit"},9.86,null,{"$f":"IF($B111=Liste1!$F$9,1,0)","v":0},{"$f":"IF(I111+J111=0,\"\",(E111*100+(YEAR($A111)+MONTH($A111)+MONTH($A111)))/((YEAR($A111))))","v":1.398418190805734},{"$f":"IF(O111+K111>0,I111,\"\")","v":""},{"$f":"IF(O111+K111>0,J111,\"\")","v":""},null,{"$f":"IF(O111+K111=0,\"\",(J111-I111))","v":""}]
["2023-03-10",2,{"$f":"IF(B112=\"\",\"\",VLOOKUP(B112,Liste1!$F$2:$I$9,2))","v":"Essai 2"},null,8,{"$f":"IF(B112=Liste1!$F$9,Liste1!$F$9*E112*100+MONTH($A112),0)","v":0},{"$f":"IF(B112=Liste1!$F$9,J112-I112,0)","v":0},{"$f":"IF(E112=\"\",\"\",VLOOKUP(E112,Liste1!$A$2:$B$41,2))","v":"Léon Dit"},2.6,null,{"$f":"IF($B112=Liste1!$F$9,1,0)","v":0},{"$f":"IF(I112+J112=0,\"\",(E112*100+(YEAR($A112)+MONTH($A112)+MONTH($A112)))/((YEAR($A112))))","v":1.398418190805734},{"$f":"IF(O112+K112>0,I112,\"\")","v":""},{"$f":"IF(O112+K112>0,J112,\"\")","v":""},null,{"$f":"IF(O112+K112=0,\"\",(J112-I112))","v":""}]
["2023-03-16",2,{"$f":"IF(B113=\"\",\"\",VLOOKUP(B113,Liste1!$F$2:$I$9,2))","v":"Essai 2"},null,8,{"$f":"IF(B113=Liste1!$F$9,Liste1!$F$9*E113*100+MONTH($A113),0)","v":0},{"$f":"IF(B113=Liste1!$F$9,J113-I113,0)","v":0},{"$f":"IF(E113=\"\",\"\",VLOOKUP(E113,Liste1!$A$2:$B$41,2))","v":"Léon Dit"},63.81,null,{"$f":"IF($B113=Liste1!$F$9,1,0)","v":0},{"$f":"IF(I113+J113=0,\"\",(E113*100+(YEAR($A113)+MONTH($A113)+MONTH($A113)))/((YEAR($A113))))","v":1.398418190805734},{"$f":"IF(O113+K113>0,I113,\"\")","v":""},{"$f":"IF(O113+K113>0,J113,\"\")","v":""},null,{"$f":"IF(O113+K113=0,\"\",(J113-I113))","v":""}]
["2023-03-16",2,{"$f":"IF(B114=\"\",\"\",VLOOKUP(B114,Liste1!$F$2:$I$9,2))","v":"Essai 2"},null,8,{"$f":"IF(B114=Liste1!$F$9,Liste1!$F$9*E114*100+MONTH($A114),0)","v":0},{"$f":"IF(B114=Liste1!$F$9,J114-I114,0)","v":0},{"$f":"IF(E114=\"\",\"\",VLOOKUP(E114,Liste1!$A$2:$B$41,2))","v":"Léon Dit"},10.68,null,{"$f":"IF($B114=Liste1!$F$9,1,0)","v":0},{"$f":"IF(I114+J114=0,\"\",(E114*100+(YEAR($A114)+MONTH($A114)+MONTH($A114)))/((YEAR($A114))))","v":1.398418190805734},{"$f":"IF(O114+K114>0,I114,\"\")","v":""},{"$f":"IF(O114+K114>0,J114,\"\")","v":""},null,{"$f":"IF(O114+K114=0,\"\",(J114-I114))","v":""}]
["2023-03-23",2,{"$f":"IF(B115=\"\",\"\",VLOOKUP(B115,Liste1!$F$2:$I$9,2))","v":"Essai 2"},null,8,{"$f":"IF(B115=Liste1!$F$9,Liste1!$F$9*E115*100+MONTH($A115),0)","v":0},{"$f":"IF(B115=Liste1!$F$9,J115-I115,0)","v":0},{"$f":"IF(E115=\"\",\"\",VLOOKUP(E115,Liste1!$A$2:$B$41,2))","v":"Léon Dit"},36.86,null,{"$f":"IF($B115=Liste1!$F$9,1,0)","v":0},{"$f":"IF(I115+J115=0,\"\",(E115*100+(YEAR($A115)+MONTH($A115)+MONTH($A115)))/((YEAR($A115))))","v":1.398418190805734},{"$f":"IF(O115+K115>0,I115,\"\")","v":""},{"$f":"IF(O115+K115>0,J115,\"\")","v":""},null,{"$f":"IF(O115+K115=0,\"\",(J115-I115))","v":""}]
["2023-03-24",2,{"$f":"IF(B116=\"\",\"\",VLOOKUP(B116,Liste1!$F$2:$I$9,2))","v":"Essai 2"},null,8,{"$f":"IF(B116=Liste1!$F$9,Liste1!$F$9*E116*100+MONTH($A116),0)","v":0},{"$f":"IF(B116=Liste1!$F$9,J116-I116,0)","v":0},{"$f":"IF(E116=\"\",\"\",VLOOKUP(E116,Liste1!$A$2:$B$41,2))","v":"Léon Dit"},8.14,null,{"$f":"IF($B116=Liste1!$F$9,1,0)","v":0},{"$f":"IF(I116+J116=0,\"\",(E116*100+(YEAR($A116)+MONTH($A116)+MONTH($A116)))/((YEAR($A116))))","v":1.398418190805734},{"$f":"IF(O116+K116>0,I116,\"\")","v":""},{"$f":"IF(O116+K116>0,J116,\"\")","v":""},null,{"$f":"IF(O116+K116=0,\"\",(J116-I116))","v":""}]
["2023-03-30",2,{"$f":"IF(B117=\"\",\"\",VLOOKUP(B117,Liste1!$F$2:$I$9,2))","v":"Essai 2"},null,8,{"$f":"IF(B117=Liste1!$F$9,Liste1!$F$9*E117*100+MONTH($A117),0)","v":0},{"$f":"IF(B117=Liste1!$F$9,J117-I117,0)","v":0},{"$f":"IF(E117=\"\",\"\",VLOOKUP(E117,Liste1!$A$2:$B$41,2))","v":"Léon Dit"},20.29,null,{"$f":"IF($B117=Liste1!$F$9,1,0)","v":0},{"$f":"IF(I117+J117=0,\"\",(E117*100+(YEAR($A117)+MONTH($A117)+MONTH($A117)))/((YEAR($A117))))","v":1.398418190805734},{"$f":"IF(O117+K117>0,I117,\"\")","v":""},{"$f":"IF(O117+K117>0,J117,\"\")","v":""},null,{"$f":"IF(O117+K117=0,\"\",(J117-I117))","v":""}]
["2023-04-01",2,{"$f":"IF(B118=\"\",\"\",VLOOKUP(B118,Liste1!$F$2:$I$9,2))","v":"Essai 2"},null,8,{"$f":"IF(B118=Liste1!$F$9,Liste1!$F$9*E118*100+MONTH($A118),0)","v":0},{"$f":"IF(B118=Liste1!$F$9,J118-I118,0)","v":0},{"$f":"IF(E118=\"\",\"\",VLOOKUP(E118,Liste1!$A$2:$B$41,2))","v":"Léon Dit"},45.73,null,{"$f":"IF($B118=Liste1!$F$9,1,0)","v":0},{"$f":"IF(I118+J118=0,\"\",(E118*100+(YEAR($A118)+MONTH($A118)+MONTH($A118)))/((YEAR($A118))))","v":1.3994068215521502},{"$f":"IF(O118+K118>0,I118,\"\")","v":""},{"$f":"IF(O118+K118>0,J118,\"\")","v":""},null,{"$f":"IF(O118+K118=0,\"\",(J118-I118))","v":""}]
["2023-04-06",2,{"$f":"IF(B119=\"\",\"\",VLOOKUP(B119,Liste1!$F$2:$I$9,2))","v":"Essai 2"},null,8,{"$f":"IF(B119=Liste1!$F$9,Liste1!$F$9*E119*100+MONTH($A119),0)","v":0},{"$f":"IF(B119=Liste1!$F$9,J119-I119,0)","v":0},{"$f":"IF(E119=\"\",\"\",VLOOKUP(E119,Liste1!$A$2:$B$41,2))","v":"Léon Dit"},55.8,null,{"$f":"IF($B119=Liste1!$F$9,1,0)","v":0},{"$f":"IF(I119+J119=0,\"\",(E119*100+(YEAR($A119)+MONTH($A119)+MONTH($A119)))/((YEAR($A119))))","v":1.3994068215521502},{"$f":"IF(O119+K119>0,I119,\"\")","v":""},{"$f":"IF(O119+K119>0,J119,\"\")","v":""},null,{"$f":"IF(O119+K119=0,\"\",(J119-I119))","v":""}]
["2023-04-06",2,{"$f":"IF(B120=\"\",\"\",VLOOKUP(B120,Liste1!$F$2:$I$9,2))","v":"Essai 2"},null,8,{"$f":"IF(B120=Liste1!$F$9,Liste1!$F$9*E120*100+MONTH($A120),0)","v":0},{"$f":"IF(B120=Liste1!$F$9,J120-I120,0)","v":0},{"$f":"IF(E120=\"\",\"\",VLOOKUP(E120,Liste1!$A$2:$B$41,2))","v":"Léon Dit"},13.54,null,{"$f":"IF($B120=Liste1!$F$9,1,0)","v":0},{"$f":"IF(I120+J120=0,\"\",(E120*100+(YEAR($A120)+MONTH($A120)+MONTH($A120)))/((YEAR($A120))))","v":1.3994068215521502},{"$f":"IF(O120+K120>0,I120,\"\")","v":""},{"$f":"IF(O120+K120>0,J120,\"\")","v":""},null,{"$f":"IF(O120+K120=0,\"\",(J120-I120))","v":""}]
["2023-04-10",2,{"$f":"IF(B121=\"\",\"\",VLOOKUP(B121,Liste1!$F$2:$I$9,2))","v":"Essai 2"},null,8,{"$f":"IF(B121=Liste1!$F$9,Liste1!$F$9*E121*100+MONTH($A121),0)","v":0},{"$f":"IF(B121=Liste1!$F$9,J121-I121,0)","v":0},{"$f":"IF(E121=\"\",\"\",VLOOKUP(E121,Liste1!$A$2:$B$41,2))","v":"Léon Dit"},19.37,null,{"$f":"IF($B121=Liste1!$F$9,1,0)","v":0},{"$f":"IF(I121+J121=0,\"\",(E121*100+(YEAR($A121)+MONTH($A121)+MONTH($A121)))/((YEAR($A121))))","v":1.3994068215521502},{"$f":"IF(O121+K121>0,I121,\"\")","v":""},{"$f":"IF(O121+K121>0,J121,\"\")","v":""},null,{"$f":"IF(O121+K121=0,\"\",(J121-I121))","v":""}]
["2023-04-12",2,{"$f":"IF(B122=\"\",\"\",VLOOKUP(B122,Liste1!$F$2:$I$9,2))","v":"Essai 2"},null,8,{"$f":"IF(B122=Liste1!$F$9,Liste1!$F$9*E122*100+MONTH($A122),0)","v":0},{"$f":"IF(B122=Liste1!$F$9,J122-I122,0)","v":0},{"$f":"IF(E122=\"\",\"\",VLOOKUP(E122,Liste1!$A$2:$B$41,2))","v":"Léon Dit"},25.46,null,{"$f":"IF($B122=Liste1!$F$9,1,0)","v":0},{"$f":"IF(I122+J122=0,\"\",(E122*100+(YEAR($A122)+MONTH($A122)+MONTH($A122)))/((YEAR($A122))))","v":1.3994068215521502},{"$f":"IF(O122+K122>0,I122,\"\")","v":""},{"$f":"IF(O122+K122>0,J122,\"\")","v":""},null,{"$f":"IF(O122+K122=0,\"\",(J122-I122))","v":""}]
["2023-04-13",2,{"$f":"IF(B123=\"\",\"\",VLOOKUP(B123,Liste1!$F$2:$I$9,2))","v":"Essai 2"},null,8,{"$f":"IF(B123=Liste1!$F$9,Liste1!$F$9*E123*100+MONTH($A123),0)","v":0},{"$f":"IF(B123=Liste1!$F$9,J123-I123,0)","v":0},{"$f":"IF(E123=\"\",\"\",VLOOKUP(E123,Liste1!$A$2:$B$41,2))","v":"Léon Dit"},9.31,null,{"$f":"IF($B123=Liste1!$F$9,1,0)","v":0},{"$f":"IF(I123+J123=0,\"\",(E123*100+(YEAR($A123)+MONTH($A123)+MONTH($A123)))/((YEAR($A123))))","v":1.3994068215521502},{"$f":"IF(O123+K123>0,I123,\"\")","v":""},{"$f":"IF(O123+K123>0,J123,\"\")","v":""},null,{"$f":"IF(O123+K123=0,\"\",(J123-I123))","v":""}]
["2023-04-19",2,{"$f":"IF(B124=\"\",\"\",VLOOKUP(B124,Liste1!$F$2:$I$9,2))","v":"Essai 2"},null,8,{"$f":"IF(B124=Liste1!$F$9,Liste1!$F$9*E124*100+MONTH($A124),0)","v":0},{"$f":"IF(B124=Liste1!$F$9,J124-I124,0)","v":0},{"$f":"IF(E124=\"\",\"\",VLOOKUP(E124,Liste1!$A$2:$B$41,2))","v":"Léon Dit"},86.31,null,{"$f":"IF($B124=Liste1!$F$9,1,0)","v":0},{"$f":"IF(I124+J124=0,\"\",(E124*100+(YEAR($A124)+MONTH($A124)+MONTH($A124)))/((YEAR($A124))))","v":1.3994068215521502},{"$f":"IF(O124+K124>0,I124,\"\")","v":""},{"$f":"IF(O124+K124>0,J124,\"\")","v":""},null,{"$f":"IF(O124+K124=0,\"\",(J124-I124))","v":""}]
["2023-04-26",2,{"$f":"IF(B125=\"\",\"\",VLOOKUP(B125,Liste1!$F$2:$I$9,2))","v":"Essai 2"},null,8,{"$f":"IF(B125=Liste1!$F$9,Liste1!$F$9*E125*100+MONTH($A125),0)","v":0},{"$f":"IF(B125=Liste1!$F$9,J125-I125,0)","v":0},{"$f":"IF(E125=\"\",\"\",VLOOKUP(E125,Liste1!$A$2:$B$41,2))","v":"Léon Dit"},47.48,null,{"$f":"IF($B125=Liste1!$F$9,1,0)","v":0},{"$f":"IF(B125=7,\"\",(E125*100+(YEAR($A125)+MONTH($A125)+MONTH($A125)))/((YEAR($A125))))","v":1.3994068215521502},{"$f":"IF(O125+K125>0,I125,\"\")","v":""},{"$f":"IF(O125+K125>0,J125,\"\")","v":""},null,{"$f":"IF(O125+K125=0,\"\",(J125-I125))","v":""}]
["2023-05-03",2,{"$f":"IF(B126=\"\",\"\",VLOOKUP(B126,Liste1!$F$2:$I$9,2))","v":"Essai 2"},null,8,{"$f":"IF(B126=Liste1!$F$9,Liste1!$F$9*E126*100+MONTH($A126),0)","v":0},{"$f":"IF(B126=Liste1!$F$9,J126-I126,0)","v":0},{"$f":"IF(E126=\"\",\"\",VLOOKUP(E126,Liste1!$A$2:$B$41,2))","v":"Léon Dit"},48.82,null,{"$f":"IF($B126=Liste1!$F$9,1,0)","v":0},{"$f":"IF(I126+J126=0,\"\",(E126*100+(YEAR($A126)+MONTH($A126)+MONTH($A126)))/((YEAR($A126))))","v":1.4003954522985664},{"$f":"IF(O126+K126>0,I126,\"\")","v":""},{"$f":"IF(O126+K126>0,J126,\"\")","v":""},null,{"$f":"IF(O126+K126=0,\"\",(J126-I126))","v":""}]
["2023-05-05",2,{"$f":"IF(B127=\"\",\"\",VLOOKUP(B127,Liste1!$F$2:$I$9,2))","v":"Essai 2"},null,8,{"$f":"IF(B127=Liste1!$F$9,Liste1!$F$9*E127*100+MONTH($A127),0)","v":0},{"$f":"IF(B127=Liste1!$F$9,J127-I127,0)","v":0},{"$f":"IF(E127=\"\",\"\",VLOOKUP(E127,Liste1!$A$2:$B$41,2))","v":"Léon Dit"},10.81,null,{"$f":"IF($B127=Liste1!$F$9,1,0)","v":0},{"$f":"IF(B127=7,\"\",(E127*100+(YEAR($A127)+MONTH($A127)+MONTH($A127)))/((YEAR($A127))))","v":1.4003954522985664},{"$f":"IF(O127+K127>0,I127,\"\")","v":""},{"$f":"IF(O127+K127>0,J127,\"\")","v":""},null,{"$f":"IF(O127+K127=0,\"\",(J127-I127))","v":""}]
["2023-05-12",2,{"$f":"IF(B128=\"\",\"\",VLOOKUP(B128,Liste1!$F$2:$I$9,2))","v":"Essai 2"},null,8,{"$f":"IF(B128=Liste1!$F$9,Liste1!$F$9*E128*100+MONTH($A128),0)","v":0},{"$f":"IF(B128=Liste1!$F$9,J128-I128,0)","v":0},{"$f":"IF(E128=\"\",\"\",VLOOKUP(E128,Liste1!$A$2:$B$41,2))","v":"Léon Dit"},34.21,null,{"$f":"IF($B128=Liste1!$F$9,1,0)","v":0},{"$f":"IF(B128=7,\"\",(E128*100+(YEAR($A128)+MONTH($A128)+MONTH($A128)))/((YEAR($A128))))","v":1.4003954522985664},{"$f":"IF(O128+K128>0,I128,\"\")","v":""},{"$f":"IF(O128+K128>0,J128,\"\")","v":""},null,{"$f":"IF(O128+K128=0,\"\",(J128-I128))","v":""}]
["2023-05-12",2,{"$f":"IF(B129=\"\",\"\",VLOOKUP(B129,Liste1!$F$2:$I$9,2))","v":"Essai 2"},null,8,{"$f":"IF(B129=Liste1!$F$9,Liste1!$F$9*E129*100+MONTH($A129),0)","v":0},{"$f":"IF(B129=Liste1!$F$9,J129-I129,0)","v":0},{"$f":"IF(E129=\"\",\"\",VLOOKUP(E129,Liste1!$A$2:$B$41,2))","v":"Léon Dit"},14.63,null,{"$f":"IF($B129=Liste1!$F$9,1,0)","v":0},{"$f":"IF(B129=7,\"\",(E129*100+(YEAR($A129)+MONTH($A129)+MONTH($A129)))/((YEAR($A129))))","v":1.4003954522985664},{"$f":"IF(O129+K129>0,I129,\"\")","v":""},{"$f":"IF(O129+K129>0,J129,\"\")","v":""},null,{"$f":"IF(O129+K129=0,\"\",(J129-I129))","v":""}]
["2023-05-12",2,{"$f":"IF(B130=\"\",\"\",VLOOKUP(B130,Liste1!$F$2:$I$9,2))","v":"Essai 2"},null,8,{"$f":"IF(B130=Liste1!$F$9,Liste1!$F$9*E130*100+MONTH($A130),0)","v":0},{"$f":"IF(B130=Liste1!$F$9,J130-I130,0)","v":0},{"$f":"IF(E130=\"\",\"\",VLOOKUP(E130,Liste1!$A$2:$B$41,2))","v":"Léon Dit"},8.11,null,{"$f":"IF($B130=Liste1!$F$9,1,0)","v":0},{"$f":"IF(B130=7,\"\",(E130*100+(YEAR($A130)+MONTH($A130)+MONTH($A130)))/((YEAR($A130))))","v":1.4003954522985664},{"$f":"IF(O130+K130>0,I130,\"\")","v":""},{"$f":"IF(O130+K130>0,J130,\"\")","v":""},null,{"$f":"IF(O130+K130=0,\"\",(J130-I130))","v":""}]
["2023-05-18",2,{"$f":"IF(B131=\"\",\"\",VLOOKUP(B131,Liste1!$F$2:$I$9,2))","v":"Essai 2"},null,8,{"$f":"IF(B131=Liste1!$F$9,Liste1!$F$9*E131*100+MONTH($A131),0)","v":0},{"$f":"IF(B131=Liste1!$F$9,J131-I131,0)","v":0},{"$f":"IF(E131=\"\",\"\",VLOOKUP(E131,Liste1!$A$2:$B$41,2))","v":"Léon Dit"},39.15,null,{"$f":"IF($B131=Liste1!$F$9,1,0)","v":0},{"$f":"IF(B131=7,\"\",(E131*100+(YEAR($A131)+MONTH($A131)+MONTH($A131)))/((YEAR($A131))))","v":1.4003954522985664},{"$f":"IF(O131+K131>0,I131,\"\")","v":""},{"$f":"IF(O131+K131>0,J131,\"\")","v":""},null,{"$f":"IF(O131+K131=0,\"\",(J131-I131))","v":""}]
["2023-05-18",2,{"$f":"IF(B132=\"\",\"\",VLOOKUP(B132,Liste1!$F$2:$I$9,2))","v":"Essai 2"},null,8,{"$f":"IF(B132=Liste1!$F$9,Liste1!$F$9*E132*100+MONTH($A132),0)","v":0},{"$f":"IF(B132=Liste1!$F$9,J132-I132,0)","v":0},{"$f":"IF(E132=\"\",\"\",VLOOKUP(E132,Liste1!$A$2:$B$41,2))","v":"Léon Dit"},12.74,null,{"$f":"IF($B132=Liste1!$F$9,1,0)","v":0},{"$f":"IF(B132=7,\"\",(E132*100+(YEAR($A132)+MONTH($A132)+MONTH($A132)))/((YEAR($A132))))","v":1.4003954522985664},{"$f":"IF(O132+K132>0,I132,\"\")","v":""},{"$f":"IF(O132+K132>0,J132,\"\")","v":""},null,{"$f":"IF(O132+K132=0,\"\",(J132-I132))","v":""}]
["2023-05-22",4,{"$f":"IF(B133=\"\",\"\",VLOOKUP(B133,Liste1!$F$2:$I$9,2))","v":"Essai 4"},null,8,0,0,{"$f":"IF(E133=\"\",\"\",VLOOKUP(E133,Liste1!$A$2:$B$41,2))","v":"Léon Dit"},8.6199999999999992,null,0,{"$f":"IF(B133=7,\"\",(E133*100+(YEAR($A133)+MONTH($A133)+MONTH($A133)))/((YEAR($A133))))","v":1.4003954522985664},{"$f":"IF(O133+K133>0,I133,\"\")","v":""},{"$f":"IF(O133+K133>0,J133,\"\")","v":""},null,{"$f":"IF(O133+K133=0,\"\",(J133-I133))","v":""}]
["2023-05-26",2,{"$f":"IF(B134=\"\",\"\",VLOOKUP(B134,Liste1!$F$2:$I$9,2))","v":"Essai 2"},null,8,{"$f":"IF(B134=Liste1!$F$9,Liste1!$F$9*E134*100+MONTH($A134),0)","v":0},{"$f":"IF(B134=Liste1!$F$9,J134-I134,0)","v":0},{"$f":"IF(E134=\"\",\"\",VLOOKUP(E134,Liste1!$A$2:$B$41,2))","v":"Léon Dit"},10.44,null,{"$f":"IF($B134=Liste1!$F$9,1,0)","v":0},{"$f":"IF(B134=7,\"\",(E134*100+(YEAR($A134)+MONTH($A134)+MONTH($A134)))/((YEAR($A134))))","v":1.4003954522985664},{"$f":"IF(O134+K134>0,I134,\"\")","v":""},{"$f":"IF(O134+K134>0,J134,\"\")","v":""},null,{"$f":"IF(O134+K134=0,\"\",(J134-I134))","v":""}]
["2023-05-26",2,{"$f":"IF(B135=\"\",\"\",VLOOKUP(B135,Liste1!$F$2:$I$9,2))","v":"Essai 2"},null,8,{"$f":"IF(B135=Liste1!$F$9,Liste1!$F$9*E135*100+MONTH($A135),0)","v":0},{"$f":"IF(B135=Liste1!$F$9,J135-I135,0)","v":0},{"$f":"IF(E135=\"\",\"\",VLOOKUP(E135,Liste1!$A$2:$B$41,2))","v":"Léon Dit"},null,34,{"$f":"IF($B135=Liste1!$F$9,1,0)","v":0},{"$f":"IF(B135=7,\"\",(E135*100+(YEAR($A135)+MONTH($A135)+MONTH($A135)))/((YEAR($A135))))","v":1.4003954522985664},{"$f":"IF(O135+K135>0,I135,\"\")","v":""},{"$f":"IF(O135+K135>0,J135,\"\")","v":""},null,{"$f":"IF(O135+K135=0,\"\",(J135-I135))","v":""}]
["2023-06-01",2,{"$f":"IF(B136=\"\",\"\",VLOOKUP(B136,Liste1!$F$2:$I$9,2))","v":"Essai 2"},null,8,{"$f":"IF(B136=Liste1!$F$9,Liste1!$F$9*E136*100+MONTH($A136),0)","v":0},{"$f":"IF(B136=Liste1!$F$9,J136-I136,0)","v":0},{"$f":"IF(E136=\"\",\"\",VLOOKUP(E136,Liste1!$A$2:$B$41,2))","v":"Léon Dit"},8.49,null,{"$f":"IF($B136=Liste1!$F$9,1,0)","v":0},{"$f":"IF(B136=7,\"\",(E136*100+(YEAR($A136)+MONTH($A136)+MONTH($A136)))/((YEAR($A136))))","v":1.4013840830449826},{"$f":"IF(O136+K136>0,I136,\"\")","v":""},{"$f":"IF(O136+K136>0,J136,\"\")","v":""},null,{"$f":"IF(O136+K136=0,\"\",(J136-I136))","v":""}]
["2023-06-02",2,{"$f":"IF(B137=\"\",\"\",VLOOKUP(B137,Liste1!$F$2:$I$9,2))","v":"Essai 2"},null,8,{"$f":"IF(B137=Liste1!$F$9,Liste1!$F$9*E137*100+MONTH($A137),0)","v":0},{"$f":"IF(B137=Liste1!$F$9,J137-I137,0)","v":0},{"$f":"IF(E137=\"\",\"\",VLOOKUP(E137,Liste1!$A$2:$B$41,2))","v":"Léon Dit"},43.17,null,{"$f":"IF($B137=Liste1!$F$9,1,0)","v":0},{"$f":"IF(B137=7,\"\",(E137*100+(YEAR($A137)+MONTH($A137)+MONTH($A137)))/((YEAR($A137))))","v":1.4013840830449826},{"$f":"IF(O137+K137>0,I137,\"\")","v":""},{"$f":"IF(O137+K137>0,J137,\"\")","v":""},null,{"$f":"IF(O137+K137=0,\"\",(J137-I137))","v":""}]
["2023-06-06",2,{"$f":"IF(B138=\"\",\"\",VLOOKUP(B138,Liste1!$F$2:$I$9,2))","v":"Essai 2"},null,8,{"$f":"IF(B138=Liste1!$F$9,Liste1!$F$9*E138*100+MONTH($A138),0)","v":0},{"$f":"IF(B138=Liste1!$F$9,J138-I138,0)","v":0},{"$f":"IF(E138=\"\",\"\",VLOOKUP(E138,Liste1!$A$2:$B$41,2))","v":"Léon Dit"},61.36,null,{"$f":"IF($B138=Liste1!$F$9,1,0)","v":0},{"$f":"IF(B138=7,\"\",(E138*100+(YEAR($A138)+MONTH($A138)+MONTH($A138)))/((YEAR($A138))))","v":1.4013840830449826},{"$f":"IF(O138+K138>0,I138,\"\")","v":""},{"$f":"IF(O138+K138>0,J138,\"\")","v":""},null,{"$f":"IF(O138+K138=0,\"\",(J138-I138))","v":""}]
["2023-06-10",2,{"$f":"IF(B139=\"\",\"\",VLOOKUP(B139,Liste1!$F$2:$I$9,2))","v":"Essai 2"},null,8,{"$f":"IF(B139=Liste1!$F$9,Liste1!$F$9*E139*100+MONTH($A139),0)","v":0},{"$f":"IF(B139=Liste1!$F$9,J139-I139,0)","v":0},{"$f":"IF(E139=\"\",\"\",VLOOKUP(E139,Liste1!$A$2:$B$41,2))","v":"Léon Dit"},56,null,{"$f":"IF($B139=Liste1!$F$9,1,0)","v":0},{"$f":"IF(B139=7,\"\",(E139*100+(YEAR($A139)+MONTH($A139)+MONTH($A139)))/((YEAR($A139))))","v":1.4013840830449826},{"$f":"IF(O139+K139>0,I139,\"\")","v":""},{"$f":"IF(O139+K139>0,J139,\"\")","v":""},null,{"$f":"IF(O139+K139=0,\"\",(J139-I139))","v":""}]
["2023-06-12",2,{"$f":"IF(B140=\"\",\"\",VLOOKUP(B140,Liste1!$F$2:$I$9,2))","v":"Essai 2"},null,8,{"$f":"IF(B140=Liste1!$F$9,Liste1!$F$9*E140*100+MONTH($A140),0)","v":0},{"$f":"IF(B140=Liste1!$F$9,J140-I140,0)","v":0},{"$f":"IF(E140=\"\",\"\",VLOOKUP(E140,Liste1!$A$2:$B$41,2))","v":"Léon Dit"},8,null,{"$f":"IF($B140=Liste1!$F$9,1,0)","v":0},{"$f":"IF(B140=7,\"\",(E140*100+(YEAR($A140)+MONTH($A140)+MONTH($A140)))/((YEAR($A140))))","v":1.4013840830449826},{"$f":"IF(O140+K140>0,I140,\"\")","v":""},{"$f":"IF(O140+K140>0,J140,\"\")","v":""},null,{"$f":"IF(O140+K140=0,\"\",(J140-I140))","v":""}]
["2023-06-16",2,{"$f":"IF(B141=\"\",\"\",VLOOKUP(B141,Liste1!$F$2:$I$9,2))","v":"Essai 2"},null,8,{"$f":"IF(B141=Liste1!$F$9,Liste1!$F$9*E141*100+MONTH($A141),0)","v":0},{"$f":"IF(B141=Liste1!$F$9,J141-I141,0)","v":0},{"$f":"IF(E141=\"\",\"\",VLOOKUP(E141,Liste1!$A$2:$B$41,2))","v":"Léon Dit"},13.47,null,{"$f":"IF($B141=Liste1!$F$9,1,0)","v":0},{"$f":"IF(B141=7,\"\",(E141*100+(YEAR($A141)+MONTH($A141)+MONTH($A141)))/((YEAR($A141))))","v":1.4013840830449826},{"$f":"IF(O141+K141>0,I141,\"\")","v":""},{"$f":"IF(O141+K141>0,J141,\"\")","v":""},null,{"$f":"IF(O141+K141=0,\"\",(J141-I141))","v":""}]
["2023-06-20",2,{"$f":"IF(B142=\"\",\"\",VLOOKUP(B142,Liste1!$F$2:$I$9,2))","v":"Essai 2"},null,8,{"$f":"IF(B142=Liste1!$F$9,Liste1!$F$9*E142*100+MONTH($A142),0)","v":0},{"$f":"IF(B142=Liste1!$F$9,J142-I142,0)","v":0},{"$f":"IF(E142=\"\",\"\",VLOOKUP(E142,Liste1!$A$2:$B$41,2))","v":"Léon Dit"},37.159999999999997,null,{"$f":"IF($B142=Liste1!$F$9,1,0)","v":0},{"$f":"IF(B142=7,\"\",(E142*100+(YEAR($A142)+MONTH($A142)+MONTH($A142)))/((YEAR($A142))))","v":1.4013840830449826},{"$f":"IF(O142+K142>0,I142,\"\")","v":""},{"$f":"IF(O142+K142>0,J142,\"\")","v":""},null,{"$f":"IF(O142+K142=0,\"\",(J142-I142))","v":""}]
["2023-06-20",2,{"$f":"IF(B143=\"\",\"\",VLOOKUP(B143,Liste1!$F$2:$I$9,2))","v":"Essai 2"},null,8,{"$f":"IF(B143=Liste1!$F$9,Liste1!$F$9*E143*100+MONTH($A143),0)","v":0},{"$f":"IF(B143=Liste1!$F$9,J143-I143,0)","v":0},{"$f":"IF(E143=\"\",\"\",VLOOKUP(E143,Liste1!$A$2:$B$41,2))","v":"Léon Dit"},29.42,null,{"$f":"IF($B143=Liste1!$F$9,1,0)","v":0},{"$f":"IF(B143=7,\"\",(E143*100+(YEAR($A143)+MONTH($A143)+MONTH($A143)))/((YEAR($A143))))","v":1.4013840830449826},{"$f":"IF(O143+K143>0,I143,\"\")","v":""},{"$f":"IF(O143+K143>0,J143,\"\")","v":""},null,{"$f":"IF(O143+K143=0,\"\",(J143-I143))","v":""}]
["2023-06-26",2,{"$f":"IF(B144=\"\",\"\",VLOOKUP(B144,Liste1!$F$2:$I$9,2))","v":"Essai 2"},null,8,{"$f":"IF(B144=Liste1!$F$9,Liste1!$F$9*E144*100+MONTH($A144),0)","v":0},{"$f":"IF(B144=Liste1!$F$9,J144-I144,0)","v":0},{"$f":"IF(E144=\"\",\"\",VLOOKUP(E144,Liste1!$A$2:$B$41,2))","v":"Léon Dit"},41.37,null,{"$f":"IF($B144=Liste1!$F$9,1,0)","v":0},{"$f":"IF(B144=7,\"\",(E144*100+(YEAR($A144)+MONTH($A144)+MONTH($A144)))/((YEAR($A144))))","v":1.4013840830449826},{"$f":"IF(O144+K144>0,I144,\"\")","v":""},{"$f":"IF(O144+K144>0,J144,\"\")","v":""},null,{"$f":"IF(O144+K144=0,\"\",(J144-I144))","v":""}]
["2023-06-30",2,{"$f":"IF(B145=\"\",\"\",VLOOKUP(B145,Liste1!$F$2:$I$9,2))","v":"Essai 2"},null,8,{"$f":"IF(B145=Liste1!$F$9,Liste1!$F$9*E145*100+MONTH($A145),0)","v":0},{"$f":"IF(B145=Liste1!$F$9,J145-I145,0)","v":0},{"$f":"IF(E145=\"\",\"\",VLOOKUP(E145,Liste1!$A$2:$B$41,2))","v":"Léon Dit"},32.58,null,{"$f":"IF($B145=Liste1!$F$9,1,0)","v":0},{"$f":"IF(B145=7,\"\",(E145*100+(YEAR($A145)+MONTH($A145)+MONTH($A145)))/((YEAR($A145))))","v":1.4013840830449826},{"$f":"IF(O145+K145>0,I145,\"\")","v":""},{"$f":"IF(O145+K145>0,J145,\"\")","v":""},null,{"$f":"IF(O145+K145=0,\"\",(J145-I145))","v":""}]
["2023-07-01",2,{"$f":"IF(B146=\"\",\"\",VLOOKUP(B146,Liste1!$F$2:$I$9,2))","v":"Essai 2"},null,8,{"$f":"IF(B146=Liste1!$F$9,Liste1!$F$9*E146*100+MONTH($A146),0)","v":0},{"$f":"IF(B146=Liste1!$F$9,J146-I146,0)","v":0},{"$f":"IF(E146=\"\",\"\",VLOOKUP(E146,Liste1!$A$2:$B$41,2))","v":"Léon Dit"},5.86,null,{"$f":"IF($B146=Liste1!$F$9,1,0)","v":0},{"$f":"IF(B146=7,\"\",(E146*100+(YEAR($A146)+MONTH($A146)+MONTH($A146)))/((YEAR($A146))))","v":1.4023727137913988},{"$f":"IF(O146+K146>0,I146,\"\")","v":""},{"$f":"IF(O146+K146>0,J146,\"\")","v":""},null,{"$f":"IF(O146+K146=0,\"\",(J146-I146))","v":""}]
["2023-07-05",2,{"$f":"IF(B147=\"\",\"\",VLOOKUP(B147,Liste1!$F$2:$I$9,2))","v":"Essai 2"},null,8,{"$f":"IF(B147=Liste1!$F$9,Liste1!$F$9*E147*100+MONTH($A147),0)","v":0},{"$f":"IF(B147=Liste1!$F$9,J147-I147,0)","v":0},{"$f":"IF(E147=\"\",\"\",VLOOKUP(E147,Liste1!$A$2:$B$41,2))","v":"Léon Dit"},45.36,null,{"$f":"IF($B147=Liste1!$F$9,1,0)","v":0},{"$f":"IF(B147=7,\"\",(E147*100+(YEAR($A147)+MONTH($A147)+MONTH($A147)))/((YEAR($A147))))","v":1.4023727137913988},{"$f":"IF(O147+K147>0,I147,\"\")","v":""},{"$f":"IF(O147+K147>0,J147,\"\")","v":""},null,{"$f":"IF(O147+K147=0,\"\",(J147-I147))","v":""}]
["2023-07-05",2,{"$f":"IF(B148=\"\",\"\",VLOOKUP(B148,Liste1!$F$2:$I$9,2))","v":"Essai 2"},null,8,{"$f":"IF(B148=Liste1!$F$9,Liste1!$F$9*E148*100+MONTH($A148),0)","v":0},{"$f":"IF(B148=Liste1!$F$9,J148-I148,0)","v":0},{"$f":"IF(E148=\"\",\"\",VLOOKUP(E148,Liste1!$A$2:$B$41,2))","v":"Léon Dit"},5.18,null,{"$f":"IF($B148=Liste1!$F$9,1,0)","v":0},{"$f":"IF(B148=7,\"\",(E148*100+(YEAR($A148)+MONTH($A148)+MONTH($A148)))/((YEAR($A148))))","v":1.4023727137913988},{"$f":"IF(O148+K148>0,I148,\"\")","v":""},{"$f":"IF(O148+K148>0,J148,\"\")","v":""},null,{"$f":"IF(O148+K148=0,\"\",(J148-I148))","v":""}]
["2023-07-07",2,{"$f":"IF(B149=\"\",\"\",VLOOKUP(B149,Liste1!$F$2:$I$9,2))","v":"Essai 2"},null,8,{"$f":"IF(B149=Liste1!$F$9,Liste1!$F$9*E149*100+MONTH($A149),0)","v":0},{"$f":"IF(B149=Liste1!$F$9,J149-I149,0)","v":0},{"$f":"IF(E149=\"\",\"\",VLOOKUP(E149,Liste1!$A$2:$B$41,2))","v":"Léon Dit"},22,null,{"$f":"IF($B149=Liste1!$F$9,1,0)","v":0},{"$f":"IF(B149=7,\"\",(E149*100+(YEAR($A149)+MONTH($A149)+MONTH($A149)))/((YEAR($A149))))","v":1.4023727137913988},{"$f":"IF(O149+K149>0,I149,\"\")","v":""},{"$f":"IF(O149+K149>0,J149,\"\")","v":""},null,{"$f":"IF(O149+K149=0,\"\",(J149-I149))","v":""}]
["2023-07-12",2,{"$f":"IF(B150=\"\",\"\",VLOOKUP(B150,Liste1!$F$2:$I$9,2))","v":"Essai 2"},null,8,{"$f":"IF(B150=Liste1!$F$9,Liste1!$F$9*E150*100+MONTH($A150),0)","v":0},{"$f":"IF(B150=Liste1!$F$9,J150-I150,0)","v":0},{"$f":"IF(E150=\"\",\"\",VLOOKUP(E150,Liste1!$A$2:$B$41,2))","v":"Léon Dit"},52.53,null,{"$f":"IF($B150=Liste1!$F$9,1,0)","v":0},{"$f":"IF(B150=7,\"\",(E150*100+(YEAR($A150)+MONTH($A150)+MONTH($A150)))/((YEAR($A150))))","v":1.4023727137913988},{"$f":"IF(O150+K150>0,I150,\"\")","v":""},{"$f":"IF(O150+K150>0,J150,\"\")","v":""},null,{"$f":"IF(O150+K150=0,\"\",(J150-I150))","v":""}]
["2023-07-20",2,{"$f":"IF(B151=\"\",\"\",VLOOKUP(B151,Liste1!$F$2:$I$9,2))","v":"Essai 2"},null,8,{"$f":"IF(B151=Liste1!$F$9,Liste1!$F$9*E151*100+MONTH($A151),0)","v":0},{"$f":"IF(B151=Liste1!$F$9,J151-I151,0)","v":0},{"$f":"IF(E151=\"\",\"\",VLOOKUP(E151,Liste1!$A$2:$B$41,2))","v":"Léon Dit"},49.61,null,{"$f":"IF($B151=Liste1!$F$9,1,0)","v":0},{"$f":"IF(B151=7,\"\",(E151*100+(YEAR($A151)+MONTH($A151)+MONTH($A151)))/((YEAR($A151))))","v":1.4023727137913988},{"$f":"IF(O151+K151>0,I151,\"\")","v":""},{"$f":"IF(O151+K151>0,J151,\"\")","v":""},null,{"$f":"IF(O151+K151=0,\"\",(J151-I151))","v":""}]
["2023-07-22",2,{"$f":"IF(B152=\"\",\"\",VLOOKUP(B152,Liste1!$F$2:$I$9,2))","v":"Essai 2"},null,8,{"$f":"IF(B152=Liste1!$F$9,Liste1!$F$9*E152*100+MONTH($A152),0)","v":0},{"$f":"IF(B152=Liste1!$F$9,J152-I152,0)","v":0},{"$f":"IF(E152=\"\",\"\",VLOOKUP(E152,Liste1!$A$2:$B$41,2))","v":"Léon Dit"},19.329999999999998,null,{"$f":"IF($B152=Liste1!$F$9,1,0)","v":0},{"$f":"IF(B152=7,\"\",(E152*100+(YEAR($A152)+MONTH($A152)+MONTH($A152)))/((YEAR($A152))))","v":1.4023727137913988},{"$f":"IF(O152+K152>0,I152,\"\")","v":""},{"$f":"IF(O152+K152>0,J152,\"\")","v":""},null,{"$f":"IF(O152+K152=0,\"\",(J152-I152))","v":""}]
["2023-07-29",2,{"$f":"IF(B153=\"\",\"\",VLOOKUP(B153,Liste1!$F$2:$I$9,2))","v":"Essai 2"},null,8,{"$f":"IF(B153=Liste1!$F$9,Liste1!$F$9*E153*100+MONTH($A153),0)","v":0},{"$f":"IF(B153=Liste1!$F$9,J153-I153,0)","v":0},{"$f":"IF(E153=\"\",\"\",VLOOKUP(E153,Liste1!$A$2:$B$41,2))","v":"Léon Dit"},19,null,{"$f":"IF($B153=Liste1!$F$9,1,0)","v":0},{"$f":"IF(B153=7,\"\",(E153*100+(YEAR($A153)+MONTH($A153)+MONTH($A153)))/((YEAR($A153))))","v":1.4023727137913988},{"$f":"IF(O153+K153>0,I153,\"\")","v":""},{"$f":"IF(O153+K153>0,J153,\"\")","v":""},null,{"$f":"IF(O153+K153=0,\"\",(J153-I153))","v":""}]
["2023-08-01",2,{"$f":"IF(B154=\"\",\"\",VLOOKUP(B154,Liste1!$F$2:$I$9,2))","v":"Essai 2"},null,8,{"$f":"IF(B154=Liste1!$F$9,Liste1!$F$9*E154*100+MONTH($A154),0)","v":0},{"$f":"IF(B154=Liste1!$F$9,J154-I154,0)","v":0},{"$f":"IF(E154=\"\",\"\",VLOOKUP(E154,Liste1!$A$2:$B$41,2))","v":"Léon Dit"},46.53,null,{"$f":"IF($B154=Liste1!$F$9,1,0)","v":0},{"$f":"IF(B154=7,\"\",(E154*100+(YEAR($A154)+MONTH($A154)+MONTH($A154)))/((YEAR($A154))))","v":1.403361344537815},{"$f":"IF(O154+K154>0,I154,\"\")","v":""},{"$f":"IF(O154+K154>0,J154,\"\")","v":""},null,{"$f":"IF(O154+K154=0,\"\",(J154-I154))","v":""}]
["2023-08-07",2,{"$f":"IF(B155=\"\",\"\",VLOOKUP(B155,Liste1!$F$2:$I$9,2))","v":"Essai 2"},null,8,{"$f":"IF(B155=Liste1!$F$9,Liste1!$F$9*E155*100+MONTH($A155),0)","v":0},{"$f":"IF(B155=Liste1!$F$9,J155-I155,0)","v":0},{"$f":"IF(E155=\"\",\"\",VLOOKUP(E155,Liste1!$A$2:$B$41,2))","v":"Léon Dit"},58.68,null,{"$f":"IF($B155=Liste1!$F$9,1,0)","v":0},{"$f":"IF(B155=7,\"\",(E155*100+(YEAR($A155)+MONTH($A155)+MONTH($A155)))/((YEAR($A155))))","v":1.403361344537815},{"$f":"IF(O155+K155>0,I155,\"\")","v":""},{"$f":"IF(O155+K155>0,J155,\"\")","v":""},null,{"$f":"IF(O155+K155=0,\"\",(J155-I155))","v":""}]
["2023-08-10T18:51:21",2,{"$f":"IF(B156=\"\",\"\",VLOOKUP(B156,Liste1!$F$2:$I$9,2))","v":"Essai 2"},null,8,{"$f":"IF(B156=Liste1!$F$9,Liste1!$F$9*E156*100+MONTH($A156),0)","v":0},{"$f":"IF(B156=Liste1!$F$9,J156-I156,0)","v":0},{"$f":"IF(E156=\"\",\"\",VLOOKUP(E156,Liste1!$A$2:$B$41,2))","v":"Léon Dit"},14.99,null,{"$f":"IF($B156=Liste1!$F$9,1,0)","v":0},{"$f":"IF(B156=7,\"\",(E156*100+(YEAR($A156)+MONTH($A156)+MONTH($A156)))/((YEAR($A156))))","v":1.403361344537815},{"$f":"IF(O156+K156>0,I156,\"\")","v":""},{"$f":"IF(O156+K156>0,J156,\"\")","v":""},null,{"$f":"IF(O156+K156=0,\"\",(J156-I156))","v":""}]
["2023-08-17T18:27:53",2,{"$f":"IF(B157=\"\",\"\",VLOOKUP(B157,Liste1!$F$2:$I$9,2))","v":"Essai 2"},null,8,{"$f":"IF(B157=Liste1!$F$9,Liste1!$F$9*E157*100+MONTH($A157),0)","v":0},{"$f":"IF(B157=Liste1!$F$9,J157-I157,0)","v":0},{"$f":"IF(E157=\"\",\"\",VLOOKUP(E157,Liste1!$A$2:$B$41,2))","v":"Léon Dit"},2.39,null,{"$f":"IF($B157=Liste1!$F$9,1,0)","v":0},{"$f":"IF(B157=7,\"\",(E157*100+(YEAR($A157)+MONTH($A157)+MONTH($A157)))/((YEAR($A157))))","v":1.403361344537815},{"$f":"IF(O157+K157>0,I157,\"\")","v":""},{"$f":"IF(O157+K157>0,J157,\"\")","v":""},null,{"$f":"IF(O157+K157=0,\"\",(J157-I157))","v":""}]
["2023-08-17T18:29:02",2,{"$f":"IF(B158=\"\",\"\",VLOOKUP(B158,Liste1!$F$2:$I$9,2))","v":"Essai 2"},null,8,{"$f":"IF(B158=Liste1!$F$9,Liste1!$F$9*E158*100+MONTH($A158),0)","v":0},{"$f":"IF(B158=Liste1!$F$9,J158-I158,0)","v":0},{"$f":"IF(E158=\"\",\"\",VLOOKUP(E158,Liste1!$A$2:$B$41,2))","v":"Léon Dit"},43.16,null,{"$f":"IF($B158=Liste1!$F$9,1,0)","v":0},{"$f":"IF(B158=7,\"\",(E158*100+(YEAR($A158)+MONTH($A158)+MONTH($A158)))/((YEAR($A158))))","v":1.403361344537815},{"$f":"IF(O158+K158>0,I158,\"\")","v":""},{"$f":"IF(O158+K158>0,J158,\"\")","v":""},null,{"$f":"IF(O158+K158=0,\"\",(J158-I158))","v":""}]
["2023-08-19T18:41:21",2,{"$f":"IF(B159=\"\",\"\",VLOOKUP(B159,Liste1!$F$2:$I$9,2))","v":"Essai 2"},null,8,{"$f":"IF(B159=Liste1!$F$9,Liste1!$F$9*E159*100+MONTH($A159),0)","v":0},{"$f":"IF(B159=Liste1!$F$9,J159-I159,0)","v":0},{"$f":"IF(E159=\"\",\"\",VLOOKUP(E159,Liste1!$A$2:$B$41,2))","v":"Léon Dit"},16.28,null,{"$f":"IF($B159=Liste1!$F$9,1,0)","v":0},{"$f":"IF(B159=7,\"\",(E159*100+(YEAR($A159)+MONTH($A159)+MONTH($A159)))/((YEAR($A159))))","v":1.403361344537815},{"$f":"IF(O159+K159>0,I159,\"\")","v":""},{"$f":"IF(O159+K159>0,J159,\"\")","v":""},null,{"$f":"IF(O159+K159=0,\"\",(J159-I159))","v":""}]
["2023-08-25T18:42:51",2,{"$f":"IF(B160=\"\",\"\",VLOOKUP(B160,Liste1!$F$2:$I$9,2))","v":"Essai 2"},null,8,{"$f":"IF(B160=Liste1!$F$9,Liste1!$F$9*E160*100+MONTH($A160),0)","v":0},{"$f":"IF(B160=Liste1!$F$9,J160-I160,0)","v":0},{"$f":"IF(E160=\"\",\"\",VLOOKUP(E160,Liste1!$A$2:$B$41,2))","v":"Léon Dit"},16.190000000000001,null,{"$f":"IF($B160=Liste1!$F$9,1,0)","v":0},{"$f":"IF(B160=7,\"\",(E160*100+(YEAR($A160)+MONTH($A160)+MONTH($A160)))/((YEAR($A160))))","v":1.403361344537815},{"$f":"IF(O160+K160>0,I160,\"\")","v":""},{"$f":"IF(O160+K160>0,J160,\"\")","v":""},null,{"$f":"IF(O160+K160=0,\"\",(J160-I160))","v":""}]
["2023-08-25T18:43:36",2,{"$f":"IF(B161=\"\",\"\",VLOOKUP(B161,Liste1!$F$2:$I$9,2))","v":"Essai 2"},null,8,{"$f":"IF(B161=Liste1!$F$9,Liste1!$F$9*E161*100+MONTH($A161),0)","v":0},{"$f":"IF(B161=Liste1!$F$9,J161-I161,0)","v":0},{"$f":"IF(E161=\"\",\"\",VLOOKUP(E161,Liste1!$A$2:$B$41,2))","v":"Léon Dit"},52.56,null,{"$f":"IF($B161=Liste1!$F$9,1,0)","v":0},{"$f":"IF(B161=7,\"\",(E161*100+(YEAR($A161)+MONTH($A161)+MONTH($A161)))/((YEAR($A161))))","v":1.403361344537815},{"$f":"IF(O161+K161>0,I161,\"\")","v":""},{"$f":"IF(O161+K161>0,J161,\"\")","v":""},null,{"$f":"IF(O161+K161=0,\"\",(J161-I161))","v":""}]
["2023-08-30",2,{"$f":"IF(B162=\"\",\"\",VLOOKUP(B162,Liste1!$F$2:$I$9,2))","v":"Essai 2"},null,8,{"$f":"IF(B162=Liste1!$F$9,Liste1!$F$9*E162*100+MONTH($A162),0)","v":0},{"$f":"IF(B162=Liste1!$F$9,J162-I162,0)","v":0},{"$f":"IF(E162=\"\",\"\",VLOOKUP(E162,Liste1!$A$2:$B$41,2))","v":"Léon Dit"},21.15,null,{"$f":"IF($B162=Liste1!$F$9,1,0)","v":0},{"$f":"IF(B162=7,\"\",(E162*100+(YEAR($A162)+MONTH($A162)+MONTH($A162)))/((YEAR($A162))))","v":1.403361344537815},{"$f":"IF(O162+K162>0,I162,\"\")","v":""},{"$f":"IF(O162+K162>0,J162,\"\")","v":""},null,{"$f":"IF(O162+K162=0,\"\",(J162-I162))","v":""}]
["2023-09-04",2,{"$f":"IF(B163=\"\",\"\",VLOOKUP(B163,Liste1!$F$2:$I$9,2))","v":"Essai 2"},null,8,{"$f":"IF(B163=Liste1!$F$9,Liste1!$F$9*E163*100+MONTH($A163),0)","v":0},{"$f":"IF(B163=Liste1!$F$9,J163-I163,0)","v":0},{"$f":"IF(E163=\"\",\"\",VLOOKUP(E163,Liste1!$A$2:$B$41,2))","v":"Léon Dit"},42.47,null,{"$f":"IF($B163=Liste1!$F$9,1,0)","v":0},{"$f":"IF(B163=7,\"\",(E163*100+(YEAR($A163)+MONTH($A163)+MONTH($A163)))/((YEAR($A163))))","v":1.4043499752842314},{"$f":"IF(O163+K163>0,I163,\"\")","v":""},{"$f":"IF(O163+K163>0,J163,\"\")","v":""},null,{"$f":"IF(O163+K163=0,\"\",(J163-I163))","v":""}]
["2023-09-04",2,{"$f":"IF(B164=\"\",\"\",VLOOKUP(B164,Liste1!$F$2:$I$9,2))","v":"Essai 2"},null,8,{"$f":"IF(B164=Liste1!$F$9,Liste1!$F$9*E164*100+MONTH($A164),0)","v":0},{"$f":"IF(B164=Liste1!$F$9,J164-I164,0)","v":0},{"$f":"IF(E164=\"\",\"\",VLOOKUP(E164,Liste1!$A$2:$B$41,2))","v":"Léon Dit"},17.96,null,{"$f":"IF($B164=Liste1!$F$9,1,0)","v":0},{"$f":"IF(B164=7,\"\",(E164*100+(YEAR($A164)+MONTH($A164)+MONTH($A164)))/((YEAR($A164))))","v":1.4043499752842314},{"$f":"IF(O164+K164>0,I164,\"\")","v":""},{"$f":"IF(O164+K164>0,J164,\"\")","v":""},null,{"$f":"IF(O164+K164=0,\"\",(J164-I164))","v":""}]
["2023-09-07",2,{"$f":"IF(B165=\"\",\"\",VLOOKUP(B165,Liste1!$F$2:$I$9,2))","v":"Essai 2"},null,8,{"$f":"IF(B165=Liste1!$F$9,Liste1!$F$9*E165*100+MONTH($A165),0)","v":0},{"$f":"IF(B165=Liste1!$F$9,J165-I165,0)","v":0},{"$f":"IF(E165=\"\",\"\",VLOOKUP(E165,Liste1!$A$2:$B$41,2))","v":"Léon Dit"},21.09,null,{"$f":"IF($B165=Liste1!$F$9,1,0)","v":0},{"$f":"IF(B165=7,\"\",(E165*100+(YEAR($A165)+MONTH($A165)+MONTH($A165)))/((YEAR($A165))))","v":1.4043499752842314},{"$f":"IF(O165+K165>0,I165,\"\")","v":""},{"$f":"IF(O165+K165>0,J165,\"\")","v":""},null,{"$f":"IF(O165+K165=0,\"\",(J165-I165))","v":""}]
["2023-09-08",2,{"$f":"IF(B166=\"\",\"\",VLOOKUP(B166,Liste1!$F$2:$I$9,2))","v":"Essai 2"},null,8,{"$f":"IF(B166=Liste1!$F$9,Liste1!$F$9*E166*100+MONTH($A166),0)","v":0},{"$f":"IF(B166=Liste1!$F$9,J166-I166,0)","v":0},{"$f":"IF(E166=\"\",\"\",VLOOKUP(E166,Liste1!$A$2:$B$41,2))","v":"Léon Dit"},12.84,null,{"$f":"IF($B166=Liste1!$F$9,1,0)","v":0},{"$f":"IF(B166=7,\"\",(E166*100+(YEAR($A166)+MONTH($A166)+MONTH($A166)))/((YEAR($A166))))","v":1.4043499752842314},{"$f":"IF(O166+K166>0,I166,\"\")","v":""},{"$f":"IF(O166+K166>0,J166,\"\")","v":""},null,{"$f":"IF(O166+K166=0,\"\",(J166-I166))","v":""}]
["2023-09-09T18:24:02",2,{"$f":"IF(B167=\"\",\"\",VLOOKUP(B167,Liste1!$F$2:$I$9,2))","v":"Essai 2"},null,8,{"$f":"IF(B167=Liste1!$F$9,Liste1!$F$9*E167*100+MONTH($A167),0)","v":0},{"$f":"IF(B167=Liste1!$F$9,J167-I167,0)","v":0},{"$f":"IF(E167=\"\",\"\",VLOOKUP(E167,Liste1!$A$2:$B$41,2))","v":"Léon Dit"},30.76,null,{"$f":"IF($B167=Liste1!$F$9,1,0)","v":0},{"$f":"IF(B167=7,\"\",(E167*100+(YEAR($A167)+MONTH($A167)+MONTH($A167)))/((YEAR($A167))))","v":1.4043499752842314},{"$f":"IF(O167+K167>0,I167,\"\")","v":""},{"$f":"IF(O167+K167>0,J167,\"\")","v":""},null,{"$f":"IF(O167+K167=0,\"\",(J167-I167))","v":""}]
["2023-09-10",2,{"$f":"IF(B168=\"\",\"\",VLOOKUP(B168,Liste1!$F$2:$I$9,2))","v":"Essai 2"},null,8,{"$f":"IF(B168=Liste1!$F$9,Liste1!$F$9*E168*100+MONTH($A168),0)","v":0},{"$f":"IF(B168=Liste1!$F$9,J168-I168,0)","v":0},{"$f":"IF(E168=\"\",\"\",VLOOKUP(E168,Liste1!$A$2:$B$41,2))","v":"Léon Dit"},34.44,null,{"$f":"IF($B168=Liste1!$F$9,1,0)","v":0},{"$f":"IF(B168=7,\"\",(E168*100+(YEAR($A168)+MONTH($A168)+MONTH($A168)))/((YEAR($A168))))","v":1.4043499752842314},{"$f":"IF(O168+K168>0,I168,\"\")","v":""},{"$f":"IF(O168+K168>0,J168,\"\")","v":""},null,{"$f":"IF(O168+K168=0,\"\",(J168-I168))","v":""}]
["2023-09-12T19:14:59",2,{"$f":"IF(B169=\"\",\"\",VLOOKUP(B169,Liste1!$F$2:$I$9,2))","v":"Essai 2"},null,8,{"$f":"IF(B169=Liste1!$F$9,Liste1!$F$9*E169*100+MONTH($A169),0)","v":0},{"$f":"IF(B169=Liste1!$F$9,J169-I169,0)","v":0},{"$f":"IF(E169=\"\",\"\",VLOOKUP(E169,Liste1!$A$2:$B$41,2))","v":"Léon Dit"},6.9,null,{"$f":"IF($B169=Liste1!$F$9,1,0)","v":0},{"$f":"IF(B169=7,\"\",(E169*100+(YEAR($A169)+MONTH($A169)+MONTH($A169)))/((YEAR($A169))))","v":1.4043499752842314},{"$f":"IF(O169+K169>0,I169,\"\")","v":""},{"$f":"IF(O169+K169>0,J169,\"\")","v":""},null,{"$f":"IF(O169+K169=0,\"\",(J169-I169))","v":""}]
["2023-09-15",2,{"$f":"IF(B170=\"\",\"\",VLOOKUP(B170,Liste1!$F$2:$I$9,2))","v":"Essai 2"},null,8,{"$f":"IF(B170=Liste1!$F$9,Liste1!$F$9*E170*100+MONTH($A170),0)","v":0},{"$f":"IF(B170=Liste1!$F$9,J170-I170,0)","v":0},{"$f":"IF(E170=\"\",\"\",VLOOKUP(E170,Liste1!$A$2:$B$41,2))","v":"Léon Dit"},14.95,null,{"$f":"IF($B170=Liste1!$F$9,1,0)","v":0},{"$f":"IF(B170=7,\"\",(E170*100+(YEAR($A170)+MONTH($A170)+MONTH($A170)))/((YEAR($A170))))","v":1.4043499752842314},{"$f":"IF(O170+K170>0,I170,\"\")","v":""},{"$f":"IF(O170+K170>0,J170,\"\")","v":""},null,{"$f":"IF(O170+K170=0,\"\",(J170-I170))","v":""}]
["2023-09-19",2,{"$f":"IF(B171=\"\",\"\",VLOOKUP(B171,Liste1!$F$2:$I$9,2))","v":"Essai 2"},null,8,{"$f":"IF(B171=Liste1!$F$9,Liste1!$F$9*E171*100+MONTH($A171),0)","v":0},{"$f":"IF(B171=Liste1!$F$9,J171-I171,0)","v":0},{"$f":"IF(E171=\"\",\"\",VLOOKUP(E171,Liste1!$A$2:$B$41,2))","v":"Léon Dit"},46.52,null,{"$f":"IF($B171=Liste1!$F$9,1,0)","v":0},{"$f":"IF(B171=7,\"\",(E171*100+(YEAR($A171)+MONTH($A171)+MONTH($A171)))/((YEAR($A171))))","v":1.4043499752842314},{"$f":"IF(O171+K171>0,I171,\"\")","v":""},{"$f":"IF(O171+K171>0,J171,\"\")","v":""},null,{"$f":"IF(O171+K171=0,\"\",(J171-I171))","v":""}]
["2023-09-21",2,{"$f":"IF(B172=\"\",\"\",VLOOKUP(B172,Liste1!$F$2:$I$9,2))","v":"Essai 2"},null,8,{"$f":"IF(B172=Liste1!$F$9,Liste1!$F$9*E172*100+MONTH($A172),0)","v":0},{"$f":"IF(B172=Liste1!$F$9,J172-I172,0)","v":0},{"$f":"IF(E172=\"\",\"\",VLOOKUP(E172,Liste1!$A$2:$B$41,2))","v":"Léon Dit"},14.76,null,{"$f":"IF($B172=Liste1!$F$9,1,0)","v":0},{"$f":"IF(B172=7,\"\",(E172*100+(YEAR($A172)+MONTH($A172)+MONTH($A172)))/((YEAR($A172))))","v":1.4043499752842314},{"$f":"IF(O172+K172>0,I172,\"\")","v":""},{"$f":"IF(O172+K172>0,J172,\"\")","v":""},null,{"$f":"IF(O172+K172=0,\"\",(J172-I172))","v":""}]
["2023-09-22T19:10:42",2,{"$f":"IF(B173=\"\",\"\",VLOOKUP(B173,Liste1!$F$2:$I$9,2))","v":"Essai 2"},null,8,{"$f":"IF(B173=Liste1!$F$9,Liste1!$F$9*E173*100+MONTH($A173),0)","v":0},{"$f":"IF(B173=Liste1!$F$9,J173-I173,0)","v":0},{"$f":"IF(E173=\"\",\"\",VLOOKUP(E173,Liste1!$A$2:$B$41,2))","v":"Léon Dit"},9.5,null,{"$f":"IF($B173=Liste1!$F$9,1,0)","v":0},{"$f":"IF(B173=7,\"\",(E173*100+(YEAR($A173)+MONTH($A173)+MONTH($A173)))/((YEAR($A173))))","v":1.4043499752842314},{"$f":"IF(O173+K173>0,I173,\"\")","v":""},{"$f":"IF(O173+K173>0,J173,\"\")","v":""},null,{"$f":"IF(O173+K173=0,\"\",(J173-I173))","v":""}]
["2023-09-22T19:11:50",2,{"$f":"IF(B174=\"\",\"\",VLOOKUP(B174,Liste1!$F$2:$I$9,2))","v":"Essai 2"},null,8,{"$f":"IF(B174=Liste1!$F$9,Liste1!$F$9*E174*100+MONTH($A174),0)","v":0},{"$f":"IF(B174=Liste1!$F$9,J174-I174,0)","v":0},{"$f":"IF(E174=\"\",\"\",VLOOKUP(E174,Liste1!$A$2:$B$41,2))","v":"Léon Dit"},46.14,null,{"$f":"IF($B174=Liste1!$F$9,1,0)","v":0},{"$f":"IF(B174=7,\"\",(E174*100+(YEAR($A174)+MONTH($A174)+MONTH($A174)))/((YEAR($A174))))","v":1.4043499752842314},{"$f":"IF(O174+K174>0,I174,\"\")","v":""},{"$f":"IF(O174+K174>0,J174,\"\")","v":""},null,{"$f":"IF(O174+K174=0,\"\",(J174-I174))","v":""}]
["2023-10-01T14:35:31",2,{"$f":"IF(B175=\"\",\"\",VLOOKUP(B175,Liste1!$F$2:$I$9,2))","v":"Essai 2"},null,8,{"$f":"IF(B175=Liste1!$F$9,Liste1!$F$9*E175*100+MONTH($A175),0)","v":0},{"$f":"IF(B175=Liste1!$F$9,J175-I175,0)","v":0},{"$f":"IF(E175=\"\",\"\",VLOOKUP(E175,Liste1!$A$2:$B$41,2))","v":"Léon Dit"},14.22,null,{"$f":"IF($B175=Liste1!$F$9,1,0)","v":0},{"$f":"IF(B175=7,\"\",(E175*100+(YEAR($A175)+MONTH($A175)+MONTH($A175)))/((YEAR($A175))))","v":1.4053386060306476},{"$f":"IF(O175+K175>0,I175,\"\")","v":""},{"$f":"IF(O175+K175>0,J175,\"\")","v":""},null,{"$f":"IF(O175+K175=0,\"\",(J175-I175))","v":""}]
["2023-10-01T14:36:53",2,{"$f":"IF(B176=\"\",\"\",VLOOKUP(B176,Liste1!$F$2:$I$9,2))","v":"Essai 2"},null,8,{"$f":"IF(B176=Liste1!$F$9,Liste1!$F$9*E176*100+MONTH($A176),0)","v":0},{"$f":"IF(B176=Liste1!$F$9,J176-I176,0)","v":0},{"$f":"IF(E176=\"\",\"\",VLOOKUP(E176,Liste1!$A$2:$B$41,2))","v":"Léon Dit"},19,null,{"$f":"IF($B176=Liste1!$F$9,1,0)","v":0},{"$f":"IF(B176=7,\"\",(E176*100+(YEAR($A176)+MONTH($A176)+MONTH($A176)))/((YEAR($A176))))","v":1.4053386060306476},{"$f":"IF(O176+K176>0,I176,\"\")","v":""},{"$f":"IF(O176+K176>0,J176,\"\")","v":""},null,{"$f":"IF(O176+K176=0,\"\",(J176-I176))","v":""}]
["2023-10-01T14:38:32",2,{"$f":"IF(B177=\"\",\"\",VLOOKUP(B177,Liste1!$F$2:$I$9,2))","v":"Essai 2"},null,8,{"$f":"IF(B177=Liste1!$F$9,Liste1!$F$9*E177*100+MONTH($A177),0)","v":0},{"$f":"IF(B177=Liste1!$F$9,J177-I177,0)","v":0},{"$f":"IF(E177=\"\",\"\",VLOOKUP(E177,Liste1!$A$2:$B$41,2))","v":"Léon Dit"},86.92,null,{"$f":"IF($B177=Liste1!$F$9,1,0)","v":0},{"$f":"IF(B177=7,\"\",(E177*100+(YEAR($A177)+MONTH($A177)+MONTH($A177)))/((YEAR($A177))))","v":1.4053386060306476},{"$f":"IF(O177+K177>0,I177,\"\")","v":""},{"$f":"IF(O177+K177>0,J177,\"\")","v":""},null,{"$f":"IF(O177+K177=0,\"\",(J177-I177))","v":""}]
["2023-10-03",8,{"$f":"IF(B178=\"\",\"\",VLOOKUP(B178,Liste1!$F$2:$I$9,2))","v":"Essai 8"},null,8,{"$f":"IF(B178=Liste1!$F$9,Liste1!$F$9*E178*100+MONTH($A178),0)","v":6410},{"$f":"IF(B178=Liste1!$F$9,J178-I178,0)","v":-170},{"$f":"IF(E178=\"\",\"\",VLOOKUP(E178,Liste1!$A$2:$B$41,2))","v":"Léon Dit"},170,null,{"$f":"IF($B178=Liste1!$F$9,1,0)","v":1},{"$f":"IF(B178=7,\"\",(E178*100+(YEAR($A178)+MONTH($A178)+MONTH($A178)))/((YEAR($A178))))","v":1.4053386060306476},{"$f":"IF(O178+K178>0,I178,\"\")","v":170},{"$f":"IF(O178+K178>0,J178,\"\")","v":0},null,{"$f":"IF(O178+K178=0,\"\",(J178-I178))","v":-170}]
["2023-01-04",8,{"$f":"IF(B179=\"\",\"\",VLOOKUP(B179,Liste1!$F$2:$I$9,2))","v":"Essai 8"},null,9,{"$f":"IF(B179=Liste1!$F$9,Liste1!$F$9*E179*100+MONTH($A179),0)","v":7201},{"$f":"IF(B179=Liste1!$F$9,J179-I179,0)","v":-40},{"$f":"IF(E179=\"\",\"\",VLOOKUP(E179,Liste1!$A$2:$B$41,2))","v":"Daisy Rable"},40,null,{"$f":"IF($B179=Liste1!$F$9,1,0)","v":1},{"$f":"IF(I179+J179=0,\"\",(E179*100+(YEAR($A179)+MONTH($A179)+MONTH($A179)))/((YEAR($A179))))","v":1.4458724666337124},{"$f":"IF(O179+K179>0,I179,\"\")","v":40},{"$f":"IF(O179+K179>0,J179,\"\")","v":0},null,{"$f":"IF(O179+K179=0,\"\",(J179-I179))","v":-40}]
["2023-01-19",2,{"$f":"IF(B180=\"\",\"\",VLOOKUP(B180,Liste1!$F$2:$I$9,2))","v":"Essai 2"},null,9,{"$f":"IF(B180=Liste1!$F$9,Liste1!$F$9*E180*100+MONTH($A180),0)","v":0},{"$f":"IF(B180=Liste1!$F$9,J180-I180,0)","v":0},{"$f":"IF(E180=\"\",\"\",VLOOKUP(E180,Liste1!$A$2:$B$41,2))","v":"Daisy Rable"},8.5399999999999991,null,{"$f":"IF($B180=Liste1!$F$9,1,0)","v":0},{"$f":"IF(I180+J180=0,\"\",(E180*100+(YEAR($A180)+MONTH($A180)+MONTH($A180)))/((YEAR($A180))))","v":1.4458724666337124},{"$f":"IF(O180+K180>0,I180,\"\")","v":""},{"$f":"IF(O180+K180>0,J180,\"\")","v":""},null,{"$f":"IF(O180+K180=0,\"\",(J180-I180))","v":""}]
["2023-01-24",2,{"$f":"IF(B181=\"\",\"\",VLOOKUP(B181,Liste1!$F$2:$I$9,2))","v":"Essai 2"},null,9,{"$f":"IF(B181=Liste1!$F$9,Liste1!$F$9*E181*100+MONTH($A181),0)","v":0},{"$f":"IF(B181=Liste1!$F$9,J181-I181,0)","v":0},{"$f":"IF(E181=\"\",\"\",VLOOKUP(E181,Liste1!$A$2:$B$41,2))","v":"Daisy Rable"},20,null,{"$f":"IF($B181=Liste1!$F$9,1,0)","v":0},{"$f":"IF(I181+J181=0,\"\",(E181*100+(YEAR($A181)+MONTH($A181)+MONTH($A181)))/((YEAR($A181))))","v":1.4458724666337124},{"$f":"IF(O181+K181>0,I181,\"\")","v":""},{"$f":"IF(O181+K181>0,J181,\"\")","v":""},null,{"$f":"IF(O181+K181=0,\"\",(J181-I181))","v":""}]
["2023-02-04",2,{"$f":"IF(B182=\"\",\"\",VLOOKUP(B182,Liste1!$F$2:$I$9,2))","v":"Essai 2"},null,9,{"$f":"IF(B182=Liste1!$F$9,Liste1!$F$9*E182*100+MONTH($A182),0)","v":0},{"$f":"IF(B182=Liste1!$F$9,J182-I182,0)","v":0},{"$f":"IF(E182=\"\",\"\",VLOOKUP(E182,Liste1!$A$2:$B$41,2))","v":"Daisy Rable"},17.170000000000002,null,{"$f":"IF($B182=Liste1!$F$9,1,0)","v":0},{"$f":"IF(I182+J182=0,\"\",(E182*100+(YEAR($A182)+MONTH($A182)+MONTH($A182)))/((YEAR($A182))))","v":1.4468610973801286},{"$f":"IF(O182+K182>0,I182,\"\")","v":""},{"$f":"IF(O182+K182>0,J182,\"\")","v":""},null,{"$f":"IF(O182+K182=0,\"\",(J182-I182))","v":""}]
["2023-02-27",4,{"$f":"IF(B183=\"\",\"\",VLOOKUP(B183,Liste1!$F$2:$I$9,2))","v":"Essai 4"},null,9,{"$f":"IF(B183=Liste1!$F$9,Liste1!$F$9*E183*100+MONTH($A183),0)","v":0},{"$f":"IF(B183=Liste1!$F$9,J183-I183,0)","v":0},{"$f":"IF(E183=\"\",\"\",VLOOKUP(E183,Liste1!$A$2:$B$41,2))","v":"Daisy Rable"},1,null,{"$f":"IF($B183=Liste1!$F$9,1,0)","v":0},{"$f":"IF(I183+J183=0,\"\",(E183*100+(YEAR($A183)+MONTH($A183)+MONTH($A183)))/((YEAR($A183))))","v":1.4468610973801286},{"$f":"IF(O183+K183>0,I183,\"\")","v":""},{"$f":"IF(O183+K183>0,J183,\"\")","v":""},null,{"$f":"IF(O183+K183=0,\"\",(J183-I183))","v":""}]
["2023-03-01",2,{"$f":"IF(B184=\"\",\"\",VLOOKUP(B184,Liste1!$F$2:$I$9,2))","v":"Essai 2"},null,9,{"$f":"IF(B184=Liste1!$F$9,Liste1!$F$9*E184*100+MONTH($A184),0)","v":0},{"$f":"IF(B184=Liste1!$F$9,J184-I184,0)","v":0},{"$f":"IF(E184=\"\",\"\",VLOOKUP(E184,Liste1!$A$2:$B$41,2))","v":"Daisy Rable"},2.99,null,{"$f":"IF($B184=Liste1!$F$9,1,0)","v":0},{"$f":"IF(I184+J184=0,\"\",(E184*100+(YEAR($A184)+MONTH($A184)+MONTH($A184)))/((YEAR($A184))))","v":1.4478497281265448},{"$f":"IF(O184+K184>0,I184,\"\")","v":""},{"$f":"IF(O184+K184>0,J184,\"\")","v":""},null,{"$f":"IF(O184+K184=0,\"\",(J184-I184))","v":""}]
["2023-03-24",4,{"$f":"IF(B185=\"\",\"\",VLOOKUP(B185,Liste1!$F$2:$I$9,2))","v":"Essai 4"},null,9,{"$f":"IF(B185=Liste1!$F$9,Liste1!$F$9*E185*100+MONTH($A185),0)","v":0},{"$f":"IF(B185=Liste1!$F$9,J185-I185,0)","v":0},{"$f":"IF(E185=\"\",\"\",VLOOKUP(E185,Liste1!$A$2:$B$41,2))","v":"Daisy Rable"},44.93,null,{"$f":"IF($B185=Liste1!$F$9,1,0)","v":0},{"$f":"IF(I185+J185=0,\"\",(E185*100+(YEAR($A185)+MONTH($A185)+MONTH($A185)))/((YEAR($A185))))","v":1.4478497281265448},{"$f":"IF(O185+K185>0,I185,\"\")","v":""},{"$f":"IF(O185+K185>0,J185,\"\")","v":""},null,{"$f":"IF(O185+K185=0,\"\",(J185-I185))","v":""}]
["2023-04-20",4,{"$f":"IF(B186=\"\",\"\",VLOOKUP(B186,Liste1!$F$2:$I$9,2))","v":"Essai 4"},null,9,{"$f":"IF(B186=Liste1!$F$9,Liste1!$F$9*E186*100+MONTH($A186),0)","v":0},{"$f":"IF(B186=Liste1!$F$9,J186-I186,0)","v":0},{"$f":"IF(E186=\"\",\"\",VLOOKUP(E186,Liste1!$A$2:$B$41,2))","v":"Daisy Rable"},44.93,null,{"$f":"IF($B186=Liste1!$F$9,1,0)","v":0},{"$f":"IF(I186+J186=0,\"\",(E186*100+(YEAR($A186)+MONTH($A186)+MONTH($A186)))/((YEAR($A186))))","v":1.448838358872961},{"$f":"IF(O186+K186>0,I186,\"\")","v":""},{"$f":"IF(O186+K186>0,J186,\"\")","v":""},null,{"$f":"IF(O186+K186=0,\"\",(J186-I186))","v":""}]
["2023-05-24",3,{"$f":"IF(B187=\"\",\"\",VLOOKUP(B187,Liste1!$F$2:$I$9,2))","v":"Essai 3"},null,9,{"$f":"IF(B187=Liste1!$F$9,Liste1!$F$9*E187*100+MONTH($A187),0)","v":0},{"$f":"IF(B187=Liste1!$F$9,J187-I187,0)","v":0},{"$f":"IF(E187=\"\",\"\",VLOOKUP(E187,Liste1!$A$2:$B$41,2))","v":"Daisy Rable"},34.94,null,{"$f":"IF($B187=Liste1!$F$9,1,0)","v":0},{"$f":"IF(B187=7,\"\",(E187*100+(YEAR($A187)+MONTH($A187)+MONTH($A187)))/((YEAR($A187))))","v":1.4498269896193772},{"$f":"IF(O187+K187>0,I187,\"\")","v":""},{"$f":"IF(O187+K187>0,J187,\"\")","v":""},null,{"$f":"IF(O187+K187=0,\"\",(J187-I187))","v":""}]
["2023-06-19",3,{"$f":"IF(B188=\"\",\"\",VLOOKUP(B188,Liste1!$F$2:$I$9,2))","v":"Essai 3"},null,9,{"$f":"IF(B188=Liste1!$F$9,Liste1!$F$9*E188*100+MONTH($A188),0)","v":0},{"$f":"IF(B188=Liste1!$F$9,J188-I188,0)","v":0},{"$f":"IF(E188=\"\",\"\",VLOOKUP(E188,Liste1!$A$2:$B$41,2))","v":"Daisy Rable"},34.94,null,{"$f":"IF($B188=Liste1!$F$9,1,0)","v":0},{"$f":"IF(B188=7,\"\",(E188*100+(YEAR($A188)+MONTH($A188)+MONTH($A188)))/((YEAR($A188))))","v":1.4508156203657934},{"$f":"IF(O188+K188>0,I188,\"\")","v":""},{"$f":"IF(O188+K188>0,J188,\"\")","v":""},null,{"$f":"IF(O188+K188=0,\"\",(J188-I188))","v":""}]
["2023-07-19",3,{"$f":"IF(B189=\"\",\"\",VLOOKUP(B189,Liste1!$F$2:$I$9,2))","v":"Essai 3"},null,9,{"$f":"IF(B189=Liste1!$F$9,Liste1!$F$9*E189*100+MONTH($A189),0)","v":0},{"$f":"IF(B189=Liste1!$F$9,J189-I189,0)","v":0},{"$f":"IF(E189=\"\",\"\",VLOOKUP(E189,Liste1!$A$2:$B$41,2))","v":"Daisy Rable"},34.94,null,{"$f":"IF($B189=Liste1!$F$9,1,0)","v":0},{"$f":"IF(B189=7,\"\",(E189*100+(YEAR($A189)+MONTH($A189)+MONTH($A189)))/((YEAR($A189))))","v":1.4518042511122096},{"$f":"IF(O189+K189>0,I189,\"\")","v":""},{"$f":"IF(O189+K189>0,J189,\"\")","v":""},null,{"$f":"IF(O189+K189=0,\"\",(J189-I189))","v":""}]
["2023-08-18",3,{"$f":"IF(B190=\"\",\"\",VLOOKUP(B190,Liste1!$F$2:$I$9,2))","v":"Essai 3"},null,9,{"$f":"IF(B190=Liste1!$F$9,Liste1!$F$9*E190*100+MONTH($A190),0)","v":0},{"$f":"IF(B190=Liste1!$F$9,J190-I190,0)","v":0},{"$f":"IF(E190=\"\",\"\",VLOOKUP(E190,Liste1!$A$2:$B$41,2))","v":"Daisy Rable"},34.94,null,{"$f":"IF($B190=Liste1!$F$9,1,0)","v":0},{"$f":"IF(B190=7,\"\",(E190*100+(YEAR($A190)+MONTH($A190)+MONTH($A190)))/((YEAR($A190))))","v":1.4527928818586258},{"$f":"IF(O190+K190>0,I190,\"\")","v":""},{"$f":"IF(O190+K190>0,J190,\"\")","v":""},null,{"$f":"IF(O190+K190=0,\"\",(J190-I190))","v":""}]
["2023-09-14T09:15:04",3,{"$f":"IF(B191=\"\",\"\",VLOOKUP(B191,Liste1!$F$2:$I$9,2))","v":"Essai 3"},null,9,{"$f":"IF(B191=Liste1!$F$9,Liste1!$F$9*E191*100+MONTH($A191),0)","v":0},{"$f":"IF(B191=Liste1!$F$9,J191-I191,0)","v":0},{"$f":"IF(E191=\"\",\"\",VLOOKUP(E191,Liste1!$A$2:$B$41,2))","v":"Daisy Rable"},70,null,{"$f":"IF($B191=Liste1!$F$9,1,0)","v":0},{"$f":"IF(B191=7,\"\",(E191*100+(YEAR($A191)+MONTH($A191)+MONTH($A191)))/((YEAR($A191))))","v":1.453781512605042},{"$f":"IF(O191+K191>0,I191,\"\")","v":""},{"$f":"IF(O191+K191>0,J191,\"\")","v":""},null,{"$f":"IF(O191+K191=0,\"\",(J191-I191))","v":""}]
["2023-01-01",8,{"$f":"IF(B192=\"\",\"\",VLOOKUP(B192,Liste1!$F$2:$I$9,2))","v":"Essai 8"},null,null,{"$f":"IF(B192=Liste1!$F$9,Liste1!$F$9*E192*100+MONTH($A192),0)","v":1},{"$f":"IF(B192=Liste1!$F$9,J192-I192,0)","v":0},{"$f":"IF(E192=\"\",\"\",VLOOKUP(E192,Liste1!$A$2:$B$41,2))","v":""},null,null,{"$f":"IF($B192=Liste1!$F$9,1,0)","v":1},{"$f":"IF(I192+J192=0,\"\",(E192*100+(YEAR($A192)+MONTH($A192)+MONTH($A192)))/((YEAR($A192))))","v":""},{"$f":"IF(O192+K192>0,I192,\"\")","v":0},{"$f":"IF(O192+K192>0,J192,\"\")","v":0},null,{"$f":"IF(O192+K192=0,\"\",(J192-I192))","v":0}]
["2023-01-01",2,{"$f":"IF(B193=\"\",\"\",VLOOKUP(B193,Liste1!$F$2:$I$9,2))","v":"Essai 2"},null,null,{"$f":"IF(B193=Liste1!$F$9,Liste1!$F$9*E193*100+MONTH($A193),0)","v":0},{"$f":"IF(B193=Liste1!$F$9,J193-I193,0)","v":0},{"$f":"IF(E193=\"\",\"\",VLOOKUP(E193,Liste1!$A$2:$B$41,2))","v":""},null,null,{"$f":"IF($B193=Liste1!$F$9,1,0)","v":0},{"$f":"IF(I193+J193=0,\"\",(E193*100+(YEAR($A193)+MONTH($A193)+MONTH($A193)))/((YEAR($A193))))","v":""},{"$f":"IF(O193+K193>0,I193,\"\")","v":""},{"$f":"IF(O193+K193>0,J193,\"\")","v":""},null,{"$f":"IF(O193+K193=0,\"\",(J193-I193))","v":""}]
["2023-01-01",3,{"$f":"IF(B194=\"\",\"\",VLOOKUP(B194,Liste1!$F$2:$I$9,2))","v":"Essai 3"},null,null,{"$f":"IF(B194=Liste1!$F$9,Liste1!$F$9*E194*100+MONTH($A194),0)","v":0},{"$f":"IF(B194=Liste1!$F$9,J194-I194,0)","v":0},{"$f":"IF(E194=\"\",\"\",VLOOKUP(E194,Liste1!$A$2:$B$41,2))","v":""},null,null,{"$f":"IF($B194=Liste1!$F$9,1,0)","v":0},{"$f":"IF(I194+J194=0,\"\",(E194*100+(YEAR($A194)+MONTH($A194)+MONTH($A194)))/((YEAR($A194))))","v":""},{"$f":"IF(O194+K194>0,I194,\"\")","v":""},{"$f":"IF(O194+K194>0,J194,\"\")","v":""},null,{"$f":"IF(O194+K194=0,\"\",(J194-I194))","v":""}]
["2023-01-02",8,{"$f":"IF(B195=\"\",\"\",VLOOKUP(B195,Liste1!$F$2:$I$9,2))","v":"Essai 8"},null,null,{"$f":"IF(B195=Liste1!$F$9,Liste1!$F$9*E195*100+MONTH($A195),0)","v":1},{"$f":"IF(B195=Liste1!$F$9,J195-I195,0)","v":0},{"$f":"IF(E195=\"\",\"\",VLOOKUP(E195,Liste1!$A$2:$B$41,2))","v":""},null,null,{"$f":"IF($B195=Liste1!$F$9,1,0)","v":1},{"$f":"IF(I195+J195=0,\"\",(E195*100+(YEAR($A195)+MONTH($A195)+MONTH($A195)))/((YEAR($A195))))","v":""},{"$f":"IF(O195+K195>0,I195,\"\")","v":0},{"$f":"IF(O195+K195>0,J195,\"\")","v":0},null,{"$f":"IF(O195+K195=0,\"\",(J195-I195))","v":0}]
["2023-01-02",2,{"$f":"IF(B196=\"\",\"\",VLOOKUP(B196,Liste1!$F$2:$I$9,2))","v":"Essai 2"},null,null,{"$f":"IF(B196=Liste1!$F$9,Liste1!$F$9*E196*100+MONTH($A196),0)","v":0},{"$f":"IF(B196=Liste1!$F$9,J196-I196,0)","v":0},{"$f":"IF(E196=\"\",\"\",VLOOKUP(E196,Liste1!$A$2:$B$41,2))","v":""},null,null,{"$f":"IF($B196=Liste1!$F$9,1,0)","v":0},{"$f":"IF(I196+J196=0,\"\",(E196*100+(YEAR($A196)+MONTH($A196)+MONTH($A196)))/((YEAR($A196))))","v":""},{"$f":"IF(O196+K196>0,I196,\"\")","v":""},{"$f":"IF(O196+K196>0,J196,\"\")","v":""},null,{"$f":"IF(O196+K196=0,\"\",(J196-I196))","v":""}]
["2023-01-02",3,{"$f":"IF(B197=\"\",\"\",VLOOKUP(B197,Liste1!$F$2:$I$9,2))","v":"Essai 3"},null,null,{"$f":"IF(B197=Liste1!$F$9,Liste1!$F$9*E197*100+MONTH($A197),0)","v":0},{"$f":"IF(B197=Liste1!$F$9,J197-I197,0)","v":0},{"$f":"IF(E197=\"\",\"\",VLOOKUP(E197,Liste1!$A$2:$B$41,2))","v":""},null,null,{"$f":"IF($B197=Liste1!$F$9,1,0)","v":0},{"$f":"IF(I197+J197=0,\"\",(E197*100+(YEAR($A197)+MONTH($A197)+MONTH($A197)))/((YEAR($A197))))","v":""},{"$f":"IF(O197+K197>0,I197,\"\")","v":""},{"$f":"IF(O197+K197>0,J197,\"\")","v":""},null,{"$f":"IF(O197+K197=0,\"\",(J197-I197))","v":""}]
["2023-01-02",3,{"$f":"IF(B198=\"\",\"\",VLOOKUP(B198,Liste1!$F$2:$I$9,2))","v":"Essai 3"},null,null,{"$f":"IF(B198=Liste1!$F$9,Liste1!$F$9*E198*100+MONTH($A198),0)","v":0},{"$f":"IF(B198=Liste1!$F$9,J198-I198,0)","v":0},{"$f":"IF(E198=\"\",\"\",VLOOKUP(E198,Liste1!$A$2:$B$41,2))","v":""},null,null,{"$f":"IF($B198=Liste1!$F$9,1,0)","v":0},{"$f":"IF(I198+J198=0,\"\",(E198*100+(YEAR($A198)+MONTH($A198)+MONTH($A198)))/((YEAR($A198))))","v":""},{"$f":"IF(O198+K198>0,I198,\"\")","v":""},{"$f":"IF(O198+K198>0,J198,\"\")","v":""},null,{"$f":"IF(O198+K198=0,\"\",(J198-I198))","v":""}]
["2023-01-03",5,{"$f":"IF(B199=\"\",\"\",VLOOKUP(B199,Liste1!$F$2:$I$9,2))","v":"Essai 5"},null,null,{"$f":"IF(B199=Liste1!$F$9,Liste1!$F$9*E199*100+MONTH($A199),0)","v":0},{"$f":"IF(B199=Liste1!$F$9,J199-I199,0)","v":0},{"$f":"IF(E199=\"\",\"\",VLOOKUP(E199,Liste1!$A$2:$B$41,2))","v":""},null,null,{"$f":"IF($B199=Liste1!$F$9,1,0)","v":0},{"$f":"IF(I199+J199=0,\"\",(E199*100+(YEAR($A199)+MONTH($A199)+MONTH($A199)))/((YEAR($A199))))","v":""},{"$f":"IF(O199+K199>0,I199,\"\")","v":""},{"$f":"IF(O199+K199>0,J199,\"\")","v":""},null,{"$f":"IF(O199+K199=0,\"\",(J199-I199))","v":""}]
["2023-01-04",2,{"$f":"IF(B200=\"\",\"\",VLOOKUP(B200,Liste1!$F$2:$I$9,2))","v":"Essai 2"},null,null,{"$f":"IF(B200=Liste1!$F$9,Liste1!$F$9*E200*100+MONTH($A200),0)","v":0},{"$f":"IF(B200=Liste1!$F$9,J200-I200,0)","v":0},{"$f":"IF(E200=\"\",\"\",VLOOKUP(E200,Liste1!$A$2:$B$41,2))","v":""},null,null,{"$f":"IF($B200=Liste1!$F$9,1,0)","v":0},{"$f":"IF(I200+J200=0,\"\",(E200*100+(YEAR($A200)+MONTH($A200)+MONTH($A200)))/((YEAR($A200))))","v":""},{"$f":"IF(O200+K200>0,I200,\"\")","v":""},{"$f":"IF(O200+K200>0,J200,\"\")","v":""},null,{"$f":"IF(O200+K200=0,\"\",(J200-I200))","v":""}]
["2023-01-04",2,{"$f":"IF(B201=\"\",\"\",VLOOKUP(B201,Liste1!$F$2:$I$9,2))","v":"Essai 2"},null,null,{"$f":"IF(B201=Liste1!$F$9,Liste1!$F$9*E201*100+MONTH($A201),0)","v":0},{"$f":"IF(B201=Liste1!$F$9,J201-I201,0)","v":0},{"$f":"IF(E201=\"\",\"\",VLOOKUP(E201,Liste1!$A$2:$B$41,2))","v":""},null,null,{"$f":"IF($B201=Liste1!$F$9,1,0)","v":0},{"$f":"IF(I201+J201=0,\"\",(E201*100+(YEAR($A201)+MONTH($A201)+MONTH($A201)))/((YEAR($A201))))","v":""},{"$f":"IF(O201+K201>0,I201,\"\")","v":""},{"$f":"IF(O201+K201>0,J201,\"\")","v":""},null,{"$f":"IF(O201+K201=0,\"\",(J201-I201))","v":""}]
["2023-01-04",2,{"$f":"IF(B202=\"\",\"\",VLOOKUP(B202,Liste1!$F$2:$I$9,2))","v":"Essai 2"},null,null,{"$f":"IF(B202=Liste1!$F$9,Liste1!$F$9*E202*100+MONTH($A202),0)","v":0},{"$f":"IF(B202=Liste1!$F$9,J202-I202,0)","v":0},{"$f":"IF(E202=\"\",\"\",VLOOKUP(E202,Liste1!$A$2:$B$41,2))","v":""},null,null,{"$f":"IF($B202=Liste1!$F$9,1,0)","v":0},{"$f":"IF(I202+J202=0,\"\",(E202*100+(YEAR($A202)+MONTH($A202)+MONTH($A202)))/((YEAR($A202))))","v":""},{"$f":"IF(O202+K202>0,I202,\"\")","v":""},{"$f":"IF(O202+K202>0,J202,\"\")","v":""},null,{"$f":"IF(O202+K202=0,\"\",(J202-I202))","v":""}]
["2023-01-04",2,{"$f":"IF(B203=\"\",\"\",VLOOKUP(B203,Liste1!$F$2:$I$9,2))","v":"Essai 2"},null,null,{"$f":"IF(B203=Liste1!$F$9,Liste1!$F$9*E203*100+MONTH($A203),0)","v":0},{"$f":"IF(B203=Liste1!$F$9,J203-I203,0)","v":0},{"$f":"IF(E203=\"\",\"\",VLOOKUP(E203,Liste1!$A$2:$B$41,2))","v":""},null,null,{"$f":"IF($B203=Liste1!$F$9,1,0)","v":0},{"$f":"IF(I203+J203=0,\"\",(E203*100+(YEAR($A203)+MONTH($A203)+MONTH($A203)))/((YEAR($A203))))","v":""},{"$f":"IF(O203+K203>0,I203,\"\")","v":""},{"$f":"IF(O203+K203>0,J203,\"\")","v":""},null,{"$f":"IF(O203+K203=0,\"\",(J203-I203))","v":""}]
["2023-01-04",2,{"$f":"IF(B204=\"\",\"\",VLOOKUP(B204,Liste1!$F$2:$I$9,2))","v":"Essai 2"},null,null,{"$f":"IF(B204=Liste1!$F$9,Liste1!$F$9*E204*100+MONTH($A204),0)","v":0},{"$f":"IF(B204=Liste1!$F$9,J204-I204,0)","v":0},{"$f":"IF(E204=\"\",\"\",VLOOKUP(E204,Liste1!$A$2:$B$41,2))","v":""},null,null,{"$f":"IF($B204=Liste1!$F$9,1,0)","v":0},{"$f":"IF(I204+J204=0,\"\",(E204*100+(YEAR($A204)+MONTH($A204)+MONTH($A204)))/((YEAR($A204))))","v":""},{"$f":"IF(O204+K204>0,I204,\"\")","v":""},{"$f":"IF(O204+K204>0,J204,\"\")","v":""},null,{"$f":"IF(O204+K204=0,\"\",(J204-I204))","v":""}]
["2023-01-05",8,{"$f":"IF(B205=\"\",\"\",VLOOKUP(B205,Liste1!$F$2:$I$9,2))","v":"Essai 8"},null,null,{"$f":"IF(B205=Liste1!$F$9,Liste1!$F$9*E205*100+MONTH($A205),0)","v":1},{"$f":"IF(B205=Liste1!$F$9,J205-I205,0)","v":0},{"$f":"IF(E205=\"\",\"\",VLOOKUP(E205,Liste1!$A$2:$B$41,2))","v":""},null,null,{"$f":"IF($B205=Liste1!$F$9,1,0)","v":1},{"$f":"IF(I205+J205=0,\"\",(E205*100+(YEAR($A205)+MONTH($A205)+MONTH($A205)))/((YEAR($A205))))","v":""},{"$f":"IF(O205+K205>0,I205,\"\")","v":0},{"$f":"IF(O205+K205>0,J205,\"\")","v":0},null,{"$f":"IF(O205+K205=0,\"\",(J205-I205))","v":0}]
["2023-01-05",3,{"$f":"IF(B206=\"\",\"\",VLOOKUP(B206,Liste1!$F$2:$I$9,2))","v":"Essai 3"},null,null,{"$f":"IF(B206=Liste1!$F$9,Liste1!$F$9*E206*100+MONTH($A206),0)","v":0},{"$f":"IF(B206=Liste1!$F$9,J206-I206,0)","v":0},{"$f":"IF(E206=\"\",\"\",VLOOKUP(E206,Liste1!$A$2:$B$41,2))","v":""},null,null,{"$f":"IF($B206=Liste1!$F$9,1,0)","v":0},{"$f":"IF(I206+J206=0,\"\",(E206*100+(YEAR($A206)+MONTH($A206)+MONTH($A206)))/((YEAR($A206))))","v":""},{"$f":"IF(O206+K206>0,I206,\"\")","v":""},{"$f":"IF(O206+K206>0,J206,\"\")","v":""},null,{"$f":"IF(O206+K206=0,\"\",(J206-I206))","v":""}]
["2023-01-05",2,{"$f":"IF(B207=\"\",\"\",VLOOKUP(B207,Liste1!$F$2:$I$9,2))","v":"Essai 2"},null,null,{"$f":"IF(B207=Liste1!$F$9,Liste1!$F$9*E207*100+MONTH($A207),0)","v":0},{"$f":"IF(B207=Liste1!$F$9,J207-I207,0)","v":0},{"$f":"IF(E207=\"\",\"\",VLOOKUP(E207,Liste1!$A$2:$B$41,2))","v":""},null,null,{"$f":"IF($B207=Liste1!$F$9,1,0)","v":0},{"$f":"IF(I207+J207=0,\"\",(E207*100+(YEAR($A207)+MONTH($A207)+MONTH($A207)))/((YEAR($A207))))","v":""},{"$f":"IF(O207+K207>0,I207,\"\")","v":""},{"$f":"IF(O207+K207>0,J207,\"\")","v":""},null,{"$f":"IF(O207+K207=0,\"\",(J207-I207))","v":""}]
["2023-01-05",2,{"$f":"IF(B208=\"\",\"\",VLOOKUP(B208,Liste1!$F$2:$I$9,2))","v":"Essai 2"},null,null,{"$f":"IF(B208=Liste1!$F$9,Liste1!$F$9*E208*100+MONTH($A208),0)","v":0},{"$f":"IF(B208=Liste1!$F$9,J208-I208,0)","v":0},{"$f":"IF(E208=\"\",\"\",VLOOKUP(E208,Liste1!$A$2:$B$41,2))","v":""},null,null,{"$f":"IF($B208=Liste1!$F$9,1,0)","v":0},{"$f":"IF(I208+J208=0,\"\",(E208*100+(YEAR($A208)+MONTH($A208)+MONTH($A208)))/((YEAR($A208))))","v":""},{"$f":"IF(O208+K208>0,I208,\"\")","v":""},{"$f":"IF(O208+K208>0,J208,\"\")","v":""},null,{"$f":"IF(O208+K208=0,\"\",(J208-I208))","v":""}]
["2023-01-05",2,{"$f":"IF(B209=\"\",\"\",VLOOKUP(B209,Liste1!$F$2:$I$9,2))","v":"Essai 2"},null,null,{"$f":"IF(B209=Liste1!$F$9,Liste1!$F$9*E209*100+MONTH($A209),0)","v":0},{"$f":"IF(B209=Liste1!$F$9,J209-I209,0)","v":0},{"$f":"IF(E209=\"\",\"\",VLOOKUP(E209,Liste1!$A$2:$B$41,2))","v":""},null,null,{"$f":"IF($B209=Liste1!$F$9,1,0)","v":0},{"$f":"IF(I209+J209=0,\"\",(E209*100+(YEAR($A209)+MONTH($A209)+MONTH($A209)))/((YEAR($A209))))","v":""},{"$f":"IF(O209+K209>0,I209,\"\")","v":""},{"$f":"IF(O209+K209>0,J209,\"\")","v":""},null,{"$f":"IF(O209+K209=0,\"\",(J209-I209))","v":""}]
["2023-01-05",2,{"$f":"IF(B210=\"\",\"\",VLOOKUP(B210,Liste1!$F$2:$I$9,2))","v":"Essai 2"},null,null,{"$f":"IF(B210=Liste1!$F$9,Liste1!$F$9*E210*100+MONTH($A210),0)","v":0},{"$f":"IF(B210=Liste1!$F$9,J210-I210,0)","v":0},{"$f":"IF(E210=\"\",\"\",VLOOKUP(E210,Liste1!$A$2:$B$41,2))","v":""},null,null,{"$f":"IF($B210=Liste1!$F$9,1,0)","v":0},{"$f":"IF(I210+J210=0,\"\",(E210*100+(YEAR($A210)+MONTH($A210)+MONTH($A210)))/((YEAR($A210))))","v":""},{"$f":"IF(O210+K210>0,I210,\"\")","v":""},{"$f":"IF(O210+K210>0,J210,\"\")","v":""},null,{"$f":"IF(O210+K210=0,\"\",(J210-I210))","v":""}]
["2023-01-06",8,{"$f":"IF(B211=\"\",\"\",VLOOKUP(B211,Liste1!$F$2:$I$9,2))","v":"Essai 8"},null,null,{"$f":"IF(B211=Liste1!$F$9,Liste1!$F$9*E211*100+MONTH($A211),0)","v":1},{"$f":"IF(B211=Liste1!$F$9,J211-I211,0)","v":0},{"$f":"IF(E211=\"\",\"\",VLOOKUP(E211,Liste1!$A$2:$B$41,2))","v":""},null,null,{"$f":"IF($B211=Liste1!$F$9,1,0)","v":1},{"$f":"IF(B211=7,\"\",(E211*100+(YEAR($A211)+MONTH($A211)+MONTH($A211)))/((YEAR($A211))))","v":1.0009886307464162},{"$f":"IF(O211+K211>0,I211,\"\")","v":0},{"$f":"IF(O211+K211>0,J211,\"\")","v":0},null,{"$f":"IF(O211+K211=0,\"\",(J211-I211))","v":0}]
["2023-01-06",5,{"$f":"IF(B212=\"\",\"\",VLOOKUP(B212,Liste1!$F$2:$I$9,2))","v":"Essai 5"},null,null,{"$f":"IF(B212=Liste1!$F$9,Liste1!$F$9*E212*100+MONTH($A212),0)","v":0},{"$f":"IF(B212=Liste1!$F$9,J212-I212,0)","v":0},{"$f":"IF(E212=\"\",\"\",VLOOKUP(E212,Liste1!$A$2:$B$41,2))","v":""},null,null,{"$f":"IF($B212=Liste1!$F$9,1,0)","v":0},{"$f":"IF(I212+J212=0,\"\",(E212*100+(YEAR($A212)+MONTH($A212)+MONTH($A212)))/((YEAR($A212))))","v":""},{"$f":"IF(O212+K212>0,I212,\"\")","v":""},{"$f":"IF(O212+K212>0,J212,\"\")","v":""},null,{"$f":"IF(O212+K212=0,\"\",(J212-I212))","v":""}]
["2023-01-06",3,{"$f":"IF(B213=\"\",\"\",VLOOKUP(B213,Liste1!$F$2:$I$9,2))","v":"Essai 3"},null,null,{"$f":"IF(B213=Liste1!$F$9,Liste1!$F$9*E213*100+MONTH($A213),0)","v":0},{"$f":"IF(B213=Liste1!$F$9,J213-I213,0)","v":0},{"$f":"IF(E213=\"\",\"\",VLOOKUP(E213,Liste1!$A$2:$B$41,2))","v":""},null,null,{"$f":"IF($B213=Liste1!$F$9,1,0)","v":0},{"$f":"IF(I213+J213=0,\"\",(E213*100+(YEAR($A213)+MONTH($A213)+MONTH($A213)))/((YEAR($A213))))","v":""},{"$f":"IF(O213+K213>0,I213,\"\")","v":""},{"$f":"IF(O213+K213>0,J213,\"\")","v":""},null,{"$f":"IF(O213+K213=0,\"\",(J213-I213))","v":""}]
["2023-01-06",3,{"$f":"IF(B214=\"\",\"\",VLOOKUP(B214,Liste1!$F$2:$I$9,2))","v":"Essai 3"},null,null,{"$f":"IF(B214=Liste1!$F$9,Liste1!$F$9*E214*100+MONTH($A214),0)","v":0},{"$f":"IF(B214=Liste1!$F$9,J214-I214,0)","v":0},{"$f":"IF(E214=\"\",\"\",VLOOKUP(E214,Liste1!$A$2:$B$41,2))","v":""},null,null,{"$f":"IF($B214=Liste1!$F$9,1,0)","v":0},{"$f":"IF(I214+J214=0,\"\",(E214*100+(YEAR($A214)+MONTH($A214)+MONTH($A214)))/((YEAR($A214))))","v":""},{"$f":"IF(O214+K214>0,I214,\"\")","v":""},{"$f":"IF(O214+K214>0,J214,\"\")","v":""},null,{"$f":"IF(O214+K214=0,\"\",(J214-I214))","v":""}]
["2023-01-06",3,{"$f":"IF(B215=\"\",\"\",VLOOKUP(B215,Liste1!$F$2:$I$9,2))","v":"Essai 3"},null,null,{"$f":"IF(B215=Liste1!$F$9,Liste1!$F$9*E215*100+MONTH($A215),0)","v":0},{"$f":"IF(B215=Liste1!$F$9,J215-I215,0)","v":0},{"$f":"IF(E215=\"\",\"\",VLOOKUP(E215,Liste1!$A$2:$B$41,2))","v":""},null,null,{"$f":"IF($B215=Liste1!$F$9,1,0)","v":0},{"$f":"IF(I215+J215=0,\"\",(E215*100+(YEAR($A215)+MONTH($A215)+MONTH($A215)))/((YEAR($A215))))","v":""},{"$f":"IF(O215+K215>0,I215,\"\")","v":""},{"$f":"IF(O215+K215>0,J215,\"\")","v":""},null,{"$f":"IF(O215+K215=0,\"\",(J215-I215))","v":""}]
["2023-01-07",2,{"$f":"IF(B216=\"\",\"\",VLOOKUP(B216,Liste1!$F$2:$I$9,2))","v":"Essai 2"},null,null,{"$f":"IF(B216=Liste1!$F$9,Liste1!$F$9*E216*100+MONTH($A216),0)","v":0},{"$f":"IF(B216=Liste1!$F$9,J216-I216,0)","v":0},{"$f":"IF(E216=\"\",\"\",VLOOKUP(E216,Liste1!$A$2:$B$41,2))","v":""},null,null,{"$f":"IF($B216=Liste1!$F$9,1,0)","v":0},{"$f":"IF(I216+J216=0,\"\",(E216*100+(YEAR($A216)+MONTH($A216)+MONTH($A216)))/((YEAR($A216))))","v":""},{"$f":"IF(O216+K216>0,I216,\"\")","v":""},{"$f":"IF(O216+K216>0,J216,\"\")","v":""},null,{"$f":"IF(O216+K216=0,\"\",(J216-I216))","v":""}]
["2023-01-07",2,{"$f":"IF(B217=\"\",\"\",VLOOKUP(B217,Liste1!$F$2:$I$9,2))","v":"Essai 2"},null,null,{"$f":"IF(B217=Liste1!$F$9,Liste1!$F$9*E217*100+MONTH($A217),0)","v":0},{"$f":"IF(B217=Liste1!$F$9,J217-I217,0)","v":0},{"$f":"IF(E217=\"\",\"\",VLOOKUP(E217,Liste1!$A$2:$B$41,2))","v":""},null,null,{"$f":"IF($B217=Liste1!$F$9,1,0)","v":0},{"$f":"IF(I217+J217=0,\"\",(E217*100+(YEAR($A217)+MONTH($A217)+MONTH($A217)))/((YEAR($A217))))","v":""},{"$f":"IF(O217+K217>0,I217,\"\")","v":""},{"$f":"IF(O217+K217>0,J217,\"\")","v":""},null,{"$f":"IF(O217+K217=0,\"\",(J217-I217))","v":""}]
["2023-01-07",5,{"$f":"IF(B218=\"\",\"\",VLOOKUP(B218,Liste1!$F$2:$I$9,2))","v":"Essai 5"},null,null,{"$f":"IF(B218=Liste1!$F$9,Liste1!$F$9*E218*100+MONTH($A218),0)","v":0},{"$f":"IF(B218=Liste1!$F$9,J218-I218,0)","v":0},{"$f":"IF(E218=\"\",\"\",VLOOKUP(E218,Liste1!$A$2:$B$41,2))","v":""},null,null,{"$f":"IF($B218=Liste1!$F$9,1,0)","v":0},{"$f":"IF(I218+J218=0,\"\",(E218*100+(YEAR($A218)+MONTH($A218)+MONTH($A218)))/((YEAR($A218))))","v":""},{"$f":"IF(O218+K218>0,I218,\"\")","v":""},{"$f":"IF(O218+K218>0,J218,\"\")","v":""},null,{"$f":"IF(O218+K218=0,\"\",(J218-I218))","v":""}]
["2023-01-07",5,{"$f":"IF(B219=\"\",\"\",VLOOKUP(B219,Liste1!$F$2:$I$9,2))","v":"Essai 5"},null,null,{"$f":"IF(B219=Liste1!$F$9,Liste1!$F$9*E219*100+MONTH($A219),0)","v":0},{"$f":"IF(B219=Liste1!$F$9,J219-I219,0)","v":0},{"$f":"IF(E219=\"\",\"\",VLOOKUP(E219,Liste1!$A$2:$B$41,2))","v":""},null,null,{"$f":"IF($B219=Liste1!$F$9,1,0)","v":0},{"$f":"IF(I219+J219=0,\"\",(E219*100+(YEAR($A219)+MONTH($A219)+MONTH($A219)))/((YEAR($A219))))","v":""},{"$f":"IF(O219+K219>0,I219,\"\")","v":""},{"$f":"IF(O219+K219>0,J219,\"\")","v":""},null,{"$f":"IF(O219+K219=0,\"\",(J219-I219))","v":""}]
["2023-01-08",4,{"$f":"IF(B220=\"\",\"\",VLOOKUP(B220,Liste1!$F$2:$I$9,2))","v":"Essai 4"},null,null,{"$f":"IF(B220=Liste1!$F$9,Liste1!$F$9*E220*100+MONTH($A220),0)","v":0},{"$f":"IF(B220=Liste1!$F$9,J220-I220,0)","v":0},{"$f":"IF(E220=\"\",\"\",VLOOKUP(E220,Liste1!$A$2:$B$41,2))","v":""},null,null,{"$f":"IF($B220=Liste1!$F$9,1,0)","v":0},{"$f":"IF(I220+J220=0,\"\",(E220*100+(YEAR($A220)+MONTH($A220)+MONTH($A220)))/((YEAR($A220))))","v":""},{"$f":"IF(O220+K220>0,I220,\"\")","v":""},{"$f":"IF(O220+K220>0,J220,\"\")","v":""},null,{"$f":"IF(O220+K220=0,\"\",(J220-I220))","v":""}]
["2023-01-09",5,{"$f":"IF(B221=\"\",\"\",VLOOKUP(B221,Liste1!$F$2:$I$9,2))","v":"Essai 5"},null,null,{"$f":"IF(B221=Liste1!$F$9,Liste1!$F$9*E221*100+MONTH($A221),0)","v":0},{"$f":"IF(B221=Liste1!$F$9,J221-I221,0)","v":0},{"$f":"IF(E221=\"\",\"\",VLOOKUP(E221,Liste1!$A$2:$B$41,2))","v":""},null,null,{"$f":"IF($B221=Liste1!$F$9,1,0)","v":0},{"$f":"IF(I221+J221=0,\"\",(E221*100+(YEAR($A221)+MONTH($A221)+MONTH($A221)))/((YEAR($A221))))","v":""},{"$f":"IF(O221+K221>0,I221,\"\")","v":""},{"$f":"IF(O221+K221>0,J221,\"\")","v":""},null,{"$f":"IF(O221+K221=0,\"\",(J221-I221))","v":""}]
["2023-01-09",3,{"$f":"IF(B222=\"\",\"\",VLOOKUP(B222,Liste1!$F$2:$I$9,2))","v":"Essai 3"},null,null,{"$f":"IF(B222=Liste1!$F$9,Liste1!$F$9*E222*100+MONTH($A222),0)","v":0},{"$f":"IF(B222=Liste1!$F$9,J222-I222,0)","v":0},{"$f":"IF(E222=\"\",\"\",VLOOKUP(E222,Liste1!$A$2:$B$41,2))","v":""},null,null,{"$f":"IF($B222=Liste1!$F$9,1,0)","v":0},{"$f":"IF(I222+J222=0,\"\",(E222*100+(YEAR($A222)+MONTH($A222)+MONTH($A222)))/((YEAR($A222))))","v":""},{"$f":"IF(O222+K222>0,I222,\"\")","v":""},{"$f":"IF(O222+K222>0,J222,\"\")","v":""},null,{"$f":"IF(O222+K222=0,\"\",(J222-I222))","v":""}]
["2023-01-09",3,{"$f":"IF(B223=\"\",\"\",VLOOKUP(B223,Liste1!$F$2:$I$9,2))","v":"Essai 3"},null,null,{"$f":"IF(B223=Liste1!$F$9,Liste1!$F$9*E223*100+MONTH($A223),0)","v":0},{"$f":"IF(B223=Liste1!$F$9,J223-I223,0)","v":0},{"$f":"IF(E223=\"\",\"\",VLOOKUP(E223,Liste1!$A$2:$B$41,2))","v":""},null,null,{"$f":"IF($B223=Liste1!$F$9,1,0)","v":0},{"$f":"IF(I223+J223=0,\"\",(E223*100+(YEAR($A223)+MONTH($A223)+MONTH($A223)))/((YEAR($A223))))","v":""},{"$f":"IF(O223+K223>0,I223,\"\")","v":""},{"$f":"IF(O223+K223>0,J223,\"\")","v":""},null,{"$f":"IF(O223+K223=0,\"\",(J223-I223))","v":""}]
["2023-01-09",3,{"$f":"IF(B224=\"\",\"\",VLOOKUP(B224,Liste1!$F$2:$I$9,2))","v":"Essai 3"},null,null,{"$f":"IF(B224=Liste1!$F$9,Liste1!$F$9*E224*100+MONTH($A224),0)","v":0},{"$f":"IF(B224=Liste1!$F$9,J224-I224,0)","v":0},{"$f":"IF(E224=\"\",\"\",VLOOKUP(E224,Liste1!$A$2:$B$41,2))","v":""},null,null,{"$f":"IF($B224=Liste1!$F$9,1,0)","v":0},{"$f":"IF(I224+J224=0,\"\",(E224*100+(YEAR($A224)+MONTH($A224)+MONTH($A224)))/((YEAR($A224))))","v":""},{"$f":"IF(O224+K224>0,I224,\"\")","v":""},{"$f":"IF(O224+K224>0,J224,\"\")","v":""},null,{"$f":"IF(O224+K224=0,\"\",(J224-I224))","v":""}]
["2023-01-09",3,{"$f":"IF(B225=\"\",\"\",VLOOKUP(B225,Liste1!$F$2:$I$9,2))","v":"Essai 3"},null,null,{"$f":"IF(B225=Liste1!$F$9,Liste1!$F$9*E225*100+MONTH($A225),0)","v":0},{"$f":"IF(B225=Liste1!$F$9,J225-I225,0)","v":0},{"$f":"IF(E225=\"\",\"\",VLOOKUP(E225,Liste1!$A$2:$B$41,2))","v":""},null,null,{"$f":"IF($B225=Liste1!$F$9,1,0)","v":0},{"$f":"IF(I225+J225=0,\"\",(E225*100+(YEAR($A225)+MONTH($A225)+MONTH($A225)))/((YEAR($A225))))","v":""},{"$f":"IF(O225+K225>0,I225,\"\")","v":""},{"$f":"IF(O225+K225>0,J225,\"\")","v":""},null,{"$f":"IF(O225+K225=0,\"\",(J225-I225))","v":""}]
["2023-01-09",3,{"$f":"IF(B226=\"\",\"\",VLOOKUP(B226,Liste1!$F$2:$I$9,2))","v":"Essai 3"},null,null,{"$f":"IF(B226=Liste1!$F$9,Liste1!$F$9*E226*100+MONTH($A226),0)","v":0},{"$f":"IF(B226=Liste1!$F$9,J226-I226,0)","v":0},{"$f":"IF(E226=\"\",\"\",VLOOKUP(E226,Liste1!$A$2:$B$41,2))","v":""},null,null,{"$f":"IF($B226=Liste1!$F$9,1,0)","v":0},{"$f":"IF(I226+J226=0,\"\",(E226*100+(YEAR($A226)+MONTH($A226)+MONTH($A226)))/((YEAR($A226))))","v":""},{"$f":"IF(O226+K226>0,I226,\"\")","v":""},{"$f":"IF(O226+K226>0,J226,\"\")","v":""},null,{"$f":"IF(O226+K226=0,\"\",(J226-I226))","v":""}]
["2023-01-09",5,{"$f":"IF(B227=\"\",\"\",VLOOKUP(B227,Liste1!$F$2:$I$9,2))","v":"Essai 5"},null,null,{"$f":"IF(B227=Liste1!$F$9,Liste1!$F$9*E227*100+MONTH($A227),0)","v":0},{"$f":"IF(B227=Liste1!$F$9,J227-I227,0)","v":0},{"$f":"IF(E227=\"\",\"\",VLOOKUP(E227,Liste1!$A$2:$B$41,2))","v":""},null,null,{"$f":"IF($B227=Liste1!$F$9,1,0)","v":0},{"$f":"IF(I227+J227=0,\"\",(E227*100+(YEAR($A227)+MONTH($A227)+MONTH($A227)))/((YEAR($A227))))","v":""},{"$f":"IF(O227+K227>0,I227,\"\")","v":""},{"$f":"IF(O227+K227>0,J227,\"\")","v":""},null,{"$f":"IF(O227+K227=0,\"\",(J227-I227))","v":""}]
["2023-01-09",3,{"$f":"IF(B228=\"\",\"\",VLOOKUP(B228,Liste1!$F$2:$I$9,2))","v":"Essai 3"},null,null,{"$f":"IF(B228=Liste1!$F$9,Liste1!$F$9*E228*100+MONTH($A228),0)","v":0},{"$f":"IF(B228=Liste1!$F$9,J228-I228,0)","v":0},{"$f":"IF(E228=\"\",\"\",VLOOKUP(E228,Liste1!$A$2:$B$41,2))","v":""},null,null,{"$f":"IF($B228=Liste1!$F$9,1,0)","v":0},{"$f":"IF(I228+J228=0,\"\",(E228*100+(YEAR($A228)+MONTH($A228)+MONTH($A228)))/((YEAR($A228))))","v":""},{"$f":"IF(O228+K228>0,I228,\"\")","v":""},{"$f":"IF(O228+K228>0,J228,\"\")","v":""},null,{"$f":"IF(O228+K228=0,\"\",(J228-I228))","v":""}]
["2023-01-09",3,{"$f":"IF(B229=\"\",\"\",VLOOKUP(B229,Liste1!$F$2:$I$9,2))","v":"Essai 3"},null,null,{"$f":"IF(B229=Liste1!$F$9,Liste1!$F$9*E229*100+MONTH($A229),0)","v":0},{"$f":"IF(B229=Liste1!$F$9,J229-I229,0)","v":0},{"$f":"IF(E229=\"\",\"\",VLOOKUP(E229,Liste1!$A$2:$B$41,2))","v":""},null,null,{"$f":"IF($B229=Liste1!$F$9,1,0)","v":0},{"$f":"IF(I229+J229=0,\"\",(E229*100+(YEAR($A229)+MONTH($A229)+MONTH($A229)))/((YEAR($A229))))","v":""},{"$f":"IF(O229+K229>0,I229,\"\")","v":""},{"$f":"IF(O229+K229>0,J229,\"\")","v":""},null,{"$f":"IF(O229+K229=0,\"\",(J229-I229))","v":""}]
["2023-01-09",3,{"$f":"IF(B230=\"\",\"\",VLOOKUP(B230,Liste1!$F$2:$I$9,2))","v":"Essai 3"},null,null,{"$f":"IF(B230=Liste1!$F$9,Liste1!$F$9*E230*100+MONTH($A230),0)","v":0},{"$f":"IF(B230=Liste1!$F$9,J230-I230,0)","v":0},{"$f":"IF(E230=\"\",\"\",VLOOKUP(E230,Liste1!$A$2:$B$41,2))","v":""},null,null,{"$f":"IF($B230=Liste1!$F$9,1,0)","v":0},{"$f":"IF(I230+J230=0,\"\",(E230*100+(YEAR($A230)+MONTH($A230)+MONTH($A230)))/((YEAR($A230))))","v":""},{"$f":"IF(O230+K230>0,I230,\"\")","v":""},{"$f":"IF(O230+K230>0,J230,\"\")","v":""},null,{"$f":"IF(O230+K230=0,\"\",(J230-I230))","v":""}]
["2023-01-10",2,{"$f":"IF(B231=\"\",\"\",VLOOKUP(B231,Liste1!$F$2:$I$9,2))","v":"Essai 2"},null,null,{"$f":"IF(B231=Liste1!$F$9,Liste1!$F$9*E231*100+MONTH($A231),0)","v":0},{"$f":"IF(B231=Liste1!$F$9,J231-I231,0)","v":0},{"$f":"IF(E231=\"\",\"\",VLOOKUP(E231,Liste1!$A$2:$B$41,2))","v":""},null,null,{"$f":"IF($B231=Liste1!$F$9,1,0)","v":0},{"$f":"IF(I231+J231=0,\"\",(E231*100+(YEAR($A231)+MONTH($A231)+MONTH($A231)))/((YEAR($A231))))","v":""},{"$f":"IF(O231+K231>0,I231,\"\")","v":""},{"$f":"IF(O231+K231>0,J231,\"\")","v":""},null,{"$f":"IF(O231+K231=0,\"\",(J231-I231))","v":""}]
["2023-01-10",2,{"$f":"IF(B232=\"\",\"\",VLOOKUP(B232,Liste1!$F$2:$I$9,2))","v":"Essai 2"},null,null,{"$f":"IF(B232=Liste1!$F$9,Liste1!$F$9*E232*100+MONTH($A232),0)","v":0},{"$f":"IF(B232=Liste1!$F$9,J232-I232,0)","v":0},{"$f":"IF(E232=\"\",\"\",VLOOKUP(E232,Liste1!$A$2:$B$41,2))","v":""},null,null,{"$f":"IF($B232=Liste1!$F$9,1,0)","v":0},{"$f":"IF(I232+J232=0,\"\",(E232*100+(YEAR($A232)+MONTH($A232)+MONTH($A232)))/((YEAR($A232))))","v":""},{"$f":"IF(O232+K232>0,I232,\"\")","v":""},{"$f":"IF(O232+K232>0,J232,\"\")","v":""},null,{"$f":"IF(O232+K232=0,\"\",(J232-I232))","v":""}]
["2023-01-11",5,{"$f":"IF(B233=\"\",\"\",VLOOKUP(B233,Liste1!$F$2:$I$9,2))","v":"Essai 5"},null,null,{"$f":"IF(B233=Liste1!$F$9,Liste1!$F$9*E233*100+MONTH($A233),0)","v":0},{"$f":"IF(B233=Liste1!$F$9,J233-I233,0)","v":0},{"$f":"IF(E233=\"\",\"\",VLOOKUP(E233,Liste1!$A$2:$B$41,2))","v":""},null,null,{"$f":"IF($B233=Liste1!$F$9,1,0)","v":0},{"$f":"IF(I233+J233=0,\"\",(E233*100+(YEAR($A233)+MONTH($A233)+MONTH($A233)))/((YEAR($A233))))","v":""},{"$f":"IF(O233+K233>0,I233,\"\")","v":""},{"$f":"IF(O233+K233>0,J233,\"\")","v":""},null,{"$f":"IF(O233+K233=0,\"\",(J233-I233))","v":""}]
["2023-01-11",3,{"$f":"IF(B234=\"\",\"\",VLOOKUP(B234,Liste1!$F$2:$I$9,2))","v":"Essai 3"},null,null,{"$f":"IF(B234=Liste1!$F$9,Liste1!$F$9*E234*100+MONTH($A234),0)","v":0},{"$f":"IF(B234=Liste1!$F$9,J234-I234,0)","v":0},{"$f":"IF(E234=\"\",\"\",VLOOKUP(E234,Liste1!$A$2:$B$41,2))","v":""},null,null,{"$f":"IF($B234=Liste1!$F$9,1,0)","v":0},{"$f":"IF(I234+J234=0,\"\",(E234*100+(YEAR($A234)+MONTH($A234)+MONTH($A234)))/((YEAR($A234))))","v":""},{"$f":"IF(O234+K234>0,I234,\"\")","v":""},{"$f":"IF(O234+K234>0,J234,\"\")","v":""},null,{"$f":"IF(O234+K234=0,\"\",(J234-I234))","v":""}]
["2023-01-11",3,{"$f":"IF(B235=\"\",\"\",VLOOKUP(B235,Liste1!$F$2:$I$9,2))","v":"Essai 3"},null,null,{"$f":"IF(B235=Liste1!$F$9,Liste1!$F$9*E235*100+MONTH($A235),0)","v":0},{"$f":"IF(B235=Liste1!$F$9,J235-I235,0)","v":0},{"$f":"IF(E235=\"\",\"\",VLOOKUP(E235,Liste1!$A$2:$B$41,2))","v":""},null,null,{"$f":"IF($B235=Liste1!$F$9,1,0)","v":0},{"$f":"IF(I235+J235=0,\"\",(E235*100+(YEAR($A235)+MONTH($A235)+MONTH($A235)))/((YEAR($A235))))","v":""},{"$f":"IF(O235+K235>0,I235,\"\")","v":""},{"$f":"IF(O235+K235>0,J235,\"\")","v":""},null,{"$f":"IF(O235+K235=0,\"\",(J235-I235))","v":""}]
["2023-01-12",5,{"$f":"IF(B236=\"\",\"\",VLOOKUP(B236,Liste1!$F$2:$I$9,2))","v":"Essai 5"},null,null,{"$f":"IF(B236=Liste1!$F$9,Liste1!$F$9*E236*100+MONTH($A236),0)","v":0},{"$f":"IF(B236=Liste1!$F$9,J236-I236,0)","v":0},{"$f":"IF(E236=\"\",\"\",VLOOKUP(E236,Liste1!$A$2:$B$41,2))","v":""},null,null,{"$f":"IF($B236=Liste1!$F$9,1,0)","v":0},{"$f":"IF(I236+J236=0,\"\",(E236*100+(YEAR($A236)+MONTH($A236)+MONTH($A236)))/((YEAR($A236))))","v":""},{"$f":"IF(O236+K236>0,I236,\"\")","v":""},{"$f":"IF(O236+K236>0,J236,\"\")","v":""},null,{"$f":"IF(O236+K236=0,\"\",(J236-I236))","v":""}]
["2023-01-12",3,{"$f":"IF(B237=\"\",\"\",VLOOKUP(B237,Liste1!$F$2:$I$9,2))","v":"Essai 3"},null,null,{"$f":"IF(B237=Liste1!$F$9,Liste1!$F$9*E237*100+MONTH($A237),0)","v":0},{"$f":"IF(B237=Liste1!$F$9,J237-I237,0)","v":0},{"$f":"IF(E237=\"\",\"\",VLOOKUP(E237,Liste1!$A$2:$B$41,2))","v":""},null,null,{"$f":"IF($B237=Liste1!$F$9,1,0)","v":0},{"$f":"IF(I237+J237=0,\"\",(E237*100+(YEAR($A237)+MONTH($A237)+MONTH($A237)))/((YEAR($A237))))","v":""},{"$f":"IF(O237+K237>0,I237,\"\")","v":""},{"$f":"IF(O237+K237>0,J237,\"\")","v":""},null,{"$f":"IF(O237+K237=0,\"\",(J237-I237))","v":""}]
["2023-01-12",3,{"$f":"IF(B238=\"\",\"\",VLOOKUP(B238,Liste1!$F$2:$I$9,2))","v":"Essai 3"},null,null,{"$f":"IF(B238=Liste1!$F$9,Liste1!$F$9*E238*100+MONTH($A238),0)","v":0},{"$f":"IF(B238=Liste1!$F$9,J238-I238,0)","v":0},{"$f":"IF(E238=\"\",\"\",VLOOKUP(E238,Liste1!$A$2:$B$41,2))","v":""},null,null,{"$f":"IF($B238=Liste1!$F$9,1,0)","v":0},{"$f":"IF(I238+J238=0,\"\",(E238*100+(YEAR($A238)+MONTH($A238)+MONTH($A238)))/((YEAR($A238))))","v":""},{"$f":"IF(O238+K238>0,I238,\"\")","v":""},{"$f":"IF(O238+K238>0,J238,\"\")","v":""},null,{"$f":"IF(O238+K238=0,\"\",(J238-I238))","v":""}]
["2023-01-12",3,{"$f":"IF(B239=\"\",\"\",VLOOKUP(B239,Liste1!$F$2:$I$9,2))","v":"Essai 3"},null,null,{"$f":"IF(B239=Liste1!$F$9,Liste1!$F$9*E239*100+MONTH($A239),0)","v":0},{"$f":"IF(B239=Liste1!$F$9,J239-I239,0)","v":0},{"$f":"IF(E239=\"\",\"\",VLOOKUP(E239,Liste1!$A$2:$B$41,2))","v":""},null,null,{"$f":"IF($B239=Liste1!$F$9,1,0)","v":0},{"$f":"IF(I239+J239=0,\"\",(E239*100+(YEAR($A239)+MONTH($A239)+MONTH($A239)))/((YEAR($A239))))","v":""},{"$f":"IF(O239+K239>0,I239,\"\")","v":""},{"$f":"IF(O239+K239>0,J239,\"\")","v":""},null,{"$f":"IF(O239+K239=0,\"\",(J239-I239))","v":""}]
["2023-01-12",2,{"$f":"IF(B240=\"\",\"\",VLOOKUP(B240,Liste1!$F$2:$I$9,2))","v":"Essai 2"},null,null,{"$f":"IF(B240=Liste1!$F$9,Liste1!$F$9*E240*100+MONTH($A240),0)","v":0},{"$f":"IF(B240=Liste1!$F$9,J240-I240,0)","v":0},{"$f":"IF(E240=\"\",\"\",VLOOKUP(E240,Liste1!$A$2:$B$41,2))","v":""},null,null,{"$f":"IF($B240=Liste1!$F$9,1,0)","v":0},{"$f":"IF(I240+J240=0,\"\",(E240*100+(YEAR($A240)+MONTH($A240)+MONTH($A240)))/((YEAR($A240))))","v":""},{"$f":"IF(O240+K240>0,I240,\"\")","v":""},{"$f":"IF(O240+K240>0,J240,\"\")","v":""},null,{"$f":"IF(O240+K240=0,\"\",(J240-I240))","v":""}]
["2023-01-13",3,{"$f":"IF(B241=\"\",\"\",VLOOKUP(B241,Liste1!$F$2:$I$9,2))","v":"Essai 3"},null,null,{"$f":"IF(B241=Liste1!$F$9,Liste1!$F$9*E241*100+MONTH($A241),0)","v":0},{"$f":"IF(B241=Liste1!$F$9,J241-I241,0)","v":0},{"$f":"IF(E241=\"\",\"\",VLOOKUP(E241,Liste1!$A$2:$B$41,2))","v":""},null,null,{"$f":"IF($B241=Liste1!$F$9,1,0)","v":0},{"$f":"IF(I241+J241=0,\"\",(E241*100+(YEAR($A241)+MONTH($A241)+MONTH($A241)))/((YEAR($A241))))","v":""},{"$f":"IF(O241+K241>0,I241,\"\")","v":""},{"$f":"IF(O241+K241>0,J241,\"\")","v":""},null,{"$f":"IF(O241+K241=0,\"\",(J241-I241))","v":""}]
["2023-01-14",2,{"$f":"IF(B242=\"\",\"\",VLOOKUP(B242,Liste1!$F$2:$I$9,2))","v":"Essai 2"},null,null,{"$f":"IF(B242=Liste1!$F$9,Liste1!$F$9*E242*100+MONTH($A242),0)","v":0},{"$f":"IF(B242=Liste1!$F$9,J242-I242,0)","v":0},{"$f":"IF(E242=\"\",\"\",VLOOKUP(E242,Liste1!$A$2:$B$41,2))","v":""},null,null,{"$f":"IF($B242=Liste1!$F$9,1,0)","v":0},{"$f":"IF(I242+J242=0,\"\",(E242*100+(YEAR($A242)+MONTH($A242)+MONTH($A242)))/((YEAR($A242))))","v":""},{"$f":"IF(O242+K242>0,I242,\"\")","v":""},{"$f":"IF(O242+K242>0,J242,\"\")","v":""},null,{"$f":"IF(O242+K242=0,\"\",(J242-I242))","v":""}]
["2023-01-14",2,{"$f":"IF(B243=\"\",\"\",VLOOKUP(B243,Liste1!$F$2:$I$9,2))","v":"Essai 2"},null,null,{"$f":"IF(B243=Liste1!$F$9,Liste1!$F$9*E243*100+MONTH($A243),0)","v":0},{"$f":"IF(B243=Liste1!$F$9,J243-I243,0)","v":0},{"$f":"IF(E243=\"\",\"\",VLOOKUP(E243,Liste1!$A$2:$B$41,2))","v":""},null,null,{"$f":"IF($B243=Liste1!$F$9,1,0)","v":0},{"$f":"IF(I243+J243=0,\"\",(E243*100+(YEAR($A243)+MONTH($A243)+MONTH($A243)))/((YEAR($A243))))","v":""},{"$f":"IF(O243+K243>0,I243,\"\")","v":""},{"$f":"IF(O243+K243>0,J243,\"\")","v":""},null,{"$f":"IF(O243+K243=0,\"\",(J243-I243))","v":""}]
["2023-01-17",2,{"$f":"IF(B244=\"\",\"\",VLOOKUP(B244,Liste1!$F$2:$I$9,2))","v":"Essai 2"},null,null,{"$f":"IF(B244=Liste1!$F$9,Liste1!$F$9*E244*100+MONTH($A244),0)","v":0},{"$f":"IF(B244=Liste1!$F$9,J244-I244,0)","v":0},{"$f":"IF(E244=\"\",\"\",VLOOKUP(E244,Liste1!$A$2:$B$41,2))","v":""},null,null,{"$f":"IF($B244=Liste1!$F$9,1,0)","v":0},{"$f":"IF(I244+J244=0,\"\",(E244*100+(YEAR($A244)+MONTH($A244)+MONTH($A244)))/((YEAR($A244))))","v":""},{"$f":"IF(O244+K244>0,I244,\"\")","v":""},{"$f":"IF(O244+K244>0,J244,\"\")","v":""},null,{"$f":"IF(O244+K244=0,\"\",(J244-I244))","v":""}]
["2023-01-18",4,{"$f":"IF(B245=\"\",\"\",VLOOKUP(B245,Liste1!$F$2:$I$9,2))","v":"Essai 4"},null,null,{"$f":"IF(B245=Liste1!$F$9,Liste1!$F$9*E245*100+MONTH($A245),0)","v":0},{"$f":"IF(B245=Liste1!$F$9,J245-I245,0)","v":0},{"$f":"IF(E245=\"\",\"\",VLOOKUP(E245,Liste1!$A$2:$B$41,2))","v":""},null,null,{"$f":"IF($B245=Liste1!$F$9,1,0)","v":0},{"$f":"IF(I245+J245=0,\"\",(E245*100+(YEAR($A245)+MONTH($A245)+MONTH($A245)))/((YEAR($A245))))","v":""},{"$f":"IF(O245+K245>0,I245,\"\")","v":""},{"$f":"IF(O245+K245>0,J245,\"\")","v":""},null,{"$f":"IF(O245+K245=0,\"\",(J245-I245))","v":""}]
["2023-01-18",4,{"$f":"IF(B246=\"\",\"\",VLOOKUP(B246,Liste1!$F$2:$I$9,2))","v":"Essai 4"},null,null,{"$f":"IF(B246=Liste1!$F$9,Liste1!$F$9*E246*100+MONTH($A246),0)","v":0},{"$f":"IF(B246=Liste1!$F$9,J246-I246,0)","v":0},{"$f":"IF(E246=\"\",\"\",VLOOKUP(E246,Liste1!$A$2:$B$41,2))","v":""},null,null,{"$f":"IF($B246=Liste1!$F$9,1,0)","v":0},{"$f":"IF(I246+J246=0,\"\",(E246*100+(YEAR($A246)+MONTH($A246)+MONTH($A246)))/((YEAR($A246))))","v":""},{"$f":"IF(O246+K246>0,I246,\"\")","v":""},{"$f":"IF(O246+K246>0,J246,\"\")","v":""},null,{"$f":"IF(O246+K246=0,\"\",(J246-I246))","v":""}]
["2023-01-19",2,{"$f":"IF(B247=\"\",\"\",VLOOKUP(B247,Liste1!$F$2:$I$9,2))","v":"Essai 2"},null,null,{"$f":"IF(B247=Liste1!$F$9,Liste1!$F$9*E247*100+MONTH($A247),0)","v":0},{"$f":"IF(B247=Liste1!$F$9,J247-I247,0)","v":0},{"$f":"IF(E247=\"\",\"\",VLOOKUP(E247,Liste1!$A$2:$B$41,2))","v":""},null,null,{"$f":"IF($B247=Liste1!$F$9,1,0)","v":0},{"$f":"IF(I247+J247=0,\"\",(E247*100+(YEAR($A247)+MONTH($A247)+MONTH($A247)))/((YEAR($A247))))","v":""},{"$f":"IF(O247+K247>0,I247,\"\")","v":""},{"$f":"IF(O247+K247>0,J247,\"\")","v":""},null,{"$f":"IF(O247+K247=0,\"\",(J247-I247))","v":""}]
["2023-01-20",3,{"$f":"IF(B248=\"\",\"\",VLOOKUP(B248,Liste1!$F$2:$I$9,2))","v":"Essai 3"},null,null,{"$f":"IF(B248=Liste1!$F$9,Liste1!$F$9*E248*100+MONTH($A248),0)","v":0},{"$f":"IF(B248=Liste1!$F$9,J248-I248,0)","v":0},{"$f":"IF(E248=\"\",\"\",VLOOKUP(E248,Liste1!$A$2:$B$41,2))","v":""},null,null,{"$f":"IF($B248=Liste1!$F$9,1,0)","v":0},{"$f":"IF(I248+J248=0,\"\",(E248*100+(YEAR($A248)+MONTH($A248)+MONTH($A248)))/((YEAR($A248))))","v":""},{"$f":"IF(O248+K248>0,I248,\"\")","v":""},{"$f":"IF(O248+K248>0,J248,\"\")","v":""},null,{"$f":"IF(O248+K248=0,\"\",(J248-I248))","v":""}]
["2023-01-20",2,{"$f":"IF(B249=\"\",\"\",VLOOKUP(B249,Liste1!$F$2:$I$9,2))","v":"Essai 2"},null,null,{"$f":"IF(B249=Liste1!$F$9,Liste1!$F$9*E249*100+MONTH($A249),0)","v":0},{"$f":"IF(B249=Liste1!$F$9,J249-I249,0)","v":0},{"$f":"IF(E249=\"\",\"\",VLOOKUP(E249,Liste1!$A$2:$B$41,2))","v":""},null,null,{"$f":"IF($B249=Liste1!$F$9,1,0)","v":0},{"$f":"IF(I249+J249=0,\"\",(E249*100+(YEAR($A249)+MONTH($A249)+MONTH($A249)))/((YEAR($A249))))","v":""},{"$f":"IF(O249+K249>0,I249,\"\")","v":""},{"$f":"IF(O249+K249>0,J249,\"\")","v":""},null,{"$f":"IF(O249+K249=0,\"\",(J249-I249))","v":""}]
["2023-01-20",5,{"$f":"IF(B250=\"\",\"\",VLOOKUP(B250,Liste1!$F$2:$I$9,2))","v":"Essai 5"},null,null,{"$f":"IF(B250=Liste1!$F$9,Liste1!$F$9*E250*100+MONTH($A250),0)","v":0},{"$f":"IF(B250=Liste1!$F$9,J250-I250,0)","v":0},{"$f":"IF(E250=\"\",\"\",VLOOKUP(E250,Liste1!$A$2:$B$41,2))","v":""},null,null,{"$f":"IF($B250=Liste1!$F$9,1,0)","v":0},{"$f":"IF(I250+J250=0,\"\",(E250*100+(YEAR($A250)+MONTH($A250)+MONTH($A250)))/((YEAR($A250))))","v":""},{"$f":"IF(O250+K250>0,I250,\"\")","v":""},{"$f":"IF(O250+K250>0,J250,\"\")","v":""},null,{"$f":"IF(O250+K250=0,\"\",(J250-I250))","v":""}]
["2023-01-24",4,{"$f":"IF(B251=\"\",\"\",VLOOKUP(B251,Liste1!$F$2:$I$9,2))","v":"Essai 4"},null,null,{"$f":"IF(B251=Liste1!$F$9,Liste1!$F$9*E251*100+MONTH($A251),0)","v":0},{"$f":"IF(B251=Liste1!$F$9,J251-I251,0)","v":0},{"$f":"IF(E251=\"\",\"\",VLOOKUP(E251,Liste1!$A$2:$B$41,2))","v":""},null,null,{"$f":"IF($B251=Liste1!$F$9,1,0)","v":0},{"$f":"IF(I251+J251=0,\"\",(E251*100+(YEAR($A251)+MONTH($A251)+MONTH($A251)))/((YEAR($A251))))","v":""},{"$f":"IF(O251+K251>0,I251,\"\")","v":""},{"$f":"IF(O251+K251>0,J251,\"\")","v":""},null,{"$f":"IF(O251+K251=0,\"\",(J251-I251))","v":""}]
["2023-01-26",4,{"$f":"IF(B252=\"\",\"\",VLOOKUP(B252,Liste1!$F$2:$I$9,2))","v":"Essai 4"},null,null,{"$f":"IF(B252=Liste1!$F$9,Liste1!$F$9*E252*100+MONTH($A252),0)","v":0},{"$f":"IF(B252=Liste1!$F$9,J252-I252,0)","v":0},{"$f":"IF(E252=\"\",\"\",VLOOKUP(E252,Liste1!$A$2:$B$41,2))","v":""},null,null,{"$f":"IF($B252=Liste1!$F$9,1,0)","v":0},{"$f":"IF(I252+J252=0,\"\",(E252*100+(YEAR($A252)+MONTH($A252)+MONTH($A252)))/((YEAR($A252))))","v":""},{"$f":"IF(O252+K252>0,I252,\"\")","v":""},{"$f":"IF(O252+K252>0,J252,\"\")","v":""},null,{"$f":"IF(O252+K252=0,\"\",(J252-I252))","v":""}]
["2023-01-26",5,{"$f":"IF(B253=\"\",\"\",VLOOKUP(B253,Liste1!$F$2:$I$9,2))","v":"Essai 5"},null,null,{"$f":"IF(B253=Liste1!$F$9,Liste1!$F$9*E253*100+MONTH($A253),0)","v":0},{"$f":"IF(B253=Liste1!$F$9,J253-I253,0)","v":0},{"$f":"IF(E253=\"\",\"\",VLOOKUP(E253,Liste1!$A$2:$B$41,2))","v":""},null,null,{"$f":"IF($B253=Liste1!$F$9,1,0)","v":0},{"$f":"IF(I253+J253=0,\"\",(E253*100+(YEAR($A253)+MONTH($A253)+MONTH($A253)))/((YEAR($A253))))","v":""},{"$f":"IF(O253+K253>0,I253,\"\")","v":""},{"$f":"IF(O253+K253>0,J253,\"\")","v":""},null,{"$f":"IF(O253+K253=0,\"\",(J253-I253))","v":""}]
["2023-01-26",5,{"$f":"IF(B254=\"\",\"\",VLOOKUP(B254,Liste1!$F$2:$I$9,2))","v":"Essai 5"},null,null,{"$f":"IF(B254=Liste1!$F$9,Liste1!$F$9*E254*100+MONTH($A254),0)","v":0},{"$f":"IF(B254=Liste1!$F$9,J254-I254,0)","v":0},{"$f":"IF(E254=\"\",\"\",VLOOKUP(E254,Liste1!$A$2:$B$41,2))","v":""},null,null,{"$f":"IF($B254=Liste1!$F$9,1,0)","v":0},{"$f":"IF(I254+J254=0,\"\",(E254*100+(YEAR($A254)+MONTH($A254)+MONTH($A254)))/((YEAR($A254))))","v":""},{"$f":"IF(O254+K254>0,I254,\"\")","v":""},{"$f":"IF(O254+K254>0,J254,\"\")","v":""},null,{"$f":"IF(O254+K254=0,\"\",(J254-I254))","v":""}]
["2023-01-27",3,{"$f":"IF(B255=\"\",\"\",VLOOKUP(B255,Liste1!$F$2:$I$9,2))","v":"Essai 3"},null,null,{"$f":"IF(B255=Liste1!$F$9,Liste1!$F$9*E255*100+MONTH($A255),0)","v":0},{"$f":"IF(B255=Liste1!$F$9,J255-I255,0)","v":0},{"$f":"IF(E255=\"\",\"\",VLOOKUP(E255,Liste1!$A$2:$B$41,2))","v":""},null,null,{"$f":"IF($B255=Liste1!$F$9,1,0)","v":0},{"$f":"IF(I255+J255=0,\"\",(E255*100+(YEAR($A255)+MONTH($A255)+MONTH($A255)))/((YEAR($A255))))","v":""},{"$f":"IF(O255+K255>0,I255,\"\")","v":""},{"$f":"IF(O255+K255>0,J255,\"\")","v":""},null,{"$f":"IF(O255+K255=0,\"\",(J255-I255))","v":""}]
["2023-01-27",2,{"$f":"IF(B256=\"\",\"\",VLOOKUP(B256,Liste1!$F$2:$I$9,2))","v":"Essai 2"},null,null,{"$f":"IF(B256=Liste1!$F$9,Liste1!$F$9*E256*100+MONTH($A256),0)","v":0},{"$f":"IF(B256=Liste1!$F$9,J256-I256,0)","v":0},{"$f":"IF(E256=\"\",\"\",VLOOKUP(E256,Liste1!$A$2:$B$41,2))","v":""},null,null,{"$f":"IF($B256=Liste1!$F$9,1,0)","v":0},{"$f":"IF(I256+J256=0,\"\",(E256*100+(YEAR($A256)+MONTH($A256)+MONTH($A256)))/((YEAR($A256))))","v":""},{"$f":"IF(O256+K256>0,I256,\"\")","v":""},{"$f":"IF(O256+K256>0,J256,\"\")","v":""},null,{"$f":"IF(O256+K256=0,\"\",(J256-I256))","v":""}]
["2023-01-27",2,{"$f":"IF(B257=\"\",\"\",VLOOKUP(B257,Liste1!$F$2:$I$9,2))","v":"Essai 2"},null,null,{"$f":"IF(B257=Liste1!$F$9,Liste1!$F$9*E257*100+MONTH($A257),0)","v":0},{"$f":"IF(B257=Liste1!$F$9,J257-I257,0)","v":0},{"$f":"IF(E257=\"\",\"\",VLOOKUP(E257,Liste1!$A$2:$B$41,2))","v":""},null,null,{"$f":"IF($B257=Liste1!$F$9,1,0)","v":0},{"$f":"IF(I257+J257=0,\"\",(E257*100+(YEAR($A257)+MONTH($A257)+MONTH($A257)))/((YEAR($A257))))","v":""},{"$f":"IF(O257+K257>0,I257,\"\")","v":""},{"$f":"IF(O257+K257>0,J257,\"\")","v":""},null,{"$f":"IF(O257+K257=0,\"\",(J257-I257))","v":""}]
["2023-01-27",2,{"$f":"IF(B258=\"\",\"\",VLOOKUP(B258,Liste1!$F$2:$I$9,2))","v":"Essai 2"},null,null,{"$f":"IF(B258=Liste1!$F$9,Liste1!$F$9*E258*100+MONTH($A258),0)","v":0},{"$f":"IF(B258=Liste1!$F$9,J258-I258,0)","v":0},{"$f":"IF(E258=\"\",\"\",VLOOKUP(E258,Liste1!$A$2:$B$41,2))","v":""},null,null,{"$f":"IF($B258=Liste1!$F$9,1,0)","v":0},{"$f":"IF(I258+J258=0,\"\",(E258*100+(YEAR($A258)+MONTH($A258)+MONTH($A258)))/((YEAR($A258))))","v":""},{"$f":"IF(O258+K258>0,I258,\"\")","v":""},{"$f":"IF(O258+K258>0,J258,\"\")","v":""},null,{"$f":"IF(O258+K258=0,\"\",(J258-I258))","v":""}]
["2023-01-27",7,{"$f":"IF(B259=\"\",\"\",VLOOKUP(B259,Liste1!$F$2:$I$9,2))","v":"Essai 7"},null,null,{"$f":"IF(B259=Liste1!$F$9,Liste1!$F$9*E259*100+MONTH($A259),0)","v":0},{"$f":"IF(B259=Liste1!$F$9,J259-I259,0)","v":0},{"$f":"IF(E259=\"\",\"\",VLOOKUP(E259,Liste1!$A$2:$B$41,2))","v":""},null,null,{"$f":"IF($B259=Liste1!$F$9,1,0)","v":0},{"$f":"IF(I259+J259=0,\"\",(E259*100+(YEAR($A259)+MONTH($A259)+MONTH($A259)))/((YEAR($A259))))","v":""},{"$f":"IF(O259+K259>0,I259,\"\")","v":""},{"$f":"IF(O259+K259>0,J259,\"\")","v":""},null,{"$f":"IF(O259+K259=0,\"\",(J259-I259))","v":""}]
["2023-01-27",4,{"$f":"IF(B260=\"\",\"\",VLOOKUP(B260,Liste1!$F$2:$I$9,2))","v":"Essai 4"},null,null,{"$f":"IF(B260=Liste1!$F$9,Liste1!$F$9*E260*100+MONTH($A260),0)","v":0},{"$f":"IF(B260=Liste1!$F$9,J260-I260,0)","v":0},{"$f":"IF(E260=\"\",\"\",VLOOKUP(E260,Liste1!$A$2:$B$41,2))","v":""},null,null,{"$f":"IF($B260=Liste1!$F$9,1,0)","v":0},{"$f":"IF(I260+J260=0,\"\",(E260*100+(YEAR($A260)+MONTH($A260)+MONTH($A260)))/((YEAR($A260))))","v":""},{"$f":"IF(O260+K260>0,I260,\"\")","v":""},{"$f":"IF(O260+K260>0,J260,\"\")","v":""},null,{"$f":"IF(O260+K260=0,\"\",(J260-I260))","v":""}]
["2023-01-29",2,{"$f":"IF(B261=\"\",\"\",VLOOKUP(B261,Liste1!$F$2:$I$9,2))","v":"Essai 2"},null,null,{"$f":"IF(B261=Liste1!$F$9,Liste1!$F$9*E261*100+MONTH($A261),0)","v":0},{"$f":"IF(B261=Liste1!$F$9,J261-I261,0)","v":0},{"$f":"IF(E261=\"\",\"\",VLOOKUP(E261,Liste1!$A$2:$B$41,2))","v":""},null,null,{"$f":"IF($B261=Liste1!$F$9,1,0)","v":0},{"$f":"IF(I261+J261=0,\"\",(E261*100+(YEAR($A261)+MONTH($A261)+MONTH($A261)))/((YEAR($A261))))","v":""},{"$f":"IF(O261+K261>0,I261,\"\")","v":""},{"$f":"IF(O261+K261>0,J261,\"\")","v":""},null,{"$f":"IF(O261+K261=0,\"\",(J261-I261))","v":""}]
["2023-01-29",2,{"$f":"IF(B262=\"\",\"\",VLOOKUP(B262,Liste1!$F$2:$I$9,2))","v":"Essai 2"},null,null,{"$f":"IF(B262=Liste1!$F$9,Liste1!$F$9*E262*100+MONTH($A262),0)","v":0},{"$f":"IF(B262=Liste1!$F$9,J262-I262,0)","v":0},{"$f":"IF(E262=\"\",\"\",VLOOKUP(E262,Liste1!$A$2:$B$41,2))","v":""},null,null,{"$f":"IF($B262=Liste1!$F$9,1,0)","v":0},{"$f":"IF(I262+J262=0,\"\",(E262*100+(YEAR($A262)+MONTH($A262)+MONTH($A262)))/((YEAR($A262))))","v":""},{"$f":"IF(O262+K262>0,I262,\"\")","v":""},{"$f":"IF(O262+K262>0,J262,\"\")","v":""},null,{"$f":"IF(O262+K262=0,\"\",(J262-I262))","v":""}]
["2023-01-29",2,{"$f":"IF(B263=\"\",\"\",VLOOKUP(B263,Liste1!$F$2:$I$9,2))","v":"Essai 2"},null,null,{"$f":"IF(B263=Liste1!$F$9,Liste1!$F$9*E263*100+MONTH($A263),0)","v":0},{"$f":"IF(B263=Liste1!$F$9,J263-I263,0)","v":0},{"$f":"IF(E263=\"\",\"\",VLOOKUP(E263,Liste1!$A$2:$B$41,2))","v":""},null,null,{"$f":"IF($B263=Liste1!$F$9,1,0)","v":0},{"$f":"IF(I263+J263=0,\"\",(E263*100+(YEAR($A263)+MONTH($A263)+MONTH($A263)))/((YEAR($A263))))","v":""},{"$f":"IF(O263+K263>0,I263,\"\")","v":""},{"$f":"IF(O263+K263>0,J263,\"\")","v":""},null,{"$f":"IF(O263+K263=0,\"\",(J263-I263))","v":""}]
["2023-01-30",1,{"$f":"IF(B264=\"\",\"\",VLOOKUP(B264,Liste1!$F$2:$I$9,2))","v":"Essai 1"},null,null,{"$f":"IF(B264=Liste1!$F$9,Liste1!$F$9*E264*100+MONTH($A264),0)","v":0},{"$f":"IF(B264=Liste1!$F$9,J264-I264,0)","v":0},{"$f":"IF(E264=\"\",\"\",VLOOKUP(E264,Liste1!$A$2:$B$41,2))","v":""},null,null,{"$f":"IF($B264=Liste1!$F$9,1,0)","v":0},{"$f":"IF(I264+J264=0,\"\",(E264*100+(YEAR($A264)+MONTH($A264)+MONTH($A264)))/((YEAR($A264))))","v":""},{"$f":"IF(O264+K264>0,I264,\"\")","v":""},{"$f":"IF(O264+K264>0,J264,\"\")","v":""},null,{"$f":"IF(O264+K264=0,\"\",(J264-I264))","v":""}]
["2023-01-30",4,{"$f":"IF(B265=\"\",\"\",VLOOKUP(B265,Liste1!$F$2:$I$9,2))","v":"Essai 4"},null,null,{"$f":"IF(B265=Liste1!$F$9,Liste1!$F$9*E265*100+MONTH($A265),0)","v":0},{"$f":"IF(B265=Liste1!$F$9,J265-I265,0)","v":0},{"$f":"IF(E265=\"\",\"\",VLOOKUP(E265,Liste1!$A$2:$B$41,2))","v":""},null,null,{"$f":"IF($B265=Liste1!$F$9,1,0)","v":0},{"$f":"IF(I265+J265=0,\"\",(E265*100+(YEAR($A265)+MONTH($A265)+MONTH($A265)))/((YEAR($A265))))","v":""},{"$f":"IF(O265+K265>0,I265,\"\")","v":""},{"$f":"IF(O265+K265>0,J265,\"\")","v":""},null,{"$f":"IF(O265+K265=0,\"\",(J265-I265))","v":""}]
["2023-01-30",5,{"$f":"IF(B266=\"\",\"\",VLOOKUP(B266,Liste1!$F$2:$I$9,2))","v":"Essai 5"},null,null,{"$f":"IF(B266=Liste1!$F$9,Liste1!$F$9*E266*100+MONTH($A266),0)","v":0},{"$f":"IF(B266=Liste1!$F$9,J266-I266,0)","v":0},{"$f":"IF(E266=\"\",\"\",VLOOKUP(E266,Liste1!$A$2:$B$41,2))","v":""},null,null,{"$f":"IF($B266=Liste1!$F$9,1,0)","v":0},{"$f":"IF(I266+J266=0,\"\",(E266*100+(YEAR($A266)+MONTH($A266)+MONTH($A266)))/((YEAR($A266))))","v":""},{"$f":"IF(O266+K266>0,I266,\"\")","v":""},{"$f":"IF(O266+K266>0,J266,\"\")","v":""},null,{"$f":"IF(O266+K266=0,\"\",(J266-I266))","v":""}]
["2023-01-30",2,{"$f":"IF(B267=\"\",\"\",VLOOKUP(B267,Liste1!$F$2:$I$9,2))","v":"Essai 2"},null,null,{"$f":"IF(B267=Liste1!$F$9,Liste1!$F$9*E267*100+MONTH($A267),0)","v":0},{"$f":"IF(B267=Liste1!$F$9,J267-I267,0)","v":0},{"$f":"IF(E267=\"\",\"\",VLOOKUP(E267,Liste1!$A$2:$B$41,2))","v":""},null,null,{"$f":"IF($B267=Liste1!$F$9,1,0)","v":0},{"$f":"IF(I267+J267=0,\"\",(E267*100+(YEAR($A267)+MONTH($A267)+MONTH($A267)))/((YEAR($A267))))","v":""},{"$f":"IF(O267+K267>0,I267,\"\")","v":""},{"$f":"IF(O267+K267>0,J267,\"\")","v":""},null,{"$f":"IF(O267+K267=0,\"\",(J267-I267))","v":""}]
["2023-02-03",4,{"$f":"IF(B268=\"\",\"\",VLOOKUP(B268,Liste1!$F$2:$I$9,2))","v":"Essai 4"},null,null,{"$f":"IF(B268=Liste1!$F$9,Liste1!$F$9*E268*100+MONTH($A268),0)","v":0},{"$f":"IF(B268=Liste1!$F$9,J268-I268,0)","v":0},{"$f":"IF(E268=\"\",\"\",VLOOKUP(E268,Liste1!$A$2:$B$41,2))","v":""},null,null,{"$f":"IF($B268=Liste1!$F$9,1,0)","v":0},{"$f":"IF(I268+J268=0,\"\",(E268*100+(YEAR($A268)+MONTH($A268)+MONTH($A268)))/((YEAR($A268))))","v":""},{"$f":"IF(O268+K268>0,I268,\"\")","v":""},{"$f":"IF(O268+K268>0,J268,\"\")","v":""},null,{"$f":"IF(O268+K268=0,\"\",(J268-I268))","v":""}]
["2023-02-03",2,{"$f":"IF(B269=\"\",\"\",VLOOKUP(B269,Liste1!$F$2:$I$9,2))","v":"Essai 2"},null,null,{"$f":"IF(B269=Liste1!$F$9,Liste1!$F$9*E269*100+MONTH($A269),0)","v":0},{"$f":"IF(B269=Liste1!$F$9,J269-I269,0)","v":0},{"$f":"IF(E269=\"\",\"\",VLOOKUP(E269,Liste1!$A$2:$B$41,2))","v":""},null,null,{"$f":"IF($B269=Liste1!$F$9,1,0)","v":0},{"$f":"IF(I269+J269=0,\"\",(E269*100+(YEAR($A269)+MONTH($A269)+MONTH($A269)))/((YEAR($A269))))","v":""},{"$f":"IF(O269+K269>0,I269,\"\")","v":""},{"$f":"IF(O269+K269>0,J269,\"\")","v":""},null,{"$f":"IF(O269+K269=0,\"\",(J269-I269))","v":""}]
["2023-02-03",4,{"$f":"IF(B270=\"\",\"\",VLOOKUP(B270,Liste1!$F$2:$I$9,2))","v":"Essai 4"},null,null,{"$f":"IF(B270=Liste1!$F$9,Liste1!$F$9*E270*100+MONTH($A270),0)","v":0},{"$f":"IF(B270=Liste1!$F$9,J270-I270,0)","v":0},{"$f":"IF(E270=\"\",\"\",VLOOKUP(E270,Liste1!$A$2:$B$41,2))","v":""},null,null,{"$f":"IF($B270=Liste1!$F$9,1,0)","v":0},{"$f":"IF(I270+J270=0,\"\",(E270*100+(YEAR($A270)+MONTH($A270)+MONTH($A270)))/((YEAR($A270))))","v":""},{"$f":"IF(O270+K270>0,I270,\"\")","v":""},{"$f":"IF(O270+K270>0,J270,\"\")","v":""},null,{"$f":"IF(O270+K270=0,\"\",(J270-I270))","v":""}]
["2023-02-04",4,{"$f":"IF(B271=\"\",\"\",VLOOKUP(B271,Liste1!$F$2:$I$9,2))","v":"Essai 4"},null,null,{"$f":"IF(B271=Liste1!$F$9,Liste1!$F$9*E271*100+MONTH($A271),0)","v":0},{"$f":"IF(B271=Liste1!$F$9,J271-I271,0)","v":0},{"$f":"IF(E271=\"\",\"\",VLOOKUP(E271,Liste1!$A$2:$B$41,2))","v":""},null,null,{"$f":"IF($B271=Liste1!$F$9,1,0)","v":0},{"$f":"IF(I271+J271=0,\"\",(E271*100+(YEAR($A271)+MONTH($A271)+MONTH($A271)))/((YEAR($A271))))","v":""},{"$f":"IF(O271+K271>0,I271,\"\")","v":""},{"$f":"IF(O271+K271>0,J271,\"\")","v":""},null,{"$f":"IF(O271+K271=0,\"\",(J271-I271))","v":""}]
["2023-02-04",2,{"$f":"IF(B272=\"\",\"\",VLOOKUP(B272,Liste1!$F$2:$I$9,2))","v":"Essai 2"},null,null,{"$f":"IF(B272=Liste1!$F$9,Liste1!$F$9*E272*100+MONTH($A272),0)","v":0},{"$f":"IF(B272=Liste1!$F$9,J272-I272,0)","v":0},{"$f":"IF(E272=\"\",\"\",VLOOKUP(E272,Liste1!$A$2:$B$41,2))","v":""},null,null,{"$f":"IF($B272=Liste1!$F$9,1,0)","v":0},{"$f":"IF(I272+J272=0,\"\",(E272*100+(YEAR($A272)+MONTH($A272)+MONTH($A272)))/((YEAR($A272))))","v":""},{"$f":"IF(O272+K272>0,I272,\"\")","v":""},{"$f":"IF(O272+K272>0,J272,\"\")","v":""},null,{"$f":"IF(O272+K272=0,\"\",(J272-I272))","v":""}]
["2023-02-04",2,{"$f":"IF(B273=\"\",\"\",VLOOKUP(B273,Liste1!$F$2:$I$9,2))","v":"Essai 2"},null,null,{"$f":"IF(B273=Liste1!$F$9,Liste1!$F$9*E273*100+MONTH($A273),0)","v":0},{"$f":"IF(B273=Liste1!$F$9,J273-I273,0)","v":0},{"$f":"IF(E273=\"\",\"\",VLOOKUP(E273,Liste1!$A$2:$B$41,2))","v":""},null,null,{"$f":"IF($B273=Liste1!$F$9,1,0)","v":0},{"$f":"IF(I273+J273=0,\"\",(E273*100+(YEAR($A273)+MONTH($A273)+MONTH($A273)))/((YEAR($A273))))","v":""},{"$f":"IF(O273+K273>0,I273,\"\")","v":""},{"$f":"IF(O273+K273>0,J273,\"\")","v":""},null,{"$f":"IF(O273+K273=0,\"\",(J273-I273))","v":""}]
["2023-02-05",2,{"$f":"IF(B274=\"\",\"\",VLOOKUP(B274,Liste1!$F$2:$I$9,2))","v":"Essai 2"},null,null,{"$f":"IF(B274=Liste1!$F$9,Liste1!$F$9*E274*100+MONTH($A274),0)","v":0},{"$f":"IF(B274=Liste1!$F$9,J274-I274,0)","v":0},{"$f":"IF(E274=\"\",\"\",VLOOKUP(E274,Liste1!$A$2:$B$41,2))","v":""},null,null,{"$f":"IF($B274=Liste1!$F$9,1,0)","v":0},{"$f":"IF(I274+J274=0,\"\",(E274*100+(YEAR($A274)+MONTH($A274)+MONTH($A274)))/((YEAR($A274))))","v":""},{"$f":"IF(O274+K274>0,I274,\"\")","v":""},{"$f":"IF(O274+K274>0,J274,\"\")","v":""},null,{"$f":"IF(O274+K274=0,\"\",(J274-I274))","v":""}]
["2023-02-06",5,{"$f":"IF(B275=\"\",\"\",VLOOKUP(B275,Liste1!$F$2:$I$9,2))","v":"Essai 5"},null,null,{"$f":"IF(B275=Liste1!$F$9,Liste1!$F$9*E275*100+MONTH($A275),0)","v":0},{"$f":"IF(B275=Liste1!$F$9,J275-I275,0)","v":0},{"$f":"IF(E275=\"\",\"\",VLOOKUP(E275,Liste1!$A$2:$B$41,2))","v":""},null,null,{"$f":"IF($B275=Liste1!$F$9,1,0)","v":0},{"$f":"IF(I275+J275=0,\"\",(E275*100+(YEAR($A275)+MONTH($A275)+MONTH($A275)))/((YEAR($A275))))","v":""},{"$f":"IF(O275+K275>0,I275,\"\")","v":""},{"$f":"IF(O275+K275>0,J275,\"\")","v":""},null,{"$f":"IF(O275+K275=0,\"\",(J275-I275))","v":""}]
["2023-02-06",2,{"$f":"IF(B276=\"\",\"\",VLOOKUP(B276,Liste1!$F$2:$I$9,2))","v":"Essai 2"},null,null,{"$f":"IF(B276=Liste1!$F$9,Liste1!$F$9*E276*100+MONTH($A276),0)","v":0},{"$f":"IF(B276=Liste1!$F$9,J276-I276,0)","v":0},{"$f":"IF(E276=\"\",\"\",VLOOKUP(E276,Liste1!$A$2:$B$41,2))","v":""},null,null,{"$f":"IF($B276=Liste1!$F$9,1,0)","v":0},{"$f":"IF(I276+J276=0,\"\",(E276*100+(YEAR($A276)+MONTH($A276)+MONTH($A276)))/((YEAR($A276))))","v":""},{"$f":"IF(O276+K276>0,I276,\"\")","v":""},{"$f":"IF(O276+K276>0,J276,\"\")","v":""},null,{"$f":"IF(O276+K276=0,\"\",(J276-I276))","v":""}]
["2023-02-06",4,{"$f":"IF(B277=\"\",\"\",VLOOKUP(B277,Liste1!$F$2:$I$9,2))","v":"Essai 4"},null,null,{"$f":"IF(B277=Liste1!$F$9,Liste1!$F$9*E277*100+MONTH($A277),0)","v":0},{"$f":"IF(B277=Liste1!$F$9,J277-I277,0)","v":0},{"$f":"IF(E277=\"\",\"\",VLOOKUP(E277,Liste1!$A$2:$B$41,2))","v":""},null,null,{"$f":"IF($B277=Liste1!$F$9,1,0)","v":0},{"$f":"IF(I277+J277=0,\"\",(E277*100+(YEAR($A277)+MONTH($A277)+MONTH($A277)))/((YEAR($A277))))","v":""},{"$f":"IF(O277+K277>0,I277,\"\")","v":""},{"$f":"IF(O277+K277>0,J277,\"\")","v":""},null,{"$f":"IF(O277+K277=0,\"\",(J277-I277))","v":""}]
["2023-02-06",2,{"$f":"IF(B278=\"\",\"\",VLOOKUP(B278,Liste1!$F$2:$I$9,2))","v":"Essai 2"},null,null,{"$f":"IF(B278=Liste1!$F$9,Liste1!$F$9*E278*100+MONTH($A278),0)","v":0},{"$f":"IF(B278=Liste1!$F$9,J278-I278,0)","v":0},{"$f":"IF(E278=\"\",\"\",VLOOKUP(E278,Liste1!$A$2:$B$41,2))","v":""},null,null,{"$f":"IF($B278=Liste1!$F$9,1,0)","v":0},{"$f":"IF(I278+J278=0,\"\",(E278*100+(YEAR($A278)+MONTH($A278)+MONTH($A278)))/((YEAR($A278))))","v":""},{"$f":"IF(O278+K278>0,I278,\"\")","v":""},{"$f":"IF(O278+K278>0,J278,\"\")","v":""},null,{"$f":"IF(O278+K278=0,\"\",(J278-I278))","v":""}]
["2023-02-08",2,{"$f":"IF(B279=\"\",\"\",VLOOKUP(B279,Liste1!$F$2:$I$9,2))","v":"Essai 2"},null,null,{"$f":"IF(B279=Liste1!$F$9,Liste1!$F$9*E279*100+MONTH($A279),0)","v":0},{"$f":"IF(B279=Liste1!$F$9,J279-I279,0)","v":0},{"$f":"IF(E279=\"\",\"\",VLOOKUP(E279,Liste1!$A$2:$B$41,2))","v":""},null,null,{"$f":"IF($B279=Liste1!$F$9,1,0)","v":0},{"$f":"IF(I279+J279=0,\"\",(E279*100+(YEAR($A279)+MONTH($A279)+MONTH($A279)))/((YEAR($A279))))","v":""},{"$f":"IF(O279+K279>0,I279,\"\")","v":""},{"$f":"IF(O279+K279>0,J279,\"\")","v":""},null,{"$f":"IF(O279+K279=0,\"\",(J279-I279))","v":""}]
["2023-02-10",3,{"$f":"IF(B280=\"\",\"\",VLOOKUP(B280,Liste1!$F$2:$I$9,2))","v":"Essai 3"},null,null,{"$f":"IF(B280=Liste1!$F$9,Liste1!$F$9*E280*100+MONTH($A280),0)","v":0},{"$f":"IF(B280=Liste1!$F$9,J280-I280,0)","v":0},{"$f":"IF(E280=\"\",\"\",VLOOKUP(E280,Liste1!$A$2:$B$41,2))","v":""},null,null,{"$f":"IF($B280=Liste1!$F$9,1,0)","v":0},{"$f":"IF(I280+J280=0,\"\",(E280*100+(YEAR($A280)+MONTH($A280)+MONTH($A280)))/((YEAR($A280))))","v":""},{"$f":"IF(O280+K280>0,I280,\"\")","v":""},{"$f":"IF(O280+K280>0,J280,\"\")","v":""},null,{"$f":"IF(O280+K280=0,\"\",(J280-I280))","v":""}]
["2023-02-10",3,{"$f":"IF(B281=\"\",\"\",VLOOKUP(B281,Liste1!$F$2:$I$9,2))","v":"Essai 3"},null,null,{"$f":"IF(B281=Liste1!$F$9,Liste1!$F$9*E281*100+MONTH($A281),0)","v":0},{"$f":"IF(B281=Liste1!$F$9,J281-I281,0)","v":0},{"$f":"IF(E281=\"\",\"\",VLOOKUP(E281,Liste1!$A$2:$B$41,2))","v":""},null,null,{"$f":"IF($B281=Liste1!$F$9,1,0)","v":0},{"$f":"IF(I281+J281=0,\"\",(E281*100+(YEAR($A281)+MONTH($A281)+MONTH($A281)))/((YEAR($A281))))","v":""},{"$f":"IF(O281+K281>0,I281,\"\")","v":""},{"$f":"IF(O281+K281>0,J281,\"\")","v":""},null,{"$f":"IF(O281+K281=0,\"\",(J281-I281))","v":""}]
["2023-02-10",3,{"$f":"IF(B282=\"\",\"\",VLOOKUP(B282,Liste1!$F$2:$I$9,2))","v":"Essai 3"},null,null,{"$f":"IF(B282=Liste1!$F$9,Liste1!$F$9*E282*100+MONTH($A282),0)","v":0},{"$f":"IF(B282=Liste1!$F$9,J282-I282,0)","v":0},{"$f":"IF(E282=\"\",\"\",VLOOKUP(E282,Liste1!$A$2:$B$41,2))","v":""},null,null,{"$f":"IF($B282=Liste1!$F$9,1,0)","v":0},{"$f":"IF(I282+J282=0,\"\",(E282*100+(YEAR($A282)+MONTH($A282)+MONTH($A282)))/((YEAR($A282))))","v":""},{"$f":"IF(O282+K282>0,I282,\"\")","v":""},{"$f":"IF(O282+K282>0,J282,\"\")","v":""},null,{"$f":"IF(O282+K282=0,\"\",(J282-I282))","v":""}]
["2023-02-10",3,{"$f":"IF(B283=\"\",\"\",VLOOKUP(B283,Liste1!$F$2:$I$9,2))","v":"Essai 3"},null,null,{"$f":"IF(B283=Liste1!$F$9,Liste1!$F$9*E283*100+MONTH($A283),0)","v":0},{"$f":"IF(B283=Liste1!$F$9,J283-I283,0)","v":0},{"$f":"IF(E283=\"\",\"\",VLOOKUP(E283,Liste1!$A$2:$B$41,2))","v":""},null,null,{"$f":"IF($B283=Liste1!$F$9,1,0)","v":0},{"$f":"IF(I283+J283=0,\"\",(E283*100+(YEAR($A283)+MONTH($A283)+MONTH($A283)))/((YEAR($A283))))","v":""},{"$f":"IF(O283+K283>0,I283,\"\")","v":""},{"$f":"IF(O283+K283>0,J283,\"\")","v":""},null,{"$f":"IF(O283+K283=0,\"\",(J283-I283))","v":""}]
["2023-02-10",3,{"$f":"IF(B284=\"\",\"\",VLOOKUP(B284,Liste1!$F$2:$I$9,2))","v":"Essai 3"},null,null,{"$f":"IF(B284=Liste1!$F$9,Liste1!$F$9*E284*100+MONTH($A284),0)","v":0},{"$f":"IF(B284=Liste1!$F$9,J284-I284,0)","v":0},{"$f":"IF(E284=\"\",\"\",VLOOKUP(E284,Liste1!$A$2:$B$41,2))","v":""},null,null,{"$f":"IF($B284=Liste1!$F$9,1,0)","v":0},{"$f":"IF(I284+J284=0,\"\",(E284*100+(YEAR($A284)+MONTH($A284)+MONTH($A284)))/((YEAR($A284))))","v":""},{"$f":"IF(O284+K284>0,I284,\"\")","v":""},{"$f":"IF(O284+K284>0,J284,\"\")","v":""},null,{"$f":"IF(O284+K284=0,\"\",(J284-I284))","v":""}]
["2023-02-10",3,{"$f":"IF(B285=\"\",\"\",VLOOKUP(B285,Liste1!$F$2:$I$9,2))","v":"Essai 3"},null,null,{"$f":"IF(B285=Liste1!$F$9,Liste1!$F$9*E285*100+MONTH($A285),0)","v":0},{"$f":"IF(B285=Liste1!$F$9,J285-I285,0)","v":0},{"$f":"IF(E285=\"\",\"\",VLOOKUP(E285,Liste1!$A$2:$B$41,2))","v":""},null,null,{"$f":"IF($B285=Liste1!$F$9,1,0)","v":0},{"$f":"IF(I285+J285=0,\"\",(E285*100+(YEAR($A285)+MONTH($A285)+MONTH($A285)))/((YEAR($A285))))","v":""},{"$f":"IF(O285+K285>0,I285,\"\")","v":""},{"$f":"IF(O285+K285>0,J285,\"\")","v":""},null,{"$f":"IF(O285+K285=0,\"\",(J285-I285))","v":""}]
["2023-02-10",3,{"$f":"IF(B286=\"\",\"\",VLOOKUP(B286,Liste1!$F$2:$I$9,2))","v":"Essai 3"},null,null,{"$f":"IF(B286=Liste1!$F$9,Liste1!$F$9*E286*100+MONTH($A286),0)","v":0},{"$f":"IF(B286=Liste1!$F$9,J286-I286,0)","v":0},{"$f":"IF(E286=\"\",\"\",VLOOKUP(E286,Liste1!$A$2:$B$41,2))","v":""},null,null,{"$f":"IF($B286=Liste1!$F$9,1,0)","v":0},{"$f":"IF(I286+J286=0,\"\",(E286*100+(YEAR($A286)+MONTH($A286)+MONTH($A286)))/((YEAR($A286))))","v":""},{"$f":"IF(O286+K286>0,I286,\"\")","v":""},{"$f":"IF(O286+K286>0,J286,\"\")","v":""},null,{"$f":"IF(O286+K286=0,\"\",(J286-I286))","v":""}]
["2023-02-10",2,{"$f":"IF(B287=\"\",\"\",VLOOKUP(B287,Liste1!$F$2:$I$9,2))","v":"Essai 2"},null,null,{"$f":"IF(B287=Liste1!$F$9,Liste1!$F$9*E287*100+MONTH($A287),0)","v":0},{"$f":"IF(B287=Liste1!$F$9,J287-I287,0)","v":0},{"$f":"IF(E287=\"\",\"\",VLOOKUP(E287,Liste1!$A$2:$B$41,2))","v":""},null,null,{"$f":"IF($B287=Liste1!$F$9,1,0)","v":0},{"$f":"IF(I287+J287=0,\"\",(E287*100+(YEAR($A287)+MONTH($A287)+MONTH($A287)))/((YEAR($A287))))","v":""},{"$f":"IF(O287+K287>0,I287,\"\")","v":""},{"$f":"IF(O287+K287>0,J287,\"\")","v":""},null,{"$f":"IF(O287+K287=0,\"\",(J287-I287))","v":""}]
["2023-02-13",4,{"$f":"IF(B288=\"\",\"\",VLOOKUP(B288,Liste1!$F$2:$I$9,2))","v":"Essai 4"},null,null,{"$f":"IF(B288=Liste1!$F$9,Liste1!$F$9*E288*100+MONTH($A288),0)","v":0},{"$f":"IF(B288=Liste1!$F$9,J288-I288,0)","v":0},{"$f":"IF(E288=\"\",\"\",VLOOKUP(E288,Liste1!$A$2:$B$41,2))","v":""},null,null,{"$f":"IF($B288=Liste1!$F$9,1,0)","v":0},{"$f":"IF(I288+J288=0,\"\",(E288*100+(YEAR($A288)+MONTH($A288)+MONTH($A288)))/((YEAR($A288))))","v":""},{"$f":"IF(O288+K288>0,I288,\"\")","v":""},{"$f":"IF(O288+K288>0,J288,\"\")","v":""},null,{"$f":"IF(O288+K288=0,\"\",(J288-I288))","v":""}]
["2023-02-13",4,{"$f":"IF(B289=\"\",\"\",VLOOKUP(B289,Liste1!$F$2:$I$9,2))","v":"Essai 4"},null,null,{"$f":"IF(B289=Liste1!$F$9,Liste1!$F$9*E289*100+MONTH($A289),0)","v":0},{"$f":"IF(B289=Liste1!$F$9,J289-I289,0)","v":0},{"$f":"IF(E289=\"\",\"\",VLOOKUP(E289,Liste1!$A$2:$B$41,2))","v":""},null,null,{"$f":"IF($B289=Liste1!$F$9,1,0)","v":0},{"$f":"IF(I289+J289=0,\"\",(E289*100+(YEAR($A289)+MONTH($A289)+MONTH($A289)))/((YEAR($A289))))","v":""},{"$f":"IF(O289+K289>0,I289,\"\")","v":""},{"$f":"IF(O289+K289>0,J289,\"\")","v":""},null,{"$f":"IF(O289+K289=0,\"\",(J289-I289))","v":""}]
["2023-02-13",2,{"$f":"IF(B290=\"\",\"\",VLOOKUP(B290,Liste1!$F$2:$I$9,2))","v":"Essai 2"},null,null,{"$f":"IF(B290=Liste1!$F$9,Liste1!$F$9*E290*100+MONTH($A290),0)","v":0},{"$f":"IF(B290=Liste1!$F$9,J290-I290,0)","v":0},{"$f":"IF(E290=\"\",\"\",VLOOKUP(E290,Liste1!$A$2:$B$41,2))","v":""},null,null,{"$f":"IF($B290=Liste1!$F$9,1,0)","v":0},{"$f":"IF(I290+J290=0,\"\",(E290*100+(YEAR($A290)+MONTH($A290)+MONTH($A290)))/((YEAR($A290))))","v":""},{"$f":"IF(O290+K290>0,I290,\"\")","v":""},{"$f":"IF(O290+K290>0,J290,\"\")","v":""},null,{"$f":"IF(O290+K290=0,\"\",(J290-I290))","v":""}]
["2023-02-14",5,{"$f":"IF(B291=\"\",\"\",VLOOKUP(B291,Liste1!$F$2:$I$9,2))","v":"Essai 5"},null,null,{"$f":"IF(B291=Liste1!$F$9,Liste1!$F$9*E291*100+MONTH($A291),0)","v":0},{"$f":"IF(B291=Liste1!$F$9,J291-I291,0)","v":0},{"$f":"IF(E291=\"\",\"\",VLOOKUP(E291,Liste1!$A$2:$B$41,2))","v":""},null,null,{"$f":"IF($B291=Liste1!$F$9,1,0)","v":0},{"$f":"IF(I291+J291=0,\"\",(E291*100+(YEAR($A291)+MONTH($A291)+MONTH($A291)))/((YEAR($A291))))","v":""},{"$f":"IF(O291+K291>0,I291,\"\")","v":""},{"$f":"IF(O291+K291>0,J291,\"\")","v":""},null,{"$f":"IF(O291+K291=0,\"\",(J291-I291))","v":""}]
["2023-02-14",2,{"$f":"IF(B292=\"\",\"\",VLOOKUP(B292,Liste1!$F$2:$I$9,2))","v":"Essai 2"},null,null,{"$f":"IF(B292=Liste1!$F$9,Liste1!$F$9*E292*100+MONTH($A292),0)","v":0},{"$f":"IF(B292=Liste1!$F$9,J292-I292,0)","v":0},{"$f":"IF(E292=\"\",\"\",VLOOKUP(E292,Liste1!$A$2:$B$41,2))","v":""},null,null,{"$f":"IF($B292=Liste1!$F$9,1,0)","v":0},{"$f":"IF(I292+J292=0,\"\",(E292*100+(YEAR($A292)+MONTH($A292)+MONTH($A292)))/((YEAR($A292))))","v":""},{"$f":"IF(O292+K292>0,I292,\"\")","v":""},{"$f":"IF(O292+K292>0,J292,\"\")","v":""},null,{"$f":"IF(O292+K292=0,\"\",(J292-I292))","v":""}]
["2023-02-15",4,{"$f":"IF(B293=\"\",\"\",VLOOKUP(B293,Liste1!$F$2:$I$9,2))","v":"Essai 4"},null,null,{"$f":"IF(B293=Liste1!$F$9,Liste1!$F$9*E293*100+MONTH($A293),0)","v":0},{"$f":"IF(B293=Liste1!$F$9,J293-I293,0)","v":0},{"$f":"IF(E293=\"\",\"\",VLOOKUP(E293,Liste1!$A$2:$B$41,2))","v":""},null,null,{"$f":"IF($B293=Liste1!$F$9,1,0)","v":0},{"$f":"IF(I293+J293=0,\"\",(E293*100+(YEAR($A293)+MONTH($A293)+MONTH($A293)))/((YEAR($A293))))","v":""},{"$f":"IF(O293+K293>0,I293,\"\")","v":""},{"$f":"IF(O293+K293>0,J293,\"\")","v":""},null,{"$f":"IF(O293+K293=0,\"\",(J293-I293))","v":""}]
["2023-02-20",3,{"$f":"IF(B294=\"\",\"\",VLOOKUP(B294,Liste1!$F$2:$I$9,2))","v":"Essai 3"},null,null,{"$f":"IF(B294=Liste1!$F$9,Liste1!$F$9*E294*100+MONTH($A294),0)","v":0},{"$f":"IF(B294=Liste1!$F$9,J294-I294,0)","v":0},{"$f":"IF(E294=\"\",\"\",VLOOKUP(E294,Liste1!$A$2:$B$41,2))","v":""},null,null,{"$f":"IF($B294=Liste1!$F$9,1,0)","v":0},{"$f":"IF(I294+J294=0,\"\",(E294*100+(YEAR($A294)+MONTH($A294)+MONTH($A294)))/((YEAR($A294))))","v":""},{"$f":"IF(O294+K294>0,I294,\"\")","v":""},{"$f":"IF(O294+K294>0,J294,\"\")","v":""},null,{"$f":"IF(O294+K294=0,\"\",(J294-I294))","v":""}]
["2023-02-21",3,{"$f":"IF(B295=\"\",\"\",VLOOKUP(B295,Liste1!$F$2:$I$9,2))","v":"Essai 3"},null,null,{"$f":"IF(B295=Liste1!$F$9,Liste1!$F$9*E295*100+MONTH($A295),0)","v":0},{"$f":"IF(B295=Liste1!$F$9,J295-I295,0)","v":0},{"$f":"IF(E295=\"\",\"\",VLOOKUP(E295,Liste1!$A$2:$B$41,2))","v":""},null,null,{"$f":"IF($B295=Liste1!$F$9,1,0)","v":0},{"$f":"IF(I295+J295=0,\"\",(E295*100+(YEAR($A295)+MONTH($A295)+MONTH($A295)))/((YEAR($A295))))","v":""},{"$f":"IF(O295+K295>0,I295,\"\")","v":""},{"$f":"IF(O295+K295>0,J295,\"\")","v":""},null,{"$f":"IF(O295+K295=0,\"\",(J295-I295))","v":""}]
["2023-02-24",2,{"$f":"IF(B296=\"\",\"\",VLOOKUP(B296,Liste1!$F$2:$I$9,2))","v":"Essai 2"},null,null,{"$f":"IF(B296=Liste1!$F$9,Liste1!$F$9*E296*100+MONTH($A296),0)","v":0},{"$f":"IF(B296=Liste1!$F$9,J296-I296,0)","v":0},{"$f":"IF(E296=\"\",\"\",VLOOKUP(E296,Liste1!$A$2:$B$41,2))","v":""},null,null,{"$f":"IF($B296=Liste1!$F$9,1,0)","v":0},{"$f":"IF(I296+J296=0,\"\",(E296*100+(YEAR($A296)+MONTH($A296)+MONTH($A296)))/((YEAR($A296))))","v":""},{"$f":"IF(O296+K296>0,I296,\"\")","v":""},{"$f":"IF(O296+K296>0,J296,\"\")","v":""},null,{"$f":"IF(O296+K296=0,\"\",(J296-I296))","v":""}]
["2023-02-25",3,{"$f":"IF(B297=\"\",\"\",VLOOKUP(B297,Liste1!$F$2:$I$9,2))","v":"Essai 3"},null,null,{"$f":"IF(B297=Liste1!$F$9,Liste1!$F$9*E297*100+MONTH($A297),0)","v":0},{"$f":"IF(B297=Liste1!$F$9,J297-I297,0)","v":0},{"$f":"IF(E297=\"\",\"\",VLOOKUP(E297,Liste1!$A$2:$B$41,2))","v":""},null,null,{"$f":"IF($B297=Liste1!$F$9,1,0)","v":0},{"$f":"IF(I297+J297=0,\"\",(E297*100+(YEAR($A297)+MONTH($A297)+MONTH($A297)))/((YEAR($A297))))","v":""},{"$f":"IF(O297+K297>0,I297,\"\")","v":""},{"$f":"IF(O297+K297>0,J297,\"\")","v":""},null,{"$f":"IF(O297+K297=0,\"\",(J297-I297))","v":""}]
["2023-03-01",5,{"$f":"IF(B298=\"\",\"\",VLOOKUP(B298,Liste1!$F$2:$I$9,2))","v":"Essai 5"},null,null,{"$f":"IF(B298=Liste1!$F$9,Liste1!$F$9*E298*100+MONTH($A298),0)","v":0},{"$f":"IF(B298=Liste1!$F$9,J298-I298,0)","v":0},{"$f":"IF(E298=\"\",\"\",VLOOKUP(E298,Liste1!$A$2:$B$41,2))","v":""},null,null,{"$f":"IF($B298=Liste1!$F$9,1,0)","v":0},{"$f":"IF(I298+J298=0,\"\",(E298*100+(YEAR($A298)+MONTH($A298)+MONTH($A298)))/((YEAR($A298))))","v":""},{"$f":"IF(O298+K298>0,I298,\"\")","v":""},{"$f":"IF(O298+K298>0,J298,\"\")","v":""},null,{"$f":"IF(O298+K298=0,\"\",(J298-I298))","v":""}]
["2023-03-01",3,{"$f":"IF(B299=\"\",\"\",VLOOKUP(B299,Liste1!$F$2:$I$9,2))","v":"Essai 3"},null,null,{"$f":"IF(B299=Liste1!$F$9,Liste1!$F$9*E299*100+MONTH($A299),0)","v":0},{"$f":"IF(B299=Liste1!$F$9,J299-I299,0)","v":0},{"$f":"IF(E299=\"\",\"\",VLOOKUP(E299,Liste1!$A$2:$B$41,2))","v":""},null,null,{"$f":"IF($B299=Liste1!$F$9,1,0)","v":0},{"$f":"IF(I299+J299=0,\"\",(E299*100+(YEAR($A299)+MONTH($A299)+MONTH($A299)))/((YEAR($A299))))","v":""},{"$f":"IF(O299+K299>0,I299,\"\")","v":""},{"$f":"IF(O299+K299>0,J299,\"\")","v":""},null,{"$f":"IF(O299+K299=0,\"\",(J299-I299))","v":""}]
["2023-03-01",5,{"$f":"IF(B300=\"\",\"\",VLOOKUP(B300,Liste1!$F$2:$I$9,2))","v":"Essai 5"},null,null,{"$f":"IF(B300=Liste1!$F$9,Liste1!$F$9*E300*100+MONTH($A300),0)","v":0},{"$f":"IF(B300=Liste1!$F$9,J300-I300,0)","v":0},{"$f":"IF(E300=\"\",\"\",VLOOKUP(E300,Liste1!$A$2:$B$41,2))","v":""},null,null,{"$f":"IF($B300=Liste1!$F$9,1,0)","v":0},{"$f":"IF(I300+J300=0,\"\",(E300*100+(YEAR($A300)+MONTH($A300)+MONTH($A300)))/((YEAR($A300))))","v":""},{"$f":"IF(O300+K300>0,I300,\"\")","v":""},{"$f":"IF(O300+K300>0,J300,\"\")","v":""},null,{"$f":"IF(O300+K300=0,\"\",(J300-I300))","v":""}]
["2023-03-01",4,{"$f":"IF(B301=\"\",\"\",VLOOKUP(B301,Liste1!$F$2:$I$9,2))","v":"Essai 4"},null,null,{"$f":"IF(B301=Liste1!$F$9,Liste1!$F$9*E301*100+MONTH($A301),0)","v":0},{"$f":"IF(B301=Liste1!$F$9,J301-I301,0)","v":0},{"$f":"IF(E301=\"\",\"\",VLOOKUP(E301,Liste1!$A$2:$B$41,2))","v":""},null,null,{"$f":"IF($B301=Liste1!$F$9,1,0)","v":0},{"$f":"IF(I301+J301=0,\"\",(E301*100+(YEAR($A301)+MONTH($A301)+MONTH($A301)))/((YEAR($A301))))","v":""},{"$f":"IF(O301+K301>0,I301,\"\")","v":""},{"$f":"IF(O301+K301>0,J301,\"\")","v":""},null,{"$f":"IF(O301+K301=0,\"\",(J301-I301))","v":""}]
["2023-03-01",4,{"$f":"IF(B302=\"\",\"\",VLOOKUP(B302,Liste1!$F$2:$I$9,2))","v":"Essai 4"},null,null,{"$f":"IF(B302=Liste1!$F$9,Liste1!$F$9*E302*100+MONTH($A302),0)","v":0},{"$f":"IF(B302=Liste1!$F$9,J302-I302,0)","v":0},{"$f":"IF(E302=\"\",\"\",VLOOKUP(E302,Liste1!$A$2:$B$41,2))","v":""},null,null,{"$f":"IF($B302=Liste1!$F$9,1,0)","v":0},{"$f":"IF(I302+J302=0,\"\",(E302*100+(YEAR($A302)+MONTH($A302)+MONTH($A302)))/((YEAR($A302))))","v":""},{"$f":"IF(O302+K302>0,I302,\"\")","v":""},{"$f":"IF(O302+K302>0,J302,\"\")","v":""},null,{"$f":"IF(O302+K302=0,\"\",(J302-I302))","v":""}]
["2023-03-04",2,{"$f":"IF(B303=\"\",\"\",VLOOKUP(B303,Liste1!$F$2:$I$9,2))","v":"Essai 2"},null,null,{"$f":"IF(B303=Liste1!$F$9,Liste1!$F$9*E303*100+MONTH($A303),0)","v":0},{"$f":"IF(B303=Liste1!$F$9,J303-I303,0)","v":0},{"$f":"IF(E303=\"\",\"\",VLOOKUP(E303,Liste1!$A$2:$B$41,2))","v":""},null,null,{"$f":"IF($B303=Liste1!$F$9,1,0)","v":0},{"$f":"IF(I303+J303=0,\"\",(E303*100+(YEAR($A303)+MONTH($A303)+MONTH($A303)))/((YEAR($A303))))","v":""},{"$f":"IF(O303+K303>0,I303,\"\")","v":""},{"$f":"IF(O303+K303>0,J303,\"\")","v":""},null,{"$f":"IF(O303+K303=0,\"\",(J303-I303))","v":""}]
["2023-03-04",2,{"$f":"IF(B304=\"\",\"\",VLOOKUP(B304,Liste1!$F$2:$I$9,2))","v":"Essai 2"},null,null,{"$f":"IF(B304=Liste1!$F$9,Liste1!$F$9*E304*100+MONTH($A304),0)","v":0},{"$f":"IF(B304=Liste1!$F$9,J304-I304,0)","v":0},{"$f":"IF(E304=\"\",\"\",VLOOKUP(E304,Liste1!$A$2:$B$41,2))","v":""},null,null,{"$f":"IF($B304=Liste1!$F$9,1,0)","v":0},{"$f":"IF(I304+J304=0,\"\",(E304*100+(YEAR($A304)+MONTH($A304)+MONTH($A304)))/((YEAR($A304))))","v":""},{"$f":"IF(O304+K304>0,I304,\"\")","v":""},{"$f":"IF(O304+K304>0,J304,\"\")","v":""},null,{"$f":"IF(O304+K304=0,\"\",(J304-I304))","v":""}]
["2023-03-05",4,{"$f":"IF(B305=\"\",\"\",VLOOKUP(B305,Liste1!$F$2:$I$9,2))","v":"Essai 4"},null,null,{"$f":"IF(B305=Liste1!$F$9,Liste1!$F$9*E305*100+MONTH($A305),0)","v":0},{"$f":"IF(B305=Liste1!$F$9,J305-I305,0)","v":0},{"$f":"IF(E305=\"\",\"\",VLOOKUP(E305,Liste1!$A$2:$B$41,2))","v":""},null,null,{"$f":"IF($B305=Liste1!$F$9,1,0)","v":0},{"$f":"IF(I305+J305=0,\"\",(E305*100+(YEAR($A305)+MONTH($A305)+MONTH($A305)))/((YEAR($A305))))","v":""},{"$f":"IF(O305+K305>0,I305,\"\")","v":""},{"$f":"IF(O305+K305>0,J305,\"\")","v":""},null,{"$f":"IF(O305+K305=0,\"\",(J305-I305))","v":""}]
["2023-03-05",4,{"$f":"IF(B306=\"\",\"\",VLOOKUP(B306,Liste1!$F$2:$I$9,2))","v":"Essai 4"},null,null,{"$f":"IF(B306=Liste1!$F$9,Liste1!$F$9*E306*100+MONTH($A306),0)","v":0},{"$f":"IF(B306=Liste1!$F$9,J306-I306,0)","v":0},{"$f":"IF(E306=\"\",\"\",VLOOKUP(E306,Liste1!$A$2:$B$41,2))","v":""},null,null,{"$f":"IF($B306=Liste1!$F$9,1,0)","v":0},{"$f":"IF(I306+J306=0,\"\",(E306*100+(YEAR($A306)+MONTH($A306)+MONTH($A306)))/((YEAR($A306))))","v":""},{"$f":"IF(O306+K306>0,I306,\"\")","v":""},{"$f":"IF(O306+K306>0,J306,\"\")","v":""},null,{"$f":"IF(O306+K306=0,\"\",(J306-I306))","v":""}]
["2023-03-06",5,{"$f":"IF(B307=\"\",\"\",VLOOKUP(B307,Liste1!$F$2:$I$9,2))","v":"Essai 5"},null,null,{"$f":"IF(B307=Liste1!$F$9,Liste1!$F$9*E307*100+MONTH($A307),0)","v":0},{"$f":"IF(B307=Liste1!$F$9,J307-I307,0)","v":0},{"$f":"IF(E307=\"\",\"\",VLOOKUP(E307,Liste1!$A$2:$B$41,2))","v":""},null,null,{"$f":"IF($B307=Liste1!$F$9,1,0)","v":0},{"$f":"IF(I307+J307=0,\"\",(E307*100+(YEAR($A307)+MONTH($A307)+MONTH($A307)))/((YEAR($A307))))","v":""},{"$f":"IF(O307+K307>0,I307,\"\")","v":""},{"$f":"IF(O307+K307>0,J307,\"\")","v":""},null,{"$f":"IF(O307+K307=0,\"\",(J307-I307))","v":""}]
["2023-03-07",5,{"$f":"IF(B308=\"\",\"\",VLOOKUP(B308,Liste1!$F$2:$I$9,2))","v":"Essai 5"},null,null,{"$f":"IF(B308=Liste1!$F$9,Liste1!$F$9*E308*100+MONTH($A308),0)","v":0},{"$f":"IF(B308=Liste1!$F$9,J308-I308,0)","v":0},{"$f":"IF(E308=\"\",\"\",VLOOKUP(E308,Liste1!$A$2:$B$41,2))","v":""},null,null,{"$f":"IF($B308=Liste1!$F$9,1,0)","v":0},{"$f":"IF(I308+J308=0,\"\",(E308*100+(YEAR($A308)+MONTH($A308)+MONTH($A308)))/((YEAR($A308))))","v":""},{"$f":"IF(O308+K308>0,I308,\"\")","v":""},{"$f":"IF(O308+K308>0,J308,\"\")","v":""},null,{"$f":"IF(O308+K308=0,\"\",(J308-I308))","v":""}]
["2023-03-09",2,{"$f":"IF(B309=\"\",\"\",VLOOKUP(B309,Liste1!$F$2:$I$9,2))","v":"Essai 2"},null,null,{"$f":"IF(B309=Liste1!$F$9,Liste1!$F$9*E309*100+MONTH($A309),0)","v":0},{"$f":"IF(B309=Liste1!$F$9,J309-I309,0)","v":0},{"$f":"IF(E309=\"\",\"\",VLOOKUP(E309,Liste1!$A$2:$B$41,2))","v":""},null,null,{"$f":"IF($B309=Liste1!$F$9,1,0)","v":0},{"$f":"IF(I309+J309=0,\"\",(E309*100+(YEAR($A309)+MONTH($A309)+MONTH($A309)))/((YEAR($A309))))","v":""},{"$f":"IF(O309+K309>0,I309,\"\")","v":""},{"$f":"IF(O309+K309>0,J309,\"\")","v":""},null,{"$f":"IF(O309+K309=0,\"\",(J309-I309))","v":""}]
["2023-03-10",3,{"$f":"IF(B310=\"\",\"\",VLOOKUP(B310,Liste1!$F$2:$I$9,2))","v":"Essai 3"},null,null,{"$f":"IF(B310=Liste1!$F$9,Liste1!$F$9*E310*100+MONTH($A310),0)","v":0},{"$f":"IF(B310=Liste1!$F$9,J310-I310,0)","v":0},{"$f":"IF(E310=\"\",\"\",VLOOKUP(E310,Liste1!$A$2:$B$41,2))","v":""},null,null,{"$f":"IF($B310=Liste1!$F$9,1,0)","v":0},{"$f":"IF(I310+J310=0,\"\",(E310*100+(YEAR($A310)+MONTH($A310)+MONTH($A310)))/((YEAR($A310))))","v":""},{"$f":"IF(O310+K310>0,I310,\"\")","v":""},{"$f":"IF(O310+K310>0,J310,\"\")","v":""},null,{"$f":"IF(O310+K310=0,\"\",(J310-I310))","v":""}]
["2023-03-10",3,{"$f":"IF(B311=\"\",\"\",VLOOKUP(B311,Liste1!$F$2:$I$9,2))","v":"Essai 3"},null,null,{"$f":"IF(B311=Liste1!$F$9,Liste1!$F$9*E311*100+MONTH($A311),0)","v":0},{"$f":"IF(B311=Liste1!$F$9,J311-I311,0)","v":0},{"$f":"IF(E311=\"\",\"\",VLOOKUP(E311,Liste1!$A$2:$B$41,2))","v":""},null,null,{"$f":"IF($B311=Liste1!$F$9,1,0)","v":0},{"$f":"IF(I311+J311=0,\"\",(E311*100+(YEAR($A311)+MONTH($A311)+MONTH($A311)))/((YEAR($A311))))","v":""},{"$f":"IF(O311+K311>0,I311,\"\")","v":""},{"$f":"IF(O311+K311>0,J311,\"\")","v":""},null,{"$f":"IF(O311+K311=0,\"\",(J311-I311))","v":""}]
["2023-03-10",2,{"$f":"IF(B312=\"\",\"\",VLOOKUP(B312,Liste1!$F$2:$I$9,2))","v":"Essai 2"},null,null,{"$f":"IF(B312=Liste1!$F$9,Liste1!$F$9*E312*100+MONTH($A312),0)","v":0},{"$f":"IF(B312=Liste1!$F$9,J312-I312,0)","v":0},{"$f":"IF(E312=\"\",\"\",VLOOKUP(E312,Liste1!$A$2:$B$41,2))","v":""},null,null,{"$f":"IF($B312=Liste1!$F$9,1,0)","v":0},{"$f":"IF(I312+J312=0,\"\",(E312*100+(YEAR($A312)+MONTH($A312)+MONTH($A312)))/((YEAR($A312))))","v":""},{"$f":"IF(O312+K312>0,I312,\"\")","v":""},{"$f":"IF(O312+K312>0,J312,\"\")","v":""},null,{"$f":"IF(O312+K312=0,\"\",(J312-I312))","v":""}]
["2023-03-10",2,{"$f":"IF(B313=\"\",\"\",VLOOKUP(B313,Liste1!$F$2:$I$9,2))","v":"Essai 2"},null,null,{"$f":"IF(B313=Liste1!$F$9,Liste1!$F$9*E313*100+MONTH($A313),0)","v":0},{"$f":"IF(B313=Liste1!$F$9,J313-I313,0)","v":0},{"$f":"IF(E313=\"\",\"\",VLOOKUP(E313,Liste1!$A$2:$B$41,2))","v":""},null,null,{"$f":"IF($B313=Liste1!$F$9,1,0)","v":0},{"$f":"IF(I313+J313=0,\"\",(E313*100+(YEAR($A313)+MONTH($A313)+MONTH($A313)))/((YEAR($A313))))","v":""},{"$f":"IF(O313+K313>0,I313,\"\")","v":""},{"$f":"IF(O313+K313>0,J313,\"\")","v":""},null,{"$f":"IF(O313+K313=0,\"\",(J313-I313))","v":""}]
["2023-03-10",3,{"$f":"IF(B314=\"\",\"\",VLOOKUP(B314,Liste1!$F$2:$I$9,2))","v":"Essai 3"},null,null,{"$f":"IF(B314=Liste1!$F$9,Liste1!$F$9*E314*100+MONTH($A314),0)","v":0},{"$f":"IF(B314=Liste1!$F$9,J314-I314,0)","v":0},{"$f":"IF(E314=\"\",\"\",VLOOKUP(E314,Liste1!$A$2:$B$41,2))","v":""},null,null,{"$f":"IF($B314=Liste1!$F$9,1,0)","v":0},{"$f":"IF(I314+J314=0,\"\",(E314*100+(YEAR($A314)+MONTH($A314)+MONTH($A314)))/((YEAR($A314))))","v":""},{"$f":"IF(O314+K314>0,I314,\"\")","v":""},{"$f":"IF(O314+K314>0,J314,\"\")","v":""},null,{"$f":"IF(O314+K314=0,\"\",(J314-I314))","v":""}]
["2023-03-10",3,{"$f":"IF(B315=\"\",\"\",VLOOKUP(B315,Liste1!$F$2:$I$9,2))","v":"Essai 3"},null,null,{"$f":"IF(B315=Liste1!$F$9,Liste1!$F$9*E315*100+MONTH($A315),0)","v":0},{"$f":"IF(B315=Liste1!$F$9,J315-I315,0)","v":0},{"$f":"IF(E315=\"\",\"\",VLOOKUP(E315,Liste1!$A$2:$B$41,2))","v":""},null,null,{"$f":"IF($B315=Liste1!$F$9,1,0)","v":0},{"$f":"IF(I315+J315=0,\"\",(E315*100+(YEAR($A315)+MONTH($A315)+MONTH($A315)))/((YEAR($A315))))","v":""},{"$f":"IF(O315+K315>0,I315,\"\")","v":""},{"$f":"IF(O315+K315>0,J315,\"\")","v":""},null,{"$f":"IF(O315+K315=0,\"\",(J315-I315))","v":""}]
["2023-03-10",3,{"$f":"IF(B316=\"\",\"\",VLOOKUP(B316,Liste1!$F$2:$I$9,2))","v":"Essai 3"},null,null,{"$f":"IF(B316=Liste1!$F$9,Liste1!$F$9*E316*100+MONTH($A316),0)","v":0},{"$f":"IF(B316=Liste1!$F$9,J316-I316,0)","v":0},{"$f":"IF(E316=\"\",\"\",VLOOKUP(E316,Liste1!$A$2:$B$41,2))","v":""},null,null,{"$f":"IF($B316=Liste1!$F$9,1,0)","v":0},{"$f":"IF(I316+J316=0,\"\",(E316*100+(YEAR($A316)+MONTH($A316)+MONTH($A316)))/((YEAR($A316))))","v":""},{"$f":"IF(O316+K316>0,I316,\"\")","v":""},{"$f":"IF(O316+K316>0,J316,\"\")","v":""},null,{"$f":"IF(O316+K316=0,\"\",(J316-I316))","v":""}]
["2023-03-10",3,{"$f":"IF(B317=\"\",\"\",VLOOKUP(B317,Liste1!$F$2:$I$9,2))","v":"Essai 3"},null,null,{"$f":"IF(B317=Liste1!$F$9,Liste1!$F$9*E317*100+MONTH($A317),0)","v":0},{"$f":"IF(B317=Liste1!$F$9,J317-I317,0)","v":0},{"$f":"IF(E317=\"\",\"\",VLOOKUP(E317,Liste1!$A$2:$B$41,2))","v":""},null,null,{"$f":"IF($B317=Liste1!$F$9,1,0)","v":0},{"$f":"IF(I317+J317=0,\"\",(E317*100+(YEAR($A317)+MONTH($A317)+MONTH($A317)))/((YEAR($A317))))","v":""},{"$f":"IF(O317+K317>0,I317,\"\")","v":""},{"$f":"IF(O317+K317>0,J317,\"\")","v":""},null,{"$f":"IF(O317+K317=0,\"\",(J317-I317))","v":""}]
["2023-03-10",3,{"$f":"IF(B318=\"\",\"\",VLOOKUP(B318,Liste1!$F$2:$I$9,2))","v":"Essai 3"},null,null,{"$f":"IF(B318=Liste1!$F$9,Liste1!$F$9*E318*100+MONTH($A318),0)","v":0},{"$f":"IF(B318=Liste1!$F$9,J318-I318,0)","v":0},{"$f":"IF(E318=\"\",\"\",VLOOKUP(E318,Liste1!$A$2:$B$41,2))","v":""},null,null,{"$f":"IF($B318=Liste1!$F$9,1,0)","v":0},{"$f":"IF(I318+J318=0,\"\",(E318*100+(YEAR($A318)+MONTH($A318)+MONTH($A318)))/((YEAR($A318))))","v":""},{"$f":"IF(O318+K318>0,I318,\"\")","v":""},{"$f":"IF(O318+K318>0,J318,\"\")","v":""},null,{"$f":"IF(O318+K318=0,\"\",(J318-I318))","v":""}]
["2023-03-10",3,{"$f":"IF(B319=\"\",\"\",VLOOKUP(B319,Liste1!$F$2:$I$9,2))","v":"Essai 3"},null,null,{"$f":"IF(B319=Liste1!$F$9,Liste1!$F$9*E319*100+MONTH($A319),0)","v":0},{"$f":"IF(B319=Liste1!$F$9,J319-I319,0)","v":0},{"$f":"IF(E319=\"\",\"\",VLOOKUP(E319,Liste1!$A$2:$B$41,2))","v":""},null,null,{"$f":"IF($B319=Liste1!$F$9,1,0)","v":0},{"$f":"IF(I319+J319=0,\"\",(E319*100+(YEAR($A319)+MONTH($A319)+MONTH($A319)))/((YEAR($A319))))","v":""},{"$f":"IF(O319+K319>0,I319,\"\")","v":""},{"$f":"IF(O319+K319>0,J319,\"\")","v":""},null,{"$f":"IF(O319+K319=0,\"\",(J319-I319))","v":""}]
["2023-03-10",3,{"$f":"IF(B320=\"\",\"\",VLOOKUP(B320,Liste1!$F$2:$I$9,2))","v":"Essai 3"},null,null,{"$f":"IF(B320=Liste1!$F$9,Liste1!$F$9*E320*100+MONTH($A320),0)","v":0},{"$f":"IF(B320=Liste1!$F$9,J320-I320,0)","v":0},{"$f":"IF(E320=\"\",\"\",VLOOKUP(E320,Liste1!$A$2:$B$41,2))","v":""},null,null,{"$f":"IF($B320=Liste1!$F$9,1,0)","v":0},{"$f":"IF(I320+J320=0,\"\",(E320*100+(YEAR($A320)+MONTH($A320)+MONTH($A320)))/((YEAR($A320))))","v":""},{"$f":"IF(O320+K320>0,I320,\"\")","v":""},{"$f":"IF(O320+K320>0,J320,\"\")","v":""},null,{"$f":"IF(O320+K320=0,\"\",(J320-I320))","v":""}]
["2023-03-10",4,{"$f":"IF(B321=\"\",\"\",VLOOKUP(B321,Liste1!$F$2:$I$9,2))","v":"Essai 4"},null,null,{"$f":"IF(B321=Liste1!$F$9,Liste1!$F$9*E321*100+MONTH($A321),0)","v":0},{"$f":"IF(B321=Liste1!$F$9,J321-I321,0)","v":0},{"$f":"IF(E321=\"\",\"\",VLOOKUP(E321,Liste1!$A$2:$B$41,2))","v":""},null,null,{"$f":"IF($B321=Liste1!$F$9,1,0)","v":0},{"$f":"IF(I321+J321=0,\"\",(E321*100+(YEAR($A321)+MONTH($A321)+MONTH($A321)))/((YEAR($A321))))","v":""},{"$f":"IF(O321+K321>0,I321,\"\")","v":""},{"$f":"IF(O321+K321>0,J321,\"\")","v":""},null,{"$f":"IF(O321+K321=0,\"\",(J321-I321))","v":""}]
["2023-03-11",4,{"$f":"IF(B322=\"\",\"\",VLOOKUP(B322,Liste1!$F$2:$I$9,2))","v":"Essai 4"},null,null,{"$f":"IF(B322=Liste1!$F$9,Liste1!$F$9*E322*100+MONTH($A322),0)","v":0},{"$f":"IF(B322=Liste1!$F$9,J322-I322,0)","v":0},{"$f":"IF(E322=\"\",\"\",VLOOKUP(E322,Liste1!$A$2:$B$41,2))","v":""},null,null,{"$f":"IF($B322=Liste1!$F$9,1,0)","v":0},{"$f":"IF(I322+J322=0,\"\",(E322*100+(YEAR($A322)+MONTH($A322)+MONTH($A322)))/((YEAR($A322))))","v":""},{"$f":"IF(O322+K322>0,I322,\"\")","v":""},{"$f":"IF(O322+K322>0,J322,\"\")","v":""},null,{"$f":"IF(O322+K322=0,\"\",(J322-I322))","v":""}]
["2023-03-11",4,{"$f":"IF(B323=\"\",\"\",VLOOKUP(B323,Liste1!$F$2:$I$9,2))","v":"Essai 4"},null,null,{"$f":"IF(B323=Liste1!$F$9,Liste1!$F$9*E323*100+MONTH($A323),0)","v":0},{"$f":"IF(B323=Liste1!$F$9,J323-I323,0)","v":0},{"$f":"IF(E323=\"\",\"\",VLOOKUP(E323,Liste1!$A$2:$B$41,2))","v":""},null,null,{"$f":"IF($B323=Liste1!$F$9,1,0)","v":0},{"$f":"IF(I323+J323=0,\"\",(E323*100+(YEAR($A323)+MONTH($A323)+MONTH($A323)))/((YEAR($A323))))","v":""},{"$f":"IF(O323+K323>0,I323,\"\")","v":""},{"$f":"IF(O323+K323>0,J323,\"\")","v":""},null,{"$f":"IF(O323+K323=0,\"\",(J323-I323))","v":""}]
["2023-03-11",4,{"$f":"IF(B324=\"\",\"\",VLOOKUP(B324,Liste1!$F$2:$I$9,2))","v":"Essai 4"},null,null,{"$f":"IF(B324=Liste1!$F$9,Liste1!$F$9*E324*100+MONTH($A324),0)","v":0},{"$f":"IF(B324=Liste1!$F$9,J324-I324,0)","v":0},{"$f":"IF(E324=\"\",\"\",VLOOKUP(E324,Liste1!$A$2:$B$41,2))","v":""},null,null,{"$f":"IF($B324=Liste1!$F$9,1,0)","v":0},{"$f":"IF(I324+J324=0,\"\",(E324*100+(YEAR($A324)+MONTH($A324)+MONTH($A324)))/((YEAR($A324))))","v":""},{"$f":"IF(O324+K324>0,I324,\"\")","v":""},{"$f":"IF(O324+K324>0,J324,\"\")","v":""},null,{"$f":"IF(O324+K324=0,\"\",(J324-I324))","v":""}]
["2023-03-12",2,{"$f":"IF(B325=\"\",\"\",VLOOKUP(B325,Liste1!$F$2:$I$9,2))","v":"Essai 2"},null,null,{"$f":"IF(B325=Liste1!$F$9,Liste1!$F$9*E325*100+MONTH($A325),0)","v":0},{"$f":"IF(B325=Liste1!$F$9,J325-I325,0)","v":0},{"$f":"IF(E325=\"\",\"\",VLOOKUP(E325,Liste1!$A$2:$B$41,2))","v":""},null,null,{"$f":"IF($B325=Liste1!$F$9,1,0)","v":0},{"$f":"IF(I325+J325=0,\"\",(E325*100+(YEAR($A325)+MONTH($A325)+MONTH($A325)))/((YEAR($A325))))","v":""},{"$f":"IF(O325+K325>0,I325,\"\")","v":""},{"$f":"IF(O325+K325>0,J325,\"\")","v":""},null,{"$f":"IF(O325+K325=0,\"\",(J325-I325))","v":""}]
["2023-03-12",2,{"$f":"IF(B326=\"\",\"\",VLOOKUP(B326,Liste1!$F$2:$I$9,2))","v":"Essai 2"},null,null,{"$f":"IF(B326=Liste1!$F$9,Liste1!$F$9*E326*100+MONTH($A326),0)","v":0},{"$f":"IF(B326=Liste1!$F$9,J326-I326,0)","v":0},{"$f":"IF(E326=\"\",\"\",VLOOKUP(E326,Liste1!$A$2:$B$41,2))","v":""},null,null,{"$f":"IF($B326=Liste1!$F$9,1,0)","v":0},{"$f":"IF(I326+J326=0,\"\",(E326*100+(YEAR($A326)+MONTH($A326)+MONTH($A326)))/((YEAR($A326))))","v":""},{"$f":"IF(O326+K326>0,I326,\"\")","v":""},{"$f":"IF(O326+K326>0,J326,\"\")","v":""},null,{"$f":"IF(O326+K326=0,\"\",(J326-I326))","v":""}]
["2023-03-12",4,{"$f":"IF(B327=\"\",\"\",VLOOKUP(B327,Liste1!$F$2:$I$9,2))","v":"Essai 4"},null,null,{"$f":"IF(B327=Liste1!$F$9,Liste1!$F$9*E327*100+MONTH($A327),0)","v":0},{"$f":"IF(B327=Liste1!$F$9,J327-I327,0)","v":0},{"$f":"IF(E327=\"\",\"\",VLOOKUP(E327,Liste1!$A$2:$B$41,2))","v":""},null,null,{"$f":"IF($B327=Liste1!$F$9,1,0)","v":0},{"$f":"IF(I327+J327=0,\"\",(E327*100+(YEAR($A327)+MONTH($A327)+MONTH($A327)))/((YEAR($A327))))","v":""},{"$f":"IF(O327+K327>0,I327,\"\")","v":""},{"$f":"IF(O327+K327>0,J327,\"\")","v":""},null,{"$f":"IF(O327+K327=0,\"\",(J327-I327))","v":""}]
["2023-03-13",4,{"$f":"IF(B328=\"\",\"\",VLOOKUP(B328,Liste1!$F$2:$I$9,2))","v":"Essai 4"},null,null,{"$f":"IF(B328=Liste1!$F$9,Liste1!$F$9*E328*100+MONTH($A328),0)","v":0},{"$f":"IF(B328=Liste1!$F$9,J328-I328,0)","v":0},{"$f":"IF(E328=\"\",\"\",VLOOKUP(E328,Liste1!$A$2:$B$41,2))","v":""},null,null,{"$f":"IF($B328=Liste1!$F$9,1,0)","v":0},{"$f":"IF(I328+J328=0,\"\",(E328*100+(YEAR($A328)+MONTH($A328)+MONTH($A328)))/((YEAR($A328))))","v":""},{"$f":"IF(O328+K328>0,I328,\"\")","v":""},{"$f":"IF(O328+K328>0,J328,\"\")","v":""},null,{"$f":"IF(O328+K328=0,\"\",(J328-I328))","v":""}]
["2023-03-13",4,{"$f":"IF(B329=\"\",\"\",VLOOKUP(B329,Liste1!$F$2:$I$9,2))","v":"Essai 4"},null,null,{"$f":"IF(B329=Liste1!$F$9,Liste1!$F$9*E329*100+MONTH($A329),0)","v":0},{"$f":"IF(B329=Liste1!$F$9,J329-I329,0)","v":0},{"$f":"IF(E329=\"\",\"\",VLOOKUP(E329,Liste1!$A$2:$B$41,2))","v":""},null,null,{"$f":"IF($B329=Liste1!$F$9,1,0)","v":0},{"$f":"IF(I329+J329=0,\"\",(E329*100+(YEAR($A329)+MONTH($A329)+MONTH($A329)))/((YEAR($A329))))","v":""},{"$f":"IF(O329+K329>0,I329,\"\")","v":""},{"$f":"IF(O329+K329>0,J329,\"\")","v":""},null,{"$f":"IF(O329+K329=0,\"\",(J329-I329))","v":""}]
["2023-03-15",5,{"$f":"IF(B330=\"\",\"\",VLOOKUP(B330,Liste1!$F$2:$I$9,2))","v":"Essai 5"},null,null,{"$f":"IF(B330=Liste1!$F$9,Liste1!$F$9*E330*100+MONTH($A330),0)","v":0},{"$f":"IF(B330=Liste1!$F$9,J330-I330,0)","v":0},{"$f":"IF(E330=\"\",\"\",VLOOKUP(E330,Liste1!$A$2:$B$41,2))","v":""},null,null,{"$f":"IF($B330=Liste1!$F$9,1,0)","v":0},{"$f":"IF(I330+J330=0,\"\",(E330*100+(YEAR($A330)+MONTH($A330)+MONTH($A330)))/((YEAR($A330))))","v":""},{"$f":"IF(O330+K330>0,I330,\"\")","v":""},{"$f":"IF(O330+K330>0,J330,\"\")","v":""},null,{"$f":"IF(O330+K330=0,\"\",(J330-I330))","v":""}]
["2023-03-15",5,{"$f":"IF(B331=\"\",\"\",VLOOKUP(B331,Liste1!$F$2:$I$9,2))","v":"Essai 5"},null,null,{"$f":"IF(B331=Liste1!$F$9,Liste1!$F$9*E331*100+MONTH($A331),0)","v":0},{"$f":"IF(B331=Liste1!$F$9,J331-I331,0)","v":0},{"$f":"IF(E331=\"\",\"\",VLOOKUP(E331,Liste1!$A$2:$B$41,2))","v":""},null,null,{"$f":"IF($B331=Liste1!$F$9,1,0)","v":0},{"$f":"IF(I331+J331=0,\"\",(E331*100+(YEAR($A331)+MONTH($A331)+MONTH($A331)))/((YEAR($A331))))","v":""},{"$f":"IF(O331+K331>0,I331,\"\")","v":""},{"$f":"IF(O331+K331>0,J331,\"\")","v":""},null,{"$f":"IF(O331+K331=0,\"\",(J331-I331))","v":""}]
["2023-03-15",2,{"$f":"IF(B332=\"\",\"\",VLOOKUP(B332,Liste1!$F$2:$I$9,2))","v":"Essai 2"},null,null,{"$f":"IF(B332=Liste1!$F$9,Liste1!$F$9*E332*100+MONTH($A332),0)","v":0},{"$f":"IF(B332=Liste1!$F$9,J332-I332,0)","v":0},{"$f":"IF(E332=\"\",\"\",VLOOKUP(E332,Liste1!$A$2:$B$41,2))","v":""},null,null,{"$f":"IF($B332=Liste1!$F$9,1,0)","v":0},{"$f":"IF(I332+J332=0,\"\",(E332*100+(YEAR($A332)+MONTH($A332)+MONTH($A332)))/((YEAR($A332))))","v":""},{"$f":"IF(O332+K332>0,I332,\"\")","v":""},{"$f":"IF(O332+K332>0,J332,\"\")","v":""},null,{"$f":"IF(O332+K332=0,\"\",(J332-I332))","v":""}]
["2023-03-15",2,{"$f":"IF(B333=\"\",\"\",VLOOKUP(B333,Liste1!$F$2:$I$9,2))","v":"Essai 2"},null,null,{"$f":"IF(B333=Liste1!$F$9,Liste1!$F$9*E333*100+MONTH($A333),0)","v":0},{"$f":"IF(B333=Liste1!$F$9,J333-I333,0)","v":0},{"$f":"IF(E333=\"\",\"\",VLOOKUP(E333,Liste1!$A$2:$B$41,2))","v":""},null,null,{"$f":"IF($B333=Liste1!$F$9,1,0)","v":0},{"$f":"IF(I333+J333=0,\"\",(E333*100+(YEAR($A333)+MONTH($A333)+MONTH($A333)))/((YEAR($A333))))","v":""},{"$f":"IF(O333+K333>0,I333,\"\")","v":""},{"$f":"IF(O333+K333>0,J333,\"\")","v":""},null,{"$f":"IF(O333+K333=0,\"\",(J333-I333))","v":""}]
["2023-03-19",2,{"$f":"IF(B334=\"\",\"\",VLOOKUP(B334,Liste1!$F$2:$I$9,2))","v":"Essai 2"},null,null,{"$f":"IF(B334=Liste1!$F$9,Liste1!$F$9*E334*100+MONTH($A334),0)","v":0},{"$f":"IF(B334=Liste1!$F$9,J334-I334,0)","v":0},{"$f":"IF(E334=\"\",\"\",VLOOKUP(E334,Liste1!$A$2:$B$41,2))","v":""},null,null,{"$f":"IF($B334=Liste1!$F$9,1,0)","v":0},{"$f":"IF(I334+J334=0,\"\",(E334*100+(YEAR($A334)+MONTH($A334)+MONTH($A334)))/((YEAR($A334))))","v":""},{"$f":"IF(O334+K334>0,I334,\"\")","v":""},{"$f":"IF(O334+K334>0,J334,\"\")","v":""},null,{"$f":"IF(O334+K334=0,\"\",(J334-I334))","v":""}]
["2023-03-19",2,{"$f":"IF(B335=\"\",\"\",VLOOKUP(B335,Liste1!$F$2:$I$9,2))","v":"Essai 2"},null,null,{"$f":"IF(B335=Liste1!$F$9,Liste1!$F$9*E335*100+MONTH($A335),0)","v":0},{"$f":"IF(B335=Liste1!$F$9,J335-I335,0)","v":0},{"$f":"IF(E335=\"\",\"\",VLOOKUP(E335,Liste1!$A$2:$B$41,2))","v":""},null,null,{"$f":"IF($B335=Liste1!$F$9,1,0)","v":0},{"$f":"IF(I335+J335=0,\"\",(E335*100+(YEAR($A335)+MONTH($A335)+MONTH($A335)))/((YEAR($A335))))","v":""},{"$f":"IF(O335+K335>0,I335,\"\")","v":""},{"$f":"IF(O335+K335>0,J335,\"\")","v":""},null,{"$f":"IF(O335+K335=0,\"\",(J335-I335))","v":""}]
["2023-03-19",2,{"$f":"IF(B336=\"\",\"\",VLOOKUP(B336,Liste1!$F$2:$I$9,2))","v":"Essai 2"},null,null,{"$f":"IF(B336=Liste1!$F$9,Liste1!$F$9*E336*100+MONTH($A336),0)","v":0},{"$f":"IF(B336=Liste1!$F$9,J336-I336,0)","v":0},{"$f":"IF(E336=\"\",\"\",VLOOKUP(E336,Liste1!$A$2:$B$41,2))","v":""},null,null,{"$f":"IF($B336=Liste1!$F$9,1,0)","v":0},{"$f":"IF(I336+J336=0,\"\",(E336*100+(YEAR($A336)+MONTH($A336)+MONTH($A336)))/((YEAR($A336))))","v":""},{"$f":"IF(O336+K336>0,I336,\"\")","v":""},{"$f":"IF(O336+K336>0,J336,\"\")","v":""},null,{"$f":"IF(O336+K336=0,\"\",(J336-I336))","v":""}]
["2023-03-20",5,{"$f":"IF(B337=\"\",\"\",VLOOKUP(B337,Liste1!$F$2:$I$9,2))","v":"Essai 5"},null,null,{"$f":"IF(B337=Liste1!$F$9,Liste1!$F$9*E337*100+MONTH($A337),0)","v":0},{"$f":"IF(B337=Liste1!$F$9,J337-I337,0)","v":0},{"$f":"IF(E337=\"\",\"\",VLOOKUP(E337,Liste1!$A$2:$B$41,2))","v":""},null,null,{"$f":"IF($B337=Liste1!$F$9,1,0)","v":0},{"$f":"IF(I337+J337=0,\"\",(E337*100+(YEAR($A337)+MONTH($A337)+MONTH($A337)))/((YEAR($A337))))","v":""},{"$f":"IF(O337+K337>0,I337,\"\")","v":""},{"$f":"IF(O337+K337>0,J337,\"\")","v":""},null,{"$f":"IF(O337+K337=0,\"\",(J337-I337))","v":""}]
["2023-03-21",3,{"$f":"IF(B338=\"\",\"\",VLOOKUP(B338,Liste1!$F$2:$I$9,2))","v":"Essai 3"},null,null,{"$f":"IF(B338=Liste1!$F$9,Liste1!$F$9*E338*100+MONTH($A338),0)","v":0},{"$f":"IF(B338=Liste1!$F$9,J338-I338,0)","v":0},{"$f":"IF(E338=\"\",\"\",VLOOKUP(E338,Liste1!$A$2:$B$41,2))","v":""},null,null,{"$f":"IF($B338=Liste1!$F$9,1,0)","v":0},{"$f":"IF(I338+J338=0,\"\",(E338*100+(YEAR($A338)+MONTH($A338)+MONTH($A338)))/((YEAR($A338))))","v":""},{"$f":"IF(O338+K338>0,I338,\"\")","v":""},{"$f":"IF(O338+K338>0,J338,\"\")","v":""},null,{"$f":"IF(O338+K338=0,\"\",(J338-I338))","v":""}]
["2023-03-22",4,{"$f":"IF(B339=\"\",\"\",VLOOKUP(B339,Liste1!$F$2:$I$9,2))","v":"Essai 4"},null,null,{"$f":"IF(B339=Liste1!$F$9,Liste1!$F$9*E339*100+MONTH($A339),0)","v":0},{"$f":"IF(B339=Liste1!$F$9,J339-I339,0)","v":0},{"$f":"IF(E339=\"\",\"\",VLOOKUP(E339,Liste1!$A$2:$B$41,2))","v":""},null,null,{"$f":"IF($B339=Liste1!$F$9,1,0)","v":0},{"$f":"IF(I339+J339=0,\"\",(E339*100+(YEAR($A339)+MONTH($A339)+MONTH($A339)))/((YEAR($A339))))","v":""},{"$f":"IF(O339+K339>0,I339,\"\")","v":""},{"$f":"IF(O339+K339>0,J339,\"\")","v":""},null,{"$f":"IF(O339+K339=0,\"\",(J339-I339))","v":""}]
["2023-03-23",2,{"$f":"IF(B340=\"\",\"\",VLOOKUP(B340,Liste1!$F$2:$I$9,2))","v":"Essai 2"},null,null,{"$f":"IF(B340=Liste1!$F$9,Liste1!$F$9*E340*100+MONTH($A340),0)","v":0},{"$f":"IF(B340=Liste1!$F$9,J340-I340,0)","v":0},{"$f":"IF(E340=\"\",\"\",VLOOKUP(E340,Liste1!$A$2:$B$41,2))","v":""},null,null,{"$f":"IF($B340=Liste1!$F$9,1,0)","v":0},{"$f":"IF(I340+J340=0,\"\",(E340*100+(YEAR($A340)+MONTH($A340)+MONTH($A340)))/((YEAR($A340))))","v":""},{"$f":"IF(O340+K340>0,I340,\"\")","v":""},{"$f":"IF(O340+K340>0,J340,\"\")","v":""},null,{"$f":"IF(O340+K340=0,\"\",(J340-I340))","v":""}]
["2023-03-23",7,{"$f":"IF(B341=\"\",\"\",VLOOKUP(B341,Liste1!$F$2:$I$9,2))","v":"Essai 7"},null,null,{"$f":"IF(B341=Liste1!$F$9,Liste1!$F$9*E341*100+MONTH($A341),0)","v":0},{"$f":"IF(B341=Liste1!$F$9,J341-I341,0)","v":0},{"$f":"IF(E341=\"\",\"\",VLOOKUP(E341,Liste1!$A$2:$B$41,2))","v":""},null,null,{"$f":"IF($B341=Liste1!$F$9,1,0)","v":0},{"$f":"IF(I341+J341=0,\"\",(E341*100+(YEAR($A341)+MONTH($A341)+MONTH($A341)))/((YEAR($A341))))","v":""},{"$f":"IF(O341+K341>0,I341,\"\")","v":""},{"$f":"IF(O341+K341>0,J341,\"\")","v":""},null,{"$f":"IF(O341+K341=0,\"\",(J341-I341))","v":""}]
["2023-03-25",3,{"$f":"IF(B342=\"\",\"\",VLOOKUP(B342,Liste1!$F$2:$I$9,2))","v":"Essai 3"},null,null,{"$f":"IF(B342=Liste1!$F$9,Liste1!$F$9*E342*100+MONTH($A342),0)","v":0},{"$f":"IF(B342=Liste1!$F$9,J342-I342,0)","v":0},{"$f":"IF(E342=\"\",\"\",VLOOKUP(E342,Liste1!$A$2:$B$41,2))","v":""},null,null,{"$f":"IF($B342=Liste1!$F$9,1,0)","v":0},{"$f":"IF(I342+J342=0,\"\",(E342*100+(YEAR($A342)+MONTH($A342)+MONTH($A342)))/((YEAR($A342))))","v":""},{"$f":"IF(O342+K342>0,I342,\"\")","v":""},{"$f":"IF(O342+K342>0,J342,\"\")","v":""},null,{"$f":"IF(O342+K342=0,\"\",(J342-I342))","v":""}]
["2023-03-28",2,{"$f":"IF(B343=\"\",\"\",VLOOKUP(B343,Liste1!$F$2:$I$9,2))","v":"Essai 2"},null,null,{"$f":"IF(B343=Liste1!$F$9,Liste1!$F$9*E343*100+MONTH($A343),0)","v":0},{"$f":"IF(B343=Liste1!$F$9,J343-I343,0)","v":0},{"$f":"IF(E343=\"\",\"\",VLOOKUP(E343,Liste1!$A$2:$B$41,2))","v":""},null,null,{"$f":"IF($B343=Liste1!$F$9,1,0)","v":0},{"$f":"IF(I343+J343=0,\"\",(E343*100+(YEAR($A343)+MONTH($A343)+MONTH($A343)))/((YEAR($A343))))","v":""},{"$f":"IF(O343+K343>0,I343,\"\")","v":""},{"$f":"IF(O343+K343>0,J343,\"\")","v":""},null,{"$f":"IF(O343+K343=0,\"\",(J343-I343))","v":""}]
["2023-03-29",4,{"$f":"IF(B344=\"\",\"\",VLOOKUP(B344,Liste1!$F$2:$I$9,2))","v":"Essai 4"},null,null,{"$f":"IF(B344=Liste1!$F$9,Liste1!$F$9*E344*100+MONTH($A344),0)","v":0},{"$f":"IF(B344=Liste1!$F$9,J344-I344,0)","v":0},{"$f":"IF(E344=\"\",\"\",VLOOKUP(E344,Liste1!$A$2:$B$41,2))","v":""},null,null,{"$f":"IF($B344=Liste1!$F$9,1,0)","v":0},{"$f":"IF(I344+J344=0,\"\",(E344*100+(YEAR($A344)+MONTH($A344)+MONTH($A344)))/((YEAR($A344))))","v":""},{"$f":"IF(O344+K344>0,I344,\"\")","v":""},{"$f":"IF(O344+K344>0,J344,\"\")","v":""},null,{"$f":"IF(O344+K344=0,\"\",(J344-I344))","v":""}]
["2023-04-03",2,{"$f":"IF(B345=\"\",\"\",VLOOKUP(B345,Liste1!$F$2:$I$9,2))","v":"Essai 2"},null,null,{"$f":"IF(B345=Liste1!$F$9,Liste1!$F$9*E345*100+MONTH($A345),0)","v":0},{"$f":"IF(B345=Liste1!$F$9,J345-I345,0)","v":0},{"$f":"IF(E345=\"\",\"\",VLOOKUP(E345,Liste1!$A$2:$B$41,2))","v":""},null,null,{"$f":"IF($B345=Liste1!$F$9,1,0)","v":0},{"$f":"IF(I345+J345=0,\"\",(E345*100+(YEAR($A345)+MONTH($A345)+MONTH($A345)))/((YEAR($A345))))","v":""},{"$f":"IF(O345+K345>0,I345,\"\")","v":""},{"$f":"IF(O345+K345>0,J345,\"\")","v":""},null,{"$f":"IF(O345+K345=0,\"\",(J345-I345))","v":""}]
["2023-04-03",4,{"$f":"IF(B346=\"\",\"\",VLOOKUP(B346,Liste1!$F$2:$I$9,2))","v":"Essai 4"},null,null,{"$f":"IF(B346=Liste1!$F$9,Liste1!$F$9*E346*100+MONTH($A346),0)","v":0},{"$f":"IF(B346=Liste1!$F$9,J346-I346,0)","v":0},{"$f":"IF(E346=\"\",\"\",VLOOKUP(E346,Liste1!$A$2:$B$41,2))","v":""},null,null,{"$f":"IF($B346=Liste1!$F$9,1,0)","v":0},{"$f":"IF(I346+J346=0,\"\",(E346*100+(YEAR($A346)+MONTH($A346)+MONTH($A346)))/((YEAR($A346))))","v":""},{"$f":"IF(O346+K346>0,I346,\"\")","v":""},{"$f":"IF(O346+K346>0,J346,\"\")","v":""},null,{"$f":"IF(O346+K346=0,\"\",(J346-I346))","v":""}]
["2023-04-05",2,{"$f":"IF(B347=\"\",\"\",VLOOKUP(B347,Liste1!$F$2:$I$9,2))","v":"Essai 2"},null,null,{"$f":"IF(B347=Liste1!$F$9,Liste1!$F$9*E347*100+MONTH($A347),0)","v":0},{"$f":"IF(B347=Liste1!$F$9,J347-I347,0)","v":0},{"$f":"IF(E347=\"\",\"\",VLOOKUP(E347,Liste1!$A$2:$B$41,2))","v":""},null,null,{"$f":"IF($B347=Liste1!$F$9,1,0)","v":0},{"$f":"IF(I347+J347=0,\"\",(E347*100+(YEAR($A347)+MONTH($A347)+MONTH($A347)))/((YEAR($A347))))","v":""},{"$f":"IF(O347+K347>0,I347,\"\")","v":""},{"$f":"IF(O347+K347>0,J347,\"\")","v":""},null,{"$f":"IF(O347+K347=0,\"\",(J347-I347))","v":""}]
["2023-04-06",5,{"$f":"IF(B348=\"\",\"\",VLOOKUP(B348,Liste1!$F$2:$I$9,2))","v":"Essai 5"},null,null,{"$f":"IF(B348=Liste1!$F$9,Liste1!$F$9*E348*100+MONTH($A348),0)","v":0},{"$f":"IF(B348=Liste1!$F$9,J348-I348,0)","v":0},{"$f":"IF(E348=\"\",\"\",VLOOKUP(E348,Liste1!$A$2:$B$41,2))","v":""},null,null,{"$f":"IF($B348=Liste1!$F$9,1,0)","v":0},{"$f":"IF(I348+J348=0,\"\",(E348*100+(YEAR($A348)+MONTH($A348)+MONTH($A348)))/((YEAR($A348))))","v":""},{"$f":"IF(O348+K348>0,I348,\"\")","v":""},{"$f":"IF(O348+K348>0,J348,\"\")","v":""},null,{"$f":"IF(O348+K348=0,\"\",(J348-I348))","v":""}]
["2023-04-07",7,{"$f":"IF(B349=\"\",\"\",VLOOKUP(B349,Liste1!$F$2:$I$9,2))","v":"Essai 7"},null,null,{"$f":"IF(B349=Liste1!$F$9,Liste1!$F$9*E349*100+MONTH($A349),0)","v":0},{"$f":"IF(B349=Liste1!$F$9,J349-I349,0)","v":0},{"$f":"IF(E349=\"\",\"\",VLOOKUP(E349,Liste1!$A$2:$B$41,2))","v":""},null,null,{"$f":"IF($B349=Liste1!$F$9,1,0)","v":0},{"$f":"IF(I349+J349=0,\"\",(E349*100+(YEAR($A349)+MONTH($A349)+MONTH($A349)))/((YEAR($A349))))","v":""},{"$f":"IF(O349+K349>0,I349,\"\")","v":""},{"$f":"IF(O349+K349>0,J349,\"\")","v":""},null,{"$f":"IF(O349+K349=0,\"\",(J349-I349))","v":""}]
["2023-04-10",3,{"$f":"IF(B350=\"\",\"\",VLOOKUP(B350,Liste1!$F$2:$I$9,2))","v":"Essai 3"},null,null,{"$f":"IF(B350=Liste1!$F$9,Liste1!$F$9*E350*100+MONTH($A350),0)","v":0},{"$f":"IF(B350=Liste1!$F$9,J350-I350,0)","v":0},{"$f":"IF(E350=\"\",\"\",VLOOKUP(E350,Liste1!$A$2:$B$41,2))","v":""},null,null,{"$f":"IF($B350=Liste1!$F$9,1,0)","v":0},{"$f":"IF(I350+J350=0,\"\",(E350*100+(YEAR($A350)+MONTH($A350)+MONTH($A350)))/((YEAR($A350))))","v":""},{"$f":"IF(O350+K350>0,I350,\"\")","v":""},{"$f":"IF(O350+K350>0,J350,\"\")","v":""},null,{"$f":"IF(O350+K350=0,\"\",(J350-I350))","v":""}]
["2023-04-10",3,{"$f":"IF(B351=\"\",\"\",VLOOKUP(B351,Liste1!$F$2:$I$9,2))","v":"Essai 3"},null,null,{"$f":"IF(B351=Liste1!$F$9,Liste1!$F$9*E351*100+MONTH($A351),0)","v":0},{"$f":"IF(B351=Liste1!$F$9,J351-I351,0)","v":0},{"$f":"IF(E351=\"\",\"\",VLOOKUP(E351,Liste1!$A$2:$B$41,2))","v":""},null,null,{"$f":"IF($B351=Liste1!$F$9,1,0)","v":0},{"$f":"IF(I351+J351=0,\"\",(E351*100+(YEAR($A351)+MONTH($A351)+MONTH($A351)))/((YEAR($A351))))","v":""},{"$f":"IF(O351+K351>0,I351,\"\")","v":""},{"$f":"IF(O351+K351>0,J351,\"\")","v":""},null,{"$f":"IF(O351+K351=0,\"\",(J351-I351))","v":""}]
["2023-04-10",3,{"$f":"IF(B352=\"\",\"\",VLOOKUP(B352,Liste1!$F$2:$I$9,2))","v":"Essai 3"},null,null,{"$f":"IF(B352=Liste1!$F$9,Liste1!$F$9*E352*100+MONTH($A352),0)","v":0},{"$f":"IF(B352=Liste1!$F$9,J352-I352,0)","v":0},{"$f":"IF(E352=\"\",\"\",VLOOKUP(E352,Liste1!$A$2:$B$41,2))","v":""},null,null,{"$f":"IF($B352=Liste1!$F$9,1,0)","v":0},{"$f":"IF(I352+J352=0,\"\",(E352*100+(YEAR($A352)+MONTH($A352)+MONTH($A352)))/((YEAR($A352))))","v":""},{"$f":"IF(O352+K352>0,I352,\"\")","v":""},{"$f":"IF(O352+K352>0,J352,\"\")","v":""},null,{"$f":"IF(O352+K352=0,\"\",(J352-I352))","v":""}]
["2023-04-10",3,{"$f":"IF(B353=\"\",\"\",VLOOKUP(B353,Liste1!$F$2:$I$9,2))","v":"Essai 3"},null,null,{"$f":"IF(B353=Liste1!$F$9,Liste1!$F$9*E353*100+MONTH($A353),0)","v":0},{"$f":"IF(B353=Liste1!$F$9,J353-I353,0)","v":0},{"$f":"IF(E353=\"\",\"\",VLOOKUP(E353,Liste1!$A$2:$B$41,2))","v":""},null,null,{"$f":"IF($B353=Liste1!$F$9,1,0)","v":0},{"$f":"IF(I353+J353=0,\"\",(E353*100+(YEAR($A353)+MONTH($A353)+MONTH($A353)))/((YEAR($A353))))","v":""},{"$f":"IF(O353+K353>0,I353,\"\")","v":""},{"$f":"IF(O353+K353>0,J353,\"\")","v":""},null,{"$f":"IF(O353+K353=0,\"\",(J353-I353))","v":""}]
["2023-04-10",3,{"$f":"IF(B354=\"\",\"\",VLOOKUP(B354,Liste1!$F$2:$I$9,2))","v":"Essai 3"},null,null,{"$f":"IF(B354=Liste1!$F$9,Liste1!$F$9*E354*100+MONTH($A354),0)","v":0},{"$f":"IF(B354=Liste1!$F$9,J354-I354,0)","v":0},{"$f":"IF(E354=\"\",\"\",VLOOKUP(E354,Liste1!$A$2:$B$41,2))","v":""},null,null,{"$f":"IF($B354=Liste1!$F$9,1,0)","v":0},{"$f":"IF(I354+J354=0,\"\",(E354*100+(YEAR($A354)+MONTH($A354)+MONTH($A354)))/((YEAR($A354))))","v":""},{"$f":"IF(O354+K354>0,I354,\"\")","v":""},{"$f":"IF(O354+K354>0,J354,\"\")","v":""},null,{"$f":"IF(O354+K354=0,\"\",(J354-I354))","v":""}]
["2023-04-10",3,{"$f":"IF(B355=\"\",\"\",VLOOKUP(B355,Liste1!$F$2:$I$9,2))","v":"Essai 3"},null,null,{"$f":"IF(B355=Liste1!$F$9,Liste1!$F$9*E355*100+MONTH($A355),0)","v":0},{"$f":"IF(B355=Liste1!$F$9,J355-I355,0)","v":0},{"$f":"IF(E355=\"\",\"\",VLOOKUP(E355,Liste1!$A$2:$B$41,2))","v":""},null,null,{"$f":"IF($B355=Liste1!$F$9,1,0)","v":0},{"$f":"IF(I355+J355=0,\"\",(E355*100+(YEAR($A355)+MONTH($A355)+MONTH($A355)))/((YEAR($A355))))","v":""},{"$f":"IF(O355+K355>0,I355,\"\")","v":""},{"$f":"IF(O355+K355>0,J355,\"\")","v":""},null,{"$f":"IF(O355+K355=0,\"\",(J355-I355))","v":""}]
["2023-04-10",3,{"$f":"IF(B356=\"\",\"\",VLOOKUP(B356,Liste1!$F$2:$I$9,2))","v":"Essai 3"},null,null,{"$f":"IF(B356=Liste1!$F$9,Liste1!$F$9*E356*100+MONTH($A356),0)","v":0},{"$f":"IF(B356=Liste1!$F$9,J356-I356,0)","v":0},{"$f":"IF(E356=\"\",\"\",VLOOKUP(E356,Liste1!$A$2:$B$41,2))","v":""},null,null,{"$f":"IF($B356=Liste1!$F$9,1,0)","v":0},{"$f":"IF(I356+J356=0,\"\",(E356*100+(YEAR($A356)+MONTH($A356)+MONTH($A356)))/((YEAR($A356))))","v":""},{"$f":"IF(O356+K356>0,I356,\"\")","v":""},{"$f":"IF(O356+K356>0,J356,\"\")","v":""},null,{"$f":"IF(O356+K356=0,\"\",(J356-I356))","v":""}]
["2023-04-10",3,{"$f":"IF(B357=\"\",\"\",VLOOKUP(B357,Liste1!$F$2:$I$9,2))","v":"Essai 3"},null,null,{"$f":"IF(B357=Liste1!$F$9,Liste1!$F$9*E357*100+MONTH($A357),0)","v":0},{"$f":"IF(B357=Liste1!$F$9,J357-I357,0)","v":0},{"$f":"IF(E357=\"\",\"\",VLOOKUP(E357,Liste1!$A$2:$B$41,2))","v":""},null,null,{"$f":"IF($B357=Liste1!$F$9,1,0)","v":0},{"$f":"IF(I357+J357=0,\"\",(E357*100+(YEAR($A357)+MONTH($A357)+MONTH($A357)))/((YEAR($A357))))","v":""},{"$f":"IF(O357+K357>0,I357,\"\")","v":""},{"$f":"IF(O357+K357>0,J357,\"\")","v":""},null,{"$f":"IF(O357+K357=0,\"\",(J357-I357))","v":""}]
["2023-04-10",3,{"$f":"IF(B358=\"\",\"\",VLOOKUP(B358,Liste1!$F$2:$I$9,2))","v":"Essai 3"},null,null,{"$f":"IF(B358=Liste1!$F$9,Liste1!$F$9*E358*100+MONTH($A358),0)","v":0},{"$f":"IF(B358=Liste1!$F$9,J358-I358,0)","v":0},{"$f":"IF(E358=\"\",\"\",VLOOKUP(E358,Liste1!$A$2:$B$41,2))","v":""},null,null,{"$f":"IF($B358=Liste1!$F$9,1,0)","v":0},{"$f":"IF(I358+J358=0,\"\",(E358*100+(YEAR($A358)+MONTH($A358)+MONTH($A358)))/((YEAR($A358))))","v":""},{"$f":"IF(O358+K358>0,I358,\"\")","v":""},{"$f":"IF(O358+K358>0,J358,\"\")","v":""},null,{"$f":"IF(O358+K358=0,\"\",(J358-I358))","v":""}]
["2023-04-10",3,{"$f":"IF(B359=\"\",\"\",VLOOKUP(B359,Liste1!$F$2:$I$9,2))","v":"Essai 3"},null,null,{"$f":"IF(B359=Liste1!$F$9,Liste1!$F$9*E359*100+MONTH($A359),0)","v":0},{"$f":"IF(B359=Liste1!$F$9,J359-I359,0)","v":0},{"$f":"IF(E359=\"\",\"\",VLOOKUP(E359,Liste1!$A$2:$B$41,2))","v":""},null,null,{"$f":"IF($B359=Liste1!$F$9,1,0)","v":0},{"$f":"IF(I359+J359=0,\"\",(E359*100+(YEAR($A359)+MONTH($A359)+MONTH($A359)))/((YEAR($A359))))","v":""},{"$f":"IF(O359+K359>0,I359,\"\")","v":""},{"$f":"IF(O359+K359>0,J359,\"\")","v":""},null,{"$f":"IF(O359+K359=0,\"\",(J359-I359))","v":""}]
["2023-04-10",4,{"$f":"IF(B360=\"\",\"\",VLOOKUP(B360,Liste1!$F$2:$I$9,2))","v":"Essai 4"},null,null,{"$f":"IF(B360=Liste1!$F$9,Liste1!$F$9*E360*100+MONTH($A360),0)","v":0},{"$f":"IF(B360=Liste1!$F$9,J360-I360,0)","v":0},{"$f":"IF(E360=\"\",\"\",VLOOKUP(E360,Liste1!$A$2:$B$41,2))","v":""},null,null,{"$f":"IF($B360=Liste1!$F$9,1,0)","v":0},{"$f":"IF(I360+J360=0,\"\",(E360*100+(YEAR($A360)+MONTH($A360)+MONTH($A360)))/((YEAR($A360))))","v":""},{"$f":"IF(O360+K360>0,I360,\"\")","v":""},{"$f":"IF(O360+K360>0,J360,\"\")","v":""},null,{"$f":"IF(O360+K360=0,\"\",(J360-I360))","v":""}]
["2023-04-12",2,{"$f":"IF(B361=\"\",\"\",VLOOKUP(B361,Liste1!$F$2:$I$9,2))","v":"Essai 2"},null,null,{"$f":"IF(B361=Liste1!$F$9,Liste1!$F$9*E361*100+MONTH($A361),0)","v":0},{"$f":"IF(B361=Liste1!$F$9,J361-I361,0)","v":0},{"$f":"IF(E361=\"\",\"\",VLOOKUP(E361,Liste1!$A$2:$B$41,2))","v":""},null,null,{"$f":"IF($B361=Liste1!$F$9,1,0)","v":0},{"$f":"IF(I361+J361=0,\"\",(E361*100+(YEAR($A361)+MONTH($A361)+MONTH($A361)))/((YEAR($A361))))","v":""},{"$f":"IF(O361+K361>0,I361,\"\")","v":""},{"$f":"IF(O361+K361>0,J361,\"\")","v":""},null,{"$f":"IF(O361+K361=0,\"\",(J361-I361))","v":""}]
["2023-04-13",5,{"$f":"IF(B362=\"\",\"\",VLOOKUP(B362,Liste1!$F$2:$I$9,2))","v":"Essai 5"},null,null,{"$f":"IF(B362=Liste1!$F$9,Liste1!$F$9*E362*100+MONTH($A362),0)","v":0},{"$f":"IF(B362=Liste1!$F$9,J362-I362,0)","v":0},{"$f":"IF(E362=\"\",\"\",VLOOKUP(E362,Liste1!$A$2:$B$41,2))","v":""},null,null,{"$f":"IF($B362=Liste1!$F$9,1,0)","v":0},{"$f":"IF(I362+J362=0,\"\",(E362*100+(YEAR($A362)+MONTH($A362)+MONTH($A362)))/((YEAR($A362))))","v":""},{"$f":"IF(O362+K362>0,I362,\"\")","v":""},{"$f":"IF(O362+K362>0,J362,\"\")","v":""},null,{"$f":"IF(O362+K362=0,\"\",(J362-I362))","v":""}]
["2023-04-13",2,{"$f":"IF(B363=\"\",\"\",VLOOKUP(B363,Liste1!$F$2:$I$9,2))","v":"Essai 2"},null,null,{"$f":"IF(B363=Liste1!$F$9,Liste1!$F$9*E363*100+MONTH($A363),0)","v":0},{"$f":"IF(B363=Liste1!$F$9,J363-I363,0)","v":0},{"$f":"IF(E363=\"\",\"\",VLOOKUP(E363,Liste1!$A$2:$B$41,2))","v":""},null,null,{"$f":"IF($B363=Liste1!$F$9,1,0)","v":0},{"$f":"IF(I363+J363=0,\"\",(E363*100+(YEAR($A363)+MONTH($A363)+MONTH($A363)))/((YEAR($A363))))","v":""},{"$f":"IF(O363+K363>0,I363,\"\")","v":""},{"$f":"IF(O363+K363>0,J363,\"\")","v":""},null,{"$f":"IF(O363+K363=0,\"\",(J363-I363))","v":""}]
["2023-04-13",4,{"$f":"IF(B364=\"\",\"\",VLOOKUP(B364,Liste1!$F$2:$I$9,2))","v":"Essai 4"},null,null,{"$f":"IF(B364=Liste1!$F$9,Liste1!$F$9*E364*100+MONTH($A364),0)","v":0},{"$f":"IF(B364=Liste1!$F$9,J364-I364,0)","v":0},{"$f":"IF(E364=\"\",\"\",VLOOKUP(E364,Liste1!$A$2:$B$41,2))","v":""},null,null,{"$f":"IF($B364=Liste1!$F$9,1,0)","v":0},{"$f":"IF(I364+J364=0,\"\",(E364*100+(YEAR($A364)+MONTH($A364)+MONTH($A364)))/((YEAR($A364))))","v":""},{"$f":"IF(O364+K364>0,I364,\"\")","v":""},{"$f":"IF(O364+K364>0,J364,\"\")","v":""},null,{"$f":"IF(O364+K364=0,\"\",(J364-I364))","v":""}]
["2023-04-13",4,{"$f":"IF(B365=\"\",\"\",VLOOKUP(B365,Liste1!$F$2:$I$9,2))","v":"Essai 4"},null,null,{"$f":"IF(B365=Liste1!$F$9,Liste1!$F$9*E365*100+MONTH($A365),0)","v":0},{"$f":"IF(B365=Liste1!$F$9,J365-I365,0)","v":0},{"$f":"IF(E365=\"\",\"\",VLOOKUP(E365,Liste1!$A$2:$B$41,2))","v":""},null,null,{"$f":"IF($B365=Liste1!$F$9,1,0)","v":0},{"$f":"IF(I365+J365=0,\"\",(E365*100+(YEAR($A365)+MONTH($A365)+MONTH($A365)))/((YEAR($A365))))","v":""},{"$f":"IF(O365+K365>0,I365,\"\")","v":""},{"$f":"IF(O365+K365>0,J365,\"\")","v":""},null,{"$f":"IF(O365+K365=0,\"\",(J365-I365))","v":""}]
["2023-04-13",4,{"$f":"IF(B366=\"\",\"\",VLOOKUP(B366,Liste1!$F$2:$I$9,2))","v":"Essai 4"},null,null,{"$f":"IF(B366=Liste1!$F$9,Liste1!$F$9*E366*100+MONTH($A366),0)","v":0},{"$f":"IF(B366=Liste1!$F$9,J366-I366,0)","v":0},{"$f":"IF(E366=\"\",\"\",VLOOKUP(E366,Liste1!$A$2:$B$41,2))","v":""},null,null,{"$f":"IF($B366=Liste1!$F$9,1,0)","v":0},{"$f":"IF(I366+J366=0,\"\",(E366*100+(YEAR($A366)+MONTH($A366)+MONTH($A366)))/((YEAR($A366))))","v":""},{"$f":"IF(O366+K366>0,I366,\"\")","v":""},{"$f":"IF(O366+K366>0,J366,\"\")","v":""},null,{"$f":"IF(O366+K366=0,\"\",(J366-I366))","v":""}]
["2023-04-15",2,{"$f":"IF(B367=\"\",\"\",VLOOKUP(B367,Liste1!$F$2:$I$9,2))","v":"Essai 2"},null,null,{"$f":"IF(B367=Liste1!$F$9,Liste1!$F$9*E367*100+MONTH($A367),0)","v":0},{"$f":"IF(B367=Liste1!$F$9,J367-I367,0)","v":0},{"$f":"IF(E367=\"\",\"\",VLOOKUP(E367,Liste1!$A$2:$B$41,2))","v":""},null,null,{"$f":"IF($B367=Liste1!$F$9,1,0)","v":0},{"$f":"IF(I367+J367=0,\"\",(E367*100+(YEAR($A367)+MONTH($A367)+MONTH($A367)))/((YEAR($A367))))","v":""},{"$f":"IF(O367+K367>0,I367,\"\")","v":""},{"$f":"IF(O367+K367>0,J367,\"\")","v":""},null,{"$f":"IF(O367+K367=0,\"\",(J367-I367))","v":""}]
["2023-04-15",7,{"$f":"IF(B368=\"\",\"\",VLOOKUP(B368,Liste1!$F$2:$I$9,2))","v":"Essai 7"},null,null,{"$f":"IF(B368=Liste1!$F$9,Liste1!$F$9*E368*100+MONTH($A368),0)","v":0},{"$f":"IF(B368=Liste1!$F$9,J368-I368,0)","v":0},{"$f":"IF(E368=\"\",\"\",VLOOKUP(E368,Liste1!$A$2:$B$41,2))","v":""},null,null,{"$f":"IF($B368=Liste1!$F$9,1,0)","v":0},{"$f":"IF(I368+J368=0,\"\",(E368*100+(YEAR($A368)+MONTH($A368)+MONTH($A368)))/((YEAR($A368))))","v":""},{"$f":"IF(O368+K368>0,I368,\"\")","v":""},{"$f":"IF(O368+K368>0,J368,\"\")","v":""},null,{"$f":"IF(O368+K368=0,\"\",(J368-I368))","v":""}]
["2023-04-16",5,{"$f":"IF(B369=\"\",\"\",VLOOKUP(B369,Liste1!$F$2:$I$9,2))","v":"Essai 5"},null,null,{"$f":"IF(B369=Liste1!$F$9,Liste1!$F$9*E369*100+MONTH($A369),0)","v":0},{"$f":"IF(B369=Liste1!$F$9,J369-I369,0)","v":0},{"$f":"IF(E369=\"\",\"\",VLOOKUP(E369,Liste1!$A$2:$B$41,2))","v":""},null,null,{"$f":"IF($B369=Liste1!$F$9,1,0)","v":0},{"$f":"IF(I369+J369=0,\"\",(E369*100+(YEAR($A369)+MONTH($A369)+MONTH($A369)))/((YEAR($A369))))","v":""},{"$f":"IF(O369+K369>0,I369,\"\")","v":""},{"$f":"IF(O369+K369>0,J369,\"\")","v":""},null,{"$f":"IF(O369+K369=0,\"\",(J369-I369))","v":""}]
["2023-04-17",4,{"$f":"IF(B370=\"\",\"\",VLOOKUP(B370,Liste1!$F$2:$I$9,2))","v":"Essai 4"},null,null,{"$f":"IF(B370=Liste1!$F$9,Liste1!$F$9*E370*100+MONTH($A370),0)","v":0},{"$f":"IF(B370=Liste1!$F$9,J370-I370,0)","v":0},{"$f":"IF(E370=\"\",\"\",VLOOKUP(E370,Liste1!$A$2:$B$41,2))","v":""},null,null,{"$f":"IF($B370=Liste1!$F$9,1,0)","v":0},{"$f":"IF(I370+J370=0,\"\",(E370*100+(YEAR($A370)+MONTH($A370)+MONTH($A370)))/((YEAR($A370))))","v":""},{"$f":"IF(O370+K370>0,I370,\"\")","v":""},{"$f":"IF(O370+K370>0,J370,\"\")","v":""},null,{"$f":"IF(O370+K370=0,\"\",(J370-I370))","v":""}]
["2023-04-18",5,{"$f":"IF(B371=\"\",\"\",VLOOKUP(B371,Liste1!$F$2:$I$9,2))","v":"Essai 5"},null,null,{"$f":"IF(B371=Liste1!$F$9,Liste1!$F$9*E371*100+MONTH($A371),0)","v":0},{"$f":"IF(B371=Liste1!$F$9,J371-I371,0)","v":0},{"$f":"IF(E371=\"\",\"\",VLOOKUP(E371,Liste1!$A$2:$B$41,2))","v":""},null,null,{"$f":"IF($B371=Liste1!$F$9,1,0)","v":0},{"$f":"IF(I371+J371=0,\"\",(E371*100+(YEAR($A371)+MONTH($A371)+MONTH($A371)))/((YEAR($A371))))","v":""},{"$f":"IF(O371+K371>0,I371,\"\")","v":""},{"$f":"IF(O371+K371>0,J371,\"\")","v":""},null,{"$f":"IF(O371+K371=0,\"\",(J371-I371))","v":""}]
["2023-04-18",4,{"$f":"IF(B372=\"\",\"\",VLOOKUP(B372,Liste1!$F$2:$I$9,2))","v":"Essai 4"},null,null,{"$f":"IF(B372=Liste1!$F$9,Liste1!$F$9*E372*100+MONTH($A372),0)","v":0},{"$f":"IF(B372=Liste1!$F$9,J372-I372,0)","v":0},{"$f":"IF(E372=\"\",\"\",VLOOKUP(E372,Liste1!$A$2:$B$41,2))","v":""},null,null,{"$f":"IF($B372=Liste1!$F$9,1,0)","v":0},{"$f":"IF(I372+J372=0,\"\",(E372*100+(YEAR($A372)+MONTH($A372)+MONTH($A372)))/((YEAR($A372))))","v":""},{"$f":"IF(O372+K372>0,I372,\"\")","v":""},{"$f":"IF(O372+K372>0,J372,\"\")","v":""},null,{"$f":"IF(O372+K372=0,\"\",(J372-I372))","v":""}]
["2023-04-19",2,{"$f":"IF(B373=\"\",\"\",VLOOKUP(B373,Liste1!$F$2:$I$9,2))","v":"Essai 2"},null,null,{"$f":"IF(B373=Liste1!$F$9,Liste1!$F$9*E373*100+MONTH($A373),0)","v":0},{"$f":"IF(B373=Liste1!$F$9,J373-I373,0)","v":0},{"$f":"IF(E373=\"\",\"\",VLOOKUP(E373,Liste1!$A$2:$B$41,2))","v":""},null,null,{"$f":"IF($B373=Liste1!$F$9,1,0)","v":0},{"$f":"IF(I373+J373=0,\"\",(E373*100+(YEAR($A373)+MONTH($A373)+MONTH($A373)))/((YEAR($A373))))","v":""},{"$f":"IF(O373+K373>0,I373,\"\")","v":""},{"$f":"IF(O373+K373>0,J373,\"\")","v":""},null,{"$f":"IF(O373+K373=0,\"\",(J373-I373))","v":""}]
["2023-04-19",4,{"$f":"IF(B374=\"\",\"\",VLOOKUP(B374,Liste1!$F$2:$I$9,2))","v":"Essai 4"},null,null,{"$f":"IF(B374=Liste1!$F$9,Liste1!$F$9*E374*100+MONTH($A374),0)","v":0},{"$f":"IF(B374=Liste1!$F$9,J374-I374,0)","v":0},{"$f":"IF(E374=\"\",\"\",VLOOKUP(E374,Liste1!$A$2:$B$41,2))","v":""},null,null,{"$f":"IF($B374=Liste1!$F$9,1,0)","v":0},{"$f":"IF(I374+J374=0,\"\",(E374*100+(YEAR($A374)+MONTH($A374)+MONTH($A374)))/((YEAR($A374))))","v":""},{"$f":"IF(O374+K374>0,I374,\"\")","v":""},{"$f":"IF(O374+K374>0,J374,\"\")","v":""},null,{"$f":"IF(O374+K374=0,\"\",(J374-I374))","v":""}]
["2023-04-20",3,{"$f":"IF(B375=\"\",\"\",VLOOKUP(B375,Liste1!$F$2:$I$9,2))","v":"Essai 3"},null,null,{"$f":"IF(B375=Liste1!$F$9,Liste1!$F$9*E375*100+MONTH($A375),0)","v":0},{"$f":"IF(B375=Liste1!$F$9,J375-I375,0)","v":0},{"$f":"IF(E375=\"\",\"\",VLOOKUP(E375,Liste1!$A$2:$B$41,2))","v":""},null,null,{"$f":"IF($B375=Liste1!$F$9,1,0)","v":0},{"$f":"IF(I375+J375=0,\"\",(E375*100+(YEAR($A375)+MONTH($A375)+MONTH($A375)))/((YEAR($A375))))","v":""},{"$f":"IF(O375+K375>0,I375,\"\")","v":""},{"$f":"IF(O375+K375>0,J375,\"\")","v":""},null,{"$f":"IF(O375+K375=0,\"\",(J375-I375))","v":""}]
["2023-04-21",5,{"$f":"IF(B376=\"\",\"\",VLOOKUP(B376,Liste1!$F$2:$I$9,2))","v":"Essai 5"},null,null,{"$f":"IF(B376=Liste1!$F$9,Liste1!$F$9*E376*100+MONTH($A376),0)","v":0},{"$f":"IF(B376=Liste1!$F$9,J376-I376,0)","v":0},{"$f":"IF(E376=\"\",\"\",VLOOKUP(E376,Liste1!$A$2:$B$41,2))","v":""},null,null,{"$f":"IF($B376=Liste1!$F$9,1,0)","v":0},{"$f":"IF(I376+J376=0,\"\",(E376*100+(YEAR($A376)+MONTH($A376)+MONTH($A376)))/((YEAR($A376))))","v":""},{"$f":"IF(O376+K376>0,I376,\"\")","v":""},{"$f":"IF(O376+K376>0,J376,\"\")","v":""},null,{"$f":"IF(O376+K376=0,\"\",(J376-I376))","v":""}]
["2023-04-21",3,{"$f":"IF(B377=\"\",\"\",VLOOKUP(B377,Liste1!$F$2:$I$9,2))","v":"Essai 3"},null,null,{"$f":"IF(B377=Liste1!$F$9,Liste1!$F$9*E377*100+MONTH($A377),0)","v":0},{"$f":"IF(B377=Liste1!$F$9,J377-I377,0)","v":0},{"$f":"IF(E377=\"\",\"\",VLOOKUP(E377,Liste1!$A$2:$B$41,2))","v":""},null,null,{"$f":"IF($B377=Liste1!$F$9,1,0)","v":0},{"$f":"IF(I377+J377=0,\"\",(E377*100+(YEAR($A377)+MONTH($A377)+MONTH($A377)))/((YEAR($A377))))","v":""},{"$f":"IF(O377+K377>0,I377,\"\")","v":""},{"$f":"IF(O377+K377>0,J377,\"\")","v":""},null,{"$f":"IF(O377+K377=0,\"\",(J377-I377))","v":""}]
["2023-04-22",3,{"$f":"IF(B378=\"\",\"\",VLOOKUP(B378,Liste1!$F$2:$I$9,2))","v":"Essai 3"},null,null,{"$f":"IF(B378=Liste1!$F$9,Liste1!$F$9*E378*100+MONTH($A378),0)","v":0},{"$f":"IF(B378=Liste1!$F$9,J378-I378,0)","v":0},{"$f":"IF(E378=\"\",\"\",VLOOKUP(E378,Liste1!$A$2:$B$41,2))","v":""},null,null,{"$f":"IF($B378=Liste1!$F$9,1,0)","v":0},{"$f":"IF(I378+J378=0,\"\",(E378*100+(YEAR($A378)+MONTH($A378)+MONTH($A378)))/((YEAR($A378))))","v":""},{"$f":"IF(O378+K378>0,I378,\"\")","v":""},{"$f":"IF(O378+K378>0,J378,\"\")","v":""},null,{"$f":"IF(O378+K378=0,\"\",(J378-I378))","v":""}]
["2023-04-22",5,{"$f":"IF(B379=\"\",\"\",VLOOKUP(B379,Liste1!$F$2:$I$9,2))","v":"Essai 5"},null,null,{"$f":"IF(B379=Liste1!$F$9,Liste1!$F$9*E379*100+MONTH($A379),0)","v":0},{"$f":"IF(B379=Liste1!$F$9,J379-I379,0)","v":0},{"$f":"IF(E379=\"\",\"\",VLOOKUP(E379,Liste1!$A$2:$B$41,2))","v":""},null,null,{"$f":"IF($B379=Liste1!$F$9,1,0)","v":0},{"$f":"IF(I379+J379=0,\"\",(E379*100+(YEAR($A379)+MONTH($A379)+MONTH($A379)))/((YEAR($A379))))","v":""},{"$f":"IF(O379+K379>0,I379,\"\")","v":""},{"$f":"IF(O379+K379>0,J379,\"\")","v":""},null,{"$f":"IF(O379+K379=0,\"\",(J379-I379))","v":""}]
["2023-04-22",2,{"$f":"IF(B380=\"\",\"\",VLOOKUP(B380,Liste1!$F$2:$I$9,2))","v":"Essai 2"},null,null,{"$f":"IF(B380=Liste1!$F$9,Liste1!$F$9*E380*100+MONTH($A380),0)","v":0},{"$f":"IF(B380=Liste1!$F$9,J380-I380,0)","v":0},{"$f":"IF(E380=\"\",\"\",VLOOKUP(E380,Liste1!$A$2:$B$41,2))","v":""},null,null,{"$f":"IF($B380=Liste1!$F$9,1,0)","v":0},{"$f":"IF(I380+J380=0,\"\",(E380*100+(YEAR($A380)+MONTH($A380)+MONTH($A380)))/((YEAR($A380))))","v":""},{"$f":"IF(O380+K380>0,I380,\"\")","v":""},{"$f":"IF(O380+K380>0,J380,\"\")","v":""},null,{"$f":"IF(O380+K380=0,\"\",(J380-I380))","v":""}]
["2023-04-22",4,{"$f":"IF(B381=\"\",\"\",VLOOKUP(B381,Liste1!$F$2:$I$9,2))","v":"Essai 4"},null,null,{"$f":"IF(B381=Liste1!$F$9,Liste1!$F$9*E381*100+MONTH($A381),0)","v":0},{"$f":"IF(B381=Liste1!$F$9,J381-I381,0)","v":0},{"$f":"IF(E381=\"\",\"\",VLOOKUP(E381,Liste1!$A$2:$B$41,2))","v":""},null,null,{"$f":"IF($B381=Liste1!$F$9,1,0)","v":0},{"$f":"IF(I381+J381=0,\"\",(E381*100+(YEAR($A381)+MONTH($A381)+MONTH($A381)))/((YEAR($A381))))","v":""},{"$f":"IF(O381+K381>0,I381,\"\")","v":""},{"$f":"IF(O381+K381>0,J381,\"\")","v":""},null,{"$f":"IF(O381+K381=0,\"\",(J381-I381))","v":""}]
["2023-04-25",3,{"$f":"IF(B382=\"\",\"\",VLOOKUP(B382,Liste1!$F$2:$I$9,2))","v":"Essai 3"},null,null,{"$f":"IF(B382=Liste1!$F$9,Liste1!$F$9*E382*100+MONTH($A382),0)","v":0},{"$f":"IF(B382=Liste1!$F$9,J382-I382,0)","v":0},{"$f":"IF(E382=\"\",\"\",VLOOKUP(E382,Liste1!$A$2:$B$41,2))","v":""},null,null,{"$f":"IF($B382=Liste1!$F$9,1,0)","v":0},{"$f":"IF(I382+J382=0,\"\",(E382*100+(YEAR($A382)+MONTH($A382)+MONTH($A382)))/((YEAR($A382))))","v":""},{"$f":"IF(O382+K382>0,I382,\"\")","v":""},{"$f":"IF(O382+K382>0,J382,\"\")","v":""},null,{"$f":"IF(O382+K382=0,\"\",(J382-I382))","v":""}]
["2023-04-26",2,{"$f":"IF(B383=\"\",\"\",VLOOKUP(B383,Liste1!$F$2:$I$9,2))","v":"Essai 2"},null,null,{"$f":"IF(B383=Liste1!$F$9,Liste1!$F$9*E383*100+MONTH($A383),0)","v":0},{"$f":"IF(B383=Liste1!$F$9,J383-I383,0)","v":0},{"$f":"IF(E383=\"\",\"\",VLOOKUP(E383,Liste1!$A$2:$B$41,2))","v":""},null,null,{"$f":"IF($B383=Liste1!$F$9,1,0)","v":0},{"$f":"IF(I383+J383=0,\"\",(E383*100+(YEAR($A383)+MONTH($A383)+MONTH($A383)))/((YEAR($A383))))","v":""},{"$f":"IF(O383+K383>0,I383,\"\")","v":""},{"$f":"IF(O383+K383>0,J383,\"\")","v":""},null,{"$f":"IF(O383+K383=0,\"\",(J383-I383))","v":""}]
["2023-04-26",2,{"$f":"IF(B384=\"\",\"\",VLOOKUP(B384,Liste1!$F$2:$I$9,2))","v":"Essai 2"},null,null,{"$f":"IF(B384=Liste1!$F$9,Liste1!$F$9*E384*100+MONTH($A384),0)","v":0},{"$f":"IF(B384=Liste1!$F$9,J384-I384,0)","v":0},{"$f":"IF(E384=\"\",\"\",VLOOKUP(E384,Liste1!$A$2:$B$41,2))","v":""},null,null,{"$f":"IF($B384=Liste1!$F$9,1,0)","v":0},{"$f":"IF(I384+J384=0,\"\",(E384*100+(YEAR($A384)+MONTH($A384)+MONTH($A384)))/((YEAR($A384))))","v":""},{"$f":"IF(O384+K384>0,I384,\"\")","v":""},{"$f":"IF(O384+K384>0,J384,\"\")","v":""},null,{"$f":"IF(O384+K384=0,\"\",(J384-I384))","v":""}]
["2023-04-27",2,{"$f":"IF(B385=\"\",\"\",VLOOKUP(B385,Liste1!$F$2:$I$9,2))","v":"Essai 2"},null,null,{"$f":"IF(B385=Liste1!$F$9,Liste1!$F$9*E385*100+MONTH($A385),0)","v":0},{"$f":"IF(B385=Liste1!$F$9,J385-I385,0)","v":0},{"$f":"IF(E385=\"\",\"\",VLOOKUP(E385,Liste1!$A$2:$B$41,2))","v":""},null,null,{"$f":"IF($B385=Liste1!$F$9,1,0)","v":0},{"$f":"IF(I385+J385=0,\"\",(E385*100+(YEAR($A385)+MONTH($A385)+MONTH($A385)))/((YEAR($A385))))","v":""},{"$f":"IF(O385+K385>0,I385,\"\")","v":""},{"$f":"IF(O385+K385>0,J385,\"\")","v":""},null,{"$f":"IF(O385+K385=0,\"\",(J385-I385))","v":""}]
["2023-04-28",5,{"$f":"IF(B386=\"\",\"\",VLOOKUP(B386,Liste1!$F$2:$I$9,2))","v":"Essai 5"},null,null,{"$f":"IF(B386=Liste1!$F$9,Liste1!$F$9*E386*100+MONTH($A386),0)","v":0},{"$f":"IF(B386=Liste1!$F$9,J386-I386,0)","v":0},{"$f":"IF(E386=\"\",\"\",VLOOKUP(E386,Liste1!$A$2:$B$41,2))","v":""},null,null,{"$f":"IF($B386=Liste1!$F$9,1,0)","v":0},{"$f":"IF(I386+J386=0,\"\",(E386*100+(YEAR($A386)+MONTH($A386)+MONTH($A386)))/((YEAR($A386))))","v":""},{"$f":"IF(O386+K386>0,I386,\"\")","v":""},{"$f":"IF(O386+K386>0,J386,\"\")","v":""},null,{"$f":"IF(O386+K386=0,\"\",(J386-I386))","v":""}]
["2023-04-29",7,{"$f":"IF(B387=\"\",\"\",VLOOKUP(B387,Liste1!$F$2:$I$9,2))","v":"Essai 7"},null,null,{"$f":"IF(B387=Liste1!$F$9,Liste1!$F$9*E387*100+MONTH($A387),0)","v":0},{"$f":"IF(B387=Liste1!$F$9,J387-I387,0)","v":0},{"$f":"IF(E387=\"\",\"\",VLOOKUP(E387,Liste1!$A$2:$B$41,2))","v":""},null,null,{"$f":"IF($B387=Liste1!$F$9,1,0)","v":0},{"$f":"IF(I387+J387=0,\"\",(E387*100+(YEAR($A387)+MONTH($A387)+MONTH($A387)))/((YEAR($A387))))","v":""},{"$f":"IF(O387+K387>0,I387,\"\")","v":""},{"$f":"IF(O387+K387>0,J387,\"\")","v":""},null,{"$f":"IF(O387+K387=0,\"\",(J387-I387))","v":""}]
["2023-04-30",2,{"$f":"IF(B388=\"\",\"\",VLOOKUP(B388,Liste1!$F$2:$I$9,2))","v":"Essai 2"},null,null,{"$f":"IF(B388=Liste1!$F$9,Liste1!$F$9*E388*100+MONTH($A388),0)","v":0},{"$f":"IF(B388=Liste1!$F$9,J388-I388,0)","v":0},{"$f":"IF(E388=\"\",\"\",VLOOKUP(E388,Liste1!$A$2:$B$41,2))","v":""},null,null,{"$f":"IF($B388=Liste1!$F$9,1,0)","v":0},{"$f":"IF(I388+J388=0,\"\",(E388*100+(YEAR($A388)+MONTH($A388)+MONTH($A388)))/((YEAR($A388))))","v":""},{"$f":"IF(O388+K388>0,I388,\"\")","v":""},{"$f":"IF(O388+K388>0,J388,\"\")","v":""},null,{"$f":"IF(O388+K388=0,\"\",(J388-I388))","v":""}]
["2023-04-30",2,{"$f":"IF(B389=\"\",\"\",VLOOKUP(B389,Liste1!$F$2:$I$9,2))","v":"Essai 2"},null,null,{"$f":"IF(B389=Liste1!$F$9,Liste1!$F$9*E389*100+MONTH($A389),0)","v":0},{"$f":"IF(B389=Liste1!$F$9,J389-I389,0)","v":0},{"$f":"IF(E389=\"\",\"\",VLOOKUP(E389,Liste1!$A$2:$B$41,2))","v":""},null,null,{"$f":"IF($B389=Liste1!$F$9,1,0)","v":0},{"$f":"IF(I389+J389=0,\"\",(E389*100+(YEAR($A389)+MONTH($A389)+MONTH($A389)))/((YEAR($A389))))","v":""},{"$f":"IF(O389+K389>0,I389,\"\")","v":""},{"$f":"IF(O389+K389>0,J389,\"\")","v":""},null,{"$f":"IF(O389+K389=0,\"\",(J389-I389))","v":""}]
["2023-04-30",2,{"$f":"IF(B390=\"\",\"\",VLOOKUP(B390,Liste1!$F$2:$I$9,2))","v":"Essai 2"},null,null,{"$f":"IF(B390=Liste1!$F$9,Liste1!$F$9*E390*100+MONTH($A390),0)","v":0},{"$f":"IF(B390=Liste1!$F$9,J390-I390,0)","v":0},{"$f":"IF(E390=\"\",\"\",VLOOKUP(E390,Liste1!$A$2:$B$41,2))","v":""},null,null,{"$f":"IF($B390=Liste1!$F$9,1,0)","v":0},{"$f":"IF(I390+J390=0,\"\",(E390*100+(YEAR($A390)+MONTH($A390)+MONTH($A390)))/((YEAR($A390))))","v":""},{"$f":"IF(O390+K390>0,I390,\"\")","v":""},{"$f":"IF(O390+K390>0,J390,\"\")","v":""},null,{"$f":"IF(O390+K390=0,\"\",(J390-I390))","v":""}]
["2023-05-01",2,{"$f":"IF(B391=\"\",\"\",VLOOKUP(B391,Liste1!$F$2:$I$9,2))","v":"Essai 2"},null,null,{"$f":"IF(B391=Liste1!$F$9,Liste1!$F$9*E391*100+MONTH($A391),0)","v":0},{"$f":"IF(B391=Liste1!$F$9,J391-I391,0)","v":0},{"$f":"IF(E391=\"\",\"\",VLOOKUP(E391,Liste1!$A$2:$B$41,2))","v":""},null,null,{"$f":"IF($B391=Liste1!$F$9,1,0)","v":0},{"$f":"IF(I391+J391=0,\"\",(E391*100+(YEAR($A391)+MONTH($A391)+MONTH($A391)))/((YEAR($A391))))","v":""},{"$f":"IF(O391+K391>0,I391,\"\")","v":""},{"$f":"IF(O391+K391>0,J391,\"\")","v":""},null,{"$f":"IF(O391+K391=0,\"\",(J391-I391))","v":""}]
["2023-05-01",2,{"$f":"IF(B392=\"\",\"\",VLOOKUP(B392,Liste1!$F$2:$I$9,2))","v":"Essai 2"},null,null,{"$f":"IF(B392=Liste1!$F$9,Liste1!$F$9*E392*100+MONTH($A392),0)","v":0},{"$f":"IF(B392=Liste1!$F$9,J392-I392,0)","v":0},{"$f":"IF(E392=\"\",\"\",VLOOKUP(E392,Liste1!$A$2:$B$41,2))","v":""},null,null,{"$f":"IF($B392=Liste1!$F$9,1,0)","v":0},{"$f":"IF(I392+J392=0,\"\",(E392*100+(YEAR($A392)+MONTH($A392)+MONTH($A392)))/((YEAR($A392))))","v":""},{"$f":"IF(O392+K392>0,I392,\"\")","v":""},{"$f":"IF(O392+K392>0,J392,\"\")","v":""},null,{"$f":"IF(O392+K392=0,\"\",(J392-I392))","v":""}]
["2023-05-04",2,{"$f":"IF(B393=\"\",\"\",VLOOKUP(B393,Liste1!$F$2:$I$9,2))","v":"Essai 2"},null,null,{"$f":"IF(B393=Liste1!$F$9,Liste1!$F$9*E393*100+MONTH($A393),0)","v":0},{"$f":"IF(B393=Liste1!$F$9,J393-I393,0)","v":0},{"$f":"IF(E393=\"\",\"\",VLOOKUP(E393,Liste1!$A$2:$B$41,2))","v":""},null,null,{"$f":"IF($B393=Liste1!$F$9,1,0)","v":0},{"$f":"IF(B393=7,\"\",(E393*100+(YEAR($A393)+MONTH($A393)+MONTH($A393)))/((YEAR($A393))))","v":1.004943153732081},{"$f":"IF(O393+K393>0,I393,\"\")","v":""},{"$f":"IF(O393+K393>0,J393,\"\")","v":""},null,{"$f":"IF(O393+K393=0,\"\",(J393-I393))","v":""}]
["2023-05-04",2,{"$f":"IF(B394=\"\",\"\",VLOOKUP(B394,Liste1!$F$2:$I$9,2))","v":"Essai 2"},null,null,{"$f":"IF(B394=Liste1!$F$9,Liste1!$F$9*E394*100+MONTH($A394),0)","v":0},{"$f":"IF(B394=Liste1!$F$9,J394-I394,0)","v":0},{"$f":"IF(E394=\"\",\"\",VLOOKUP(E394,Liste1!$A$2:$B$41,2))","v":""},null,null,{"$f":"IF($B394=Liste1!$F$9,1,0)","v":0},{"$f":"IF(I394+J394=0,\"\",(E394*100+(YEAR($A394)+MONTH($A394)+MONTH($A394)))/((YEAR($A394))))","v":""},{"$f":"IF(O394+K394>0,I394,\"\")","v":""},{"$f":"IF(O394+K394>0,J394,\"\")","v":""},null,{"$f":"IF(O394+K394=0,\"\",(J394-I394))","v":""}]
["2023-05-07",2,{"$f":"IF(B395=\"\",\"\",VLOOKUP(B395,Liste1!$F$2:$I$9,2))","v":"Essai 2"},null,null,{"$f":"IF(B395=Liste1!$F$9,Liste1!$F$9*E395*100+MONTH($A395),0)","v":0},{"$f":"IF(B395=Liste1!$F$9,J395-I395,0)","v":0},{"$f":"IF(E395=\"\",\"\",VLOOKUP(E395,Liste1!$A$2:$B$41,2))","v":""},null,null,{"$f":"IF($B395=Liste1!$F$9,1,0)","v":0},{"$f":"IF(B395=7,\"\",(E395*100+(YEAR($A395)+MONTH($A395)+MONTH($A395)))/((YEAR($A395))))","v":1.004943153732081},{"$f":"IF(O395+K395>0,I395,\"\")","v":""},{"$f":"IF(O395+K395>0,J395,\"\")","v":""},null,{"$f":"IF(O395+K395=0,\"\",(J395-I395))","v":""}]
["2023-05-09",4,{"$f":"IF(B396=\"\",\"\",VLOOKUP(B396,Liste1!$F$2:$I$9,2))","v":"Essai 4"},null,null,{"$f":"IF(B396=Liste1!$F$9,Liste1!$F$9*E396*100+MONTH($A396),0)","v":0},{"$f":"IF(B396=Liste1!$F$9,J396-I396,0)","v":0},{"$f":"IF(E396=\"\",\"\",VLOOKUP(E396,Liste1!$A$2:$B$41,2))","v":""},null,null,{"$f":"IF($B396=Liste1!$F$9,1,0)","v":0},{"$f":"IF(B396=7,\"\",(E396*100+(YEAR($A396)+MONTH($A396)+MONTH($A396)))/((YEAR($A396))))","v":1.004943153732081},{"$f":"IF(O396+K396>0,I396,\"\")","v":""},{"$f":"IF(O396+K396>0,J396,\"\")","v":""},null,{"$f":"IF(O396+K396=0,\"\",(J396-I396))","v":""}]
["2023-05-09",4,{"$f":"IF(B397=\"\",\"\",VLOOKUP(B397,Liste1!$F$2:$I$9,2))","v":"Essai 4"},null,null,{"$f":"IF(B397=Liste1!$F$9,Liste1!$F$9*E397*100+MONTH($A397),0)","v":0},{"$f":"IF(B397=Liste1!$F$9,J397-I397,0)","v":0},{"$f":"IF(E397=\"\",\"\",VLOOKUP(E397,Liste1!$A$2:$B$41,2))","v":""},null,null,{"$f":"IF($B397=Liste1!$F$9,1,0)","v":0},{"$f":"IF(B397=7,\"\",(E397*100+(YEAR($A397)+MONTH($A397)+MONTH($A397)))/((YEAR($A397))))","v":1.004943153732081},{"$f":"IF(O397+K397>0,I397,\"\")","v":""},{"$f":"IF(O397+K397>0,J397,\"\")","v":""},null,{"$f":"IF(O397+K397=0,\"\",(J397-I397))","v":""}]
["2023-05-10",3,{"$f":"IF(B398=\"\",\"\",VLOOKUP(B398,Liste1!$F$2:$I$9,2))","v":"Essai 3"},null,null,{"$f":"IF(B398=Liste1!$F$9,Liste1!$F$9*E398*100+MONTH($A398),0)","v":0},{"$f":"IF(B398=Liste1!$F$9,J398-I398,0)","v":0},{"$f":"IF(E398=\"\",\"\",VLOOKUP(E398,Liste1!$A$2:$B$41,2))","v":""},null,null,{"$f":"IF($B398=Liste1!$F$9,1,0)","v":0},{"$f":"IF(B398=7,\"\",(E398*100+(YEAR($A398)+MONTH($A398)+MONTH($A398)))/((YEAR($A398))))","v":1.004943153732081},{"$f":"IF(O398+K398>0,I398,\"\")","v":""},{"$f":"IF(O398+K398>0,J398,\"\")","v":""},null,{"$f":"IF(O398+K398=0,\"\",(J398-I398))","v":""}]
["2023-05-10",3,{"$f":"IF(B399=\"\",\"\",VLOOKUP(B399,Liste1!$F$2:$I$9,2))","v":"Essai 3"},null,null,{"$f":"IF(B399=Liste1!$F$9,Liste1!$F$9*E399*100+MONTH($A399),0)","v":0},{"$f":"IF(B399=Liste1!$F$9,J399-I399,0)","v":0},{"$f":"IF(E399=\"\",\"\",VLOOKUP(E399,Liste1!$A$2:$B$41,2))","v":""},null,null,{"$f":"IF($B399=Liste1!$F$9,1,0)","v":0},{"$f":"IF(B399=7,\"\",(E399*100+(YEAR($A399)+MONTH($A399)+MONTH($A399)))/((YEAR($A399))))","v":1.004943153732081},{"$f":"IF(O399+K399>0,I399,\"\")","v":""},{"$f":"IF(O399+K399>0,J399,\"\")","v":""},null,{"$f":"IF(O399+K399=0,\"\",(J399-I399))","v":""}]
["2023-05-10",3,{"$f":"IF(B400=\"\",\"\",VLOOKUP(B400,Liste1!$F$2:$I$9,2))","v":"Essai 3"},null,null,{"$f":"IF(B400=Liste1!$F$9,Liste1!$F$9*E400*100+MONTH($A400),0)","v":0},{"$f":"IF(B400=Liste1!$F$9,J400-I400,0)","v":0},{"$f":"IF(E400=\"\",\"\",VLOOKUP(E400,Liste1!$A$2:$B$41,2))","v":""},null,null,{"$f":"IF($B400=Liste1!$F$9,1,0)","v":0},{"$f":"IF(B400=7,\"\",(E400*100+(YEAR($A400)+MONTH($A400)+MONTH($A400)))/((YEAR($A400))))","v":1.004943153732081},{"$f":"IF(O400+K400>0,I400,\"\")","v":""},{"$f":"IF(O400+K400>0,J400,\"\")","v":""},null,{"$f":"IF(O400+K400=0,\"\",(J400-I400))","v":""}]
["2023-05-10",3,{"$f":"IF(B401=\"\",\"\",VLOOKUP(B401,Liste1!$F$2:$I$9,2))","v":"Essai 3"},null,null,{"$f":"IF(B401=Liste1!$F$9,Liste1!$F$9*E401*100+MONTH($A401),0)","v":0},{"$f":"IF(B401=Liste1!$F$9,J401-I401,0)","v":0},{"$f":"IF(E401=\"\",\"\",VLOOKUP(E401,Liste1!$A$2:$B$41,2))","v":""},null,null,{"$f":"IF($B401=Liste1!$F$9,1,0)","v":0},{"$f":"IF(B401=7,\"\",(E401*100+(YEAR($A401)+MONTH($A401)+MONTH($A401)))/((YEAR($A401))))","v":1.004943153732081},{"$f":"IF(O401+K401>0,I401,\"\")","v":""},{"$f":"IF(O401+K401>0,J401,\"\")","v":""},null,{"$f":"IF(O401+K401=0,\"\",(J401-I401))","v":""}]
["2023-05-10",3,{"$f":"IF(B402=\"\",\"\",VLOOKUP(B402,Liste1!$F$2:$I$9,2))","v":"Essai 3"},null,null,{"$f":"IF(B402=Liste1!$F$9,Liste1!$F$9*E402*100+MONTH($A402),0)","v":0},{"$f":"IF(B402=Liste1!$F$9,J402-I402,0)","v":0},{"$f":"IF(E402=\"\",\"\",VLOOKUP(E402,Liste1!$A$2:$B$41,2))","v":""},null,null,{"$f":"IF($B402=Liste1!$F$9,1,0)","v":0},{"$f":"IF(B402=7,\"\",(E402*100+(YEAR($A402)+MONTH($A402)+MONTH($A402)))/((YEAR($A402))))","v":1.004943153732081},{"$f":"IF(O402+K402>0,I402,\"\")","v":""},{"$f":"IF(O402+K402>0,J402,\"\")","v":""},null,{"$f":"IF(O402+K402=0,\"\",(J402-I402))","v":""}]
["2023-05-10",3,{"$f":"IF(B403=\"\",\"\",VLOOKUP(B403,Liste1!$F$2:$I$9,2))","v":"Essai 3"},null,null,{"$f":"IF(B403=Liste1!$F$9,Liste1!$F$9*E403*100+MONTH($A403),0)","v":0},{"$f":"IF(B403=Liste1!$F$9,J403-I403,0)","v":0},{"$f":"IF(E403=\"\",\"\",VLOOKUP(E403,Liste1!$A$2:$B$41,2))","v":""},null,null,{"$f":"IF($B403=Liste1!$F$9,1,0)","v":0},{"$f":"IF(B403=7,\"\",(E403*100+(YEAR($A403)+MONTH($A403)+MONTH($A403)))/((YEAR($A403))))","v":1.004943153732081},{"$f":"IF(O403+K403>0,I403,\"\")","v":""},{"$f":"IF(O403+K403>0,J403,\"\")","v":""},null,{"$f":"IF(O403+K403=0,\"\",(J403-I403))","v":""}]
["2023-05-10",3,{"$f":"IF(B404=\"\",\"\",VLOOKUP(B404,Liste1!$F$2:$I$9,2))","v":"Essai 3"},null,null,{"$f":"IF(B404=Liste1!$F$9,Liste1!$F$9*E404*100+MONTH($A404),0)","v":0},{"$f":"IF(B404=Liste1!$F$9,J404-I404,0)","v":0},{"$f":"IF(E404=\"\",\"\",VLOOKUP(E404,Liste1!$A$2:$B$41,2))","v":""},null,null,{"$f":"IF($B404=Liste1!$F$9,1,0)","v":0},{"$f":"IF(B404=7,\"\",(E404*100+(YEAR($A404)+MONTH($A404)+MONTH($A404)))/((YEAR($A404))))","v":1.004943153732081},{"$f":"IF(O404+K404>0,I404,\"\")","v":""},{"$f":"IF(O404+K404>0,J404,\"\")","v":""},null,{"$f":"IF(O404+K404=0,\"\",(J404-I404))","v":""}]
["2023-05-10",3,{"$f":"IF(B405=\"\",\"\",VLOOKUP(B405,Liste1!$F$2:$I$9,2))","v":"Essai 3"},null,null,{"$f":"IF(B405=Liste1!$F$9,Liste1!$F$9*E405*100+MONTH($A405),0)","v":0},{"$f":"IF(B405=Liste1!$F$9,J405-I405,0)","v":0},{"$f":"IF(E405=\"\",\"\",VLOOKUP(E405,Liste1!$A$2:$B$41,2))","v":""},null,null,{"$f":"IF($B405=Liste1!$F$9,1,0)","v":0},{"$f":"IF(B405=7,\"\",(E405*100+(YEAR($A405)+MONTH($A405)+MONTH($A405)))/((YEAR($A405))))","v":1.004943153732081},{"$f":"IF(O405+K405>0,I405,\"\")","v":""},{"$f":"IF(O405+K405>0,J405,\"\")","v":""},null,{"$f":"IF(O405+K405=0,\"\",(J405-I405))","v":""}]
["2023-05-15",5,{"$f":"IF(B406=\"\",\"\",VLOOKUP(B406,Liste1!$F$2:$I$9,2))","v":"Essai 5"},null,null,{"$f":"IF(B406=Liste1!$F$9,Liste1!$F$9*E406*100+MONTH($A406),0)","v":0},{"$f":"IF(B406=Liste1!$F$9,J406-I406,0)","v":0},{"$f":"IF(E406=\"\",\"\",VLOOKUP(E406,Liste1!$A$2:$B$41,2))","v":""},null,null,{"$f":"IF($B406=Liste1!$F$9,1,0)","v":0},{"$f":"IF(B406=7,\"\",(E406*100+(YEAR($A406)+MONTH($A406)+MONTH($A406)))/((YEAR($A406))))","v":1.004943153732081},{"$f":"IF(O406+K406>0,I406,\"\")","v":""},{"$f":"IF(O406+K406>0,J406,\"\")","v":""},null,{"$f":"IF(O406+K406=0,\"\",(J406-I406))","v":""}]
["2023-05-19",2,{"$f":"IF(B407=\"\",\"\",VLOOKUP(B407,Liste1!$F$2:$I$9,2))","v":"Essai 2"},null,null,{"$f":"IF(B407=Liste1!$F$9,Liste1!$F$9*E407*100+MONTH($A407),0)","v":0},{"$f":"IF(B407=Liste1!$F$9,J407-I407,0)","v":0},{"$f":"IF(E407=\"\",\"\",VLOOKUP(E407,Liste1!$A$2:$B$41,2))","v":""},null,null,{"$f":"IF($B407=Liste1!$F$9,1,0)","v":0},{"$f":"IF(B407=7,\"\",(E407*100+(YEAR($A407)+MONTH($A407)+MONTH($A407)))/((YEAR($A407))))","v":1.004943153732081},{"$f":"IF(O407+K407>0,I407,\"\")","v":""},{"$f":"IF(O407+K407>0,J407,\"\")","v":""},null,{"$f":"IF(O407+K407=0,\"\",(J407-I407))","v":""}]
["2023-05-21",3,{"$f":"IF(B408=\"\",\"\",VLOOKUP(B408,Liste1!$F$2:$I$9,2))","v":"Essai 3"},null,null,{"$f":"IF(B408=Liste1!$F$9,Liste1!$F$9*E408*100+MONTH($A408),0)","v":0},{"$f":"IF(B408=Liste1!$F$9,J408-I408,0)","v":0},{"$f":"IF(E408=\"\",\"\",VLOOKUP(E408,Liste1!$A$2:$B$41,2))","v":""},null,null,{"$f":"IF($B408=Liste1!$F$9,1,0)","v":0},{"$f":"IF(B408=7,\"\",(E408*100+(YEAR($A408)+MONTH($A408)+MONTH($A408)))/((YEAR($A408))))","v":1.004943153732081},{"$f":"IF(O408+K408>0,I408,\"\")","v":""},{"$f":"IF(O408+K408>0,J408,\"\")","v":""},null,{"$f":"IF(O408+K408=0,\"\",(J408-I408))","v":""}]
["2023-05-22",3,{"$f":"IF(B409=\"\",\"\",VLOOKUP(B409,Liste1!$F$2:$I$9,2))","v":"Essai 3"},null,null,{"$f":"IF(B409=Liste1!$F$9,Liste1!$F$9*E409*100+MONTH($A409),0)","v":0},{"$f":"IF(B409=Liste1!$F$9,J409-I409,0)","v":0},{"$f":"IF(E409=\"\",\"\",VLOOKUP(E409,Liste1!$A$2:$B$41,2))","v":""},null,null,{"$f":"IF($B409=Liste1!$F$9,1,0)","v":0},{"$f":"IF(I409+J409=0,\"\",(E409*100+(YEAR($A409)+MONTH($A409)+MONTH($A409)))/((YEAR($A409))))","v":""},{"$f":"IF(O409+K409>0,I409,\"\")","v":""},{"$f":"IF(O409+K409>0,J409,\"\")","v":""},null,{"$f":"IF(O409+K409=0,\"\",(J409-I409))","v":""}]
["2023-05-25",2,{"$f":"IF(B410=\"\",\"\",VLOOKUP(B410,Liste1!$F$2:$I$9,2))","v":"Essai 2"},null,null,{"$f":"IF(B410=Liste1!$F$9,Liste1!$F$9*E410*100+MONTH($A410),0)","v":0},{"$f":"IF(B410=Liste1!$F$9,J410-I410,0)","v":0},{"$f":"IF(E410=\"\",\"\",VLOOKUP(E410,Liste1!$A$2:$B$41,2))","v":""},null,null,{"$f":"IF($B410=Liste1!$F$9,1,0)","v":0},{"$f":"IF(B410=7,\"\",(E410*100+(YEAR($A410)+MONTH($A410)+MONTH($A410)))/((YEAR($A410))))","v":1.004943153732081},{"$f":"IF(O410+K410>0,I410,\"\")","v":""},{"$f":"IF(O410+K410>0,J410,\"\")","v":""},null,{"$f":"IF(O410+K410=0,\"\",(J410-I410))","v":""}]
["2023-05-25",2,{"$f":"IF(B411=\"\",\"\",VLOOKUP(B411,Liste1!$F$2:$I$9,2))","v":"Essai 2"},null,null,{"$f":"IF(B411=Liste1!$F$9,Liste1!$F$9*E411*100+MONTH($A411),0)","v":0},{"$f":"IF(B411=Liste1!$F$9,J411-I411,0)","v":0},{"$f":"IF(E411=\"\",\"\",VLOOKUP(E411,Liste1!$A$2:$B$41,2))","v":""},null,null,{"$f":"IF($B411=Liste1!$F$9,1,0)","v":0},{"$f":"IF(B411=7,\"\",(E411*100+(YEAR($A411)+MONTH($A411)+MONTH($A411)))/((YEAR($A411))))","v":1.004943153732081},{"$f":"IF(O411+K411>0,I411,\"\")","v":""},{"$f":"IF(O411+K411>0,J411,\"\")","v":""},null,{"$f":"IF(O411+K411=0,\"\",(J411-I411))","v":""}]
["2023-05-26",2,{"$f":"IF(B412=\"\",\"\",VLOOKUP(B412,Liste1!$F$2:$I$9,2))","v":"Essai 2"},null,null,{"$f":"IF(B412=Liste1!$F$9,Liste1!$F$9*E412*100+MONTH($A412),0)","v":0},{"$f":"IF(B412=Liste1!$F$9,J412-I412,0)","v":0},{"$f":"IF(E412=\"\",\"\",VLOOKUP(E412,Liste1!$A$2:$B$41,2))","v":""},null,null,{"$f":"IF($B412=Liste1!$F$9,1,0)","v":0},{"$f":"IF(B412=7,\"\",(E412*100+(YEAR($A412)+MONTH($A412)+MONTH($A412)))/((YEAR($A412))))","v":1.004943153732081},{"$f":"IF(O412+K412>0,I412,\"\")","v":""},{"$f":"IF(O412+K412>0,J412,\"\")","v":""},null,{"$f":"IF(O412+K412=0,\"\",(J412-I412))","v":""}]
["2023-05-26",3,{"$f":"IF(B413=\"\",\"\",VLOOKUP(B413,Liste1!$F$2:$I$9,2))","v":"Essai 3"},null,null,{"$f":"IF(B413=Liste1!$F$9,Liste1!$F$9*E413*100+MONTH($A413),0)","v":0},{"$f":"IF(B413=Liste1!$F$9,J413-I413,0)","v":0},{"$f":"IF(E413=\"\",\"\",VLOOKUP(E413,Liste1!$A$2:$B$41,2))","v":""},null,null,{"$f":"IF($B413=Liste1!$F$9,1,0)","v":0},{"$f":"IF(B413=7,\"\",(E413*100+(YEAR($A413)+MONTH($A413)+MONTH($A413)))/((YEAR($A413))))","v":1.004943153732081},{"$f":"IF(O413+K413>0,I413,\"\")","v":""},{"$f":"IF(O413+K413>0,J413,\"\")","v":""},null,{"$f":"IF(O413+K413=0,\"\",(J413-I413))","v":""}]
["2023-05-26",2,{"$f":"IF(B414=\"\",\"\",VLOOKUP(B414,Liste1!$F$2:$I$9,2))","v":"Essai 2"},null,null,0,0,{"$f":"IF(E414=\"\",\"\",VLOOKUP(E414,Liste1!$A$2:$B$41,2))","v":""},null,null,0,{"$f":"IF(B414=7,\"\",(E414*100+(YEAR($A414)+MONTH($A414)+MONTH($A414)))/((YEAR($A414))))","v":1.004943153732081},{"$f":"IF(O414+K414>0,I414,\"\")","v":""},{"$f":"IF(O414+K414>0,J414,\"\")","v":""},null,{"$f":"IF(O414+K414=0,\"\",(J414-I414))","v":""}]
["2023-05-28",2,{"$f":"IF(B415=\"\",\"\",VLOOKUP(B415,Liste1!$F$2:$I$9,2))","v":"Essai 2"},null,null,{"$f":"IF(B415=Liste1!$F$9,Liste1!$F$9*E415*100+MONTH($A415),0)","v":0},{"$f":"IF(B415=Liste1!$F$9,J415-I415,0)","v":0},{"$f":"IF(E415=\"\",\"\",VLOOKUP(E415,Liste1!$A$2:$B$41,2))","v":""},null,null,{"$f":"IF($B415=Liste1!$F$9,1,0)","v":0},{"$f":"IF(B415=7,\"\",(E415*100+(YEAR($A415)+MONTH($A415)+MONTH($A415)))/((YEAR($A415))))","v":1.004943153732081},{"$f":"IF(O415+K415>0,I415,\"\")","v":""},{"$f":"IF(O415+K415>0,J415,\"\")","v":""},null,{"$f":"IF(O415+K415=0,\"\",(J415-I415))","v":""}]
["2023-05-29",4,{"$f":"IF(B416=\"\",\"\",VLOOKUP(B416,Liste1!$F$2:$I$9,2))","v":"Essai 4"},null,null,{"$f":"IF(B416=Liste1!$F$9,Liste1!$F$9*E416*100+MONTH($A416),0)","v":0},{"$f":"IF(B416=Liste1!$F$9,J416-I416,0)","v":0},{"$f":"IF(E416=\"\",\"\",VLOOKUP(E416,Liste1!$A$2:$B$41,2))","v":""},null,null,{"$f":"IF($B416=Liste1!$F$9,1,0)","v":0},{"$f":"IF(B416=7,\"\",(E416*100+(YEAR($A416)+MONTH($A416)+MONTH($A416)))/((YEAR($A416))))","v":1.004943153732081},{"$f":"IF(O416+K416>0,I416,\"\")","v":""},{"$f":"IF(O416+K416>0,J416,\"\")","v":""},null,{"$f":"IF(O416+K416=0,\"\",(J416-I416))","v":""}]
["2023-06-01",2,{"$f":"IF(B417=\"\",\"\",VLOOKUP(B417,Liste1!$F$2:$I$9,2))","v":"Essai 2"},null,null,{"$f":"IF(B417=Liste1!$F$9,Liste1!$F$9*E417*100+MONTH($A417),0)","v":0},{"$f":"IF(B417=Liste1!$F$9,J417-I417,0)","v":0},{"$f":"IF(E417=\"\",\"\",VLOOKUP(E417,Liste1!$A$2:$B$41,2))","v":""},null,null,{"$f":"IF($B417=Liste1!$F$9,1,0)","v":0},{"$f":"IF(B417=7,\"\",(E417*100+(YEAR($A417)+MONTH($A417)+MONTH($A417)))/((YEAR($A417))))","v":1.0059317844784972},{"$f":"IF(O417+K417>0,I417,\"\")","v":""},{"$f":"IF(O417+K417>0,J417,\"\")","v":""},null,{"$f":"IF(O417+K417=0,\"\",(J417-I417))","v":""}]
["2023-06-02",4,{"$f":"IF(B418=\"\",\"\",VLOOKUP(B418,Liste1!$F$2:$I$9,2))","v":"Essai 4"},null,null,{"$f":"IF(B418=Liste1!$F$9,Liste1!$F$9*E418*100+MONTH($A418),0)","v":0},{"$f":"IF(B418=Liste1!$F$9,J418-I418,0)","v":0},{"$f":"IF(E418=\"\",\"\",VLOOKUP(E418,Liste1!$A$2:$B$41,2))","v":""},null,null,{"$f":"IF($B418=Liste1!$F$9,1,0)","v":0},{"$f":"IF(B418=7,\"\",(E418*100+(YEAR($A418)+MONTH($A418)+MONTH($A418)))/((YEAR($A418))))","v":1.0059317844784972},{"$f":"IF(O418+K418>0,I418,\"\")","v":""},{"$f":"IF(O418+K418>0,J418,\"\")","v":""},null,{"$f":"IF(O418+K418=0,\"\",(J418-I418))","v":""}]
["2023-06-03",4,{"$f":"IF(B419=\"\",\"\",VLOOKUP(B419,Liste1!$F$2:$I$9,2))","v":"Essai 4"},null,null,{"$f":"IF(B419=Liste1!$F$9,Liste1!$F$9*E419*100+MONTH($A419),0)","v":0},{"$f":"IF(B419=Liste1!$F$9,J419-I419,0)","v":0},{"$f":"IF(E419=\"\",\"\",VLOOKUP(E419,Liste1!$A$2:$B$41,2))","v":""},null,null,{"$f":"IF($B419=Liste1!$F$9,1,0)","v":0},{"$f":"IF(I419+J419=0,\"\",(E419*100+(YEAR($A419)+MONTH($A419)+MONTH($A419)))/((YEAR($A419))))","v":""},{"$f":"IF(O419+K419>0,I419,\"\")","v":""},{"$f":"IF(O419+K419>0,J419,\"\")","v":""},null,{"$f":"IF(O419+K419=0,\"\",(J419-I419))","v":""}]
["2023-06-04",7,{"$f":"IF(B420=\"\",\"\",VLOOKUP(B420,Liste1!$F$2:$I$9,2))","v":"Essai 7"},null,null,{"$f":"IF(B420=Liste1!$F$9,Liste1!$F$9*E420*100+MONTH($A420),0)","v":0},{"$f":"IF(B420=Liste1!$F$9,J420-I420,0)","v":0},{"$f":"IF(E420=\"\",\"\",VLOOKUP(E420,Liste1!$A$2:$B$41,2))","v":""},null,null,{"$f":"IF($B420=Liste1!$F$9,1,0)","v":0},{"$f":"IF(B420=7,\"\",(E420*100+(YEAR($A420)+MONTH($A420)+MONTH($A420)))/((YEAR($A420))))","v":""},{"$f":"IF(O420+K420>0,I420,\"\")","v":""},{"$f":"IF(O420+K420>0,J420,\"\")","v":""},null,{"$f":"IF(O420+K420=0,\"\",(J420-I420))","v":""}]
["2023-06-05",4,{"$f":"IF(B421=\"\",\"\",VLOOKUP(B421,Liste1!$F$2:$I$9,2))","v":"Essai 4"},null,null,{"$f":"IF(B421=Liste1!$F$9,Liste1!$F$9*E421*100+MONTH($A421),0)","v":0},{"$f":"IF(B421=Liste1!$F$9,J421-I421,0)","v":0},{"$f":"IF(E421=\"\",\"\",VLOOKUP(E421,Liste1!$A$2:$B$41,2))","v":""},null,null,{"$f":"IF($B421=Liste1!$F$9,1,0)","v":0},{"$f":"IF(B421=7,\"\",(E421*100+(YEAR($A421)+MONTH($A421)+MONTH($A421)))/((YEAR($A421))))","v":1.0059317844784972},{"$f":"IF(O421+K421>0,I421,\"\")","v":""},{"$f":"IF(O421+K421>0,J421,\"\")","v":""},null,{"$f":"IF(O421+K421=0,\"\",(J421-I421))","v":""}]
["2023-06-08",4,{"$f":"IF(B422=\"\",\"\",VLOOKUP(B422,Liste1!$F$2:$I$9,2))","v":"Essai 4"},null,null,{"$f":"IF(B422=Liste1!$F$9,Liste1!$F$9*E422*100+MONTH($A422),0)","v":0},{"$f":"IF(B422=Liste1!$F$9,J422-I422,0)","v":0},{"$f":"IF(E422=\"\",\"\",VLOOKUP(E422,Liste1!$A$2:$B$41,2))","v":""},null,null,{"$f":"IF($B422=Liste1!$F$9,1,0)","v":0},{"$f":"IF(B422=7,\"\",(E422*100+(YEAR($A422)+MONTH($A422)+MONTH($A422)))/((YEAR($A422))))","v":1.0059317844784972},{"$f":"IF(O422+K422>0,I422,\"\")","v":""},{"$f":"IF(O422+K422>0,J422,\"\")","v":""},null,{"$f":"IF(O422+K422=0,\"\",(J422-I422))","v":""}]
["2023-06-09",3,{"$f":"IF(B423=\"\",\"\",VLOOKUP(B423,Liste1!$F$2:$I$9,2))","v":"Essai 3"},null,null,{"$f":"IF(B423=Liste1!$F$9,Liste1!$F$9*E423*100+MONTH($A423),0)","v":0},{"$f":"IF(B423=Liste1!$F$9,J423-I423,0)","v":0},{"$f":"IF(E423=\"\",\"\",VLOOKUP(E423,Liste1!$A$2:$B$41,2))","v":""},null,null,{"$f":"IF($B423=Liste1!$F$9,1,0)","v":0},{"$f":"IF(B423=7,\"\",(E423*100+(YEAR($A423)+MONTH($A423)+MONTH($A423)))/((YEAR($A423))))","v":1.0059317844784972},{"$f":"IF(O423+K423>0,I423,\"\")","v":""},{"$f":"IF(O423+K423>0,J423,\"\")","v":""},null,{"$f":"IF(O423+K423=0,\"\",(J423-I423))","v":""}]
["2023-06-09",4,{"$f":"IF(B424=\"\",\"\",VLOOKUP(B424,Liste1!$F$2:$I$9,2))","v":"Essai 4"},null,null,{"$f":"IF(B424=Liste1!$F$9,Liste1!$F$9*E424*100+MONTH($A424),0)","v":0},{"$f":"IF(B424=Liste1!$F$9,J424-I424,0)","v":0},{"$f":"IF(E424=\"\",\"\",VLOOKUP(E424,Liste1!$A$2:$B$41,2))","v":""},null,null,{"$f":"IF($B424=Liste1!$F$9,1,0)","v":0},{"$f":"IF(B424=7,\"\",(E424*100+(YEAR($A424)+MONTH($A424)+MONTH($A424)))/((YEAR($A424))))","v":1.0059317844784972},{"$f":"IF(O424+K424>0,I424,\"\")","v":""},{"$f":"IF(O424+K424>0,J424,\"\")","v":""},null,{"$f":"IF(O424+K424=0,\"\",(J424-I424))","v":""}]
["2023-06-10",3,{"$f":"IF(B425=\"\",\"\",VLOOKUP(B425,Liste1!$F$2:$I$9,2))","v":"Essai 3"},null,null,{"$f":"IF(B425=Liste1!$F$9,Liste1!$F$9*E425*100+MONTH($A425),0)","v":0},{"$f":"IF(B425=Liste1!$F$9,J425-I425,0)","v":0},{"$f":"IF(E425=\"\",\"\",VLOOKUP(E425,Liste1!$A$2:$B$41,2))","v":""},null,null,{"$f":"IF($B425=Liste1!$F$9,1,0)","v":0},{"$f":"IF(B425=7,\"\",(E425*100+(YEAR($A425)+MONTH($A425)+MONTH($A425)))/((YEAR($A425))))","v":1.0059317844784972},{"$f":"IF(O425+K425>0,I425,\"\")","v":""},{"$f":"IF(O425+K425>0,J425,\"\")","v":""},null,{"$f":"IF(O425+K425=0,\"\",(J425-I425))","v":""}]
["2023-06-10",3,{"$f":"IF(B426=\"\",\"\",VLOOKUP(B426,Liste1!$F$2:$I$9,2))","v":"Essai 3"},null,null,{"$f":"IF(B426=Liste1!$F$9,Liste1!$F$9*E426*100+MONTH($A426),0)","v":0},{"$f":"IF(B426=Liste1!$F$9,J426-I426,0)","v":0},{"$f":"IF(E426=\"\",\"\",VLOOKUP(E426,Liste1!$A$2:$B$41,2))","v":""},null,null,{"$f":"IF($B426=Liste1!$F$9,1,0)","v":0},{"$f":"IF(B426=7,\"\",(E426*100+(YEAR($A426)+MONTH($A426)+MONTH($A426)))/((YEAR($A426))))","v":1.0059317844784972},{"$f":"IF(O426+K426>0,I426,\"\")","v":""},{"$f":"IF(O426+K426>0,J426,\"\")","v":""},null,{"$f":"IF(O426+K426=0,\"\",(J426-I426))","v":""}]
["2023-06-10",3,{"$f":"IF(B427=\"\",\"\",VLOOKUP(B427,Liste1!$F$2:$I$9,2))","v":"Essai 3"},null,null,{"$f":"IF(B427=Liste1!$F$9,Liste1!$F$9*E427*100+MONTH($A427),0)","v":0},{"$f":"IF(B427=Liste1!$F$9,J427-I427,0)","v":0},{"$f":"IF(E427=\"\",\"\",VLOOKUP(E427,Liste1!$A$2:$B$41,2))","v":""},null,null,{"$f":"IF($B427=Liste1!$F$9,1,0)","v":0},{"$f":"IF(B427=7,\"\",(E427*100+(YEAR($A427)+MONTH($A427)+MONTH($A427)))/((YEAR($A427))))","v":1.0059317844784972},{"$f":"IF(O427+K427>0,I427,\"\")","v":""},{"$f":"IF(O427+K427>0,J427,\"\")","v":""},null,{"$f":"IF(O427+K427=0,\"\",(J427-I427))","v":""}]
["2023-06-10",3,{"$f":"IF(B428=\"\",\"\",VLOOKUP(B428,Liste1!$F$2:$I$9,2))","v":"Essai 3"},null,null,{"$f":"IF(B428=Liste1!$F$9,Liste1!$F$9*E428*100+MONTH($A428),0)","v":0},{"$f":"IF(B428=Liste1!$F$9,J428-I428,0)","v":0},{"$f":"IF(E428=\"\",\"\",VLOOKUP(E428,Liste1!$A$2:$B$41,2))","v":""},null,null,{"$f":"IF($B428=Liste1!$F$9,1,0)","v":0},{"$f":"IF(B428=7,\"\",(E428*100+(YEAR($A428)+MONTH($A428)+MONTH($A428)))/((YEAR($A428))))","v":1.0059317844784972},{"$f":"IF(O428+K428>0,I428,\"\")","v":""},{"$f":"IF(O428+K428>0,J428,\"\")","v":""},null,{"$f":"IF(O428+K428=0,\"\",(J428-I428))","v":""}]
["2023-06-10",3,{"$f":"IF(B429=\"\",\"\",VLOOKUP(B429,Liste1!$F$2:$I$9,2))","v":"Essai 3"},null,null,{"$f":"IF(B429=Liste1!$F$9,Liste1!$F$9*E429*100+MONTH($A429),0)","v":0},{"$f":"IF(B429=Liste1!$F$9,J429-I429,0)","v":0},{"$f":"IF(E429=\"\",\"\",VLOOKUP(E429,Liste1!$A$2:$B$41,2))","v":""},null,null,{"$f":"IF($B429=Liste1!$F$9,1,0)","v":0},{"$f":"IF(B429=7,\"\",(E429*100+(YEAR($A429)+MONTH($A429)+MONTH($A429)))/((YEAR($A429))))","v":1.0059317844784972},{"$f":"IF(O429+K429>0,I429,\"\")","v":""},{"$f":"IF(O429+K429>0,J429,\"\")","v":""},null,{"$f":"IF(O429+K429=0,\"\",(J429-I429))","v":""}]
["2023-06-10",3,{"$f":"IF(B430=\"\",\"\",VLOOKUP(B430,Liste1!$F$2:$I$9,2))","v":"Essai 3"},null,null,{"$f":"IF(B430=Liste1!$F$9,Liste1!$F$9*E430*100+MONTH($A430),0)","v":0},{"$f":"IF(B430=Liste1!$F$9,J430-I430,0)","v":0},{"$f":"IF(E430=\"\",\"\",VLOOKUP(E430,Liste1!$A$2:$B$41,2))","v":""},null,null,{"$f":"IF($B430=Liste1!$F$9,1,0)","v":0},{"$f":"IF(B430=7,\"\",(E430*100+(YEAR($A430)+MONTH($A430)+MONTH($A430)))/((YEAR($A430))))","v":1.0059317844784972},{"$f":"IF(O430+K430>0,I430,\"\")","v":""},{"$f":"IF(O430+K430>0,J430,\"\")","v":""},null,{"$f":"IF(O430+K430=0,\"\",(J430-I430))","v":""}]
["2023-06-10",3,{"$f":"IF(B431=\"\",\"\",VLOOKUP(B431,Liste1!$F$2:$I$9,2))","v":"Essai 3"},null,null,{"$f":"IF(B431=Liste1!$F$9,Liste1!$F$9*E431*100+MONTH($A431),0)","v":0},{"$f":"IF(B431=Liste1!$F$9,J431-I431,0)","v":0},{"$f":"IF(E431=\"\",\"\",VLOOKUP(E431,Liste1!$A$2:$B$41,2))","v":""},null,null,{"$f":"IF($B431=Liste1!$F$9,1,0)","v":0},{"$f":"IF(B431=7,\"\",(E431*100+(YEAR($A431)+MONTH($A431)+MONTH($A431)))/((YEAR($A431))))","v":1.0059317844784972},{"$f":"IF(O431+K431>0,I431,\"\")","v":""},{"$f":"IF(O431+K431>0,J431,\"\")","v":""},null,{"$f":"IF(O431+K431=0,\"\",(J431-I431))","v":""}]
["2023-06-10",3,{"$f":"IF(B432=\"\",\"\",VLOOKUP(B432,Liste1!$F$2:$I$9,2))","v":"Essai 3"},null,null,{"$f":"IF(B432=Liste1!$F$9,Liste1!$F$9*E432*100+MONTH($A432),0)","v":0},{"$f":"IF(B432=Liste1!$F$9,J432-I432,0)","v":0},{"$f":"IF(E432=\"\",\"\",VLOOKUP(E432,Liste1!$A$2:$B$41,2))","v":""},null,null,{"$f":"IF($B432=Liste1!$F$9,1,0)","v":0},{"$f":"IF(B432=7,\"\",(E432*100+(YEAR($A432)+MONTH($A432)+MONTH($A432)))/((YEAR($A432))))","v":1.0059317844784972},{"$f":"IF(O432+K432>0,I432,\"\")","v":""},{"$f":"IF(O432+K432>0,J432,\"\")","v":""},null,{"$f":"IF(O432+K432=0,\"\",(J432-I432))","v":""}]
["2023-06-10",3,{"$f":"IF(B433=\"\",\"\",VLOOKUP(B433,Liste1!$F$2:$I$9,2))","v":"Essai 3"},null,null,{"$f":"IF(B433=Liste1!$F$9,Liste1!$F$9*E433*100+MONTH($A433),0)","v":0},{"$f":"IF(B433=Liste1!$F$9,J433-I433,0)","v":0},{"$f":"IF(E433=\"\",\"\",VLOOKUP(E433,Liste1!$A$2:$B$41,2))","v":""},null,null,{"$f":"IF($B433=Liste1!$F$9,1,0)","v":0},{"$f":"IF(B433=7,\"\",(E433*100+(YEAR($A433)+MONTH($A433)+MONTH($A433)))/((YEAR($A433))))","v":1.0059317844784972},{"$f":"IF(O433+K433>0,I433,\"\")","v":""},{"$f":"IF(O433+K433>0,J433,\"\")","v":""},null,{"$f":"IF(O433+K433=0,\"\",(J433-I433))","v":""}]
["2023-06-11",7,{"$f":"IF(B434=\"\",\"\",VLOOKUP(B434,Liste1!$F$2:$I$9,2))","v":"Essai 7"},null,null,{"$f":"IF(B434=Liste1!$F$9,Liste1!$F$9*E434*100+MONTH($A434),0)","v":0},{"$f":"IF(B434=Liste1!$F$9,J434-I434,0)","v":0},{"$f":"IF(E434=\"\",\"\",VLOOKUP(E434,Liste1!$A$2:$B$41,2))","v":""},null,null,{"$f":"IF($B434=Liste1!$F$9,1,0)","v":0},{"$f":"IF(B434=7,\"\",(E434*100+(YEAR($A434)+MONTH($A434)+MONTH($A434)))/((YEAR($A434))))","v":""},{"$f":"IF(O434+K434>0,I434,\"\")","v":""},{"$f":"IF(O434+K434>0,J434,\"\")","v":""},null,{"$f":"IF(O434+K434=0,\"\",(J434-I434))","v":""}]
["2023-06-12",2,{"$f":"IF(B435=\"\",\"\",VLOOKUP(B435,Liste1!$F$2:$I$9,2))","v":"Essai 2"},null,null,{"$f":"IF(B435=Liste1!$F$9,Liste1!$F$9*E435*100+MONTH($A435),0)","v":0},{"$f":"IF(B435=Liste1!$F$9,J435-I435,0)","v":0},{"$f":"IF(E435=\"\",\"\",VLOOKUP(E435,Liste1!$A$2:$B$41,2))","v":""},null,null,{"$f":"IF($B435=Liste1!$F$9,1,0)","v":0},{"$f":"IF(B435=7,\"\",(E435*100+(YEAR($A435)+MONTH($A435)+MONTH($A435)))/((YEAR($A435))))","v":1.0059317844784972},{"$f":"IF(O435+K435>0,I435,\"\")","v":""},{"$f":"IF(O435+K435>0,J435,\"\")","v":""},null,{"$f":"IF(O435+K435=0,\"\",(J435-I435))","v":""}]
["2023-06-13",2,{"$f":"IF(B436=\"\",\"\",VLOOKUP(B436,Liste1!$F$2:$I$9,2))","v":"Essai 2"},null,null,{"$f":"IF(B436=Liste1!$F$9,Liste1!$F$9*E436*100+MONTH($A436),0)","v":0},{"$f":"IF(B436=Liste1!$F$9,J436-I436,0)","v":0},{"$f":"IF(E436=\"\",\"\",VLOOKUP(E436,Liste1!$A$2:$B$41,2))","v":""},null,null,{"$f":"IF($B436=Liste1!$F$9,1,0)","v":0},{"$f":"IF(B436=7,\"\",(E436*100+(YEAR($A436)+MONTH($A436)+MONTH($A436)))/((YEAR($A436))))","v":1.0059317844784972},{"$f":"IF(O436+K436>0,I436,\"\")","v":""},{"$f":"IF(O436+K436>0,J436,\"\")","v":""},null,{"$f":"IF(O436+K436=0,\"\",(J436-I436))","v":""}]
["2023-06-13",2,{"$f":"IF(B437=\"\",\"\",VLOOKUP(B437,Liste1!$F$2:$I$9,2))","v":"Essai 2"},null,null,{"$f":"IF(B437=Liste1!$F$9,Liste1!$F$9*E437*100+MONTH($A437),0)","v":0},{"$f":"IF(B437=Liste1!$F$9,J437-I437,0)","v":0},{"$f":"IF(E437=\"\",\"\",VLOOKUP(E437,Liste1!$A$2:$B$41,2))","v":""},null,null,{"$f":"IF($B437=Liste1!$F$9,1,0)","v":0},{"$f":"IF(B437=7,\"\",(E437*100+(YEAR($A437)+MONTH($A437)+MONTH($A437)))/((YEAR($A437))))","v":1.0059317844784972},{"$f":"IF(O437+K437>0,I437,\"\")","v":""},{"$f":"IF(O437+K437>0,J437,\"\")","v":""},null,{"$f":"IF(O437+K437=0,\"\",(J437-I437))","v":""}]
["2023-06-14",4,{"$f":"IF(B438=\"\",\"\",VLOOKUP(B438,Liste1!$F$2:$I$9,2))","v":"Essai 4"},null,null,{"$f":"IF(B438=Liste1!$F$9,Liste1!$F$9*E438*100+MONTH($A438),0)","v":0},{"$f":"IF(B438=Liste1!$F$9,J438-I438,0)","v":0},{"$f":"IF(E438=\"\",\"\",VLOOKUP(E438,Liste1!$A$2:$B$41,2))","v":""},null,null,{"$f":"IF($B438=Liste1!$F$9,1,0)","v":0},{"$f":"IF(B438=7,\"\",(E438*100+(YEAR($A438)+MONTH($A438)+MONTH($A438)))/((YEAR($A438))))","v":1.0059317844784972},{"$f":"IF(O438+K438>0,I438,\"\")","v":""},{"$f":"IF(O438+K438>0,J438,\"\")","v":""},null,{"$f":"IF(O438+K438=0,\"\",(J438-I438))","v":""}]
["2023-06-16",2,{"$f":"IF(B439=\"\",\"\",VLOOKUP(B439,Liste1!$F$2:$I$9,2))","v":"Essai 2"},null,null,{"$f":"IF(B439=Liste1!$F$9,Liste1!$F$9*E439*100+MONTH($A439),0)","v":0},{"$f":"IF(B439=Liste1!$F$9,J439-I439,0)","v":0},{"$f":"IF(E439=\"\",\"\",VLOOKUP(E439,Liste1!$A$2:$B$41,2))","v":""},null,null,{"$f":"IF($B439=Liste1!$F$9,1,0)","v":0},{"$f":"IF(B439=7,\"\",(E439*100+(YEAR($A439)+MONTH($A439)+MONTH($A439)))/((YEAR($A439))))","v":1.0059317844784972},{"$f":"IF(O439+K439>0,I439,\"\")","v":""},{"$f":"IF(O439+K439>0,J439,\"\")","v":""},null,{"$f":"IF(O439+K439=0,\"\",(J439-I439))","v":""}]
["2023-06-17",2,{"$f":"IF(B440=\"\",\"\",VLOOKUP(B440,Liste1!$F$2:$I$9,2))","v":"Essai 2"},null,null,{"$f":"IF(B440=Liste1!$F$9,Liste1!$F$9*E440*100+MONTH($A440),0)","v":0},{"$f":"IF(B440=Liste1!$F$9,J440-I440,0)","v":0},{"$f":"IF(E440=\"\",\"\",VLOOKUP(E440,Liste1!$A$2:$B$41,2))","v":""},null,null,{"$f":"IF($B440=Liste1!$F$9,1,0)","v":0},{"$f":"IF(B440=7,\"\",(E440*100+(YEAR($A440)+MONTH($A440)+MONTH($A440)))/((YEAR($A440))))","v":1.0059317844784972},{"$f":"IF(O440+K440>0,I440,\"\")","v":""},{"$f":"IF(O440+K440>0,J440,\"\")","v":""},null,{"$f":"IF(O440+K440=0,\"\",(J440-I440))","v":""}]
["2023-06-19",5,{"$f":"IF(B441=\"\",\"\",VLOOKUP(B441,Liste1!$F$2:$I$9,2))","v":"Essai 5"},null,null,{"$f":"IF(B441=Liste1!$F$9,Liste1!$F$9*E441*100+MONTH($A441),0)","v":0},{"$f":"IF(B441=Liste1!$F$9,J441-I441,0)","v":0},{"$f":"IF(E441=\"\",\"\",VLOOKUP(E441,Liste1!$A$2:$B$41,2))","v":""},null,null,{"$f":"IF($B441=Liste1!$F$9,1,0)","v":0},{"$f":"IF(B441=7,\"\",(E441*100+(YEAR($A441)+MONTH($A441)+MONTH($A441)))/((YEAR($A441))))","v":1.0059317844784972},{"$f":"IF(O441+K441>0,I441,\"\")","v":""},{"$f":"IF(O441+K441>0,J441,\"\")","v":""},null,{"$f":"IF(O441+K441=0,\"\",(J441-I441))","v":""}]
["2023-06-19",3,{"$f":"IF(B442=\"\",\"\",VLOOKUP(B442,Liste1!$F$2:$I$9,2))","v":"Essai 3"},null,null,{"$f":"IF(B442=Liste1!$F$9,Liste1!$F$9*E442*100+MONTH($A442),0)","v":0},{"$f":"IF(B442=Liste1!$F$9,J442-I442,0)","v":0},{"$f":"IF(E442=\"\",\"\",VLOOKUP(E442,Liste1!$A$2:$B$41,2))","v":""},null,null,{"$f":"IF($B442=Liste1!$F$9,1,0)","v":0},{"$f":"IF(B442=7,\"\",(E442*100+(YEAR($A442)+MONTH($A442)+MONTH($A442)))/((YEAR($A442))))","v":1.0059317844784972},{"$f":"IF(O442+K442>0,I442,\"\")","v":""},{"$f":"IF(O442+K442>0,J442,\"\")","v":""},null,{"$f":"IF(O442+K442=0,\"\",(J442-I442))","v":""}]
["2023-06-20",3,{"$f":"IF(B443=\"\",\"\",VLOOKUP(B443,Liste1!$F$2:$I$9,2))","v":"Essai 3"},null,null,{"$f":"IF(B443=Liste1!$F$9,Liste1!$F$9*E443*100+MONTH($A443),0)","v":0},{"$f":"IF(B443=Liste1!$F$9,J443-I443,0)","v":0},{"$f":"IF(E443=\"\",\"\",VLOOKUP(E443,Liste1!$A$2:$B$41,2))","v":""},null,null,{"$f":"IF($B443=Liste1!$F$9,1,0)","v":0},{"$f":"IF(B443=7,\"\",(E443*100+(YEAR($A443)+MONTH($A443)+MONTH($A443)))/((YEAR($A443))))","v":1.0059317844784972},{"$f":"IF(O443+K443>0,I443,\"\")","v":""},{"$f":"IF(O443+K443>0,J443,\"\")","v":""},null,{"$f":"IF(O443+K443=0,\"\",(J443-I443))","v":""}]
["2023-06-20",2,{"$f":"IF(B444=\"\",\"\",VLOOKUP(B444,Liste1!$F$2:$I$9,2))","v":"Essai 2"},null,null,{"$f":"IF(B444=Liste1!$F$9,Liste1!$F$9*E444*100+MONTH($A444),0)","v":0},{"$f":"IF(B444=Liste1!$F$9,J444-I444,0)","v":0},{"$f":"IF(E444=\"\",\"\",VLOOKUP(E444,Liste1!$A$2:$B$41,2))","v":""},null,null,{"$f":"IF($B444=Liste1!$F$9,1,0)","v":0},{"$f":"IF(B444=7,\"\",(E444*100+(YEAR($A444)+MONTH($A444)+MONTH($A444)))/((YEAR($A444))))","v":1.0059317844784972},{"$f":"IF(O444+K444>0,I444,\"\")","v":""},{"$f":"IF(O444+K444>0,J444,\"\")","v":""},null,{"$f":"IF(O444+K444=0,\"\",(J444-I444))","v":""}]
["2023-06-25",3,{"$f":"IF(B445=\"\",\"\",VLOOKUP(B445,Liste1!$F$2:$I$9,2))","v":"Essai 3"},null,null,{"$f":"IF(B445=Liste1!$F$9,Liste1!$F$9*E445*100+MONTH($A445),0)","v":0},{"$f":"IF(B445=Liste1!$F$9,J445-I445,0)","v":0},{"$f":"IF(E445=\"\",\"\",VLOOKUP(E445,Liste1!$A$2:$B$41,2))","v":""},null,null,{"$f":"IF($B445=Liste1!$F$9,1,0)","v":0},{"$f":"IF(B445=7,\"\",(E445*100+(YEAR($A445)+MONTH($A445)+MONTH($A445)))/((YEAR($A445))))","v":1.0059317844784972},{"$f":"IF(O445+K445>0,I445,\"\")","v":""},{"$f":"IF(O445+K445>0,J445,\"\")","v":""},null,{"$f":"IF(O445+K445=0,\"\",(J445-I445))","v":""}]
["2023-06-25",4,{"$f":"IF(B446=\"\",\"\",VLOOKUP(B446,Liste1!$F$2:$I$9,2))","v":"Essai 4"},null,null,{"$f":"IF(B446=Liste1!$F$9,Liste1!$F$9*E446*100+MONTH($A446),0)","v":0},{"$f":"IF(B446=Liste1!$F$9,J446-I446,0)","v":0},{"$f":"IF(E446=\"\",\"\",VLOOKUP(E446,Liste1!$A$2:$B$41,2))","v":""},null,null,{"$f":"IF($B446=Liste1!$F$9,1,0)","v":0},{"$f":"IF(B446=7,\"\",(E446*100+(YEAR($A446)+MONTH($A446)+MONTH($A446)))/((YEAR($A446))))","v":1.0059317844784972},{"$f":"IF(O446+K446>0,I446,\"\")","v":""},{"$f":"IF(O446+K446>0,J446,\"\")","v":""},null,{"$f":"IF(O446+K446=0,\"\",(J446-I446))","v":""}]
["2023-06-30",2,{"$f":"IF(B447=\"\",\"\",VLOOKUP(B447,Liste1!$F$2:$I$9,2))","v":"Essai 2"},null,null,{"$f":"IF(B447=Liste1!$F$9,Liste1!$F$9*E447*100+MONTH($A447),0)","v":0},{"$f":"IF(B447=Liste1!$F$9,J447-I447,0)","v":0},{"$f":"IF(E447=\"\",\"\",VLOOKUP(E447,Liste1!$A$2:$B$41,2))","v":""},null,null,{"$f":"IF($B447=Liste1!$F$9,1,0)","v":0},{"$f":"IF(B447=7,\"\",(E447*100+(YEAR($A447)+MONTH($A447)+MONTH($A447)))/((YEAR($A447))))","v":1.0059317844784972},{"$f":"IF(O447+K447>0,I447,\"\")","v":""},{"$f":"IF(O447+K447>0,J447,\"\")","v":""},null,{"$f":"IF(O447+K447=0,\"\",(J447-I447))","v":""}]
["2023-07-01",2,{"$f":"IF(B448=\"\",\"\",VLOOKUP(B448,Liste1!$F$2:$I$9,2))","v":"Essai 2"},null,null,{"$f":"IF(B448=Liste1!$F$9,Liste1!$F$9*E448*100+MONTH($A448),0)","v":0},{"$f":"IF(B448=Liste1!$F$9,J448-I448,0)","v":0},{"$f":"IF(E448=\"\",\"\",VLOOKUP(E448,Liste1!$A$2:$B$41,2))","v":""},null,null,{"$f":"IF($B448=Liste1!$F$9,1,0)","v":0},{"$f":"IF(B448=7,\"\",(E448*100+(YEAR($A448)+MONTH($A448)+MONTH($A448)))/((YEAR($A448))))","v":1.0069204152249136},{"$f":"IF(O448+K448>0,I448,\"\")","v":""},{"$f":"IF(O448+K448>0,J448,\"\")","v":""},null,{"$f":"IF(O448+K448=0,\"\",(J448-I448))","v":""}]
["2023-07-03",4,{"$f":"IF(B449=\"\",\"\",VLOOKUP(B449,Liste1!$F$2:$I$9,2))","v":"Essai 4"},null,null,{"$f":"IF(B449=Liste1!$F$9,Liste1!$F$9*E449*100+MONTH($A449),0)","v":0},{"$f":"IF(B449=Liste1!$F$9,J449-I449,0)","v":0},{"$f":"IF(E449=\"\",\"\",VLOOKUP(E449,Liste1!$A$2:$B$41,2))","v":""},null,null,{"$f":"IF($B449=Liste1!$F$9,1,0)","v":0},{"$f":"IF(I449+J449=0,\"\",(E449*100+(YEAR($A449)+MONTH($A449)+MONTH($A449)))/((YEAR($A449))))","v":""},{"$f":"IF(O449+K449>0,I449,\"\")","v":""},{"$f":"IF(O449+K449>0,J449,\"\")","v":""},null,{"$f":"IF(O449+K449=0,\"\",(J449-I449))","v":""}]
["2023-07-05",2,{"$f":"IF(B450=\"\",\"\",VLOOKUP(B450,Liste1!$F$2:$I$9,2))","v":"Essai 2"},null,null,{"$f":"IF(B450=Liste1!$F$9,Liste1!$F$9*E450*100+MONTH($A450),0)","v":0},{"$f":"IF(B450=Liste1!$F$9,J450-I450,0)","v":0},{"$f":"IF(E450=\"\",\"\",VLOOKUP(E450,Liste1!$A$2:$B$41,2))","v":""},null,null,{"$f":"IF($B450=Liste1!$F$9,1,0)","v":0},{"$f":"IF(B450=7,\"\",(E450*100+(YEAR($A450)+MONTH($A450)+MONTH($A450)))/((YEAR($A450))))","v":1.0069204152249136},{"$f":"IF(O450+K450>0,I450,\"\")","v":""},{"$f":"IF(O450+K450>0,J450,\"\")","v":""},null,{"$f":"IF(O450+K450=0,\"\",(J450-I450))","v":""}]
["2023-07-09",2,{"$f":"IF(B451=\"\",\"\",VLOOKUP(B451,Liste1!$F$2:$I$9,2))","v":"Essai 2"},null,null,{"$f":"IF(B451=Liste1!$F$9,Liste1!$F$9*E451*100+MONTH($A451),0)","v":0},{"$f":"IF(B451=Liste1!$F$9,J451-I451,0)","v":0},{"$f":"IF(E451=\"\",\"\",VLOOKUP(E451,Liste1!$A$2:$B$41,2))","v":""},null,null,{"$f":"IF($B451=Liste1!$F$9,1,0)","v":0},{"$f":"IF(B451=7,\"\",(E451*100+(YEAR($A451)+MONTH($A451)+MONTH($A451)))/((YEAR($A451))))","v":1.0069204152249136},{"$f":"IF(O451+K451>0,I451,\"\")","v":""},{"$f":"IF(O451+K451>0,J451,\"\")","v":""},null,{"$f":"IF(O451+K451=0,\"\",(J451-I451))","v":""}]
["2023-07-09",2,{"$f":"IF(B452=\"\",\"\",VLOOKUP(B452,Liste1!$F$2:$I$9,2))","v":"Essai 2"},null,null,{"$f":"IF(B452=Liste1!$F$9,Liste1!$F$9*E452*100+MONTH($A452),0)","v":0},{"$f":"IF(B452=Liste1!$F$9,J452-I452,0)","v":0},{"$f":"IF(E452=\"\",\"\",VLOOKUP(E452,Liste1!$A$2:$B$41,2))","v":""},null,null,{"$f":"IF($B452=Liste1!$F$9,1,0)","v":0},{"$f":"IF(B452=7,\"\",(E452*100+(YEAR($A452)+MONTH($A452)+MONTH($A452)))/((YEAR($A452))))","v":1.0069204152249136},{"$f":"IF(O452+K452>0,I452,\"\")","v":""},{"$f":"IF(O452+K452>0,J452,\"\")","v":""},null,{"$f":"IF(O452+K452=0,\"\",(J452-I452))","v":""}]
["2023-07-10",3,{"$f":"IF(B453=\"\",\"\",VLOOKUP(B453,Liste1!$F$2:$I$9,2))","v":"Essai 3"},null,null,{"$f":"IF(B453=Liste1!$F$9,Liste1!$F$9*E453*100+MONTH($A453),0)","v":0},{"$f":"IF(B453=Liste1!$F$9,J453-I453,0)","v":0},{"$f":"IF(E453=\"\",\"\",VLOOKUP(E453,Liste1!$A$2:$B$41,2))","v":""},null,null,{"$f":"IF($B453=Liste1!$F$9,1,0)","v":0},{"$f":"IF(B453=7,\"\",(E453*100+(YEAR($A453)+MONTH($A453)+MONTH($A453)))/((YEAR($A453))))","v":1.0069204152249136},{"$f":"IF(O453+K453>0,I453,\"\")","v":""},{"$f":"IF(O453+K453>0,J453,\"\")","v":""},null,{"$f":"IF(O453+K453=0,\"\",(J453-I453))","v":""}]
["2023-07-10",3,{"$f":"IF(B454=\"\",\"\",VLOOKUP(B454,Liste1!$F$2:$I$9,2))","v":"Essai 3"},null,null,{"$f":"IF(B454=Liste1!$F$9,Liste1!$F$9*E454*100+MONTH($A454),0)","v":0},{"$f":"IF(B454=Liste1!$F$9,J454-I454,0)","v":0},{"$f":"IF(E454=\"\",\"\",VLOOKUP(E454,Liste1!$A$2:$B$41,2))","v":""},null,null,{"$f":"IF($B454=Liste1!$F$9,1,0)","v":0},{"$f":"IF(B454=7,\"\",(E454*100+(YEAR($A454)+MONTH($A454)+MONTH($A454)))/((YEAR($A454))))","v":1.0069204152249136},{"$f":"IF(O454+K454>0,I454,\"\")","v":""},{"$f":"IF(O454+K454>0,J454,\"\")","v":""},null,{"$f":"IF(O454+K454=0,\"\",(J454-I454))","v":""}]
["2023-07-10",3,{"$f":"IF(B455=\"\",\"\",VLOOKUP(B455,Liste1!$F$2:$I$9,2))","v":"Essai 3"},null,null,{"$f":"IF(B455=Liste1!$F$9,Liste1!$F$9*E455*100+MONTH($A455),0)","v":0},{"$f":"IF(B455=Liste1!$F$9,J455-I455,0)","v":0},{"$f":"IF(E455=\"\",\"\",VLOOKUP(E455,Liste1!$A$2:$B$41,2))","v":""},null,null,{"$f":"IF($B455=Liste1!$F$9,1,0)","v":0},{"$f":"IF(B455=7,\"\",(E455*100+(YEAR($A455)+MONTH($A455)+MONTH($A455)))/((YEAR($A455))))","v":1.0069204152249136},{"$f":"IF(O455+K455>0,I455,\"\")","v":""},{"$f":"IF(O455+K455>0,J455,\"\")","v":""},null,{"$f":"IF(O455+K455=0,\"\",(J455-I455))","v":""}]
["2023-07-10",3,{"$f":"IF(B456=\"\",\"\",VLOOKUP(B456,Liste1!$F$2:$I$9,2))","v":"Essai 3"},null,null,{"$f":"IF(B456=Liste1!$F$9,Liste1!$F$9*E456*100+MONTH($A456),0)","v":0},{"$f":"IF(B456=Liste1!$F$9,J456-I456,0)","v":0},{"$f":"IF(E456=\"\",\"\",VLOOKUP(E456,Liste1!$A$2:$B$41,2))","v":""},null,null,{"$f":"IF($B456=Liste1!$F$9,1,0)","v":0},{"$f":"IF(B456=7,\"\",(E456*100+(YEAR($A456)+MONTH($A456)+MONTH($A456)))/((YEAR($A456))))","v":1.0069204152249136},{"$f":"IF(O456+K456>0,I456,\"\")","v":""},{"$f":"IF(O456+K456>0,J456,\"\")","v":""},null,{"$f":"IF(O456+K456=0,\"\",(J456-I456))","v":""}]
["2023-07-10",3,{"$f":"IF(B457=\"\",\"\",VLOOKUP(B457,Liste1!$F$2:$I$9,2))","v":"Essai 3"},null,null,{"$f":"IF(B457=Liste1!$F$9,Liste1!$F$9*E457*100+MONTH($A457),0)","v":0},{"$f":"IF(B457=Liste1!$F$9,J457-I457,0)","v":0},{"$f":"IF(E457=\"\",\"\",VLOOKUP(E457,Liste1!$A$2:$B$41,2))","v":""},null,null,{"$f":"IF($B457=Liste1!$F$9,1,0)","v":0},{"$f":"IF(B457=7,\"\",(E457*100+(YEAR($A457)+MONTH($A457)+MONTH($A457)))/((YEAR($A457))))","v":1.0069204152249136},{"$f":"IF(O457+K457>0,I457,\"\")","v":""},{"$f":"IF(O457+K457>0,J457,\"\")","v":""},null,{"$f":"IF(O457+K457=0,\"\",(J457-I457))","v":""}]
["2023-07-10",3,{"$f":"IF(B458=\"\",\"\",VLOOKUP(B458,Liste1!$F$2:$I$9,2))","v":"Essai 3"},null,null,{"$f":"IF(B458=Liste1!$F$9,Liste1!$F$9*E458*100+MONTH($A458),0)","v":0},{"$f":"IF(B458=Liste1!$F$9,J458-I458,0)","v":0},{"$f":"IF(E458=\"\",\"\",VLOOKUP(E458,Liste1!$A$2:$B$41,2))","v":""},null,null,{"$f":"IF($B458=Liste1!$F$9,1,0)","v":0},{"$f":"IF(B458=7,\"\",(E458*100+(YEAR($A458)+MONTH($A458)+MONTH($A458)))/((YEAR($A458))))","v":1.0069204152249136},{"$f":"IF(O458+K458>0,I458,\"\")","v":""},{"$f":"IF(O458+K458>0,J458,\"\")","v":""},null,{"$f":"IF(O458+K458=0,\"\",(J458-I458))","v":""}]
["2023-07-10",3,{"$f":"IF(B459=\"\",\"\",VLOOKUP(B459,Liste1!$F$2:$I$9,2))","v":"Essai 3"},null,null,{"$f":"IF(B459=Liste1!$F$9,Liste1!$F$9*E459*100+MONTH($A459),0)","v":0},{"$f":"IF(B459=Liste1!$F$9,J459-I459,0)","v":0},{"$f":"IF(E459=\"\",\"\",VLOOKUP(E459,Liste1!$A$2:$B$41,2))","v":""},null,null,{"$f":"IF($B459=Liste1!$F$9,1,0)","v":0},{"$f":"IF(B459=7,\"\",(E459*100+(YEAR($A459)+MONTH($A459)+MONTH($A459)))/((YEAR($A459))))","v":1.0069204152249136},{"$f":"IF(O459+K459>0,I459,\"\")","v":""},{"$f":"IF(O459+K459>0,J459,\"\")","v":""},null,{"$f":"IF(O459+K459=0,\"\",(J459-I459))","v":""}]
["2023-07-10",3,{"$f":"IF(B460=\"\",\"\",VLOOKUP(B460,Liste1!$F$2:$I$9,2))","v":"Essai 3"},null,null,{"$f":"IF(B460=Liste1!$F$9,Liste1!$F$9*E460*100+MONTH($A460),0)","v":0},{"$f":"IF(B460=Liste1!$F$9,J460-I460,0)","v":0},{"$f":"IF(E460=\"\",\"\",VLOOKUP(E460,Liste1!$A$2:$B$41,2))","v":""},null,null,{"$f":"IF($B460=Liste1!$F$9,1,0)","v":0},{"$f":"IF(B460=7,\"\",(E460*100+(YEAR($A460)+MONTH($A460)+MONTH($A460)))/((YEAR($A460))))","v":1.0069204152249136},{"$f":"IF(O460+K460>0,I460,\"\")","v":""},{"$f":"IF(O460+K460>0,J460,\"\")","v":""},null,{"$f":"IF(O460+K460=0,\"\",(J460-I460))","v":""}]
["2023-07-10",3,{"$f":"IF(B461=\"\",\"\",VLOOKUP(B461,Liste1!$F$2:$I$9,2))","v":"Essai 3"},null,null,{"$f":"IF(B461=Liste1!$F$9,Liste1!$F$9*E461*100+MONTH($A461),0)","v":0},{"$f":"IF(B461=Liste1!$F$9,J461-I461,0)","v":0},{"$f":"IF(E461=\"\",\"\",VLOOKUP(E461,Liste1!$A$2:$B$41,2))","v":""},null,null,{"$f":"IF($B461=Liste1!$F$9,1,0)","v":0},{"$f":"IF(B461=7,\"\",(E461*100+(YEAR($A461)+MONTH($A461)+MONTH($A461)))/((YEAR($A461))))","v":1.0069204152249136},{"$f":"IF(O461+K461>0,I461,\"\")","v":""},{"$f":"IF(O461+K461>0,J461,\"\")","v":""},null,{"$f":"IF(O461+K461=0,\"\",(J461-I461))","v":""}]
["2023-07-10",3,{"$f":"IF(B462=\"\",\"\",VLOOKUP(B462,Liste1!$F$2:$I$9,2))","v":"Essai 3"},null,null,{"$f":"IF(B462=Liste1!$F$9,Liste1!$F$9*E462*100+MONTH($A462),0)","v":0},{"$f":"IF(B462=Liste1!$F$9,J462-I462,0)","v":0},{"$f":"IF(E462=\"\",\"\",VLOOKUP(E462,Liste1!$A$2:$B$41,2))","v":""},null,null,{"$f":"IF($B462=Liste1!$F$9,1,0)","v":0},{"$f":"IF(B462=7,\"\",(E462*100+(YEAR($A462)+MONTH($A462)+MONTH($A462)))/((YEAR($A462))))","v":1.0069204152249136},{"$f":"IF(O462+K462>0,I462,\"\")","v":""},{"$f":"IF(O462+K462>0,J462,\"\")","v":""},null,{"$f":"IF(O462+K462=0,\"\",(J462-I462))","v":""}]
["2023-07-11",3,{"$f":"IF(B463=\"\",\"\",VLOOKUP(B463,Liste1!$F$2:$I$9,2))","v":"Essai 3"},null,null,{"$f":"IF(B463=Liste1!$F$9,Liste1!$F$9*E463*100+MONTH($A463),0)","v":0},{"$f":"IF(B463=Liste1!$F$9,J463-I463,0)","v":0},{"$f":"IF(E463=\"\",\"\",VLOOKUP(E463,Liste1!$A$2:$B$41,2))","v":""},null,null,{"$f":"IF($B463=Liste1!$F$9,1,0)","v":0},{"$f":"IF(B463=7,\"\",(E463*100+(YEAR($A463)+MONTH($A463)+MONTH($A463)))/((YEAR($A463))))","v":1.0069204152249136},{"$f":"IF(O463+K463>0,I463,\"\")","v":""},{"$f":"IF(O463+K463>0,J463,\"\")","v":""},null,{"$f":"IF(O463+K463=0,\"\",(J463-I463))","v":""}]
["2023-07-13",5,{"$f":"IF(B464=\"\",\"\",VLOOKUP(B464,Liste1!$F$2:$I$9,2))","v":"Essai 5"},null,null,{"$f":"IF(B464=Liste1!$F$9,Liste1!$F$9*E464*100+MONTH($A464),0)","v":0},{"$f":"IF(B464=Liste1!$F$9,J464-I464,0)","v":0},{"$f":"IF(E464=\"\",\"\",VLOOKUP(E464,Liste1!$A$2:$B$41,2))","v":""},null,null,{"$f":"IF($B464=Liste1!$F$9,1,0)","v":0},{"$f":"IF(B464=7,\"\",(E464*100+(YEAR($A464)+MONTH($A464)+MONTH($A464)))/((YEAR($A464))))","v":1.0069204152249136},{"$f":"IF(O464+K464>0,I464,\"\")","v":""},{"$f":"IF(O464+K464>0,J464,\"\")","v":""},null,{"$f":"IF(O464+K464=0,\"\",(J464-I464))","v":""}]
["2023-07-13",2,{"$f":"IF(B465=\"\",\"\",VLOOKUP(B465,Liste1!$F$2:$I$9,2))","v":"Essai 2"},null,null,{"$f":"IF(B465=Liste1!$F$9,Liste1!$F$9*E465*100+MONTH($A465),0)","v":0},{"$f":"IF(B465=Liste1!$F$9,J465-I465,0)","v":0},{"$f":"IF(E465=\"\",\"\",VLOOKUP(E465,Liste1!$A$2:$B$41,2))","v":""},null,null,{"$f":"IF($B465=Liste1!$F$9,1,0)","v":0},{"$f":"IF(B465=7,\"\",(E465*100+(YEAR($A465)+MONTH($A465)+MONTH($A465)))/((YEAR($A465))))","v":1.0069204152249136},{"$f":"IF(O465+K465>0,I465,\"\")","v":""},{"$f":"IF(O465+K465>0,J465,\"\")","v":""},null,{"$f":"IF(O465+K465=0,\"\",(J465-I465))","v":""}]
["2023-07-14",2,{"$f":"IF(B466=\"\",\"\",VLOOKUP(B466,Liste1!$F$2:$I$9,2))","v":"Essai 2"},null,null,{"$f":"IF(B466=Liste1!$F$9,Liste1!$F$9*E466*100+MONTH($A466),0)","v":0},{"$f":"IF(B466=Liste1!$F$9,J466-I466,0)","v":0},{"$f":"IF(E466=\"\",\"\",VLOOKUP(E466,Liste1!$A$2:$B$41,2))","v":""},null,null,{"$f":"IF($B466=Liste1!$F$9,1,0)","v":0},{"$f":"IF(B466=7,\"\",(E466*100+(YEAR($A466)+MONTH($A466)+MONTH($A466)))/((YEAR($A466))))","v":1.0069204152249136},{"$f":"IF(O466+K466>0,I466,\"\")","v":""},{"$f":"IF(O466+K466>0,J466,\"\")","v":""},null,{"$f":"IF(O466+K466=0,\"\",(J466-I466))","v":""}]
["2023-07-16",2,{"$f":"IF(B467=\"\",\"\",VLOOKUP(B467,Liste1!$F$2:$I$9,2))","v":"Essai 2"},null,null,{"$f":"IF(B467=Liste1!$F$9,Liste1!$F$9*E467*100+MONTH($A467),0)","v":0},{"$f":"IF(B467=Liste1!$F$9,J467-I467,0)","v":0},{"$f":"IF(E467=\"\",\"\",VLOOKUP(E467,Liste1!$A$2:$B$41,2))","v":""},null,null,{"$f":"IF($B467=Liste1!$F$9,1,0)","v":0},{"$f":"IF(B467=7,\"\",(E467*100+(YEAR($A467)+MONTH($A467)+MONTH($A467)))/((YEAR($A467))))","v":1.0069204152249136},{"$f":"IF(O467+K467>0,I467,\"\")","v":""},{"$f":"IF(O467+K467>0,J467,\"\")","v":""},null,{"$f":"IF(O467+K467=0,\"\",(J467-I467))","v":""}]
["2023-07-16",2,{"$f":"IF(B468=\"\",\"\",VLOOKUP(B468,Liste1!$F$2:$I$9,2))","v":"Essai 2"},null,null,{"$f":"IF(B468=Liste1!$F$9,Liste1!$F$9*E468*100+MONTH($A468),0)","v":0},{"$f":"IF(B468=Liste1!$F$9,J468-I468,0)","v":0},{"$f":"IF(E468=\"\",\"\",VLOOKUP(E468,Liste1!$A$2:$B$41,2))","v":""},null,null,{"$f":"IF($B468=Liste1!$F$9,1,0)","v":0},{"$f":"IF(B468=7,\"\",(E468*100+(YEAR($A468)+MONTH($A468)+MONTH($A468)))/((YEAR($A468))))","v":1.0069204152249136},{"$f":"IF(O468+K468>0,I468,\"\")","v":""},{"$f":"IF(O468+K468>0,J468,\"\")","v":""},null,{"$f":"IF(O468+K468=0,\"\",(J468-I468))","v":""}]
["2023-07-17",5,{"$f":"IF(B469=\"\",\"\",VLOOKUP(B469,Liste1!$F$2:$I$9,2))","v":"Essai 5"},null,null,{"$f":"IF(B469=Liste1!$F$9,Liste1!$F$9*E469*100+MONTH($A469),0)","v":0},{"$f":"IF(B469=Liste1!$F$9,J469-I469,0)","v":0},{"$f":"IF(E469=\"\",\"\",VLOOKUP(E469,Liste1!$A$2:$B$41,2))","v":""},null,null,{"$f":"IF($B469=Liste1!$F$9,1,0)","v":0},{"$f":"IF(B469=7,\"\",(E469*100+(YEAR($A469)+MONTH($A469)+MONTH($A469)))/((YEAR($A469))))","v":1.0069204152249136},{"$f":"IF(O469+K469>0,I469,\"\")","v":""},{"$f":"IF(O469+K469>0,J469,\"\")","v":""},null,{"$f":"IF(O469+K469=0,\"\",(J469-I469))","v":""}]
["2023-07-18",4,{"$f":"IF(B470=\"\",\"\",VLOOKUP(B470,Liste1!$F$2:$I$9,2))","v":"Essai 4"},null,null,{"$f":"IF(B470=Liste1!$F$9,Liste1!$F$9*E470*100+MONTH($A470),0)","v":0},{"$f":"IF(B470=Liste1!$F$9,J470-I470,0)","v":0},{"$f":"IF(E470=\"\",\"\",VLOOKUP(E470,Liste1!$A$2:$B$41,2))","v":""},null,null,{"$f":"IF($B470=Liste1!$F$9,1,0)","v":0},{"$f":"IF(B470=7,\"\",(E470*100+(YEAR($A470)+MONTH($A470)+MONTH($A470)))/((YEAR($A470))))","v":1.0069204152249136},{"$f":"IF(O470+K470>0,I470,\"\")","v":""},{"$f":"IF(O470+K470>0,J470,\"\")","v":""},null,{"$f":"IF(O470+K470=0,\"\",(J470-I470))","v":""}]
["2023-07-20",3,{"$f":"IF(B471=\"\",\"\",VLOOKUP(B471,Liste1!$F$2:$I$9,2))","v":"Essai 3"},null,null,{"$f":"IF(B471=Liste1!$F$9,Liste1!$F$9*E471*100+MONTH($A471),0)","v":0},{"$f":"IF(B471=Liste1!$F$9,J471-I471,0)","v":0},{"$f":"IF(E471=\"\",\"\",VLOOKUP(E471,Liste1!$A$2:$B$41,2))","v":""},null,null,{"$f":"IF($B471=Liste1!$F$9,1,0)","v":0},{"$f":"IF(B471=7,\"\",(E471*100+(YEAR($A471)+MONTH($A471)+MONTH($A471)))/((YEAR($A471))))","v":1.0069204152249136},{"$f":"IF(O471+K471>0,I471,\"\")","v":""},{"$f":"IF(O471+K471>0,J471,\"\")","v":""},null,{"$f":"IF(O471+K471=0,\"\",(J471-I471))","v":""}]
["2023-07-20",2,{"$f":"IF(B472=\"\",\"\",VLOOKUP(B472,Liste1!$F$2:$I$9,2))","v":"Essai 2"},null,null,{"$f":"IF(B472=Liste1!$F$9,Liste1!$F$9*E472*100+MONTH($A472),0)","v":0},{"$f":"IF(B472=Liste1!$F$9,J472-I472,0)","v":0},{"$f":"IF(E472=\"\",\"\",VLOOKUP(E472,Liste1!$A$2:$B$41,2))","v":""},null,null,{"$f":"IF($B472=Liste1!$F$9,1,0)","v":0},{"$f":"IF(B472=7,\"\",(E472*100+(YEAR($A472)+MONTH($A472)+MONTH($A472)))/((YEAR($A472))))","v":1.0069204152249136},{"$f":"IF(O472+K472>0,I472,\"\")","v":""},{"$f":"IF(O472+K472>0,J472,\"\")","v":""},null,{"$f":"IF(O472+K472=0,\"\",(J472-I472))","v":""}]
["2023-07-20",2,{"$f":"IF(B473=\"\",\"\",VLOOKUP(B473,Liste1!$F$2:$I$9,2))","v":"Essai 2"},null,null,{"$f":"IF(B473=Liste1!$F$9,Liste1!$F$9*E473*100+MONTH($A473),0)","v":0},{"$f":"IF(B473=Liste1!$F$9,J473-I473,0)","v":0},{"$f":"IF(E473=\"\",\"\",VLOOKUP(E473,Liste1!$A$2:$B$41,2))","v":""},null,null,{"$f":"IF($B473=Liste1!$F$9,1,0)","v":0},{"$f":"IF(B473=7,\"\",(E473*100+(YEAR($A473)+MONTH($A473)+MONTH($A473)))/((YEAR($A473))))","v":1.0069204152249136},{"$f":"IF(O473+K473>0,I473,\"\")","v":""},{"$f":"IF(O473+K473>0,J473,\"\")","v":""},null,{"$f":"IF(O473+K473=0,\"\",(J473-I473))","v":""}]
["2023-07-21",5,{"$f":"IF(B474=\"\",\"\",VLOOKUP(B474,Liste1!$F$2:$I$9,2))","v":"Essai 5"},null,null,{"$f":"IF(B474=Liste1!$F$9,Liste1!$F$9*E474*100+MONTH($A474),0)","v":0},{"$f":"IF(B474=Liste1!$F$9,J474-I474,0)","v":0},{"$f":"IF(E474=\"\",\"\",VLOOKUP(E474,Liste1!$A$2:$B$41,2))","v":""},null,null,{"$f":"IF($B474=Liste1!$F$9,1,0)","v":0},{"$f":"IF(B474=7,\"\",(E474*100+(YEAR($A474)+MONTH($A474)+MONTH($A474)))/((YEAR($A474))))","v":1.0069204152249136},{"$f":"IF(O474+K474>0,I474,\"\")","v":""},{"$f":"IF(O474+K474>0,J474,\"\")","v":""},null,{"$f":"IF(O474+K474=0,\"\",(J474-I474))","v":""}]
["2023-07-23",5,{"$f":"IF(B475=\"\",\"\",VLOOKUP(B475,Liste1!$F$2:$I$9,2))","v":"Essai 5"},null,null,{"$f":"IF(B475=Liste1!$F$9,Liste1!$F$9*E475*100+MONTH($A475),0)","v":0},{"$f":"IF(B475=Liste1!$F$9,J475-I475,0)","v":0},{"$f":"IF(E475=\"\",\"\",VLOOKUP(E475,Liste1!$A$2:$B$41,2))","v":""},null,null,{"$f":"IF($B475=Liste1!$F$9,1,0)","v":0},{"$f":"IF(B475=7,\"\",(E475*100+(YEAR($A475)+MONTH($A475)+MONTH($A475)))/((YEAR($A475))))","v":1.0069204152249136},{"$f":"IF(O475+K475>0,I475,\"\")","v":""},{"$f":"IF(O475+K475>0,J475,\"\")","v":""},null,{"$f":"IF(O475+K475=0,\"\",(J475-I475))","v":""}]
["2023-07-23",2,{"$f":"IF(B476=\"\",\"\",VLOOKUP(B476,Liste1!$F$2:$I$9,2))","v":"Essai 2"},null,null,{"$f":"IF(B476=Liste1!$F$9,Liste1!$F$9*E476*100+MONTH($A476),0)","v":0},{"$f":"IF(B476=Liste1!$F$9,J476-I476,0)","v":0},{"$f":"IF(E476=\"\",\"\",VLOOKUP(E476,Liste1!$A$2:$B$41,2))","v":""},null,null,{"$f":"IF($B476=Liste1!$F$9,1,0)","v":0},{"$f":"IF(B476=7,\"\",(E476*100+(YEAR($A476)+MONTH($A476)+MONTH($A476)))/((YEAR($A476))))","v":1.0069204152249136},{"$f":"IF(O476+K476>0,I476,\"\")","v":""},{"$f":"IF(O476+K476>0,J476,\"\")","v":""},null,{"$f":"IF(O476+K476=0,\"\",(J476-I476))","v":""}]
["2023-07-27",2,{"$f":"IF(B477=\"\",\"\",VLOOKUP(B477,Liste1!$F$2:$I$9,2))","v":"Essai 2"},null,null,{"$f":"IF(B477=Liste1!$F$9,Liste1!$F$9*E477*100+MONTH($A477),0)","v":0},{"$f":"IF(B477=Liste1!$F$9,J477-I477,0)","v":0},{"$f":"IF(E477=\"\",\"\",VLOOKUP(E477,Liste1!$A$2:$B$41,2))","v":""},null,null,{"$f":"IF($B477=Liste1!$F$9,1,0)","v":0},{"$f":"IF(B477=7,\"\",(E477*100+(YEAR($A477)+MONTH($A477)+MONTH($A477)))/((YEAR($A477))))","v":1.0069204152249136},{"$f":"IF(O477+K477>0,I477,\"\")","v":""},{"$f":"IF(O477+K477>0,J477,\"\")","v":""},null,{"$f":"IF(O477+K477=0,\"\",(J477-I477))","v":""}]
["2023-07-28",3,{"$f":"IF(B478=\"\",\"\",VLOOKUP(B478,Liste1!$F$2:$I$9,2))","v":"Essai 3"},null,null,{"$f":"IF(B478=Liste1!$F$9,Liste1!$F$9*E478*100+MONTH($A478),0)","v":0},{"$f":"IF(B478=Liste1!$F$9,J478-I478,0)","v":0},{"$f":"IF(E478=\"\",\"\",VLOOKUP(E478,Liste1!$A$2:$B$41,2))","v":""},null,null,{"$f":"IF($B478=Liste1!$F$9,1,0)","v":0},{"$f":"IF(B478=7,\"\",(E478*100+(YEAR($A478)+MONTH($A478)+MONTH($A478)))/((YEAR($A478))))","v":1.0069204152249136},{"$f":"IF(O478+K478>0,I478,\"\")","v":""},{"$f":"IF(O478+K478>0,J478,\"\")","v":""},null,{"$f":"IF(O478+K478=0,\"\",(J478-I478))","v":""},null,null,null,null,null,null,null,0]
["2023-07-28",2,{"$f":"IF(B479=\"\",\"\",VLOOKUP(B479,Liste1!$F$2:$I$9,2))","v":"Essai 2"},null,null,{"$f":"IF(B479=Liste1!$F$9,Liste1!$F$9*E479*100+MONTH($A479),0)","v":0},{"$f":"IF(B479=Liste1!$F$9,J479-I479,0)","v":0},{"$f":"IF(E479=\"\",\"\",VLOOKUP(E479,Liste1!$A$2:$B$41,2))","v":""},null,null,{"$f":"IF($B479=Liste1!$F$9,1,0)","v":0},{"$f":"IF(B479=7,\"\",(E479*100+(YEAR($A479)+MONTH($A479)+MONTH($A479)))/((YEAR($A479))))","v":1.0069204152249136},{"$f":"IF(O479+K479>0,I479,\"\")","v":""},{"$f":"IF(O479+K479>0,J479,\"\")","v":""},null,{"$f":"IF(O479+K479=0,\"\",(J479-I479))","v":""}]
["2023-07-28",2,{"$f":"IF(B480=\"\",\"\",VLOOKUP(B480,Liste1!$F$2:$I$9,2))","v":"Essai 2"},null,null,{"$f":"IF(B480=Liste1!$F$9,Liste1!$F$9*E480*100+MONTH($A480),0)","v":0},{"$f":"IF(B480=Liste1!$F$9,J480-I480,0)","v":0},{"$f":"IF(E480=\"\",\"\",VLOOKUP(E480,Liste1!$A$2:$B$41,2))","v":""},null,null,{"$f":"IF($B480=Liste1!$F$9,1,0)","v":0},{"$f":"IF(B480=7,\"\",(E480*100+(YEAR($A480)+MONTH($A480)+MONTH($A480)))/((YEAR($A480))))","v":1.0069204152249136},{"$f":"IF(O480+K480>0,I480,\"\")","v":""},{"$f":"IF(O480+K480>0,J480,\"\")","v":""},null,{"$f":"IF(O480+K480=0,\"\",(J480-I480))","v":""}]
["2023-07-30",2,{"$f":"IF(B481=\"\",\"\",VLOOKUP(B481,Liste1!$F$2:$I$9,2))","v":"Essai 2"},null,null,{"$f":"IF(B481=Liste1!$F$9,Liste1!$F$9*E481*100+MONTH($A481),0)","v":0},{"$f":"IF(B481=Liste1!$F$9,J481-I481,0)","v":0},{"$f":"IF(E481=\"\",\"\",VLOOKUP(E481,Liste1!$A$2:$B$41,2))","v":""},null,null,{"$f":"IF($B481=Liste1!$F$9,1,0)","v":0},{"$f":"IF(B481=7,\"\",(E481*100+(YEAR($A481)+MONTH($A481)+MONTH($A481)))/((YEAR($A481))))","v":1.0069204152249136},{"$f":"IF(O481+K481>0,I481,\"\")","v":""},{"$f":"IF(O481+K481>0,J481,\"\")","v":""},null,{"$f":"IF(O481+K481=0,\"\",(J481-I481))","v":""}]
["2023-07-30",3,{"$f":"IF(B482=\"\",\"\",VLOOKUP(B482,Liste1!$F$2:$I$9,2))","v":"Essai 3"},null,null,{"$f":"IF(B482=Liste1!$F$9,Liste1!$F$9*E482*100+MONTH($A482),0)","v":0},{"$f":"IF(B482=Liste1!$F$9,J482-I482,0)","v":0},{"$f":"IF(E482=\"\",\"\",VLOOKUP(E482,Liste1!$A$2:$B$41,2))","v":""},null,null,{"$f":"IF($B482=Liste1!$F$9,1,0)","v":0},{"$f":"IF(B482=7,\"\",(E482*100+(YEAR($A482)+MONTH($A482)+MONTH($A482)))/((YEAR($A482))))","v":1.0069204152249136},{"$f":"IF(O482+K482>0,I482,\"\")","v":""},{"$f":"IF(O482+K482>0,J482,\"\")","v":""},null,{"$f":"IF(O482+K482=0,\"\",(J482-I482))","v":""}]
["2023-07-31",2,{"$f":"IF(B483=\"\",\"\",VLOOKUP(B483,Liste1!$F$2:$I$9,2))","v":"Essai 2"},null,null,{"$f":"IF(B483=Liste1!$F$9,Liste1!$F$9*E483*100+MONTH($A483),0)","v":0},{"$f":"IF(B483=Liste1!$F$9,J483-I483,0)","v":0},{"$f":"IF(E483=\"\",\"\",VLOOKUP(E483,Liste1!$A$2:$B$41,2))","v":""},null,null,{"$f":"IF($B483=Liste1!$F$9,1,0)","v":0},{"$f":"IF(B483=7,\"\",(E483*100+(YEAR($A483)+MONTH($A483)+MONTH($A483)))/((YEAR($A483))))","v":1.0069204152249136},{"$f":"IF(O483+K483>0,I483,\"\")","v":""},{"$f":"IF(O483+K483>0,J483,\"\")","v":""},null,{"$f":"IF(O483+K483=0,\"\",(J483-I483))","v":""}]
["2023-07-31",2,{"$f":"IF(B484=\"\",\"\",VLOOKUP(B484,Liste1!$F$2:$I$9,2))","v":"Essai 2"},null,null,{"$f":"IF(B484=Liste1!$F$9,Liste1!$F$9*E484*100+MONTH($A484),0)","v":0},{"$f":"IF(B484=Liste1!$F$9,J484-I484,0)","v":0},{"$f":"IF(E484=\"\",\"\",VLOOKUP(E484,Liste1!$A$2:$B$41,2))","v":""},null,null,{"$f":"IF($B484=Liste1!$F$9,1,0)","v":0},{"$f":"IF(B484=7,\"\",(E484*100+(YEAR($A484)+MONTH($A484)+MONTH($A484)))/((YEAR($A484))))","v":1.0069204152249136},{"$f":"IF(O484+K484>0,I484,\"\")","v":""},{"$f":"IF(O484+K484>0,J484,\"\")","v":""},null,{"$f":"IF(O484+K484=0,\"\",(J484-I484))","v":""}]
["2023-08-01",3,{"$f":"IF(B485=\"\",\"\",VLOOKUP(B485,Liste1!$F$2:$I$9,2))","v":"Essai 3"},null,null,{"$f":"IF(B485=Liste1!$F$9,Liste1!$F$9*E485*100+MONTH($A485),0)","v":0},{"$f":"IF(B485=Liste1!$F$9,J485-I485,0)","v":0},{"$f":"IF(E485=\"\",\"\",VLOOKUP(E485,Liste1!$A$2:$B$41,2))","v":""},null,null,{"$f":"IF($B485=Liste1!$F$9,1,0)","v":0},{"$f":"IF(I485+J485=0,\"\",(E485*100+(YEAR($A485)+MONTH($A485)+MONTH($A485)))/((YEAR($A485))))","v":""},{"$f":"IF(O485+K485>0,I485,\"\")","v":""},{"$f":"IF(O485+K485>0,J485,\"\")","v":""},null,{"$f":"IF(O485+K485=0,\"\",(J485-I485))","v":""}]
["2023-08-01",2,{"$f":"IF(B486=\"\",\"\",VLOOKUP(B486,Liste1!$F$2:$I$9,2))","v":"Essai 2"},null,null,{"$f":"IF(B486=Liste1!$F$9,Liste1!$F$9*E486*100+MONTH($A486),0)","v":0},{"$f":"IF(B486=Liste1!$F$9,J486-I486,0)","v":0},{"$f":"IF(E486=\"\",\"\",VLOOKUP(E486,Liste1!$A$2:$B$41,2))","v":""},null,null,{"$f":"IF($B486=Liste1!$F$9,1,0)","v":0},{"$f":"IF(B486=7,\"\",(E486*100+(YEAR($A486)+MONTH($A486)+MONTH($A486)))/((YEAR($A486))))","v":1.0079090459713298},{"$f":"IF(O486+K486>0,I486,\"\")","v":""},{"$f":"IF(O486+K486>0,J486,\"\")","v":""},null,{"$f":"IF(O486+K486=0,\"\",(J486-I486))","v":""}]
["2023-08-04",2,{"$f":"IF(B487=\"\",\"\",VLOOKUP(B487,Liste1!$F$2:$I$9,2))","v":"Essai 2"},null,null,{"$f":"IF(B487=Liste1!$F$9,Liste1!$F$9*E487*100+MONTH($A487),0)","v":0},{"$f":"IF(B487=Liste1!$F$9,J487-I487,0)","v":0},{"$f":"IF(E487=\"\",\"\",VLOOKUP(E487,Liste1!$A$2:$B$41,2))","v":""},null,null,{"$f":"IF($B487=Liste1!$F$9,1,0)","v":0},{"$f":"IF(B487=7,\"\",(E487*100+(YEAR($A487)+MONTH($A487)+MONTH($A487)))/((YEAR($A487))))","v":1.0079090459713298},{"$f":"IF(O487+K487>0,I487,\"\")","v":""},{"$f":"IF(O487+K487>0,J487,\"\")","v":""},null,{"$f":"IF(O487+K487=0,\"\",(J487-I487))","v":""}]
["2023-08-07",2,{"$f":"IF(B488=\"\",\"\",VLOOKUP(B488,Liste1!$F$2:$I$9,2))","v":"Essai 2"},null,null,{"$f":"IF(B488=Liste1!$F$9,Liste1!$F$9*E488*100+MONTH($A488),0)","v":0},{"$f":"IF(B488=Liste1!$F$9,J488-I488,0)","v":0},{"$f":"IF(E488=\"\",\"\",VLOOKUP(E488,Liste1!$A$2:$B$41,2))","v":""},null,null,{"$f":"IF($B488=Liste1!$F$9,1,0)","v":0},{"$f":"IF(B488=7,\"\",(E488*100+(YEAR($A488)+MONTH($A488)+MONTH($A488)))/((YEAR($A488))))","v":1.0079090459713298},{"$f":"IF(O488+K488>0,I488,\"\")","v":""},{"$f":"IF(O488+K488>0,J488,\"\")","v":""},null,{"$f":"IF(O488+K488=0,\"\",(J488-I488))","v":""}]
["2023-08-07",3,{"$f":"IF(B489=\"\",\"\",VLOOKUP(B489,Liste1!$F$2:$I$9,2))","v":"Essai 3"},null,null,{"$f":"IF(B489=Liste1!$F$9,Liste1!$F$9*E489*100+MONTH($A489),0)","v":0},{"$f":"IF(B489=Liste1!$F$9,J489-I489,0)","v":0},{"$f":"IF(E489=\"\",\"\",VLOOKUP(E489,Liste1!$A$2:$B$41,2))","v":""},null,null,{"$f":"IF($B489=Liste1!$F$9,1,0)","v":0},{"$f":"IF(B489=7,\"\",(E489*100+(YEAR($A489)+MONTH($A489)+MONTH($A489)))/((YEAR($A489))))","v":1.0079090459713298},{"$f":"IF(O489+K489>0,I489,\"\")","v":""},{"$f":"IF(O489+K489>0,J489,\"\")","v":""},null,{"$f":"IF(O489+K489=0,\"\",(J489-I489))","v":""}]
["2023-08-08",3,{"$f":"IF(B490=\"\",\"\",VLOOKUP(B490,Liste1!$F$2:$I$9,2))","v":"Essai 3"},null,null,{"$f":"IF(B490=Liste1!$F$9,Liste1!$F$9*E490*100+MONTH($A490),0)","v":0},{"$f":"IF(B490=Liste1!$F$9,J490-I490,0)","v":0},{"$f":"IF(E490=\"\",\"\",VLOOKUP(E490,Liste1!$A$2:$B$41,2))","v":""},null,null,{"$f":"IF($B490=Liste1!$F$9,1,0)","v":0},{"$f":"IF(B490=7,\"\",(E490*100+(YEAR($A490)+MONTH($A490)+MONTH($A490)))/((YEAR($A490))))","v":1.0079090459713298},{"$f":"IF(O490+K490>0,I490,\"\")","v":""},{"$f":"IF(O490+K490>0,J490,\"\")","v":""},null,{"$f":"IF(O490+K490=0,\"\",(J490-I490))","v":""}]
["2023-08-10",3,{"$f":"IF(B491=\"\",\"\",VLOOKUP(B491,Liste1!$F$2:$I$9,2))","v":"Essai 3"},null,null,{"$f":"IF(B491=Liste1!$F$9,Liste1!$F$9*E491*100+MONTH($A491),0)","v":0},{"$f":"IF(B491=Liste1!$F$9,J491-I491,0)","v":0},{"$f":"IF(E491=\"\",\"\",VLOOKUP(E491,Liste1!$A$2:$B$41,2))","v":""},null,null,{"$f":"IF($B491=Liste1!$F$9,1,0)","v":0},{"$f":"IF(B491=7,\"\",(E491*100+(YEAR($A491)+MONTH($A491)+MONTH($A491)))/((YEAR($A491))))","v":1.0079090459713298},{"$f":"IF(O491+K491>0,I491,\"\")","v":""},{"$f":"IF(O491+K491>0,J491,\"\")","v":""},null,{"$f":"IF(O491+K491=0,\"\",(J491-I491))","v":""}]
["2023-08-10",3,{"$f":"IF(B492=\"\",\"\",VLOOKUP(B492,Liste1!$F$2:$I$9,2))","v":"Essai 3"},null,null,{"$f":"IF(B492=Liste1!$F$9,Liste1!$F$9*E492*100+MONTH($A492),0)","v":0},{"$f":"IF(B492=Liste1!$F$9,J492-I492,0)","v":0},{"$f":"IF(E492=\"\",\"\",VLOOKUP(E492,Liste1!$A$2:$B$41,2))","v":""},null,null,{"$f":"IF($B492=Liste1!$F$9,1,0)","v":0},{"$f":"IF(B492=7,\"\",(E492*100+(YEAR($A492)+MONTH($A492)+MONTH($A492)))/((YEAR($A492))))","v":1.0079090459713298},{"$f":"IF(O492+K492>0,I492,\"\")","v":""},{"$f":"IF(O492+K492>0,J492,\"\")","v":""},null,{"$f":"IF(O492+K492=0,\"\",(J492-I492))","v":""}]
["2023-08-10",3,{"$f":"IF(B493=\"\",\"\",VLOOKUP(B493,Liste1!$F$2:$I$9,2))","v":"Essai 3"},null,null,{"$f":"IF(B493=Liste1!$F$9,Liste1!$F$9*E493*100+MONTH($A493),0)","v":0},{"$f":"IF(B493=Liste1!$F$9,J493-I493,0)","v":0},{"$f":"IF(E493=\"\",\"\",VLOOKUP(E493,Liste1!$A$2:$B$41,2))","v":""},null,null,{"$f":"IF($B493=Liste1!$F$9,1,0)","v":0},{"$f":"IF(B493=7,\"\",(E493*100+(YEAR($A493)+MONTH($A493)+MONTH($A493)))/((YEAR($A493))))","v":1.0079090459713298},{"$f":"IF(O493+K493>0,I493,\"\")","v":""},{"$f":"IF(O493+K493>0,J493,\"\")","v":""},null,{"$f":"IF(O493+K493=0,\"\",(J493-I493))","v":""}]
["2023-08-10",3,{"$f":"IF(B494=\"\",\"\",VLOOKUP(B494,Liste1!$F$2:$I$9,2))","v":"Essai 3"},null,null,{"$f":"IF(B494=Liste1!$F$9,Liste1!$F$9*E494*100+MONTH($A494),0)","v":0},{"$f":"IF(B494=Liste1!$F$9,J494-I494,0)","v":0},{"$f":"IF(E494=\"\",\"\",VLOOKUP(E494,Liste1!$A$2:$B$41,2))","v":""},null,null,{"$f":"IF($B494=Liste1!$F$9,1,0)","v":0},{"$f":"IF(B494=7,\"\",(E494*100+(YEAR($A494)+MONTH($A494)+MONTH($A494)))/((YEAR($A494))))","v":1.0079090459713298},{"$f":"IF(O494+K494>0,I494,\"\")","v":""},{"$f":"IF(O494+K494>0,J494,\"\")","v":""},null,{"$f":"IF(O494+K494=0,\"\",(J494-I494))","v":""}]
["2023-08-10",3,{"$f":"IF(B495=\"\",\"\",VLOOKUP(B495,Liste1!$F$2:$I$9,2))","v":"Essai 3"},null,null,{"$f":"IF(B495=Liste1!$F$9,Liste1!$F$9*E495*100+MONTH($A495),0)","v":0},{"$f":"IF(B495=Liste1!$F$9,J495-I495,0)","v":0},{"$f":"IF(E495=\"\",\"\",VLOOKUP(E495,Liste1!$A$2:$B$41,2))","v":""},null,null,{"$f":"IF($B495=Liste1!$F$9,1,0)","v":0},{"$f":"IF(B495=7,\"\",(E495*100+(YEAR($A495)+MONTH($A495)+MONTH($A495)))/((YEAR($A495))))","v":1.0079090459713298},{"$f":"IF(O495+K495>0,I495,\"\")","v":""},{"$f":"IF(O495+K495>0,J495,\"\")","v":""},null,{"$f":"IF(O495+K495=0,\"\",(J495-I495))","v":""}]
["2023-08-10",3,{"$f":"IF(B496=\"\",\"\",VLOOKUP(B496,Liste1!$F$2:$I$9,2))","v":"Essai 3"},null,null,{"$f":"IF(B496=Liste1!$F$9,Liste1!$F$9*E496*100+MONTH($A496),0)","v":0},{"$f":"IF(B496=Liste1!$F$9,J496-I496,0)","v":0},{"$f":"IF(E496=\"\",\"\",VLOOKUP(E496,Liste1!$A$2:$B$41,2))","v":""},null,null,{"$f":"IF($B496=Liste1!$F$9,1,0)","v":0},{"$f":"IF(B496=7,\"\",(E496*100+(YEAR($A496)+MONTH($A496)+MONTH($A496)))/((YEAR($A496))))","v":1.0079090459713298},{"$f":"IF(O496+K496>0,I496,\"\")","v":""},{"$f":"IF(O496+K496>0,J496,\"\")","v":""},null,{"$f":"IF(O496+K496=0,\"\",(J496-I496))","v":""}]
["2023-08-10",3,{"$f":"IF(B497=\"\",\"\",VLOOKUP(B497,Liste1!$F$2:$I$9,2))","v":"Essai 3"},null,null,{"$f":"IF(B497=Liste1!$F$9,Liste1!$F$9*E497*100+MONTH($A497),0)","v":0},{"$f":"IF(B497=Liste1!$F$9,J497-I497,0)","v":0},{"$f":"IF(E497=\"\",\"\",VLOOKUP(E497,Liste1!$A$2:$B$41,2))","v":""},null,null,{"$f":"IF($B497=Liste1!$F$9,1,0)","v":0},{"$f":"IF(B497=7,\"\",(E497*100+(YEAR($A497)+MONTH($A497)+MONTH($A497)))/((YEAR($A497))))","v":1.0079090459713298},{"$f":"IF(O497+K497>0,I497,\"\")","v":""},{"$f":"IF(O497+K497>0,J497,\"\")","v":""},null,{"$f":"IF(O497+K497=0,\"\",(J497-I497))","v":""}]
["2023-08-10",3,{"$f":"IF(B498=\"\",\"\",VLOOKUP(B498,Liste1!$F$2:$I$9,2))","v":"Essai 3"},null,null,{"$f":"IF(B498=Liste1!$F$9,Liste1!$F$9*E498*100+MONTH($A498),0)","v":0},{"$f":"IF(B498=Liste1!$F$9,J498-I498,0)","v":0},{"$f":"IF(E498=\"\",\"\",VLOOKUP(E498,Liste1!$A$2:$B$41,2))","v":""},null,null,{"$f":"IF($B498=Liste1!$F$9,1,0)","v":0},{"$f":"IF(B498=7,\"\",(E498*100+(YEAR($A498)+MONTH($A498)+MONTH($A498)))/((YEAR($A498))))","v":1.0079090459713298},{"$f":"IF(O498+K498>0,I498,\"\")","v":""},{"$f":"IF(O498+K498>0,J498,\"\")","v":""},null,{"$f":"IF(O498+K498=0,\"\",(J498-I498))","v":""}]
["2023-08-10",3,{"$f":"IF(B499=\"\",\"\",VLOOKUP(B499,Liste1!$F$2:$I$9,2))","v":"Essai 3"},null,null,{"$f":"IF(B499=Liste1!$F$9,Liste1!$F$9*E499*100+MONTH($A499),0)","v":0},{"$f":"IF(B499=Liste1!$F$9,J499-I499,0)","v":0},{"$f":"IF(E499=\"\",\"\",VLOOKUP(E499,Liste1!$A$2:$B$41,2))","v":""},null,null,{"$f":"IF($B499=Liste1!$F$9,1,0)","v":0},{"$f":"IF(B499=7,\"\",(E499*100+(YEAR($A499)+MONTH($A499)+MONTH($A499)))/((YEAR($A499))))","v":1.0079090459713298},{"$f":"IF(O499+K499>0,I499,\"\")","v":""},{"$f":"IF(O499+K499>0,J499,\"\")","v":""},null,{"$f":"IF(O499+K499=0,\"\",(J499-I499))","v":""}]
["2023-08-13",2,{"$f":"IF(B500=\"\",\"\",VLOOKUP(B500,Liste1!$F$2:$I$9,2))","v":"Essai 2"},null,null,{"$f":"IF(B500=Liste1!$F$9,Liste1!$F$9*E500*100+MONTH($A500),0)","v":0},{"$f":"IF(B500=Liste1!$F$9,J500-I500,0)","v":0},{"$f":"IF(E500=\"\",\"\",VLOOKUP(E500,Liste1!$A$2:$B$41,2))","v":""},null,null,{"$f":"IF($B500=Liste1!$F$9,1,0)","v":0},{"$f":"IF(B500=7,\"\",(E500*100+(YEAR($A500)+MONTH($A500)+MONTH($A500)))/((YEAR($A500))))","v":1.0079090459713298},{"$f":"IF(O500+K500>0,I500,\"\")","v":""},{"$f":"IF(O500+K500>0,J500,\"\")","v":""},null,{"$f":"IF(O500+K500=0,\"\",(J500-I500))","v":""}]
["2023-08-14T13:42:43",5,{"$f":"IF(B501=\"\",\"\",VLOOKUP(B501,Liste1!$F$2:$I$9,2))","v":"Essai 5"},null,null,{"$f":"IF(B501=Liste1!$F$9,Liste1!$F$9*E501*100+MONTH($A501),0)","v":0},{"$f":"IF(B501=Liste1!$F$9,J501-I501,0)","v":0},{"$f":"IF(E501=\"\",\"\",VLOOKUP(E501,Liste1!$A$2:$B$41,2))","v":""},null,null,{"$f":"IF($B501=Liste1!$F$9,1,0)","v":0},{"$f":"IF(B501=7,\"\",(E501*100+(YEAR($A501)+MONTH($A501)+MONTH($A501)))/((YEAR($A501))))","v":1.0079090459713298},{"$f":"IF(O501+K501>0,I501,\"\")","v":""},{"$f":"IF(O501+K501>0,J501,\"\")","v":""},null,{"$f":"IF(O501+K501=0,\"\",(J501-I501))","v":""}]
["2023-08-14T13:48:43",5,{"$f":"IF(B502=\"\",\"\",VLOOKUP(B502,Liste1!$F$2:$I$9,2))","v":"Essai 5"},null,null,{"$f":"IF(B502=Liste1!$F$9,Liste1!$F$9*E502*100+MONTH($A502),0)","v":0},{"$f":"IF(B502=Liste1!$F$9,J502-I502,0)","v":0},{"$f":"IF(E502=\"\",\"\",VLOOKUP(E502,Liste1!$A$2:$B$41,2))","v":""},null,null,{"$f":"IF($B502=Liste1!$F$9,1,0)","v":0},{"$f":"IF(B502=7,\"\",(E502*100+(YEAR($A502)+MONTH($A502)+MONTH($A502)))/((YEAR($A502))))","v":1.0079090459713298},{"$f":"IF(O502+K502>0,I502,\"\")","v":""},{"$f":"IF(O502+K502>0,J502,\"\")","v":""},null,{"$f":"IF(O502+K502=0,\"\",(J502-I502))","v":""}]
["2023-08-14T13:49:54",3,{"$f":"IF(B503=\"\",\"\",VLOOKUP(B503,Liste1!$F$2:$I$9,2))","v":"Essai 3"},null,null,{"$f":"IF(B503=Liste1!$F$9,Liste1!$F$9*E503*100+MONTH($A503),0)","v":0},{"$f":"IF(B503=Liste1!$F$9,J503-I503,0)","v":0},{"$f":"IF(E503=\"\",\"\",VLOOKUP(E503,Liste1!$A$2:$B$41,2))","v":""},null,null,{"$f":"IF($B503=Liste1!$F$9,1,0)","v":0},{"$f":"IF(B503=7,\"\",(E503*100+(YEAR($A503)+MONTH($A503)+MONTH($A503)))/((YEAR($A503))))","v":1.0079090459713298},{"$f":"IF(O503+K503>0,I503,\"\")","v":""},{"$f":"IF(O503+K503>0,J503,\"\")","v":""},null,{"$f":"IF(O503+K503=0,\"\",(J503-I503))","v":""}]
["2023-08-16T19:53:39",3,{"$f":"IF(B504=\"\",\"\",VLOOKUP(B504,Liste1!$F$2:$I$9,2))","v":"Essai 3"},null,null,{"$f":"IF(B504=Liste1!$F$9,Liste1!$F$9*E504*100+MONTH($A504),0)","v":0},{"$f":"IF(B504=Liste1!$F$9,J504-I504,0)","v":0},{"$f":"IF(E504=\"\",\"\",VLOOKUP(E504,Liste1!$A$2:$B$41,2))","v":""},null,null,{"$f":"IF($B504=Liste1!$F$9,1,0)","v":0},{"$f":"IF(B504=7,\"\",(E504*100+(YEAR($A504)+MONTH($A504)+MONTH($A504)))/((YEAR($A504))))","v":1.0079090459713298},{"$f":"IF(O504+K504>0,I504,\"\")","v":""},{"$f":"IF(O504+K504>0,J504,\"\")","v":""},null,{"$f":"IF(O504+K504=0,\"\",(J504-I504))","v":""}]
["2023-08-17T18:28:35",2,{"$f":"IF(B505=\"\",\"\",VLOOKUP(B505,Liste1!$F$2:$I$9,2))","v":"Essai 2"},null,null,{"$f":"IF(B505=Liste1!$F$9,Liste1!$F$9*E505*100+MONTH($A505),0)","v":0},{"$f":"IF(B505=Liste1!$F$9,J505-I505,0)","v":0},{"$f":"IF(E505=\"\",\"\",VLOOKUP(E505,Liste1!$A$2:$B$41,2))","v":""},null,null,{"$f":"IF($B505=Liste1!$F$9,1,0)","v":0},{"$f":"IF(B505=7,\"\",(E505*100+(YEAR($A505)+MONTH($A505)+MONTH($A505)))/((YEAR($A505))))","v":1.0079090459713298},{"$f":"IF(O505+K505>0,I505,\"\")","v":""},{"$f":"IF(O505+K505>0,J505,\"\")","v":""},null,{"$f":"IF(O505+K505=0,\"\",(J505-I505))","v":""}]
["2023-08-18",3,{"$f":"IF(B506=\"\",\"\",VLOOKUP(B506,Liste1!$F$2:$I$9,2))","v":"Essai 3"},null,null,{"$f":"IF(B506=Liste1!$F$9,Liste1!$F$9*E506*100+MONTH($A506),0)","v":0},{"$f":"IF(B506=Liste1!$F$9,J506-I506,0)","v":0},{"$f":"IF(E506=\"\",\"\",VLOOKUP(E506,Liste1!$A$2:$B$41,2))","v":""},null,null,{"$f":"IF($B506=Liste1!$F$9,1,0)","v":0},{"$f":"IF(B506=7,\"\",(E506*100+(YEAR($A506)+MONTH($A506)+MONTH($A506)))/((YEAR($A506))))","v":1.0079090459713298},{"$f":"IF(O506+K506>0,I506,\"\")","v":""},{"$f":"IF(O506+K506>0,J506,\"\")","v":""},null,{"$f":"IF(O506+K506=0,\"\",(J506-I506))","v":""}]
["2023-08-18",4,{"$f":"IF(B507=\"\",\"\",VLOOKUP(B507,Liste1!$F$2:$I$9,2))","v":"Essai 4"},null,null,{"$f":"IF(B507=Liste1!$F$9,Liste1!$F$9*E507*100+MONTH($A507),0)","v":0},{"$f":"IF(B507=Liste1!$F$9,J507-I507,0)","v":0},{"$f":"IF(E507=\"\",\"\",VLOOKUP(E507,Liste1!$A$2:$B$41,2))","v":""},null,null,{"$f":"IF($B507=Liste1!$F$9,1,0)","v":0},{"$f":"IF(B507=7,\"\",(E507*100+(YEAR($A507)+MONTH($A507)+MONTH($A507)))/((YEAR($A507))))","v":1.0079090459713298},{"$f":"IF(O507+K507>0,I507,\"\")","v":""},{"$f":"IF(O507+K507>0,J507,\"\")","v":""},null,{"$f":"IF(O507+K507=0,\"\",(J507-I507))","v":""}]
["2023-08-18T12:14:06",5,{"$f":"IF(B508=\"\",\"\",VLOOKUP(B508,Liste1!$F$2:$I$9,2))","v":"Essai 5"},null,null,{"$f":"IF(B508=Liste1!$F$9,Liste1!$F$9*E508*100+MONTH($A508),0)","v":0},{"$f":"IF(B508=Liste1!$F$9,J508-I508,0)","v":0},{"$f":"IF(E508=\"\",\"\",VLOOKUP(E508,Liste1!$A$2:$B$41,2))","v":""},null,null,{"$f":"IF($B508=Liste1!$F$9,1,0)","v":0},{"$f":"IF(B508=7,\"\",(E508*100+(YEAR($A508)+MONTH($A508)+MONTH($A508)))/((YEAR($A508))))","v":1.0079090459713298},{"$f":"IF(O508+K508>0,I508,\"\")","v":""},{"$f":"IF(O508+K508>0,J508,\"\")","v":""},null,{"$f":"IF(O508+K508=0,\"\",(J508-I508))","v":""}]
["2023-08-18T13:10:51",3,{"$f":"IF(B509=\"\",\"\",VLOOKUP(B509,Liste1!$F$2:$I$9,2))","v":"Essai 3"},null,null,{"$f":"IF(B509=Liste1!$F$9,Liste1!$F$9*E509*100+MONTH($A509),0)","v":0},{"$f":"IF(B509=Liste1!$F$9,J509-I509,0)","v":0},{"$f":"IF(E509=\"\",\"\",VLOOKUP(E509,Liste1!$A$2:$B$41,2))","v":""},null,null,{"$f":"IF($B509=Liste1!$F$9,1,0)","v":0},{"$f":"IF(B509=7,\"\",(E509*100+(YEAR($A509)+MONTH($A509)+MONTH($A509)))/((YEAR($A509))))","v":1.0079090459713298},{"$f":"IF(O509+K509>0,I509,\"\")","v":""},{"$f":"IF(O509+K509>0,J509,\"\")","v":""},null,{"$f":"IF(O509+K509=0,\"\",(J509-I509))","v":""}]
["2023-08-19T19:09:14",3,{"$f":"IF(B510=\"\",\"\",VLOOKUP(B510,Liste1!$F$2:$I$9,2))","v":"Essai 3"},null,null,{"$f":"IF(B510=Liste1!$F$9,Liste1!$F$9*E510*100+MONTH($A510),0)","v":0},{"$f":"IF(B510=Liste1!$F$9,J510-I510,0)","v":0},{"$f":"IF(E510=\"\",\"\",VLOOKUP(E510,Liste1!$A$2:$B$41,2))","v":""},null,null,{"$f":"IF($B510=Liste1!$F$9,1,0)","v":0},{"$f":"IF(B510=7,\"\",(E510*100+(YEAR($A510)+MONTH($A510)+MONTH($A510)))/((YEAR($A510))))","v":1.0079090459713298},{"$f":"IF(O510+K510>0,I510,\"\")","v":""},{"$f":"IF(O510+K510>0,J510,\"\")","v":""},null,{"$f":"IF(O510+K510=0,\"\",(J510-I510))","v":""}]
["2023-08-21",3,{"$f":"IF(B511=\"\",\"\",VLOOKUP(B511,Liste1!$F$2:$I$9,2))","v":"Essai 3"},null,null,{"$f":"IF(B511=Liste1!$F$9,Liste1!$F$9*E511*100+MONTH($A511),0)","v":0},{"$f":"IF(B511=Liste1!$F$9,J511-I511,0)","v":0},{"$f":"IF(E511=\"\",\"\",VLOOKUP(E511,Liste1!$A$2:$B$41,2))","v":""},null,null,{"$f":"IF($B511=Liste1!$F$9,1,0)","v":0},{"$f":"IF(B511=7,\"\",(E511*100+(YEAR($A511)+MONTH($A511)+MONTH($A511)))/((YEAR($A511))))","v":1.0079090459713298},{"$f":"IF(O511+K511>0,I511,\"\")","v":""},{"$f":"IF(O511+K511>0,J511,\"\")","v":""},null,{"$f":"IF(O511+K511=0,\"\",(J511-I511))","v":""}]
["2023-08-22",4,{"$f":"IF(B512=\"\",\"\",VLOOKUP(B512,Liste1!$F$2:$I$9,2))","v":"Essai 4"},null,null,{"$f":"IF(B512=Liste1!$F$9,Liste1!$F$9*E512*100+MONTH($A512),0)","v":0},{"$f":"IF(B512=Liste1!$F$9,J512-I512,0)","v":0},{"$f":"IF(E512=\"\",\"\",VLOOKUP(E512,Liste1!$A$2:$B$41,2))","v":""},null,null,{"$f":"IF($B512=Liste1!$F$9,1,0)","v":0},{"$f":"IF(B512=7,\"\",(E512*100+(YEAR($A512)+MONTH($A512)+MONTH($A512)))/((YEAR($A512))))","v":1.0079090459713298},{"$f":"IF(O512+K512>0,I512,\"\")","v":""},{"$f":"IF(O512+K512>0,J512,\"\")","v":""},null,{"$f":"IF(O512+K512=0,\"\",(J512-I512))","v":""}]
["2023-08-23T13:51:44",3,{"$f":"IF(B513=\"\",\"\",VLOOKUP(B513,Liste1!$F$2:$I$9,2))","v":"Essai 3"},null,null,{"$f":"IF(B513=Liste1!$F$9,Liste1!$F$9*E513*100+MONTH($A513),0)","v":0},{"$f":"IF(B513=Liste1!$F$9,J513-I513,0)","v":0},{"$f":"IF(E513=\"\",\"\",VLOOKUP(E513,Liste1!$A$2:$B$41,2))","v":""},null,null,{"$f":"IF($B513=Liste1!$F$9,1,0)","v":0},{"$f":"IF(B513=7,\"\",(E513*100+(YEAR($A513)+MONTH($A513)+MONTH($A513)))/((YEAR($A513))))","v":1.0079090459713298},{"$f":"IF(O513+K513>0,I513,\"\")","v":""},{"$f":"IF(O513+K513>0,J513,\"\")","v":""},null,{"$f":"IF(O513+K513=0,\"\",(J513-I513))","v":""}]
["2023-08-24T17:32:13",2,{"$f":"IF(B514=\"\",\"\",VLOOKUP(B514,Liste1!$F$2:$I$9,2))","v":"Essai 2"},null,null,{"$f":"IF(B514=Liste1!$F$9,Liste1!$F$9*E514*100+MONTH($A514),0)","v":0},{"$f":"IF(B514=Liste1!$F$9,J514-I514,0)","v":0},{"$f":"IF(E514=\"\",\"\",VLOOKUP(E514,Liste1!$A$2:$B$41,2))","v":""},null,null,{"$f":"IF($B514=Liste1!$F$9,1,0)","v":0},{"$f":"IF(B514=7,\"\",(E514*100+(YEAR($A514)+MONTH($A514)+MONTH($A514)))/((YEAR($A514))))","v":1.0079090459713298},{"$f":"IF(O514+K514>0,I514,\"\")","v":""},{"$f":"IF(O514+K514>0,J514,\"\")","v":""},null,{"$f":"IF(O514+K514=0,\"\",(J514-I514))","v":""}]
["2023-08-25",5,{"$f":"IF(B515=\"\",\"\",VLOOKUP(B515,Liste1!$F$2:$I$9,2))","v":"Essai 5"},null,null,{"$f":"IF(B515=Liste1!$F$9,Liste1!$F$9*E515*100+MONTH($A515),0)","v":0},{"$f":"IF(B515=Liste1!$F$9,J515-I515,0)","v":0},{"$f":"IF(E515=\"\",\"\",VLOOKUP(E515,Liste1!$A$2:$B$41,2))","v":""},null,null,{"$f":"IF($B515=Liste1!$F$9,1,0)","v":0},{"$f":"IF(B515=7,\"\",(E515*100+(YEAR($A515)+MONTH($A515)+MONTH($A515)))/((YEAR($A515))))","v":1.0079090459713298},{"$f":"IF(O515+K515>0,I515,\"\")","v":""},{"$f":"IF(O515+K515>0,J515,\"\")","v":""},null,{"$f":"IF(O515+K515=0,\"\",(J515-I515))","v":""}]
["2023-08-26",2,{"$f":"IF(B516=\"\",\"\",VLOOKUP(B516,Liste1!$F$2:$I$9,2))","v":"Essai 2"},null,null,{"$f":"IF(B516=Liste1!$F$9,Liste1!$F$9*E516*100+MONTH($A516),0)","v":0},{"$f":"IF(B516=Liste1!$F$9,J516-I516,0)","v":0},{"$f":"IF(E516=\"\",\"\",VLOOKUP(E516,Liste1!$A$2:$B$41,2))","v":""},null,null,{"$f":"IF($B516=Liste1!$F$9,1,0)","v":0},{"$f":"IF(B516=7,\"\",(E516*100+(YEAR($A516)+MONTH($A516)+MONTH($A516)))/((YEAR($A516))))","v":1.0079090459713298},{"$f":"IF(O516+K516>0,I516,\"\")","v":""},{"$f":"IF(O516+K516>0,J516,\"\")","v":""},null,{"$f":"IF(O516+K516=0,\"\",(J516-I516))","v":""}]
["2023-08-28",3,{"$f":"IF(B517=\"\",\"\",VLOOKUP(B517,Liste1!$F$2:$I$9,2))","v":"Essai 3"},null,null,{"$f":"IF(B517=Liste1!$F$9,Liste1!$F$9*E517*100+MONTH($A517),0)","v":0},{"$f":"IF(B517=Liste1!$F$9,J517-I517,0)","v":0},{"$f":"IF(E517=\"\",\"\",VLOOKUP(E517,Liste1!$A$2:$B$41,2))","v":""},null,null,{"$f":"IF($B517=Liste1!$F$9,1,0)","v":0},{"$f":"IF(B517=7,\"\",(E517*100+(YEAR($A517)+MONTH($A517)+MONTH($A517)))/((YEAR($A517))))","v":1.0079090459713298},{"$f":"IF(O517+K517>0,I517,\"\")","v":""},{"$f":"IF(O517+K517>0,J517,\"\")","v":""},null,{"$f":"IF(O517+K517=0,\"\",(J517-I517))","v":""}]
["2023-08-29T18:46:25",4,{"$f":"IF(B518=\"\",\"\",VLOOKUP(B518,Liste1!$F$2:$I$9,2))","v":"Essai 4"},null,null,{"$f":"IF(B518=Liste1!$F$9,Liste1!$F$9*E518*100+MONTH($A518),0)","v":0},{"$f":"IF(B518=Liste1!$F$9,J518-I518,0)","v":0},{"$f":"IF(E518=\"\",\"\",VLOOKUP(E518,Liste1!$A$2:$B$41,2))","v":""},null,null,{"$f":"IF($B518=Liste1!$F$9,1,0)","v":0},{"$f":"IF(B518=7,\"\",(E518*100+(YEAR($A518)+MONTH($A518)+MONTH($A518)))/((YEAR($A518))))","v":1.0079090459713298},{"$f":"IF(O518+K518>0,I518,\"\")","v":""},{"$f":"IF(O518+K518>0,J518,\"\")","v":""},null,{"$f":"IF(O518+K518=0,\"\",(J518-I518))","v":""}]
["2023-08-30",2,{"$f":"IF(B519=\"\",\"\",VLOOKUP(B519,Liste1!$F$2:$I$9,2))","v":"Essai 2"},null,null,{"$f":"IF(B519=Liste1!$F$9,Liste1!$F$9*E519*100+MONTH($A519),0)","v":0},{"$f":"IF(B519=Liste1!$F$9,J519-I519,0)","v":0},{"$f":"IF(E519=\"\",\"\",VLOOKUP(E519,Liste1!$A$2:$B$41,2))","v":""},null,null,{"$f":"IF($B519=Liste1!$F$9,1,0)","v":0},{"$f":"IF(B519=7,\"\",(E519*100+(YEAR($A519)+MONTH($A519)+MONTH($A519)))/((YEAR($A519))))","v":1.0079090459713298},{"$f":"IF(O519+K519>0,I519,\"\")","v":""},{"$f":"IF(O519+K519>0,J519,\"\")","v":""},null,{"$f":"IF(O519+K519=0,\"\",(J519-I519))","v":""}]
["2023-08-30T10:52:28",5,{"$f":"IF(B520=\"\",\"\",VLOOKUP(B520,Liste1!$F$2:$I$9,2))","v":"Essai 5"},null,null,{"$f":"IF(B520=Liste1!$F$9,Liste1!$F$9*E520*100+MONTH($A520),0)","v":0},{"$f":"IF(B520=Liste1!$F$9,J520-I520,0)","v":0},{"$f":"IF(E520=\"\",\"\",VLOOKUP(E520,Liste1!$A$2:$B$41,2))","v":""},null,null,{"$f":"IF($B520=Liste1!$F$9,1,0)","v":0},{"$f":"IF(B520=7,\"\",(E520*100+(YEAR($A520)+MONTH($A520)+MONTH($A520)))/((YEAR($A520))))","v":1.0079090459713298},{"$f":"IF(O520+K520>0,I520,\"\")","v":""},{"$f":"IF(O520+K520>0,J520,\"\")","v":""},null,{"$f":"IF(O520+K520=0,\"\",(J520-I520))","v":""}]
["2023-08-30T11:06:41",3,{"$f":"IF(B521=\"\",\"\",VLOOKUP(B521,Liste1!$F$2:$I$9,2))","v":"Essai 3"},null,null,{"$f":"IF(B521=Liste1!$F$9,Liste1!$F$9*E521*100+MONTH($A521),0)","v":0},{"$f":"IF(B521=Liste1!$F$9,J521-I521,0)","v":0},{"$f":"IF(E521=\"\",\"\",VLOOKUP(E521,Liste1!$A$2:$B$41,2))","v":""},null,null,{"$f":"IF($B521=Liste1!$F$9,1,0)","v":0},{"$f":"IF(B521=7,\"\",(E521*100+(YEAR($A521)+MONTH($A521)+MONTH($A521)))/((YEAR($A521))))","v":1.0079090459713298},{"$f":"IF(O521+K521>0,I521,\"\")","v":""},{"$f":"IF(O521+K521>0,J521,\"\")","v":""},null,{"$f":"IF(O521+K521=0,\"\",(J521-I521))","v":""}]
["2023-09-01",3,{"$f":"IF(B522=\"\",\"\",VLOOKUP(B522,Liste1!$F$2:$I$9,2))","v":"Essai 3"},null,null,{"$f":"IF(B522=Liste1!$F$9,Liste1!$F$9*E522*100+MONTH($A522),0)","v":0},{"$f":"IF(B522=Liste1!$F$9,J522-I522,0)","v":0},{"$f":"IF(E522=\"\",\"\",VLOOKUP(E522,Liste1!$A$2:$B$41,2))","v":""},null,null,{"$f":"IF($B522=Liste1!$F$9,1,0)","v":0},{"$f":"IF(B522=7,\"\",(E522*100+(YEAR($A522)+MONTH($A522)+MONTH($A522)))/((YEAR($A522))))","v":1.008897676717746},{"$f":"IF(O522+K522>0,I522,\"\")","v":""},{"$f":"IF(O522+K522>0,J522,\"\")","v":""},null,{"$f":"IF(O522+K522=0,\"\",(J522-I522))","v":""}]
["2023-09-03T21:08:04",2,{"$f":"IF(B523=\"\",\"\",VLOOKUP(B523,Liste1!$F$2:$I$9,2))","v":"Essai 2"},null,null,{"$f":"IF(B523=Liste1!$F$9,Liste1!$F$9*E523*100+MONTH($A523),0)","v":0},{"$f":"IF(B523=Liste1!$F$9,J523-I523,0)","v":0},{"$f":"IF(E523=\"\",\"\",VLOOKUP(E523,Liste1!$A$2:$B$41,2))","v":""},null,null,{"$f":"IF($B523=Liste1!$F$9,1,0)","v":0},{"$f":"IF(B523=7,\"\",(E523*100+(YEAR($A523)+MONTH($A523)+MONTH($A523)))/((YEAR($A523))))","v":1.008897676717746},{"$f":"IF(O523+K523>0,I523,\"\")","v":""},{"$f":"IF(O523+K523>0,J523,\"\")","v":""},null,{"$f":"IF(O523+K523=0,\"\",(J523-I523))","v":""}]
["2023-09-07",2,{"$f":"IF(B524=\"\",\"\",VLOOKUP(B524,Liste1!$F$2:$I$9,2))","v":"Essai 2"},null,null,{"$f":"IF(B524=Liste1!$F$9,Liste1!$F$9*E524*100+MONTH($A524),0)","v":0},{"$f":"IF(B524=Liste1!$F$9,J524-I524,0)","v":0},{"$f":"IF(E524=\"\",\"\",VLOOKUP(E524,Liste1!$A$2:$B$41,2))","v":""},null,null,{"$f":"IF($B524=Liste1!$F$9,1,0)","v":0},{"$f":"IF(B524=7,\"\",(E524*100+(YEAR($A524)+MONTH($A524)+MONTH($A524)))/((YEAR($A524))))","v":1.008897676717746},{"$f":"IF(O524+K524>0,I524,\"\")","v":""},{"$f":"IF(O524+K524>0,J524,\"\")","v":""},null,{"$f":"IF(O524+K524=0,\"\",(J524-I524))","v":""}]
["2023-09-08",2,{"$f":"IF(B525=\"\",\"\",VLOOKUP(B525,Liste1!$F$2:$I$9,2))","v":"Essai 2"},null,null,{"$f":"IF(B525=Liste1!$F$9,Liste1!$F$9*E525*100+MONTH($A525),0)","v":0},{"$f":"IF(B525=Liste1!$F$9,J525-I525,0)","v":0},{"$f":"IF(E525=\"\",\"\",VLOOKUP(E525,Liste1!$A$2:$B$41,2))","v":""},null,null,{"$f":"IF($B525=Liste1!$F$9,1,0)","v":0},{"$f":"IF(B525=7,\"\",(E525*100+(YEAR($A525)+MONTH($A525)+MONTH($A525)))/((YEAR($A525))))","v":1.008897676717746},{"$f":"IF(O525+K525>0,I525,\"\")","v":""},{"$f":"IF(O525+K525>0,J525,\"\")","v":""},null,{"$f":"IF(O525+K525=0,\"\",(J525-I525))","v":""}]
["2023-09-08",2,{"$f":"IF(B526=\"\",\"\",VLOOKUP(B526,Liste1!$F$2:$I$9,2))","v":"Essai 2"},null,null,{"$f":"IF(B526=Liste1!$F$9,Liste1!$F$9*E526*100+MONTH($A526),0)","v":0},{"$f":"IF(B526=Liste1!$F$9,J526-I526,0)","v":0},{"$f":"IF(E526=\"\",\"\",VLOOKUP(E526,Liste1!$A$2:$B$41,2))","v":""},null,null,{"$f":"IF($B526=Liste1!$F$9,1,0)","v":0},{"$f":"IF(B526=7,\"\",(E526*100+(YEAR($A526)+MONTH($A526)+MONTH($A526)))/((YEAR($A526))))","v":1.008897676717746},{"$f":"IF(O526+K526>0,I526,\"\")","v":""},{"$f":"IF(O526+K526>0,J526,\"\")","v":""},null,{"$f":"IF(O526+K526=0,\"\",(J526-I526))","v":""}]
["2023-09-08T13:46:35",4,{"$f":"IF(B527=\"\",\"\",VLOOKUP(B527,Liste1!$F$2:$I$9,2))","v":"Essai 4"},null,null,{"$f":"IF(B527=Liste1!$F$9,Liste1!$F$9*E527*100+MONTH($A527),0)","v":0},{"$f":"IF(B527=Liste1!$F$9,J527-I527,0)","v":0},{"$f":"IF(E527=\"\",\"\",VLOOKUP(E527,Liste1!$A$2:$B$41,2))","v":""},null,null,{"$f":"IF($B527=Liste1!$F$9,1,0)","v":0},{"$f":"IF(B527=7,\"\",(E527*100+(YEAR($A527)+MONTH($A527)+MONTH($A527)))/((YEAR($A527))))","v":1.008897676717746},{"$f":"IF(O527+K527>0,I527,\"\")","v":""},{"$f":"IF(O527+K527>0,J527,\"\")","v":""},null,{"$f":"IF(O527+K527=0,\"\",(J527-I527))","v":""}]
["2023-09-08T17:19:55",2,{"$f":"IF(B528=\"\",\"\",VLOOKUP(B528,Liste1!$F$2:$I$9,2))","v":"Essai 2"},null,null,{"$f":"IF(B528=Liste1!$F$9,Liste1!$F$9*E528*100+MONTH($A528),0)","v":0},{"$f":"IF(B528=Liste1!$F$9,J528-I528,0)","v":0},{"$f":"IF(E528=\"\",\"\",VLOOKUP(E528,Liste1!$A$2:$B$41,2))","v":""},null,null,{"$f":"IF($B528=Liste1!$F$9,1,0)","v":0},{"$f":"IF(B528=7,\"\",(E528*100+(YEAR($A528)+MONTH($A528)+MONTH($A528)))/((YEAR($A528))))","v":1.008897676717746},{"$f":"IF(O528+K528>0,I528,\"\")","v":""},{"$f":"IF(O528+K528>0,J528,\"\")","v":""},null,{"$f":"IF(O528+K528=0,\"\",(J528-I528))","v":""}]
["2023-09-09T18:21:51",2,{"$f":"IF(B529=\"\",\"\",VLOOKUP(B529,Liste1!$F$2:$I$9,2))","v":"Essai 2"},null,null,{"$f":"IF(B529=Liste1!$F$9,Liste1!$F$9*E529*100+MONTH($A529),0)","v":0},{"$f":"IF(B529=Liste1!$F$9,J529-I529,0)","v":0},{"$f":"IF(E529=\"\",\"\",VLOOKUP(E529,Liste1!$A$2:$B$41,2))","v":""},null,null,{"$f":"IF($B529=Liste1!$F$9,1,0)","v":0},{"$f":"IF(B529=7,\"\",(E529*100+(YEAR($A529)+MONTH($A529)+MONTH($A529)))/((YEAR($A529))))","v":1.008897676717746},{"$f":"IF(O529+K529>0,I529,\"\")","v":""},{"$f":"IF(O529+K529>0,J529,\"\")","v":""},null,{"$f":"IF(O529+K529=0,\"\",(J529-I529))","v":""}]
["2023-09-10",3,{"$f":"IF(B530=\"\",\"\",VLOOKUP(B530,Liste1!$F$2:$I$9,2))","v":"Essai 3"},null,null,{"$f":"IF(B530=Liste1!$F$9,Liste1!$F$9*E530*100+MONTH($A530),0)","v":0},{"$f":"IF(B530=Liste1!$F$9,J530-I530,0)","v":0},{"$f":"IF(E530=\"\",\"\",VLOOKUP(E530,Liste1!$A$2:$B$41,2))","v":""},null,null,{"$f":"IF(Saisie1!$B1032=Liste1!$F$9,1,0)","v":0},{"$f":"IF(Saisie1!B1032=7,\"\",(Saisie1!E1032*100+(YEAR(Saisie1!$A1032)+MONTH(Saisie1!$A1032)+MONTH(Saisie1!$A1032)))/((YEAR(Saisie1!$A1032))))","v":1.0010526315789474},{"$f":"IF(O530+K530>0,I530,\"\")","v":""},{"$f":"IF(O530+K530>0,J530,\"\")","v":""},null,{"$f":"IF(O530+K530=0,\"\",(J530-I530))","v":""}]
["2023-09-10",3,{"$f":"IF(B531=\"\",\"\",VLOOKUP(B531,Liste1!$F$2:$I$9,2))","v":"Essai 3"},null,null,{"$f":"IF(B531=Liste1!$F$9,Liste1!$F$9*E531*100+MONTH($A531),0)","v":0},{"$f":"IF(B531=Liste1!$F$9,J531-I531,0)","v":0},{"$f":"IF(E531=\"\",\"\",VLOOKUP(E531,Liste1!$A$2:$B$41,2))","v":""},null,null,{"$f":"IF(Saisie1!$B1034=Liste1!$F$9,1,0)","v":0},{"$f":"IF(Saisie1!B1034=7,\"\",(Saisie1!E1034*100+(YEAR(Saisie1!$A1034)+MONTH(Saisie1!$A1034)+MONTH(Saisie1!$A1034)))/((YEAR(Saisie1!$A1034))))","v":1.0010526315789474},{"$f":"IF(O531+K531>0,I531,\"\")","v":""},{"$f":"IF(O531+K531>0,J531,\"\")","v":""},null,{"$f":"IF(O531+K531=0,\"\",(J531-I531))","v":""}]
["2023-09-10",3,{"$f":"IF(B532=\"\",\"\",VLOOKUP(B532,Liste1!$F$2:$I$9,2))","v":"Essai 3"},null,null,{"$f":"IF(B532=Liste1!$F$9,Liste1!$F$9*E532*100+MONTH($A532),0)","v":0},{"$f":"IF(B532=Liste1!$F$9,J532-I532,0)","v":0},{"$f":"IF(E532=\"\",\"\",VLOOKUP(E532,Liste1!$A$2:$B$41,2))","v":""},null,null,{"$f":"IF(Saisie1!$B1036=Liste1!$F$9,1,0)","v":0},{"$f":"IF(Saisie1!B1036=7,\"\",(Saisie1!E1036*100+(YEAR(Saisie1!$A1036)+MONTH(Saisie1!$A1036)+MONTH(Saisie1!$A1036)))/((YEAR(Saisie1!$A1036))))","v":1.0010526315789474},{"$f":"IF(O532+K532>0,I532,\"\")","v":""},{"$f":"IF(O532+K532>0,J532,\"\")","v":""},null,{"$f":"IF(O532+K532=0,\"\",(J532-I532))","v":""}]
["2023-09-10",3,{"$f":"IF(B533=\"\",\"\",VLOOKUP(B533,Liste1!$F$2:$I$9,2))","v":"Essai 3"},null,null,{"$f":"IF(B533=Liste1!$F$9,Liste1!$F$9*E533*100+MONTH($A533),0)","v":0},{"$f":"IF(B533=Liste1!$F$9,J533-I533,0)","v":0},{"$f":"IF(E533=\"\",\"\",VLOOKUP(E533,Liste1!$A$2:$B$41,2))","v":""},null,null,{"$f":"IF(Saisie1!$B1039=Liste1!$F$9,1,0)","v":0},{"$f":"IF(Saisie1!B1039=7,\"\",(Saisie1!E1039*100+(YEAR(Saisie1!$A1039)+MONTH(Saisie1!$A1039)+MONTH(Saisie1!$A1039)))/((YEAR(Saisie1!$A1039))))","v":1.0010526315789474},{"$f":"IF(O533+K533>0,I533,\"\")","v":""},{"$f":"IF(O533+K533>0,J533,\"\")","v":""},null,{"$f":"IF(O533+K533=0,\"\",(J533-I533))","v":""}]
["2023-09-10",3,{"$f":"IF(B534=\"\",\"\",VLOOKUP(B534,Liste1!$F$2:$I$9,2))","v":"Essai 3"},null,null,{"$f":"IF(B534=Liste1!$F$9,Liste1!$F$9*E534*100+MONTH($A534),0)","v":0},{"$f":"IF(B534=Liste1!$F$9,J534-I534,0)","v":0},{"$f":"IF(E534=\"\",\"\",VLOOKUP(E534,Liste1!$A$2:$B$41,2))","v":""},null,null,{"$f":"IF(Saisie1!$B1033=Liste1!$F$9,1,0)","v":0},{"$f":"IF(Saisie1!B1033=7,\"\",(Saisie1!E1033*100+(YEAR(Saisie1!$A1033)+MONTH(Saisie1!$A1033)+MONTH(Saisie1!$A1033)))/((YEAR(Saisie1!$A1033))))","v":1.0010526315789474},{"$f":"IF(O534+K534>0,I534,\"\")","v":""},{"$f":"IF(O534+K534>0,J534,\"\")","v":""},null,{"$f":"IF(O534+K534=0,\"\",(J534-I534))","v":""}]
["2023-09-10",3,{"$f":"IF(B535=\"\",\"\",VLOOKUP(B535,Liste1!$F$2:$I$9,2))","v":"Essai 3"},null,null,{"$f":"IF(B535=Liste1!$F$9,Liste1!$F$9*E535*100+MONTH($A535),0)","v":0},{"$f":"IF(B535=Liste1!$F$9,J535-I535,0)","v":0},{"$f":"IF(E535=\"\",\"\",VLOOKUP(E535,Liste1!$A$2:$B$41,2))","v":""},null,null,{"$f":"IF(Saisie1!$B1037=Liste1!$F$9,1,0)","v":0},{"$f":"IF(Saisie1!B1037=7,\"\",(Saisie1!E1037*100+(YEAR(Saisie1!$A1037)+MONTH(Saisie1!$A1037)+MONTH(Saisie1!$A1037)))/((YEAR(Saisie1!$A1037))))","v":1.0010526315789474},{"$f":"IF(O535+K535>0,I535,\"\")","v":""},{"$f":"IF(O535+K535>0,J535,\"\")","v":""},null,{"$f":"IF(O535+K535=0,\"\",(J535-I535))","v":""}]
["2023-09-10",3,{"$f":"IF(B536=\"\",\"\",VLOOKUP(B536,Liste1!$F$2:$I$9,2))","v":"Essai 3"},null,null,{"$f":"IF(B536=Liste1!$F$9,Liste1!$F$9*E536*100+MONTH($A536),0)","v":0},{"$f":"IF(B536=Liste1!$F$9,J536-I536,0)","v":0},{"$f":"IF(E536=\"\",\"\",VLOOKUP(E536,Liste1!$A$2:$B$41,2))","v":""},null,null,{"$f":"IF(Saisie1!$B1042=Liste1!$F$9,1,0)","v":0},{"$f":"IF(Saisie1!B1042=7,\"\",(Saisie1!E1042*100+(YEAR(Saisie1!$A1042)+MONTH(Saisie1!$A1042)+MONTH(Saisie1!$A1042)))/((YEAR(Saisie1!$A1042))))","v":1.0010526315789474},{"$f":"IF(O536+K536>0,I536,\"\")","v":""},{"$f":"IF(O536+K536>0,J536,\"\")","v":""},null,{"$f":"IF(O536+K536=0,\"\",(J536-I536))","v":""}]
["2023-09-10",3,{"$f":"IF(B537=\"\",\"\",VLOOKUP(B537,Liste1!$F$2:$I$9,2))","v":"Essai 3"},null,null,{"$f":"IF(B537=Liste1!$F$9,Liste1!$F$9*E537*100+MONTH($A537),0)","v":0},{"$f":"IF(B537=Liste1!$F$9,J537-I537,0)","v":0},{"$f":"IF(E537=\"\",\"\",VLOOKUP(E537,Liste1!$A$2:$B$41,2))","v":""},null,null,{"$f":"IF(Saisie1!$B1041=Liste1!$F$9,1,0)","v":0},{"$f":"IF(Saisie1!B1041=7,\"\",(Saisie1!E1041*100+(YEAR(Saisie1!$A1041)+MONTH(Saisie1!$A1041)+MONTH(Saisie1!$A1041)))/((YEAR(Saisie1!$A1041))))","v":1.0010526315789474},{"$f":"IF(O537+K537>0,I537,\"\")","v":""},{"$f":"IF(O537+K537>0,J537,\"\")","v":""},null,{"$f":"IF(O537+K537=0,\"\",(J537-I537))","v":""}]
["2023-09-13T18:06:09",5,{"$f":"IF(B538=\"\",\"\",VLOOKUP(B538,Liste1!$F$2:$I$9,2))","v":"Essai 5"},null,null,{"$f":"IF(B538=Liste1!$F$9,Liste1!$F$9*E538*100+MONTH($A538),0)","v":0},{"$f":"IF(B538=Liste1!$F$9,J538-I538,0)","v":0},{"$f":"IF(E538=\"\",\"\",VLOOKUP(E538,Liste1!$A$2:$B$41,2))","v":""},null,null,{"$f":"IF($B538=Liste1!$F$9,1,0)","v":0},{"$f":"IF(B538=7,\"\",(E538*100+(YEAR($A538)+MONTH($A538)+MONTH($A538)))/((YEAR($A538))))","v":1.008897676717746},{"$f":"IF(O538+K538>0,I538,\"\")","v":""},{"$f":"IF(O538+K538>0,J538,\"\")","v":""},null,{"$f":"IF(O538+K538=0,\"\",(J538-I538))","v":""}]
["2023-09-14",5,{"$f":"IF(B539=\"\",\"\",VLOOKUP(B539,Liste1!$F$2:$I$9,2))","v":"Essai 5"},null,null,{"$f":"IF(B539=Liste1!$F$9,Liste1!$F$9*E539*100+MONTH($A539),0)","v":0},{"$f":"IF(B539=Liste1!$F$9,J539-I539,0)","v":0},{"$f":"IF(E539=\"\",\"\",VLOOKUP(E539,Liste1!$A$2:$B$41,2))","v":""},null,null,{"$f":"IF($B539=Liste1!$F$9,1,0)","v":0},{"$f":"IF(B539=7,\"\",(E539*100+(YEAR($A539)+MONTH($A539)+MONTH($A539)))/((YEAR($A539))))","v":1.008897676717746},{"$f":"IF(O539+K539>0,I539,\"\")","v":""},{"$f":"IF(O539+K539>0,J539,\"\")","v":""},null,{"$f":"IF(O539+K539=0,\"\",(J539-I539))","v":""}]
["2023-09-14",3,{"$f":"IF(B540=\"\",\"\",VLOOKUP(B540,Liste1!$F$2:$I$9,2))","v":"Essai 3"},null,null,{"$f":"IF(B540=Liste1!$F$9,Liste1!$F$9*E540*100+MONTH($A540),0)","v":0},{"$f":"IF(B540=Liste1!$F$9,J540-I540,0)","v":0},{"$f":"IF(E540=\"\",\"\",VLOOKUP(E540,Liste1!$A$2:$B$41,2))","v":""},null,null,{"$f":"IF($B540=Liste1!$F$9,1,0)","v":0},{"$f":"IF(B540=7,\"\",(E540*100+(YEAR($A540)+MONTH($A540)+MONTH($A540)))/((YEAR($A540))))","v":1.008897676717746},{"$f":"IF(O540+K540>0,I540,\"\")","v":""},{"$f":"IF(O540+K540>0,J540,\"\")","v":""},null,{"$f":"IF(O540+K540=0,\"\",(J540-I540))","v":""}]
["2023-09-15",5,{"$f":"IF(B541=\"\",\"\",VLOOKUP(B541,Liste1!$F$2:$I$9,2))","v":"Essai 5"},null,null,{"$f":"IF(B541=Liste1!$F$9,Liste1!$F$9*E541*100+MONTH($A541),0)","v":0},{"$f":"IF(B541=Liste1!$F$9,J541-I541,0)","v":0},{"$f":"IF(E541=\"\",\"\",VLOOKUP(E541,Liste1!$A$2:$B$41,2))","v":""},null,null,{"$f":"IF($B541=Liste1!$F$9,1,0)","v":0},{"$f":"IF(B541=7,\"\",(E541*100+(YEAR($A541)+MONTH($A541)+MONTH($A541)))/((YEAR($A541))))","v":1.008897676717746},{"$f":"IF(O541+K541>0,I541,\"\")","v":""},{"$f":"IF(O541+K541>0,J541,\"\")","v":""},null,{"$f":"IF(O541+K541=0,\"\",(J541-I541))","v":""}]
["2023-09-15",2,{"$f":"IF(B542=\"\",\"\",VLOOKUP(B542,Liste1!$F$2:$I$9,2))","v":"Essai 2"},null,null,{"$f":"IF(B542=Liste1!$F$9,Liste1!$F$9*E542*100+MONTH($A542),0)","v":0},{"$f":"IF(B542=Liste1!$F$9,J542-I542,0)","v":0},{"$f":"IF(E542=\"\",\"\",VLOOKUP(E542,Liste1!$A$2:$B$41,2))","v":""},null,null,{"$f":"IF($B542=Liste1!$F$9,1,0)","v":0},{"$f":"IF(B542=7,\"\",(E542*100+(YEAR($A542)+MONTH($A542)+MONTH($A542)))/((YEAR($A542))))","v":1.008897676717746},{"$f":"IF(O542+K542>0,I542,\"\")","v":""},{"$f":"IF(O542+K542>0,J542,\"\")","v":""},null,{"$f":"IF(O542+K542=0,\"\",(J542-I542))","v":""}]
["2023-09-16",2,{"$f":"IF(B543=\"\",\"\",VLOOKUP(B543,Liste1!$F$2:$I$9,2))","v":"Essai 2"},null,null,{"$f":"IF(B543=Liste1!$F$9,Liste1!$F$9*E543*100+MONTH($A543),0)","v":0},{"$f":"IF(B543=Liste1!$F$9,J543-I543,0)","v":0},{"$f":"IF(E543=\"\",\"\",VLOOKUP(E543,Liste1!$A$2:$B$41,2))","v":""},null,null,{"$f":"IF($B543=Liste1!$F$9,1,0)","v":0},{"$f":"IF(B543=7,\"\",(E543*100+(YEAR($A543)+MONTH($A543)+MONTH($A543)))/((YEAR($A543))))","v":1.008897676717746},{"$f":"IF(O543+K543>0,I543,\"\")","v":""},{"$f":"IF(O543+K543>0,J543,\"\")","v":""},null,{"$f":"IF(O543+K543=0,\"\",(J543-I543))","v":""}]
["2023-09-16",2,{"$f":"IF(B544=\"\",\"\",VLOOKUP(B544,Liste1!$F$2:$I$9,2))","v":"Essai 2"},null,null,{"$f":"IF(B544=Liste1!$F$9,Liste1!$F$9*E544*100+MONTH($A544),0)","v":0},{"$f":"IF(B544=Liste1!$F$9,J544-I544,0)","v":0},{"$f":"IF(E544=\"\",\"\",VLOOKUP(E544,Liste1!$A$2:$B$41,2))","v":""},null,null,{"$f":"IF($B544=Liste1!$F$9,1,0)","v":0},{"$f":"IF(B544=7,\"\",(E544*100+(YEAR($A544)+MONTH($A544)+MONTH($A544)))/((YEAR($A544))))","v":1.008897676717746},{"$f":"IF(O544+K544>0,I544,\"\")","v":""},{"$f":"IF(O544+K544>0,J544,\"\")","v":""},null,{"$f":"IF(O544+K544=0,\"\",(J544-I544))","v":""}]
["2023-09-17",1,{"$f":"IF(B545=\"\",\"\",VLOOKUP(B545,Liste1!$F$2:$I$9,2))","v":"Essai 1"},null,null,{"$f":"IF(B545=Liste1!$F$9,Liste1!$F$9*E545*100+MONTH($A545),0)","v":0},{"$f":"IF(B545=Liste1!$F$9,J545-I545,0)","v":0},{"$f":"IF(E545=\"\",\"\",VLOOKUP(E545,Liste1!$A$2:$B$41,2))","v":""},null,null,{"$f":"IF($B545=Liste1!$F$9,1,0)","v":0},{"$f":"IF(B545=7,\"\",(E545*100+(YEAR($A545)+MONTH($A545)+MONTH($A545)))/((YEAR($A545))))","v":1.008897676717746},{"$f":"IF(O545+K545>0,I545,\"\")","v":""},{"$f":"IF(O545+K545>0,J545,\"\")","v":""},null,{"$f":"IF(O545+K545=0,\"\",(J545-I545))","v":""}]
["2023-09-17",2,{"$f":"IF(B546=\"\",\"\",VLOOKUP(B546,Liste1!$F$2:$I$9,2))","v":"Essai 2"},null,null,{"$f":"IF(B546=Liste1!$F$9,Liste1!$F$9*E546*100+MONTH($A546),0)","v":0},{"$f":"IF(B546=Liste1!$F$9,J546-I546,0)","v":0},{"$f":"IF(E546=\"\",\"\",VLOOKUP(E546,Liste1!$A$2:$B$41,2))","v":""},null,null,{"$f":"IF($B546=Liste1!$F$9,1,0)","v":0},{"$f":"IF(B546=7,\"\",(E546*100+(YEAR($A546)+MONTH($A546)+MONTH($A546)))/((YEAR($A546))))","v":1.008897676717746},{"$f":"IF(O546+K546>0,I546,\"\")","v":""},{"$f":"IF(O546+K546>0,J546,\"\")","v":""},null,{"$f":"IF(O546+K546=0,\"\",(J546-I546))","v":""}]
["2023-09-19",5,{"$f":"IF(B547=\"\",\"\",VLOOKUP(B547,Liste1!$F$2:$I$9,2))","v":"Essai 5"},null,null,{"$f":"IF(B547=Liste1!$F$9,Liste1!$F$9*E547*100+MONTH($A547),0)","v":0},{"$f":"IF(B547=Liste1!$F$9,J547-I547,0)","v":0},{"$f":"IF(E547=\"\",\"\",VLOOKUP(E547,Liste1!$A$2:$B$41,2))","v":""},null,null,{"$f":"IF($B547=Liste1!$F$9,1,0)","v":0},{"$f":"IF(B547=7,\"\",(E547*100+(YEAR($A547)+MONTH($A547)+MONTH($A547)))/((YEAR($A547))))","v":1.008897676717746},{"$f":"IF(O547+K547>0,I547,\"\")","v":""},{"$f":"IF(O547+K547>0,J547,\"\")","v":""},null,{"$f":"IF(O547+K547=0,\"\",(J547-I547))","v":""}]
["2023-09-19",2,{"$f":"IF(B548=\"\",\"\",VLOOKUP(B548,Liste1!$F$2:$I$9,2))","v":"Essai 2"},null,null,{"$f":"IF(B548=Liste1!$F$9,Liste1!$F$9*E548*100+MONTH($A548),0)","v":0},{"$f":"IF(B548=Liste1!$F$9,J548-I548,0)","v":0},{"$f":"IF(E548=\"\",\"\",VLOOKUP(E548,Liste1!$A$2:$B$41,2))","v":""},null,null,{"$f":"IF($B548=Liste1!$F$9,1,0)","v":0},{"$f":"IF(B548=7,\"\",(E548*100+(YEAR($A548)+MONTH($A548)+MONTH($A548)))/((YEAR($A548))))","v":1.008897676717746},{"$f":"IF(O548+K548>0,I548,\"\")","v":""},{"$f":"IF(O548+K548>0,J548,\"\")","v":""},null,{"$f":"IF(O548+K548=0,\"\",(J548-I548))","v":""}]
["2023-09-19",2,{"$f":"IF(B549=\"\",\"\",VLOOKUP(B549,Liste1!$F$2:$I$9,2))","v":"Essai 2"},null,null,{"$f":"IF(B549=Liste1!$F$9,Liste1!$F$9*E549*100+MONTH($A549),0)","v":0},{"$f":"IF(B549=Liste1!$F$9,J549-I549,0)","v":0},{"$f":"IF(E549=\"\",\"\",VLOOKUP(E549,Liste1!$A$2:$B$41,2))","v":""},null,null,{"$f":"IF($B549=Liste1!$F$9,1,0)","v":0},{"$f":"IF(B549=7,\"\",(E549*100+(YEAR($A549)+MONTH($A549)+MONTH($A549)))/((YEAR($A549))))","v":1.008897676717746},{"$f":"IF(O549+K549>0,I549,\"\")","v":""},{"$f":"IF(O549+K549>0,J549,\"\")","v":""},null,{"$f":"IF(O549+K549=0,\"\",(J549-I549))","v":""}]
["2023-09-19",2,{"$f":"IF(B550=\"\",\"\",VLOOKUP(B550,Liste1!$F$2:$I$9,2))","v":"Essai 2"},null,null,{"$f":"IF(B550=Liste1!$F$9,Liste1!$F$9*E550*100+MONTH($A550),0)","v":0},{"$f":"IF(B550=Liste1!$F$9,J550-I550,0)","v":0},{"$f":"IF(E550=\"\",\"\",VLOOKUP(E550,Liste1!$A$2:$B$41,2))","v":""},null,null,{"$f":"IF($B550=Liste1!$F$9,1,0)","v":0},{"$f":"IF(B550=7,\"\",(E550*100+(YEAR($A550)+MONTH($A550)+MONTH($A550)))/((YEAR($A550))))","v":1.008897676717746},{"$f":"IF(O550+K550>0,I550,\"\")","v":""},{"$f":"IF(O550+K550>0,J550,\"\")","v":""},null,{"$f":"IF(O550+K550=0,\"\",(J550-I550))","v":""}]
["2023-09-20",3,{"$f":"IF(B551=\"\",\"\",VLOOKUP(B551,Liste1!$F$2:$I$9,2))","v":"Essai 3"},null,null,{"$f":"IF(B551=Liste1!$F$9,Liste1!$F$9*E551*100+MONTH($A551),0)","v":0},{"$f":"IF(B551=Liste1!$F$9,J551-I551,0)","v":0},{"$f":"IF(E551=\"\",\"\",VLOOKUP(E551,Liste1!$A$2:$B$41,2))","v":""},null,null,{"$f":"IF($B551=Liste1!$F$9,1,0)","v":0},{"$f":"IF(B551=7,\"\",(E551*100+(YEAR($A551)+MONTH($A551)+MONTH($A551)))/((YEAR($A551))))","v":1.008897676717746},{"$f":"IF(O551+K551>0,I551,\"\")","v":""},{"$f":"IF(O551+K551>0,J551,\"\")","v":""},null,{"$f":"IF(O551+K551=0,\"\",(J551-I551))","v":""}]
["2023-09-20T19:06:28",3,{"$f":"IF(B552=\"\",\"\",VLOOKUP(B552,Liste1!$F$2:$I$9,2))","v":"Essai 3"},null,null,{"$f":"IF(B552=Liste1!$F$9,Liste1!$F$9*E552*100+MONTH($A552),0)","v":0},{"$f":"IF(B552=Liste1!$F$9,J552-I552,0)","v":0},{"$f":"IF(E552=\"\",\"\",VLOOKUP(E552,Liste1!$A$2:$B$41,2))","v":""},null,null,{"$f":"IF($B552=Liste1!$F$9,1,0)","v":0},{"$f":"IF(B552=7,\"\",(E552*100+(YEAR($A552)+MONTH($A552)+MONTH($A552)))/((YEAR($A552))))","v":1.008897676717746},{"$f":"IF(O552+K552>0,I552,\"\")","v":""},{"$f":"IF(O552+K552>0,J552,\"\")","v":""},null,{"$f":"IF(O552+K552=0,\"\",(J552-I552))","v":""}]
["2023-09-21T19:13:18",3,{"$f":"IF(B553=\"\",\"\",VLOOKUP(B553,Liste1!$F$2:$I$9,2))","v":"Essai 3"},null,null,{"$f":"IF(B553=Liste1!$F$9,Liste1!$F$9*E553*100+MONTH($A553),0)","v":0},{"$f":"IF(B553=Liste1!$F$9,J553-I553,0)","v":0},{"$f":"IF(E553=\"\",\"\",VLOOKUP(E553,Liste1!$A$2:$B$41,2))","v":""},null,null,{"$f":"IF($B553=Liste1!$F$9,1,0)","v":0},{"$f":"IF(B553=7,\"\",(E553*100+(YEAR($A553)+MONTH($A553)+MONTH($A553)))/((YEAR($A553))))","v":1.008897676717746},{"$f":"IF(O553+K553>0,I553,\"\")","v":""},{"$f":"IF(O553+K553>0,J553,\"\")","v":""},null,{"$f":"IF(O553+K553=0,\"\",(J553-I553))","v":""}]
["2023-09-21T19:19:19",5,{"$f":"IF(B554=\"\",\"\",VLOOKUP(B554,Liste1!$F$2:$I$9,2))","v":"Essai 5"},null,null,{"$f":"IF(B554=Liste1!$F$9,Liste1!$F$9*E554*100+MONTH($A554),0)","v":0},{"$f":"IF(B554=Liste1!$F$9,J554-I554,0)","v":0},{"$f":"IF(E554=\"\",\"\",VLOOKUP(E554,Liste1!$A$2:$B$41,2))","v":""},null,null,{"$f":"IF($B554=Liste1!$F$9,1,0)","v":0},{"$f":"IF(B554=7,\"\",(E554*100+(YEAR($A554)+MONTH($A554)+MONTH($A554)))/((YEAR($A554))))","v":1.008897676717746},{"$f":"IF(O554+K554>0,I554,\"\")","v":""},{"$f":"IF(O554+K554>0,J554,\"\")","v":""},null,{"$f":"IF(O554+K554=0,\"\",(J554-I554))","v":""}]
["2023-09-23",4,{"$f":"IF(B555=\"\",\"\",VLOOKUP(B555,Liste1!$F$2:$I$9,2))","v":"Essai 4"},null,null,{"$f":"IF(B555=Liste1!$F$9,Liste1!$F$9*E555*100+MONTH($A555),0)","v":0},{"$f":"IF(B555=Liste1!$F$9,J555-I555,0)","v":0},{"$f":"IF(E555=\"\",\"\",VLOOKUP(E555,Liste1!$A$2:$B$41,2))","v":""},null,null,{"$f":"IF($B555=Liste1!$F$9,1,0)","v":0},{"$f":"IF(B555=7,\"\",(E555*100+(YEAR($A555)+MONTH($A555)+MONTH($A555)))/((YEAR($A555))))","v":1.008897676717746},{"$f":"IF(O555+K555>0,I555,\"\")","v":""},{"$f":"IF(O555+K555>0,J555,\"\")","v":""},null,{"$f":"IF(O555+K555=0,\"\",(J555-I555))","v":""}]
["2023-09-23T16:05:59",4,{"$f":"IF(B556=\"\",\"\",VLOOKUP(B556,Liste1!$F$2:$I$9,2))","v":"Essai 4"},null,null,{"$f":"IF(B556=Liste1!$F$9,Liste1!$F$9*E556*100+MONTH($A556),0)","v":0},{"$f":"IF(B556=Liste1!$F$9,J556-I556,0)","v":0},{"$f":"IF(E556=\"\",\"\",VLOOKUP(E556,Liste1!$A$2:$B$41,2))","v":""},null,null,{"$f":"IF($B556=Liste1!$F$9,1,0)","v":0},{"$f":"IF(B556=7,\"\",(E556*100+(YEAR($A556)+MONTH($A556)+MONTH($A556)))/((YEAR($A556))))","v":1.008897676717746},{"$f":"IF(O556+K556>0,I556,\"\")","v":""},{"$f":"IF(O556+K556>0,J556,\"\")","v":""},null,{"$f":"IF(O556+K556=0,\"\",(J556-I556))","v":""}]
["2023-09-24T19:00:34",2,{"$f":"IF(B557=\"\",\"\",VLOOKUP(B557,Liste1!$F$2:$I$9,2))","v":"Essai 2"},null,null,{"$f":"IF(B557=Liste1!$F$9,Liste1!$F$9*E557*100+MONTH($A557),0)","v":0},{"$f":"IF(B557=Liste1!$F$9,J557-I557,0)","v":0},{"$f":"IF(E557=\"\",\"\",VLOOKUP(E557,Liste1!$A$2:$B$41,2))","v":""},null,null,{"$f":"IF($B557=Liste1!$F$9,1,0)","v":0},{"$f":"IF(B557=7,\"\",(E557*100+(YEAR($A557)+MONTH($A557)+MONTH($A557)))/((YEAR($A557))))","v":1.008897676717746},{"$f":"IF(O557+K557>0,I557,\"\")","v":""},{"$f":"IF(O557+K557>0,J557,\"\")","v":""},null,{"$f":"IF(O557+K557=0,\"\",(J557-I557))","v":""}]
["2023-09-25",3,{"$f":"IF(B558=\"\",\"\",VLOOKUP(B558,Liste1!$F$2:$I$9,2))","v":"Essai 3"},null,null,{"$f":"IF(B558=Liste1!$F$9,Liste1!$F$9*E558*100+MONTH($A558),0)","v":0},{"$f":"IF(B558=Liste1!$F$9,J558-I558,0)","v":0},{"$f":"IF(E558=\"\",\"\",VLOOKUP(E558,Liste1!$A$2:$B$41,2))","v":""},null,null,{"$f":"IF($B558=Liste1!$F$9,1,0)","v":0},{"$f":"IF(B558=7,\"\",(E558*100+(YEAR($A558)+MONTH($A558)+MONTH($A558)))/((YEAR($A558))))","v":1.008897676717746},{"$f":"IF(O558+K558>0,I558,\"\")","v":""},{"$f":"IF(O558+K558>0,J558,\"\")","v":""},null,{"$f":"IF(O558+K558=0,\"\",(J558-I558))","v":""}]
["2023-09-25T10:38:26",5,{"$f":"IF(B559=\"\",\"\",VLOOKUP(B559,Liste1!$F$2:$I$9,2))","v":"Essai 5"},null,null,{"$f":"IF(B559=Liste1!$F$9,Liste1!$F$9*E559*100+MONTH($A559),0)","v":0},{"$f":"IF(B559=Liste1!$F$9,J559-I559,0)","v":0},{"$f":"IF(E559=\"\",\"\",VLOOKUP(E559,Liste1!$A$2:$B$41,2))","v":""},null,null,{"$f":"IF($B559=Liste1!$F$9,1,0)","v":0},{"$f":"IF(B559=7,\"\",(E559*100+(YEAR($A559)+MONTH($A559)+MONTH($A559)))/((YEAR($A559))))","v":1.008897676717746},{"$f":"IF(O559+K559>0,I559,\"\")","v":""},{"$f":"IF(O559+K559>0,J559,\"\")","v":""},null,{"$f":"IF(O559+K559=0,\"\",(J559-I559))","v":""}]
["2023-09-25T10:44:23",3,{"$f":"IF(B560=\"\",\"\",VLOOKUP(B560,Liste1!$F$2:$I$9,2))","v":"Essai 3"},null,null,{"$f":"IF(B560=Liste1!$F$9,Liste1!$F$9*E560*100+MONTH($A560),0)","v":0},{"$f":"IF(B560=Liste1!$F$9,J560-I560,0)","v":0},{"$f":"IF(E560=\"\",\"\",VLOOKUP(E560,Liste1!$A$2:$B$41,2))","v":""},null,null,{"$f":"IF($B560=Liste1!$F$9,1,0)","v":0},{"$f":"IF(B560=7,\"\",(E560*100+(YEAR($A560)+MONTH($A560)+MONTH($A560)))/((YEAR($A560))))","v":1.008897676717746},{"$f":"IF(O560+K560>0,I560,\"\")","v":""},{"$f":"IF(O560+K560>0,J560,\"\")","v":""},null,{"$f":"IF(O560+K560=0,\"\",(J560-I560))","v":""}]
["2023-09-25T10:59:14",5,{"$f":"IF(B561=\"\",\"\",VLOOKUP(B561,Liste1!$F$2:$I$9,2))","v":"Essai 5"},null,null,{"$f":"IF(B561=Liste1!$F$9,Liste1!$F$9*E561*100+MONTH($A561),0)","v":0},{"$f":"IF(B561=Liste1!$F$9,J561-I561,0)","v":0},{"$f":"IF(E561=\"\",\"\",VLOOKUP(E561,Liste1!$A$2:$B$41,2))","v":""},null,null,{"$f":"IF($B561=Liste1!$F$9,1,0)","v":0},{"$f":"IF(B561=7,\"\",(E561*100+(YEAR($A561)+MONTH($A561)+MONTH($A561)))/((YEAR($A561))))","v":1.008897676717746},{"$f":"IF(O561+K561>0,I561,\"\")","v":""},{"$f":"IF(O561+K561>0,J561,\"\")","v":""},null,{"$f":"IF(O561+K561=0,\"\",(J561-I561))","v":""}]
["2023-09-25T11:00:21",8,{"$f":"IF(B562=\"\",\"\",VLOOKUP(B562,Liste1!$F$2:$I$9,2))","v":"Essai 8"},null,null,{"$f":"IF(B562=Liste1!$F$9,Liste1!$F$9*E562*100+MONTH($A562),0)","v":9},{"$f":"IF(B562=Liste1!$F$9,J562-I562,0)","v":0},{"$f":"IF(E562=\"\",\"\",VLOOKUP(E562,Liste1!$A$2:$B$41,2))","v":""},null,null,{"$f":"IF($B562=Liste1!$F$9,1,0)","v":1},{"$f":"IF(B562=7,\"\",(E562*100+(YEAR($A562)+MONTH($A562)+MONTH($A562)))/((YEAR($A562))))","v":1.008897676717746},{"$f":"IF(O562+K562>0,I562,\"\")","v":0},{"$f":"IF(O562+K562>0,J562,\"\")","v":0},null,{"$f":"IF(O562+K562=0,\"\",(J562-I562))","v":0}]
["2023-09-25T12:48:56",3,{"$f":"IF(B563=\"\",\"\",VLOOKUP(B563,Liste1!$F$2:$I$9,2))","v":"Essai 3"},null,null,{"$f":"IF(B563=Liste1!$F$9,Liste1!$F$9*E563*100+MONTH($A563),0)","v":0},{"$f":"IF(B563=Liste1!$F$9,J563-I563,0)","v":0},{"$f":"IF(E563=\"\",\"\",VLOOKUP(E563,Liste1!$A$2:$B$41,2))","v":""},null,null,{"$f":"IF($B563=Liste1!$F$9,1,0)","v":0},{"$f":"IF(B563=7,\"\",(E563*100+(YEAR($A563)+MONTH($A563)+MONTH($A563)))/((YEAR($A563))))","v":1.008897676717746},{"$f":"IF(O563+K563>0,I563,\"\")","v":""},{"$f":"IF(O563+K563>0,J563,\"\")","v":""},null,{"$f":"IF(O563+K563=0,\"\",(J563-I563))","v":""}]
["2023-09-28T19:39:15",4,{"$f":"IF(B564=\"\",\"\",VLOOKUP(B564,Liste1!$F$2:$I$9,2))","v":"Essai 4"},null,null,{"$f":"IF(B564=Liste1!$F$9,Liste1!$F$9*E564*100+MONTH($A564),0)","v":0},{"$f":"IF(B564=Liste1!$F$9,J564-I564,0)","v":0},{"$f":"IF(E564=\"\",\"\",VLOOKUP(E564,Liste1!$A$2:$B$41,2))","v":""},null,null,{"$f":"IF($B564=Liste1!$F$9,1,0)","v":0},{"$f":"IF(B564=7,\"\",(E564*100+(YEAR($A564)+MONTH($A564)+MONTH($A564)))/((YEAR($A564))))","v":1.008897676717746},{"$f":"IF(O564+K564>0,I564,\"\")","v":""},{"$f":"IF(O564+K564>0,J564,\"\")","v":""},null,{"$f":"IF(O564+K564=0,\"\",(J564-I564))","v":""}]
["2023-09-28T19:40:26",4,{"$f":"IF(B565=\"\",\"\",VLOOKUP(B565,Liste1!$F$2:$I$9,2))","v":"Essai 4"},null,null,{"$f":"IF(B565=Liste1!$F$9,Liste1!$F$9*E565*100+MONTH($A565),0)","v":0},{"$f":"IF(B565=Liste1!$F$9,J565-I565,0)","v":0},{"$f":"IF(E565=\"\",\"\",VLOOKUP(E565,Liste1!$A$2:$B$41,2))","v":""},null,null,{"$f":"IF($B565=Liste1!$F$9,1,0)","v":0},{"$f":"IF(B565=7,\"\",(E565*100+(YEAR($A565)+MONTH($A565)+MONTH($A565)))/((YEAR($A565))))","v":1.008897676717746},{"$f":"IF(O565+K565>0,I565,\"\")","v":""},{"$f":"IF(O565+K565>0,J565,\"\")","v":""},null,{"$f":"IF(O565+K565=0,\"\",(J565-I565))","v":""}]
["2023-09-29T18:18:54",4,{"$f":"IF(B566=\"\",\"\",VLOOKUP(B566,Liste1!$F$2:$I$9,2))","v":"Essai 4"},null,null,{"$f":"IF(B566=Liste1!$F$9,Liste1!$F$9*E566*100+MONTH($A566),0)","v":0},{"$f":"IF(B566=Liste1!$F$9,J566-I566,0)","v":0},{"$f":"IF(E566=\"\",\"\",VLOOKUP(E566,Liste1!$A$2:$B$41,2))","v":""},null,null,{"$f":"IF($B566=Liste1!$F$9,1,0)","v":0},{"$f":"IF(B566=7,\"\",(E566*100+(YEAR($A566)+MONTH($A566)+MONTH($A566)))/((YEAR($A566))))","v":1.008897676717746},{"$f":"IF(O566+K566>0,I566,\"\")","v":""},{"$f":"IF(O566+K566>0,J566,\"\")","v":""},null,{"$f":"IF(O566+K566=0,\"\",(J566-I566))","v":""}]
["2023-09-30",8,{"$f":"IF(B567=\"\",\"\",VLOOKUP(B567,Liste1!$F$2:$I$9,2))","v":"Essai 8"},null,null,{"$f":"IF(B567=Liste1!$F$9,Liste1!$F$9*E567*100+MONTH($A567),0)","v":9},{"$f":"IF(B567=Liste1!$F$9,J567-I567,0)","v":0},{"$f":"IF(E567=\"\",\"\",VLOOKUP(E567,Liste1!$A$2:$B$41,2))","v":""},null,null,{"$f":"IF($B567=Liste1!$F$9,1,0)","v":1},{"$f":"IF(B567=7,\"\",(E567*100+(YEAR($A567)+MONTH($A567)+MONTH($A567)))/((YEAR($A567))))","v":1.008897676717746},{"$f":"IF(O567+K567>0,I567,\"\")","v":0},{"$f":"IF(O567+K567>0,J567,\"\")","v":0},null,{"$f":"IF(O567+K567=0,\"\",(J567-I567))","v":0}]
["2023-09-30",2,{"$f":"IF(B568=\"\",\"\",VLOOKUP(B568,Liste1!$F$2:$I$9,2))","v":"Essai 2"},null,null,{"$f":"IF(B568=Liste1!$F$9,Liste1!$F$9*E568*100+MONTH($A568),0)","v":0},{"$f":"IF(B568=Liste1!$F$9,J568-I568,0)","v":0},{"$f":"IF(E568=\"\",\"\",VLOOKUP(E568,Liste1!$A$2:$B$41,2))","v":""},null,null,{"$f":"IF($B568=Liste1!$F$9,1,0)","v":0},{"$f":"IF(B568=7,\"\",(E568*100+(YEAR($A568)+MONTH($A568)+MONTH($A568)))/((YEAR($A568))))","v":1.008897676717746},{"$f":"IF(O568+K568>0,I568,\"\")","v":""},{"$f":"IF(O568+K568>0,J568,\"\")","v":""},null,{"$f":"IF(O568+K568=0,\"\",(J568-I568))","v":""}]
["2023-09-30",2,{"$f":"IF(B569=\"\",\"\",VLOOKUP(B569,Liste1!$F$2:$I$9,2))","v":"Essai 2"},null,null,{"$f":"IF(B569=Liste1!$F$9,Liste1!$F$9*E569*100+MONTH($A569),0)","v":0},{"$f":"IF(B569=Liste1!$F$9,J569-I569,0)","v":0},{"$f":"IF(E569=\"\",\"\",VLOOKUP(E569,Liste1!$A$2:$B$41,2))","v":""},null,null,{"$f":"IF($B569=Liste1!$F$9,1,0)","v":0},{"$f":"IF(B569=7,\"\",(E569*100+(YEAR($A569)+MONTH($A569)+MONTH($A569)))/((YEAR($A569))))","v":1.008897676717746},{"$f":"IF(O569+K569>0,I569,\"\")","v":""},{"$f":"IF(O569+K569>0,J569,\"\")","v":""},null,{"$f":"IF(O569+K569=0,\"\",(J569-I569))","v":""}]
["2023-10-01",5,{"$f":"IF(B570=\"\",\"\",VLOOKUP(B570,Liste1!$F$2:$I$9,2))","v":"Essai 5"},null,null,{"$f":"IF(B570=Liste1!$F$9,Liste1!$F$9*E570*100+MONTH($A570),0)","v":0},{"$f":"IF(B570=Liste1!$F$9,J570-I570,0)","v":0},{"$f":"IF(E570=\"\",\"\",VLOOKUP(E570,Liste1!$A$2:$B$41,2))","v":""},null,null,{"$f":"IF($B570=Liste1!$F$9,1,0)","v":0},{"$f":"IF(B570=7,\"\",(E570*100+(YEAR($A570)+MONTH($A570)+MONTH($A570)))/((YEAR($A570))))","v":1.0098863074641622},{"$f":"IF(O570+K570>0,I570,\"\")","v":""},{"$f":"IF(O570+K570>0,J570,\"\")","v":""},null,{"$f":"IF(O570+K570=0,\"\",(J570-I570))","v":""}]
["2023-10-01",3,{"$f":"IF(B571=\"\",\"\",VLOOKUP(B571,Liste1!$F$2:$I$9,2))","v":"Essai 3"},null,null,{"$f":"IF(B571=Liste1!$F$9,Liste1!$F$9*E571*100+MONTH($A571),0)","v":0},{"$f":"IF(B571=Liste1!$F$9,J571-I571,0)","v":0},{"$f":"IF(E571=\"\",\"\",VLOOKUP(E571,Liste1!$A$2:$B$41,2))","v":""},null,null,{"$f":"IF($B571=Liste1!$F$9,1,0)","v":0},{"$f":"IF(B571=7,\"\",(E571*100+(YEAR($A571)+MONTH($A571)+MONTH($A571)))/((YEAR($A571))))","v":1.0098863074641622},{"$f":"IF(O571+K571>0,I571,\"\")","v":""},{"$f":"IF(O571+K571>0,J571,\"\")","v":""},null,{"$f":"IF(O571+K571=0,\"\",(J571-I571))","v":""}]
["2023-10-01T14:15:29",5,{"$f":"IF(B572=\"\",\"\",VLOOKUP(B572,Liste1!$F$2:$I$9,2))","v":"Essai 5"},null,null,{"$f":"IF(B572=Liste1!$F$9,Liste1!$F$9*E572*100+MONTH($A572),0)","v":0},{"$f":"IF(B572=Liste1!$F$9,J572-I572,0)","v":0},{"$f":"IF(E572=\"\",\"\",VLOOKUP(E572,Liste1!$A$2:$B$41,2))","v":""},null,null,{"$f":"IF($B572=Liste1!$F$9,1,0)","v":0},{"$f":"IF(B572=7,\"\",(E572*100+(YEAR($A572)+MONTH($A572)+MONTH($A572)))/((YEAR($A572))))","v":1.0098863074641622},{"$f":"IF(O572+K572>0,I572,\"\")","v":""},{"$f":"IF(O572+K572>0,J572,\"\")","v":""},null,{"$f":"IF(O572+K572=0,\"\",(J572-I572))","v":""}]
["2023-10-01T14:36:10",2,{"$f":"IF(B573=\"\",\"\",VLOOKUP(B573,Liste1!$F$2:$I$9,2))","v":"Essai 2"},null,null,{"$f":"IF(B573=Liste1!$F$9,Liste1!$F$9*E573*100+MONTH($A573),0)","v":0},{"$f":"IF(B573=Liste1!$F$9,J573-I573,0)","v":0},{"$f":"IF(E573=\"\",\"\",VLOOKUP(E573,Liste1!$A$2:$B$41,2))","v":""},null,null,{"$f":"IF($B573=Liste1!$F$9,1,0)","v":0},{"$f":"IF(B573=7,\"\",(E573*100+(YEAR($A573)+MONTH($A573)+MONTH($A573)))/((YEAR($A573))))","v":1.0098863074641622},{"$f":"IF(O573+K573>0,I573,\"\")","v":""},{"$f":"IF(O573+K573>0,J573,\"\")","v":""},null,{"$f":"IF(O573+K573=0,\"\",(J573-I573))","v":""}]
["2023-10-02T09:22:47",8,{"$f":"IF(B574=\"\",\"\",VLOOKUP(B574,Liste1!$F$2:$I$9,2))","v":"Essai 8"},null,null,{"$f":"IF(B574=Liste1!$F$9,Liste1!$F$9*E574*100+MONTH($A574),0)","v":10},{"$f":"IF(B574=Liste1!$F$9,J574-I574,0)","v":0},{"$f":"IF(E574=\"\",\"\",VLOOKUP(E574,Liste1!$A$2:$B$41,2))","v":""},null,null,{"$f":"IF($B574=Liste1!$F$9,1,0)","v":1},{"$f":"IF(B574=7,\"\",(E574*100+(YEAR($A574)+MONTH($A574)+MONTH($A574)))/((YEAR($A574))))","v":1.0098863074641622},{"$f":"IF(O574+K574>0,I574,\"\")","v":0},{"$f":"IF(O574+K574>0,J574,\"\")","v":0},null,{"$f":"IF(O574+K574=0,\"\",(J574-I574))","v":0}]
["2023-10-02T09:22:50",8,{"$f":"IF(B575=\"\",\"\",VLOOKUP(B575,Liste1!$F$2:$I$9,2))","v":"Essai 8"},null,null,{"$f":"IF(B575=Liste1!$F$9,Liste1!$F$9*E575*100+MONTH($A575),0)","v":10},{"$f":"IF(B575=Liste1!$F$9,J575-I575,0)","v":0},{"$f":"IF(E575=\"\",\"\",VLOOKUP(E575,Liste1!$A$2:$B$41,2))","v":""},null,null,{"$f":"IF($B575=Liste1!$F$9,1,0)","v":1},{"$f":"IF(B575=7,\"\",(E575*100+(YEAR($A575)+MONTH($A575)+MONTH($A575)))/((YEAR($A575))))","v":1.0098863074641622},{"$f":"IF(O575+K575>0,I575,\"\")","v":0},{"$f":"IF(O575+K575>0,J575,\"\")","v":0},null,{"$f":"IF(O575+K575=0,\"\",(J575-I575))","v":0}]
["2023-10-02T09:28:38",8,{"$f":"IF(B576=\"\",\"\",VLOOKUP(B576,Liste1!$F$2:$I$9,2))","v":"Essai 8"},null,null,{"$f":"IF(B576=Liste1!$F$9,Liste1!$F$9*E576*100+MONTH($A576),0)","v":10},{"$f":"IF(B576=Liste1!$F$9,J576-I576,0)","v":0},{"$f":"IF(E576=\"\",\"\",VLOOKUP(E576,Liste1!$A$2:$B$41,2))","v":""},null,null,{"$f":"IF($B576=Liste1!$F$9,1,0)","v":1},{"$f":"IF(B576=7,\"\",(E576*100+(YEAR($A576)+MONTH($A576)+MONTH($A576)))/((YEAR($A576))))","v":1.0098863074641622},{"$f":"IF(O576+K576>0,I576,\"\")","v":0},{"$f":"IF(O576+K576>0,J576,\"\")","v":0},null,{"$f":"IF(O576+K576=0,\"\",(J576-I576))","v":0}]
["2023-10-03",8,{"$f":"IF(B577=\"\",\"\",VLOOKUP(B577,Liste1!$F$2:$I$9,2))","v":"Essai 8"},null,null,{"$f":"IF(B577=Liste1!$F$9,Liste1!$F$9*E577*100+MONTH($A577),0)","v":10},{"$f":"IF(B577=Liste1!$F$9,J577-I577,0)","v":0},{"$f":"IF(E577=\"\",\"\",VLOOKUP(E577,Liste1!$A$2:$B$41,2))","v":""},null,null,{"$f":"IF($B577=Liste1!$F$9,1,0)","v":1},{"$f":"IF(B577=7,\"\",(E577*100+(YEAR($A577)+MONTH($A577)+MONTH($A577)))/((YEAR($A577))))","v":1.0098863074641622},{"$f":"IF(O577+K577>0,I577,\"\")","v":0},{"$f":"IF(O577+K577>0,J577,\"\")","v":0},null,{"$f":"IF(O577+K577=0,\"\",(J577-I577))","v":0}]
["2023-10-03",8,{"$f":"IF(B578=\"\",\"\",VLOOKUP(B578,Liste1!$F$2:$I$9,2))","v":"Essai 8"},null,null,{"$f":"IF(B578=Liste1!$F$9,Liste1!$F$9*E578*100+MONTH($A578),0)","v":10},{"$f":"IF(B578=Liste1!$F$9,J578-I578,0)","v":0},{"$f":"IF(E578=\"\",\"\",VLOOKUP(E578,Liste1!$A$2:$B$41,2))","v":""},null,null,{"$f":"IF($B578=Liste1!$F$9,1,0)","v":1},{"$f":"IF(B578=7,\"\",(E578*100+(YEAR($A578)+MONTH($A578)+MONTH($A578)))/((YEAR($A578))))","v":1.0098863074641622},{"$f":"IF(O578+K578>0,I578,\"\")","v":0},{"$f":"IF(O578+K578>0,J578,\"\")","v":0},null,{"$f":"IF(O578+K578=0,\"\",(J578-I578))","v":0}]
["2023-10-03",8,{"$f":"IF(B579=\"\",\"\",VLOOKUP(B579,Liste1!$F$2:$I$9,2))","v":"Essai 8"},null,null,{"$f":"IF(B579=Liste1!$F$9,Liste1!$F$9*E579*100+MONTH($A579),0)","v":10},{"$f":"IF(B579=Liste1!$F$9,J579-I579,0)","v":0},{"$f":"IF(E579=\"\",\"\",VLOOKUP(E579,Liste1!$A$2:$B$41,2))","v":""},null,null,{"$f":"IF($B579=Liste1!$F$9,1,0)","v":1},{"$f":"IF(B579=7,\"\",(E579*100+(YEAR($A579)+MONTH($A579)+MONTH($A579)))/((YEAR($A579))))","v":1.0098863074641622},{"$f":"IF(O579+K579>0,I579,\"\")","v":0},{"$f":"IF(O579+K579>0,J579,\"\")","v":0},null,{"$f":"IF(O579+K579=0,\"\",(J579-I579))","v":0}]
["2023-10-03",8,{"$f":"IF(B580=\"\",\"\",VLOOKUP(B580,Liste1!$F$2:$I$9,2))","v":"Essai 8"},null,null,{"$f":"IF(B580=Liste1!$F$9,Liste1!$F$9*E580*100+MONTH($A580),0)","v":10},{"$f":"IF(B580=Liste1!$F$9,J580-I580,0)","v":0},{"$f":"IF(E580=\"\",\"\",VLOOKUP(E580,Liste1!$A$2:$B$41,2))","v":""},null,null,{"$f":"IF($B580=Liste1!$F$9,1,0)","v":1},{"$f":"IF(B580=7,\"\",(E580*100+(YEAR($A580)+MONTH($A580)+MONTH($A580)))/((YEAR($A580))))","v":1.0098863074641622},{"$f":"IF(O580+K580>0,I580,\"\")","v":0},{"$f":"IF(O580+K580>0,J580,\"\")","v":0},null,{"$f":"IF(O580+K580=0,\"\",(J580-I580))","v":0}]
["2023-10-03",8,{"$f":"IF(B581=\"\",\"\",VLOOKUP(B581,Liste1!$F$2:$I$9,2))","v":"Essai 8"},null,null,{"$f":"IF(B581=Liste1!$F$9,Liste1!$F$9*E581*100+MONTH($A581),0)","v":10},{"$f":"IF(B581=Liste1!$F$9,J581-I581,0)","v":0},{"$f":"IF(E581=\"\",\"\",VLOOKUP(E581,Liste1!$A$2:$B$41,2))","v":""},null,null,{"$f":"IF($B581=Liste1!$F$9,1,0)","v":1},{"$f":"IF(B581=7,\"\",(E581*100+(YEAR($A581)+MONTH($A581)+MONTH($A581)))/((YEAR($A581))))","v":1.0098863074641622},{"$f":"IF(O581+K581>0,I581,\"\")","v":0},{"$f":"IF(O581+K581>0,J581,\"\")","v":0},null,{"$f":"IF(O581+K581=0,\"\",(J581-I581))","v":0}]
["2023-10-05",3,{"$f":"IF(B582=\"\",\"\",VLOOKUP(B582,Liste1!$F$2:$I$9,2))","v":"Essai 3"},null,null,{"$f":"IF(B582=Liste1!$F$9,Liste1!$F$9*E582*100+MONTH($A582),0)","v":0},{"$f":"IF(B582=Liste1!$F$9,J582-I582,0)","v":0},{"$f":"IF(E582=\"\",\"\",VLOOKUP(E582,Liste1!$A$2:$B$41,2))","v":""},null,null,{"$f":"IF($B582=Liste1!$F$9,1,0)","v":0},{"$f":"IF(B582=7,\"\",(E582*100+(YEAR($A582)+MONTH($A582)+MONTH($A582)))/((YEAR($A582))))","v":1.0098863074641622},{"$f":"IF(O582+K582>0,I582,\"\")","v":""},{"$f":"IF(O582+K582>0,J582,\"\")","v":""},null,{"$f":"IF(O582+K582=0,\"\",(J582-I582))","v":""}]
["2023-10-05",5,{"$f":"IF(B583=\"\",\"\",VLOOKUP(B583,Liste1!$F$2:$I$9,2))","v":"Essai 5"},null,null,{"$f":"IF(B583=Liste1!$F$9,Liste1!$F$9*E583*100+MONTH($A583),0)","v":0},{"$f":"IF(B583=Liste1!$F$9,J583-I583,0)","v":0},{"$f":"IF(E583=\"\",\"\",VLOOKUP(E583,Liste1!$A$2:$B$41,2))","v":""},null,null,{"$f":"IF($B583=Liste1!$F$9,1,0)","v":0},{"$f":"IF(B583=7,\"\",(E583*100+(YEAR($A583)+MONTH($A583)+MONTH($A583)))/((YEAR($A583))))","v":1.0098863074641622},{"$f":"IF(O583+K583>0,I583,\"\")","v":""},{"$f":"IF(O583+K583>0,J583,\"\")","v":""},null,{"$f":"IF(O583+K583=0,\"\",(J583-I583))","v":""}]
["2023-10-10",3,{"$f":"IF(B584=\"\",\"\",VLOOKUP(B584,Liste1!$F$2:$I$9,2))","v":"Essai 3"},null,null,{"$f":"IF(B584=Liste1!$F$9,Liste1!$F$9*E584*100+MONTH($A584),0)","v":0},{"$f":"IF(B584=Liste1!$F$9,J584-I584,0)","v":0},{"$f":"IF(E584=\"\",\"\",VLOOKUP(E584,Liste1!$A$2:$B$41,2))","v":""},null,null,{"$f":"IF(Saisie1!$B1112=Liste1!$F$9,1,0)","v":0},{"$f":"IF(Saisie1!B1112=7,\"\",(Saisie1!E1112*100+(YEAR(Saisie1!$A1112)+MONTH(Saisie1!$A1112)+MONTH(Saisie1!$A1112)))/((YEAR(Saisie1!$A1112))))","v":1.0010526315789474},{"$f":"IF(O584+K584>0,I584,\"\")","v":""},{"$f":"IF(O584+K584>0,J584,\"\")","v":""},null,{"$f":"IF(O584+K584=0,\"\",(J584-I584))","v":""}]
["2023-10-10",3,{"$f":"IF(B585=\"\",\"\",VLOOKUP(B585,Liste1!$F$2:$I$9,2))","v":"Essai 3"},null,null,{"$f":"IF(B585=Liste1!$F$9,Liste1!$F$9*E585*100+MONTH($A585),0)","v":0},{"$f":"IF(B585=Liste1!$F$9,J585-I585,0)","v":0},{"$f":"IF(E585=\"\",\"\",VLOOKUP(E585,Liste1!$A$2:$B$41,2))","v":""},null,null,{"$f":"IF(Saisie1!$B1114=Liste1!$F$9,1,0)","v":0},{"$f":"IF(Saisie1!B1114=7,\"\",(Saisie1!E1114*100+(YEAR(Saisie1!$A1114)+MONTH(Saisie1!$A1114)+MONTH(Saisie1!$A1114)))/((YEAR(Saisie1!$A1114))))","v":1.0010526315789474},{"$f":"IF(O585+K585>0,I585,\"\")","v":""},{"$f":"IF(O585+K585>0,J585,\"\")","v":""},null,{"$f":"IF(O585+K585=0,\"\",(J585-I585))","v":""}]
["2023-10-10",3,{"$f":"IF(B586=\"\",\"\",VLOOKUP(B586,Liste1!$F$2:$I$9,2))","v":"Essai 3"},null,null,{"$f":"IF(B586=Liste1!$F$9,Liste1!$F$9*E586*100+MONTH($A586),0)","v":0},{"$f":"IF(B586=Liste1!$F$9,J586-I586,0)","v":0},{"$f":"IF(E586=\"\",\"\",VLOOKUP(E586,Liste1!$A$2:$B$41,2))","v":""},null,null,{"$f":"IF(Saisie1!$B1116=Liste1!$F$9,1,0)","v":0},{"$f":"IF(Saisie1!B1116=7,\"\",(Saisie1!E1116*100+(YEAR(Saisie1!$A1116)+MONTH(Saisie1!$A1116)+MONTH(Saisie1!$A1116)))/((YEAR(Saisie1!$A1116))))","v":1.0010526315789474},{"$f":"IF(O586+K586>0,I586,\"\")","v":""},{"$f":"IF(O586+K586>0,J586,\"\")","v":""},null,{"$f":"IF(O586+K586=0,\"\",(J586-I586))","v":""}]
["2023-10-10",3,{"$f":"IF(B587=\"\",\"\",VLOOKUP(B587,Liste1!$F$2:$I$9,2))","v":"Essai 3"},null,null,{"$f":"IF(B587=Liste1!$F$9,Liste1!$F$9*E587*100+MONTH($A587),0)","v":0},{"$f":"IF(B587=Liste1!$F$9,J587-I587,0)","v":0},{"$f":"IF(E587=\"\",\"\",VLOOKUP(E587,Liste1!$A$2:$B$41,2))","v":""},null,null,{"$f":"IF(Saisie1!$B1119=Liste1!$F$9,1,0)","v":0},{"$f":"IF(Saisie1!B1119=7,\"\",(Saisie1!E1119*100+(YEAR(Saisie1!$A1119)+MONTH(Saisie1!$A1119)+MONTH(Saisie1!$A1119)))/((YEAR(Saisie1!$A1119))))","v":1.0010526315789474},{"$f":"IF(O587+K587>0,I587,\"\")","v":""},{"$f":"IF(O587+K587>0,J587,\"\")","v":""},null,{"$f":"IF(O587+K587=0,\"\",(J587-I587))","v":""}]
["2023-10-10",3,{"$f":"IF(B588=\"\",\"\",VLOOKUP(B588,Liste1!$F$2:$I$9,2))","v":"Essai 3"},null,null,{"$f":"IF(B588=Liste1!$F$9,Liste1!$F$9*E588*100+MONTH($A588),0)","v":0},{"$f":"IF(B588=Liste1!$F$9,J588-I588,0)","v":0},{"$f":"IF(E588=\"\",\"\",VLOOKUP(E588,Liste1!$A$2:$B$41,2))","v":""},null,null,{"$f":"IF(Saisie1!$B1113=Liste1!$F$9,1,0)","v":0},{"$f":"IF(Saisie1!B1113=7,\"\",(Saisie1!E1113*100+(YEAR(Saisie1!$A1113)+MONTH(Saisie1!$A1113)+MONTH(Saisie1!$A1113)))/((YEAR(Saisie1!$A1113))))","v":1.0010526315789474},{"$f":"IF(O588+K588>0,I588,\"\")","v":""},{"$f":"IF(O588+K588>0,J588,\"\")","v":""},null,{"$f":"IF(O588+K588=0,\"\",(J588-I588))","v":""}]
["2023-10-10",3,{"$f":"IF(B589=\"\",\"\",VLOOKUP(B589,Liste1!$F$2:$I$9,2))","v":"Essai 3"},null,null,{"$f":"IF(B589=Liste1!$F$9,Liste1!$F$9*E589*100+MONTH($A589),0)","v":0},{"$f":"IF(B589=Liste1!$F$9,J589-I589,0)","v":0},{"$f":"IF(E589=\"\",\"\",VLOOKUP(E589,Liste1!$A$2:$B$41,2))","v":""},null,null,{"$f":"IF(Saisie1!$B1117=Liste1!$F$9,1,0)","v":0},{"$f":"IF(I589+J589=0,\"\",(Saisie1!E1117*100+(YEAR(Saisie1!$A1117)+MONTH(Saisie1!$A1117)+MONTH(Saisie1!$A1117)))/((YEAR(Saisie1!$A1117))))","v":""},{"$f":"IF(O589+K589>0,I589,\"\")","v":""},{"$f":"IF(O589+K589>0,J589,\"\")","v":""},null,{"$f":"IF(O589+K589=0,\"\",(J589-I589))","v":""}]
["2023-10-10",3,{"$f":"IF(B590=\"\",\"\",VLOOKUP(B590,Liste1!$F$2:$I$9,2))","v":"Essai 3"},null,null,{"$f":"IF(B590=Liste1!$F$9,Liste1!$F$9*E590*100+MONTH($A590),0)","v":0},{"$f":"IF(B590=Liste1!$F$9,J590-I590,0)","v":0},{"$f":"IF(E590=\"\",\"\",VLOOKUP(E590,Liste1!$A$2:$B$41,2))","v":""},null,null,{"$f":"IF($B590=Liste1!$F$9,1,0)","v":0},{"$f":"IF(B590=7,\"\",(E590*100+(YEAR($A590)+MONTH($A590)+MONTH($A590)))/((YEAR($A590))))","v":1.0098863074641622},{"$f":"IF(O590+K590>0,I590,\"\")","v":""},{"$f":"IF(O590+K590>0,J590,\"\")","v":""},null,{"$f":"IF(O590+K590=0,\"\",(J590-I590))","v":""}]
["2023-10-10",3,{"$f":"IF(B591=\"\",\"\",VLOOKUP(B591,Liste1!$F$2:$I$9,2))","v":"Essai 3"},null,null,{"$f":"IF(B591=Liste1!$F$9,Liste1!$F$9*E591*100+MONTH($A591),0)","v":0},{"$f":"IF(B591=Liste1!$F$9,J591-I591,0)","v":0},{"$f":"IF(E591=\"\",\"\",VLOOKUP(E591,Liste1!$A$2:$B$41,2))","v":""},null,null,{"$f":"IF(Saisie1!$B1120=Liste1!$F$9,1,0)","v":0},{"$f":"IF(Saisie1!B1120=7,\"\",(Saisie1!E1120*100+(YEAR(Saisie1!$A1120)+MONTH(Saisie1!$A1120)+MONTH(Saisie1!$A1120)))/((YEAR(Saisie1!$A1120))))","v":1.0010526315789474},{"$f":"IF(O591+K591>0,I591,\"\")","v":""},{"$f":"IF(O591+K591>0,J591,\"\")","v":""},null,{"$f":"IF(O591+K591=0,\"\",(J591-I591))","v":""}]
["2023-10-10",3,{"$f":"IF(B592=\"\",\"\",VLOOKUP(B592,Liste1!$F$2:$I$9,2))","v":"Essai 3"},null,null,{"$f":"IF(B592=Liste1!$F$9,Liste1!$F$9*E592*100+MONTH($A592),0)","v":0},{"$f":"IF(B592=Liste1!$F$9,J592-I592,0)","v":0},{"$f":"IF(E592=\"\",\"\",VLOOKUP(E592,Liste1!$A$2:$B$41,2))","v":""},null,null,{"$f":"IF(Saisie1!$B1121=Liste1!$F$9,1,0)","v":0},{"$f":"IF(Saisie1!B1121=7,\"\",(Saisie1!E1121*100+(YEAR(Saisie1!$A1121)+MONTH(Saisie1!$A1121)+MONTH(Saisie1!$A1121)))/((YEAR(Saisie1!$A1121))))","v":1.0010526315789474},{"$f":"IF(O592+K592>0,I592,\"\")","v":""},{"$f":"IF(O592+K592>0,J592,\"\")","v":""},null,{"$f":"IF(O592+K592=0,\"\",(J592-I592))","v":""}]
["2023-10-20",3,{"$f":"IF(B593=\"\",\"\",VLOOKUP(B593,Liste1!$F$2:$I$9,2))","v":"Essai 3"},null,null,{"$f":"IF(B593=Liste1!$F$9,Liste1!$F$9*E593*100+MONTH($A593),0)","v":0},{"$f":"IF(B593=Liste1!$F$9,J593-I593,0)","v":0},{"$f":"IF(E593=\"\",\"\",VLOOKUP(E593,Liste1!$A$2:$B$41,2))","v":""},null,null,{"$f":"IF($B593=Liste1!$F$9,1,0)","v":0},{"$f":"IF(B593=7,\"\",(E593*100+(YEAR($A593)+MONTH($A593)+MONTH($A593)))/((YEAR($A593))))","v":1.0098863074641622},{"$f":"IF(O593+K593>0,I593,\"\")","v":""},{"$f":"IF(O593+K593>0,J593,\"\")","v":""},null,{"$f":"IF(O593+K593=0,\"\",(J593-I593))","v":""}]
["2023-10-20",3,{"$f":"IF(B594=\"\",\"\",VLOOKUP(B594,Liste1!$F$2:$I$9,2))","v":"Essai 3"},null,null,{"$f":"IF(B594=Liste1!$F$9,Liste1!$F$9*E594*100+MONTH($A594),0)","v":0},{"$f":"IF(B594=Liste1!$F$9,J594-I594,0)","v":0},{"$f":"IF(E594=\"\",\"\",VLOOKUP(E594,Liste1!$A$2:$B$41,2))","v":""},null,null,{"$f":"IF($B594=Liste1!$F$9,1,0)","v":0},{"$f":"IF(B594=7,\"\",(E594*100+(YEAR($A594)+MONTH($A594)+MONTH($A594)))/((YEAR($A594))))","v":1.0098863074641622},{"$f":"IF(O594+K594>0,I594,\"\")","v":""},{"$f":"IF(O594+K594>0,J594,\"\")","v":""},null,{"$f":"IF(O594+K594=0,\"\",(J594-I594))","v":""}]
["2023-12-31",8,{"$f":"IF(B595=\"\",\"\",VLOOKUP(B595,Liste1!$F$2:$I$9,2))","v":"Essai 8"},null,null,{"$f":"IF(B595=Liste1!$F$9,Liste1!$F$9*E595*100+MONTH($A595),0)","v":12},{"$f":"IF(B595=Liste1!$F$9,J595-I595,0)","v":0},{"$f":"IF(E595=\"\",\"\",VLOOKUP(E595,Liste1!$A$2:$B$41,2))","v":""},null,null,{"$f":"IF($B595=Liste1!$F$9,1,0)","v":1},{"$f":"IF(B595=7,\"\",(E595*100+(YEAR($A595)+MONTH($A595)+MONTH($A595)))/((YEAR($A595))))","v":1.0118635689569946},{"$f":"IF(O595+K595>0,I595,\"\")","v":0},{"$f":"IF(O595+K595>0,J595,\"\")","v":0},null,{"$f":"IF(O595+K595=0,\"\",(J595-I595))","v":0}]
[null,null,{"$f":"IF(B596=\"\",\"\",VLOOKUP(B596,Liste1!$F$2:$I$9,2))","v":""},null,null,{"$f":"IF(B596=Liste1!$F$9,Liste1!$F$9*E596*100+MONTH($A596),0)","v":0},{"$f":"IF(B596=Liste1!$F$9,J596-I596,0)","v":0},{"$f":"IF(E596=\"\",\"\",VLOOKUP(E596,Liste1!$A$2:$B$41,2))","v":""},null,null,{"$f":"IF($B596=Liste1!$F$9,1,0)","v":0},{"$f":"IF(B596=7,\"\",(E596*100+(YEAR($A596)+MONTH($A596)+MONTH($A596)))/((YEAR($A596))))","v":1.0010526315789474},{"$f":"IF(O596+K596>0,I596,\"\")","v":""},{"$f":"IF(O596+K596>0,J596,\"\")","v":""},null,{"$f":"IF(O596+K596=0,\"\",(J596-I596))","v":""}]
[null,null,{"$f":"IF(B597=\"\",\"\",VLOOKUP(B597,Liste1!$F$2:$I$9,2))","v":""},null,null,{"$f":"IF(B597=Liste1!$F$9,Liste1!$F$9*E597*100+MONTH($A597),0)","v":0},{"$f":"IF(B597=Liste1!$F$9,J597-I597,0)","v":0},{"$f":"IF(E597=\"\",\"\",VLOOKUP(E597,Liste1!$A$2:$B$41,2))","v":""},null,null,{"$f":"IF($B597=Liste1!$F$9,1,0)","v":0},{"$f":"IF(B597=7,\"\",(E597*100+(YEAR($A597)+MONTH($A597)+MONTH($A597)))/((YEAR($A597))))","v":1.0010526315789474},{"$f":"IF(O597+K597>0,I597,\"\")","v":""},{"$f":"IF(O597+K597>0,J597,\"\")","v":""},null,{"$f":"IF(O597+K597=0,\"\",(J597-I597))","v":""}]
[null,null,{"$f":"IF(B598=\"\",\"\",VLOOKUP(B598,Liste1!$F$2:$I$9,2))","v":""},null,null,{"$f":"IF(B598=Liste1!$F$9,Liste1!$F$9*E598*100+MONTH($A598),0)","v":0},{"$f":"IF(B598=Liste1!$F$9,J598-I598,0)","v":0},{"$f":"IF(E598=\"\",\"\",VLOOKUP(E598,Liste1!$A$2:$B$41,2))","v":""},null,null,{"$f":"IF($B598=Liste1!$F$9,1,0)","v":0},{"$f":"IF(B598=7,\"\",(E598*100+(YEAR($A598)+MONTH($A598)+MONTH($A598)))/((YEAR($A598))))","v":1.0010526315789474},{"$f":"IF(O598+K598>0,I598,\"\")","v":""},{"$f":"IF(O598+K598>0,J598,\"\")","v":""},null,{"$f":"IF(O598+K598=0,\"\",(J598-I598))","v":""}]
[null,null,{"$f":"IF(B599=\"\",\"\",VLOOKUP(B599,Liste1!$F$2:$I$9,2))","v":""},null,null,{"$f":"IF(B599=Liste1!$F$9,Liste1!$F$9*E599*100+MONTH($A599),0)","v":0},{"$f":"IF(B599=Liste1!$F$9,J599-I599,0)","v":0},{"$f":"IF(E599=\"\",\"\",VLOOKUP(E599,Liste1!$A$2:$B$41,2))","v":""},null,null,{"$f":"IF($B599=Liste1!$F$9,1,0)","v":0},{"$f":"IF(B599=7,\"\",(E599*100+(YEAR($A599)+MONTH($A599)+MONTH($A599)))/((YEAR($A599))))","v":1.0010526315789474},{"$f":"IF(O599+K599>0,I599,\"\")","v":""},{"$f":"IF(O599+K599>0,J599,\"\")","v":""},null,{"$f":"IF(O599+K599=0,\"\",(J599-I599))","v":""}]
[null,null,{"$f":"IF(B600=\"\",\"\",VLOOKUP(B600,Liste1!$F$2:$I$9,2))","v":""},null,null,{"$f":"IF(B600=Liste1!$F$9,Liste1!$F$9*E600*100+MONTH($A600),0)","v":0},{"$f":"IF(B600=Liste1!$F$9,J600-I600,0)","v":0},{"$f":"IF(E600=\"\",\"\",VLOOKUP(E600,Liste1!$A$2:$B$41,2))","v":""},null,null,{"$f":"IF($B600=Liste1!$F$9,1,0)","v":0},{"$f":"IF(B600=7,\"\",(E600*100+(YEAR($A600)+MONTH($A600)+MONTH($A600)))/((YEAR($A600))))","v":1.0010526315789474},{"$f":"IF(O600+K600>0,I600,\"\")","v":""},{"$f":"IF(O600+K600>0,J600,\"\")","v":""},null,{"$f":"IF(O600+K600=0,\"\",(J600-I600))","v":""}]
[null,null,{"$f":"IF(B601=\"\",\"\",VLOOKUP(B601,Liste1!$F$2:$I$9,2))","v":""},null,null,{"$f":"IF(B601=Liste1!$F$9,Liste1!$F$9*E601*100+MONTH($A601),0)","v":0},{"$f":"IF(B601=Liste1!$F$9,J601-I601,0)","v":0},{"$f":"IF(E601=\"\",\"\",VLOOKUP(E601,Liste1!$A$2:$B$41,2))","v":""},null,null,{"$f":"IF(Saisie1!$B1111=Liste1!$F$9,1,0)","v":0},{"$f":"IF(Saisie1!B1111=7,\"\",(Saisie1!E1111*100+(YEAR(Saisie1!$A1111)+MONTH(Saisie1!$A1111)+MONTH(Saisie1!$A1111)))/((YEAR(Saisie1!$A1111))))","v":1.0010526315789474},{"$f":"IF(O601+K601>0,I601,\"\")","v":""},{"$f":"IF(O601+K601>0,J601,\"\")","v":""},null,{"$f":"IF(O601+K601=0,\"\",(J601-I601))","v":""}]
[null,null,{"$f":"IF(B602=\"\",\"\",VLOOKUP(B602,Liste1!$F$2:$I$9,2))","v":""},null,null,{"$f":"IF(B602=Liste1!$F$9,Liste1!$F$9*E602*100+MONTH($A602),0)","v":0},{"$f":"IF(B602=Liste1!$F$9,J602-I602,0)","v":0},{"$f":"IF(E602=\"\",\"\",VLOOKUP(E602,Liste1!$A$2:$B$41,2))","v":""},null,null,{"$f":"IF($B602=Liste1!$F$9,1,0)","v":0},{"$f":"IF(B602=7,\"\",(E602*100+(YEAR($A602)+MONTH($A602)+MONTH($A602)))/((YEAR($A602))))","v":1.0010526315789474},{"$f":"IF(O602+K602>0,I602,\"\")","v":""},{"$f":"IF(O602+K602>0,J602,\"\")","v":""},null,{"$f":"IF(O602+K602=0,\"\",(J602-I602))","v":""}]
[null,null,{"$f":"IF(B603=\"\",\"\",VLOOKUP(B603,Liste1!$F$2:$I$9,2))","v":""},null,null,{"$f":"IF(B603=Liste1!$F$9,Liste1!$F$9*E603*100+MONTH($A603),0)","v":0},{"$f":"IF(B603=Liste1!$F$9,J603-I603,0)","v":0},{"$f":"IF(E603=\"\",\"\",VLOOKUP(E603,Liste1!$A$2:$B$41,2))","v":""},null,null,{"$f":"IF($B603=Liste1!$F$9,1,0)","v":0},{"$f":"IF(B603=7,\"\",(E603*100+(YEAR($A603)+MONTH($A603)+MONTH($A603)))/((YEAR($A603))))","v":1.0010526315789474},{"$f":"IF(O603+K603>0,I603,\"\")","v":""},{"$f":"IF(O603+K603>0,J603,\"\")","v":""},null,{"$f":"IF(O603+K603=0,\"\",(J603-I603))","v":""}]
[null,null,{"$f":"IF(B604=\"\",\"\",VLOOKUP(B604,Liste1!$F$2:$I$9,2))","v":""},null,null,{"$f":"IF(B604=Liste1!$F$9,Liste1!$F$9*E604*100+MONTH($A604),0)","v":0},{"$f":"IF(B604=Liste1!$F$9,J604-I604,0)","v":0},{"$f":"IF(E604=\"\",\"\",VLOOKUP(E604,Liste1!$A$2:$B$41,2))","v":""},null,null,{"$f":"IF($B604=Liste1!$F$9,1,0)","v":0},{"$f":"IF(B604=7,\"\",(E604*100+(YEAR($A604)+MONTH($A604)+MONTH($A604)))/((YEAR($A604))))","v":1.0010526315789474},{"$f":"IF(O604+K604>0,I604,\"\")","v":""},{"$f":"IF(O604+K604>0,J604,\"\")","v":""},null,{"$f":"IF(O604+K604=0,\"\",(J604-I604))","v":""}]
[null,null,{"$f":"IF(B605=\"\",\"\",VLOOKUP(B605,Liste1!$F$2:$I$9,2))","v":""},null,null,{"$f":"IF(B605=Liste1!$F$9,Liste1!$F$9*E605*100+MONTH($A605),0)","v":0},{"$f":"IF(B605=Liste1!$F$9,J605-I605,0)","v":0},{"$f":"IF(E605=\"\",\"\",VLOOKUP(E605,Liste1!$A$2:$B$41,2))","v":""},null,null,{"$f":"IF($B605=Liste1!$F$9,1,0)","v":0},{"$f":"IF(B605=7,\"\",(E605*100+(YEAR($A605)+MONTH($A605)+MONTH($A605)))/((YEAR($A605))))","v":1.0010526315789474},{"$f":"IF(O605+K605>0,I605,\"\")","v":""},{"$f":"IF(O605+K605>0,J605,\"\")","v":""},null,{"$f":"IF(O605+K605=0,\"\",(J605-I605))","v":""}]
[null,null,{"$f":"IF(B606=\"\",\"\",VLOOKUP(B606,Liste1!$F$2:$I$9,2))","v":""},null,null,{"$f":"IF(B606=Liste1!$F$9,Liste1!$F$9*E606*100+MONTH($A606),0)","v":0},{"$f":"IF(B606=Liste1!$F$9,J606-I606,0)","v":0},{"$f":"IF(E606=\"\",\"\",VLOOKUP(E606,Liste1!$A$2:$B$41,2))","v":""},null,null,{"$f":"IF($B606=Liste1!$F$9,1,0)","v":0},{"$f":"IF(B606=7,\"\",(E606*100+(YEAR($A606)+MONTH($A606)+MONTH($A606)))/((YEAR($A606))))","v":1.0010526315789474},{"$f":"IF(O606+K606>0,I606,\"\")","v":""},{"$f":"IF(O606+K606>0,J606,\"\")","v":""},null,{"$f":"IF(O606+K606=0,\"\",(J606-I606))","v":""}]

{"sheet":"Liste1","index":2,"n_rows":112,"n_cols":7,"rows_kept":112,"cut":false,"hidden":false,"merged":[[9,6,9,8],[8,6,8,8],[6,6,6,8],[0,5,0,8],[7,6,7,8],[4,6,4,8],[3,6,3,8],[1,6,1,8],[2,6,2,8],[5,6,5,8]]}
["LIBELLÉS ","All",null,null,null,"MOUVEMENTS"]
[1,"Harry Cover",null,null,null,1,"Essai 1"]
[2,"Gérard Menvussat",null,null,null,2,"Essai 2"]
[3,"Sarah Pelle",null,null,null,3,"Essai 3"]
[4,"Aldo Berman",null,null,null,4,"Essai 4"]
[5,"Alex Térieur",null,null,null,5,"Essai 5"]
[6,"Elsa Dorsa",null,null,null,6,"Essai 6"]
[7,"Elvire Horouge",null,null,null,7,"Essai 7"]
[8,"Léon Dit",null,null,null,8,"Essai 8"]
[9,"Daisy Rable",null,null,null,10,"Essai 9"]
[10,"Léon Dit"]
[11]
[12]
[13]
[14]
[15]
[16]
[17]
[18]
[19]
[20]
[21]
[22]
[23]
[24]
[25]
[26]
[27]
[28]
[29]
[30]
[31]
[32]
[33]
[34]
[35]
[36]
[37]
[38]
[39]
[40]
[]
[]
[]
[]
[]
[]
[]
[]
[]
[]
[]
[]
[]
[]
[]
[]
[]
[]
[]
[]
[]
[]
[]
[]
[]
[]
[]
[]
[]
[]
[]
[{"$f":"A2&\"   \"&B2","v":"1   Harry Cover"}]
["2   Gérard Menvussat"]
["3   Sarah Pelle"]
["4   Aldo Berman"]
["5   Alex Térieur"]
["6   Elsa Dorsa"]
["7   Elvire Horouge"]
["8   Léon Dit"]
["9   Daisy Rable"]
["10   Léon Dit"]
["11   "]
["12   "]
["13   "]
["14   "]
["15   "]
["16   "]
["17   "]
["18   "]
["19   "]
["20   "]
["21   "]
["22   "]
["23   "]
["24   "]
["25   "]
["26   "]
["27   "]
["28   "]
["29   "]
["30   "]
["31   "]
["32   "]
["33   "]
["34   "]
["35   "]
["36   "]
["37   "]
["38   "]
["39   "]
["40   "]