{"text_format":"1","workbook":"xlsx","n_sheets":3,"sheets":["Menu","Saisie1","Liste1"],"not_rendered":{"charts":0,"images":1,"macros":1,"external_links":0,"defined_names":12,"comments":1,"pivot_tables":0},"unopened":[],"bounds":{"document_bytes":16777216,"sheet_cells":100000,"rows_first":2000,"rows_last":500,"rows_between":2000,"halvings":0,"cell_chars":16384,"cell_head_chars":4096},"cells_cut":0,"cells_raw":0,"read":"whole","date_system":"1900"}

{"sheet":"Menu","index":0,"n_rows":0,"n_cols":0,"rows_kept":0,"cut":false,"hidden":true,"merged":[]}

{"sheet":"Saisie1","index":1,"n_rows":606,"n_cols":24,"rows_kept":606,"cut":false,"hidden":false,"merged":[[6,8,7,8],[4,9,5,9],[0,0,0,16],[2,0,2,16],[4,8,5,8],[4,3,5,4],[4,2,5,2],[4,0,5,1],[6,3,6,4],[7,3,7,4]]}
["Largeur des colonnes"]
[9.43,3,23,8.86,3,"zéro","zéro",24.14,11.57,11.57,"zéro","zéro","zéro","zéro",2,"zéro",69.569999999999993,14.29]
["Totaux des colonnes"]
[null,null,null,null,null,null,{"$f":"SUM(G12:G3071)","v":-210},null,{"$f":"SUM(I12:I3071)","v":8463.1299999999956},{"$f":"SUM(J12:J3071)","v":5260},null,null,null,null,null,{"$f":"SUM(P12:P3071)","v":-210}]
[]
[null,null,null,null,null,null,null,"All"]
[null,null,null,null,null,null,null,{"$f":"SUMIF($H$11:$H$2202,H6,$I$11:$I$2202)","v":0}]
[null,null,null,null,null,null,{"$f":"SUM(G12:G479)","v":-210},{"$f":"SUMIF($H$11:$H$2202,H6,$J$11:$J$2202)","v":0}]
[null,null,null,null,null,"Prévisions","Cumul prévis",null,null,null,"1 auto prévis","Cumul","pointé débit","pointé crédit",0.5,"tous pointés"]
[]
[null,null,null,null,null,null,null," "]
["2023-01-01",5,{"$f":"IF(B12=\"\",\"\",VLOOKUP(B12,Liste1!$F$2:$I$9,2))","v":"Essai 5"},null,1,{"$f":"IF(B12=Liste1!$F$9,Liste1!$F$9*E12*100+MONTH($A12),0)","v":0},{"$f":"IF(B12=Liste1!$F$9,J12-I12,0)","v":0},{"$f":"IF(E12=\"\",\"\",VLOOKUP(E12,Liste1!$A$2:$B$41,2))","v":"Harry Cover"},50,null,{"$f":"IF($B12=Liste1!$F$9,1,0)","v":0},{"$f":"IF(I12+J12=0,\"\",(E12*100+(YEAR($A12)+MONTH($A12)+MONTH($A12)))/((YEAR($A12))))","v":1.0504201680672269},{"$f":"IF(O12+K12>0,I12,\"\")","v":""},{"$f":"IF(O12+K12>0,J12,\"\")","v":""},null,{"$f":"IF(O12+K12=0,\"\",(J12-I12))","v":""}]
["2023-01-03",5,{"$f":"IF(B13=\"\",\"\",VLOOKUP(B13,Liste1!$F$2:$I$9,2))","v":"Essai 5"},null,1,{"$f":"IF(B13=Liste1!$F$9,Liste1!$F$9*E13*100+MONTH($A13),0)","v":0},{"$f":"IF(B13=Liste1!$F$9,J13-I13,0)","v":0},{"$f":"IF(E13=\"\",\"\",VLOOKUP(E13,Liste1!$A$2:$B$41,2))","v":"Harry Cover"},55,null,{"$f":"IF($B13=Liste1!$F$9,1,0)","v":0},{"$f":"IF(I13+J13=0,\"\",(E13*100+(YEAR($A13)+MONTH($A13)+MONTH($A13)))/((YEAR($A13))))","v":1.0504201680672269},{"$f":"IF(O13+K13>0,I13,\"\")","v":""},{"$f":"IF(O13+K13>0,J13,\"\")","v":""},null,{"$f":"IF(O13+K13=0,\"\",(J13-I13))","v":""}]
["2023-02-01",5,{"$f":"IF(B14=\"\",\"\",VLOOKUP(B14,Liste1!$F$2:$I$9,2))","v":"Essai 5"},null,1,{"$f":"IF(B14=Liste1!$F$9,Liste1!$F$9*E14*100+MONTH($A14),0)","v":0},{"$f":"IF(B14=Liste1!$F$9,J14-I14,0)","v":0},{"$f":"IF(E14=\"\",\"\",VLOOKUP(E14,Liste1!$A$2:$B$41,2))","v":"Harry Cover"},46,null,{"$f":"IF($B14=Liste1!$F$9,1,0)","v":0},{"$f":"IF(I14+J14=0,\"\",(E14*100+(YEAR($A14)+MONTH($A14)+MONTH($A14)))/((YEAR($A14))))","v":1.0514087988136431},{"$f":"IF(O14+K14>0,I14,\"\")","v":""},{"$f":"IF(O14+K14>0,J14,\"\")","v":""},null,{"$f":"IF(O14+K14=0,\"\",(J14-I14))","v":""}]
["2023-03-01",5,{"$f":"IF(B15=\"\",\"\",VLOOKUP(B15,Liste1!$F$2:$I$9,2))","v":"Essai 5"},null,1,{"$f":"IF(B15=Liste1!$F$9,Liste1!$F$9*E15*100+MONTH($A15),0)","v":0},{"$f":"IF(B15=Liste1!$F$9,J15-I15,0)","v":0},{"$f":"IF(E15=\"\",\"\",VLOOKUP(E15,Liste1!$A$2:$B$41,2))","v":"Harry Cover"},78,null,{"$f":"IF($B15=Liste1!$F$9,1,0)","v":0},{"$f":"IF(I15+J15=0,\"\",(E15*100+(YEAR($A15)+MONTH($A15)+MONTH($A15)))/((YEAR($A15))))","v":1.0523974295600593},{"$f":"IF(O15+K15>0,I15,\"\")","v":""},{"$f":"IF(O15+K15>0,J15,\"\")","v":""},null,{"$f":"IF(O15+K15=0,\"\",(J15-I15))","v":""}]
["2023-04-03",5,{"$f":"IF(B16=\"\",\"\",VLOOKUP(B16,Liste1!$F$2:$I$9,2))","v":"Essai 5"},null,1,{"$f":"IF(B16=Liste1!$F$9,Liste1!$F$9*E16*100+MONTH($A16),0)","v":0},{"$f":"IF(B16=Liste1!$F$9,J16-I16,0)","v":0},{"$f":"IF(E16=\"\",\"\",VLOOKUP(E16,Liste1!$A$2:$B$41,2))","v":"Harry Cover"},32,null,{"$f":"IF($B16=Liste1!$F$9,1,0)","v":0},{"$f":"IF(I16+J16=0,\"\",(E16*100+(YEAR($A16)+MONTH($A16)+MONTH($A16)))/((YEAR($A16))))","v":1.0533860603064755},{"$f":"IF(O16+K16>0,I16,\"\")","v":""},{"$f":"IF(O16+K16>0,J16,\"\")","v":""},null,{"$f":"IF(O16+K16=0,\"\",(J16-I16))","v":""}]
["2023-05-03",5,{"$f":"IF(B17=\"\",\"\",VLOOKUP(B17,Liste1!$F$2:$I$9,2))","v":"Essai 5"},null,1,{"$f":"IF(B17=Liste1!$F$9,Liste1!$F$9*E17*100+MONTH($A17),0)","v":0},{"$f":"IF(B17=Liste1!$F$9,J17-I17,0)","v":0},{"$f":"IF(E17=\"\",\"\",VLOOKUP(E17,Liste1!$A$2:$B$41,2))","v":"Harry Cover"},72,null,{"$f":"IF($B17=Liste1!$F$9,1,0)","v":0},{"$f":"IF(I17+J17=0,\"\",(E17*100+(YEAR($A17)+MONTH($A17)+MONTH($A17)))/((YEAR($A17))))","v":1.0543746910528917},{"$f":"IF(O17+K17>0,I17,\"\")","v":""},{"$f":"IF(O17+K17>0,J17,\"\")","v":""},null,{"$f":"IF(O17+K17=0,\"\",(J17-I17))","v":""}]
["2023-06-03",5,{"$f":"IF(B18=\"\",\"\",VLOOKUP(B18,Liste1!$F$2:$I$9,2))","v":"Essai 5"},null,1,{"$f":"IF(B18=Liste1!$F$9,Liste1!$F$9*E18*100+MONTH($A18),0)","v":0},{"$f":"IF(B18=Liste1!$F$9,J18-I18,0)","v":0},{"$f":"IF(E18=\"\",\"\",VLOOKUP(E18,Liste1!$A$2:$B$41,2))","v":"Harry Cover"},120,null,{"$f":"IF($B18=Liste1!$F$9,1,0)","v":0},{"$f":"IF(B18=7,\"\",(E18*100+(YEAR($A18)+MONTH($A18)+MONTH($A18)))/((YEAR($A18))))","v":1.0553633217993079},{"$f":"IF(O18+K18>0,I18,\"\")","v":""},{"$f":"IF(O18+K18>0,J18,\"\")","v":""},null,{"$f":"IF(O18+K18=0,\"\",(J18-I18))","v":""}]
["2023-07-03",5,{"$f":"IF(B19=\"\",\"\",VLOOKUP(B19,Liste1!$F$2:$I$9,2))","v":"Essai 5"},null,1,{"$f":"IF(B19=Liste1!$F$9,Liste1!$F$9*E19*100+MONTH($A19),0)","v":0},{"$f":"IF(B19=Liste1!$F$9,J19-I19,0)","v":0},{"$f":"IF(E19=\"\",\"\",VLOOKUP(E19,Liste1!$A$2:$B$41,2))","v":"Harry Cover"},null,1000,{"$f":"IF($B19=Liste1!$F$9,1,0)","v":0},{"$f":"IF(B19=7,\"\",(E19*100+(YEAR($A19)+MONTH($A19)+MONTH($A19)))/((YEAR($A19))))","v":1.0563519525457241},{"$f":"IF(O19+K19>0,I19,\"\")","v":""},{"$f":"IF(O19+K19>0,J19,\"\")","v":""},null,{"$f":"IF(O19+K19=0,\"\",(J19-I19))","v":""}]
["2023-08-10",5,{"$f":"IF(B20=\"\",\"\",VLOOKUP(B20,Liste1!$F$2:$I$9,2))","v":"Essai 5"},null,1,{"$f":"IF(B20=Liste1!$F$9,Liste1!$F$9*E20*100+MONTH($A20),0)","v":0},{"$f":"IF(B20=Liste1!$F$9,J20-I20,0)","v":0},{"$f":"IF(E20=\"\",\"\",VLOOKUP(E20,Liste1!$A$2:$B$41,2))","v":"Harry Cover"},null,1000,{"$f":"IF($B20=Liste1!$F$9,1,0)","v":0},{"$f":"IF(B20=7,\"\",(E20*100+(YEAR($A20)+MONTH($A20)+MONTH($A20)))/((YEAR($A20))))","v":1.0573405832921403},{"$f":"IF(O20+K20>0,I20,\"\")","v":""},{"$f":"IF(O20+K20>0,J20,\"\")","v":""},null,{"$f":"IF(O20+K20=0,\"\",(J20-I20))","v":""}]
["2023-09-10",5,{"$f":"IF(B21=\"\",\"\",VLOOKUP(B21,Liste1!$F$2:$I$9,2))","v":"Essai 5"},null,1,{"$f":"IF(B21=Liste1!$F$9,Liste1!$F$9*E21*100+MONTH($A21),0)","v":0},{"$f":"IF(B21=Liste1!$F$9,J21-I21,0)","v":0},{"$f":"IF(E21=\"\",\"\",VLOOKUP(E21,Liste1!$A$2:$B$41,2))","v":"Harry Cover"},null,1000,{"$f":"IF($B21=Liste1!$F$9,1,0)","v":0},{"$f":"IF(I21+J21=0,\"\",(E21*100+(YEAR($A21)+MONTH($A21)+MONTH($A21)))/((YEAR($A21))))","v":1.0583292140385565},{"$f":"IF(O21+K21>0,I21,\"\")","v":""},{"$f":"IF(O21+K21>0,J21,\"\")","v":""},null,{"$f":"IF(O21+K21=0,\"\",(J21-I21))","v":""}]
["2023-10-10",5,{"$f":"IF(B22=\"\",\"\",VLOOKUP(B22,Liste1!$F$2:$I$9,2))","v":"Essai 5"},null,1,{"$f":"IF(B22=Liste1!$F$9,Liste1!$F$9*E22*100+MONTH($A22),0)","v":0},{"$f":"IF(B22=Liste1!$F$9,J22-I22,0)","v":0},{"$f":"IF(E22=\"\",\"\",VLOOKUP(E22,Liste1!$A$2:$B$41,2))","v":"Harry Cover"},null,1000,{"$f":"IF($B22=Liste1!$F$9,1,0)","v":0},{"$f":"IF(I22+J22=0,\"\",(E22*100+(YEAR($A22)+MONTH($A22)+MONTH($A22)))/((YEAR($A22))))","v":1.0593178447849727},{"$f":"IF(O22+K22>0,I22,\"\")","v":""},{"$f":"IF(O22+K22>0,J22,\"\")","v":""},null,{"$f":"IF(O22+K22=0,\"\",(J22-I22))","v":""}]
["2023-01-01",5,{"$f":"IF(B23=\"\",\"\",VLOOKUP(B23,Liste1!$F$2:$I$9,2))","v":"Essai 5"},null,2,{"$f":"IF(B23=Liste1!$F$9,Liste1!$F$9*E23*100+MONTH($A23),0)","v":0},{"$f":"IF(B23=Liste1!$F$9,J23-I23,0)","v":0},{"$f":"IF(E23=\"\",\"\",VLOOKUP(E23,Liste1!$A$2:$B$41,2))","v":"Gérard Menvussat"},100,null,{"$f":"IF($B23=Liste1!$F$9,1,0)","v":0},{"$f":"IF(I23+J23=0,\"\",(E23*100+(YEAR($A23)+MONTH($A23)+MONTH($A23)))/((YEAR($A23))))","v":1.0998517053880377},{"$f":"IF(O23+K23>0,I23,\"\")","v":""},{"$f":"IF(O23+K23>0,J23,\"\")","v":""},null,{"$f":"IF(O23+K23=0,\"\",(J23-I23))","v":""}]
["2023-02-01",5,{"$f":"IF(B24=\"\",\"\",VLOOKUP(B24,Liste1!$F$2:$I$9,2))","v":"Essai 5"},null,2,{"$f":"IF(B24=Liste1!$F$9,Liste1!$F$9*E24*100+MONTH($A24),0)","v":0},{"$f":"IF(B24=Liste1!$F$9,J24-I24,0)","v":0},{"$f":"IF(E24=\"\",\"\",VLOOKUP(E24,Liste1!$A$2:$B$41,2))","v":"Gérard Menvussat"},100,null,{"$f":"IF($B24=Liste1!$F$9,1,0)","v":0},{"$f":"IF(I24+J24=0,\"\",(E24*100+(YEAR($A24)+MONTH($A24)+MONTH($A24)))/((YEAR($A24))))","v":1.1008403361344539},{"$f":"IF(O24+K24>0,I24,\"\")","v":""},{"$f":"IF(O24+K24>0,J24,\"\")","v":""},null,{"$f":"IF(O24+K24=0,\"\",(J24-I24))","v":""}]
["2023-03-01",5,{"$f":"IF(B25=\"\",\"\",VLOOKUP(B25,Liste1!$F$2:$I$9,2))","v":"Essai 5"},null,2,{"$f":"IF(B25=Liste1!$F$9,Liste1!$F$9*E25*100+MONTH($A25),0)","v":0},{"$f":"IF(B25=Liste1!$F$9,J25-I25,0)","v":0},{"$f":"IF(E25=\"\",\"\",VLOOKUP(E25,Liste1!$A$2:$B$41,2))","v":"Gérard Menvussat"},null,700,{"$f":"IF($B25=Liste1!$F$9,1,0)","v":0},{"$f":"IF(I25+J25=0,\"\",(E25*100+(YEAR($A25)+MONTH($A25)+MONTH($A25)))/((YEAR($A25))))","v":1.1018289668808701},{"$f":"IF(O25+K25>0,I25,\"\")","v":""},{"$f":"IF(O25+K25>0,J25,\"\")","v":""},null,{"$f":"IF(O25+K25=0,\"\",(J25-I25))","v":""}]
["2023-04-03",5,{"$f":"IF(B26=\"\",\"\",VLOOKUP(B26,Liste1!$F$2:$I$9,2))","v":"Essai 5"},null,2,{"$f":"IF(B26=Liste1!$F$9,Liste1!$F$9*E26*100+MONTH($A26),0)","v":0},{"$f":"IF(B26=Liste1!$F$9,J26-I26,0)","v":0},{"$f":"IF(E26=\"\",\"\",VLOOKUP(E26,Liste1!$A$2:$B$41,2))","v":"Gérard Menvussat"},700,null,{"$f":"IF($B26=Liste1!$F$9,1,0)","v":0},{"$f":"IF(I26+J26=0,\"\",(E26*100+(YEAR($A26)+MONTH($A26)+MONTH($A26)))/((YEAR($A26))))","v":1.1028175976272863},{"$f":"IF(O26+K26>0,I26,\"\")","v":""},{"$f":"IF(O26+K26>0,J26,\"\")","v":""},null,{"$f":"IF(O26+K26=0,\"\",(J26-I26))","v":""}]
["2023-05-03",5,{"$f":"IF(B27=\"\",\"\",VLOOKUP(B27,Liste1!$F$2:$I$9,2))","v":"Essai 5"},null,2,{"$f":"IF(B27=Liste1!$F$9,Liste1!$F$9*E27*100+MONTH($A27),0)","v":0},{"$f":"IF(B27=Liste1!$F$9,J27-I27,0)","v":0},{"$f":"IF(E27=\"\",\"\",VLOOKUP(E27,Liste1!$A$2:$B$41,2))","v":"Gérard Menvussat"},700,null,{"$f":"IF($B27=Liste1!$F$9,1,0)","v":0},{"$f":"IF(I27+J27=0,\"\",(E27*100+(YEAR($A27)+MONTH($A27)+MONTH($A27)))/((YEAR($A27))))","v":1.1038062283737025},{"$f":"IF(O27+K27>0,I27,\"\")","v":""},{"$f":"IF(O27+K27>0,J27,\"\")","v":""},null,{"$f":"IF(O27+K27=0,\"\",(J27-I27))","v":""}]
["2023-06-03",5,{"$f":"IF(B28=\"\",\"\",VLOOKUP(B28,Liste1!$F$2:$I$9,2))","v":"Essai 5"},null,2,{"$f":"IF(B28=Liste1!$F$9,Liste1!$F$9*E28*100+MONTH($A28),0)","v":0},{"$f":"IF(B28=Liste1!$F$9,J28-I28,0)","v":0},{"$f":"IF(E28=\"\",\"\",VLOOKUP(E28,Liste1!$A$2:$B$41,2))","v":"Gérard Menvussat"},700,null,{"$f":"IF($B28=Liste1!$F$9,1,0)","v":0},{"$f":"IF(B28=7,\"\",(E28*100+(YEAR($A28)+MONTH($A28)+MONTH($A28)))/((YEAR($A28))))","v":1.1047948591201187},{"$f":"IF(O28+K28>0,I28,\"\")","v":""},{"$f":"IF(O28+K28>0,J28,\"\")","v":""},null,{"$f":"IF(O28+K28=0,\"\",(J28-I28))","v":""}]
["2023-07-03",5,{"$f":"IF(B29=\"\",\"\",VLOOKUP(B29,Liste1!$F$2:$I$9,2))","v":"Essai 5"},null,2,{"$f":"IF(B29=Liste1!$F$9,Liste1!$F$9*E29*100+MONTH($A29),0)","v":0},{"$f":"IF(B29=Liste1!$F$9,J29-I29,0)","v":0},{"$f":"IF(E29=\"\",\"\",VLOOKUP(E29,Liste1!$A$2:$B$41,2))","v":"Gérard Menvussat"},null,15,{"$f":"IF($B29=Liste1!$F$9,1,0)","v":0},{"$f":"IF(B29=7,\"\",(E29*100+(YEAR($A29)+MONTH($A29)+MONTH($A29)))/((YEAR($A29))))","v":1.1057834898665349},{"$f":"IF(O29+K29>0,I29,\"\")","v":""},{"$f":"IF(O29+K29>0,J29,\"\")","v":""},null,{"$f":"IF(O29+K29=0,\"\",(J29-I29))","v":""}]
["2023-08-01",5,{"$f":"IF(B30=\"\",\"\",VLOOKUP(B30,Liste1!$F$2:$I$9,2))","v":"Essai 5"},null,2,{"$f":"IF(B30=Liste1!$F$9,Liste1!$F$9*E30*100+MONTH($A30),0)","v":0},{"$f":"IF(B30=Liste1!$F$9,J30-I30,0)","v":0},{"$f":"IF(E30=\"\",\"\",VLOOKUP(E30,Liste1!$A$2:$B$41,2))","v":"Gérard Menvussat"},null,15,{"$f":"IF($B30=Liste1!$F$9,1,0)","v":0},{"$f":"IF(B30=7,\"\",(E30*100+(YEAR($A30)+MONTH($A30)+MONTH($A30)))/((YEAR($A30))))","v":1.106772120612951},{"$f":"IF(O30+K30>0,I30,\"\")","v":""},{"$f":"IF(O30+K30>0,J30,\"\")","v":""},null,{"$f":"IF(O30+K30=0,\"\",(J30-I30))","v":""}]
["2023-09-01",5,{"$f":"IF(B31=\"\",\"\",VLOOKUP(B31,Liste1!$F$2:$I$9,2))","v":"Essai 5"},null,2,{"$f":"IF(B31=Liste1!$F$9,Liste1!$F$9*E31*100+MONTH($A31),0)","v":0},{"$f":"IF(B31=Liste1!$F$9,J31-I31,0)","v":0},{"$f":"IF(E31=\"\",\"\",VLOOKUP(E31,Liste1!$A$2:$B$41,2))","v":"Gérard Menvussat"},null,16,{"$f":"IF($B31=Liste1!$F$9,1,0)","v":0},{"$f":"IF(I31+J31=0,\"\",(E31*100+(YEAR($A31)+MONTH($A31)+MONTH($A31)))/((YEAR($A31))))","v":1.1077607513593672},{"$f":"IF(O31+K31>0,I31,\"\")","v":""},{"$f":"IF(O31+K31>0,J31,\"\")","v":""},null,{"$f":"IF(O31+K31=0,\"\",(J31-I31))","v":""}]
["2023-10-01",5,{"$f":"IF(B32=\"\",\"\",VLOOKUP(B32,Liste1!$F$2:$I$9,2))","v":"Essai 5"},null,2,{"$f":"IF(B32=Liste1!$F$9,Liste1!$F$9*E32*100+MONTH($A32),0)","v":0},{"$f":"IF(B32=Liste1!$F$9,J32-I32,0)","v":0},{"$f":"IF(E32=\"\",\"\",VLOOKUP(E32,Liste1!$A$2:$B$41,2))","v":"Gérard Menvussat"},null,19,{"$f":"IF($B32=Liste1!$F$9,1,0)","v":0},{"$f":"IF(I32+J32=0,\"\",(E32*100+(YEAR($A32)+MONTH($A32)+MONTH($A32)))/((YEAR($A32))))","v":1.1087493821057834},{"$f":"IF(O32+K32>0,I32,\"\")","v":""},{"$f":"IF(O32+K32>0,J32,\"\")","v":""},null,{"$f":"IF(O32+K32=0,\"\",(J32-I32))","v":""}]
["2023-07-02",3,{"$f":"IF(B33=\"\",\"\",VLOOKUP(B33,Liste1!$F$2:$I$9,2))","v":"Essai 3"},null,3,{"$f":"IF(B33=Liste1!$F$9,Liste1!$F$9*E33*100+MONTH($A33),0)","v":0},{"$f":"IF(B33=Liste1!$F$9,J33-I33,0)","v":0},{"$f":"IF(E33=\"\",\"\",VLOOKUP(E33,Liste1!$A$2:$B$41,2))","v":"Sarah Pelle"},300,null,{"$f":"IF($B33=Liste1!$F$9,1,0)","v":0},{"$f":"IF(B33=7,\"\",(E33*100+(YEAR($A33)+MONTH($A33)+MONTH($A33)))/((YEAR($A33))))","v":1.1552150271873456},{"$f":"IF(O33+K33>0,I33,\"\")","v":""},{"$f":"IF(O33+K33>0,J33,\"\")","v":""},null,{"$f":"IF(O33+K33=0,\"\",(J33-I33))","v":""}]
["2023-07-02",3,{"$f":"IF(B34=\"\",\"\",VLOOKUP(B34,Liste1!$F$2:$I$9,2))","v":"Essai 3"},null,3,{"$f":"IF(B34=Liste1!$F$9,Liste1!$F$9*E34*100+MONTH($A34),0)","v":0},{"$f":"IF(B34=Liste1!$F$9,J34-I34,0)","v":0},{"$f":"IF(E34=\"\",\"\",VLOOKUP(E34,Liste1!$A$2:$B$41,2))","v":"Sarah Pelle"},40,null,{"$f":"IF($B34=Liste1!$F$9,1,0)","v":0},{"$f":"IF(B34=7,\"\",(E34*100+(YEAR($A34)+MONTH($A34)+MONTH($A34)))/((YEAR($A34))))","v":1.1552150271873456},{"$f":"IF(O34+K34>0,I34,\"\")","v":""},{"$f":"IF(O34+K34>0,J34,\"\")","v":""},null,{"$f":"IF(O34+K34=0,\"\",(J34-I34))","v":""}]
["2023-07-02",5,{"$f":"IF(B35=\"\",\"\",VLOOKUP(B35,Liste1!$F$2:$I$9,2))","v":"Essai 5"},null,3,{"$f":"IF(B35=Liste1!$F$9,Liste1!$F$9*E35*100+MONTH($A35),0)","v":0},{"$f":"IF(B35=Liste1!$F$9,J35-I35,0)","v":0},{"$f":"IF(E35=\"\",\"\",VLOOKUP(E35,Liste1!$A$2:$B$41,2))","v":"Sarah Pelle"},null,64,{"$f":"IF($B35=Liste1!$F$9,1,0)","v":0},{"$f":"IF(B35=7,\"\",(E35*100+(YEAR($A35)+MONTH($A35)+MONTH($A35)))/((YEAR($A35))))","v":1.1552150271873456},{"$f":"IF(O35+K35>0,I35,\"\")","v":""},{"$f":"IF(O35+K35>0,J35,\"\")","v":""},null,{"$f":"IF(O35+K35=0,\"\",(J35-I35))","v":""}]
["2023-07-02",5,{"$f":"IF(B36=\"\",\"\",VLOOKUP(B36,Liste1!$F$2:$I$9,2))","v":"Essai 5"},null,3,{"$f":"IF(B36=Liste1!$F$9,Liste1!$F$9*E36*100+MONTH($A36),0)","v":0},{"$f":"IF(B36=Liste1!$F$9,J36-I36,0)","v":0},{"$f":"IF(E36=\"\",\"\",VLOOKUP(E36,Liste1!$A$2:$B$41,2))","v":"Sarah Pelle"},null,32,{"$f":"IF($B36=Liste1!$F$9,1,0)","v":0},{"$f":"IF(B36=7,\"\",(E36*100+(YEAR($A36)+MONTH($A36)+MONTH($A36)))/((YEAR($A36))))","v":1.1552150271873456},{"$f":"IF(O36+K36>0,I36,\"\")","v":""},{"$f":"IF(O36+K36>0,J36,\"\")","v":""},null,{"$f":"IF(O36+K36=0,\"\",(J36-I36))","v":""}]
["2023-03-10",3,{"$f":"IF(B37=\"\",\"\",VLOOKUP(B37,Liste1!$F$2:$I$9,2))","v":"Essai 3"},null,4,{"$f":"IF(B37=Liste1!$F$9,Liste1!$F$9*E37*100+MONTH($A37),0)","v":0},{"$f":"IF(B37=Liste1!$F$9,J37-I37,0)","v":0},{"$f":"IF(E37=\"\",\"\",VLOOKUP(E37,Liste1!$A$2:$B$41,2))","v":"Aldo Berman"},100,null,{"$f":"IF($B37=Liste1!$F$9,1,0)","v":0},{"$f":"IF(I37+J37=0,\"\",(E37*100+(YEAR($A37)+MONTH($A37)+MONTH($A37)))/((YEAR($A37))))","v":1.2006920415224913},{"$f":"IF(O37+K37>0,I37,\"\")","v":""},{"$f":"IF(O37+K37>0,J37,\"\")","v":""},null,{"$f":"IF(O37+K37=0,\"\",(J37-I37))","v":""}]
["2023-04-10",3,{"$f":"IF(B38=\"\",\"\",VLOOKUP(B38,Liste1!$F$2:$I$9,2))","v":"Essai 3"},null,4,{"$f":"IF(B38=Liste1!$F$9,Liste1!$F$9*E38*100+MONTH($A38),0)","v":0},{"$f":"IF(B38=Liste1!$F$9,J38-I38,0)","v":0},{"$f":"IF(E38=\"\",\"\",VLOOKUP(E38,Liste1!$A$2:$B$41,2))","v":"Aldo Berman"},100,null,{"$f":"IF($B38=Liste1!$F$9,1,0)","v":0},{"$f":"IF(I38+J38=0,\"\",(E38*100+(YEAR($A38)+MONTH($A38)+MONTH($A38)))/((YEAR($A38))))","v":1.2016806722689075},{"$f":"IF(O38+K38>0,I38,\"\")","v":""},{"$f":"IF(O38+K38>0,J38,\"\")","v":""},null,{"$f":"IF(O38+K38=0,\"\",(J38-I38))","v":""}]
["2023-05-10",3,{"$f":"IF(B39=\"\",\"\",VLOOKUP(B39,Liste1!$F$2:$I$9,2))","v":"Essai 3"},null,4,{"$f":"IF(B39=Liste1!$F$9,Liste1!$F$9*E39*100+MONTH($A39),0)","v":0},{"$f":"IF(B39=Liste1!$F$9,J39-I39,0)","v":0},{"$f":"IF(E39=\"\",\"\",VLOOKUP(E39,Liste1!$A$2:$B$41,2))","v":"Aldo Berman"},100,null,{"$f":"IF($B39=Liste1!$F$9,1,0)","v":0},{"$f":"IF(B39=7,\"\",(E39*100+(YEAR($A39)+MONTH($A39)+MONTH($A39)))/((YEAR($A39))))","v":1.2026693030153237},{"$f":"IF(O39+K39>0,I39,\"\")","v":""},{"$f":"IF(O39+K39>0,J39,\"\")","v":""},null,{"$f":"IF(O39+K39=0,\"\",(J39-I39))","v":""}]
["2023-06-10",3,{"$f":"IF(B40=\"\",\"\",VLOOKUP(B40,Liste1!$F$2:$I$9,2))","v":"Essai 3"},null,4,{"$f":"IF(B40=Liste1!$F$9,Liste1!$F$9*E40*100+MONTH($A40),0)","v":0},{"$f":"IF(B40=Liste1!$F$9,J40-I40,0)","v":0},{"$f":"IF(E40=\"\",\"\",VLOOKUP(E40,Liste1!$A$2:$B$41,2))","v":"Aldo Berman"},100,null,{"$f":"IF($B40=Liste1!$F$9,1,0)","v":0},{"$f":"IF(B40=7,\"\",(E40*100+(YEAR($A40)+MONTH($A40)+MONTH($A40)))/((YEAR($A40))))","v":1.2036579337617399},{"$f":"IF(O40+K40>0,I40,\"\")","v":""},{"$f":"IF(O40+K40>0,J40,\"\")","v":""},null,{"$f":"IF(O40+K40=0,\"\",(J40-I40))","v":""}]
{"$rows_left_out":567}
{"sheet":"Liste1","index":2,"n_rows":112,"n_cols":7,"rows_kept":112,"cut":false,"hidden":false,"merged":[[9,6,9,8],[8,6,8,8],[6,6,6,8],[0,5,0,8],[7,6,7,8],[4,6,4,8],[3,6,3,8],[1,6,1,8],[2,6,2,8],[5,6,5,8]]}
["LIBELLÉS ","All",null,null,null,"MOUVEMENTS"]
[1,"Harry Cover",null,null,null,1,"Essai 1"]
[2,"Gérard Menvussat",null,null,null,2,"Essai 2"]
[3,"Sarah Pelle",null,null,null,3,"Essai 3"]
[4,"Aldo Berman",null,null,null,4,"Essai 4"]
[5,"Alex Térieur",null,null,null,5,"Essai 5"]
[6,"Elsa Dorsa",null,null,null,6,"Essai 6"]
[7,"Elvire Horouge",null,null,null,7,"Essai 7"]
[8,"Léon Dit",null,null,null,8,"Essai 8"]
[9,"Daisy Rable",null,null,null,10,"Essai 9"]
[10,"Léon Dit"]
[11]
[12]
[13]
[14]
[15]
[16]
[17]
[18]
[19]
[20]
[21]
[22]
[23]
[24]
[25]
[26]
[27]
[28]
[29]
[30]
[31]
[32]
[33]
[34]
[35]
[36]
[37]
[38]
[39]
{"$rows_left_out":72}