{"text_format":"1","workbook":"xlsx","n_sheets":5,"sheets":["Infos_2","Infos","Jours fériés","Vacances","Planning"],"not_rendered":{"charts":0,"images":0,"macros":1,"external_links":0,"defined_names":9,"comments":1,"pivot_tables":0},"unopened":[],"bounds":{"document_bytes":16777216,"sheet_cells":100000,"rows_first":2000,"rows_last":500,"rows_between":2000,"halvings":0,"cell_chars":16384,"cell_head_chars":4096},"cells_cut":0,"cells_raw":0,"read":"whole","date_system":"1900"}

{"sheet":"Infos_2","index":0,"n_rows":1097,"n_cols":16,"rows_kept":1097,"cut":false,"hidden":false,"merged":[]}
[null,null,{"$f":"B2","v":"C1"},null,null,{"$f":"E2","v":"C2"},null,null,{"$f":"H2","v":"H"},null,null,{"$f":"K2","v":"H1"},null,null,{"$f":"N2","v":"H2"}]
[{"$f":"C2","v":"2023-01-01"},"C1","2023-01-01","R","C2","2023-01-01","T","H","2023-01-01","R","H1","2023-01-01","R","H2","2023-01-01","R"]
["2023-01-02",null,"2023-01-02","R",null,"2023-01-02","T",null,"2023-01-02","T",null,"2023-01-02","R",null,"2023-01-02","T"]
["2023-01-03",null,"2023-01-03","T",null,"2023-01-03","R",null,"2023-01-03","T",null,"2023-01-03","T",null,"2023-01-03","T"]
["2023-01-04",null,"2023-01-04","T",null,"2023-01-04","R",null,"2023-01-04","T",null,"2023-01-04","T",null,"2023-01-04","T"]
["2023-01-05",null,"2023-01-05","R",null,"2023-01-05","T",null,"2023-01-05","T",null,"2023-01-05","T",null,"2023-01-05","T"]
["2023-01-06",null,"2023-01-06","R",null,"2023-01-06","T",null,"2023-01-06","T",null,"2023-01-06","T",null,"2023-01-06","T"]
["2023-01-07",null,"2023-01-07","R",null,"2023-01-07","T",null,"2023-01-07","R",null,"2023-01-07","R",null,"2023-01-07","T"]
{"$rows_left_out":1090}
{"sheet":"Infos","index":1,"n_rows":80,"n_cols":11,"rows_kept":80,"cut":false,"hidden":false,"merged":[[0,0,0,1]]}
["MOIS",null,null,"ANNEE",null,"EQUIPES","Nbr","EQUIPES","NOM","PRENOM","NOM & Prénom"]
["Janvier",1,null,2022,null,"C1",{"$f":"COUNTIF(H:H,F2)","v":11},"C1","NOM 1","Prénom 1",{"$f":"I2&\" \"&J2","v":"NOM 1 Prénom 1"}]
["Février",2,null,2023,null,"C2",12,"C1","NOM 2","Prénom 2","NOM 2 Prénom 2"]
["Mars",3,null,2024,null,"C3",13,"C1","NOM 3","Prénom 3","NOM 3 Prénom 3"]
["Avril",4,null,2025,null,"C4",13,"C1","NOM 4","Prénom 4","NOM 4 Prénom 4"]
["Mai",5,null,null,null,"H",9,"C1","NOM 5","Prénom 5","NOM 5 Prénom 5"]
["Juin",6,null,null,null,"H1",13,"C1","NOM 6","Prénom 6","NOM 6 Prénom 6"]
["Juillet",7,null,null,null,"H2",8,"C1","NOM 7","Prénom 7","NOM 7 Prénom 7"]
{"$rows_left_out":73}
{"sheet":"Jours fériés","index":2,"n_rows":15,"n_cols":2,"rows_kept":15,"cut":false,"hidden":false,"merged":[]}
["ANNEE",{"$f":"Planning!D1","v":"1923-12-01"}]
[]
["1er janvier",{"$f":"DATE(Planning!C1,1,1)","v":"2023-01-01"}]
["Pâques",{"$f":"ROUND(DATE(Planning!C1,4,MOD(234-11*MOD(Planning!C1,19),30))/7,0)*7-6","v":"2023-04-09"}]
["Lundi de Pâques",{"$f":"B4+1","v":"2023-04-10"}]
["1er Mai",{"$f":"DATE(Planning!C1,5,1)","v":"2023-05-01"}]
["8 Mai",{"$f":"DATE(Planning!C1,5,8)","v":"2023-05-08"}]
["Ascension",{"$f":"B4+39","v":"2023-05-18"}]
{"$rows_left_out":8}
{"sheet":"Vacances","index":3,"n_rows":19,"n_cols":3,"rows_kept":19,"cut":false,"hidden":false,"merged":[]}
["vacances","début","fin"]
[]
["été","2023-07-05","2023-09-03"]
["toussaint","2023-10-21","2023-11-06"]
["noêl","2023-12-23","2024-01-08"]
["hiver","2024-02-17","2024-03-04"]
["printemps","2024-04-13","2024-04-29"]
["été","2024-07-06","2024-09-02"]
{"$rows_left_out":12}
{"sheet":"Planning","index":4,"n_rows":266,"n_cols":1011,"rows_kept":266,"cut":false,"hidden":false,"merged":[]}
[null,"Année",2023,{"$f":"DATE(MATCH(C1,Infos!D2:D5,0)+21,MATCH(B4,Infos!A2:A13,0),1)","v":"1923-12-01"},null,null,null,"Repos ou WE",null,null,"férié",null,null,"vacances"]
[null,"valeurs pour code",{"$f":"MATCH(MAX(A:A),A:A,0)","v":23},{"$f":"MATCH(MAX(A:A),A:A,1)","v":265}]
[null,"H",{"$f":"DATE(C$1,MATCH(B4,mois,0),1)","v":"2023-12-01"},{"$f":"C3+1","v":"2023-12-02"},"2023-12-03","2023-12-04","2023-12-05","2023-12-06","2023-12-07","2023-12-08","2023-12-09","2023-12-10","2023-12-11","2023-12-12","2023-12-13","2023-12-14","2023-12-15","2023-12-16","2023-12-17","2023-12-18","2023-12-19","2023-12-20","2023-12-21","2023-12-22","2023-12-23","2023-12-24","2023-12-25","2023-12-26","2023-12-27","2023-12-28",{"$f":"IF(MONTH($AD$3)<>MONTH(AD$3+1),\"\",AD$3+1)","v":"2023-12-29"},{"$f":"IF(AE3=\"\",\"\",IF(MONTH(AE3+1)<>MONTH(AE3),\"\",AE3+1))","v":"2023-12-30"},{"$f":"IF(AF3=\"\",\"\",IF(MONTH(AF3+1)<>MONTH(AF3),\"\",AF3+1))","v":"2023-12-31"}]
[null,"Décembre",{"$f":"C3","v":"2023-12-01"},"2023-12-02","2023-12-03","2023-12-04","2023-12-05","2023-12-06","2023-12-07","2023-12-08","2023-12-09","2023-12-10","2023-12-11","2023-12-12","2023-12-13","2023-12-14","2023-12-15","2023-12-16","2023-12-17","2023-12-18","2023-12-19","2023-12-20","2023-12-21","2023-12-22","2023-12-23","2023-12-24","2023-12-25","2023-12-26","2023-12-27","2023-12-28","2023-12-29","2023-12-30","2023-12-31"]
[null,"Férié",{"$f":"IF(C3=\"\",\"\",DATE($C$1,MATCH($B4,Infos!$A$2:$A$13,0),DAY(C$91)))","v":"2023-12-01"},{"$f":"IF(D3=\"\",\"\",DATE($C$1,MATCH($B4,Infos!$A$2:$A$13,0),DAY(D$3)))","v":"2023-12-02"},{"$f":"IF(E3=\"\",\"\",DATE($C$1,MATCH($B4,Infos!$A$2:$A$13,0),DAY(E$3)))","v":"2023-12-03"},{"$f":"IF(F3=\"\",\"\",DATE($C$1,MATCH($B4,Infos!$A$2:$A$13,0),DAY(F$3)))","v":"2023-12-04"},{"$f":"IF(G3=\"\",\"\",DATE($C$1,MATCH($B4,Infos!$A$2:$A$13,0),DAY(G$3)))","v":"2023-12-05"},{"$f":"IF(H3=\"\",\"\",DATE($C$1,MATCH($B4,Infos!$A$2:$A$13,0),DAY(H$3)))","v":"2023-12-06"},{"$f":"IF(I3=\"\",\"\",DATE($C$1,MATCH($B4,Infos!$A$2:$A$13,0),DAY(I$3)))","v":"2023-12-07"},{"$f":"IF(J3=\"\",\"\",DATE($C$1,MATCH($B4,Infos!$A$2:$A$13,0),DAY(J$3)))","v":"2023-12-08"},{"$f":"IF(K3=\"\",\"\",DATE($C$1,MATCH($B4,Infos!$A$2:$A$13,0),DAY(K$3)))","v":"2023-12-09"},{"$f":"IF(L3=\"\",\"\",DATE($C$1,MATCH($B4,Infos!$A$2:$A$13,0),DAY(L$3)))","v":"2023-12-10"},{"$f":"IF(M3=\"\",\"\",DATE($C$1,MATCH($B4,Infos!$A$2:$A$13,0),DAY(M$3)))","v":"2023-12-11"},{"$f":"IF(N3=\"\",\"\",DATE($C$1,MATCH($B4,Infos!$A$2:$A$13,0),DAY(N$3)))","v":"2023-12-12"},{"$f":"IF(O3=\"\",\"\",DATE($C$1,MATCH($B4,Infos!$A$2:$A$13,0),DAY(O$3)))","v":"2023-12-13"},{"$f":"IF(P3=\"\",\"\",DATE($C$1,MATCH($B4,Infos!$A$2:$A$13,0),DAY(P$3)))","v":"2023-12-14"},{"$f":"IF(Q3=\"\",\"\",DATE($C$1,MATCH($B4,Infos!$A$2:$A$13,0),DAY(Q$3)))","v":"2023-12-15"},{"$f":"IF(R3=\"\",\"\",DATE($C$1,MATCH($B4,Infos!$A$2:$A$13,0),DAY(R$3)))","v":"2023-12-16"},{"$f":"IF(S3=\"\",\"\",DATE($C$1,MATCH($B4,Infos!$A$2:$A$13,0),DAY(S$3)))","v":"2023-12-17"},{"$f":"IF(T3=\"\",\"\",DATE($C$1,MATCH($B4,Infos!$A$2:$A$13,0),DAY(T$3)))","v":"2023-12-18"},{"$f":"IF(U3=\"\",\"\",DATE($C$1,MATCH($B4,Infos!$A$2:$A$13,0),DAY(U$3)))","v":"2023-12-19"},{"$f":"IF(V3=\"\",\"\",DATE($C$1,MATCH($B4,Infos!$A$2:$A$13,0),DAY(V$3)))","v":"2023-12-20"},{"$f":"IF(W3=\"\",\"\",DATE($C$1,MATCH($B4,Infos!$A$2:$A$13,0),DAY(W$3)))","v":"2023-12-21"},{"$f":"IF(X3=\"\",\"\",DATE($C$1,MATCH($B4,Infos!$A$2:$A$13,0),DAY(X$3)))","v":"2023-12-22"},{"$f":"IF(Y3=\"\",\"\",DATE($C$1,MATCH($B4,Infos!$A$2:$A$13,0),DAY(Y$3)))","v":"2023-12-23"},{"$f":"IF(Z3=\"\",\"\",DATE($C$1,MATCH($B4,Infos!$A$2:$A$13,0),DAY(Z$3)))","v":"2023-12-24"},{"$f":"IF(AA3=\"\",\"\",DATE($C$1,MATCH($B4,Infos!$A$2:$A$13,0),DAY(AA$3)))","v":"2023-12-25"},{"$f":"IF(AB3=\"\",\"\",DATE($C$1,MATCH($B4,Infos!$A$2:$A$13,0),DAY(AB$3)))","v":"2023-12-26"},{"$f":"IF(AC3=\"\",\"\",DATE($C$1,MATCH($B4,Infos!$A$2:$A$13,0),DAY(AC$3)))","v":"2023-12-27"},{"$f":"IF(AD3=\"\",\"\",DATE($C$1,MATCH($B4,Infos!$A$2:$A$13,0),DAY(AD$3)))","v":"2023-12-28"},{"$f":"IF(AE3=\"\",\"\",DATE($C$1,MATCH($B4,Infos!$A$2:$A$13,0),DAY(AE$3)))","v":"2023-12-29"},{"$f":"IF(AF3=\"\",\"\",DATE($C$1,MATCH($B4,Infos!$A$2:$A$13,0),DAY(AF$3)))","v":"2023-12-30"},{"$f":"IF(AG3=\"\",\"\",DATE($C$1,MATCH($B4,Infos!$A$2:$A$13,0),DAY(AG$3)))","v":"2023-12-31"},null,"sera caché"]
[null,"WE",{"$f":"IF(C25<>\"\",IF(COUNTIF('Jours fériés'!$B$3:$B$15,Planning!C5),8,WEEKDAY(C5,2)),\"\")","v":5},{"$f":"IF(D25<>\"\",IF(COUNTIF('Jours fériés'!$B$3:$B$15,Planning!D5),8,WEEKDAY(D5,2)),\"\")","v":6},{"$f":"IF(E25<>\"\",IF(COUNTIF('Jours fériés'!$B$3:$B$15,Planning!E5),8,WEEKDAY(E5,2)),\"\")","v":7},{"$f":"IF(F25<>\"\",IF(COUNTIF('Jours fériés'!$B$3:$B$15,Planning!F5),8,WEEKDAY(F5,2)),\"\")","v":1},{"$f":"IF(G25<>\"\",IF(COUNTIF('Jours fériés'!$B$3:$B$15,Planning!G5),8,WEEKDAY(G5,2)),\"\")","v":2},{"$f":"IF(H25<>\"\",IF(COUNTIF('Jours fériés'!$B$3:$B$15,Planning!H5),8,WEEKDAY(H5,2)),\"\")","v":3},{"$f":"IF(I25<>\"\",IF(COUNTIF('Jours fériés'!$B$3:$B$15,Planning!I5),8,WEEKDAY(I5,2)),\"\")","v":4},{"$f":"IF(J25<>\"\",IF(COUNTIF('Jours fériés'!$B$3:$B$15,Planning!J5),8,WEEKDAY(J5,2)),\"\")","v":5},{"$f":"IF(K25<>\"\",IF(COUNTIF('Jours fériés'!$B$3:$B$15,Planning!K5),8,WEEKDAY(K5,2)),\"\")","v":6},{"$f":"IF(L25<>\"\",IF(COUNTIF('Jours fériés'!$B$3:$B$15,Planning!L5),8,WEEKDAY(L5,2)),\"\")","v":7},{"$f":"IF(M25<>\"\",IF(COUNTIF('Jours fériés'!$B$3:$B$15,Planning!M5),8,WEEKDAY(M5,2)),\"\")","v":1},{"$f":"IF(N25<>\"\",IF(COUNTIF('Jours fériés'!$B$3:$B$15,Planning!N5),8,WEEKDAY(N5,2)),\"\")","v":2},{"$f":"IF(O25<>\"\",IF(COUNTIF('Jours fériés'!$B$3:$B$15,Planning!O5),8,WEEKDAY(O5,2)),\"\")","v":3},{"$f":"IF(P25<>\"\",IF(COUNTIF('Jours fériés'!$B$3:$B$15,Planning!P5),8,WEEKDAY(P5,2)),\"\")","v":4},{"$f":"IF(Q25<>\"\",IF(COUNTIF('Jours fériés'!$B$3:$B$15,Planning!Q5),8,WEEKDAY(Q5,2)),\"\")","v":5},{"$f":"IF(R25<>\"\",IF(COUNTIF('Jours fériés'!$B$3:$B$15,Planning!R5),8,WEEKDAY(R5,2)),\"\")","v":6},{"$f":"IF(S25<>\"\",IF(COUNTIF('Jours fériés'!$B$3:$B$15,Planning!S5),8,WEEKDAY(S5,2)),\"\")","v":7},{"$f":"IF(T25<>\"\",IF(COUNTIF('Jours fériés'!$B$3:$B$15,Planning!T5),8,WEEKDAY(T5,2)),\"\")","v":1},{"$f":"IF(U25<>\"\",IF(COUNTIF('Jours fériés'!$B$3:$B$15,Planning!U5),8,WEEKDAY(U5,2)),\"\")","v":2},{"$f":"IF(V25<>\"\",IF(COUNTIF('Jours fériés'!$B$3:$B$15,Planning!V5),8,WEEKDAY(V5,2)),\"\")","v":3},{"$f":"IF(W25<>\"\",IF(COUNTIF('Jours fériés'!$B$3:$B$15,Planning!W5),8,WEEKDAY(W5,2)),\"\")","v":4},{"$f":"IF(X25<>\"\",IF(COUNTIF('Jours fériés'!$B$3:$B$15,Planning!X5),8,WEEKDAY(X5,2)),\"\")","v":5},{"$f":"IF(Y25<>\"\",IF(COUNTIF('Jours fériés'!$B$3:$B$15,Planning!Y5),8,WEEKDAY(Y5,2)),\"\")","v":6},{"$f":"IF(Z25<>\"\",IF(COUNTIF('Jours fériés'!$B$3:$B$15,Planning!Z5),8,WEEKDAY(Z5,2)),\"\")","v":7},{"$f":"IF(AA25<>\"\",IF(COUNTIF('Jours fériés'!$B$3:$B$15,Planning!AA5),8,WEEKDAY(AA5,2)),\"\")","v":8},{"$f":"IF(AB25<>\"\",IF(COUNTIF('Jours fériés'!$B$3:$B$15,Planning!AB5),8,WEEKDAY(AB5,2)),\"\")","v":2},{"$f":"IF(AC25<>\"\",IF(COUNTIF('Jours fériés'!$B$3:$B$15,Planning!AC5),8,WEEKDAY(AC5,2)),\"\")","v":3},{"$f":"IF(AD25<>\"\",IF(COUNTIF('Jours fériés'!$B$3:$B$15,Planning!AD5),8,WEEKDAY(AD5,2)),\"\")","v":4},{"$f":"IF(AE25<>\"\",IF(COUNTIF('Jours fériés'!$B$3:$B$15,Planning!AE5),8,WEEKDAY(AE5,2)),\"\")","v":5},{"$f":"IF(AF25<>\"\",IF(COUNTIF('Jours fériés'!$B$3:$B$15,Planning!AF5),8,WEEKDAY(AF5,2)),\"\")","v":6},{"$f":"IF(AG25<>\"\",IF(COUNTIF('Jours fériés'!$B$3:$B$15,Planning!AG5),8,WEEKDAY(AG5,2)),\"\")","v":7},null,"sera caché"]
[null,"VACANCES",{"$f":"IF(SUMPRODUCT((C3>=datdeb)*(C3<=datfin))=1,\"vac\",\"\")","v":""},{"$f":"IF(SUMPRODUCT((D3>=datdeb)*(D3<=datfin))=1,\"vac\",\"\")","v":""},{"$f":"IF(SUMPRODUCT((E3>=datdeb)*(E3<=datfin))=1,\"vac\",\"\")","v":""},{"$f":"IF(SUMPRODUCT((F3>=datdeb)*(F3<=datfin))=1,\"vac\",\"\")","v":""},{"$f":"IF(SUMPRODUCT((G3>=datdeb)*(G3<=datfin))=1,\"vac\",\"\")","v":""},{"$f":"IF(SUMPRODUCT((H3>=datdeb)*(H3<=datfin))=1,\"vac\",\"\")","v":""},{"$f":"IF(SUMPRODUCT((I3>=datdeb)*(I3<=datfin))=1,\"vac\",\"\")","v":""},{"$f":"IF(SUMPRODUCT((J3>=datdeb)*(J3<=datfin))=1,\"vac\",\"\")","v":""},{"$f":"IF(SUMPRODUCT((K3>=datdeb)*(K3<=datfin))=1,\"vac\",\"\")","v":""},{"$f":"IF(SUMPRODUCT((L3>=datdeb)*(L3<=datfin))=1,\"vac\",\"\")","v":""},{"$f":"IF(SUMPRODUCT((M3>=datdeb)*(M3<=datfin))=1,\"vac\",\"\")","v":""},{"$f":"IF(SUMPRODUCT((N3>=datdeb)*(N3<=datfin))=1,\"vac\",\"\")","v":""},{"$f":"IF(SUMPRODUCT((O3>=datdeb)*(O3<=datfin))=1,\"vac\",\"\")","v":""},{"$f":"IF(SUMPRODUCT((P3>=datdeb)*(P3<=datfin))=1,\"vac\",\"\")","v":""},{"$f":"IF(SUMPRODUCT((Q3>=datdeb)*(Q3<=datfin))=1,\"vac\",\"\")","v":""},{"$f":"IF(SUMPRODUCT((R3>=datdeb)*(R3<=datfin))=1,\"vac\",\"\")","v":""},{"$f":"IF(SUMPRODUCT((S3>=datdeb)*(S3<=datfin))=1,\"vac\",\"\")","v":""},{"$f":"IF(SUMPRODUCT((T3>=datdeb)*(T3<=datfin))=1,\"vac\",\"\")","v":""},{"$f":"IF(SUMPRODUCT((U3>=datdeb)*(U3<=datfin))=1,\"vac\",\"\")","v":""},{"$f":"IF(SUMPRODUCT((V3>=datdeb)*(V3<=datfin))=1,\"vac\",\"\")","v":""},{"$f":"IF(SUMPRODUCT((W3>=datdeb)*(W3<=datfin))=1,\"vac\",\"\")","v":""},{"$f":"IF(SUMPRODUCT((X3>=datdeb)*(X3<=datfin))=1,\"vac\",\"\")","v":""},{"$f":"IF(SUMPRODUCT((Y3>=datdeb)*(Y3<=datfin))=1,\"vac\",\"\")","v":"vac"},{"$f":"IF(SUMPRODUCT((Z3>=datdeb)*(Z3<=datfin))=1,\"vac\",\"\")","v":"vac"},{"$f":"IF(SUMPRODUCT((AA3>=datdeb)*(AA3<=datfin))=1,\"vac\",\"\")","v":"vac"},{"$f":"IF(SUMPRODUCT((AB3>=datdeb)*(AB3<=datfin))=1,\"vac\",\"\")","v":"vac"},{"$f":"IF(SUMPRODUCT((AC3>=datdeb)*(AC3<=datfin))=1,\"vac\",\"\")","v":"vac"},{"$f":"IF(SUMPRODUCT((AD3>=datdeb)*(AD3<=datfin))=1,\"vac\",\"\")","v":"vac"},{"$f":"IF(SUMPRODUCT((AE3>=datdeb)*(AE3<=datfin))=1,\"vac\",\"\")","v":"vac"},{"$f":"IF(SUMPRODUCT((AF3>=datdeb)*(AF3<=datfin))=1,\"vac\",\"\")","v":"vac"},{"$f":"IF(SUMPRODUCT((AG3>=datdeb)*(AG3<=datfin))=1,\"vac\",\"\")","v":"vac"}]
[null,null,{"$f":"IFERROR(_xlfn.SWITCH($B$3,\"C1\",INDEX(Infos_2!$D$2:$D$1097,MATCH(C3,Infos_2!$C$2:$C$1097,0),1),\"C2\",INDEX(Infos_2!$G$2:$G$1097,MATCH(C3,Infos_2!$F$2:$F$1097,0), ,1),\"H\",INDEX(Infos_2!$J$2:$J$1097,MATCH(C3,Infos_2!$I$2:$I$1097,0), ,1),\"H1\",INDEX(Infos_2!$M$2:$M$1097,MATCH(C3,Infos_2!$L$2:$L$1097,0), ,1),\"H2\",INDEX(Infos_2!$P$2:$P$1097,MATCH(C3,Infos_2!$O$2:$O$1097,0), ,1)),\"\")","v":"T"},{"$f":"IFERROR(_xlfn.SWITCH($B$3,\"C1\",INDEX(Infos_2!$D$2:$D$1097,MATCH(D3,Infos_2!$C$2:$C$1097,0),1),\"C2\",INDEX(Infos_2!$G$2:$G$1097,MATCH(D3,Infos_2!$F$2:$F$1097,0), ,1),\"H\",INDEX(Infos_2!$J$2:$J$1097,MATCH(D3,Infos_2!$I$2:$I$1097,0), ,1),\"H1\",INDEX(Infos_2!$M$2:$M$1097,MATCH(D3,Infos_2!$L$2:$L$1097,0), ,1),\"H2\",INDEX(Infos_2!$P$2:$P$1097,MATCH(D3,Infos_2!$O$2:$O$1097,0), ,1)),\"\")","v":"R"},{"$f":"IFERROR(_xlfn.SWITCH($B$3,\"C1\",INDEX(Infos_2!$D$2:$D$1097,MATCH(E3,Infos_2!$C$2:$C$1097,0),1),\"C2\",INDEX(Infos_2!$G$2:$G$1097,MATCH(E3,Infos_2!$F$2:$F$1097,0), ,1),\"H\",INDEX(Infos_2!$J$2:$J$1097,MATCH(E3,Infos_2!$I$2:$I$1097,0), ,1),\"H1\",INDEX(Infos_2!$M$2:$M$1097,MATCH(E3,Infos_2!$L$2:$L$1097,0), ,1),\"H2\",INDEX(Infos_2!$P$2:$P$1097,MATCH(E3,Infos_2!$O$2:$O$1097,0), ,1)),\"\")","v":"R"},{"$f":"IFERROR(_xlfn.SWITCH($B$3,\"C1\",INDEX(Infos_2!$D$2:$D$1097,MATCH(F3,Infos_2!$C$2:$C$1097,0),1),\"C2\",INDEX(Infos_2!$G$2:$G$1097,MATCH(F3,Infos_2!$F$2:$F$1097,0), ,1),\"H\",INDEX(Infos_2!$J$2:$J$1097,MATCH(F3,Infos_2!$I$2:$I$1097,0), ,1),\"H1\",INDEX(Infos_2!$M$2:$M$1097,MATCH(F3,Infos_2!$L$2:$L$1097,0), ,1),\"H2\",INDEX(Infos_2!$P$2:$P$1097,MATCH(F3,Infos_2!$O$2:$O$1097,0), ,1)),\"\")","v":"T"},{"$f":"IFERROR(_xlfn.SWITCH($B$3,\"C1\",INDEX(Infos_2!$D$2:$D$1097,MATCH(G3,Infos_2!$C$2:$C$1097,0),1),\"C2\",INDEX(Infos_2!$G$2:$G$1097,MATCH(G3,Infos_2!$F$2:$F$1097,0), ,1),\"H\",INDEX(Infos_2!$J$2:$J$1097,MATCH(G3,Infos_2!$I$2:$I$1097,0), ,1),\"H1\",INDEX(Infos_2!$M$2:$M$1097,MATCH(G3,Infos_2!$L$2:$L$1097,0), ,1),\"H2\",INDEX(Infos_2!$P$2:$P$1097,MATCH(G3,Infos_2!$O$2:$O$1097,0), ,1)),\"\")","v":"T"},{"$f":"IFERROR(_xlfn.SWITCH($B$3,\"C1\",INDEX(Infos_2!$D$2:$D$1097,MATCH(H3,Infos_2!$C$2:$C$1097,0),1),\"C2\",INDEX(Infos_2!$G$2:$G$1097,MATCH(H3,Infos_2!$F$2:$F$1097,0), ,1),\"H\",INDEX(Infos_2!$J$2:$J$1097,MATCH(H3,Infos_2!$I$2:$I$1097,0), ,1),\"H1\",INDEX(Infos_2!$M$2:$M$1097,MATCH(H3,Infos_2!$L$2:$L$1097,0), ,1),\"H2\",INDEX(Infos_2!$P$2:$P$1097,MATCH(H3,Infos_2!$O$2:$O$1097,0), ,1)),\"\")","v":"T"},{"$f":"IFERROR(_xlfn.SWITCH($B$3,\"C1\",INDEX(Infos_2!$D$2:$D$1097,MATCH(I3,Infos_2!$C$2:$C$1097,0),1),\"C2\",INDEX(Infos_2!$G$2:$G$1097,MATCH(I3,Infos_2!$F$2:$F$1097,0), ,1),\"H\",INDEX(Infos_2!$J$2:$J$1097,MATCH(I3,Infos_2!$I$2:$I$1097,0), ,1),\"H1\",INDEX(Infos_2!$M$2:$M$1097,MATCH(I3,Infos_2!$L$2:$L$1097,0), ,1),\"H2\",INDEX(Infos_2!$P$2:$P$1097,MATCH(I3,Infos_2!$O$2:$O$1097,0), ,1)),\"\")","v":"T"},{"$f":"IFERROR(_xlfn.SWITCH($B$3,\"C1\",INDEX(Infos_2!$D$2:$D$1097,MATCH(J3,Infos_2!$C$2:$C$1097,0),1),\"C2\",INDEX(Infos_2!$G$2:$G$1097,MATCH(J3,Infos_2!$F$2:$F$1097,0), ,1),\"H\",INDEX(Infos_2!$J$2:$J$1097,MATCH(J3,Infos_2!$I$2:$I$1097,0), ,1),\"H1\",INDEX(Infos_2!$M$2:$M$1097,MATCH(J3,Infos_2!$L$2:$L$1097,0), ,1),\"H2\",INDEX(Infos_2!$P$2:$P$1097,MATCH(J3,Infos_2!$O$2:$O$1097,0), ,1)),\"\")","v":"T"},{"$f":"IFERROR(_xlfn.SWITCH($B$3,\"C1\",INDEX(Infos_2!$D$2:$D$1097,MATCH(K3,Infos_2!$C$2:$C$1097,0),1),\"C2\",INDEX(Infos_2!$G$2:$G$1097,MATCH(K3,Infos_2!$F$2:$F$1097,0), ,1),\"H\",INDEX(Infos_2!$J$2:$J$1097,MATCH(K3,Infos_2!$I$2:$I$1097,0), ,1),\"H1\",INDEX(Infos_2!$M$2:$M$1097,MATCH(K3,Infos_2!$L$2:$L$1097,0), ,1),\"H2\",INDEX(Infos_2!$P$2:$P$1097,MATCH(K3,Infos_2!$O$2:$O$1097,0), ,1)),\"\")","v":"R"},{"$f":"IFERROR(_xlfn.SWITCH($B$3,\"C1\",INDEX(Infos_2!$D$2:$D$1097,MATCH(L3,Infos_2!$C$2:$C$1097,0),1),\"C2\",INDEX(Infos_2!$G$2:$G$1097,MATCH(L3,Infos_2!$F$2:$F$1097,0), ,1),\"H\",INDEX(Infos_2!$J$2:$J$1097,MATCH(L3,Infos_2!$I$2:$I$1097,0), ,1),\"H1\",INDEX(Infos_2!$M$2:$M$1097,MATCH(L3,Infos_2!$L$2:$L$1097,0), ,1),\"H2\",INDEX(Infos_2!$P$2:$P$1097,MATCH(L3,Infos_2!$O$2:$O$1097,0), ,1)),\"\")","v":"R"},{"$f":"IFERROR(_xlfn.SWITCH($B$3,\"C1\",INDEX(Infos_2!$D$2:$D$1097,MATCH(M3,Infos_2!$C$2:$C$1097,0),1),\"C2\",INDEX(Infos_2!$G$2:$G$1097,MATCH(M3,Infos_2!$F$2:$F$1097,0), ,1),\"H\",INDEX(Infos_2!$J$2:$J$1097,MATCH(M3,Infos_2!$I$2:$I$1097,0), ,1),\"H1\",INDEX(Infos_2!$M$2:$M$1097,MATCH(M3,Infos_2!$L$2:$L$1097,0), ,1),\"H2\",INDEX(Infos_2!$P$2:$P$1097,MATCH(M3,Infos_2!$O$2:$O$1097,0), ,1)),\"\")","v":"T"},{"$f":"IFERROR(_xlfn.SWITCH($B$3,\"C1\",INDEX(Infos_2!$D$2:$D$1097,MATCH(N3,Infos_2!$C$2:$C$1097,0),1),\"C2\",INDEX(Infos_2!$G$2:$G$1097,MATCH(N3,Infos_2!$F$2:$F$1097,0), ,1),\"H\",INDEX(Infos_2!$J$2:$J$1097,MATCH(N3,Infos_2!$I$2:$I$1097,0), ,1),\"H1\",INDEX(Infos_2!$M$2:$M$1097,MATCH(N3,Infos_2!$L$2:$L$1097,0), ,1),\"H2\",INDEX(Infos_2!$P$2:$P$1097,MATCH(N3,Infos_2!$O$2:$O$1097,0), ,1)),\"\")","v":"T"},{"$f":"IFERROR(_xlfn.SWITCH($B$3,\"C1\",INDEX(Infos_2!$D$2:$D$1097,MATCH(O3,Infos_2!$C$2:$C$1097,0),1),\"C2\",INDEX(Infos_2!$G$2:$G$1097,MATCH(O3,Infos_2!$F$2:$F$1097,0), ,1),\"H\",INDEX(Infos_2!$J$2:$J$1097,MATCH(O3,Infos_2!$I$2:$I$1097,0), ,1),\"H1\",INDEX(Infos_2!$M$2:$M$1097,MATCH(O3,Infos_2!$L$2:$L$1097,0), ,1),\"H2\",INDEX(Infos_2!$P$2:$P$1097,MATCH(O3,Infos_2!$O$2:$O$1097,0), ,1)),\"\")","v":"T"},{"$f":"IFERROR(_xlfn.SWITCH($B$3,\"C1\",INDEX(Infos_2!$D$2:$D$1097,MATCH(P3,Infos_2!$C$2:$C$1097,0),1),\"C2\",INDEX(Infos_2!$G$2:$G$1097,MATCH(P3,Infos_2!$F$2:$F$1097,0), ,1),\"H\",INDEX(Infos_2!$J$2:$J$1097,MATCH(P3,Infos_2!$I$2:$I$1097,0), ,1),\"H1\",INDEX(Infos_2!$M$2:$M$1097,MATCH(P3,Infos_2!$L$2:$L$1097,0), ,1),\"H2\",INDEX(Infos_2!$P$2:$P$1097,MATCH(P3,Infos_2!$O$2:$O$1097,0), ,1)),\"\")","v":"T"},{"$f":"IFERROR(_xlfn.SWITCH($B$3,\"C1\",INDEX(Infos_2!$D$2:$D$1097,MATCH(Q3,Infos_2!$C$2:$C$1097,0),1),\"C2\",INDEX(Infos_2!$G$2:$G$1097,MATCH(Q3,Infos_2!$F$2:$F$1097,0), ,1),\"H\",INDEX(Infos_2!$J$2:$J$1097,MATCH(Q3,Infos_2!$I$2:$I$1097,0), ,1),\"H1\",INDEX(Infos_2!$M$2:$M$1097,MATCH(Q3,Infos_2!$L$2:$L$1097,0), ,1),\"H2\",INDEX(Infos_2!$P$2:$P$1097,MATCH(Q3,Infos_2!$O$2:$O$1097,0), ,1)),\"\")","v":"T"},{"$f":"IFERROR(_xlfn.SWITCH($B$3,\"C1\",INDEX(Infos_2!$D$2:$D$1097,MATCH(R3,Infos_2!$C$2:$C$1097,0),1),\"C2\",INDEX(Infos_2!$G$2:$G$1097,MATCH(R3,Infos_2!$F$2:$F$1097,0), ,1),\"H\",INDEX(Infos_2!$J$2:$J$1097,MATCH(R3,Infos_2!$I$2:$I$1097,0), ,1),\"H1\",INDEX(Infos_2!$M$2:$M$1097,MATCH(R3,Infos_2!$L$2:$L$1097,0), ,1),\"H2\",INDEX(Infos_2!$P$2:$P$1097,MATCH(R3,Infos_2!$O$2:$O$1097,0), ,1)),\"\")","v":"R"},{"$f":"IFERROR(_xlfn.SWITCH($B$3,\"C1\",INDEX(Infos_2!$D$2:$D$1097,MATCH(S3,Infos_2!$C$2:$C$1097,0),1),\"C2\",INDEX(Infos_2!$G$2:$G$1097,MATCH(S3,Infos_2!$F$2:$F$1097,0), ,1),\"H\",INDEX(Infos_2!$J$2:$J$1097,MATCH(S3,Infos_2!$I$2:$I$1097,0), ,1),\"H1\",INDEX(Infos_2!$M$2:$M$1097,MATCH(S3,Infos_2!$L$2:$L$1097,0), ,1),\"H2\",INDEX(Infos_2!$P$2:$P$1097,MATCH(S3,Infos_2!$O$2:$O$1097,0), ,1)),\"\")","v":"R"},{"$f":"IFERROR(_xlfn.SWITCH($B$3,\"C1\",INDEX(Infos_2!$D$2:$D$1097,MATCH(T3,Infos_2!$C$2:$C$1097,0),1),\"C2\",INDEX(Infos_2!$G$2:$G$1097,MATCH(T3,Infos_2!$F$2:$F$1097,0), ,1),\"H\",INDEX(Infos_2!$J$2:$J$1097,MATCH(T3,Infos_2!$I$2:$I$1097,0), ,1),\"H1\",INDEX(Infos_2!$M$2:$M$1097,MATCH(T3,Infos_2!$L$2:$L$1097,0), ,1),\"H2\",INDEX(Infos_2!$P$2:$P$1097,MATCH(T3,Infos_2!$O$2:$O$1097,0), ,1)),\"\")","v":"T"},{"$f":"IFERROR(_xlfn.SWITCH($B$3,\"C1\",INDEX(Infos_2!$D$2:$D$1097,MATCH(U3,Infos_2!$C$2:$C$1097,0),1),\"C2\",INDEX(Infos_2!$G$2:$G$1097,MATCH(U3,Infos_2!$F$2:$F$1097,0), ,1),\"H\",INDEX(Infos_2!$J$2:$J$1097,MATCH(U3,Infos_2!$I$2:$I$1097,0), ,1),\"H1\",INDEX(Infos_2!$M$2:$M$1097,MATCH(U3,Infos_2!$L$2:$L$1097,0), ,1),\"H2\",INDEX(Infos_2!$P$2:$P$1097,MATCH(U3,Infos_2!$O$2:$O$1097,0), ,1)),\"\")","v":"T"},{"$f":"IFERROR(_xlfn.SWITCH($B$3,\"C1\",INDEX(Infos_2!$D$2:$D$1097,MATCH(V3,Infos_2!$C$2:$C$1097,0),1),\"C2\",INDEX(Infos_2!$G$2:$G$1097,MATCH(V3,Infos_2!$F$2:$F$1097,0), ,1),\"H\",INDEX(Infos_2!$J$2:$J$1097,MATCH(V3,Infos_2!$I$2:$I$1097,0), ,1),\"H1\",INDEX(Infos_2!$M$2:$M$1097,MATCH(V3,Infos_2!$L$2:$L$1097,0), ,1),\"H2\",INDEX(Infos_2!$P$2:$P$1097,MATCH(V3,Infos_2!$O$2:$O$1097,0), ,1)),\"\")","v":"T"},{"$f":"IFERROR(_xlfn.SWITCH($B$3,\"C1\",INDEX(Infos_2!$D$2:$D$1097,MATCH(W3,Infos_2!$C$2:$C$1097,0),1),\"C2\",INDEX(Infos_2!$G$2:$G$1097,MATCH(W3,Infos_2!$F$2:$F$1097,0), ,1),\"H\",INDEX(Infos_2!$J$2:$J$1097,MATCH(W3,Infos_2!$I$2:$I$1097,0), ,1),\"H1\",INDEX(Infos_2!$M$2:$M$1097,MATCH(W3,Infos_2!$L$2:$L$1097,0), ,1),\"H2\",INDEX(Infos_2!$P$2:$P$1097,MATCH(W3,Infos_2!$O$2:$O$1097,0), ,1)),\"\")","v":"T"},{"$f":"IFERROR(_xlfn.SWITCH($B$3,\"C1\",INDEX(Infos_2!$D$2:$D$1097,MATCH(X3,Infos_2!$C$2:$C$1097,0),1),\"C2\",INDEX(Infos_2!$G$2:$G$1097,MATCH(X3,Infos_2!$F$2:$F$1097,0), ,1),\"H\",INDEX(Infos_2!$J$2:$J$1097,MATCH(X3,Infos_2!$I$2:$I$1097,0), ,1),\"H1\",INDEX(Infos_2!$M$2:$M$1097,MATCH(X3,Infos_2!$L$2:$L$1097,0), ,1),\"H2\",INDEX(Infos_2!$P$2:$P$1097,MATCH(X3,Infos_2!$O$2:$O$1097,0), ,1)),\"\")","v":"T"},{"$f":"IFERROR(_xlfn.SWITCH($B$3,\"C1\",INDEX(Infos_2!$D$2:$D$1097,MATCH(Y3,Infos_2!$C$2:$C$1097,0),1),\"C2\",INDEX(Infos_2!$G$2:$G$1097,MATCH(Y3,Infos_2!$F$2:$F$1097,0), ,1),\"H\",INDEX(Infos_2!$J$2:$J$1097,MATCH(Y3,Infos_2!$I$2:$I$1097,0), ,1),\"H1\",INDEX(Infos_2!$M$2:$M$1097,MATCH(Y3,Infos_2!$L$2:$L$1097,0), ,1),\"H2\",INDEX(Infos_2!$P$2:$P$1097,MATCH(Y3,Infos_2!$O$2:$O$1097,0), ,1)),\"\")","v":"R"},{"$f":"IFERROR(_xlfn.SWITCH($B$3,\"C1\",INDEX(Infos_2!$D$2:$D$1097,MATCH(Z3,Infos_2!$C$2:$C$1097,0),1),\"C2\",INDEX(Infos_2!$G$2:$G$1097,MATCH(Z3,Infos_2!$F$2:$F$1097,0), ,1),\"H\",INDEX(Infos_2!$J$2:$J$1097,MATCH(Z3,Infos_2!$I$2:$I$1097,0), ,1),\"H1\",INDEX(Infos_2!$M$2:$M$1097,MATCH(Z3,Infos_2!$L$2:$L$1097,0), ,1),\"H2\",INDEX(Infos_2!$P$2:$P$1097,MATCH(Z3,Infos_2!$O$2:$O$1097,0), ,1)),\"\")","v":"R"},{"$f":"IFERROR(_xlfn.SWITCH($B$3,\"C1\",INDEX(Infos_2!$D$2:$D$1097,MATCH(AA3,Infos_2!$C$2:$C$1097,0),1),\"C2\",INDEX(Infos_2!$G$2:$G$1097,MATCH(AA3,Infos_2!$F$2:$F$1097,0), ,1),\"H\",INDEX(Infos_2!$J$2:$J$1097,MATCH(AA3,Infos_2!$I$2:$I$1097,0), ,1),\"H1\",INDEX(Infos_2!$M$2:$M$1097,MATCH(AA3,Infos_2!$L$2:$L$1097,0), ,1),\"H2\",INDEX(Infos_2!$P$2:$P$1097,MATCH(AA3,Infos_2!$O$2:$O$1097,0), ,1)),\"\")","v":"T"},{"$f":"IFERROR(_xlfn.SWITCH($B$3,\"C1\",INDEX(Infos_2!$D$2:$D$1097,MATCH(AB3,Infos_2!$C$2:$C$1097,0),1),\"C2\",INDEX(Infos_2!$G$2:$G$1097,MATCH(AB3,Infos_2!$F$2:$F$1097,0), ,1),\"H\",INDEX(Infos_2!$J$2:$J$1097,MATCH(AB3,Infos_2!$I$2:$I$1097,0), ,1),\"H1\",INDEX(Infos_2!$M$2:$M$1097,MATCH(AB3,Infos_2!$L$2:$L$1097,0), ,1),\"H2\",INDEX(Infos_2!$P$2:$P$1097,MATCH(AB3,Infos_2!$O$2:$O$1097,0), ,1)),\"\")","v":"T"},{"$f":"IFERROR(_xlfn.SWITCH($B$3,\"C1\",INDEX(Infos_2!$D$2:$D$1097,MATCH(AC3,Infos_2!$C$2:$C$1097,0),1),\"C2\",INDEX(Infos_2!$G$2:$G$1097,MATCH(AC3,Infos_2!$F$2:$F$1097,0), ,1),\"H\",INDEX(Infos_2!$J$2:$J$1097,MATCH(AC3,Infos_2!$I$2:$I$1097,0), ,1),\"H1\",INDEX(Infos_2!$M$2:$M$1097,MATCH(AC3,Infos_2!$L$2:$L$1097,0), ,1),\"H2\",INDEX(Infos_2!$P$2:$P$1097,MATCH(AC3,Infos_2!$O$2:$O$1097,0), ,1)),\"\")","v":"T"},{"$f":"IFERROR(_xlfn.SWITCH($B$3,\"C1\",INDEX(Infos_2!$D$2:$D$1097,MATCH(AD3,Infos_2!$C$2:$C$1097,0),1),\"C2\",INDEX(Infos_2!$G$2:$G$1097,MATCH(AD3,Infos_2!$F$2:$F$1097,0), ,1),\"H\",INDEX(Infos_2!$J$2:$J$1097,MATCH(AD3,Infos_2!$I$2:$I$1097,0), ,1),\"H1\",INDEX(Infos_2!$M$2:$M$1097,MATCH(AD3,Infos_2!$L$2:$L$1097,0), ,1),\"H2\",INDEX(Infos_2!$P$2:$P$1097,MATCH(AD3,Infos_2!$O$2:$O$1097,0), ,1)),\"\")","v":"T"},{"$f":"IFERROR(_xlfn.SWITCH($B$3,\"C1\",INDEX(Infos_2!$D$2:$D$1097,MATCH(AE3,Infos_2!$C$2:$C$1097,0),1),\"C2\",INDEX(Infos_2!$G$2:$G$1097,MATCH(AE3,Infos_2!$F$2:$F$1097,0), ,1),\"H\",INDEX(Infos_2!$J$2:$J$1097,MATCH(AE3,Infos_2!$I$2:$I$1097,0), ,1),\"H1\",INDEX(Infos_2!$M$2:$M$1097,MATCH(AE3,Infos_2!$L$2:$L$1097,0), ,1),\"H2\",INDEX(Infos_2!$P$2:$P$1097,MATCH(AE3,Infos_2!$O$2:$O$1097,0), ,1)),\"\")","v":"T"},{"$f":"IFERROR(_xlfn.SWITCH($B$3,\"C1\",INDEX(Infos_2!$D$2:$D$1097,MATCH(AF3,Infos_2!$C$2:$C$1097,0),1),\"C2\",INDEX(Infos_2!$G$2:$G$1097,MATCH(AF3,Infos_2!$F$2:$F$1097,0), ,1),\"H\",INDEX(Infos_2!$J$2:$J$1097,MATCH(AF3,Infos_2!$I$2:$I$1097,0), ,1),\"H1\",INDEX(Infos_2!$M$2:$M$1097,MATCH(AF3,Infos_2!$L$2:$L$1097,0), ,1),\"H2\",INDEX(Infos_2!$P$2:$P$1097,MATCH(AF3,Infos_2!$O$2:$O$1097,0), ,1)),\"\")","v":"R"},{"$f":"IFERROR(_xlfn.SWITCH($B$3,\"C1\",INDEX(Infos_2!$D$2:$D$1097,MATCH(AG3,Infos_2!$C$2:$C$1097,0),1),\"C2\",INDEX(Infos_2!$G$2:$G$1097,MATCH(AG3,Infos_2!$F$2:$F$1097,0), ,1),\"H\",INDEX(Infos_2!$J$2:$J$1097,MATCH(AG3,Infos_2!$I$2:$I$1097,0), ,1),\"H1\",INDEX(Infos_2!$M$2:$M$1097,MATCH(AG3,Infos_2!$L$2:$L$1097,0), ,1),\"H2\",INDEX(Infos_2!$P$2:$P$1097,MATCH(AG3,Infos_2!$O$2:$O$1097,0), ,1)),\"\")","v":"R"},null,"sera caché"]
{"$rows_left_out":258}