{"text_format":"1","workbook":"xlsx","n_sheets":5,"sheets":["Infos_2","Infos","Jours fériés","Vacances","Planning"],"not_rendered":{"charts":0,"images":0,"macros":1,"external_links":0,"defined_names":9,"comments":1,"pivot_tables":0},"unopened":[],"bounds":{"document_bytes":16777216,"sheet_cells":100000,"rows_first":2000,"rows_last":500,"rows_between":2000,"halvings":0,"cell_chars":16384,"cell_head_chars":4096},"cells_cut":0,"cells_raw":0,"read":"whole","date_system":"1900"}

{"sheet":"Infos_2","index":0,"n_rows":1097,"n_cols":16,"rows_kept":1097,"cut":false,"hidden":false,"merged":[]}
[null,null,{"$f":"B2","v":"C1"},null,null,{"$f":"E2","v":"C2"},null,null,{"$f":"H2","v":"H"},null,null,{"$f":"K2","v":"H1"},null,null,{"$f":"N2","v":"H2"}]
[{"$f":"C2","v":"2023-01-01"},"C1","2023-01-01","R","C2","2023-01-01","T","H","2023-01-01","R","H1","2023-01-01","R","H2","2023-01-01","R"]
["2023-01-02",null,"2023-01-02","R",null,"2023-01-02","T",null,"2023-01-02","T",null,"2023-01-02","R",null,"2023-01-02","T"]
["2023-01-03",null,"2023-01-03","T",null,"2023-01-03","R",null,"2023-01-03","T",null,"2023-01-03","T",null,"2023-01-03","T"]
["2023-01-04",null,"2023-01-04","T",null,"2023-01-04","R",null,"2023-01-04","T",null,"2023-01-04","T",null,"2023-01-04","T"]
["2023-01-05",null,"2023-01-05","R",null,"2023-01-05","T",null,"2023-01-05","T",null,"2023-01-05","T",null,"2023-01-05","T"]
["2023-01-06",null,"2023-01-06","R",null,"2023-01-06","T",null,"2023-01-06","T",null,"2023-01-06","T",null,"2023-01-06","T"]
["2023-01-07",null,"2023-01-07","R",null,"2023-01-07","T",null,"2023-01-07","R",null,"2023-01-07","R",null,"2023-01-07","T"]
["2023-01-08",null,"2023-01-08","T",null,"2023-01-08","R",null,"2023-01-08","R",null,"2023-01-08","R",null,"2023-01-08","R"]
["2023-01-09",null,"2023-01-09","T",null,"2023-01-09","R",null,"2023-01-09","T",null,"2023-01-09","T",null,"2023-01-09","R"]
["2023-01-10",null,"2023-01-10","R",null,"2023-01-10","T",null,"2023-01-10","T",null,"2023-01-10","T",null,"2023-01-10","T"]
["2023-01-11",null,"2023-01-11","R",null,"2023-01-11","T",null,"2023-01-11","T",null,"2023-01-11","T",null,"2023-01-11","T"]
["2023-01-12",null,"2023-01-12","T",null,"2023-01-12","R",null,"2023-01-12","T",null,"2023-01-12","T",null,"2023-01-12","T"]
["2023-01-13",null,"2023-01-13","T",null,"2023-01-13","R",null,"2023-01-13","T",null,"2023-01-13","T",null,"2023-01-13","T"]
["2023-01-14",null,"2023-01-14","T",null,"2023-01-14","R",null,"2023-01-14","R",null,"2023-01-14","T",null,"2023-01-14","R"]
["2023-01-15",null,"2023-01-15","R",null,"2023-01-15","T",null,"2023-01-15","R",null,"2023-01-15","R",null,"2023-01-15","R"]
["2023-01-16",null,"2023-01-16","R",null,"2023-01-16","T",null,"2023-01-16","T",null,"2023-01-16","R",null,"2023-01-16","T"]
["2023-01-17",null,"2023-01-17","T",null,"2023-01-17","R",null,"2023-01-17","T",null,"2023-01-17","T",null,"2023-01-17","T"]
["2023-01-18",null,"2023-01-18","T",null,"2023-01-18","R",null,"2023-01-18","T",null,"2023-01-18","T",null,"2023-01-18","T"]
["2023-01-19",null,"2023-01-19","R",null,"2023-01-19","T",null,"2023-01-19","T",null,"2023-01-19","T",null,"2023-01-19","T"]
["2023-01-20",null,"2023-01-20","R",null,"2023-01-20","T",null,"2023-01-20","T",null,"2023-01-20","T",null,"2023-01-20","T"]
["2023-01-21",null,"2023-01-21","R",null,"2023-01-21","T",null,"2023-01-21","R",null,"2023-01-21","R",null,"2023-01-21","T"]
["2023-01-22",null,"2023-01-22","T",null,"2023-01-22","R",null,"2023-01-22","R",null,"2023-01-22","R",null,"2023-01-22","R"]
["2023-01-23",null,"2023-01-23","T",null,"2023-01-23","R",null,"2023-01-23","T",null,"2023-01-23","T",null,"2023-01-23","R"]
["2023-01-24",null,"2023-01-24","R",null,"2023-01-24","T",null,"2023-01-24","T",null,"2023-01-24","T",null,"2023-01-24","T"]
["2023-01-25",null,"2023-01-25","R",null,"2023-01-25","T",null,"2023-01-25","T",null,"2023-01-25","T",null,"2023-01-25","T"]
["2023-01-26",null,"2023-01-26","T",null,"2023-01-26","R",null,"2023-01-26","T",null,"2023-01-26","T",null,"2023-01-26","T"]
["2023-01-27",null,"2023-01-27","T",null,"2023-01-27","R",null,"2023-01-27","T",null,"2023-01-27","T",null,"2023-01-27","T"]
["2023-01-28",null,"2023-01-28","T",null,"2023-01-28","R",null,"2023-01-28","R",null,"2023-01-28","T",null,"2023-01-28","R"]
["2023-01-29",null,"2023-01-29","R",null,"2023-01-29","T",null,"2023-01-29","R",null,"2023-01-29","R",null,"2023-01-29","R"]
["2023-01-30",null,"2023-01-30","R",null,"2023-01-30","T",null,"2023-01-30","T",null,"2023-01-30","R",null,"2023-01-30","T"]
["2023-01-31",null,"2023-01-31","T",null,"2023-01-31","R",null,"2023-01-31","T",null,"2023-01-31","T",null,"2023-01-31","T"]
["2023-02-01",null,"2023-02-01","T",null,"2023-02-01","R",null,"2023-02-01","T",null,"2023-02-01","T",null,"2023-02-01","T"]
["2023-02-02",null,"2023-02-02","R",null,"2023-02-02","T",null,"2023-02-02","T",null,"2023-02-02","T",null,"2023-02-02","T"]
["2023-02-03",null,"2023-02-03","R",null,"2023-02-03","T",null,"2023-02-03","T",null,"2023-02-03","T",null,"2023-02-03","T"]
["2023-02-04",null,"2023-02-04","R",null,"2023-02-04","T",null,"2023-02-04","R",null,"2023-02-04","R",null,"2023-02-04","T"]
["2023-02-05",null,"2023-02-05","T",null,"2023-02-05","R",null,"2023-02-05","R",null,"2023-02-05","R",null,"2023-02-05","R"]
["2023-02-06",null,"2023-02-06","T",null,"2023-02-06","R",null,"2023-02-06","T",null,"2023-02-06","T",null,"2023-02-06","R"]
["2023-02-07",null,"2023-02-07","R",null,"2023-02-07","T",null,"2023-02-07","T",null,"2023-02-07","T",null,"2023-02-07","T"]
["2023-02-08",null,"2023-02-08","R",null,"2023-02-08","T",null,"2023-02-08","T",null,"2023-02-08","T",null,"2023-02-08","T"]
["2023-02-09",null,"2023-02-09","T",null,"2023-02-09","R",null,"2023-02-09","T",null,"2023-02-09","T",null,"2023-02-09","T"]
["2023-02-10",null,"2023-02-10","T",null,"2023-02-10","R",null,"2023-02-10","T",null,"2023-02-10","T",null,"2023-02-10","T"]
["2023-02-11",null,"2023-02-11","T",null,"2023-02-11","R",null,"2023-02-11","R",null,"2023-02-11","T",null,"2023-02-11","R"]
["2023-02-12",null,"2023-02-12","R",null,"2023-02-12","T",null,"2023-02-12","R",null,"2023-02-12","R",null,"2023-02-12","R"]
["2023-02-13",null,"2023-02-13","R",null,"2023-02-13","T",null,"2023-02-13","T",null,"2023-02-13","R",null,"2023-02-13","T"]
["2023-02-14",null,"2023-02-14","T",null,"2023-02-14","R",null,"2023-02-14","T",null,"2023-02-14","T",null,"2023-02-14","T"]
["2023-02-15",null,"2023-02-15","T",null,"2023-02-15","R",null,"2023-02-15","T",null,"2023-02-15","T",null,"2023-02-15","T"]
["2023-02-16",null,"2023-02-16","R",null,"2023-02-16","T",null,"2023-02-16","T",null,"2023-02-16","T",null,"2023-02-16","T"]
["2023-02-17",null,"2023-02-17","R",null,"2023-02-17","T",null,"2023-02-17","T",null,"2023-02-17","T",null,"2023-02-17","T"]
["2023-02-18",null,"2023-02-18","R",null,"2023-02-18","T",null,"2023-02-18","R",null,"2023-02-18","R",null,"2023-02-18","T"]
["2023-02-19",null,"2023-02-19","T",null,"2023-02-19","R",null,"2023-02-19","R",null,"2023-02-19","R",null,"2023-02-19","R"]
["2023-02-20",null,"2023-02-20","T",null,"2023-02-20","R",null,"2023-02-20","T",null,"2023-02-20","T",null,"2023-02-20","R"]
["2023-02-21",null,"2023-02-21","R",null,"2023-02-21","T",null,"2023-02-21","T",null,"2023-02-21","T",null,"2023-02-21","T"]
["2023-02-22",null,"2023-02-22","R",null,"2023-02-22","T",null,"2023-02-22","T",null,"2023-02-22","T",null,"2023-02-22","T"]
["2023-02-23",null,"2023-02-23","T",null,"2023-02-23","R",null,"2023-02-23","T",null,"2023-02-23","T",null,"2023-02-23","T"]
["2023-02-24",null,"2023-02-24","T",null,"2023-02-24","R",null,"2023-02-24","T",null,"2023-02-24","T",null,"2023-02-24","T"]
["2023-02-25",null,"2023-02-25","T",null,"2023-02-25","R",null,"2023-02-25","R",null,"2023-02-25","T",null,"2023-02-25","R"]
["2023-02-26",null,"2023-02-26","R",null,"2023-02-26","T",null,"2023-02-26","R",null,"2023-02-26","R",null,"2023-02-26","R"]
["2023-02-27",null,"2023-02-27","R",null,"2023-02-27","T",null,"2023-02-27","T",null,"2023-02-27","R",null,"2023-02-27","T"]
["2023-02-28",null,"2023-02-28","T",null,"2023-02-28","R",null,"2023-02-28","T",null,"2023-02-28","T",null,"2023-02-28","T"]
["2023-03-01",null,"2023-03-01","T",null,"2023-03-01","R",null,"2023-03-01","T",null,"2023-03-01","T",null,"2023-03-01","T"]
["2023-03-02",null,"2023-03-02","R",null,"2023-03-02","T",null,"2023-03-02","T",null,"2023-03-02","T",null,"2023-03-02","T"]
["2023-03-03",null,"2023-03-03","R",null,"2023-03-03","T",null,"2023-03-03","T",null,"2023-03-03","T",null,"2023-03-03","T"]
["2023-03-04",null,"2023-03-04","R",null,"2023-03-04","T",null,"2023-03-04","R",null,"2023-03-04","R",null,"2023-03-04","T"]
["2023-03-05",null,"2023-03-05","T",null,"2023-03-05","R",null,"2023-03-05","R",null,"2023-03-05","R",null,"2023-03-05","R"]
[{"$f":"C66","v":"2023-03-06"},null,"2023-03-06","T",null,"2023-03-06","R",null,"2023-03-06","T",null,"2023-03-06","T",null,"2023-03-06","R"]
["2023-03-07",null,"2023-03-07","R",null,"2023-03-07","T",null,"2023-03-07","T",null,"2023-03-07","T",null,"2023-03-07","T"]
["2023-03-08",null,"2023-03-08","R",null,"2023-03-08","T",null,"2023-03-08","T",null,"2023-03-08","T",null,"2023-03-08","T"]
["2023-03-09",null,"2023-03-09","T",null,"2023-03-09","R",null,"2023-03-09","T",null,"2023-03-09","T",null,"2023-03-09","T"]
["2023-03-10",null,"2023-03-10","T",null,"2023-03-10","R",null,"2023-03-10","T",null,"2023-03-10","T",null,"2023-03-10","T"]
["2023-03-11",null,"2023-03-11","T",null,"2023-03-11","R",null,"2023-03-11","R",null,"2023-03-11","T",null,"2023-03-11","R"]
["2023-03-12",null,"2023-03-12","R",null,"2023-03-12","T",null,"2023-03-12","R",null,"2023-03-12","R",null,"2023-03-12","R"]
["2023-03-13",null,"2023-03-13","R",null,"2023-03-13","T",null,"2023-03-13","T",null,"2023-03-13","R",null,"2023-03-13","T"]
["2023-03-14",null,"2023-03-14","T",null,"2023-03-14","R",null,"2023-03-14","T",null,"2023-03-14","T",null,"2023-03-14","T"]
["2023-03-15",null,"2023-03-15","T",null,"2023-03-15","R",null,"2023-03-15","T",null,"2023-03-15","T",null,"2023-03-15","T"]
["2023-03-16",null,"2023-03-16","R",null,"2023-03-16","T",null,"2023-03-16","T",null,"2023-03-16","T",null,"2023-03-16","T"]
["2023-03-17",null,"2023-03-17","R",null,"2023-03-17","T",null,"2023-03-17","T",null,"2023-03-17","T",null,"2023-03-17","T"]
["2023-03-18",null,"2023-03-18","R",null,"2023-03-18","T",null,"2023-03-18","R",null,"2023-03-18","R",null,"2023-03-18","T"]
["2023-03-19",null,"2023-03-19","T",null,"2023-03-19","R",null,"2023-03-19","R",null,"2023-03-19","R",null,"2023-03-19","R"]
["2023-03-20",null,"2023-03-20","T",null,"2023-03-20","R",null,"2023-03-20","T",null,"2023-03-20","T",null,"2023-03-20","R"]
["2023-03-21",null,"2023-03-21","R",null,"2023-03-21","T",null,"2023-03-21","T",null,"2023-03-21","T",null,"2023-03-21","T"]
["2023-03-22",null,"2023-03-22","R",null,"2023-03-22","T",null,"2023-03-22","T",null,"2023-03-22","T",null,"2023-03-22","T"]
["2023-03-23",null,"2023-03-23","T",null,"2023-03-23","R",null,"2023-03-23","T",null,"2023-03-23","T",null,"2023-03-23","T"]
["2023-03-24",null,"2023-03-24","T",null,"2023-03-24","R",null,"2023-03-24","T",null,"2023-03-24","T",null,"2023-03-24","T"]
["2023-03-25",null,"2023-03-25","T",null,"2023-03-25","R",null,"2023-03-25","R",null,"2023-03-25","T",null,"2023-03-25","R"]
["2023-03-26",null,"2023-03-26","R",null,"2023-03-26","T",null,"2023-03-26","R",null,"2023-03-26","R",null,"2023-03-26","R"]
["2023-03-27",null,"2023-03-27","R",null,"2023-03-27","T",null,"2023-03-27","T",null,"2023-03-27","R",null,"2023-03-27","T"]
["2023-03-28",null,"2023-03-28","T",null,"2023-03-28","R",null,"2023-03-28","T",null,"2023-03-28","T",null,"2023-03-28","T"]
["2023-03-29",null,"2023-03-29","T",null,"2023-03-29","R",null,"2023-03-29","T",null,"2023-03-29","T",null,"2023-03-29","T"]
["2023-03-30",null,"2023-03-30","R",null,"2023-03-30","T",null,"2023-03-30","T",null,"2023-03-30","T",null,"2023-03-30","T"]
["2023-03-31",null,"2023-03-31","R",null,"2023-03-31","T",null,"2023-03-31","T",null,"2023-03-31","T",null,"2023-03-31","T"]
["2023-04-01",null,"2023-04-01","R",null,"2023-04-01","T",null,"2023-04-01","R",null,"2023-04-01","R",null,"2023-04-01","T"]
["2023-04-02",null,"2023-04-02","T",null,"2023-04-02","R",null,"2023-04-02","R",null,"2023-04-02","R",null,"2023-04-02","R"]
["2023-04-03",null,"2023-04-03","T",null,"2023-04-03","R",null,"2023-04-03","T",null,"2023-04-03","T",null,"2023-04-03","R"]
["2023-04-04",null,"2023-04-04","R",null,"2023-04-04","T",null,"2023-04-04","T",null,"2023-04-04","T",null,"2023-04-04","T"]
["2023-04-05",null,"2023-04-05","R",null,"2023-04-05","T",null,"2023-04-05","T",null,"2023-04-05","T",null,"2023-04-05","T"]
["2023-04-06",null,"2023-04-06","T",null,"2023-04-06","R",null,"2023-04-06","T",null,"2023-04-06","T",null,"2023-04-06","T"]
["2023-04-07",null,"2023-04-07","T",null,"2023-04-07","R",null,"2023-04-07","T",null,"2023-04-07","T",null,"2023-04-07","T"]
["2023-04-08",null,"2023-04-08","T",null,"2023-04-08","R",null,"2023-04-08","R",null,"2023-04-08","T",null,"2023-04-08","R"]
["2023-04-09",null,"2023-04-09","R",null,"2023-04-09","T",null,"2023-04-09","R",null,"2023-04-09","R",null,"2023-04-09","R"]
["2023-04-10",null,"2023-04-10","R",null,"2023-04-10","T",null,"2023-04-10","T",null,"2023-04-10","R",null,"2023-04-10","T"]
["2023-04-11",null,"2023-04-11","T",null,"2023-04-11","R",null,"2023-04-11","T",null,"2023-04-11","T",null,"2023-04-11","T"]
["2023-04-12",null,"2023-04-12","T",null,"2023-04-12","R",null,"2023-04-12","T",null,"2023-04-12","T",null,"2023-04-12","T"]
["2023-04-13",null,"2023-04-13","R",null,"2023-04-13","T",null,"2023-04-13","T",null,"2023-04-13","T",null,"2023-04-13","T"]
["2023-04-14",null,"2023-04-14","R",null,"2023-04-14","T",null,"2023-04-14","T",null,"2023-04-14","T",null,"2023-04-14","T"]
["2023-04-15",null,"2023-04-15","R",null,"2023-04-15","T",null,"2023-04-15","R",null,"2023-04-15","R",null,"2023-04-15","T"]
["2023-04-16",null,"2023-04-16","T",null,"2023-04-16","R",null,"2023-04-16","R",null,"2023-04-16","R",null,"2023-04-16","R"]
["2023-04-17",null,"2023-04-17","T",null,"2023-04-17","R",null,"2023-04-17","T",null,"2023-04-17","T",null,"2023-04-17","R"]
["2023-04-18",null,"2023-04-18","R",null,"2023-04-18","T",null,"2023-04-18","T",null,"2023-04-18","T",null,"2023-04-18","T"]
["2023-04-19",null,"2023-04-19","R",null,"2023-04-19","T",null,"2023-04-19","T",null,"2023-04-19","T",null,"2023-04-19","T"]
["2023-04-20",null,"2023-04-20","T",null,"2023-04-20","R",null,"2023-04-20","T",null,"2023-04-20","T",null,"2023-04-20","T"]
["2023-04-21",null,"2023-04-21","T",null,"2023-04-21","R",null,"2023-04-21","T",null,"2023-04-21","T",null,"2023-04-21","T"]
["2023-04-22",null,"2023-04-22","T",null,"2023-04-22","R",null,"2023-04-22","R",null,"2023-04-22","T",null,"2023-04-22","R"]
["2023-04-23",null,"2023-04-23","R",null,"2023-04-23","T",null,"2023-04-23","R",null,"2023-04-23","R",null,"2023-04-23","R"]
["2023-04-24",null,"2023-04-24","R",null,"2023-04-24","T",null,"2023-04-24","T",null,"2023-04-24","R",null,"2023-04-24","T"]
["2023-04-25",null,"2023-04-25","T",null,"2023-04-25","R",null,"2023-04-25","T",null,"2023-04-25","T",null,"2023-04-25","T"]
["2023-04-26",null,"2023-04-26","T",null,"2023-04-26","R",null,"2023-04-26","T",null,"2023-04-26","T",null,"2023-04-26","T"]
["2023-04-27",null,"2023-04-27","R",null,"2023-04-27","T",null,"2023-04-27","T",null,"2023-04-27","T",null,"2023-04-27","T"]
["2023-04-28",null,"2023-04-28","R",null,"2023-04-28","T",null,"2023-04-28","T",null,"2023-04-28","T",null,"2023-04-28","T"]
["2023-04-29",null,"2023-04-29","R",null,"2023-04-29","T",null,"2023-04-29","R",null,"2023-04-29","R",null,"2023-04-29","T"]
["2023-04-30",null,"2023-04-30","T",null,"2023-04-30","R",null,"2023-04-30","R",null,"2023-04-30","R",null,"2023-04-30","R"]
["2023-05-01",null,"2023-05-01","T",null,"2023-05-01","R",null,"2023-05-01","T",null,"2023-05-01","T",null,"2023-05-01","R"]
["2023-05-02",null,"2023-05-02","R",null,"2023-05-02","T",null,"2023-05-02","T",null,"2023-05-02","T",null,"2023-05-02","T"]
["2023-05-03",null,"2023-05-03","R",null,"2023-05-03","T",null,"2023-05-03","T",null,"2023-05-03","T",null,"2023-05-03","T"]
["2023-05-04",null,"2023-05-04","T",null,"2023-05-04","R",null,"2023-05-04","T",null,"2023-05-04","T",null,"2023-05-04","T"]
["2023-05-05",null,"2023-05-05","T",null,"2023-05-05","R",null,"2023-05-05","T",null,"2023-05-05","T",null,"2023-05-05","T"]
["2023-05-06",null,"2023-05-06","T",null,"2023-05-06","R",null,"2023-05-06","R",null,"2023-05-06","T",null,"2023-05-06","R"]
["2023-05-07",null,"2023-05-07","R",null,"2023-05-07","T",null,"2023-05-07","R",null,"2023-05-07","R",null,"2023-05-07","R"]
["2023-05-08",null,"2023-05-08","R",null,"2023-05-08","T",null,"2023-05-08","T",null,"2023-05-08","R",null,"2023-05-08","T"]
[{"$f":"C130","v":"2023-05-09"},null,"2023-05-09","T",null,"2023-05-09","R",null,"2023-05-09","T",null,"2023-05-09","T",null,"2023-05-09","T"]
["2023-05-10",null,"2023-05-10","T",null,"2023-05-10","R",null,"2023-05-10","T",null,"2023-05-10","T",null,"2023-05-10","T"]
["2023-05-11",null,"2023-05-11","R",null,"2023-05-11","T",null,"2023-05-11","T",null,"2023-05-11","T",null,"2023-05-11","T"]
["2023-05-12",null,"2023-05-12","R",null,"2023-05-12","T",null,"2023-05-12","T",null,"2023-05-12","T",null,"2023-05-12","T"]
["2023-05-13",null,"2023-05-13","R",null,"2023-05-13","T",null,"2023-05-13","R",null,"2023-05-13","R",null,"2023-05-13","T"]
["2023-05-14",null,"2023-05-14","T",null,"2023-05-14","R",null,"2023-05-14","R",null,"2023-05-14","R",null,"2023-05-14","R"]
["2023-05-15",null,"2023-05-15","T",null,"2023-05-15","R",null,"2023-05-15","T",null,"2023-05-15","T",null,"2023-05-15","R"]
["2023-05-16",null,"2023-05-16","R",null,"2023-05-16","T",null,"2023-05-16","T",null,"2023-05-16","T",null,"2023-05-16","T"]
["2023-05-17",null,"2023-05-17","R",null,"2023-05-17","T",null,"2023-05-17","T",null,"2023-05-17","T",null,"2023-05-17","T"]
["2023-05-18",null,"2023-05-18","T",null,"2023-05-18","R",null,"2023-05-18","T",null,"2023-05-18","T",null,"2023-05-18","T"]
["2023-05-19",null,"2023-05-19","T",null,"2023-05-19","R",null,"2023-05-19","T",null,"2023-05-19","T",null,"2023-05-19","T"]
["2023-05-20",null,"2023-05-20","T",null,"2023-05-20","R",null,"2023-05-20","R",null,"2023-05-20","T",null,"2023-05-20","R"]
["2023-05-21",null,"2023-05-21","R",null,"2023-05-21","T",null,"2023-05-21","R",null,"2023-05-21","R",null,"2023-05-21","R"]
["2023-05-22",null,"2023-05-22","R",null,"2023-05-22","T",null,"2023-05-22","T",null,"2023-05-22","R",null,"2023-05-22","T"]
["2023-05-23",null,"2023-05-23","T",null,"2023-05-23","R",null,"2023-05-23","T",null,"2023-05-23","T",null,"2023-05-23","T"]
["2023-05-24",null,"2023-05-24","T",null,"2023-05-24","R",null,"2023-05-24","T",null,"2023-05-24","T",null,"2023-05-24","T"]
["2023-05-25",null,"2023-05-25","R",null,"2023-05-25","T",null,"2023-05-25","T",null,"2023-05-25","T",null,"2023-05-25","T"]
["2023-05-26",null,"2023-05-26","R",null,"2023-05-26","T",null,"2023-05-26","T",null,"2023-05-26","T",null,"2023-05-26","T"]
["2023-05-27",null,"2023-05-27","R",null,"2023-05-27","T",null,"2023-05-27","R",null,"2023-05-27","R",null,"2023-05-27","T"]
["2023-05-28",null,"2023-05-28","T",null,"2023-05-28","R",null,"2023-05-28","R",null,"2023-05-28","R",null,"2023-05-28","R"]
["2023-05-29",null,"2023-05-29","T",null,"2023-05-29","R",null,"2023-05-29","T",null,"2023-05-29","T",null,"2023-05-29","R"]
["2023-05-30",null,"2023-05-30","R",null,"2023-05-30","T",null,"2023-05-30","T",null,"2023-05-30","T",null,"2023-05-30","T"]
["2023-05-31",null,"2023-05-31","R",null,"2023-05-31","T",null,"2023-05-31","T",null,"2023-05-31","T",null,"2023-05-31","T"]
["2023-06-01",null,"2023-06-01","T",null,"2023-06-01","R",null,"2023-06-01","T",null,"2023-06-01","T",null,"2023-06-01","T"]
["2023-06-02",null,"2023-06-02","T",null,"2023-06-02","R",null,"2023-06-02","T",null,"2023-06-02","T",null,"2023-06-02","T"]
["2023-06-03",null,"2023-06-03","T",null,"2023-06-03","R",null,"2023-06-03","R",null,"2023-06-03","T",null,"2023-06-03","R"]
["2023-06-04",null,"2023-06-04","R",null,"2023-06-04","T",null,"2023-06-04","R",null,"2023-06-04","R",null,"2023-06-04","R"]
["2023-06-05",null,"2023-06-05","R",null,"2023-06-05","T",null,"2023-06-05","T",null,"2023-06-05","R",null,"2023-06-05","T"]
["2023-06-06",null,"2023-06-06","T",null,"2023-06-06","R",null,"2023-06-06","T",null,"2023-06-06","T",null,"2023-06-06","T"]
["2023-06-07",null,"2023-06-07","T",null,"2023-06-07","R",null,"2023-06-07","T",null,"2023-06-07","T",null,"2023-06-07","T"]
["2023-06-08",null,"2023-06-08","R",null,"2023-06-08","T",null,"2023-06-08","T",null,"2023-06-08","T",null,"2023-06-08","T"]
["2023-06-09",null,"2023-06-09","R",null,"2023-06-09","T",null,"2023-06-09","T",null,"2023-06-09","T",null,"2023-06-09","T"]
["2023-06-10",null,"2023-06-10","R",null,"2023-06-10","T",null,"2023-06-10","R",null,"2023-06-10","R",null,"2023-06-10","T"]
["2023-06-11",null,"2023-06-11","T",null,"2023-06-11","R",null,"2023-06-11","R",null,"2023-06-11","R",null,"2023-06-11","R"]
["2023-06-12",null,"2023-06-12","T",null,"2023-06-12","R",null,"2023-06-12","T",null,"2023-06-12","T",null,"2023-06-12","R"]
["2023-06-13",null,"2023-06-13","R",null,"2023-06-13","T",null,"2023-06-13","T",null,"2023-06-13","T",null,"2023-06-13","T"]
["2023-06-14",null,"2023-06-14","R",null,"2023-06-14","T",null,"2023-06-14","T",null,"2023-06-14","T",null,"2023-06-14","T"]
["2023-06-15",null,"2023-06-15","T",null,"2023-06-15","R",null,"2023-06-15","T",null,"2023-06-15","T",null,"2023-06-15","T"]
["2023-06-16",null,"2023-06-16","T",null,"2023-06-16","R",null,"2023-06-16","T",null,"2023-06-16","T",null,"2023-06-16","T"]
["2023-06-17",null,"2023-06-17","T",null,"2023-06-17","R",null,"2023-06-17","R",null,"2023-06-17","T",null,"2023-06-17","R"]
["2023-06-18",null,"2023-06-18","R",null,"2023-06-18","T",null,"2023-06-18","R",null,"2023-06-18","R",null,"2023-06-18","R"]
["2023-06-19",null,"2023-06-19","R",null,"2023-06-19","T",null,"2023-06-19","T",null,"2023-06-19","R",null,"2023-06-19","T"]
["2023-06-20",null,"2023-06-20","T",null,"2023-06-20","R",null,"2023-06-20","T",null,"2023-06-20","T",null,"2023-06-20","T"]
["2023-06-21",null,"2023-06-21","T",null,"2023-06-21","R",null,"2023-06-21","T",null,"2023-06-21","T",null,"2023-06-21","T"]
["2023-06-22",null,"2023-06-22","R",null,"2023-06-22","T",null,"2023-06-22","T",null,"2023-06-22","T",null,"2023-06-22","T"]
["2023-06-23",null,"2023-06-23","R",null,"2023-06-23","T",null,"2023-06-23","T",null,"2023-06-23","T",null,"2023-06-23","T"]
["2023-06-24",null,"2023-06-24","R",null,"2023-06-24","T",null,"2023-06-24","R",null,"2023-06-24","R",null,"2023-06-24","T"]
["2023-06-25",null,"2023-06-25","T",null,"2023-06-25","R",null,"2023-06-25","R",null,"2023-06-25","R",null,"2023-06-25","R"]
["2023-06-26",null,"2023-06-26","T",null,"2023-06-26","R",null,"2023-06-26","T",null,"2023-06-26","T",null,"2023-06-26","R"]
["2023-06-27",null,"2023-06-27","R",null,"2023-06-27","T",null,"2023-06-27","T",null,"2023-06-27","T",null,"2023-06-27","T"]
["2023-06-28",null,"2023-06-28","R",null,"2023-06-28","T",null,"2023-06-28","T",null,"2023-06-28","T",null,"2023-06-28","T"]
["2023-06-29",null,"2023-06-29","T",null,"2023-06-29","R",null,"2023-06-29","T",null,"2023-06-29","T",null,"2023-06-29","T"]
["2023-06-30",null,"2023-06-30","T",null,"2023-06-30","R",null,"2023-06-30","T",null,"2023-06-30","T",null,"2023-06-30","T"]
["2023-07-01",null,"2023-07-01","T",null,"2023-07-01","R",null,"2023-07-01","R",null,"2023-07-01","T",null,"2023-07-01","R"]
["2023-07-02",null,"2023-07-02","R",null,"2023-07-02","T",null,"2023-07-02","R",null,"2023-07-02","R",null,"2023-07-02","R"]
["2023-07-03",null,"2023-07-03","R",null,"2023-07-03","T",null,"2023-07-03","T",null,"2023-07-03","R",null,"2023-07-03","T"]
["2023-07-04",null,"2023-07-04","T",null,"2023-07-04","R",null,"2023-07-04","T",null,"2023-07-04","T",null,"2023-07-04","T"]
["2023-07-05",null,"2023-07-05","T",null,"2023-07-05","R",null,"2023-07-05","T",null,"2023-07-05","T",null,"2023-07-05","T"]
["2023-07-06",null,"2023-07-06","R",null,"2023-07-06","T",null,"2023-07-06","T",null,"2023-07-06","T",null,"2023-07-06","T"]
["2023-07-07",null,"2023-07-07","R",null,"2023-07-07","T",null,"2023-07-07","T",null,"2023-07-07","T",null,"2023-07-07","T"]
["2023-07-08",null,"2023-07-08","R",null,"2023-07-08","T",null,"2023-07-08","R",null,"2023-07-08","R",null,"2023-07-08","T"]
["2023-07-09",null,"2023-07-09","T",null,"2023-07-09","R",null,"2023-07-09","R",null,"2023-07-09","R",null,"2023-07-09","R"]
["2023-07-10",null,"2023-07-10","T",null,"2023-07-10","R",null,"2023-07-10","T",null,"2023-07-10","T",null,"2023-07-10","R"]
["2023-07-11",null,"2023-07-11","R",null,"2023-07-11","T",null,"2023-07-11","T",null,"2023-07-11","T",null,"2023-07-11","T"]
[{"$f":"C194","v":"2023-07-12"},null,"2023-07-12","R",null,"2023-07-12","T",null,"2023-07-12","T",null,"2023-07-12","T",null,"2023-07-12","T"]
["2023-07-13",null,"2023-07-13","T",null,"2023-07-13","R",null,"2023-07-13","T",null,"2023-07-13","T",null,"2023-07-13","T"]
["2023-07-14",null,"2023-07-14","T",null,"2023-07-14","R",null,"2023-07-14","T",null,"2023-07-14","T",null,"2023-07-14","T"]
["2023-07-15",null,"2023-07-15","T",null,"2023-07-15","R",null,"2023-07-15","R",null,"2023-07-15","T",null,"2023-07-15","R"]
["2023-07-16",null,"2023-07-16","R",null,"2023-07-16","T",null,"2023-07-16","R",null,"2023-07-16","R",null,"2023-07-16","R"]
["2023-07-17",null,"2023-07-17","R",null,"2023-07-17","T",null,"2023-07-17","T",null,"2023-07-17","R",null,"2023-07-17","T"]
["2023-07-18",null,"2023-07-18","T",null,"2023-07-18","R",null,"2023-07-18","T",null,"2023-07-18","T",null,"2023-07-18","T"]
["2023-07-19",null,"2023-07-19","T",null,"2023-07-19","R",null,"2023-07-19","T",null,"2023-07-19","T",null,"2023-07-19","T"]
["2023-07-20",null,"2023-07-20","R",null,"2023-07-20","T",null,"2023-07-20","T",null,"2023-07-20","T",null,"2023-07-20","T"]
["2023-07-21",null,"2023-07-21","R",null,"2023-07-21","T",null,"2023-07-21","T",null,"2023-07-21","T",null,"2023-07-21","T"]
["2023-07-22",null,"2023-07-22","R",null,"2023-07-22","T",null,"2023-07-22","R",null,"2023-07-22","R",null,"2023-07-22","T"]
["2023-07-23",null,"2023-07-23","T",null,"2023-07-23","R",null,"2023-07-23","R",null,"2023-07-23","R",null,"2023-07-23","R"]
["2023-07-24",null,"2023-07-24","T",null,"2023-07-24","R",null,"2023-07-24","T",null,"2023-07-24","T",null,"2023-07-24","R"]
["2023-07-25",null,"2023-07-25","R",null,"2023-07-25","T",null,"2023-07-25","T",null,"2023-07-25","T",null,"2023-07-25","T"]
["2023-07-26",null,"2023-07-26","R",null,"2023-07-26","T",null,"2023-07-26","T",null,"2023-07-26","T",null,"2023-07-26","T"]
["2023-07-27",null,"2023-07-27","T",null,"2023-07-27","R",null,"2023-07-27","T",null,"2023-07-27","T",null,"2023-07-27","T"]
["2023-07-28",null,"2023-07-28","T",null,"2023-07-28","R",null,"2023-07-28","T",null,"2023-07-28","T",null,"2023-07-28","T"]
["2023-07-29",null,"2023-07-29","T",null,"2023-07-29","R",null,"2023-07-29","R",null,"2023-07-29","T",null,"2023-07-29","R"]
["2023-07-30",null,"2023-07-30","R",null,"2023-07-30","T",null,"2023-07-30","R",null,"2023-07-30","R",null,"2023-07-30","R"]
["2023-07-31",null,"2023-07-31","R",null,"2023-07-31","T",null,"2023-07-31","T",null,"2023-07-31","R",null,"2023-07-31","T"]
["2023-08-01",null,"2023-08-01","T",null,"2023-08-01","R",null,"2023-08-01","T",null,"2023-08-01","T",null,"2023-08-01","T"]
["2023-08-02",null,"2023-08-02","T",null,"2023-08-02","R",null,"2023-08-02","T",null,"2023-08-02","T",null,"2023-08-02","T"]
["2023-08-03",null,"2023-08-03","R",null,"2023-08-03","T",null,"2023-08-03","T",null,"2023-08-03","T",null,"2023-08-03","T"]
["2023-08-04",null,"2023-08-04","R",null,"2023-08-04","T",null,"2023-08-04","T",null,"2023-08-04","T",null,"2023-08-04","T"]
["2023-08-05",null,"2023-08-05","R",null,"2023-08-05","T",null,"2023-08-05","R",null,"2023-08-05","R",null,"2023-08-05","T"]
["2023-08-06",null,"2023-08-06","T",null,"2023-08-06","R",null,"2023-08-06","R",null,"2023-08-06","R",null,"2023-08-06","R"]
["2023-08-07",null,"2023-08-07","T",null,"2023-08-07","R",null,"2023-08-07","T",null,"2023-08-07","T",null,"2023-08-07","R"]
["2023-08-08",null,"2023-08-08","R",null,"2023-08-08","T",null,"2023-08-08","T",null,"2023-08-08","T",null,"2023-08-08","T"]
["2023-08-09",null,"2023-08-09","R",null,"2023-08-09","T",null,"2023-08-09","T",null,"2023-08-09","T",null,"2023-08-09","T"]
["2023-08-10",null,"2023-08-10","T",null,"2023-08-10","R",null,"2023-08-10","T",null,"2023-08-10","T",null,"2023-08-10","T"]
["2023-08-11",null,"2023-08-11","T",null,"2023-08-11","R",null,"2023-08-11","T",null,"2023-08-11","T",null,"2023-08-11","T"]
["2023-08-12",null,"2023-08-12","T",null,"2023-08-12","R",null,"2023-08-12","R",null,"2023-08-12","T",null,"2023-08-12","R"]
["2023-08-13",null,"2023-08-13","R",null,"2023-08-13","T",null,"2023-08-13","R",null,"2023-08-13","R",null,"2023-08-13","R"]
["2023-08-14",null,"2023-08-14","R",null,"2023-08-14","T",null,"2023-08-14","T",null,"2023-08-14","R",null,"2023-08-14","T"]
["2023-08-15",null,"2023-08-15","T",null,"2023-08-15","R",null,"2023-08-15","T",null,"2023-08-15","T",null,"2023-08-15","T"]
["2023-08-16",null,"2023-08-16","T",null,"2023-08-16","R",null,"2023-08-16","T",null,"2023-08-16","T",null,"2023-08-16","T"]
["2023-08-17",null,"2023-08-17","R",null,"2023-08-17","T",null,"2023-08-17","T",null,"2023-08-17","T",null,"2023-08-17","T"]
["2023-08-18",null,"2023-08-18","R",null,"2023-08-18","T",null,"2023-08-18","T",null,"2023-08-18","T",null,"2023-08-18","T"]
["2023-08-19",null,"2023-08-19","R",null,"2023-08-19","T",null,"2023-08-19","R",null,"2023-08-19","R",null,"2023-08-19","T"]
["2023-08-20",null,"2023-08-20","T",null,"2023-08-20","R",null,"2023-08-20","R",null,"2023-08-20","R",null,"2023-08-20","R"]
["2023-08-21",null,"2023-08-21","T",null,"2023-08-21","R",null,"2023-08-21","T",null,"2023-08-21","T",null,"2023-08-21","R"]
["2023-08-22",null,"2023-08-22","R",null,"2023-08-22","T",null,"2023-08-22","T",null,"2023-08-22","T",null,"2023-08-22","T"]
["2023-08-23",null,"2023-08-23","R",null,"2023-08-23","T",null,"2023-08-23","T",null,"2023-08-23","T",null,"2023-08-23","T"]
["2023-08-24",null,"2023-08-24","T",null,"2023-08-24","R",null,"2023-08-24","T",null,"2023-08-24","T",null,"2023-08-24","T"]
["2023-08-25",null,"2023-08-25","T",null,"2023-08-25","R",null,"2023-08-25","T",null,"2023-08-25","T",null,"2023-08-25","T"]
["2023-08-26",null,"2023-08-26","T",null,"2023-08-26","R",null,"2023-08-26","R",null,"2023-08-26","T",null,"2023-08-26","R"]
["2023-08-27",null,"2023-08-27","R",null,"2023-08-27","T",null,"2023-08-27","R",null,"2023-08-27","R",null,"2023-08-27","R"]
["2023-08-28",null,"2023-08-28","R",null,"2023-08-28","T",null,"2023-08-28","T",null,"2023-08-28","R",null,"2023-08-28","T"]
["2023-08-29",null,"2023-08-29","T",null,"2023-08-29","R",null,"2023-08-29","T",null,"2023-08-29","T",null,"2023-08-29","T"]
["2023-08-30",null,"2023-08-30","T",null,"2023-08-30","R",null,"2023-08-30","T",null,"2023-08-30","T",null,"2023-08-30","T"]
["2023-08-31",null,"2023-08-31","R",null,"2023-08-31","T",null,"2023-08-31","T",null,"2023-08-31","T",null,"2023-08-31","T"]
["2023-09-01",null,"2023-09-01","R",null,"2023-09-01","T",null,"2023-09-01","T",null,"2023-09-01","T",null,"2023-09-01","T"]
["2023-09-02",null,"2023-09-02","R",null,"2023-09-02","T",null,"2023-09-02","R",null,"2023-09-02","R",null,"2023-09-02","T"]
["2023-09-03",null,"2023-09-03","T",null,"2023-09-03","R",null,"2023-09-03","R",null,"2023-09-03","R",null,"2023-09-03","R"]
["2023-09-04",null,"2023-09-04","T",null,"2023-09-04","R",null,"2023-09-04","T",null,"2023-09-04","T",null,"2023-09-04","R"]
["2023-09-05",null,"2023-09-05","R",null,"2023-09-05","T",null,"2023-09-05","T",null,"2023-09-05","T",null,"2023-09-05","T"]
["2023-09-06",null,"2023-09-06","R",null,"2023-09-06","T",null,"2023-09-06","T",null,"2023-09-06","T",null,"2023-09-06","T"]
["2023-09-07",null,"2023-09-07","T",null,"2023-09-07","R",null,"2023-09-07","T",null,"2023-09-07","T",null,"2023-09-07","T"]
["2023-09-08",null,"2023-09-08","T",null,"2023-09-08","R",null,"2023-09-08","T",null,"2023-09-08","T",null,"2023-09-08","T"]
["2023-09-09",null,"2023-09-09","T",null,"2023-09-09","R",null,"2023-09-09","R",null,"2023-09-09","T",null,"2023-09-09","R"]
["2023-09-10",null,"2023-09-10","R",null,"2023-09-10","T",null,"2023-09-10","R",null,"2023-09-10","R",null,"2023-09-10","R"]
["2023-09-11",null,"2023-09-11","R",null,"2023-09-11","T",null,"2023-09-11","T",null,"2023-09-11","R",null,"2023-09-11","T"]
["2023-09-12",null,"2023-09-12","T",null,"2023-09-12","R",null,"2023-09-12","T",null,"2023-09-12","T",null,"2023-09-12","T"]
["2023-09-13",null,"2023-09-13","T",null,"2023-09-13","R",null,"2023-09-13","T",null,"2023-09-13","T",null,"2023-09-13","T"]
[{"$f":"C258","v":"2023-09-14"},null,"2023-09-14","R",null,"2023-09-14","T",null,"2023-09-14","T",null,"2023-09-14","T",null,"2023-09-14","T"]
["2023-09-15",null,"2023-09-15","R",null,"2023-09-15","T",null,"2023-09-15","T",null,"2023-09-15","T",null,"2023-09-15","T"]
["2023-09-16",null,"2023-09-16","R",null,"2023-09-16","T",null,"2023-09-16","R",null,"2023-09-16","R",null,"2023-09-16","T"]
["2023-09-17",null,"2023-09-17","T",null,"2023-09-17","R",null,"2023-09-17","R",null,"2023-09-17","R",null,"2023-09-17","R"]
["2023-09-18",null,"2023-09-18","T",null,"2023-09-18","R",null,"2023-09-18","T",null,"2023-09-18","T",null,"2023-09-18","R"]
["2023-09-19",null,"2023-09-19","R",null,"2023-09-19","T",null,"2023-09-19","T",null,"2023-09-19","T",null,"2023-09-19","T"]
["2023-09-20",null,"2023-09-20","R",null,"2023-09-20","T",null,"2023-09-20","T",null,"2023-09-20","T",null,"2023-09-20","T"]
["2023-09-21",null,"2023-09-21","T",null,"2023-09-21","R",null,"2023-09-21","T",null,"2023-09-21","T",null,"2023-09-21","T"]
["2023-09-22",null,"2023-09-22","T",null,"2023-09-22","R",null,"2023-09-22","T",null,"2023-09-22","T",null,"2023-09-22","T"]
["2023-09-23",null,"2023-09-23","T",null,"2023-09-23","R",null,"2023-09-23","R",null,"2023-09-23","T",null,"2023-09-23","R"]
["2023-09-24",null,"2023-09-24","R",null,"2023-09-24","T",null,"2023-09-24","R",null,"2023-09-24","R",null,"2023-09-24","R"]
["2023-09-25",null,"2023-09-25","R",null,"2023-09-25","T",null,"2023-09-25","T",null,"2023-09-25","R",null,"2023-09-25","T"]
["2023-09-26",null,"2023-09-26","T",null,"2023-09-26","R",null,"2023-09-26","T",null,"2023-09-26","T",null,"2023-09-26","T"]
["2023-09-27",null,"2023-09-27","T",null,"2023-09-27","R",null,"2023-09-27","T",null,"2023-09-27","T",null,"2023-09-27","T"]
["2023-09-28",null,"2023-09-28","R",null,"2023-09-28","T",null,"2023-09-28","T",null,"2023-09-28","T",null,"2023-09-28","T"]
["2023-09-29",null,"2023-09-29","R",null,"2023-09-29","T",null,"2023-09-29","T",null,"2023-09-29","T",null,"2023-09-29","T"]
["2023-09-30",null,"2023-09-30","R",null,"2023-09-30","T",null,"2023-09-30","R",null,"2023-09-30","R",null,"2023-09-30","T"]
["2023-10-01",null,"2023-10-01","T",null,"2023-10-01","R",null,"2023-10-01","R",null,"2023-10-01","R",null,"2023-10-01","R"]
["2023-10-02",null,"2023-10-02","T",null,"2023-10-02","R",null,"2023-10-02","T",null,"2023-10-02","T",null,"2023-10-02","R"]
["2023-10-03",null,"2023-10-03","R",null,"2023-10-03","T",null,"2023-10-03","T",null,"2023-10-03","T",null,"2023-10-03","T"]
["2023-10-04",null,"2023-10-04","R",null,"2023-10-04","T",null,"2023-10-04","T",null,"2023-10-04","T",null,"2023-10-04","T"]
["2023-10-05",null,"2023-10-05","T",null,"2023-10-05","R",null,"2023-10-05","T",null,"2023-10-05","T",null,"2023-10-05","T"]
["2023-10-06",null,"2023-10-06","T",null,"2023-10-06","R",null,"2023-10-06","T",null,"2023-10-06","T",null,"2023-10-06","T"]
["2023-10-07",null,"2023-10-07","T",null,"2023-10-07","R",null,"2023-10-07","R",null,"2023-10-07","T",null,"2023-10-07","R"]
["2023-10-08",null,"2023-10-08","R",null,"2023-10-08","T",null,"2023-10-08","R",null,"2023-10-08","R",null,"2023-10-08","R"]
["2023-10-09",null,"2023-10-09","R",null,"2023-10-09","T",null,"2023-10-09","T",null,"2023-10-09","R",null,"2023-10-09","T"]
["2023-10-10",null,"2023-10-10","T",null,"2023-10-10","R",null,"2023-10-10","T",null,"2023-10-10","T",null,"2023-10-10","T"]
["2023-10-11",null,"2023-10-11","T",null,"2023-10-11","R",null,"2023-10-11","T",null,"2023-10-11","T",null,"2023-10-11","T"]
["2023-10-12",null,"2023-10-12","R",null,"2023-10-12","T",null,"2023-10-12","T",null,"2023-10-12","T",null,"2023-10-12","T"]
["2023-10-13",null,"2023-10-13","R",null,"2023-10-13","T",null,"2023-10-13","T",null,"2023-10-13","T",null,"2023-10-13","T"]
["2023-10-14",null,"2023-10-14","R",null,"2023-10-14","T",null,"2023-10-14","R",null,"2023-10-14","R",null,"2023-10-14","T"]
["2023-10-15",null,"2023-10-15","T",null,"2023-10-15","R",null,"2023-10-15","R",null,"2023-10-15","R",null,"2023-10-15","R"]
["2023-10-16",null,"2023-10-16","T",null,"2023-10-16","R",null,"2023-10-16","T",null,"2023-10-16","T",null,"2023-10-16","R"]
["2023-10-17",null,"2023-10-17","R",null,"2023-10-17","T",null,"2023-10-17","T",null,"2023-10-17","T",null,"2023-10-17","T"]
["2023-10-18",null,"2023-10-18","R",null,"2023-10-18","T",null,"2023-10-18","T",null,"2023-10-18","T",null,"2023-10-18","T"]
["2023-10-19",null,"2023-10-19","T",null,"2023-10-19","R",null,"2023-10-19","T",null,"2023-10-19","T",null,"2023-10-19","T"]
["2023-10-20",null,"2023-10-20","T",null,"2023-10-20","R",null,"2023-10-20","T",null,"2023-10-20","T",null,"2023-10-20","T"]
["2023-10-21",null,"2023-10-21","T",null,"2023-10-21","R",null,"2023-10-21","R",null,"2023-10-21","T",null,"2023-10-21","R"]
["2023-10-22",null,"2023-10-22","R",null,"2023-10-22","T",null,"2023-10-22","R",null,"2023-10-22","R",null,"2023-10-22","R"]
["2023-10-23",null,"2023-10-23","R",null,"2023-10-23","T",null,"2023-10-23","T",null,"2023-10-23","R",null,"2023-10-23","T"]
["2023-10-24",null,"2023-10-24","T",null,"2023-10-24","R",null,"2023-10-24","T",null,"2023-10-24","T",null,"2023-10-24","T"]
["2023-10-25",null,"2023-10-25","T",null,"2023-10-25","R",null,"2023-10-25","T",null,"2023-10-25","T",null,"2023-10-25","T"]
["2023-10-26",null,"2023-10-26","R",null,"2023-10-26","T",null,"2023-10-26","T",null,"2023-10-26","T",null,"2023-10-26","T"]
["2023-10-27",null,"2023-10-27","R",null,"2023-10-27","T",null,"2023-10-27","T",null,"2023-10-27","T",null,"2023-10-27","T"]
["2023-10-28",null,"2023-10-28","R",null,"2023-10-28","T",null,"2023-10-28","R",null,"2023-10-28","R",null,"2023-10-28","T"]
["2023-10-29",null,"2023-10-29","T",null,"2023-10-29","R",null,"2023-10-29","R",null,"2023-10-29","R",null,"2023-10-29","R"]
["2023-10-30",null,"2023-10-30","T",null,"2023-10-30","R",null,"2023-10-30","T",null,"2023-10-30","T",null,"2023-10-30","R"]
["2023-10-31",null,"2023-10-31","R",null,"2023-10-31","T",null,"2023-10-31","T",null,"2023-10-31","T",null,"2023-10-31","T"]
["2023-11-01",null,"2023-11-01","R",null,"2023-11-01","T",null,"2023-11-01","T",null,"2023-11-01","T",null,"2023-11-01","T"]
["2023-11-02",null,"2023-11-02","T",null,"2023-11-02","R",null,"2023-11-02","T",null,"2023-11-02","T",null,"2023-11-02","T"]
["2023-11-03",null,"2023-11-03","T",null,"2023-11-03","R",null,"2023-11-03","T",null,"2023-11-03","T",null,"2023-11-03","T"]
["2023-11-04",null,"2023-11-04","T",null,"2023-11-04","R",null,"2023-11-04","R",null,"2023-11-04","T",null,"2023-11-04","R"]
["2023-11-05",null,"2023-11-05","R",null,"2023-11-05","T",null,"2023-11-05","R",null,"2023-11-05","R",null,"2023-11-05","R"]
["2023-11-06",null,"2023-11-06","R",null,"2023-11-06","T",null,"2023-11-06","T",null,"2023-11-06","R",null,"2023-11-06","T"]
["2023-11-07",null,"2023-11-07","T",null,"2023-11-07","R",null,"2023-11-07","T",null,"2023-11-07","T",null,"2023-11-07","T"]
["2023-11-08",null,"2023-11-08","T",null,"2023-11-08","R",null,"2023-11-08","T",null,"2023-11-08","T",null,"2023-11-08","T"]
["2023-11-09",null,"2023-11-09","R",null,"2023-11-09","T",null,"2023-11-09","T",null,"2023-11-09","T",null,"2023-11-09","T"]
["2023-11-10",null,"2023-11-10","R",null,"2023-11-10","T",null,"2023-11-10","T",null,"2023-11-10","T",null,"2023-11-10","T"]
["2023-11-11",null,"2023-11-11","R",null,"2023-11-11","T",null,"2023-11-11","R",null,"2023-11-11","R",null,"2023-11-11","T"]
["2023-11-12",null,"2023-11-12","T",null,"2023-11-12","R",null,"2023-11-12","R",null,"2023-11-12","R",null,"2023-11-12","R"]
["2023-11-13",null,"2023-11-13","T",null,"2023-11-13","R",null,"2023-11-13","T",null,"2023-11-13","T",null,"2023-11-13","R"]
["2023-11-14",null,"2023-11-14","R",null,"2023-11-14","T",null,"2023-11-14","T",null,"2023-11-14","T",null,"2023-11-14","T"]
["2023-11-15",null,"2023-11-15","R",null,"2023-11-15","T",null,"2023-11-15","T",null,"2023-11-15","T",null,"2023-11-15","T"]
["2023-11-16",null,"2023-11-16","T",null,"2023-11-16","R",null,"2023-11-16","T",null,"2023-11-16","T",null,"2023-11-16","T"]
[{"$f":"C322","v":"2023-11-17"},null,"2023-11-17","T",null,"2023-11-17","R",null,"2023-11-17","T",null,"2023-11-17","T",null,"2023-11-17","T"]
["2023-11-18",null,"2023-11-18","T",null,"2023-11-18","R",null,"2023-11-18","R",null,"2023-11-18","T",null,"2023-11-18","R"]
["2023-11-19",null,"2023-11-19","R",null,"2023-11-19","T",null,"2023-11-19","R",null,"2023-11-19","R",null,"2023-11-19","R"]
["2023-11-20",null,"2023-11-20","R",null,"2023-11-20","T",null,"2023-11-20","T",null,"2023-11-20","R",null,"2023-11-20","T"]
["2023-11-21",null,"2023-11-21","T",null,"2023-11-21","R",null,"2023-11-21","T",null,"2023-11-21","T",null,"2023-11-21","T"]
["2023-11-22",null,"2023-11-22","T",null,"2023-11-22","R",null,"2023-11-22","T",null,"2023-11-22","T",null,"2023-11-22","T"]
["2023-11-23",null,"2023-11-23","R",null,"2023-11-23","T",null,"2023-11-23","T",null,"2023-11-23","T",null,"2023-11-23","T"]
["2023-11-24",null,"2023-11-24","R",null,"2023-11-24","T",null,"2023-11-24","T",null,"2023-11-24","T",null,"2023-11-24","T"]
["2023-11-25",null,"2023-11-25","R",null,"2023-11-25","T",null,"2023-11-25","R",null,"2023-11-25","R",null,"2023-11-25","T"]
["2023-11-26",null,"2023-11-26","T",null,"2023-11-26","R",null,"2023-11-26","R",null,"2023-11-26","R",null,"2023-11-26","R"]
["2023-11-27",null,"2023-11-27","T",null,"2023-11-27","R",null,"2023-11-27","T",null,"2023-11-27","T",null,"2023-11-27","R"]
["2023-11-28",null,"2023-11-28","R",null,"2023-11-28","T",null,"2023-11-28","T",null,"2023-11-28","T",null,"2023-11-28","T"]
["2023-11-29",null,"2023-11-29","R",null,"2023-11-29","T",null,"2023-11-29","T",null,"2023-11-29","T",null,"2023-11-29","T"]
["2023-11-30",null,"2023-11-30","T",null,"2023-11-30","R",null,"2023-11-30","T",null,"2023-11-30","T",null,"2023-11-30","T"]
["2023-12-01",null,"2023-12-01","T",null,"2023-12-01","R",null,"2023-12-01","T",null,"2023-12-01","T",null,"2023-12-01","T"]
["2023-12-02",null,"2023-12-02","T",null,"2023-12-02","R",null,"2023-12-02","R",null,"2023-12-02","T",null,"2023-12-02","R"]
["2023-12-03",null,"2023-12-03","R",null,"2023-12-03","T",null,"2023-12-03","R",null,"2023-12-03","R",null,"2023-12-03","R"]
["2023-12-04",null,"2023-12-04","R",null,"2023-12-04","T",null,"2023-12-04","T",null,"2023-12-04","R",null,"2023-12-04","T"]
["2023-12-05",null,"2023-12-05","T",null,"2023-12-05","R",null,"2023-12-05","T",null,"2023-12-05","T",null,"2023-12-05","T"]
["2023-12-06",null,"2023-12-06","T",null,"2023-12-06","R",null,"2023-12-06","T",null,"2023-12-06","T",null,"2023-12-06","T"]
["2023-12-07",null,"2023-12-07","R",null,"2023-12-07","T",null,"2023-12-07","T",null,"2023-12-07","T",null,"2023-12-07","T"]
["2023-12-08",null,"2023-12-08","R",null,"2023-12-08","T",null,"2023-12-08","T",null,"2023-12-08","T",null,"2023-12-08","T"]
["2023-12-09",null,"2023-12-09","R",null,"2023-12-09","T",null,"2023-12-09","R",null,"2023-12-09","R",null,"2023-12-09","T"]
["2023-12-10",null,"2023-12-10","T",null,"2023-12-10","R",null,"2023-12-10","R",null,"2023-12-10","R",null,"2023-12-10","R"]
["2023-12-11",null,"2023-12-11","T",null,"2023-12-11","R",null,"2023-12-11","T",null,"2023-12-11","T",null,"2023-12-11","R"]
["2023-12-12",null,"2023-12-12","R",null,"2023-12-12","T",null,"2023-12-12","T",null,"2023-12-12","T",null,"2023-12-12","T"]
["2023-12-13",null,"2023-12-13","R",null,"2023-12-13","T",null,"2023-12-13","T",null,"2023-12-13","T",null,"2023-12-13","T"]
["2023-12-14",null,"2023-12-14","T",null,"2023-12-14","R",null,"2023-12-14","T",null,"2023-12-14","T",null,"2023-12-14","T"]
["2023-12-15",null,"2023-12-15","T",null,"2023-12-15","R",null,"2023-12-15","T",null,"2023-12-15","T",null,"2023-12-15","T"]
["2023-12-16",null,"2023-12-16","T",null,"2023-12-16","R",null,"2023-12-16","R",null,"2023-12-16","T",null,"2023-12-16","R"]
["2023-12-17",null,"2023-12-17","R",null,"2023-12-17","T",null,"2023-12-17","R",null,"2023-12-17","R",null,"2023-12-17","R"]
["2023-12-18",null,"2023-12-18","R",null,"2023-12-18","T",null,"2023-12-18","T",null,"2023-12-18","R",null,"2023-12-18","T"]
["2023-12-19",null,"2023-12-19","T",null,"2023-12-19","R",null,"2023-12-19","T",null,"2023-12-19","T",null,"2023-12-19","T"]
["2023-12-20",null,"2023-12-20","T",null,"2023-12-20","R",null,"2023-12-20","T",null,"2023-12-20","T",null,"2023-12-20","T"]
["2023-12-21",null,"2023-12-21","R",null,"2023-12-21","T",null,"2023-12-21","T",null,"2023-12-21","T",null,"2023-12-21","T"]
["2023-12-22",null,"2023-12-22","R",null,"2023-12-22","T",null,"2023-12-22","T",null,"2023-12-22","T",null,"2023-12-22","T"]
["2023-12-23",null,"2023-12-23","R",null,"2023-12-23","T",null,"2023-12-23","R",null,"2023-12-23","R",null,"2023-12-23","T"]
["2023-12-24",null,"2023-12-24","T",null,"2023-12-24","R",null,"2023-12-24","R",null,"2023-12-24","R",null,"2023-12-24","R"]
["2023-12-25",null,"2023-12-25","T",null,"2023-12-25","R",null,"2023-12-25","T",null,"2023-12-25","T",null,"2023-12-25","R"]
["2023-12-26",null,"2023-12-26","R",null,"2023-12-26","T",null,"2023-12-26","T",null,"2023-12-26","T",null,"2023-12-26","T"]
["2023-12-27",null,"2023-12-27","R",null,"2023-12-27","T",null,"2023-12-27","T",null,"2023-12-27","T",null,"2023-12-27","T"]
["2023-12-28",null,"2023-12-28","T",null,"2023-12-28","R",null,"2023-12-28","T",null,"2023-12-28","T",null,"2023-12-28","T"]
["2023-12-29",null,"2023-12-29","T",null,"2023-12-29","R",null,"2023-12-29","T",null,"2023-12-29","T",null,"2023-12-29","T"]
["2023-12-30",null,"2023-12-30","T",null,"2023-12-30","R",null,"2023-12-30","R",null,"2023-12-30","T",null,"2023-12-30","R"]
["2023-12-31",null,"2023-12-31","R",null,"2023-12-31","T",null,"2023-12-31","R",null,"2023-12-31","R",null,"2023-12-31","R"]
["2024-01-01",null,"2024-01-01","R",null,"2024-01-01","T",null,"2024-01-01","T",null,"2024-01-01","R",null,"2024-01-01","T"]
["2024-01-02",null,"2024-01-02","T",null,"2024-01-02","R",null,"2024-01-02","T",null,"2024-01-02","T",null,"2024-01-02","T"]
["2024-01-03",null,"2024-01-03","T",null,"2024-01-03","R",null,"2024-01-03","T",null,"2024-01-03","T",null,"2024-01-03","T"]
["2024-01-04",null,"2024-01-04","R",null,"2024-01-04","T",null,"2024-01-04","T",null,"2024-01-04","T",null,"2024-01-04","T"]
["2024-01-05",null,"2024-01-05","R",null,"2024-01-05","T",null,"2024-01-05","T",null,"2024-01-05","T",null,"2024-01-05","T"]
["2024-01-06",null,"2024-01-06","R",null,"2024-01-06","T",null,"2024-01-06","R",null,"2024-01-06","R",null,"2024-01-06","T"]
["2024-01-07",null,"2024-01-07","T",null,"2024-01-07","R",null,"2024-01-07","R",null,"2024-01-07","R",null,"2024-01-07","R"]
["2024-01-08",null,"2024-01-08","T",null,"2024-01-08","R",null,"2024-01-08","T",null,"2024-01-08","T",null,"2024-01-08","R"]
["2024-01-09",null,"2024-01-09","R",null,"2024-01-09","T",null,"2024-01-09","T",null,"2024-01-09","T",null,"2024-01-09","T"]
["2024-01-10",null,"2024-01-10","R",null,"2024-01-10","T",null,"2024-01-10","T",null,"2024-01-10","T",null,"2024-01-10","T"]
["2024-01-11",null,"2024-01-11","T",null,"2024-01-11","R",null,"2024-01-11","T",null,"2024-01-11","T",null,"2024-01-11","T"]
["2024-01-12",null,"2024-01-12","T",null,"2024-01-12","R",null,"2024-01-12","T",null,"2024-01-12","T",null,"2024-01-12","T"]
["2024-01-13",null,"2024-01-13","T",null,"2024-01-13","R",null,"2024-01-13","R",null,"2024-01-13","T",null,"2024-01-13","R"]
["2024-01-14",null,"2024-01-14","R",null,"2024-01-14","T",null,"2024-01-14","R",null,"2024-01-14","R",null,"2024-01-14","R"]
["2024-01-15",null,"2024-01-15","R",null,"2024-01-15","T",null,"2024-01-15","T",null,"2024-01-15","R",null,"2024-01-15","T"]
["2024-01-16",null,"2024-01-16","T",null,"2024-01-16","R",null,"2024-01-16","T",null,"2024-01-16","T",null,"2024-01-16","T"]
["2024-01-17",null,"2024-01-17","T",null,"2024-01-17","R",null,"2024-01-17","T",null,"2024-01-17","T",null,"2024-01-17","T"]
["2024-01-18",null,"2024-01-18","R",null,"2024-01-18","T",null,"2024-01-18","T",null,"2024-01-18","T",null,"2024-01-18","T"]
["2024-01-19",null,"2024-01-19","R",null,"2024-01-19","T",null,"2024-01-19","T",null,"2024-01-19","T",null,"2024-01-19","T"]
[{"$f":"C386","v":"2024-01-20"},null,"2024-01-20","R",null,"2024-01-20","T",null,"2024-01-20","R",null,"2024-01-20","R",null,"2024-01-20","T"]
["2024-01-21",null,"2024-01-21","T",null,"2024-01-21","R",null,"2024-01-21","R",null,"2024-01-21","R",null,"2024-01-21","R"]
["2024-01-22",null,"2024-01-22","T",null,"2024-01-22","R",null,"2024-01-22","T",null,"2024-01-22","T",null,"2024-01-22","R"]
["2024-01-23",null,"2024-01-23","R",null,"2024-01-23","T",null,"2024-01-23","T",null,"2024-01-23","T",null,"2024-01-23","T"]
["2024-01-24",null,"2024-01-24","R",null,"2024-01-24","T",null,"2024-01-24","T",null,"2024-01-24","T",null,"2024-01-24","T"]
["2024-01-25",null,"2024-01-25","T",null,"2024-01-25","R",null,"2024-01-25","T",null,"2024-01-25","T",null,"2024-01-25","T"]
["2024-01-26",null,"2024-01-26","T",null,"2024-01-26","R",null,"2024-01-26","T",null,"2024-01-26","T",null,"2024-01-26","T"]
["2024-01-27",null,"2024-01-27","T",null,"2024-01-27","R",null,"2024-01-27","R",null,"2024-01-27","T",null,"2024-01-27","R"]
["2024-01-28",null,"2024-01-28","R",null,"2024-01-28","T",null,"2024-01-28","R",null,"2024-01-28","R",null,"2024-01-28","R"]
["2024-01-29",null,"2024-01-29","R",null,"2024-01-29","T",null,"2024-01-29","T",null,"2024-01-29","R",null,"2024-01-29","T"]
["2024-01-30",null,"2024-01-30","T",null,"2024-01-30","R",null,"2024-01-30","T",null,"2024-01-30","T",null,"2024-01-30","T"]
["2024-01-31",null,"2024-01-31","T",null,"2024-01-31","R",null,"2024-01-31","T",null,"2024-01-31","T",null,"2024-01-31","T"]
["2024-02-01",null,"2024-02-01","R",null,"2024-02-01","T",null,"2024-02-01","T",null,"2024-02-01","T",null,"2024-02-01","T"]
["2024-02-02",null,"2024-02-02","R",null,"2024-02-02","T",null,"2024-02-02","T",null,"2024-02-02","T",null,"2024-02-02","T"]
["2024-02-03",null,"2024-02-03","R",null,"2024-02-03","T",null,"2024-02-03","R",null,"2024-02-03","R",null,"2024-02-03","T"]
["2024-02-04",null,"2024-02-04","T",null,"2024-02-04","R",null,"2024-02-04","R",null,"2024-02-04","R",null,"2024-02-04","R"]
["2024-02-05",null,"2024-02-05","T",null,"2024-02-05","R",null,"2024-02-05","T",null,"2024-02-05","T",null,"2024-02-05","R"]
["2024-02-06",null,"2024-02-06","R",null,"2024-02-06","T",null,"2024-02-06","T",null,"2024-02-06","T",null,"2024-02-06","T"]
["2024-02-07",null,"2024-02-07","R",null,"2024-02-07","T",null,"2024-02-07","T",null,"2024-02-07","T",null,"2024-02-07","T"]
["2024-02-08",null,"2024-02-08","T",null,"2024-02-08","R",null,"2024-02-08","T",null,"2024-02-08","T",null,"2024-02-08","T"]
["2024-02-09",null,"2024-02-09","T",null,"2024-02-09","R",null,"2024-02-09","T",null,"2024-02-09","T",null,"2024-02-09","T"]
["2024-02-10",null,"2024-02-10","T",null,"2024-02-10","R",null,"2024-02-10","R",null,"2024-02-10","T",null,"2024-02-10","R"]
["2024-02-11",null,"2024-02-11","R",null,"2024-02-11","T",null,"2024-02-11","R",null,"2024-02-11","R",null,"2024-02-11","R"]
["2024-02-12",null,"2024-02-12","R",null,"2024-02-12","T",null,"2024-02-12","T",null,"2024-02-12","R",null,"2024-02-12","T"]
["2024-02-13",null,"2024-02-13","T",null,"2024-02-13","R",null,"2024-02-13","T",null,"2024-02-13","T",null,"2024-02-13","T"]
["2024-02-14",null,"2024-02-14","T",null,"2024-02-14","R",null,"2024-02-14","T",null,"2024-02-14","T",null,"2024-02-14","T"]
["2024-02-15",null,"2024-02-15","R",null,"2024-02-15","T",null,"2024-02-15","T",null,"2024-02-15","T",null,"2024-02-15","T"]
["2024-02-16",null,"2024-02-16","R",null,"2024-02-16","T",null,"2024-02-16","T",null,"2024-02-16","T",null,"2024-02-16","T"]
["2024-02-17",null,"2024-02-17","R",null,"2024-02-17","T",null,"2024-02-17","R",null,"2024-02-17","R",null,"2024-02-17","T"]
["2024-02-18",null,"2024-02-18","T",null,"2024-02-18","R",null,"2024-02-18","R",null,"2024-02-18","R",null,"2024-02-18","R"]
["2024-02-19",null,"2024-02-19","T",null,"2024-02-19","R",null,"2024-02-19","T",null,"2024-02-19","T",null,"2024-02-19","R"]
["2024-02-20",null,"2024-02-20","R",null,"2024-02-20","T",null,"2024-02-20","T",null,"2024-02-20","T",null,"2024-02-20","T"]
["2024-02-21",null,"2024-02-21","R",null,"2024-02-21","T",null,"2024-02-21","T",null,"2024-02-21","T",null,"2024-02-21","T"]
["2024-02-22",null,"2024-02-22","T",null,"2024-02-22","R",null,"2024-02-22","T",null,"2024-02-22","T",null,"2024-02-22","T"]
["2024-02-23",null,"2024-02-23","T",null,"2024-02-23","R",null,"2024-02-23","T",null,"2024-02-23","T",null,"2024-02-23","T"]
["2024-02-24",null,"2024-02-24","T",null,"2024-02-24","R",null,"2024-02-24","R",null,"2024-02-24","T",null,"2024-02-24","R"]
["2024-02-25",null,"2024-02-25","R",null,"2024-02-25","T",null,"2024-02-25","R",null,"2024-02-25","R",null,"2024-02-25","R"]
["2024-02-26",null,"2024-02-26","R",null,"2024-02-26","T",null,"2024-02-26","T",null,"2024-02-26","R",null,"2024-02-26","T"]
["2024-02-27",null,"2024-02-27","T",null,"2024-02-27","R",null,"2024-02-27","T",null,"2024-02-27","T",null,"2024-02-27","T"]
["2024-02-28",null,"2024-02-28","T",null,"2024-02-28","R",null,"2024-02-28","T",null,"2024-02-28","T",null,"2024-02-28","T"]
["2024-02-29",null,"2024-02-29","R",null,"2024-02-29","T",null,"2024-02-29","T",null,"2024-02-29","T",null,"2024-02-29","T"]
["2024-03-01",null,"2024-03-01","R",null,"2024-03-01","T",null,"2024-03-01","T",null,"2024-03-01","T",null,"2024-03-01","T"]
["2024-03-02",null,"2024-03-02","R",null,"2024-03-02","T",null,"2024-03-02","R",null,"2024-03-02","R",null,"2024-03-02","T"]
["2024-03-03",null,"2024-03-03","T",null,"2024-03-03","R",null,"2024-03-03","R",null,"2024-03-03","R",null,"2024-03-03","R"]
["2024-03-04",null,"2024-03-04","T",null,"2024-03-04","R",null,"2024-03-04","T",null,"2024-03-04","T",null,"2024-03-04","R"]
["2024-03-05",null,"2024-03-05","R",null,"2024-03-05","T",null,"2024-03-05","T",null,"2024-03-05","T",null,"2024-03-05","T"]
["2024-03-06",null,"2024-03-06","R",null,"2024-03-06","T",null,"2024-03-06","T",null,"2024-03-06","T",null,"2024-03-06","T"]
["2024-03-07",null,"2024-03-07","T",null,"2024-03-07","R",null,"2024-03-07","T",null,"2024-03-07","T",null,"2024-03-07","T"]
["2024-03-08",null,"2024-03-08","T",null,"2024-03-08","R",null,"2024-03-08","T",null,"2024-03-08","T",null,"2024-03-08","T"]
["2024-03-09",null,"2024-03-09","T",null,"2024-03-09","R",null,"2024-03-09","R",null,"2024-03-09","T",null,"2024-03-09","R"]
["2024-03-10",null,"2024-03-10","R",null,"2024-03-10","T",null,"2024-03-10","R",null,"2024-03-10","R",null,"2024-03-10","R"]
["2024-03-11",null,"2024-03-11","R",null,"2024-03-11","T",null,"2024-03-11","T",null,"2024-03-11","R",null,"2024-03-11","T"]
["2024-03-12",null,"2024-03-12","T",null,"2024-03-12","R",null,"2024-03-12","T",null,"2024-03-12","T",null,"2024-03-12","T"]
["2024-03-13",null,"2024-03-13","T",null,"2024-03-13","R",null,"2024-03-13","T",null,"2024-03-13","T",null,"2024-03-13","T"]
["2024-03-14",null,"2024-03-14","R",null,"2024-03-14","T",null,"2024-03-14","T",null,"2024-03-14","T",null,"2024-03-14","T"]
["2024-03-15",null,"2024-03-15","R",null,"2024-03-15","T",null,"2024-03-15","T",null,"2024-03-15","T",null,"2024-03-15","T"]
["2024-03-16",null,"2024-03-16","R",null,"2024-03-16","T",null,"2024-03-16","R",null,"2024-03-16","R",null,"2024-03-16","T"]
["2024-03-17",null,"2024-03-17","T",null,"2024-03-17","R",null,"2024-03-17","R",null,"2024-03-17","R",null,"2024-03-17","R"]
["2024-03-18",null,"2024-03-18","T",null,"2024-03-18","R",null,"2024-03-18","T",null,"2024-03-18","T",null,"2024-03-18","R"]
["2024-03-19",null,"2024-03-19","R",null,"2024-03-19","T",null,"2024-03-19","T",null,"2024-03-19","T",null,"2024-03-19","T"]
["2024-03-20",null,"2024-03-20","R",null,"2024-03-20","T",null,"2024-03-20","T",null,"2024-03-20","T",null,"2024-03-20","T"]
["2024-03-21",null,"2024-03-21","T",null,"2024-03-21","R",null,"2024-03-21","T",null,"2024-03-21","T",null,"2024-03-21","T"]
["2024-03-22",null,"2024-03-22","T",null,"2024-03-22","R",null,"2024-03-22","T",null,"2024-03-22","T",null,"2024-03-22","T"]
["2024-03-23",null,"2024-03-23","T",null,"2024-03-23","R",null,"2024-03-23","R",null,"2024-03-23","T",null,"2024-03-23","R"]
[{"$f":"C450","v":"2024-03-24"},null,"2024-03-24","R",null,"2024-03-24","T",null,"2024-03-24","R",null,"2024-03-24","R",null,"2024-03-24","R"]
["2024-03-25",null,"2024-03-25","R",null,"2024-03-25","T",null,"2024-03-25","T",null,"2024-03-25","R",null,"2024-03-25","T"]
["2024-03-26",null,"2024-03-26","T",null,"2024-03-26","R",null,"2024-03-26","T",null,"2024-03-26","T",null,"2024-03-26","T"]
["2024-03-27",null,"2024-03-27","T",null,"2024-03-27","R",null,"2024-03-27","T",null,"2024-03-27","T",null,"2024-03-27","T"]
["2024-03-28",null,"2024-03-28","R",null,"2024-03-28","T",null,"2024-03-28","T",null,"2024-03-28","T",null,"2024-03-28","T"]
["2024-03-29",null,"2024-03-29","R",null,"2024-03-29","T",null,"2024-03-29","T",null,"2024-03-29","T",null,"2024-03-29","T"]
["2024-03-30",null,"2024-03-30","R",null,"2024-03-30","T",null,"2024-03-30","R",null,"2024-03-30","R",null,"2024-03-30","T"]
["2024-03-31",null,"2024-03-31","T",null,"2024-03-31","R",null,"2024-03-31","R",null,"2024-03-31","R",null,"2024-03-31","R"]
["2024-04-01",null,"2024-04-01","T",null,"2024-04-01","R",null,"2024-04-01","T",null,"2024-04-01","T",null,"2024-04-01","R"]
["2024-04-02",null,"2024-04-02","R",null,"2024-04-02","T",null,"2024-04-02","T",null,"2024-04-02","T",null,"2024-04-02","T"]
["2024-04-03",null,"2024-04-03","R",null,"2024-04-03","T",null,"2024-04-03","T",null,"2024-04-03","T",null,"2024-04-03","T"]
["2024-04-04",null,"2024-04-04","T",null,"2024-04-04","R",null,"2024-04-04","T",null,"2024-04-04","T",null,"2024-04-04","T"]
["2024-04-05",null,"2024-04-05","T",null,"2024-04-05","R",null,"2024-04-05","T",null,"2024-04-05","T",null,"2024-04-05","T"]
["2024-04-06",null,"2024-04-06","T",null,"2024-04-06","R",null,"2024-04-06","R",null,"2024-04-06","T",null,"2024-04-06","R"]
["2024-04-07",null,"2024-04-07","R",null,"2024-04-07","T",null,"2024-04-07","R",null,"2024-04-07","R",null,"2024-04-07","R"]
["2024-04-08",null,"2024-04-08","R",null,"2024-04-08","T",null,"2024-04-08","T",null,"2024-04-08","R",null,"2024-04-08","T"]
["2024-04-09",null,"2024-04-09","T",null,"2024-04-09","R",null,"2024-04-09","T",null,"2024-04-09","T",null,"2024-04-09","T"]
["2024-04-10",null,"2024-04-10","T",null,"2024-04-10","R",null,"2024-04-10","T",null,"2024-04-10","T",null,"2024-04-10","T"]
["2024-04-11",null,"2024-04-11","R",null,"2024-04-11","T",null,"2024-04-11","T",null,"2024-04-11","T",null,"2024-04-11","T"]
["2024-04-12",null,"2024-04-12","R",null,"2024-04-12","T",null,"2024-04-12","T",null,"2024-04-12","T",null,"2024-04-12","T"]
["2024-04-13",null,"2024-04-13","R",null,"2024-04-13","T",null,"2024-04-13","R",null,"2024-04-13","R",null,"2024-04-13","T"]
["2024-04-14",null,"2024-04-14","T",null,"2024-04-14","R",null,"2024-04-14","R",null,"2024-04-14","R",null,"2024-04-14","R"]
["2024-04-15",null,"2024-04-15","T",null,"2024-04-15","R",null,"2024-04-15","T",null,"2024-04-15","T",null,"2024-04-15","R"]
["2024-04-16",null,"2024-04-16","R",null,"2024-04-16","T",null,"2024-04-16","T",null,"2024-04-16","T",null,"2024-04-16","T"]
["2024-04-17",null,"2024-04-17","R",null,"2024-04-17","T",null,"2024-04-17","T",null,"2024-04-17","T",null,"2024-04-17","T"]
["2024-04-18",null,"2024-04-18","T",null,"2024-04-18","R",null,"2024-04-18","T",null,"2024-04-18","T",null,"2024-04-18","T"]
["2024-04-19",null,"2024-04-19","T",null,"2024-04-19","R",null,"2024-04-19","T",null,"2024-04-19","T",null,"2024-04-19","T"]
["2024-04-20",null,"2024-04-20","T",null,"2024-04-20","R",null,"2024-04-20","R",null,"2024-04-20","T",null,"2024-04-20","R"]
["2024-04-21",null,"2024-04-21","R",null,"2024-04-21","T",null,"2024-04-21","R",null,"2024-04-21","R",null,"2024-04-21","R"]
["2024-04-22",null,"2024-04-22","R",null,"2024-04-22","T",null,"2024-04-22","T",null,"2024-04-22","R",null,"2024-04-22","T"]
["2024-04-23",null,"2024-04-23","T",null,"2024-04-23","R",null,"2024-04-23","T",null,"2024-04-23","T",null,"2024-04-23","T"]
["2024-04-24",null,"2024-04-24","T",null,"2024-04-24","R",null,"2024-04-24","T",null,"2024-04-24","T",null,"2024-04-24","T"]
["2024-04-25",null,"2024-04-25","R",null,"2024-04-25","T",null,"2024-04-25","T",null,"2024-04-25","T",null,"2024-04-25","T"]
["2024-04-26",null,"2024-04-26","R",null,"2024-04-26","T",null,"2024-04-26","T",null,"2024-04-26","T",null,"2024-04-26","T"]
["2024-04-27",null,"2024-04-27","R",null,"2024-04-27","T",null,"2024-04-27","R",null,"2024-04-27","R",null,"2024-04-27","T"]
["2024-04-28",null,"2024-04-28","T",null,"2024-04-28","R",null,"2024-04-28","R",null,"2024-04-28","R",null,"2024-04-28","R"]
["2024-04-29",null,"2024-04-29","T",null,"2024-04-29","R",null,"2024-04-29","T",null,"2024-04-29","T",null,"2024-04-29","R"]
["2024-04-30",null,"2024-04-30","R",null,"2024-04-30","T",null,"2024-04-30","T",null,"2024-04-30","T",null,"2024-04-30","T"]
["2024-05-01",null,"2024-05-01","R",null,"2024-05-01","T",null,"2024-05-01","T",null,"2024-05-01","T",null,"2024-05-01","T"]
["2024-05-02",null,"2024-05-02","T",null,"2024-05-02","R",null,"2024-05-02","T",null,"2024-05-02","T",null,"2024-05-02","T"]
["2024-05-03",null,"2024-05-03","T",null,"2024-05-03","R",null,"2024-05-03","T",null,"2024-05-03","T",null,"2024-05-03","T"]
["2024-05-04",null,"2024-05-04","T",null,"2024-05-04","R",null,"2024-05-04","R",null,"2024-05-04","T",null,"2024-05-04","R"]
["2024-05-05",null,"2024-05-05","R",null,"2024-05-05","T",null,"2024-05-05","R",null,"2024-05-05","R",null,"2024-05-05","R"]
["2024-05-06",null,"2024-05-06","R",null,"2024-05-06","T",null,"2024-05-06","T",null,"2024-05-06","R",null,"2024-05-06","T"]
["2024-05-07",null,"2024-05-07","T",null,"2024-05-07","R",null,"2024-05-07","T",null,"2024-05-07","T",null,"2024-05-07","T"]
["2024-05-08",null,"2024-05-08","T",null,"2024-05-08","R",null,"2024-05-08","T",null,"2024-05-08","T",null,"2024-05-08","T"]
["2024-05-09",null,"2024-05-09","R",null,"2024-05-09","T",null,"2024-05-09","T",null,"2024-05-09","T",null,"2024-05-09","T"]
["2024-05-10",null,"2024-05-10","R",null,"2024-05-10","T",null,"2024-05-10","T",null,"2024-05-10","T",null,"2024-05-10","T"]
["2024-05-11",null,"2024-05-11","R",null,"2024-05-11","T",null,"2024-05-11","R",null,"2024-05-11","R",null,"2024-05-11","T"]
["2024-05-12",null,"2024-05-12","T",null,"2024-05-12","R",null,"2024-05-12","R",null,"2024-05-12","R",null,"2024-05-12","R"]
["2024-05-13",null,"2024-05-13","T",null,"2024-05-13","R",null,"2024-05-13","T",null,"2024-05-13","T",null,"2024-05-13","R"]
["2024-05-14",null,"2024-05-14","R",null,"2024-05-14","T",null,"2024-05-14","T",null,"2024-05-14","T",null,"2024-05-14","T"]
["2024-05-15",null,"2024-05-15","R",null,"2024-05-15","T",null,"2024-05-15","T",null,"2024-05-15","T",null,"2024-05-15","T"]
["2024-05-16",null,"2024-05-16","T",null,"2024-05-16","R",null,"2024-05-16","T",null,"2024-05-16","T",null,"2024-05-16","T"]
["2024-05-17",null,"2024-05-17","T",null,"2024-05-17","R",null,"2024-05-17","T",null,"2024-05-17","T",null,"2024-05-17","T"]
["2024-05-18",null,"2024-05-18","T",null,"2024-05-18","R",null,"2024-05-18","R",null,"2024-05-18","T",null,"2024-05-18","R"]
["2024-05-19",null,"2024-05-19","R",null,"2024-05-19","T",null,"2024-05-19","R",null,"2024-05-19","R",null,"2024-05-19","R"]
["2024-05-20",null,"2024-05-20","R",null,"2024-05-20","T",null,"2024-05-20","T",null,"2024-05-20","R",null,"2024-05-20","T"]
["2024-05-21",null,"2024-05-21","T",null,"2024-05-21","R",null,"2024-05-21","T",null,"2024-05-21","T",null,"2024-05-21","T"]
["2024-05-22",null,"2024-05-22","T",null,"2024-05-22","R",null,"2024-05-22","T",null,"2024-05-22","T",null,"2024-05-22","T"]
["2024-05-23",null,"2024-05-23","R",null,"2024-05-23","T",null,"2024-05-23","T",null,"2024-05-23","T",null,"2024-05-23","T"]
["2024-05-24",null,"2024-05-24","R",null,"2024-05-24","T",null,"2024-05-24","T",null,"2024-05-24","T",null,"2024-05-24","T"]
["2024-05-25",null,"2024-05-25","R",null,"2024-05-25","T",null,"2024-05-25","R",null,"2024-05-25","R",null,"2024-05-25","T"]
["2024-05-26",null,"2024-05-26","T",null,"2024-05-26","R",null,"2024-05-26","R",null,"2024-05-26","R",null,"2024-05-26","R"]
[{"$f":"C514","v":"2024-05-27"},null,"2024-05-27","T",null,"2024-05-27","R",null,"2024-05-27","T",null,"2024-05-27","T",null,"2024-05-27","R"]
["2024-05-28",null,"2024-05-28","R",null,"2024-05-28","T",null,"2024-05-28","T",null,"2024-05-28","T",null,"2024-05-28","T"]
["2024-05-29",null,"2024-05-29","R",null,"2024-05-29","T",null,"2024-05-29","T",null,"2024-05-29","T",null,"2024-05-29","T"]
["2024-05-30",null,"2024-05-30","T",null,"2024-05-30","R",null,"2024-05-30","T",null,"2024-05-30","T",null,"2024-05-30","T"]
["2024-05-31",null,"2024-05-31","T",null,"2024-05-31","R",null,"2024-05-31","T",null,"2024-05-31","T",null,"2024-05-31","T"]
["2024-06-01",null,"2024-06-01","T",null,"2024-06-01","R",null,"2024-06-01","R",null,"2024-06-01","T",null,"2024-06-01","R"]
["2024-06-02",null,"2024-06-02","R",null,"2024-06-02","T",null,"2024-06-02","R",null,"2024-06-02","R",null,"2024-06-02","R"]
["2024-06-03",null,"2024-06-03","R",null,"2024-06-03","T",null,"2024-06-03","T",null,"2024-06-03","R",null,"2024-06-03","T"]
["2024-06-04",null,"2024-06-04","T",null,"2024-06-04","R",null,"2024-06-04","T",null,"2024-06-04","T",null,"2024-06-04","T"]
["2024-06-05",null,"2024-06-05","T",null,"2024-06-05","R",null,"2024-06-05","T",null,"2024-06-05","T",null,"2024-06-05","T"]
["2024-06-06",null,"2024-06-06","R",null,"2024-06-06","T",null,"2024-06-06","T",null,"2024-06-06","T",null,"2024-06-06","T"]
["2024-06-07",null,"2024-06-07","R",null,"2024-06-07","T",null,"2024-06-07","T",null,"2024-06-07","T",null,"2024-06-07","T"]
["2024-06-08",null,"2024-06-08","R",null,"2024-06-08","T",null,"2024-06-08","R",null,"2024-06-08","R",null,"2024-06-08","T"]
["2024-06-09",null,"2024-06-09","T",null,"2024-06-09","R",null,"2024-06-09","R",null,"2024-06-09","R",null,"2024-06-09","R"]
["2024-06-10",null,"2024-06-10","T",null,"2024-06-10","R",null,"2024-06-10","T",null,"2024-06-10","T",null,"2024-06-10","R"]
["2024-06-11",null,"2024-06-11","R",null,"2024-06-11","T",null,"2024-06-11","T",null,"2024-06-11","T",null,"2024-06-11","T"]
["2024-06-12",null,"2024-06-12","R",null,"2024-06-12","T",null,"2024-06-12","T",null,"2024-06-12","T",null,"2024-06-12","T"]
["2024-06-13",null,"2024-06-13","T",null,"2024-06-13","R",null,"2024-06-13","T",null,"2024-06-13","T",null,"2024-06-13","T"]
["2024-06-14",null,"2024-06-14","T",null,"2024-06-14","R",null,"2024-06-14","T",null,"2024-06-14","T",null,"2024-06-14","T"]
["2024-06-15",null,"2024-06-15","T",null,"2024-06-15","R",null,"2024-06-15","R",null,"2024-06-15","T",null,"2024-06-15","R"]
["2024-06-16",null,"2024-06-16","R",null,"2024-06-16","T",null,"2024-06-16","R",null,"2024-06-16","R",null,"2024-06-16","R"]
["2024-06-17",null,"2024-06-17","R",null,"2024-06-17","T",null,"2024-06-17","T",null,"2024-06-17","R",null,"2024-06-17","T"]
["2024-06-18",null,"2024-06-18","T",null,"2024-06-18","R",null,"2024-06-18","T",null,"2024-06-18","T",null,"2024-06-18","T"]
["2024-06-19",null,"2024-06-19","T",null,"2024-06-19","R",null,"2024-06-19","T",null,"2024-06-19","T",null,"2024-06-19","T"]
["2024-06-20",null,"2024-06-20","R",null,"2024-06-20","T",null,"2024-06-20","T",null,"2024-06-20","T",null,"2024-06-20","T"]
["2024-06-21",null,"2024-06-21","R",null,"2024-06-21","T",null,"2024-06-21","T",null,"2024-06-21","T",null,"2024-06-21","T"]
["2024-06-22",null,"2024-06-22","R",null,"2024-06-22","T",null,"2024-06-22","R",null,"2024-06-22","R",null,"2024-06-22","T"]
["2024-06-23",null,"2024-06-23","T",null,"2024-06-23","R",null,"2024-06-23","R",null,"2024-06-23","R",null,"2024-06-23","R"]
["2024-06-24",null,"2024-06-24","T",null,"2024-06-24","R",null,"2024-06-24","T",null,"2024-06-24","T",null,"2024-06-24","R"]
["2024-06-25",null,"2024-06-25","R",null,"2024-06-25","T",null,"2024-06-25","T",null,"2024-06-25","T",null,"2024-06-25","T"]
["2024-06-26",null,"2024-06-26","R",null,"2024-06-26","T",null,"2024-06-26","T",null,"2024-06-26","T",null,"2024-06-26","T"]
["2024-06-27",null,"2024-06-27","T",null,"2024-06-27","R",null,"2024-06-27","T",null,"2024-06-27","T",null,"2024-06-27","T"]
["2024-06-28",null,"2024-06-28","T",null,"2024-06-28","R",null,"2024-06-28","T",null,"2024-06-28","T",null,"2024-06-28","T"]
["2024-06-29",null,"2024-06-29","T",null,"2024-06-29","R",null,"2024-06-29","R",null,"2024-06-29","T",null,"2024-06-29","R"]
["2024-06-30",null,"2024-06-30","R",null,"2024-06-30","T",null,"2024-06-30","R",null,"2024-06-30","R",null,"2024-06-30","R"]
["2024-07-01",null,"2024-07-01","R",null,"2024-07-01","T",null,"2024-07-01","T",null,"2024-07-01","R",null,"2024-07-01","T"]
["2024-07-02",null,"2024-07-02","T",null,"2024-07-02","R",null,"2024-07-02","T",null,"2024-07-02","T",null,"2024-07-02","T"]
["2024-07-03",null,"2024-07-03","T",null,"2024-07-03","R",null,"2024-07-03","T",null,"2024-07-03","T",null,"2024-07-03","T"]
["2024-07-04",null,"2024-07-04","R",null,"2024-07-04","T",null,"2024-07-04","T",null,"2024-07-04","T",null,"2024-07-04","T"]
["2024-07-05",null,"2024-07-05","R",null,"2024-07-05","T",null,"2024-07-05","T",null,"2024-07-05","T",null,"2024-07-05","T"]
["2024-07-06",null,"2024-07-06","R",null,"2024-07-06","T",null,"2024-07-06","R",null,"2024-07-06","R",null,"2024-07-06","T"]
["2024-07-07",null,"2024-07-07","T",null,"2024-07-07","R",null,"2024-07-07","R",null,"2024-07-07","R",null,"2024-07-07","R"]
["2024-07-08",null,"2024-07-08","T",null,"2024-07-08","R",null,"2024-07-08","T",null,"2024-07-08","T",null,"2024-07-08","R"]
["2024-07-09",null,"2024-07-09","R",null,"2024-07-09","T",null,"2024-07-09","T",null,"2024-07-09","T",null,"2024-07-09","T"]
["2024-07-10",null,"2024-07-10","R",null,"2024-07-10","T",null,"2024-07-10","T",null,"2024-07-10","T",null,"2024-07-10","T"]
["2024-07-11",null,"2024-07-11","T",null,"2024-07-11","R",null,"2024-07-11","T",null,"2024-07-11","T",null,"2024-07-11","T"]
["2024-07-12",null,"2024-07-12","T",null,"2024-07-12","R",null,"2024-07-12","T",null,"2024-07-12","T",null,"2024-07-12","T"]
["2024-07-13",null,"2024-07-13","T",null,"2024-07-13","R",null,"2024-07-13","R",null,"2024-07-13","T",null,"2024-07-13","R"]
["2024-07-14",null,"2024-07-14","R",null,"2024-07-14","T",null,"2024-07-14","R",null,"2024-07-14","R",null,"2024-07-14","R"]
["2024-07-15",null,"2024-07-15","R",null,"2024-07-15","T",null,"2024-07-15","T",null,"2024-07-15","R",null,"2024-07-15","T"]
["2024-07-16",null,"2024-07-16","T",null,"2024-07-16","R",null,"2024-07-16","T",null,"2024-07-16","T",null,"2024-07-16","T"]
["2024-07-17",null,"2024-07-17","T",null,"2024-07-17","R",null,"2024-07-17","T",null,"2024-07-17","T",null,"2024-07-17","T"]
["2024-07-18",null,"2024-07-18","R",null,"2024-07-18","T",null,"2024-07-18","T",null,"2024-07-18","T",null,"2024-07-18","T"]
["2024-07-19",null,"2024-07-19","R",null,"2024-07-19","T",null,"2024-07-19","T",null,"2024-07-19","T",null,"2024-07-19","T"]
["2024-07-20",null,"2024-07-20","R",null,"2024-07-20","T",null,"2024-07-20","R",null,"2024-07-20","R",null,"2024-07-20","T"]
["2024-07-21",null,"2024-07-21","T",null,"2024-07-21","R",null,"2024-07-21","R",null,"2024-07-21","R",null,"2024-07-21","R"]
["2024-07-22",null,"2024-07-22","T",null,"2024-07-22","R",null,"2024-07-22","T",null,"2024-07-22","T",null,"2024-07-22","R"]
["2024-07-23",null,"2024-07-23","R",null,"2024-07-23","T",null,"2024-07-23","T",null,"2024-07-23","T",null,"2024-07-23","T"]
["2024-07-24",null,"2024-07-24","R",null,"2024-07-24","T",null,"2024-07-24","T",null,"2024-07-24","T",null,"2024-07-24","T"]
["2024-07-25",null,"2024-07-25","T",null,"2024-07-25","R",null,"2024-07-25","T",null,"2024-07-25","T",null,"2024-07-25","T"]
["2024-07-26",null,"2024-07-26","T",null,"2024-07-26","R",null,"2024-07-26","T",null,"2024-07-26","T",null,"2024-07-26","T"]
["2024-07-27",null,"2024-07-27","T",null,"2024-07-27","R",null,"2024-07-27","R",null,"2024-07-27","T",null,"2024-07-27","R"]
["2024-07-28",null,"2024-07-28","R",null,"2024-07-28","T",null,"2024-07-28","R",null,"2024-07-28","R",null,"2024-07-28","R"]
["2024-07-29",null,"2024-07-29","R",null,"2024-07-29","T",null,"2024-07-29","T",null,"2024-07-29","R",null,"2024-07-29","T"]
[{"$f":"C578","v":"2024-07-30"},null,"2024-07-30","T",null,"2024-07-30","R",null,"2024-07-30","T",null,"2024-07-30","T",null,"2024-07-30","T"]
["2024-07-31",null,"2024-07-31","T",null,"2024-07-31","R",null,"2024-07-31","T",null,"2024-07-31","T",null,"2024-07-31","T"]
["2024-08-01",null,"2024-08-01","R",null,"2024-08-01","T",null,"2024-08-01","T",null,"2024-08-01","T",null,"2024-08-01","T"]
["2024-08-02",null,"2024-08-02","R",null,"2024-08-02","T",null,"2024-08-02","T",null,"2024-08-02","T",null,"2024-08-02","T"]
["2024-08-03",null,"2024-08-03","R",null,"2024-08-03","T",null,"2024-08-03","R",null,"2024-08-03","R",null,"2024-08-03","T"]
["2024-08-04",null,"2024-08-04","T",null,"2024-08-04","R",null,"2024-08-04","R",null,"2024-08-04","R",null,"2024-08-04","R"]
["2024-08-05",null,"2024-08-05","T",null,"2024-08-05","R",null,"2024-08-05","T",null,"2024-08-05","T",null,"2024-08-05","R"]
["2024-08-06",null,"2024-08-06","R",null,"2024-08-06","T",null,"2024-08-06","T",null,"2024-08-06","T",null,"2024-08-06","T"]
["2024-08-07",null,"2024-08-07","R",null,"2024-08-07","T",null,"2024-08-07","T",null,"2024-08-07","T",null,"2024-08-07","T"]
["2024-08-08",null,"2024-08-08","T",null,"2024-08-08","R",null,"2024-08-08","T",null,"2024-08-08","T",null,"2024-08-08","T"]
["2024-08-09",null,"2024-08-09","T",null,"2024-08-09","R",null,"2024-08-09","T",null,"2024-08-09","T",null,"2024-08-09","T"]
["2024-08-10",null,"2024-08-10","T",null,"2024-08-10","R",null,"2024-08-10","R",null,"2024-08-10","T",null,"2024-08-10","R"]
["2024-08-11",null,"2024-08-11","R",null,"2024-08-11","T",null,"2024-08-11","R",null,"2024-08-11","R",null,"2024-08-11","R"]
["2024-08-12",null,"2024-08-12","R",null,"2024-08-12","T",null,"2024-08-12","T",null,"2024-08-12","R",null,"2024-08-12","T"]
["2024-08-13",null,"2024-08-13","T",null,"2024-08-13","R",null,"2024-08-13","T",null,"2024-08-13","T",null,"2024-08-13","T"]
["2024-08-14",null,"2024-08-14","T",null,"2024-08-14","R",null,"2024-08-14","T",null,"2024-08-14","T",null,"2024-08-14","T"]
["2024-08-15",null,"2024-08-15","R",null,"2024-08-15","T",null,"2024-08-15","T",null,"2024-08-15","T",null,"2024-08-15","T"]
["2024-08-16",null,"2024-08-16","R",null,"2024-08-16","T",null,"2024-08-16","T",null,"2024-08-16","T",null,"2024-08-16","T"]
["2024-08-17",null,"2024-08-17","R",null,"2024-08-17","T",null,"2024-08-17","R",null,"2024-08-17","R",null,"2024-08-17","T"]
["2024-08-18",null,"2024-08-18","T",null,"2024-08-18","R",null,"2024-08-18","R",null,"2024-08-18","R",null,"2024-08-18","R"]
["2024-08-19",null,"2024-08-19","T",null,"2024-08-19","R",null,"2024-08-19","T",null,"2024-08-19","T",null,"2024-08-19","R"]
["2024-08-20",null,"2024-08-20","R",null,"2024-08-20","T",null,"2024-08-20","T",null,"2024-08-20","T",null,"2024-08-20","T"]
["2024-08-21",null,"2024-08-21","R",null,"2024-08-21","T",null,"2024-08-21","T",null,"2024-08-21","T",null,"2024-08-21","T"]
["2024-08-22",null,"2024-08-22","T",null,"2024-08-22","R",null,"2024-08-22","T",null,"2024-08-22","T",null,"2024-08-22","T"]
["2024-08-23",null,"2024-08-23","T",null,"2024-08-23","R",null,"2024-08-23","T",null,"2024-08-23","T",null,"2024-08-23","T"]
["2024-08-24",null,"2024-08-24","T",null,"2024-08-24","R",null,"2024-08-24","R",null,"2024-08-24","T",null,"2024-08-24","R"]
["2024-08-25",null,"2024-08-25","R",null,"2024-08-25","T",null,"2024-08-25","R",null,"2024-08-25","R",null,"2024-08-25","R"]
["2024-08-26",null,"2024-08-26","R",null,"2024-08-26","T",null,"2024-08-26","T",null,"2024-08-26","R",null,"2024-08-26","T"]
["2024-08-27",null,"2024-08-27","T",null,"2024-08-27","R",null,"2024-08-27","T",null,"2024-08-27","T",null,"2024-08-27","T"]
["2024-08-28",null,"2024-08-28","T",null,"2024-08-28","R",null,"2024-08-28","T",null,"2024-08-28","T",null,"2024-08-28","T"]
["2024-08-29",null,"2024-08-29","R",null,"2024-08-29","T",null,"2024-08-29","T",null,"2024-08-29","T",null,"2024-08-29","T"]
["2024-08-30",null,"2024-08-30","R",null,"2024-08-30","T",null,"2024-08-30","T",null,"2024-08-30","T",null,"2024-08-30","T"]
["2024-08-31",null,"2024-08-31","R",null,"2024-08-31","T",null,"2024-08-31","R",null,"2024-08-31","R",null,"2024-08-31","T"]
["2024-09-01",null,"2024-09-01","T",null,"2024-09-01","R",null,"2024-09-01","R",null,"2024-09-01","R",null,"2024-09-01","R"]
["2024-09-02",null,"2024-09-02","T",null,"2024-09-02","R",null,"2024-09-02","T",null,"2024-09-02","T",null,"2024-09-02","R"]
["2024-09-03",null,"2024-09-03","R",null,"2024-09-03","T",null,"2024-09-03","T",null,"2024-09-03","T",null,"2024-09-03","T"]
["2024-09-04",null,"2024-09-04","R",null,"2024-09-04","T",null,"2024-09-04","T",null,"2024-09-04","T",null,"2024-09-04","T"]
["2024-09-05",null,"2024-09-05","T",null,"2024-09-05","R",null,"2024-09-05","T",null,"2024-09-05","T",null,"2024-09-05","T"]
["2024-09-06",null,"2024-09-06","T",null,"2024-09-06","R",null,"2024-09-06","T",null,"2024-09-06","T",null,"2024-09-06","T"]
["2024-09-07",null,"2024-09-07","T",null,"2024-09-07","R",null,"2024-09-07","R",null,"2024-09-07","T",null,"2024-09-07","R"]
["2024-09-08",null,"2024-09-08","R",null,"2024-09-08","T",null,"2024-09-08","R",null,"2024-09-08","R",null,"2024-09-08","R"]
["2024-09-09",null,"2024-09-09","R",null,"2024-09-09","T",null,"2024-09-09","T",null,"2024-09-09","R",null,"2024-09-09","T"]
["2024-09-10",null,"2024-09-10","T",null,"2024-09-10","R",null,"2024-09-10","T",null,"2024-09-10","T",null,"2024-09-10","T"]
["2024-09-11",null,"2024-09-11","T",null,"2024-09-11","R",null,"2024-09-11","T",null,"2024-09-11","T",null,"2024-09-11","T"]
["2024-09-12",null,"2024-09-12","R",null,"2024-09-12","T",null,"2024-09-12","T",null,"2024-09-12","T",null,"2024-09-12","T"]
["2024-09-13",null,"2024-09-13","R",null,"2024-09-13","T",null,"2024-09-13","T",null,"2024-09-13","T",null,"2024-09-13","T"]
["2024-09-14",null,"2024-09-14","R",null,"2024-09-14","T",null,"2024-09-14","R",null,"2024-09-14","R",null,"2024-09-14","T"]
["2024-09-15",null,"2024-09-15","T",null,"2024-09-15","R",null,"2024-09-15","R",null,"2024-09-15","R",null,"2024-09-15","R"]
["2024-09-16",null,"2024-09-16","T",null,"2024-09-16","R",null,"2024-09-16","T",null,"2024-09-16","T",null,"2024-09-16","R"]
["2024-09-17",null,"2024-09-17","R",null,"2024-09-17","T",null,"2024-09-17","T",null,"2024-09-17","T",null,"2024-09-17","T"]
["2024-09-18",null,"2024-09-18","R",null,"2024-09-18","T",null,"2024-09-18","T",null,"2024-09-18","T",null,"2024-09-18","T"]
["2024-09-19",null,"2024-09-19","T",null,"2024-09-19","R",null,"2024-09-19","T",null,"2024-09-19","T",null,"2024-09-19","T"]
["2024-09-20",null,"2024-09-20","T",null,"2024-09-20","R",null,"2024-09-20","T",null,"2024-09-20","T",null,"2024-09-20","T"]
["2024-09-21",null,"2024-09-21","T",null,"2024-09-21","R",null,"2024-09-21","R",null,"2024-09-21","T",null,"2024-09-21","R"]
["2024-09-22",null,"2024-09-22","R",null,"2024-09-22","T",null,"2024-09-22","R",null,"2024-09-22","R",null,"2024-09-22","R"]
["2024-09-23",null,"2024-09-23","R",null,"2024-09-23","T",null,"2024-09-23","T",null,"2024-09-23","R",null,"2024-09-23","T"]
["2024-09-24",null,"2024-09-24","T",null,"2024-09-24","R",null,"2024-09-24","T",null,"2024-09-24","T",null,"2024-09-24","T"]
["2024-09-25",null,"2024-09-25","T",null,"2024-09-25","R",null,"2024-09-25","T",null,"2024-09-25","T",null,"2024-09-25","T"]
["2024-09-26",null,"2024-09-26","R",null,"2024-09-26","T",null,"2024-09-26","T",null,"2024-09-26","T",null,"2024-09-26","T"]
["2024-09-27",null,"2024-09-27","R",null,"2024-09-27","T",null,"2024-09-27","T",null,"2024-09-27","T",null,"2024-09-27","T"]
["2024-09-28",null,"2024-09-28","R",null,"2024-09-28","T",null,"2024-09-28","R",null,"2024-09-28","R",null,"2024-09-28","T"]
["2024-09-29",null,"2024-09-29","T",null,"2024-09-29","R",null,"2024-09-29","R",null,"2024-09-29","R",null,"2024-09-29","R"]
["2024-09-30",null,"2024-09-30","T",null,"2024-09-30","R",null,"2024-09-30","T",null,"2024-09-30","T",null,"2024-09-30","R"]
["2024-10-01",null,"2024-10-01","R",null,"2024-10-01","T",null,"2024-10-01","T",null,"2024-10-01","T",null,"2024-10-01","T"]
[{"$f":"C642","v":"2024-10-02"},null,"2024-10-02","R",null,"2024-10-02","T",null,"2024-10-02","T",null,"2024-10-02","T",null,"2024-10-02","T"]
["2024-10-03",null,"2024-10-03","T",null,"2024-10-03","R",null,"2024-10-03","T",null,"2024-10-03","T",null,"2024-10-03","T"]
["2024-10-04",null,"2024-10-04","T",null,"2024-10-04","R",null,"2024-10-04","T",null,"2024-10-04","T",null,"2024-10-04","T"]
["2024-10-05",null,"2024-10-05","T",null,"2024-10-05","R",null,"2024-10-05","R",null,"2024-10-05","T",null,"2024-10-05","R"]
["2024-10-06",null,"2024-10-06","R",null,"2024-10-06","T",null,"2024-10-06","R",null,"2024-10-06","R",null,"2024-10-06","R"]
["2024-10-07",null,"2024-10-07","R",null,"2024-10-07","T",null,"2024-10-07","T",null,"2024-10-07","R",null,"2024-10-07","T"]
["2024-10-08",null,"2024-10-08","T",null,"2024-10-08","R",null,"2024-10-08","T",null,"2024-10-08","T",null,"2024-10-08","T"]
["2024-10-09",null,"2024-10-09","T",null,"2024-10-09","R",null,"2024-10-09","T",null,"2024-10-09","T",null,"2024-10-09","T"]
["2024-10-10",null,"2024-10-10","R",null,"2024-10-10","T",null,"2024-10-10","T",null,"2024-10-10","T",null,"2024-10-10","T"]
["2024-10-11",null,"2024-10-11","R",null,"2024-10-11","T",null,"2024-10-11","T",null,"2024-10-11","T",null,"2024-10-11","T"]
["2024-10-12",null,"2024-10-12","R",null,"2024-10-12","T",null,"2024-10-12","R",null,"2024-10-12","R",null,"2024-10-12","T"]
["2024-10-13",null,"2024-10-13","T",null,"2024-10-13","R",null,"2024-10-13","R",null,"2024-10-13","R",null,"2024-10-13","R"]
["2024-10-14",null,"2024-10-14","T",null,"2024-10-14","R",null,"2024-10-14","T",null,"2024-10-14","T",null,"2024-10-14","R"]
["2024-10-15",null,"2024-10-15","R",null,"2024-10-15","T",null,"2024-10-15","T",null,"2024-10-15","T",null,"2024-10-15","T"]
["2024-10-16",null,"2024-10-16","R",null,"2024-10-16","T",null,"2024-10-16","T",null,"2024-10-16","T",null,"2024-10-16","T"]
["2024-10-17",null,"2024-10-17","T",null,"2024-10-17","R",null,"2024-10-17","T",null,"2024-10-17","T",null,"2024-10-17","T"]
["2024-10-18",null,"2024-10-18","T",null,"2024-10-18","R",null,"2024-10-18","T",null,"2024-10-18","T",null,"2024-10-18","T"]
["2024-10-19",null,"2024-10-19","T",null,"2024-10-19","R",null,"2024-10-19","R",null,"2024-10-19","T",null,"2024-10-19","R"]
["2024-10-20",null,"2024-10-20","R",null,"2024-10-20","T",null,"2024-10-20","R",null,"2024-10-20","R",null,"2024-10-20","R"]
["2024-10-21",null,"2024-10-21","R",null,"2024-10-21","T",null,"2024-10-21","T",null,"2024-10-21","R",null,"2024-10-21","T"]
["2024-10-22",null,"2024-10-22","T",null,"2024-10-22","R",null,"2024-10-22","T",null,"2024-10-22","T",null,"2024-10-22","T"]
["2024-10-23",null,"2024-10-23","T",null,"2024-10-23","R",null,"2024-10-23","T",null,"2024-10-23","T",null,"2024-10-23","T"]
["2024-10-24",null,"2024-10-24","R",null,"2024-10-24","T",null,"2024-10-24","T",null,"2024-10-24","T",null,"2024-10-24","T"]
["2024-10-25",null,"2024-10-25","R",null,"2024-10-25","T",null,"2024-10-25","T",null,"2024-10-25","T",null,"2024-10-25","T"]
["2024-10-26",null,"2024-10-26","R",null,"2024-10-26","T",null,"2024-10-26","R",null,"2024-10-26","R",null,"2024-10-26","T"]
["2024-10-27",null,"2024-10-27","T",null,"2024-10-27","R",null,"2024-10-27","R",null,"2024-10-27","R",null,"2024-10-27","R"]
["2024-10-28",null,"2024-10-28","T",null,"2024-10-28","R",null,"2024-10-28","T",null,"2024-10-28","T",null,"2024-10-28","R"]
["2024-10-29",null,"2024-10-29","R",null,"2024-10-29","T",null,"2024-10-29","T",null,"2024-10-29","T",null,"2024-10-29","T"]
["2024-10-30",null,"2024-10-30","R",null,"2024-10-30","T",null,"2024-10-30","T",null,"2024-10-30","T",null,"2024-10-30","T"]
["2024-10-31",null,"2024-10-31","T",null,"2024-10-31","R",null,"2024-10-31","T",null,"2024-10-31","T",null,"2024-10-31","T"]
["2024-11-01",null,"2024-11-01","T",null,"2024-11-01","R",null,"2024-11-01","T",null,"2024-11-01","T",null,"2024-11-01","T"]
["2024-11-02",null,"2024-11-02","T",null,"2024-11-02","R",null,"2024-11-02","R",null,"2024-11-02","T",null,"2024-11-02","R"]
["2024-11-03",null,"2024-11-03","R",null,"2024-11-03","T",null,"2024-11-03","R",null,"2024-11-03","R",null,"2024-11-03","R"]
["2024-11-04",null,"2024-11-04","R",null,"2024-11-04","T",null,"2024-11-04","T",null,"2024-11-04","R",null,"2024-11-04","T"]
["2024-11-05",null,"2024-11-05","T",null,"2024-11-05","R",null,"2024-11-05","T",null,"2024-11-05","T",null,"2024-11-05","T"]
["2024-11-06",null,"2024-11-06","T",null,"2024-11-06","R",null,"2024-11-06","T",null,"2024-11-06","T",null,"2024-11-06","T"]
["2024-11-07",null,"2024-11-07","R",null,"2024-11-07","T",null,"2024-11-07","T",null,"2024-11-07","T",null,"2024-11-07","T"]
["2024-11-08",null,"2024-11-08","R",null,"2024-11-08","T",null,"2024-11-08","T",null,"2024-11-08","T",null,"2024-11-08","T"]
["2024-11-09",null,"2024-11-09","R",null,"2024-11-09","T",null,"2024-11-09","R",null,"2024-11-09","R",null,"2024-11-09","T"]
["2024-11-10",null,"2024-11-10","T",null,"2024-11-10","R",null,"2024-11-10","R",null,"2024-11-10","R",null,"2024-11-10","R"]
["2024-11-11",null,"2024-11-11","T",null,"2024-11-11","R",null,"2024-11-11","T",null,"2024-11-11","T",null,"2024-11-11","R"]
["2024-11-12",null,"2024-11-12","R",null,"2024-11-12","T",null,"2024-11-12","T",null,"2024-11-12","T",null,"2024-11-12","T"]
["2024-11-13",null,"2024-11-13","R",null,"2024-11-13","T",null,"2024-11-13","T",null,"2024-11-13","T",null,"2024-11-13","T"]
["2024-11-14",null,"2024-11-14","T",null,"2024-11-14","R",null,"2024-11-14","T",null,"2024-11-14","T",null,"2024-11-14","T"]
["2024-11-15",null,"2024-11-15","T",null,"2024-11-15","R",null,"2024-11-15","T",null,"2024-11-15","T",null,"2024-11-15","T"]
["2024-11-16",null,"2024-11-16","T",null,"2024-11-16","R",null,"2024-11-16","R",null,"2024-11-16","T",null,"2024-11-16","R"]
["2024-11-17",null,"2024-11-17","R",null,"2024-11-17","T",null,"2024-11-17","R",null,"2024-11-17","R",null,"2024-11-17","R"]
["2024-11-18",null,"2024-11-18","R",null,"2024-11-18","T",null,"2024-11-18","T",null,"2024-11-18","R",null,"2024-11-18","T"]
["2024-11-19",null,"2024-11-19","T",null,"2024-11-19","R",null,"2024-11-19","T",null,"2024-11-19","T",null,"2024-11-19","T"]
["2024-11-20",null,"2024-11-20","T",null,"2024-11-20","R",null,"2024-11-20","T",null,"2024-11-20","T",null,"2024-11-20","T"]
["2024-11-21",null,"2024-11-21","R",null,"2024-11-21","T",null,"2024-11-21","T",null,"2024-11-21","T",null,"2024-11-21","T"]
["2024-11-22",null,"2024-11-22","R",null,"2024-11-22","T",null,"2024-11-22","T",null,"2024-11-22","T",null,"2024-11-22","T"]
["2024-11-23",null,"2024-11-23","R",null,"2024-11-23","T",null,"2024-11-23","R",null,"2024-11-23","R",null,"2024-11-23","T"]
["2024-11-24",null,"2024-11-24","T",null,"2024-11-24","R",null,"2024-11-24","R",null,"2024-11-24","R",null,"2024-11-24","R"]
["2024-11-25",null,"2024-11-25","T",null,"2024-11-25","R",null,"2024-11-25","T",null,"2024-11-25","T",null,"2024-11-25","R"]
["2024-11-26",null,"2024-11-26","R",null,"2024-11-26","T",null,"2024-11-26","T",null,"2024-11-26","T",null,"2024-11-26","T"]
["2024-11-27",null,"2024-11-27","R",null,"2024-11-27","T",null,"2024-11-27","T",null,"2024-11-27","T",null,"2024-11-27","T"]
["2024-11-28",null,"2024-11-28","T",null,"2024-11-28","R",null,"2024-11-28","T",null,"2024-11-28","T",null,"2024-11-28","T"]
["2024-11-29",null,"2024-11-29","T",null,"2024-11-29","R",null,"2024-11-29","T",null,"2024-11-29","T",null,"2024-11-29","T"]
["2024-11-30",null,"2024-11-30","T",null,"2024-11-30","R",null,"2024-11-30","R",null,"2024-11-30","T",null,"2024-11-30","R"]
["2024-12-01",null,"2024-12-01","R",null,"2024-12-01","T",null,"2024-12-01","R",null,"2024-12-01","R",null,"2024-12-01","R"]
["2024-12-02",null,"2024-12-02","R",null,"2024-12-02","T",null,"2024-12-02","T",null,"2024-12-02","R",null,"2024-12-02","T"]
["2024-12-03",null,"2024-12-03","T",null,"2024-12-03","R",null,"2024-12-03","T",null,"2024-12-03","T",null,"2024-12-03","T"]
["2024-12-04",null,"2024-12-04","T",null,"2024-12-04","R",null,"2024-12-04","T",null,"2024-12-04","T",null,"2024-12-04","T"]
[{"$f":"C706","v":"2024-12-05"},null,"2024-12-05","R",null,"2024-12-05","T",null,"2024-12-05","T",null,"2024-12-05","T",null,"2024-12-05","T"]
["2024-12-06",null,"2024-12-06","R",null,"2024-12-06","T",null,"2024-12-06","T",null,"2024-12-06","T",null,"2024-12-06","T"]
["2024-12-07",null,"2024-12-07","R",null,"2024-12-07","T",null,"2024-12-07","R",null,"2024-12-07","R",null,"2024-12-07","T"]
["2024-12-08",null,"2024-12-08","T",null,"2024-12-08","R",null,"2024-12-08","R",null,"2024-12-08","R",null,"2024-12-08","R"]
["2024-12-09",null,"2024-12-09","T",null,"2024-12-09","R",null,"2024-12-09","T",null,"2024-12-09","T",null,"2024-12-09","R"]
["2024-12-10",null,"2024-12-10","R",null,"2024-12-10","T",null,"2024-12-10","T",null,"2024-12-10","T",null,"2024-12-10","T"]
["2024-12-11",null,"2024-12-11","R",null,"2024-12-11","T",null,"2024-12-11","T",null,"2024-12-11","T",null,"2024-12-11","T"]
["2024-12-12",null,"2024-12-12","T",null,"2024-12-12","R",null,"2024-12-12","T",null,"2024-12-12","T",null,"2024-12-12","T"]
["2024-12-13",null,"2024-12-13","T",null,"2024-12-13","R",null,"2024-12-13","T",null,"2024-12-13","T",null,"2024-12-13","T"]
["2024-12-14",null,"2024-12-14","T",null,"2024-12-14","R",null,"2024-12-14","R",null,"2024-12-14","T",null,"2024-12-14","R"]
["2024-12-15",null,"2024-12-15","R",null,"2024-12-15","T",null,"2024-12-15","R",null,"2024-12-15","R",null,"2024-12-15","R"]
["2024-12-16",null,"2024-12-16","R",null,"2024-12-16","T",null,"2024-12-16","T",null,"2024-12-16","R",null,"2024-12-16","T"]
["2024-12-17",null,"2024-12-17","T",null,"2024-12-17","R",null,"2024-12-17","T",null,"2024-12-17","T",null,"2024-12-17","T"]
["2024-12-18",null,"2024-12-18","T",null,"2024-12-18","R",null,"2024-12-18","T",null,"2024-12-18","T",null,"2024-12-18","T"]
["2024-12-19",null,"2024-12-19","R",null,"2024-12-19","T",null,"2024-12-19","T",null,"2024-12-19","T",null,"2024-12-19","T"]
["2024-12-20",null,"2024-12-20","R",null,"2024-12-20","T",null,"2024-12-20","T",null,"2024-12-20","T",null,"2024-12-20","T"]
["2024-12-21",null,"2024-12-21","R",null,"2024-12-21","T",null,"2024-12-21","R",null,"2024-12-21","R",null,"2024-12-21","T"]
["2024-12-22",null,"2024-12-22","T",null,"2024-12-22","R",null,"2024-12-22","R",null,"2024-12-22","R",null,"2024-12-22","R"]
["2024-12-23",null,"2024-12-23","T",null,"2024-12-23","R",null,"2024-12-23","T",null,"2024-12-23","T",null,"2024-12-23","R"]
["2024-12-24",null,"2024-12-24","R",null,"2024-12-24","T",null,"2024-12-24","T",null,"2024-12-24","T",null,"2024-12-24","T"]
["2024-12-25",null,"2024-12-25","R",null,"2024-12-25","T",null,"2024-12-25","T",null,"2024-12-25","T",null,"2024-12-25","T"]
["2024-12-26",null,"2024-12-26","T",null,"2024-12-26","R",null,"2024-12-26","T",null,"2024-12-26","T",null,"2024-12-26","T"]
["2024-12-27",null,"2024-12-27","T",null,"2024-12-27","R",null,"2024-12-27","T",null,"2024-12-27","T",null,"2024-12-27","T"]
["2024-12-28",null,"2024-12-28","T",null,"2024-12-28","R",null,"2024-12-28","R",null,"2024-12-28","T",null,"2024-12-28","R"]
["2024-12-29",null,"2024-12-29","R",null,"2024-12-29","T",null,"2024-12-29","R",null,"2024-12-29","R",null,"2024-12-29","R"]
["2024-12-30",null,"2024-12-30","R",null,"2024-12-30","T",null,"2024-12-30","T",null,"2024-12-30","R",null,"2024-12-30","T"]
["2024-12-31",null,"2024-12-31","T",null,"2024-12-31","R",null,"2024-12-31","T",null,"2024-12-31","T",null,"2024-12-31","T"]
["2025-01-01",null,"2025-01-01","T",null,"2025-01-01","R",null,"2025-01-01","T",null,"2025-01-01","T",null,"2025-01-01","T"]
["2025-01-02",null,"2025-01-02","R",null,"2025-01-02","T",null,"2025-01-02","T",null,"2025-01-02","T",null,"2025-01-02","T"]
["2025-01-03",null,"2025-01-03","R",null,"2025-01-03","T",null,"2025-01-03","T",null,"2025-01-03","T",null,"2025-01-03","T"]
["2025-01-04",null,"2025-01-04","R",null,"2025-01-04","T",null,"2025-01-04","R",null,"2025-01-04","R",null,"2025-01-04","T"]
["2025-01-05",null,"2025-01-05","T",null,"2025-01-05","R",null,"2025-01-05","R",null,"2025-01-05","R",null,"2025-01-05","R"]
["2025-01-06",null,"2025-01-06","T",null,"2025-01-06","R",null,"2025-01-06","T",null,"2025-01-06","T",null,"2025-01-06","R"]
["2025-01-07",null,"2025-01-07","R",null,"2025-01-07","T",null,"2025-01-07","T",null,"2025-01-07","T",null,"2025-01-07","T"]
["2025-01-08",null,"2025-01-08","R",null,"2025-01-08","T",null,"2025-01-08","T",null,"2025-01-08","T",null,"2025-01-08","T"]
["2025-01-09",null,"2025-01-09","T",null,"2025-01-09","R",null,"2025-01-09","T",null,"2025-01-09","T",null,"2025-01-09","T"]
["2025-01-10",null,"2025-01-10","T",null,"2025-01-10","R",null,"2025-01-10","T",null,"2025-01-10","T",null,"2025-01-10","T"]
["2025-01-11",null,"2025-01-11","T",null,"2025-01-11","R",null,"2025-01-11","R",null,"2025-01-11","T",null,"2025-01-11","R"]
["2025-01-12",null,"2025-01-12","R",null,"2025-01-12","T",null,"2025-01-12","R",null,"2025-01-12","R",null,"2025-01-12","R"]
["2025-01-13",null,"2025-01-13","R",null,"2025-01-13","T",null,"2025-01-13","T",null,"2025-01-13","R",null,"2025-01-13","T"]
["2025-01-14",null,"2025-01-14","T",null,"2025-01-14","R",null,"2025-01-14","T",null,"2025-01-14","T",null,"2025-01-14","T"]
["2025-01-15",null,"2025-01-15","T",null,"2025-01-15","R",null,"2025-01-15","T",null,"2025-01-15","T",null,"2025-01-15","T"]
["2025-01-16",null,"2025-01-16","R",null,"2025-01-16","T",null,"2025-01-16","T",null,"2025-01-16","T",null,"2025-01-16","T"]
["2025-01-17",null,"2025-01-17","R",null,"2025-01-17","T",null,"2025-01-17","T",null,"2025-01-17","T",null,"2025-01-17","T"]
["2025-01-18",null,"2025-01-18","R",null,"2025-01-18","T",null,"2025-01-18","R",null,"2025-01-18","R",null,"2025-01-18","T"]
["2025-01-19",null,"2025-01-19","T",null,"2025-01-19","R",null,"2025-01-19","R",null,"2025-01-19","R",null,"2025-01-19","R"]
["2025-01-20",null,"2025-01-20","T",null,"2025-01-20","R",null,"2025-01-20","T",null,"2025-01-20","T",null,"2025-01-20","R"]
["2025-01-21",null,"2025-01-21","R",null,"2025-01-21","T",null,"2025-01-21","T",null,"2025-01-21","T",null,"2025-01-21","T"]
["2025-01-22",null,"2025-01-22","R",null,"2025-01-22","T",null,"2025-01-22","T",null,"2025-01-22","T",null,"2025-01-22","T"]
["2025-01-23",null,"2025-01-23","T",null,"2025-01-23","R",null,"2025-01-23","T",null,"2025-01-23","T",null,"2025-01-23","T"]
["2025-01-24",null,"2025-01-24","T",null,"2025-01-24","R",null,"2025-01-24","T",null,"2025-01-24","T",null,"2025-01-24","T"]
["2025-01-25",null,"2025-01-25","T",null,"2025-01-25","R",null,"2025-01-25","R",null,"2025-01-25","T",null,"2025-01-25","R"]
["2025-01-26",null,"2025-01-26","R",null,"2025-01-26","T",null,"2025-01-26","R",null,"2025-01-26","R",null,"2025-01-26","R"]
["2025-01-27",null,"2025-01-27","R",null,"2025-01-27","T",null,"2025-01-27","T",null,"2025-01-27","R",null,"2025-01-27","T"]
["2025-01-28",null,"2025-01-28","T",null,"2025-01-28","R",null,"2025-01-28","T",null,"2025-01-28","T",null,"2025-01-28","T"]
["2025-01-29",null,"2025-01-29","T",null,"2025-01-29","R",null,"2025-01-29","T",null,"2025-01-29","T",null,"2025-01-29","T"]
["2025-01-30",null,"2025-01-30","R",null,"2025-01-30","T",null,"2025-01-30","T",null,"2025-01-30","T",null,"2025-01-30","T"]
["2025-01-31",null,"2025-01-31","R",null,"2025-01-31","T",null,"2025-01-31","T",null,"2025-01-31","T",null,"2025-01-31","T"]
["2025-02-01",null,"2025-02-01","R",null,"2025-02-01","T",null,"2025-02-01","R",null,"2025-02-01","R",null,"2025-02-01","T"]
["2025-02-02",null,"2025-02-02","T",null,"2025-02-02","R",null,"2025-02-02","R",null,"2025-02-02","R",null,"2025-02-02","R"]
["2025-02-03",null,"2025-02-03","T",null,"2025-02-03","R",null,"2025-02-03","T",null,"2025-02-03","T",null,"2025-02-03","R"]
["2025-02-04",null,"2025-02-04","R",null,"2025-02-04","T",null,"2025-02-04","T",null,"2025-02-04","T",null,"2025-02-04","T"]
["2025-02-05",null,"2025-02-05","R",null,"2025-02-05","T",null,"2025-02-05","T",null,"2025-02-05","T",null,"2025-02-05","T"]
["2025-02-06",null,"2025-02-06","T",null,"2025-02-06","R",null,"2025-02-06","T",null,"2025-02-06","T",null,"2025-02-06","T"]
[{"$f":"C770","v":"2025-02-07"},null,"2025-02-07","T",null,"2025-02-07","R",null,"2025-02-07","T",null,"2025-02-07","T",null,"2025-02-07","T"]
["2025-02-08",null,"2025-02-08","T",null,"2025-02-08","R",null,"2025-02-08","R",null,"2025-02-08","T",null,"2025-02-08","R"]
["2025-02-09",null,"2025-02-09","R",null,"2025-02-09","T",null,"2025-02-09","R",null,"2025-02-09","R",null,"2025-02-09","R"]
["2025-02-10",null,"2025-02-10","R",null,"2025-02-10","T",null,"2025-02-10","T",null,"2025-02-10","R",null,"2025-02-10","T"]
["2025-02-11",null,"2025-02-11","T",null,"2025-02-11","R",null,"2025-02-11","T",null,"2025-02-11","T",null,"2025-02-11","T"]
["2025-02-12",null,"2025-02-12","T",null,"2025-02-12","R",null,"2025-02-12","T",null,"2025-02-12","T",null,"2025-02-12","T"]
["2025-02-13",null,"2025-02-13","R",null,"2025-02-13","T",null,"2025-02-13","T",null,"2025-02-13","T",null,"2025-02-13","T"]
["2025-02-14",null,"2025-02-14","R",null,"2025-02-14","T",null,"2025-02-14","T",null,"2025-02-14","T",null,"2025-02-14","T"]
["2025-02-15",null,"2025-02-15","R",null,"2025-02-15","T",null,"2025-02-15","R",null,"2025-02-15","R",null,"2025-02-15","T"]
["2025-02-16",null,"2025-02-16","T",null,"2025-02-16","R",null,"2025-02-16","R",null,"2025-02-16","R",null,"2025-02-16","R"]
["2025-02-17",null,"2025-02-17","T",null,"2025-02-17","R",null,"2025-02-17","T",null,"2025-02-17","T",null,"2025-02-17","R"]
["2025-02-18",null,"2025-02-18","R",null,"2025-02-18","T",null,"2025-02-18","T",null,"2025-02-18","T",null,"2025-02-18","T"]
["2025-02-19",null,"2025-02-19","R",null,"2025-02-19","T",null,"2025-02-19","T",null,"2025-02-19","T",null,"2025-02-19","T"]
["2025-02-20",null,"2025-02-20","T",null,"2025-02-20","R",null,"2025-02-20","T",null,"2025-02-20","T",null,"2025-02-20","T"]
["2025-02-21",null,"2025-02-21","T",null,"2025-02-21","R",null,"2025-02-21","T",null,"2025-02-21","T",null,"2025-02-21","T"]
["2025-02-22",null,"2025-02-22","T",null,"2025-02-22","R",null,"2025-02-22","R",null,"2025-02-22","T",null,"2025-02-22","R"]
["2025-02-23",null,"2025-02-23","R",null,"2025-02-23","T",null,"2025-02-23","R",null,"2025-02-23","R",null,"2025-02-23","R"]
["2025-02-24",null,"2025-02-24","R",null,"2025-02-24","T",null,"2025-02-24","T",null,"2025-02-24","R",null,"2025-02-24","T"]
["2025-02-25",null,"2025-02-25","T",null,"2025-02-25","R",null,"2025-02-25","T",null,"2025-02-25","T",null,"2025-02-25","T"]
["2025-02-26",null,"2025-02-26","T",null,"2025-02-26","R",null,"2025-02-26","T",null,"2025-02-26","T",null,"2025-02-26","T"]
["2025-02-27",null,"2025-02-27","R",null,"2025-02-27","T",null,"2025-02-27","T",null,"2025-02-27","T",null,"2025-02-27","T"]
["2025-02-28",null,"2025-02-28","R",null,"2025-02-28","T",null,"2025-02-28","T",null,"2025-02-28","T",null,"2025-02-28","T"]
["2025-03-01",null,"2025-03-01","R",null,"2025-03-01","T",null,"2025-03-01","R",null,"2025-03-01","R",null,"2025-03-01","T"]
["2025-03-02",null,"2025-03-02","T",null,"2025-03-02","R",null,"2025-03-02","R",null,"2025-03-02","R",null,"2025-03-02","R"]
["2025-03-03",null,"2025-03-03","T",null,"2025-03-03","R",null,"2025-03-03","T",null,"2025-03-03","T",null,"2025-03-03","R"]
["2025-03-04",null,"2025-03-04","R",null,"2025-03-04","T",null,"2025-03-04","T",null,"2025-03-04","T",null,"2025-03-04","T"]
["2025-03-05",null,"2025-03-05","R",null,"2025-03-05","T",null,"2025-03-05","T",null,"2025-03-05","T",null,"2025-03-05","T"]
["2025-03-06",null,"2025-03-06","T",null,"2025-03-06","R",null,"2025-03-06","T",null,"2025-03-06","T",null,"2025-03-06","T"]
["2025-03-07",null,"2025-03-07","T",null,"2025-03-07","R",null,"2025-03-07","T",null,"2025-03-07","T",null,"2025-03-07","T"]
["2025-03-08",null,"2025-03-08","T",null,"2025-03-08","R",null,"2025-03-08","R",null,"2025-03-08","T",null,"2025-03-08","R"]
["2025-03-09",null,"2025-03-09","R",null,"2025-03-09","T",null,"2025-03-09","R",null,"2025-03-09","R",null,"2025-03-09","R"]
["2025-03-10",null,"2025-03-10","R",null,"2025-03-10","T",null,"2025-03-10","T",null,"2025-03-10","R",null,"2025-03-10","T"]
["2025-03-11",null,"2025-03-11","T",null,"2025-03-11","R",null,"2025-03-11","T",null,"2025-03-11","T",null,"2025-03-11","T"]
["2025-03-12",null,"2025-03-12","T",null,"2025-03-12","R",null,"2025-03-12","T",null,"2025-03-12","T",null,"2025-03-12","T"]
["2025-03-13",null,"2025-03-13","R",null,"2025-03-13","T",null,"2025-03-13","T",null,"2025-03-13","T",null,"2025-03-13","T"]
["2025-03-14",null,"2025-03-14","R",null,"2025-03-14","T",null,"2025-03-14","T",null,"2025-03-14","T",null,"2025-03-14","T"]
["2025-03-15",null,"2025-03-15","R",null,"2025-03-15","T",null,"2025-03-15","R",null,"2025-03-15","R",null,"2025-03-15","T"]
["2025-03-16",null,"2025-03-16","T",null,"2025-03-16","R",null,"2025-03-16","R",null,"2025-03-16","R",null,"2025-03-16","R"]
["2025-03-17",null,"2025-03-17","T",null,"2025-03-17","R",null,"2025-03-17","T",null,"2025-03-17","T",null,"2025-03-17","R"]
["2025-03-18",null,"2025-03-18","R",null,"2025-03-18","T",null,"2025-03-18","T",null,"2025-03-18","T",null,"2025-03-18","T"]
["2025-03-19",null,"2025-03-19","R",null,"2025-03-19","T",null,"2025-03-19","T",null,"2025-03-19","T",null,"2025-03-19","T"]
["2025-03-20",null,"2025-03-20","T",null,"2025-03-20","R",null,"2025-03-20","T",null,"2025-03-20","T",null,"2025-03-20","T"]
["2025-03-21",null,"2025-03-21","T",null,"2025-03-21","R",null,"2025-03-21","T",null,"2025-03-21","T",null,"2025-03-21","T"]
["2025-03-22",null,"2025-03-22","T",null,"2025-03-22","R",null,"2025-03-22","R",null,"2025-03-22","T",null,"2025-03-22","R"]
["2025-03-23",null,"2025-03-23","R",null,"2025-03-23","T",null,"2025-03-23","R",null,"2025-03-23","R",null,"2025-03-23","R"]
["2025-03-24",null,"2025-03-24","R",null,"2025-03-24","T",null,"2025-03-24","T",null,"2025-03-24","R",null,"2025-03-24","T"]
["2025-03-25",null,"2025-03-25","T",null,"2025-03-25","R",null,"2025-03-25","T",null,"2025-03-25","T",null,"2025-03-25","T"]
["2025-03-26",null,"2025-03-26","T",null,"2025-03-26","R",null,"2025-03-26","T",null,"2025-03-26","T",null,"2025-03-26","T"]
["2025-03-27",null,"2025-03-27","R",null,"2025-03-27","T",null,"2025-03-27","T",null,"2025-03-27","T",null,"2025-03-27","T"]
["2025-03-28",null,"2025-03-28","R",null,"2025-03-28","T",null,"2025-03-28","T",null,"2025-03-28","T",null,"2025-03-28","T"]
["2025-03-29",null,"2025-03-29","R",null,"2025-03-29","T",null,"2025-03-29","R",null,"2025-03-29","R",null,"2025-03-29","T"]
["2025-03-30",null,"2025-03-30","T",null,"2025-03-30","R",null,"2025-03-30","R",null,"2025-03-30","R",null,"2025-03-30","R"]
["2025-03-31",null,"2025-03-31","T",null,"2025-03-31","R",null,"2025-03-31","T",null,"2025-03-31","T",null,"2025-03-31","R"]
["2025-04-01",null,"2025-04-01","R",null,"2025-04-01","T",null,"2025-04-01","T",null,"2025-04-01","T",null,"2025-04-01","T"]
["2025-04-02",null,"2025-04-02","R",null,"2025-04-02","T",null,"2025-04-02","T",null,"2025-04-02","T",null,"2025-04-02","T"]
["2025-04-03",null,"2025-04-03","T",null,"2025-04-03","R",null,"2025-04-03","T",null,"2025-04-03","T",null,"2025-04-03","T"]
["2025-04-04",null,"2025-04-04","T",null,"2025-04-04","R",null,"2025-04-04","T",null,"2025-04-04","T",null,"2025-04-04","T"]
["2025-04-05",null,"2025-04-05","T",null,"2025-04-05","R",null,"2025-04-05","R",null,"2025-04-05","T",null,"2025-04-05","R"]
["2025-04-06",null,"2025-04-06","R",null,"2025-04-06","T",null,"2025-04-06","R",null,"2025-04-06","R",null,"2025-04-06","R"]
["2025-04-07",null,"2025-04-07","R",null,"2025-04-07","T",null,"2025-04-07","T",null,"2025-04-07","R",null,"2025-04-07","T"]
["2025-04-08",null,"2025-04-08","T",null,"2025-04-08","R",null,"2025-04-08","T",null,"2025-04-08","T",null,"2025-04-08","T"]
["2025-04-09",null,"2025-04-09","T",null,"2025-04-09","R",null,"2025-04-09","T",null,"2025-04-09","T",null,"2025-04-09","T"]
["2025-04-10",null,"2025-04-10","R",null,"2025-04-10","T",null,"2025-04-10","T",null,"2025-04-10","T",null,"2025-04-10","T"]
["2025-04-11",null,"2025-04-11","R",null,"2025-04-11","T",null,"2025-04-11","R",null,"2025-04-11","T",null,"2025-04-11","T"]
[{"$f":"C834","v":"2025-04-12"},null,"2025-04-12","R",null,"2025-04-12","T",null,"2025-04-12","R",null,"2025-04-12","R",null,"2025-04-12","T"]
["2025-04-13",null,"2025-04-13","T",null,"2025-04-13","R",null,"2025-04-13","T",null,"2025-04-13","R",null,"2025-04-13","R"]
["2025-04-14",null,"2025-04-14","T",null,"2025-04-14","R",null,"2025-04-14","T",null,"2025-04-14","T",null,"2025-04-14","R"]
["2025-04-15",null,"2025-04-15","R",null,"2025-04-15","T",null,"2025-04-15","T",null,"2025-04-15","T",null,"2025-04-15","T"]
["2025-04-16",null,"2025-04-16","R",null,"2025-04-16","T",null,"2025-04-16","T",null,"2025-04-16","T",null,"2025-04-16","T"]
["2025-04-17",null,"2025-04-17","T",null,"2025-04-17","R",null,"2025-04-17","T",null,"2025-04-17","T",null,"2025-04-17","T"]
["2025-04-18",null,"2025-04-18","T",null,"2025-04-18","R",null,"2025-04-18","T",null,"2025-04-18","T",null,"2025-04-18","T"]
["2025-04-19",null,"2025-04-19","T",null,"2025-04-19","R",null,"2025-04-19","R",null,"2025-04-19","T",null,"2025-04-19","R"]
["2025-04-20",null,"2025-04-20","R",null,"2025-04-20","T",null,"2025-04-20","R",null,"2025-04-20","R",null,"2025-04-20","R"]
["2025-04-21",null,"2025-04-21","R",null,"2025-04-21","T",null,"2025-04-21","T",null,"2025-04-21","R",null,"2025-04-21","T"]
["2025-04-22",null,"2025-04-22","T",null,"2025-04-22","R",null,"2025-04-22","T",null,"2025-04-22","T",null,"2025-04-22","T"]
["2025-04-23",null,"2025-04-23","T",null,"2025-04-23","R",null,"2025-04-23","T",null,"2025-04-23","T",null,"2025-04-23","T"]
["2025-04-24",null,"2025-04-24","R",null,"2025-04-24","T",null,"2025-04-24","T",null,"2025-04-24","T",null,"2025-04-24","T"]
["2025-04-25",null,"2025-04-25","R",null,"2025-04-25","T",null,"2025-04-25","R",null,"2025-04-25","T",null,"2025-04-25","T"]
["2025-04-26",null,"2025-04-26","R",null,"2025-04-26","T",null,"2025-04-26","R",null,"2025-04-26","R",null,"2025-04-26","T"]
["2025-04-27",null,"2025-04-27","T",null,"2025-04-27","R",null,"2025-04-27","T",null,"2025-04-27","R",null,"2025-04-27","R"]
["2025-04-28",null,"2025-04-28","T",null,"2025-04-28","R",null,"2025-04-28","T",null,"2025-04-28","T",null,"2025-04-28","R"]
["2025-04-29",null,"2025-04-29","R",null,"2025-04-29","T",null,"2025-04-29","T",null,"2025-04-29","T",null,"2025-04-29","T"]
["2025-04-30",null,"2025-04-30","R",null,"2025-04-30","T",null,"2025-04-30","T",null,"2025-04-30","T",null,"2025-04-30","T"]
["2025-05-01",null,"2025-05-01","T",null,"2025-05-01","R",null,"2025-05-01","T",null,"2025-05-01","T",null,"2025-05-01","T"]
["2025-05-02",null,"2025-05-02","T",null,"2025-05-02","R",null,"2025-05-02","T",null,"2025-05-02","T",null,"2025-05-02","T"]
["2025-05-03",null,"2025-05-03","T",null,"2025-05-03","R",null,"2025-05-03","R",null,"2025-05-03","T",null,"2025-05-03","R"]
["2025-05-04",null,"2025-05-04","R",null,"2025-05-04","T",null,"2025-05-04","R",null,"2025-05-04","R",null,"2025-05-04","R"]
["2025-05-05",null,"2025-05-05","R",null,"2025-05-05","T",null,"2025-05-05","T",null,"2025-05-05","R",null,"2025-05-05","T"]
["2025-05-06",null,"2025-05-06","T",null,"2025-05-06","R",null,"2025-05-06","T",null,"2025-05-06","T",null,"2025-05-06","T"]
["2025-05-07",null,"2025-05-07","T",null,"2025-05-07","R",null,"2025-05-07","T",null,"2025-05-07","T",null,"2025-05-07","T"]
["2025-05-08",null,"2025-05-08","R",null,"2025-05-08","T",null,"2025-05-08","T",null,"2025-05-08","T",null,"2025-05-08","T"]
["2025-05-09",null,"2025-05-09","R",null,"2025-05-09","T",null,"2025-05-09","R",null,"2025-05-09","T",null,"2025-05-09","T"]
["2025-05-10",null,"2025-05-10","R",null,"2025-05-10","T",null,"2025-05-10","R",null,"2025-05-10","R",null,"2025-05-10","T"]
["2025-05-11",null,"2025-05-11","T",null,"2025-05-11","R",null,"2025-05-11","T",null,"2025-05-11","R",null,"2025-05-11","R"]
["2025-05-12",null,"2025-05-12","T",null,"2025-05-12","R",null,"2025-05-12","T",null,"2025-05-12","T",null,"2025-05-12","R"]
["2025-05-13",null,"2025-05-13","R",null,"2025-05-13","T",null,"2025-05-13","T",null,"2025-05-13","T",null,"2025-05-13","T"]
["2025-05-14",null,"2025-05-14","R",null,"2025-05-14","T",null,"2025-05-14","T",null,"2025-05-14","T",null,"2025-05-14","T"]
["2025-05-15",null,"2025-05-15","T",null,"2025-05-15","R",null,"2025-05-15","T",null,"2025-05-15","T",null,"2025-05-15","T"]
["2025-05-16",null,"2025-05-16","T",null,"2025-05-16","R",null,"2025-05-16","T",null,"2025-05-16","T",null,"2025-05-16","T"]
["2025-05-17",null,"2025-05-17","T",null,"2025-05-17","R",null,"2025-05-17","R",null,"2025-05-17","T",null,"2025-05-17","R"]
["2025-05-18",null,"2025-05-18","R",null,"2025-05-18","T",null,"2025-05-18","R",null,"2025-05-18","R",null,"2025-05-18","R"]
["2025-05-19",null,"2025-05-19","R",null,"2025-05-19","T",null,"2025-05-19","T",null,"2025-05-19","R",null,"2025-05-19","T"]
["2025-05-20",null,"2025-05-20","T",null,"2025-05-20","R",null,"2025-05-20","T",null,"2025-05-20","T",null,"2025-05-20","T"]
["2025-05-21",null,"2025-05-21","T",null,"2025-05-21","R",null,"2025-05-21","T",null,"2025-05-21","T",null,"2025-05-21","T"]
["2025-05-22",null,"2025-05-22","R",null,"2025-05-22","T",null,"2025-05-22","T",null,"2025-05-22","T",null,"2025-05-22","T"]
["2025-05-23",null,"2025-05-23","R",null,"2025-05-23","T",null,"2025-05-23","R",null,"2025-05-23","T",null,"2025-05-23","T"]
["2025-05-24",null,"2025-05-24","R",null,"2025-05-24","T",null,"2025-05-24","R",null,"2025-05-24","R",null,"2025-05-24","T"]
["2025-05-25",null,"2025-05-25","T",null,"2025-05-25","R",null,"2025-05-25","T",null,"2025-05-25","R",null,"2025-05-25","R"]
["2025-05-26",null,"2025-05-26","T",null,"2025-05-26","R",null,"2025-05-26","T",null,"2025-05-26","T",null,"2025-05-26","R"]
["2025-05-27",null,"2025-05-27","R",null,"2025-05-27","T",null,"2025-05-27","T",null,"2025-05-27","T",null,"2025-05-27","T"]
["2025-05-28",null,"2025-05-28","R",null,"2025-05-28","T",null,"2025-05-28","T",null,"2025-05-28","T",null,"2025-05-28","T"]
["2025-05-29",null,"2025-05-29","T",null,"2025-05-29","R",null,"2025-05-29","T",null,"2025-05-29","T",null,"2025-05-29","T"]
["2025-05-30",null,"2025-05-30","T",null,"2025-05-30","R",null,"2025-05-30","T",null,"2025-05-30","T",null,"2025-05-30","T"]
["2025-05-31",null,"2025-05-31","T",null,"2025-05-31","R",null,"2025-05-31","R",null,"2025-05-31","T",null,"2025-05-31","R"]
["2025-06-01",null,"2025-06-01","R",null,"2025-06-01","T",null,"2025-06-01","R",null,"2025-06-01","R",null,"2025-06-01","R"]
["2025-06-02",null,"2025-06-02","R",null,"2025-06-02","T",null,"2025-06-02","T",null,"2025-06-02","R",null,"2025-06-02","T"]
["2025-06-03",null,"2025-06-03","T",null,"2025-06-03","R",null,"2025-06-03","T",null,"2025-06-03","T",null,"2025-06-03","T"]
["2025-06-04",null,"2025-06-04","T",null,"2025-06-04","R",null,"2025-06-04","T",null,"2025-06-04","T",null,"2025-06-04","T"]
["2025-06-05",null,"2025-06-05","R",null,"2025-06-05","T",null,"2025-06-05","T",null,"2025-06-05","T",null,"2025-06-05","T"]
["2025-06-06",null,"2025-06-06","R",null,"2025-06-06","T",null,"2025-06-06","R",null,"2025-06-06","T",null,"2025-06-06","T"]
["2025-06-07",null,"2025-06-07","R",null,"2025-06-07","T",null,"2025-06-07","R",null,"2025-06-07","R",null,"2025-06-07","T"]
["2025-06-08",null,"2025-06-08","T",null,"2025-06-08","R",null,"2025-06-08","T",null,"2025-06-08","R",null,"2025-06-08","R"]
["2025-06-09",null,"2025-06-09","T",null,"2025-06-09","R",null,"2025-06-09","T",null,"2025-06-09","T",null,"2025-06-09","R"]
["2025-06-10",null,"2025-06-10","R",null,"2025-06-10","T",null,"2025-06-10","T",null,"2025-06-10","T",null,"2025-06-10","T"]
["2025-06-11",null,"2025-06-11","R",null,"2025-06-11","T",null,"2025-06-11","T",null,"2025-06-11","T",null,"2025-06-11","T"]
["2025-06-12",null,"2025-06-12","T",null,"2025-06-12","R",null,"2025-06-12","T",null,"2025-06-12","T",null,"2025-06-12","T"]
["2025-06-13",null,"2025-06-13","T",null,"2025-06-13","R",null,"2025-06-13","T",null,"2025-06-13","T",null,"2025-06-13","T"]
["2025-06-14",null,"2025-06-14","T",null,"2025-06-14","R",null,"2025-06-14","R",null,"2025-06-14","T",null,"2025-06-14","R"]
[{"$f":"C898","v":"2025-06-15"},null,"2025-06-15","R",null,"2025-06-15","T",null,"2025-06-15","R",null,"2025-06-15","R",null,"2025-06-15","R"]
["2025-06-16",null,"2025-06-16","R",null,"2025-06-16","T",null,"2025-06-16","T",null,"2025-06-16","R",null,"2025-06-16","T"]
["2025-06-17",null,"2025-06-17","T",null,"2025-06-17","R",null,"2025-06-17","T",null,"2025-06-17","T",null,"2025-06-17","T"]
["2025-06-18",null,"2025-06-18","T",null,"2025-06-18","R",null,"2025-06-18","T",null,"2025-06-18","T",null,"2025-06-18","T"]
["2025-06-19",null,"2025-06-19","R",null,"2025-06-19","T",null,"2025-06-19","T",null,"2025-06-19","T",null,"2025-06-19","T"]
["2025-06-20",null,"2025-06-20","R",null,"2025-06-20","T",null,"2025-06-20","R",null,"2025-06-20","T",null,"2025-06-20","T"]
["2025-06-21",null,"2025-06-21","R",null,"2025-06-21","T",null,"2025-06-21","R",null,"2025-06-21","R",null,"2025-06-21","T"]
["2025-06-22",null,"2025-06-22","T",null,"2025-06-22","R",null,"2025-06-22","T",null,"2025-06-22","R",null,"2025-06-22","R"]
["2025-06-23",null,"2025-06-23","T",null,"2025-06-23","R",null,"2025-06-23","T",null,"2025-06-23","T",null,"2025-06-23","R"]
["2025-06-24",null,"2025-06-24","R",null,"2025-06-24","T",null,"2025-06-24","T",null,"2025-06-24","T",null,"2025-06-24","T"]
["2025-06-25",null,"2025-06-25","R",null,"2025-06-25","T",null,"2025-06-25","T",null,"2025-06-25","T",null,"2025-06-25","T"]
["2025-06-26",null,"2025-06-26","T",null,"2025-06-26","R",null,"2025-06-26","T",null,"2025-06-26","T",null,"2025-06-26","T"]
["2025-06-27",null,"2025-06-27","T",null,"2025-06-27","R",null,"2025-06-27","T",null,"2025-06-27","T",null,"2025-06-27","T"]
["2025-06-28",null,"2025-06-28","T",null,"2025-06-28","R",null,"2025-06-28","R",null,"2025-06-28","T",null,"2025-06-28","R"]
["2025-06-29",null,"2025-06-29","R",null,"2025-06-29","T",null,"2025-06-29","R",null,"2025-06-29","R",null,"2025-06-29","R"]
["2025-06-30",null,"2025-06-30","R",null,"2025-06-30","T",null,"2025-06-30","T",null,"2025-06-30","R",null,"2025-06-30","T"]
["2025-07-01",null,"2025-07-01","T",null,"2025-07-01","R",null,"2025-07-01","T",null,"2025-07-01","T",null,"2025-07-01","T"]
["2025-07-02",null,"2025-07-02","T",null,"2025-07-02","R",null,"2025-07-02","T",null,"2025-07-02","T",null,"2025-07-02","T"]
["2025-07-03",null,"2025-07-03","R",null,"2025-07-03","T",null,"2025-07-03","T",null,"2025-07-03","T",null,"2025-07-03","T"]
["2025-07-04",null,"2025-07-04","R",null,"2025-07-04","T",null,"2025-07-04","R",null,"2025-07-04","T",null,"2025-07-04","T"]
["2025-07-05",null,"2025-07-05","R",null,"2025-07-05","T",null,"2025-07-05","R",null,"2025-07-05","R",null,"2025-07-05","T"]
["2025-07-06",null,"2025-07-06","T",null,"2025-07-06","R",null,"2025-07-06","T",null,"2025-07-06","R",null,"2025-07-06","R"]
["2025-07-07",null,"2025-07-07","T",null,"2025-07-07","R",null,"2025-07-07","T",null,"2025-07-07","T",null,"2025-07-07","R"]
["2025-07-08",null,"2025-07-08","R",null,"2025-07-08","T",null,"2025-07-08","T",null,"2025-07-08","T",null,"2025-07-08","T"]
["2025-07-09",null,"2025-07-09","R",null,"2025-07-09","T",null,"2025-07-09","T",null,"2025-07-09","T",null,"2025-07-09","T"]
["2025-07-10",null,"2025-07-10","T",null,"2025-07-10","R",null,"2025-07-10","T",null,"2025-07-10","T",null,"2025-07-10","T"]
["2025-07-11",null,"2025-07-11","T",null,"2025-07-11","R",null,"2025-07-11","T",null,"2025-07-11","T",null,"2025-07-11","T"]
["2025-07-12",null,"2025-07-12","T",null,"2025-07-12","R",null,"2025-07-12","R",null,"2025-07-12","T",null,"2025-07-12","R"]
["2025-07-13",null,"2025-07-13","R",null,"2025-07-13","T",null,"2025-07-13","R",null,"2025-07-13","R",null,"2025-07-13","R"]
["2025-07-14",null,"2025-07-14","R",null,"2025-07-14","T",null,"2025-07-14","T",null,"2025-07-14","R",null,"2025-07-14","T"]
["2025-07-15",null,"2025-07-15","T",null,"2025-07-15","R",null,"2025-07-15","T",null,"2025-07-15","T",null,"2025-07-15","T"]
["2025-07-16",null,"2025-07-16","T",null,"2025-07-16","R",null,"2025-07-16","T",null,"2025-07-16","T",null,"2025-07-16","T"]
["2025-07-17",null,"2025-07-17","R",null,"2025-07-17","T",null,"2025-07-17","T",null,"2025-07-17","T",null,"2025-07-17","T"]
["2025-07-18",null,"2025-07-18","R",null,"2025-07-18","T",null,"2025-07-18","R",null,"2025-07-18","T",null,"2025-07-18","T"]
["2025-07-19",null,"2025-07-19","R",null,"2025-07-19","T",null,"2025-07-19","R",null,"2025-07-19","R",null,"2025-07-19","T"]
["2025-07-20",null,"2025-07-20","T",null,"2025-07-20","R",null,"2025-07-20","T",null,"2025-07-20","R",null,"2025-07-20","R"]
["2025-07-21",null,"2025-07-21","T",null,"2025-07-21","R",null,"2025-07-21","T",null,"2025-07-21","T",null,"2025-07-21","R"]
["2025-07-22",null,"2025-07-22","R",null,"2025-07-22","T",null,"2025-07-22","T",null,"2025-07-22","T",null,"2025-07-22","T"]
["2025-07-23",null,"2025-07-23","R",null,"2025-07-23","T",null,"2025-07-23","T",null,"2025-07-23","T",null,"2025-07-23","T"]
["2025-07-24",null,"2025-07-24","T",null,"2025-07-24","R",null,"2025-07-24","T",null,"2025-07-24","T",null,"2025-07-24","T"]
["2025-07-25",null,"2025-07-25","T",null,"2025-07-25","R",null,"2025-07-25","T",null,"2025-07-25","T",null,"2025-07-25","T"]
["2025-07-26",null,"2025-07-26","T",null,"2025-07-26","R",null,"2025-07-26","R",null,"2025-07-26","T",null,"2025-07-26","R"]
["2025-07-27",null,"2025-07-27","R",null,"2025-07-27","T",null,"2025-07-27","R",null,"2025-07-27","R",null,"2025-07-27","R"]
["2025-07-28",null,"2025-07-28","R",null,"2025-07-28","T",null,"2025-07-28","T",null,"2025-07-28","R",null,"2025-07-28","T"]
["2025-07-29",null,"2025-07-29","T",null,"2025-07-29","R",null,"2025-07-29","T",null,"2025-07-29","T",null,"2025-07-29","T"]
["2025-07-30",null,"2025-07-30","T",null,"2025-07-30","R",null,"2025-07-30","T",null,"2025-07-30","T",null,"2025-07-30","T"]
["2025-07-31",null,"2025-07-31","R",null,"2025-07-31","T",null,"2025-07-31","T",null,"2025-07-31","T",null,"2025-07-31","T"]
["2025-08-01",null,"2025-08-01","R",null,"2025-08-01","T",null,"2025-08-01","R",null,"2025-08-01","T",null,"2025-08-01","T"]
["2025-08-02",null,"2025-08-02","R",null,"2025-08-02","T",null,"2025-08-02","R",null,"2025-08-02","R",null,"2025-08-02","T"]
["2025-08-03",null,"2025-08-03","T",null,"2025-08-03","R",null,"2025-08-03","T",null,"2025-08-03","R",null,"2025-08-03","R"]
["2025-08-04",null,"2025-08-04","T",null,"2025-08-04","R",null,"2025-08-04","T",null,"2025-08-04","T",null,"2025-08-04","R"]
["2025-08-05",null,"2025-08-05","R",null,"2025-08-05","T",null,"2025-08-05","T",null,"2025-08-05","T",null,"2025-08-05","T"]
["2025-08-06",null,"2025-08-06","R",null,"2025-08-06","T",null,"2025-08-06","T",null,"2025-08-06","T",null,"2025-08-06","T"]
["2025-08-07",null,"2025-08-07","T",null,"2025-08-07","R",null,"2025-08-07","T",null,"2025-08-07","T",null,"2025-08-07","T"]
["2025-08-08",null,"2025-08-08","T",null,"2025-08-08","R",null,"2025-08-08","T",null,"2025-08-08","T",null,"2025-08-08","T"]
["2025-08-09",null,"2025-08-09","T",null,"2025-08-09","R",null,"2025-08-09","R",null,"2025-08-09","T",null,"2025-08-09","R"]
["2025-08-10",null,"2025-08-10","R",null,"2025-08-10","T",null,"2025-08-10","R",null,"2025-08-10","R",null,"2025-08-10","R"]
["2025-08-11",null,"2025-08-11","R",null,"2025-08-11","T",null,"2025-08-11","T",null,"2025-08-11","R",null,"2025-08-11","T"]
["2025-08-12",null,"2025-08-12","T",null,"2025-08-12","R",null,"2025-08-12","T",null,"2025-08-12","T",null,"2025-08-12","T"]
["2025-08-13",null,"2025-08-13","T",null,"2025-08-13","R",null,"2025-08-13","T",null,"2025-08-13","T",null,"2025-08-13","T"]
["2025-08-14",null,"2025-08-14","R",null,"2025-08-14","T",null,"2025-08-14","T",null,"2025-08-14","T",null,"2025-08-14","T"]
["2025-08-15",null,"2025-08-15","R",null,"2025-08-15","T",null,"2025-08-15","R",null,"2025-08-15","T",null,"2025-08-15","T"]
["2025-08-16",null,"2025-08-16","R",null,"2025-08-16","T",null,"2025-08-16","R",null,"2025-08-16","R",null,"2025-08-16","T"]
["2025-08-17",null,"2025-08-17","T",null,"2025-08-17","R",null,"2025-08-17","T",null,"2025-08-17","R",null,"2025-08-17","R"]
[{"$f":"C962","v":"2025-08-18"},null,"2025-08-18","T",null,"2025-08-18","R",null,"2025-08-18","T",null,"2025-08-18","T",null,"2025-08-18","R"]
["2025-08-19",null,"2025-08-19","R",null,"2025-08-19","T",null,"2025-08-19","T",null,"2025-08-19","T",null,"2025-08-19","T"]
["2025-08-20",null,"2025-08-20","R",null,"2025-08-20","T",null,"2025-08-20","T",null,"2025-08-20","T",null,"2025-08-20","T"]
["2025-08-21",null,"2025-08-21","T",null,"2025-08-21","R",null,"2025-08-21","T",null,"2025-08-21","T",null,"2025-08-21","T"]
["2025-08-22",null,"2025-08-22","T",null,"2025-08-22","R",null,"2025-08-22","T",null,"2025-08-22","T",null,"2025-08-22","T"]
["2025-08-23",null,"2025-08-23","T",null,"2025-08-23","R",null,"2025-08-23","R",null,"2025-08-23","T",null,"2025-08-23","R"]
["2025-08-24",null,"2025-08-24","R",null,"2025-08-24","T",null,"2025-08-24","R",null,"2025-08-24","R",null,"2025-08-24","R"]
["2025-08-25",null,"2025-08-25","R",null,"2025-08-25","T",null,"2025-08-25","T",null,"2025-08-25","R",null,"2025-08-25","T"]
["2025-08-26",null,"2025-08-26","T",null,"2025-08-26","R",null,"2025-08-26","T",null,"2025-08-26","T",null,"2025-08-26","T"]
["2025-08-27",null,"2025-08-27","T",null,"2025-08-27","R",null,"2025-08-27","T",null,"2025-08-27","T",null,"2025-08-27","T"]
["2025-08-28",null,"2025-08-28","R",null,"2025-08-28","T",null,"2025-08-28","T",null,"2025-08-28","T",null,"2025-08-28","T"]
["2025-08-29",null,"2025-08-29","R",null,"2025-08-29","T",null,"2025-08-29","R",null,"2025-08-29","T",null,"2025-08-29","T"]
["2025-08-30",null,"2025-08-30","R",null,"2025-08-30","T",null,"2025-08-30","R",null,"2025-08-30","R",null,"2025-08-30","T"]
["2025-08-31",null,"2025-08-31","T",null,"2025-08-31","R",null,"2025-08-31","T",null,"2025-08-31","R",null,"2025-08-31","R"]
["2025-09-01",null,"2025-09-01","T",null,"2025-09-01","R",null,"2025-09-01","T",null,"2025-09-01","T",null,"2025-09-01","R"]
["2025-09-02",null,"2025-09-02","R",null,"2025-09-02","T",null,"2025-09-02","T",null,"2025-09-02","T",null,"2025-09-02","T"]
["2025-09-03",null,"2025-09-03","R",null,"2025-09-03","T",null,"2025-09-03","T",null,"2025-09-03","T",null,"2025-09-03","T"]
["2025-09-04",null,"2025-09-04","T",null,"2025-09-04","R",null,"2025-09-04","T",null,"2025-09-04","T",null,"2025-09-04","T"]
["2025-09-05",null,"2025-09-05","T",null,"2025-09-05","R",null,"2025-09-05","T",null,"2025-09-05","T",null,"2025-09-05","T"]
["2025-09-06",null,"2025-09-06","T",null,"2025-09-06","R",null,"2025-09-06","R",null,"2025-09-06","T",null,"2025-09-06","R"]
["2025-09-07",null,"2025-09-07","R",null,"2025-09-07","T",null,"2025-09-07","R",null,"2025-09-07","R",null,"2025-09-07","R"]
["2025-09-08",null,"2025-09-08","R",null,"2025-09-08","T",null,"2025-09-08","T",null,"2025-09-08","R",null,"2025-09-08","T"]
["2025-09-09",null,"2025-09-09","T",null,"2025-09-09","R",null,"2025-09-09","T",null,"2025-09-09","T",null,"2025-09-09","T"]
["2025-09-10",null,"2025-09-10","T",null,"2025-09-10","R",null,"2025-09-10","T",null,"2025-09-10","T",null,"2025-09-10","T"]
["2025-09-11",null,"2025-09-11","R",null,"2025-09-11","T",null,"2025-09-11","T",null,"2025-09-11","T",null,"2025-09-11","T"]
["2025-09-12",null,"2025-09-12","R",null,"2025-09-12","T",null,"2025-09-12","R",null,"2025-09-12","T",null,"2025-09-12","T"]
["2025-09-13",null,"2025-09-13","R",null,"2025-09-13","T",null,"2025-09-13","R",null,"2025-09-13","R",null,"2025-09-13","T"]
["2025-09-14",null,"2025-09-14","T",null,"2025-09-14","R",null,"2025-09-14","T",null,"2025-09-14","R",null,"2025-09-14","R"]
["2025-09-15",null,"2025-09-15","T",null,"2025-09-15","R",null,"2025-09-15","T",null,"2025-09-15","T",null,"2025-09-15","R"]
["2025-09-16",null,"2025-09-16","R",null,"2025-09-16","T",null,"2025-09-16","T",null,"2025-09-16","T",null,"2025-09-16","T"]
["2025-09-17",null,"2025-09-17","R",null,"2025-09-17","T",null,"2025-09-17","T",null,"2025-09-17","T",null,"2025-09-17","T"]
["2025-09-18",null,"2025-09-18","T",null,"2025-09-18","R",null,"2025-09-18","T",null,"2025-09-18","T",null,"2025-09-18","T"]
["2025-09-19",null,"2025-09-19","T",null,"2025-09-19","R",null,"2025-09-19","T",null,"2025-09-19","T",null,"2025-09-19","T"]
["2025-09-20",null,"2025-09-20","T",null,"2025-09-20","R",null,"2025-09-20","R",null,"2025-09-20","T",null,"2025-09-20","R"]
["2025-09-21",null,"2025-09-21","R",null,"2025-09-21","T",null,"2025-09-21","R",null,"2025-09-21","R",null,"2025-09-21","R"]
["2025-09-22",null,"2025-09-22","R",null,"2025-09-22","T",null,"2025-09-22","T",null,"2025-09-22","R",null,"2025-09-22","T"]
["2025-09-23",null,"2025-09-23","T",null,"2025-09-23","R",null,"2025-09-23","T",null,"2025-09-23","T",null,"2025-09-23","T"]
["2025-09-24",null,"2025-09-24","T",null,"2025-09-24","R",null,"2025-09-24","T",null,"2025-09-24","T",null,"2025-09-24","T"]
["2025-09-25",null,"2025-09-25","R",null,"2025-09-25","T",null,"2025-09-25","T",null,"2025-09-25","T",null,"2025-09-25","T"]
["2025-09-26",null,"2025-09-26","R",null,"2025-09-26","T",null,"2025-09-26","R",null,"2025-09-26","T",null,"2025-09-26","T"]
["2025-09-27",null,"2025-09-27","R",null,"2025-09-27","T",null,"2025-09-27","R",null,"2025-09-27","R",null,"2025-09-27","T"]
["2025-09-28",null,"2025-09-28","T",null,"2025-09-28","R",null,"2025-09-28","T",null,"2025-09-28","R",null,"2025-09-28","R"]
["2025-09-29",null,"2025-09-29","T",null,"2025-09-29","R",null,"2025-09-29","T",null,"2025-09-29","T",null,"2025-09-29","R"]
["2025-09-30",null,"2025-09-30","R",null,"2025-09-30","T",null,"2025-09-30","T",null,"2025-09-30","T",null,"2025-09-30","T"]
["2025-10-01",null,"2025-10-01","R",null,"2025-10-01","T",null,"2025-10-01","T",null,"2025-10-01","T",null,"2025-10-01","T"]
["2025-10-02",null,"2025-10-02","T",null,"2025-10-02","R",null,"2025-10-02","T",null,"2025-10-02","T",null,"2025-10-02","T"]
["2025-10-03",null,"2025-10-03","T",null,"2025-10-03","R",null,"2025-10-03","T",null,"2025-10-03","T",null,"2025-10-03","T"]
["2025-10-04",null,"2025-10-04","T",null,"2025-10-04","R",null,"2025-10-04","R",null,"2025-10-04","T",null,"2025-10-04","R"]
["2025-10-05",null,"2025-10-05","R",null,"2025-10-05","T",null,"2025-10-05","R",null,"2025-10-05","R",null,"2025-10-05","R"]
["2025-10-06",null,"2025-10-06","R",null,"2025-10-06","T",null,"2025-10-06","T",null,"2025-10-06","R",null,"2025-10-06","T"]
["2025-10-07",null,"2025-10-07","T",null,"2025-10-07","R",null,"2025-10-07","T",null,"2025-10-07","T",null,"2025-10-07","T"]
["2025-10-08",null,"2025-10-08","T",null,"2025-10-08","R",null,"2025-10-08","T",null,"2025-10-08","T",null,"2025-10-08","T"]
["2025-10-09",null,"2025-10-09","R",null,"2025-10-09","T",null,"2025-10-09","T",null,"2025-10-09","T",null,"2025-10-09","T"]
["2025-10-10",null,"2025-10-10","R",null,"2025-10-10","T",null,"2025-10-10","R",null,"2025-10-10","T",null,"2025-10-10","T"]
["2025-10-11",null,"2025-10-11","R",null,"2025-10-11","T",null,"2025-10-11","R",null,"2025-10-11","R",null,"2025-10-11","T"]
["2025-10-12",null,"2025-10-12","T",null,"2025-10-12","R",null,"2025-10-12","T",null,"2025-10-12","R",null,"2025-10-12","R"]
["2025-10-13",null,"2025-10-13","T",null,"2025-10-13","R",null,"2025-10-13","T",null,"2025-10-13","T",null,"2025-10-13","R"]
["2025-10-14",null,"2025-10-14","R",null,"2025-10-14","T",null,"2025-10-14","T",null,"2025-10-14","T",null,"2025-10-14","T"]
["2025-10-15",null,"2025-10-15","R",null,"2025-10-15","T",null,"2025-10-15","T",null,"2025-10-15","T",null,"2025-10-15","T"]
["2025-10-16",null,"2025-10-16","T",null,"2025-10-16","R",null,"2025-10-16","T",null,"2025-10-16","T",null,"2025-10-16","T"]
["2025-10-17",null,"2025-10-17","T",null,"2025-10-17","R",null,"2025-10-17","T",null,"2025-10-17","T",null,"2025-10-17","T"]
["2025-10-18",null,"2025-10-18","T",null,"2025-10-18","R",null,"2025-10-18","R",null,"2025-10-18","T",null,"2025-10-18","R"]
["2025-10-19",null,"2025-10-19","R",null,"2025-10-19","T",null,"2025-10-19","R",null,"2025-10-19","R",null,"2025-10-19","R"]
["2025-10-20",null,"2025-10-20","R",null,"2025-10-20","T",null,"2025-10-20","T",null,"2025-10-20","R",null,"2025-10-20","T"]
[{"$f":"C1026","v":"2025-10-21"},null,"2025-10-21","T",null,"2025-10-21","R",null,"2025-10-21","T",null,"2025-10-21","T",null,"2025-10-21","T"]
["2025-10-22",null,"2025-10-22","T",null,"2025-10-22","R",null,"2025-10-22","T",null,"2025-10-22","T",null,"2025-10-22","T"]
["2025-10-23",null,"2025-10-23","R",null,"2025-10-23","T",null,"2025-10-23","T",null,"2025-10-23","T",null,"2025-10-23","T"]
["2025-10-24",null,"2025-10-24","R",null,"2025-10-24","T",null,"2025-10-24","R",null,"2025-10-24","T",null,"2025-10-24","T"]
["2025-10-25",null,"2025-10-25","R",null,"2025-10-25","T",null,"2025-10-25","R",null,"2025-10-25","R",null,"2025-10-25","T"]
["2025-10-26",null,"2025-10-26","T",null,"2025-10-26","R",null,"2025-10-26","T",null,"2025-10-26","R",null,"2025-10-26","R"]
["2025-10-27",null,"2025-10-27","T",null,"2025-10-27","R",null,"2025-10-27","T",null,"2025-10-27","T",null,"2025-10-27","R"]
["2025-10-28",null,"2025-10-28","R",null,"2025-10-28","T",null,"2025-10-28","T",null,"2025-10-28","T",null,"2025-10-28","T"]
["2025-10-29",null,"2025-10-29","R",null,"2025-10-29","T",null,"2025-10-29","T",null,"2025-10-29","T",null,"2025-10-29","T"]
["2025-10-30",null,"2025-10-30","T",null,"2025-10-30","R",null,"2025-10-30","T",null,"2025-10-30","T",null,"2025-10-30","T"]
["2025-10-31",null,"2025-10-31","T",null,"2025-10-31","R",null,"2025-10-31","T",null,"2025-10-31","T",null,"2025-10-31","T"]
["2025-11-01",null,"2025-11-01","T",null,"2025-11-01","R",null,"2025-11-01","R",null,"2025-11-01","T",null,"2025-11-01","R"]
["2025-11-02",null,"2025-11-02","R",null,"2025-11-02","T",null,"2025-11-02","R",null,"2025-11-02","R",null,"2025-11-02","R"]
["2025-11-03",null,"2025-11-03","R",null,"2025-11-03","T",null,"2025-11-03","T",null,"2025-11-03","R",null,"2025-11-03","T"]
["2025-11-04",null,"2025-11-04","T",null,"2025-11-04","R",null,"2025-11-04","T",null,"2025-11-04","T",null,"2025-11-04","T"]
["2025-11-05",null,"2025-11-05","T",null,"2025-11-05","R",null,"2025-11-05","T",null,"2025-11-05","T",null,"2025-11-05","T"]
["2025-11-06",null,"2025-11-06","R",null,"2025-11-06","T",null,"2025-11-06","T",null,"2025-11-06","T",null,"2025-11-06","T"]
["2025-11-07",null,"2025-11-07","R",null,"2025-11-07","T",null,"2025-11-07","R",null,"2025-11-07","T",null,"2025-11-07","T"]
["2025-11-08",null,"2025-11-08","R",null,"2025-11-08","T",null,"2025-11-08","R",null,"2025-11-08","R",null,"2025-11-08","T"]
["2025-11-09",null,"2025-11-09","T",null,"2025-11-09","R",null,"2025-11-09","T",null,"2025-11-09","R",null,"2025-11-09","R"]
["2025-11-10",null,"2025-11-10","T",null,"2025-11-10","R",null,"2025-11-10","T",null,"2025-11-10","T",null,"2025-11-10","R"]
["2025-11-11",null,"2025-11-11","R",null,"2025-11-11","T",null,"2025-11-11","T",null,"2025-11-11","T",null,"2025-11-11","T"]
["2025-11-12",null,"2025-11-12","R",null,"2025-11-12","T",null,"2025-11-12","T",null,"2025-11-12","T",null,"2025-11-12","T"]
["2025-11-13",null,"2025-11-13","T",null,"2025-11-13","R",null,"2025-11-13","T",null,"2025-11-13","T",null,"2025-11-13","T"]
["2025-11-14",null,"2025-11-14","T",null,"2025-11-14","R",null,"2025-11-14","T",null,"2025-11-14","T",null,"2025-11-14","T"]
["2025-11-15",null,"2025-11-15","T",null,"2025-11-15","R",null,"2025-11-15","R",null,"2025-11-15","T",null,"2025-11-15","R"]
["2025-11-16",null,"2025-11-16","R",null,"2025-11-16","T",null,"2025-11-16","R",null,"2025-11-16","R",null,"2025-11-16","R"]
["2025-11-17",null,"2025-11-17","R",null,"2025-11-17","T",null,"2025-11-17","T",null,"2025-11-17","R",null,"2025-11-17","T"]
["2025-11-18",null,"2025-11-18","T",null,"2025-11-18","R",null,"2025-11-18","T",null,"2025-11-18","T",null,"2025-11-18","T"]
["2025-11-19",null,"2025-11-19","T",null,"2025-11-19","R",null,"2025-11-19","T",null,"2025-11-19","T",null,"2025-11-19","T"]
["2025-11-20",null,"2025-11-20","R",null,"2025-11-20","T",null,"2025-11-20","T",null,"2025-11-20","T",null,"2025-11-20","T"]
["2025-11-21",null,"2025-11-21","R",null,"2025-11-21","T",null,"2025-11-21","R",null,"2025-11-21","T",null,"2025-11-21","T"]
["2025-11-22",null,"2025-11-22","R",null,"2025-11-22","T",null,"2025-11-22","R",null,"2025-11-22","R",null,"2025-11-22","T"]
["2025-11-23",null,"2025-11-23","T",null,"2025-11-23","R",null,"2025-11-23","T",null,"2025-11-23","R",null,"2025-11-23","R"]
["2025-11-24",null,"2025-11-24","T",null,"2025-11-24","R",null,"2025-11-24","T",null,"2025-11-24","T",null,"2025-11-24","R"]
["2025-11-25",null,"2025-11-25","R",null,"2025-11-25","T",null,"2025-11-25","T",null,"2025-11-25","T",null,"2025-11-25","T"]
["2025-11-26",null,"2025-11-26","R",null,"2025-11-26","T",null,"2025-11-26","T",null,"2025-11-26","T",null,"2025-11-26","T"]
["2025-11-27",null,"2025-11-27","T",null,"2025-11-27","R",null,"2025-11-27","T",null,"2025-11-27","T",null,"2025-11-27","T"]
["2025-11-28",null,"2025-11-28","T",null,"2025-11-28","R",null,"2025-11-28","T",null,"2025-11-28","T",null,"2025-11-28","T"]
["2025-11-29",null,"2025-11-29","T",null,"2025-11-29","R",null,"2025-11-29","R",null,"2025-11-29","T",null,"2025-11-29","R"]
["2025-11-30",null,"2025-11-30","R",null,"2025-11-30","T",null,"2025-11-30","R",null,"2025-11-30","R",null,"2025-11-30","R"]
["2025-12-01",null,"2025-12-01","R",null,"2025-12-01","T",null,"2025-12-01","T",null,"2025-12-01","R",null,"2025-12-01","T"]
["2025-12-02",null,"2025-12-02","T",null,"2025-12-02","R",null,"2025-12-02","T",null,"2025-12-02","T",null,"2025-12-02","T"]
["2025-12-03",null,"2025-12-03","T",null,"2025-12-03","R",null,"2025-12-03","T",null,"2025-12-03","T",null,"2025-12-03","T"]
["2025-12-04",null,"2025-12-04","R",null,"2025-12-04","T",null,"2025-12-04","T",null,"2025-12-04","T",null,"2025-12-04","T"]
["2025-12-05",null,"2025-12-05","R",null,"2025-12-05","T",null,"2025-12-05","R",null,"2025-12-05","T",null,"2025-12-05","T"]
["2025-12-06",null,"2025-12-06","R",null,"2025-12-06","T",null,"2025-12-06","R",null,"2025-12-06","R",null,"2025-12-06","T"]
["2025-12-07",null,"2025-12-07","T",null,"2025-12-07","R",null,"2025-12-07","T",null,"2025-12-07","R",null,"2025-12-07","R"]
["2025-12-08",null,"2025-12-08","T",null,"2025-12-08","R",null,"2025-12-08","T",null,"2025-12-08","T",null,"2025-12-08","R"]
["2025-12-09",null,"2025-12-09","R",null,"2025-12-09","T",null,"2025-12-09","T",null,"2025-12-09","T",null,"2025-12-09","T"]
["2025-12-10",null,"2025-12-10","R",null,"2025-12-10","T",null,"2025-12-10","T",null,"2025-12-10","T",null,"2025-12-10","T"]
["2025-12-11",null,"2025-12-11","T",null,"2025-12-11","R",null,"2025-12-11","T",null,"2025-12-11","T",null,"2025-12-11","T"]
["2025-12-12",null,"2025-12-12","T",null,"2025-12-12","R",null,"2025-12-12","T",null,"2025-12-12","T",null,"2025-12-12","T"]
["2025-12-13",null,"2025-12-13","T",null,"2025-12-13","R",null,"2025-12-13","R",null,"2025-12-13","T",null,"2025-12-13","R"]
["2025-12-14",null,"2025-12-14","R",null,"2025-12-14","T",null,"2025-12-14","R",null,"2025-12-14","R",null,"2025-12-14","R"]
["2025-12-15",null,"2025-12-15","R",null,"2025-12-15","T",null,"2025-12-15","T",null,"2025-12-15","R",null,"2025-12-15","T"]
["2025-12-16",null,"2025-12-16","T",null,"2025-12-16","R",null,"2025-12-16","T",null,"2025-12-16","T",null,"2025-12-16","T"]
["2025-12-17",null,"2025-12-17","T",null,"2025-12-17","R",null,"2025-12-17","T",null,"2025-12-17","T",null,"2025-12-17","T"]
["2025-12-18",null,"2025-12-18","R",null,"2025-12-18","T",null,"2025-12-18","T",null,"2025-12-18","T",null,"2025-12-18","T"]
["2025-12-19",null,"2025-12-19","R",null,"2025-12-19","T",null,"2025-12-19","R",null,"2025-12-19","T",null,"2025-12-19","T"]
["2025-12-20",null,"2025-12-20","R",null,"2025-12-20","T",null,"2025-12-20","R",null,"2025-12-20","R",null,"2025-12-20","T"]
["2025-12-21",null,"2025-12-21","T",null,"2025-12-21","R",null,"2025-12-21","T",null,"2025-12-21","R",null,"2025-12-21","R"]
["2025-12-22",null,"2025-12-22","T",null,"2025-12-22","R",null,"2025-12-22","T",null,"2025-12-22","T",null,"2025-12-22","R"]
["2025-12-23",null,"2025-12-23","R",null,"2025-12-23","T",null,"2025-12-23","T",null,"2025-12-23","T",null,"2025-12-23","T"]
[{"$f":"C1090","v":"2025-12-24"},null,"2025-12-24","R",null,"2025-12-24","T",null,"2025-12-24","T",null,"2025-12-24","T",null,"2025-12-24","T"]
["2025-12-25",null,"2025-12-25","T",null,"2025-12-25",null,null,"2025-12-25","T",null,"2025-12-25","T",null,"2025-12-25","T"]
["2025-12-26",null,"2025-12-26","T",null,"2025-12-26",null,null,"2025-12-26","T",null,"2025-12-26","T",null,"2025-12-26","T"]
["2025-12-27",null,"2025-12-27","T",null,"2025-12-27",null,null,"2025-12-27","R",null,"2025-12-27","T",null,"2025-12-27","R"]
["2025-12-28",null,"2025-12-28","R",null,"2025-12-28",null,null,"2025-12-28","R",null,"2025-12-28","R",null,"2025-12-28","R"]
["2025-12-29",null,"2025-12-29","R",null,"2025-12-29",null,null,"2025-12-29","T",null,"2025-12-29","R",null,"2025-12-29","T"]
["2025-12-30",null,"2025-12-30","T",null,"2025-12-30",null,null,"2025-12-30","T",null,"2025-12-30","T",null,"2025-12-30","T"]
["2025-12-31",null,"2025-12-31","T",null,"2025-12-31",null,null,"2025-12-31",null,null,"2025-12-31","T",null,"2025-12-31","T"]

{"sheet":"Infos","index":1,"n_rows":80,"n_cols":11,"rows_kept":80,"cut":false,"hidden":false,"merged":[[0,0,0,1]]}
["MOIS",null,null,"ANNEE",null,"EQUIPES","Nbr","EQUIPES","NOM","PRENOM","NOM & Prénom"]
["Janvier",1,null,2022,null,"C1",{"$f":"COUNTIF(H:H,F2)","v":11},"C1","NOM 1","Prénom 1",{"$f":"I2&\" \"&J2","v":"NOM 1 Prénom 1"}]
["Février",2,null,2023,null,"C2",12,"C1","NOM 2","Prénom 2","NOM 2 Prénom 2"]
["Mars",3,null,2024,null,"C3",13,"C1","NOM 3","Prénom 3","NOM 3 Prénom 3"]
["Avril",4,null,2025,null,"C4",13,"C1","NOM 4","Prénom 4","NOM 4 Prénom 4"]
["Mai",5,null,null,null,"H",9,"C1","NOM 5","Prénom 5","NOM 5 Prénom 5"]
["Juin",6,null,null,null,"H1",13,"C1","NOM 6","Prénom 6","NOM 6 Prénom 6"]
["Juillet",7,null,null,null,"H2",8,"C1","NOM 7","Prénom 7","NOM 7 Prénom 7"]
["Août",8,null,null,null,null,null,"C1","NOM 8","Prénom 8","NOM 8 Prénom 8"]
["Septembre",9,null,null,null,null,null,"C1","NOM 9","Prénom 9","NOM 9 Prénom 9"]
["Octobre",10,null,null,null,null,null,"C1","NOM 10","Prénom 10","NOM 10 Prénom 10"]
["Novembre",11,null,null,null,null,null,"C1","NOM 11","Prénom 11","NOM 11 Prénom 11"]
["Décembre",12,null,null,null,null,null,"C2","NOM 12","Prénom 12","NOM 12 Prénom 12"]
[null,null,null,null,null,null,null,"C2","NOM 13","Prénom 13","NOM 13 Prénom 13"]
[null,null,null,null,null,null,null,"C2","NOM 14","Prénom 14","NOM 14 Prénom 14"]
[null,null,null,null,null,null,null,"C2","NOM 15","Prénom 15","NOM 15 Prénom 15"]
[null,null,null,null,null,null,null,"C2","NOM 16","Prénom 16","NOM 16 Prénom 16"]
[null,null,null,null,null,null,null,"C2","NOM 17","Prénom 17","NOM 17 Prénom 17"]
[null,null,null,null,null,null,null,"C2","NOM 18","Prénom 18","NOM 18 Prénom 18"]
[null,null,null,null,null,null,null,"C2","NOM 19","Prénom 19","NOM 19 Prénom 19"]
[null,null,null,null,null,null,null,"C2","NOM 20","Prénom 20","NOM 20 Prénom 20"]
[null,null,null,null,null,null,null,"C2","NOM 21","Prénom 21","NOM 21 Prénom 21"]
[null,null,null,null,null,null,null,"C2","NOM 22","Prénom 22","NOM 22 Prénom 22"]
[null,null,null,null,null,null,null,"C2","NOM 23","Prénom 23","NOM 23 Prénom 23"]
[null,null,null,null,null,null,null,"C3","NOM 24","Prénom 24","NOM 24 Prénom 24"]
[null,null,null,null,null,null,null,"C3","NOM 25","Prénom 25","NOM 25 Prénom 25"]
[null,null,null,null,null,null,null,"C3","NOM 26","Prénom 26","NOM 26 Prénom 26"]
[null,null,null,null,null,null,null,"C3","NOM 27","Prénom 27","NOM 27 Prénom 27"]
[null,null,null,null,null,null,null,"C3","NOM 28","Prénom 28","NOM 28 Prénom 28"]
[null,null,null,null,null,null,null,"C3","NOM 29","Prénom 29","NOM 29 Prénom 29"]
[null,null,null,null,null,null,null,"C3","NOM 30","Prénom 30","NOM 30 Prénom 30"]
[null,null,null,null,null,null,null,"C3","NOM 31","Prénom 31","NOM 31 Prénom 31"]
[null,null,null,null,null,null,null,"C3","NOM 32","Prénom 32","NOM 32 Prénom 32"]
[null,null,null,null,null,null,null,"C3","NOM 33","Prénom 33",{"$f":"I34&\" \"&J34","v":"NOM 33 Prénom 33"}]
[null,null,null,null,null,null,null,"C3","NOM 34","Prénom 34","NOM 34 Prénom 34"]
[null,null,null,null,null,null,null,"C3","NOM 35","Prénom 35","NOM 35 Prénom 35"]
[null,null,null,null,null,null,null,"C3","NOM 36","Prénom 36","NOM 36 Prénom 36"]
[null,null,null,null,null,null,null,"C4","NOM 37","Prénom 37","NOM 37 Prénom 37"]
[null,null,null,null,null,null,null,"C4","NOM 38","Prénom 38","NOM 38 Prénom 38"]
[null,null,null,null,null,null,null,"C4","NOM 39","Prénom 39","NOM 39 Prénom 39"]
[null,null,null,null,null,null,null,"C4","NOM 40","Prénom 40","NOM 40 Prénom 40"]
[null,null,null,null,null,null,null,"C4","NOM 41","Prénom 41","NOM 41 Prénom 41"]
[null,null,null,null,null,null,null,"C4","NOM 42","Prénom 42","NOM 42 Prénom 42"]
[null,null,null,null,null,null,null,"C4","NOM 43","Prénom 43","NOM 43 Prénom 43"]
[null,null,null,null,null,null,null,"C4","NOM 44","Prénom 44","NOM 44 Prénom 44"]
[null,null,null,null,null,null,null,"C4","NOM 45","Prénom 45","NOM 45 Prénom 45"]
[null,null,null,null,null,null,null,"C4","NOM 46","Prénom 46","NOM 46 Prénom 46"]
[null,null,null,null,null,null,null,"C4","NOM 47","Prénom 47","NOM 47 Prénom 47"]
[null,null,null,null,null,null,null,"C4","NOM 48","Prénom 48","NOM 48 Prénom 48"]
[null,null,null,null,null,null,null,"C4","NOM 49","Prénom 49","NOM 49 Prénom 49"]
[null,null,null,null,null,null,null,"H","NOM 50","Prénom 50","NOM 50 Prénom 50"]
[null,null,null,null,null,null,null,"H","NOM 51","Prénom 51","NOM 51 Prénom 51"]
[null,null,null,null,null,null,null,"H","NOM 52","Prénom 52","NOM 52 Prénom 52"]
[null,null,null,null,null,null,null,"H","NOM 53","Prénom 53","NOM 53 Prénom 53"]
[null,null,null,null,null,null,null,"H","NOM 54","Prénom 54","NOM 54 Prénom 54"]
[null,null,null,null,null,null,null,"H","NOM 55","Prénom 55","NOM 55 Prénom 55"]
[null,null,null,null,null,null,null,"H","NOM 56","Prénom 56","NOM 56 Prénom 56"]
[null,null,null,null,null,null,null,"H","NOM 57","Prénom 57","NOM 57 Prénom 57"]
[null,null,null,null,null,null,null,"H","NOM 58","Prénom 58","NOM 58 Prénom 58"]
[null,null,null,null,null,null,null,"H1","NOM 59","Prénom 59","NOM 59 Prénom 59"]
[null,null,null,null,null,null,null,"H1","NOM 60","Prénom 60","NOM 60 Prénom 60"]
[null,null,null,null,null,null,null,"H1","NOM 61","Prénom 61","NOM 61 Prénom 61"]
[null,null,null,null,null,null,null,"H1","NOM 62","Prénom 62","NOM 62 Prénom 62"]
[null,null,null,null,null,null,null,"H1","NOM 63","Prénom 63","NOM 63 Prénom 63"]
[null,null,null,null,null,null,null,"H1","NOM 64","Prénom 64","NOM 64 Prénom 64"]
[null,null,null,null,null,null,null,"H1","NOM 65","Prénom 65",{"$f":"I66&\" \"&J66","v":"NOM 65 Prénom 65"}]
[null,null,null,null,null,null,null,"H1","NOM 66","Prénom 66","NOM 66 Prénom 66"]
[null,null,null,null,null,null,null,"H1","NOM 67","Prénom 67","NOM 67 Prénom 67"]
[null,null,null,null,null,null,null,"H1","NOM 68","Prénom 68","NOM 68 Prénom 68"]
[null,null,null,null,null,null,null,"H1","NOM 69","Prénom 69","NOM 69 Prénom 69"]
[null,null,null,null,null,null,null,"H1","NOM 70","Prénom 70","NOM 70 Prénom 70"]
[null,null,null,null,null,null,null,"H1","NOM 71","Prénom 71","NOM 71 Prénom 71"]
[null,null,null,null,null,null,null,"H2","NOM 72","Prénom 72","NOM 72 Prénom 72"]
[null,null,null,null,null,null,null,"H2","NOM 73","Prénom 73","NOM 73 Prénom 73"]
[null,null,null,null,null,null,null,"H2","NOM 74","Prénom 74","NOM 74 Prénom 74"]
[null,null,null,null,null,null,null,"H2","NOM 75","Prénom 75","NOM 75 Prénom 75"]
[null,null,null,null,null,null,null,"H2","NOM 76","Prénom 76","NOM 76 Prénom 76"]
[null,null,null,null,null,null,null,"H2","NOM 77","Prénom 77","NOM 77 Prénom 77"]
[null,null,null,null,null,null,null,"H2","NOM 78","Prénom 78","NOM 78 Prénom 78"]
[null,null,null,null,null,null,null,"H2","NOM 79","Prénom 79","NOM 79 Prénom 79"]

{"sheet":"Jours fériés","index":2,"n_rows":15,"n_cols":2,"rows_kept":15,"cut":false,"hidden":false,"merged":[]}
["ANNEE",{"$f":"Planning!D1","v":"1923-12-01"}]
[]
["1er janvier",{"$f":"DATE(Planning!C1,1,1)","v":"2023-01-01"}]
["Pâques",{"$f":"ROUND(DATE(Planning!C1,4,MOD(234-11*MOD(Planning!C1,19),30))/7,0)*7-6","v":"2023-04-09"}]
["Lundi de Pâques",{"$f":"B4+1","v":"2023-04-10"}]
["1er Mai",{"$f":"DATE(Planning!C1,5,1)","v":"2023-05-01"}]
["8 Mai",{"$f":"DATE(Planning!C1,5,8)","v":"2023-05-08"}]
["Ascension",{"$f":"B4+39","v":"2023-05-18"}]
["Pentecôte",{"$f":"B4+49","v":"2023-05-28"}]
["Lundi de Pentecôte",{"$f":"B4+50","v":"2023-05-29"}]
["14 Juillet",{"$f":"DATE(Planning!C1,7,14)","v":"2023-07-14"}]
["15 Août",{"$f":"DATE(Planning!C1,8,15)","v":"2023-08-15"}]
["1er Novembre",{"$f":"DATE(Planning!C1,11,1)","v":"2023-11-01"}]
["11 Novembre",{"$f":"DATE(Planning!C1,11,11)","v":"2023-11-11"}]
["25 Décembre",{"$f":"DATE(Planning!C1,12,25)","v":"2023-12-25"}]

{"sheet":"Vacances","index":3,"n_rows":19,"n_cols":3,"rows_kept":19,"cut":false,"hidden":false,"merged":[]}
["vacances","début","fin"]
[]
["été","2023-07-05","2023-09-03"]
["toussaint","2023-10-21","2023-11-06"]
["noêl","2023-12-23","2024-01-08"]
["hiver","2024-02-17","2024-03-04"]
["printemps","2024-04-13","2024-04-29"]
["été","2024-07-06","2024-09-02"]
["toussaint","2024-10-19","2024-11-04"]
["noêl","2024-12-21","2025-01-06"]
["hiver"]
["printemps"]
["été"]
["toussaint"]
["noêl"]
["hiver"]
["printemps"]
["été"]
["toussaint"]

{"sheet":"Planning","index":4,"n_rows":266,"n_cols":1011,"rows_kept":266,"cut":false,"hidden":false,"merged":[]}
[null,"Année",2023,{"$f":"DATE(MATCH(C1,Infos!D2:D5,0)+21,MATCH(B4,Infos!A2:A13,0),1)","v":"1923-12-01"},null,null,null,"Repos ou WE",null,null,"férié",null,null,"vacances"]
[null,"valeurs pour code",{"$f":"MATCH(MAX(A:A),A:A,0)","v":23},{"$f":"MATCH(MAX(A:A),A:A,1)","v":265}]
[null,"H",{"$f":"DATE(C$1,MATCH(B4,mois,0),1)","v":"2023-12-01"},{"$f":"C3+1","v":"2023-12-02"},"2023-12-03","2023-12-04","2023-12-05","2023-12-06","2023-12-07","2023-12-08","2023-12-09","2023-12-10","2023-12-11","2023-12-12","2023-12-13","2023-12-14","2023-12-15","2023-12-16","2023-12-17","2023-12-18","2023-12-19","2023-12-20","2023-12-21","2023-12-22","2023-12-23","2023-12-24","2023-12-25","2023-12-26","2023-12-27","2023-12-28",{"$f":"IF(MONTH($AD$3)<>MONTH(AD$3+1),\"\",AD$3+1)","v":"2023-12-29"},{"$f":"IF(AE3=\"\",\"\",IF(MONTH(AE3+1)<>MONTH(AE3),\"\",AE3+1))","v":"2023-12-30"},{"$f":"IF(AF3=\"\",\"\",IF(MONTH(AF3+1)<>MONTH(AF3),\"\",AF3+1))","v":"2023-12-31"}]
[null,"Décembre",{"$f":"C3","v":"2023-12-01"},"2023-12-02","2023-12-03","2023-12-04","2023-12-05","2023-12-06","2023-12-07","2023-12-08","2023-12-09","2023-12-10","2023-12-11","2023-12-12","2023-12-13","2023-12-14","2023-12-15","2023-12-16","2023-12-17","2023-12-18","2023-12-19","2023-12-20","2023-12-21","2023-12-22","2023-12-23","2023-12-24","2023-12-25","2023-12-26","2023-12-27","2023-12-28","2023-12-29","2023-12-30","2023-12-31"]
[null,"Férié",{"$f":"IF(C3=\"\",\"\",DATE($C$1,MATCH($B4,Infos!$A$2:$A$13,0),DAY(C$91)))","v":"2023-12-01"},{"$f":"IF(D3=\"\",\"\",DATE($C$1,MATCH($B4,Infos!$A$2:$A$13,0),DAY(D$3)))","v":"2023-12-02"},{"$f":"IF(E3=\"\",\"\",DATE($C$1,MATCH($B4,Infos!$A$2:$A$13,0),DAY(E$3)))","v":"2023-12-03"},{"$f":"IF(F3=\"\",\"\",DATE($C$1,MATCH($B4,Infos!$A$2:$A$13,0),DAY(F$3)))","v":"2023-12-04"},{"$f":"IF(G3=\"\",\"\",DATE($C$1,MATCH($B4,Infos!$A$2:$A$13,0),DAY(G$3)))","v":"2023-12-05"},{"$f":"IF(H3=\"\",\"\",DATE($C$1,MATCH($B4,Infos!$A$2:$A$13,0),DAY(H$3)))","v":"2023-12-06"},{"$f":"IF(I3=\"\",\"\",DATE($C$1,MATCH($B4,Infos!$A$2:$A$13,0),DAY(I$3)))","v":"2023-12-07"},{"$f":"IF(J3=\"\",\"\",DATE($C$1,MATCH($B4,Infos!$A$2:$A$13,0),DAY(J$3)))","v":"2023-12-08"},{"$f":"IF(K3=\"\",\"\",DATE($C$1,MATCH($B4,Infos!$A$2:$A$13,0),DAY(K$3)))","v":"2023-12-09"},{"$f":"IF(L3=\"\",\"\",DATE($C$1,MATCH($B4,Infos!$A$2:$A$13,0),DAY(L$3)))","v":"2023-12-10"},{"$f":"IF(M3=\"\",\"\",DATE($C$1,MATCH($B4,Infos!$A$2:$A$13,0),DAY(M$3)))","v":"2023-12-11"},{"$f":"IF(N3=\"\",\"\",DATE($C$1,MATCH($B4,Infos!$A$2:$A$13,0),DAY(N$3)))","v":"2023-12-12"},{"$f":"IF(O3=\"\",\"\",DATE($C$1,MATCH($B4,Infos!$A$2:$A$13,0),DAY(O$3)))","v":"2023-12-13"},{"$f":"IF(P3=\"\",\"\",DATE($C$1,MATCH($B4,Infos!$A$2:$A$13,0),DAY(P$3)))","v":"2023-12-14"},{"$f":"IF(Q3=\"\",\"\",DATE($C$1,MATCH($B4,Infos!$A$2:$A$13,0),DAY(Q$3)))","v":"2023-12-15"},{"$f":"IF(R3=\"\",\"\",DATE($C$1,MATCH($B4,Infos!$A$2:$A$13,0),DAY(R$3)))","v":"2023-12-16"},{"$f":"IF(S3=\"\",\"\",DATE($C$1,MATCH($B4,Infos!$A$2:$A$13,0),DAY(S$3)))","v":"2023-12-17"},{"$f":"IF(T3=\"\",\"\",DATE($C$1,MATCH($B4,Infos!$A$2:$A$13,0),DAY(T$3)))","v":"2023-12-18"},{"$f":"IF(U3=\"\",\"\",DATE($C$1,MATCH($B4,Infos!$A$2:$A$13,0),DAY(U$3)))","v":"2023-12-19"},{"$f":"IF(V3=\"\",\"\",DATE($C$1,MATCH($B4,Infos!$A$2:$A$13,0),DAY(V$3)))","v":"2023-12-20"},{"$f":"IF(W3=\"\",\"\",DATE($C$1,MATCH($B4,Infos!$A$2:$A$13,0),DAY(W$3)))","v":"2023-12-21"},{"$f":"IF(X3=\"\",\"\",DATE($C$1,MATCH($B4,Infos!$A$2:$A$13,0),DAY(X$3)))","v":"2023-12-22"},{"$f":"IF(Y3=\"\",\"\",DATE($C$1,MATCH($B4,Infos!$A$2:$A$13,0),DAY(Y$3)))","v":"2023-12-23"},{"$f":"IF(Z3=\"\",\"\",DATE($C$1,MATCH($B4,Infos!$A$2:$A$13,0),DAY(Z$3)))","v":"2023-12-24"},{"$f":"IF(AA3=\"\",\"\",DATE($C$1,MATCH($B4,Infos!$A$2:$A$13,0),DAY(AA$3)))","v":"2023-12-25"},{"$f":"IF(AB3=\"\",\"\",DATE($C$1,MATCH($B4,Infos!$A$2:$A$13,0),DAY(AB$3)))","v":"2023-12-26"},{"$f":"IF(AC3=\"\",\"\",DATE($C$1,MATCH($B4,Infos!$A$2:$A$13,0),DAY(AC$3)))","v":"2023-12-27"},{"$f":"IF(AD3=\"\",\"\",DATE($C$1,MATCH($B4,Infos!$A$2:$A$13,0),DAY(AD$3)))","v":"2023-12-28"},{"$f":"IF(AE3=\"\",\"\",DATE($C$1,MATCH($B4,Infos!$A$2:$A$13,0),DAY(AE$3)))","v":"2023-12-29"},{"$f":"IF(AF3=\"\",\"\",DATE($C$1,MATCH($B4,Infos!$A$2:$A$13,0),DAY(AF$3)))","v":"2023-12-30"},{"$f":"IF(AG3=\"\",\"\",DATE($C$1,MATCH($B4,Infos!$A$2:$A$13,0),DAY(AG$3)))","v":"2023-12-31"},null,"sera caché"]
[null,"WE",{"$f":"IF(C25<>\"\",IF(COUNTIF('Jours fériés'!$B$3:$B$15,Planning!C5),8,WEEKDAY(C5,2)),\"\")","v":5},{"$f":"IF(D25<>\"\",IF(COUNTIF('Jours fériés'!$B$3:$B$15,Planning!D5),8,WEEKDAY(D5,2)),\"\")","v":6},{"$f":"IF(E25<>\"\",IF(COUNTIF('Jours fériés'!$B$3:$B$15,Planning!E5),8,WEEKDAY(E5,2)),\"\")","v":7},{"$f":"IF(F25<>\"\",IF(COUNTIF('Jours fériés'!$B$3:$B$15,Planning!F5),8,WEEKDAY(F5,2)),\"\")","v":1},{"$f":"IF(G25<>\"\",IF(COUNTIF('Jours fériés'!$B$3:$B$15,Planning!G5),8,WEEKDAY(G5,2)),\"\")","v":2},{"$f":"IF(H25<>\"\",IF(COUNTIF('Jours fériés'!$B$3:$B$15,Planning!H5),8,WEEKDAY(H5,2)),\"\")","v":3},{"$f":"IF(I25<>\"\",IF(COUNTIF('Jours fériés'!$B$3:$B$15,Planning!I5),8,WEEKDAY(I5,2)),\"\")","v":4},{"$f":"IF(J25<>\"\",IF(COUNTIF('Jours fériés'!$B$3:$B$15,Planning!J5),8,WEEKDAY(J5,2)),\"\")","v":5},{"$f":"IF(K25<>\"\",IF(COUNTIF('Jours fériés'!$B$3:$B$15,Planning!K5),8,WEEKDAY(K5,2)),\"\")","v":6},{"$f":"IF(L25<>\"\",IF(COUNTIF('Jours fériés'!$B$3:$B$15,Planning!L5),8,WEEKDAY(L5,2)),\"\")","v":7},{"$f":"IF(M25<>\"\",IF(COUNTIF('Jours fériés'!$B$3:$B$15,Planning!M5),8,WEEKDAY(M5,2)),\"\")","v":1},{"$f":"IF(N25<>\"\",IF(COUNTIF('Jours fériés'!$B$3:$B$15,Planning!N5),8,WEEKDAY(N5,2)),\"\")","v":2},{"$f":"IF(O25<>\"\",IF(COUNTIF('Jours fériés'!$B$3:$B$15,Planning!O5),8,WEEKDAY(O5,2)),\"\")","v":3},{"$f":"IF(P25<>\"\",IF(COUNTIF('Jours fériés'!$B$3:$B$15,Planning!P5),8,WEEKDAY(P5,2)),\"\")","v":4},{"$f":"IF(Q25<>\"\",IF(COUNTIF('Jours fériés'!$B$3:$B$15,Planning!Q5),8,WEEKDAY(Q5,2)),\"\")","v":5},{"$f":"IF(R25<>\"\",IF(COUNTIF('Jours fériés'!$B$3:$B$15,Planning!R5),8,WEEKDAY(R5,2)),\"\")","v":6},{"$f":"IF(S25<>\"\",IF(COUNTIF('Jours fériés'!$B$3:$B$15,Planning!S5),8,WEEKDAY(S5,2)),\"\")","v":7},{"$f":"IF(T25<>\"\",IF(COUNTIF('Jours fériés'!$B$3:$B$15,Planning!T5),8,WEEKDAY(T5,2)),\"\")","v":1},{"$f":"IF(U25<>\"\",IF(COUNTIF('Jours fériés'!$B$3:$B$15,Planning!U5),8,WEEKDAY(U5,2)),\"\")","v":2},{"$f":"IF(V25<>\"\",IF(COUNTIF('Jours fériés'!$B$3:$B$15,Planning!V5),8,WEEKDAY(V5,2)),\"\")","v":3},{"$f":"IF(W25<>\"\",IF(COUNTIF('Jours fériés'!$B$3:$B$15,Planning!W5),8,WEEKDAY(W5,2)),\"\")","v":4},{"$f":"IF(X25<>\"\",IF(COUNTIF('Jours fériés'!$B$3:$B$15,Planning!X5),8,WEEKDAY(X5,2)),\"\")","v":5},{"$f":"IF(Y25<>\"\",IF(COUNTIF('Jours fériés'!$B$3:$B$15,Planning!Y5),8,WEEKDAY(Y5,2)),\"\")","v":6},{"$f":"IF(Z25<>\"\",IF(COUNTIF('Jours fériés'!$B$3:$B$15,Planning!Z5),8,WEEKDAY(Z5,2)),\"\")","v":7},{"$f":"IF(AA25<>\"\",IF(COUNTIF('Jours fériés'!$B$3:$B$15,Planning!AA5),8,WEEKDAY(AA5,2)),\"\")","v":8},{"$f":"IF(AB25<>\"\",IF(COUNTIF('Jours fériés'!$B$3:$B$15,Planning!AB5),8,WEEKDAY(AB5,2)),\"\")","v":2},{"$f":"IF(AC25<>\"\",IF(COUNTIF('Jours fériés'!$B$3:$B$15,Planning!AC5),8,WEEKDAY(AC5,2)),\"\")","v":3},{"$f":"IF(AD25<>\"\",IF(COUNTIF('Jours fériés'!$B$3:$B$15,Planning!AD5),8,WEEKDAY(AD5,2)),\"\")","v":4},{"$f":"IF(AE25<>\"\",IF(COUNTIF('Jours fériés'!$B$3:$B$15,Planning!AE5),8,WEEKDAY(AE5,2)),\"\")","v":5},{"$f":"IF(AF25<>\"\",IF(COUNTIF('Jours fériés'!$B$3:$B$15,Planning!AF5),8,WEEKDAY(AF5,2)),\"\")","v":6},{"$f":"IF(AG25<>\"\",IF(COUNTIF('Jours fériés'!$B$3:$B$15,Planning!AG5),8,WEEKDAY(AG5,2)),\"\")","v":7},null,"sera caché"]
[null,"VACANCES",{"$f":"IF(SUMPRODUCT((C3>=datdeb)*(C3<=datfin))=1,\"vac\",\"\")","v":""},{"$f":"IF(SUMPRODUCT((D3>=datdeb)*(D3<=datfin))=1,\"vac\",\"\")","v":""},{"$f":"IF(SUMPRODUCT((E3>=datdeb)*(E3<=datfin))=1,\"vac\",\"\")","v":""},{"$f":"IF(SUMPRODUCT((F3>=datdeb)*(F3<=datfin))=1,\"vac\",\"\")","v":""},{"$f":"IF(SUMPRODUCT((G3>=datdeb)*(G3<=datfin))=1,\"vac\",\"\")","v":""},{"$f":"IF(SUMPRODUCT((H3>=datdeb)*(H3<=datfin))=1,\"vac\",\"\")","v":""},{"$f":"IF(SUMPRODUCT((I3>=datdeb)*(I3<=datfin))=1,\"vac\",\"\")","v":""},{"$f":"IF(SUMPRODUCT((J3>=datdeb)*(J3<=datfin))=1,\"vac\",\"\")","v":""},{"$f":"IF(SUMPRODUCT((K3>=datdeb)*(K3<=datfin))=1,\"vac\",\"\")","v":""},{"$f":"IF(SUMPRODUCT((L3>=datdeb)*(L3<=datfin))=1,\"vac\",\"\")","v":""},{"$f":"IF(SUMPRODUCT((M3>=datdeb)*(M3<=datfin))=1,\"vac\",\"\")","v":""},{"$f":"IF(SUMPRODUCT((N3>=datdeb)*(N3<=datfin))=1,\"vac\",\"\")","v":""},{"$f":"IF(SUMPRODUCT((O3>=datdeb)*(O3<=datfin))=1,\"vac\",\"\")","v":""},{"$f":"IF(SUMPRODUCT((P3>=datdeb)*(P3<=datfin))=1,\"vac\",\"\")","v":""},{"$f":"IF(SUMPRODUCT((Q3>=datdeb)*(Q3<=datfin))=1,\"vac\",\"\")","v":""},{"$f":"IF(SUMPRODUCT((R3>=datdeb)*(R3<=datfin))=1,\"vac\",\"\")","v":""},{"$f":"IF(SUMPRODUCT((S3>=datdeb)*(S3<=datfin))=1,\"vac\",\"\")","v":""},{"$f":"IF(SUMPRODUCT((T3>=datdeb)*(T3<=datfin))=1,\"vac\",\"\")","v":""},{"$f":"IF(SUMPRODUCT((U3>=datdeb)*(U3<=datfin))=1,\"vac\",\"\")","v":""},{"$f":"IF(SUMPRODUCT((V3>=datdeb)*(V3<=datfin))=1,\"vac\",\"\")","v":""},{"$f":"IF(SUMPRODUCT((W3>=datdeb)*(W3<=datfin))=1,\"vac\",\"\")","v":""},{"$f":"IF(SUMPRODUCT((X3>=datdeb)*(X3<=datfin))=1,\"vac\",\"\")","v":""},{"$f":"IF(SUMPRODUCT((Y3>=datdeb)*(Y3<=datfin))=1,\"vac\",\"\")","v":"vac"},{"$f":"IF(SUMPRODUCT((Z3>=datdeb)*(Z3<=datfin))=1,\"vac\",\"\")","v":"vac"},{"$f":"IF(SUMPRODUCT((AA3>=datdeb)*(AA3<=datfin))=1,\"vac\",\"\")","v":"vac"},{"$f":"IF(SUMPRODUCT((AB3>=datdeb)*(AB3<=datfin))=1,\"vac\",\"\")","v":"vac"},{"$f":"IF(SUMPRODUCT((AC3>=datdeb)*(AC3<=datfin))=1,\"vac\",\"\")","v":"vac"},{"$f":"IF(SUMPRODUCT((AD3>=datdeb)*(AD3<=datfin))=1,\"vac\",\"\")","v":"vac"},{"$f":"IF(SUMPRODUCT((AE3>=datdeb)*(AE3<=datfin))=1,\"vac\",\"\")","v":"vac"},{"$f":"IF(SUMPRODUCT((AF3>=datdeb)*(AF3<=datfin))=1,\"vac\",\"\")","v":"vac"},{"$f":"IF(SUMPRODUCT((AG3>=datdeb)*(AG3<=datfin))=1,\"vac\",\"\")","v":"vac"}]
[null,null,{"$f":"IFERROR(_xlfn.SWITCH($B$3,\"C1\",INDEX(Infos_2!$D$2:$D$1097,MATCH(C3,Infos_2!$C$2:$C$1097,0),1),\"C2\",INDEX(Infos_2!$G$2:$G$1097,MATCH(C3,Infos_2!$F$2:$F$1097,0), ,1),\"H\",INDEX(Infos_2!$J$2:$J$1097,MATCH(C3,Infos_2!$I$2:$I$1097,0), ,1),\"H1\",INDEX(Infos_2!$M$2:$M$1097,MATCH(C3,Infos_2!$L$2:$L$1097,0), ,1),\"H2\",INDEX(Infos_2!$P$2:$P$1097,MATCH(C3,Infos_2!$O$2:$O$1097,0), ,1)),\"\")","v":"T"},{"$f":"IFERROR(_xlfn.SWITCH($B$3,\"C1\",INDEX(Infos_2!$D$2:$D$1097,MATCH(D3,Infos_2!$C$2:$C$1097,0),1),\"C2\",INDEX(Infos_2!$G$2:$G$1097,MATCH(D3,Infos_2!$F$2:$F$1097,0), ,1),\"H\",INDEX(Infos_2!$J$2:$J$1097,MATCH(D3,Infos_2!$I$2:$I$1097,0), ,1),\"H1\",INDEX(Infos_2!$M$2:$M$1097,MATCH(D3,Infos_2!$L$2:$L$1097,0), ,1),\"H2\",INDEX(Infos_2!$P$2:$P$1097,MATCH(D3,Infos_2!$O$2:$O$1097,0), ,1)),\"\")","v":"R"},{"$f":"IFERROR(_xlfn.SWITCH($B$3,\"C1\",INDEX(Infos_2!$D$2:$D$1097,MATCH(E3,Infos_2!$C$2:$C$1097,0),1),\"C2\",INDEX(Infos_2!$G$2:$G$1097,MATCH(E3,Infos_2!$F$2:$F$1097,0), ,1),\"H\",INDEX(Infos_2!$J$2:$J$1097,MATCH(E3,Infos_2!$I$2:$I$1097,0), ,1),\"H1\",INDEX(Infos_2!$M$2:$M$1097,MATCH(E3,Infos_2!$L$2:$L$1097,0), ,1),\"H2\",INDEX(Infos_2!$P$2:$P$1097,MATCH(E3,Infos_2!$O$2:$O$1097,0), ,1)),\"\")","v":"R"},{"$f":"IFERROR(_xlfn.SWITCH($B$3,\"C1\",INDEX(Infos_2!$D$2:$D$1097,MATCH(F3,Infos_2!$C$2:$C$1097,0),1),\"C2\",INDEX(Infos_2!$G$2:$G$1097,MATCH(F3,Infos_2!$F$2:$F$1097,0), ,1),\"H\",INDEX(Infos_2!$J$2:$J$1097,MATCH(F3,Infos_2!$I$2:$I$1097,0), ,1),\"H1\",INDEX(Infos_2!$M$2:$M$1097,MATCH(F3,Infos_2!$L$2:$L$1097,0), ,1),\"H2\",INDEX(Infos_2!$P$2:$P$1097,MATCH(F3,Infos_2!$O$2:$O$1097,0), ,1)),\"\")","v":"T"},{"$f":"IFERROR(_xlfn.SWITCH($B$3,\"C1\",INDEX(Infos_2!$D$2:$D$1097,MATCH(G3,Infos_2!$C$2:$C$1097,0),1),\"C2\",INDEX(Infos_2!$G$2:$G$1097,MATCH(G3,Infos_2!$F$2:$F$1097,0), ,1),\"H\",INDEX(Infos_2!$J$2:$J$1097,MATCH(G3,Infos_2!$I$2:$I$1097,0), ,1),\"H1\",INDEX(Infos_2!$M$2:$M$1097,MATCH(G3,Infos_2!$L$2:$L$1097,0), ,1),\"H2\",INDEX(Infos_2!$P$2:$P$1097,MATCH(G3,Infos_2!$O$2:$O$1097,0), ,1)),\"\")","v":"T"},{"$f":"IFERROR(_xlfn.SWITCH($B$3,\"C1\",INDEX(Infos_2!$D$2:$D$1097,MATCH(H3,Infos_2!$C$2:$C$1097,0),1),\"C2\",INDEX(Infos_2!$G$2:$G$1097,MATCH(H3,Infos_2!$F$2:$F$1097,0), ,1),\"H\",INDEX(Infos_2!$J$2:$J$1097,MATCH(H3,Infos_2!$I$2:$I$1097,0), ,1),\"H1\",INDEX(Infos_2!$M$2:$M$1097,MATCH(H3,Infos_2!$L$2:$L$1097,0), ,1),\"H2\",INDEX(Infos_2!$P$2:$P$1097,MATCH(H3,Infos_2!$O$2:$O$1097,0), ,1)),\"\")","v":"T"},{"$f":"IFERROR(_xlfn.SWITCH($B$3,\"C1\",INDEX(Infos_2!$D$2:$D$1097,MATCH(I3,Infos_2!$C$2:$C$1097,0),1),\"C2\",INDEX(Infos_2!$G$2:$G$1097,MATCH(I3,Infos_2!$F$2:$F$1097,0), ,1),\"H\",INDEX(Infos_2!$J$2:$J$1097,MATCH(I3,Infos_2!$I$2:$I$1097,0), ,1),\"H1\",INDEX(Infos_2!$M$2:$M$1097,MATCH(I3,Infos_2!$L$2:$L$1097,0), ,1),\"H2\",INDEX(Infos_2!$P$2:$P$1097,MATCH(I3,Infos_2!$O$2:$O$1097,0), ,1)),\"\")","v":"T"},{"$f":"IFERROR(_xlfn.SWITCH($B$3,\"C1\",INDEX(Infos_2!$D$2:$D$1097,MATCH(J3,Infos_2!$C$2:$C$1097,0),1),\"C2\",INDEX(Infos_2!$G$2:$G$1097,MATCH(J3,Infos_2!$F$2:$F$1097,0), ,1),\"H\",INDEX(Infos_2!$J$2:$J$1097,MATCH(J3,Infos_2!$I$2:$I$1097,0), ,1),\"H1\",INDEX(Infos_2!$M$2:$M$1097,MATCH(J3,Infos_2!$L$2:$L$1097,0), ,1),\"H2\",INDEX(Infos_2!$P$2:$P$1097,MATCH(J3,Infos_2!$O$2:$O$1097,0), ,1)),\"\")","v":"T"},{"$f":"IFERROR(_xlfn.SWITCH($B$3,\"C1\",INDEX(Infos_2!$D$2:$D$1097,MATCH(K3,Infos_2!$C$2:$C$1097,0),1),\"C2\",INDEX(Infos_2!$G$2:$G$1097,MATCH(K3,Infos_2!$F$2:$F$1097,0), ,1),\"H\",INDEX(Infos_2!$J$2:$J$1097,MATCH(K3,Infos_2!$I$2:$I$1097,0), ,1),\"H1\",INDEX(Infos_2!$M$2:$M$1097,MATCH(K3,Infos_2!$L$2:$L$1097,0), ,1),\"H2\",INDEX(Infos_2!$P$2:$P$1097,MATCH(K3,Infos_2!$O$2:$O$1097,0), ,1)),\"\")","v":"R"},{"$f":"IFERROR(_xlfn.SWITCH($B$3,\"C1\",INDEX(Infos_2!$D$2:$D$1097,MATCH(L3,Infos_2!$C$2:$C$1097,0),1),\"C2\",INDEX(Infos_2!$G$2:$G$1097,MATCH(L3,Infos_2!$F$2:$F$1097,0), ,1),\"H\",INDEX(Infos_2!$J$2:$J$1097,MATCH(L3,Infos_2!$I$2:$I$1097,0), ,1),\"H1\",INDEX(Infos_2!$M$2:$M$1097,MATCH(L3,Infos_2!$L$2:$L$1097,0), ,1),\"H2\",INDEX(Infos_2!$P$2:$P$1097,MATCH(L3,Infos_2!$O$2:$O$1097,0), ,1)),\"\")","v":"R"},{"$f":"IFERROR(_xlfn.SWITCH($B$3,\"C1\",INDEX(Infos_2!$D$2:$D$1097,MATCH(M3,Infos_2!$C$2:$C$1097,0),1),\"C2\",INDEX(Infos_2!$G$2:$G$1097,MATCH(M3,Infos_2!$F$2:$F$1097,0), ,1),\"H\",INDEX(Infos_2!$J$2:$J$1097,MATCH(M3,Infos_2!$I$2:$I$1097,0), ,1),\"H1\",INDEX(Infos_2!$M$2:$M$1097,MATCH(M3,Infos_2!$L$2:$L$1097,0), ,1),\"H2\",INDEX(Infos_2!$P$2:$P$1097,MATCH(M3,Infos_2!$O$2:$O$1097,0), ,1)),\"\")","v":"T"},{"$f":"IFERROR(_xlfn.SWITCH($B$3,\"C1\",INDEX(Infos_2!$D$2:$D$1097,MATCH(N3,Infos_2!$C$2:$C$1097,0),1),\"C2\",INDEX(Infos_2!$G$2:$G$1097,MATCH(N3,Infos_2!$F$2:$F$1097,0), ,1),\"H\",INDEX(Infos_2!$J$2:$J$1097,MATCH(N3,Infos_2!$I$2:$I$1097,0), ,1),\"H1\",INDEX(Infos_2!$M$2:$M$1097,MATCH(N3,Infos_2!$L$2:$L$1097,0), ,1),\"H2\",INDEX(Infos_2!$P$2:$P$1097,MATCH(N3,Infos_2!$O$2:$O$1097,0), ,1)),\"\")","v":"T"},{"$f":"IFERROR(_xlfn.SWITCH($B$3,\"C1\",INDEX(Infos_2!$D$2:$D$1097,MATCH(O3,Infos_2!$C$2:$C$1097,0),1),\"C2\",INDEX(Infos_2!$G$2:$G$1097,MATCH(O3,Infos_2!$F$2:$F$1097,0), ,1),\"H\",INDEX(Infos_2!$J$2:$J$1097,MATCH(O3,Infos_2!$I$2:$I$1097,0), ,1),\"H1\",INDEX(Infos_2!$M$2:$M$1097,MATCH(O3,Infos_2!$L$2:$L$1097,0), ,1),\"H2\",INDEX(Infos_2!$P$2:$P$1097,MATCH(O3,Infos_2!$O$2:$O$1097,0), ,1)),\"\")","v":"T"},{"$f":"IFERROR(_xlfn.SWITCH($B$3,\"C1\",INDEX(Infos_2!$D$2:$D$1097,MATCH(P3,Infos_2!$C$2:$C$1097,0),1),\"C2\",INDEX(Infos_2!$G$2:$G$1097,MATCH(P3,Infos_2!$F$2:$F$1097,0), ,1),\"H\",INDEX(Infos_2!$J$2:$J$1097,MATCH(P3,Infos_2!$I$2:$I$1097,0), ,1),\"H1\",INDEX(Infos_2!$M$2:$M$1097,MATCH(P3,Infos_2!$L$2:$L$1097,0), ,1),\"H2\",INDEX(Infos_2!$P$2:$P$1097,MATCH(P3,Infos_2!$O$2:$O$1097,0), ,1)),\"\")","v":"T"},{"$f":"IFERROR(_xlfn.SWITCH($B$3,\"C1\",INDEX(Infos_2!$D$2:$D$1097,MATCH(Q3,Infos_2!$C$2:$C$1097,0),1),\"C2\",INDEX(Infos_2!$G$2:$G$1097,MATCH(Q3,Infos_2!$F$2:$F$1097,0), ,1),\"H\",INDEX(Infos_2!$J$2:$J$1097,MATCH(Q3,Infos_2!$I$2:$I$1097,0), ,1),\"H1\",INDEX(Infos_2!$M$2:$M$1097,MATCH(Q3,Infos_2!$L$2:$L$1097,0), ,1),\"H2\",INDEX(Infos_2!$P$2:$P$1097,MATCH(Q3,Infos_2!$O$2:$O$1097,0), ,1)),\"\")","v":"T"},{"$f":"IFERROR(_xlfn.SWITCH($B$3,\"C1\",INDEX(Infos_2!$D$2:$D$1097,MATCH(R3,Infos_2!$C$2:$C$1097,0),1),\"C2\",INDEX(Infos_2!$G$2:$G$1097,MATCH(R3,Infos_2!$F$2:$F$1097,0), ,1),\"H\",INDEX(Infos_2!$J$2:$J$1097,MATCH(R3,Infos_2!$I$2:$I$1097,0), ,1),\"H1\",INDEX(Infos_2!$M$2:$M$1097,MATCH(R3,Infos_2!$L$2:$L$1097,0), ,1),\"H2\",INDEX(Infos_2!$P$2:$P$1097,MATCH(R3,Infos_2!$O$2:$O$1097,0), ,1)),\"\")","v":"R"},{"$f":"IFERROR(_xlfn.SWITCH($B$3,\"C1\",INDEX(Infos_2!$D$2:$D$1097,MATCH(S3,Infos_2!$C$2:$C$1097,0),1),\"C2\",INDEX(Infos_2!$G$2:$G$1097,MATCH(S3,Infos_2!$F$2:$F$1097,0), ,1),\"H\",INDEX(Infos_2!$J$2:$J$1097,MATCH(S3,Infos_2!$I$2:$I$1097,0), ,1),\"H1\",INDEX(Infos_2!$M$2:$M$1097,MATCH(S3,Infos_2!$L$2:$L$1097,0), ,1),\"H2\",INDEX(Infos_2!$P$2:$P$1097,MATCH(S3,Infos_2!$O$2:$O$1097,0), ,1)),\"\")","v":"R"},{"$f":"IFERROR(_xlfn.SWITCH($B$3,\"C1\",INDEX(Infos_2!$D$2:$D$1097,MATCH(T3,Infos_2!$C$2:$C$1097,0),1),\"C2\",INDEX(Infos_2!$G$2:$G$1097,MATCH(T3,Infos_2!$F$2:$F$1097,0), ,1),\"H\",INDEX(Infos_2!$J$2:$J$1097,MATCH(T3,Infos_2!$I$2:$I$1097,0), ,1),\"H1\",INDEX(Infos_2!$M$2:$M$1097,MATCH(T3,Infos_2!$L$2:$L$1097,0), ,1),\"H2\",INDEX(Infos_2!$P$2:$P$1097,MATCH(T3,Infos_2!$O$2:$O$1097,0), ,1)),\"\")","v":"T"},{"$f":"IFERROR(_xlfn.SWITCH($B$3,\"C1\",INDEX(Infos_2!$D$2:$D$1097,MATCH(U3,Infos_2!$C$2:$C$1097,0),1),\"C2\",INDEX(Infos_2!$G$2:$G$1097,MATCH(U3,Infos_2!$F$2:$F$1097,0), ,1),\"H\",INDEX(Infos_2!$J$2:$J$1097,MATCH(U3,Infos_2!$I$2:$I$1097,0), ,1),\"H1\",INDEX(Infos_2!$M$2:$M$1097,MATCH(U3,Infos_2!$L$2:$L$1097,0), ,1),\"H2\",INDEX(Infos_2!$P$2:$P$1097,MATCH(U3,Infos_2!$O$2:$O$1097,0), ,1)),\"\")","v":"T"},{"$f":"IFERROR(_xlfn.SWITCH($B$3,\"C1\",INDEX(Infos_2!$D$2:$D$1097,MATCH(V3,Infos_2!$C$2:$C$1097,0),1),\"C2\",INDEX(Infos_2!$G$2:$G$1097,MATCH(V3,Infos_2!$F$2:$F$1097,0), ,1),\"H\",INDEX(Infos_2!$J$2:$J$1097,MATCH(V3,Infos_2!$I$2:$I$1097,0), ,1),\"H1\",INDEX(Infos_2!$M$2:$M$1097,MATCH(V3,Infos_2!$L$2:$L$1097,0), ,1),\"H2\",INDEX(Infos_2!$P$2:$P$1097,MATCH(V3,Infos_2!$O$2:$O$1097,0), ,1)),\"\")","v":"T"},{"$f":"IFERROR(_xlfn.SWITCH($B$3,\"C1\",INDEX(Infos_2!$D$2:$D$1097,MATCH(W3,Infos_2!$C$2:$C$1097,0),1),\"C2\",INDEX(Infos_2!$G$2:$G$1097,MATCH(W3,Infos_2!$F$2:$F$1097,0), ,1),\"H\",INDEX(Infos_2!$J$2:$J$1097,MATCH(W3,Infos_2!$I$2:$I$1097,0), ,1),\"H1\",INDEX(Infos_2!$M$2:$M$1097,MATCH(W3,Infos_2!$L$2:$L$1097,0), ,1),\"H2\",INDEX(Infos_2!$P$2:$P$1097,MATCH(W3,Infos_2!$O$2:$O$1097,0), ,1)),\"\")","v":"T"},{"$f":"IFERROR(_xlfn.SWITCH($B$3,\"C1\",INDEX(Infos_2!$D$2:$D$1097,MATCH(X3,Infos_2!$C$2:$C$1097,0),1),\"C2\",INDEX(Infos_2!$G$2:$G$1097,MATCH(X3,Infos_2!$F$2:$F$1097,0), ,1),\"H\",INDEX(Infos_2!$J$2:$J$1097,MATCH(X3,Infos_2!$I$2:$I$1097,0), ,1),\"H1\",INDEX(Infos_2!$M$2:$M$1097,MATCH(X3,Infos_2!$L$2:$L$1097,0), ,1),\"H2\",INDEX(Infos_2!$P$2:$P$1097,MATCH(X3,Infos_2!$O$2:$O$1097,0), ,1)),\"\")","v":"T"},{"$f":"IFERROR(_xlfn.SWITCH($B$3,\"C1\",INDEX(Infos_2!$D$2:$D$1097,MATCH(Y3,Infos_2!$C$2:$C$1097,0),1),\"C2\",INDEX(Infos_2!$G$2:$G$1097,MATCH(Y3,Infos_2!$F$2:$F$1097,0), ,1),\"H\",INDEX(Infos_2!$J$2:$J$1097,MATCH(Y3,Infos_2!$I$2:$I$1097,0), ,1),\"H1\",INDEX(Infos_2!$M$2:$M$1097,MATCH(Y3,Infos_2!$L$2:$L$1097,0), ,1),\"H2\",INDEX(Infos_2!$P$2:$P$1097,MATCH(Y3,Infos_2!$O$2:$O$1097,0), ,1)),\"\")","v":"R"},{"$f":"IFERROR(_xlfn.SWITCH($B$3,\"C1\",INDEX(Infos_2!$D$2:$D$1097,MATCH(Z3,Infos_2!$C$2:$C$1097,0),1),\"C2\",INDEX(Infos_2!$G$2:$G$1097,MATCH(Z3,Infos_2!$F$2:$F$1097,0), ,1),\"H\",INDEX(Infos_2!$J$2:$J$1097,MATCH(Z3,Infos_2!$I$2:$I$1097,0), ,1),\"H1\",INDEX(Infos_2!$M$2:$M$1097,MATCH(Z3,Infos_2!$L$2:$L$1097,0), ,1),\"H2\",INDEX(Infos_2!$P$2:$P$1097,MATCH(Z3,Infos_2!$O$2:$O$1097,0), ,1)),\"\")","v":"R"},{"$f":"IFERROR(_xlfn.SWITCH($B$3,\"C1\",INDEX(Infos_2!$D$2:$D$1097,MATCH(AA3,Infos_2!$C$2:$C$1097,0),1),\"C2\",INDEX(Infos_2!$G$2:$G$1097,MATCH(AA3,Infos_2!$F$2:$F$1097,0), ,1),\"H\",INDEX(Infos_2!$J$2:$J$1097,MATCH(AA3,Infos_2!$I$2:$I$1097,0), ,1),\"H1\",INDEX(Infos_2!$M$2:$M$1097,MATCH(AA3,Infos_2!$L$2:$L$1097,0), ,1),\"H2\",INDEX(Infos_2!$P$2:$P$1097,MATCH(AA3,Infos_2!$O$2:$O$1097,0), ,1)),\"\")","v":"T"},{"$f":"IFERROR(_xlfn.SWITCH($B$3,\"C1\",INDEX(Infos_2!$D$2:$D$1097,MATCH(AB3,Infos_2!$C$2:$C$1097,0),1),\"C2\",INDEX(Infos_2!$G$2:$G$1097,MATCH(AB3,Infos_2!$F$2:$F$1097,0), ,1),\"H\",INDEX(Infos_2!$J$2:$J$1097,MATCH(AB3,Infos_2!$I$2:$I$1097,0), ,1),\"H1\",INDEX(Infos_2!$M$2:$M$1097,MATCH(AB3,Infos_2!$L$2:$L$1097,0), ,1),\"H2\",INDEX(Infos_2!$P$2:$P$1097,MATCH(AB3,Infos_2!$O$2:$O$1097,0), ,1)),\"\")","v":"T"},{"$f":"IFERROR(_xlfn.SWITCH($B$3,\"C1\",INDEX(Infos_2!$D$2:$D$1097,MATCH(AC3,Infos_2!$C$2:$C$1097,0),1),\"C2\",INDEX(Infos_2!$G$2:$G$1097,MATCH(AC3,Infos_2!$F$2:$F$1097,0), ,1),\"H\",INDEX(Infos_2!$J$2:$J$1097,MATCH(AC3,Infos_2!$I$2:$I$1097,0), ,1),\"H1\",INDEX(Infos_2!$M$2:$M$1097,MATCH(AC3,Infos_2!$L$2:$L$1097,0), ,1),\"H2\",INDEX(Infos_2!$P$2:$P$1097,MATCH(AC3,Infos_2!$O$2:$O$1097,0), ,1)),\"\")","v":"T"},{"$f":"IFERROR(_xlfn.SWITCH($B$3,\"C1\",INDEX(Infos_2!$D$2:$D$1097,MATCH(AD3,Infos_2!$C$2:$C$1097,0),1),\"C2\",INDEX(Infos_2!$G$2:$G$1097,MATCH(AD3,Infos_2!$F$2:$F$1097,0), ,1),\"H\",INDEX(Infos_2!$J$2:$J$1097,MATCH(AD3,Infos_2!$I$2:$I$1097,0), ,1),\"H1\",INDEX(Infos_2!$M$2:$M$1097,MATCH(AD3,Infos_2!$L$2:$L$1097,0), ,1),\"H2\",INDEX(Infos_2!$P$2:$P$1097,MATCH(AD3,Infos_2!$O$2:$O$1097,0), ,1)),\"\")","v":"T"},{"$f":"IFERROR(_xlfn.SWITCH($B$3,\"C1\",INDEX(Infos_2!$D$2:$D$1097,MATCH(AE3,Infos_2!$C$2:$C$1097,0),1),\"C2\",INDEX(Infos_2!$G$2:$G$1097,MATCH(AE3,Infos_2!$F$2:$F$1097,0), ,1),\"H\",INDEX(Infos_2!$J$2:$J$1097,MATCH(AE3,Infos_2!$I$2:$I$1097,0), ,1),\"H1\",INDEX(Infos_2!$M$2:$M$1097,MATCH(AE3,Infos_2!$L$2:$L$1097,0), ,1),\"H2\",INDEX(Infos_2!$P$2:$P$1097,MATCH(AE3,Infos_2!$O$2:$O$1097,0), ,1)),\"\")","v":"T"},{"$f":"IFERROR(_xlfn.SWITCH($B$3,\"C1\",INDEX(Infos_2!$D$2:$D$1097,MATCH(AF3,Infos_2!$C$2:$C$1097,0),1),\"C2\",INDEX(Infos_2!$G$2:$G$1097,MATCH(AF3,Infos_2!$F$2:$F$1097,0), ,1),\"H\",INDEX(Infos_2!$J$2:$J$1097,MATCH(AF3,Infos_2!$I$2:$I$1097,0), ,1),\"H1\",INDEX(Infos_2!$M$2:$M$1097,MATCH(AF3,Infos_2!$L$2:$L$1097,0), ,1),\"H2\",INDEX(Infos_2!$P$2:$P$1097,MATCH(AF3,Infos_2!$O$2:$O$1097,0), ,1)),\"\")","v":"R"},{"$f":"IFERROR(_xlfn.SWITCH($B$3,\"C1\",INDEX(Infos_2!$D$2:$D$1097,MATCH(AG3,Infos_2!$C$2:$C$1097,0),1),\"C2\",INDEX(Infos_2!$G$2:$G$1097,MATCH(AG3,Infos_2!$F$2:$F$1097,0), ,1),\"H\",INDEX(Infos_2!$J$2:$J$1097,MATCH(AG3,Infos_2!$I$2:$I$1097,0), ,1),\"H1\",INDEX(Infos_2!$M$2:$M$1097,MATCH(AG3,Infos_2!$L$2:$L$1097,0), ,1),\"H2\",INDEX(Infos_2!$P$2:$P$1097,MATCH(AG3,Infos_2!$O$2:$O$1097,0), ,1)),\"\")","v":"R"},null,"sera caché"]
[1,{"$f":"IF(ROWS($1:1)<=COUNTIF(code,$B$3),INDEX(equipe,MATCH($B$3,code,0)+ROWS($1:1)-1,4),\"\")","v":"NOM 50 Prénom 50"}]
[2,{"$f":"IF(ROWS($1:2)<=COUNTIF(code,$B$3),INDEX(equipe,MATCH($B$3,code,0)+ROWS($1:2)-1,4),\"\")","v":"NOM 51 Prénom 51"}]
[3,{"$f":"IF(ROWS($1:3)<=COUNTIF(code,$B$3),INDEX(equipe,MATCH($B$3,code,0)+ROWS($1:3)-1,4),\"\")","v":"NOM 52 Prénom 52"}]
[4,{"$f":"IF(ROWS($1:4)<=COUNTIF(code,$B$3),INDEX(equipe,MATCH($B$3,code,0)+ROWS($1:4)-1,4),\"\")","v":"NOM 53 Prénom 53"}]
[5,{"$f":"IF(ROWS($1:5)<=COUNTIF(code,$B$3),INDEX(equipe,MATCH($B$3,code,0)+ROWS($1:5)-1,4),\"\")","v":"NOM 54 Prénom 54"}]
[6,{"$f":"IF(ROWS($1:6)<=COUNTIF(code,$B$3),INDEX(equipe,MATCH($B$3,code,0)+ROWS($1:6)-1,4),\"\")","v":"NOM 55 Prénom 55"}]
[7,{"$f":"IF(ROWS($1:7)<=COUNTIF(code,$B$3),INDEX(equipe,MATCH($B$3,code,0)+ROWS($1:7)-1,4),\"\")","v":"NOM 56 Prénom 56"}]
[8,{"$f":"IF(ROWS($1:8)<=COUNTIF(code,$B$3),INDEX(equipe,MATCH($B$3,code,0)+ROWS($1:8)-1,4),\"\")","v":"NOM 57 Prénom 57"}]
[9,{"$f":"IF(ROWS($1:9)<=COUNTIF(code,$B$3),INDEX(equipe,MATCH($B$3,code,0)+ROWS($1:9)-1,4),\"\")","v":"NOM 58 Prénom 58"}]
[10,{"$f":"IF(ROWS($1:10)<=COUNTIF(code,$B$3),INDEX(equipe,MATCH($B$3,code,0)+ROWS($1:10)-1,4),\"\")","v":""}]
[11,{"$f":"IF(ROWS($1:11)<=COUNTIF(code,$B$3),INDEX(equipe,MATCH($B$3,code,0)+ROWS($1:11)-1,4),\"\")","v":""}]
[12,{"$f":"IF(ROWS($1:12)<=COUNTIF(code,$B$3),INDEX(equipe,MATCH($B$3,code,0)+ROWS($1:12)-1,4),\"\")","v":""}]
[13,{"$f":"IF(ROWS($1:13)<=COUNTIF(code,$B$3),INDEX(equipe,MATCH($B$3,code,0)+ROWS($1:13)-1,4),\"\")","v":""}]
[14,{"$f":"IF(ROWS($1:14)<=COUNTIF(code,$B$3),INDEX(equipe,MATCH($B$3,code,0)+ROWS($1:14)-1,4),\"\")","v":""}]
[15,{"$f":"IF(ROWS($1:15)<=COUNTIF(code,$B$3),INDEX(equipe,MATCH($B$3,code,0)+ROWS($1:15)-1,4),\"\")","v":""}]
[]
[null,null,{"$f":"EDATE($C3,1)","v":"2024-01-01"},{"$f":"C25+1","v":"2024-01-02"},"2024-01-03","2024-01-04","2024-01-05","2024-01-06","2024-01-07","2024-01-08","2024-01-09","2024-01-10","2024-01-11","2024-01-12","2024-01-13","2024-01-14","2024-01-15","2024-01-16","2024-01-17","2024-01-18","2024-01-19","2024-01-20","2024-01-21","2024-01-22","2024-01-23","2024-01-24","2024-01-25","2024-01-26","2024-01-27","2024-01-28",{"$f":"IF(MONTH($AD$25)<>MONTH(AD25+1),\"\",AD25+1)","v":"2024-01-29"},{"$f":"IF(AE25=\"\",\"\",IF(MONTH(AE25+1)<>MONTH(AE25),\"\",AE25+1))","v":"2024-01-30"},{"$f":"IF(AF25=\"\",\"\",IF(MONTH(AF25+1)<>MONTH(AF25),\"\",AF25+1))","v":"2024-01-31"}]
[null,{"$f":"PROPER(TEXT(C25,\"Mmmm\"))","v":"Janvier"},{"$f":"C25","v":"2024-01-01"},"2024-01-02","2024-01-03","2024-01-04","2024-01-05","2024-01-06","2024-01-07","2024-01-08","2024-01-09","2024-01-10","2024-01-11","2024-01-12","2024-01-13","2024-01-14","2024-01-15","2024-01-16","2024-01-17","2024-01-18","2024-01-19","2024-01-20","2024-01-21","2024-01-22","2024-01-23","2024-01-24","2024-01-25","2024-01-26","2024-01-27","2024-01-28","2024-01-29","2024-01-30","2024-01-31"]
[null,"Férié",{"$f":"IF(C25=\"\",\"\",DATE($C$1,MATCH($B26,Infos!$A$2:$A$13,0),DAY(C$25)))","v":"2023-01-01"},{"$f":"IF(D25=\"\",\"\",DATE($C$1,MATCH($B26,Infos!$A$2:$A$13,0),DAY(D$25)))","v":"2023-01-02"},{"$f":"IF(E25=\"\",\"\",DATE($C$1,MATCH($B26,Infos!$A$2:$A$13,0),DAY(E$25)))","v":"2023-01-03"},{"$f":"IF(F25=\"\",\"\",DATE($C$1,MATCH($B26,Infos!$A$2:$A$13,0),DAY(F$25)))","v":"2023-01-04"},{"$f":"IF(G25=\"\",\"\",DATE($C$1,MATCH($B26,Infos!$A$2:$A$13,0),DAY(G$25)))","v":"2023-01-05"},{"$f":"IF(H25=\"\",\"\",DATE($C$1,MATCH($B26,Infos!$A$2:$A$13,0),DAY(H$25)))","v":"2023-01-06"},{"$f":"IF(I25=\"\",\"\",DATE($C$1,MATCH($B26,Infos!$A$2:$A$13,0),DAY(I$25)))","v":"2023-01-07"},{"$f":"IF(J25=\"\",\"\",DATE($C$1,MATCH($B26,Infos!$A$2:$A$13,0),DAY(J$25)))","v":"2023-01-08"},{"$f":"IF(K25=\"\",\"\",DATE($C$1,MATCH($B26,Infos!$A$2:$A$13,0),DAY(K$25)))","v":"2023-01-09"},{"$f":"IF(L25=\"\",\"\",DATE($C$1,MATCH($B26,Infos!$A$2:$A$13,0),DAY(L$25)))","v":"2023-01-10"},{"$f":"IF(M25=\"\",\"\",DATE($C$1,MATCH($B26,Infos!$A$2:$A$13,0),DAY(M$25)))","v":"2023-01-11"},{"$f":"IF(N25=\"\",\"\",DATE($C$1,MATCH($B26,Infos!$A$2:$A$13,0),DAY(N$25)))","v":"2023-01-12"},{"$f":"IF(O25=\"\",\"\",DATE($C$1,MATCH($B26,Infos!$A$2:$A$13,0),DAY(O$25)))","v":"2023-01-13"},{"$f":"IF(P25=\"\",\"\",DATE($C$1,MATCH($B26,Infos!$A$2:$A$13,0),DAY(P$25)))","v":"2023-01-14"},{"$f":"IF(Q25=\"\",\"\",DATE($C$1,MATCH($B26,Infos!$A$2:$A$13,0),DAY(Q$25)))","v":"2023-01-15"},{"$f":"IF(R25=\"\",\"\",DATE($C$1,MATCH($B26,Infos!$A$2:$A$13,0),DAY(R$25)))","v":"2023-01-16"},{"$f":"IF(S25=\"\",\"\",DATE($C$1,MATCH($B26,Infos!$A$2:$A$13,0),DAY(S$25)))","v":"2023-01-17"},{"$f":"IF(T25=\"\",\"\",DATE($C$1,MATCH($B26,Infos!$A$2:$A$13,0),DAY(T$25)))","v":"2023-01-18"},{"$f":"IF(U25=\"\",\"\",DATE($C$1,MATCH($B26,Infos!$A$2:$A$13,0),DAY(U$25)))","v":"2023-01-19"},{"$f":"IF(V25=\"\",\"\",DATE($C$1,MATCH($B26,Infos!$A$2:$A$13,0),DAY(V$25)))","v":"2023-01-20"},{"$f":"IF(W25=\"\",\"\",DATE($C$1,MATCH($B26,Infos!$A$2:$A$13,0),DAY(W$25)))","v":"2023-01-21"},{"$f":"IF(X25=\"\",\"\",DATE($C$1,MATCH($B26,Infos!$A$2:$A$13,0),DAY(X$25)))","v":"2023-01-22"},{"$f":"IF(Y25=\"\",\"\",DATE($C$1,MATCH($B26,Infos!$A$2:$A$13,0),DAY(Y$25)))","v":"2023-01-23"},{"$f":"IF(Z25=\"\",\"\",DATE($C$1,MATCH($B26,Infos!$A$2:$A$13,0),DAY(Z$25)))","v":"2023-01-24"},{"$f":"IF(AA25=\"\",\"\",DATE($C$1,MATCH($B26,Infos!$A$2:$A$13,0),DAY(AA$25)))","v":"2023-01-25"},{"$f":"IF(AB25=\"\",\"\",DATE($C$1,MATCH($B26,Infos!$A$2:$A$13,0),DAY(AB$25)))","v":"2023-01-26"},{"$f":"IF(AC25=\"\",\"\",DATE($C$1,MATCH($B26,Infos!$A$2:$A$13,0),DAY(AC$25)))","v":"2023-01-27"},{"$f":"IF(AD25=\"\",\"\",DATE($C$1,MATCH($B26,Infos!$A$2:$A$13,0),DAY(AD$25)))","v":"2023-01-28"},{"$f":"IF(AE25=\"\",\"\",DATE($C$1,MATCH($B26,Infos!$A$2:$A$13,0),DAY(AE$25)))","v":"2023-01-29"},{"$f":"IF(AF25=\"\",\"\",DATE($C$1,MATCH($B26,Infos!$A$2:$A$13,0),DAY(AF$25)))","v":"2023-01-30"},{"$f":"IF(AG25=\"\",\"\",DATE($C$1,MATCH($B26,Infos!$A$2:$A$13,0),DAY(AG$25)))","v":"2023-01-31"},null,"sera caché"]
[null,"WE",{"$f":"IF(C25<>\"\",IF(COUNTIF('Jours fériés'!$B$3:$B$15,Planning!C27),8,WEEKDAY(C27,2)),\"\")","v":8},{"$f":"IF(D25<>\"\",IF(COUNTIF('Jours fériés'!$B$3:$B$15,Planning!D27),8,WEEKDAY(D27,2)),\"\")","v":1},{"$f":"IF(E25<>\"\",IF(COUNTIF('Jours fériés'!$B$3:$B$15,Planning!E27),8,WEEKDAY(E27,2)),\"\")","v":2},{"$f":"IF(F25<>\"\",IF(COUNTIF('Jours fériés'!$B$3:$B$15,Planning!F27),8,WEEKDAY(F27,2)),\"\")","v":3},{"$f":"IF(G25<>\"\",IF(COUNTIF('Jours fériés'!$B$3:$B$15,Planning!G27),8,WEEKDAY(G27,2)),\"\")","v":4},{"$f":"IF(H25<>\"\",IF(COUNTIF('Jours fériés'!$B$3:$B$15,Planning!H27),8,WEEKDAY(H27,2)),\"\")","v":5},{"$f":"IF(I25<>\"\",IF(COUNTIF('Jours fériés'!$B$3:$B$15,Planning!I27),8,WEEKDAY(I27,2)),\"\")","v":6},{"$f":"IF(J25<>\"\",IF(COUNTIF('Jours fériés'!$B$3:$B$15,Planning!J27),8,WEEKDAY(J27,2)),\"\")","v":7},{"$f":"IF(K25<>\"\",IF(COUNTIF('Jours fériés'!$B$3:$B$15,Planning!K27),8,WEEKDAY(K27,2)),\"\")","v":1},{"$f":"IF(L25<>\"\",IF(COUNTIF('Jours fériés'!$B$3:$B$15,Planning!L27),8,WEEKDAY(L27,2)),\"\")","v":2},{"$f":"IF(M25<>\"\",IF(COUNTIF('Jours fériés'!$B$3:$B$15,Planning!M27),8,WEEKDAY(M27,2)),\"\")","v":3},{"$f":"IF(N25<>\"\",IF(COUNTIF('Jours fériés'!$B$3:$B$15,Planning!N27),8,WEEKDAY(N27,2)),\"\")","v":4},{"$f":"IF(O25<>\"\",IF(COUNTIF('Jours fériés'!$B$3:$B$15,Planning!O27),8,WEEKDAY(O27,2)),\"\")","v":5},{"$f":"IF(P25<>\"\",IF(COUNTIF('Jours fériés'!$B$3:$B$15,Planning!P27),8,WEEKDAY(P27,2)),\"\")","v":6},{"$f":"IF(Q25<>\"\",IF(COUNTIF('Jours fériés'!$B$3:$B$15,Planning!Q27),8,WEEKDAY(Q27,2)),\"\")","v":7},{"$f":"IF(R25<>\"\",IF(COUNTIF('Jours fériés'!$B$3:$B$15,Planning!R27),8,WEEKDAY(R27,2)),\"\")","v":1},{"$f":"IF(S25<>\"\",IF(COUNTIF('Jours fériés'!$B$3:$B$15,Planning!S27),8,WEEKDAY(S27,2)),\"\")","v":2},{"$f":"IF(T25<>\"\",IF(COUNTIF('Jours fériés'!$B$3:$B$15,Planning!T27),8,WEEKDAY(T27,2)),\"\")","v":3},{"$f":"IF(U25<>\"\",IF(COUNTIF('Jours fériés'!$B$3:$B$15,Planning!U27),8,WEEKDAY(U27,2)),\"\")","v":4},{"$f":"IF(V25<>\"\",IF(COUNTIF('Jours fériés'!$B$3:$B$15,Planning!V27),8,WEEKDAY(V27,2)),\"\")","v":5},{"$f":"IF(W25<>\"\",IF(COUNTIF('Jours fériés'!$B$3:$B$15,Planning!W27),8,WEEKDAY(W27,2)),\"\")","v":6},{"$f":"IF(X25<>\"\",IF(COUNTIF('Jours fériés'!$B$3:$B$15,Planning!X27),8,WEEKDAY(X27,2)),\"\")","v":7},{"$f":"IF(Y25<>\"\",IF(COUNTIF('Jours fériés'!$B$3:$B$15,Planning!Y27),8,WEEKDAY(Y27,2)),\"\")","v":1},{"$f":"IF(Z25<>\"\",IF(COUNTIF('Jours fériés'!$B$3:$B$15,Planning!Z27),8,WEEKDAY(Z27,2)),\"\")","v":2},{"$f":"IF(AA25<>\"\",IF(COUNTIF('Jours fériés'!$B$3:$B$15,Planning!AA27),8,WEEKDAY(AA27,2)),\"\")","v":3},{"$f":"IF(AB25<>\"\",IF(COUNTIF('Jours fériés'!$B$3:$B$15,Planning!AB27),8,WEEKDAY(AB27,2)),\"\")","v":4},{"$f":"IF(AC25<>\"\",IF(COUNTIF('Jours fériés'!$B$3:$B$15,Planning!AC27),8,WEEKDAY(AC27,2)),\"\")","v":5},{"$f":"IF(AD25<>\"\",IF(COUNTIF('Jours fériés'!$B$3:$B$15,Planning!AD27),8,WEEKDAY(AD27,2)),\"\")","v":6},{"$f":"IF(AE25<>\"\",IF(COUNTIF('Jours fériés'!$B$3:$B$15,Planning!AE27),8,WEEKDAY(AE27,2)),\"\")","v":7},{"$f":"IF(AF25<>\"\",IF(COUNTIF('Jours fériés'!$B$3:$B$15,Planning!AF27),8,WEEKDAY(AF27,2)),\"\")","v":1},{"$f":"IF(AG25<>\"\",IF(COUNTIF('Jours fériés'!$B$3:$B$15,Planning!AG27),8,WEEKDAY(AG27,2)),\"\")","v":2},null,"sera caché"]
[null,"VACANCES",{"$f":"IF(SUMPRODUCT((C25>=datdeb)*(C25<=datfin))=1,\"vac\",\"\")","v":"vac"},{"$f":"IF(SUMPRODUCT((D25>=datdeb)*(D25<=datfin))=1,\"vac\",\"\")","v":"vac"},{"$f":"IF(SUMPRODUCT((E25>=datdeb)*(E25<=datfin))=1,\"vac\",\"\")","v":"vac"},{"$f":"IF(SUMPRODUCT((F25>=datdeb)*(F25<=datfin))=1,\"vac\",\"\")","v":"vac"},{"$f":"IF(SUMPRODUCT((G25>=datdeb)*(G25<=datfin))=1,\"vac\",\"\")","v":"vac"},{"$f":"IF(SUMPRODUCT((H25>=datdeb)*(H25<=datfin))=1,\"vac\",\"\")","v":"vac"},{"$f":"IF(SUMPRODUCT((I25>=datdeb)*(I25<=datfin))=1,\"vac\",\"\")","v":"vac"},{"$f":"IF(SUMPRODUCT((J25>=datdeb)*(J25<=datfin))=1,\"vac\",\"\")","v":"vac"},{"$f":"IF(SUMPRODUCT((K25>=datdeb)*(K25<=datfin))=1,\"vac\",\"\")","v":""},{"$f":"IF(SUMPRODUCT((L25>=datdeb)*(L25<=datfin))=1,\"vac\",\"\")","v":""},{"$f":"IF(SUMPRODUCT((M25>=datdeb)*(M25<=datfin))=1,\"vac\",\"\")","v":""},{"$f":"IF(SUMPRODUCT((N25>=datdeb)*(N25<=datfin))=1,\"vac\",\"\")","v":""},{"$f":"IF(SUMPRODUCT((O25>=datdeb)*(O25<=datfin))=1,\"vac\",\"\")","v":""},{"$f":"IF(SUMPRODUCT((P25>=datdeb)*(P25<=datfin))=1,\"vac\",\"\")","v":""},{"$f":"IF(SUMPRODUCT((Q25>=datdeb)*(Q25<=datfin))=1,\"vac\",\"\")","v":""},{"$f":"IF(SUMPRODUCT((R25>=datdeb)*(R25<=datfin))=1,\"vac\",\"\")","v":""},{"$f":"IF(SUMPRODUCT((S25>=datdeb)*(S25<=datfin))=1,\"vac\",\"\")","v":""},{"$f":"IF(SUMPRODUCT((T25>=datdeb)*(T25<=datfin))=1,\"vac\",\"\")","v":""},{"$f":"IF(SUMPRODUCT((U25>=datdeb)*(U25<=datfin))=1,\"vac\",\"\")","v":""},{"$f":"IF(SUMPRODUCT((V25>=datdeb)*(V25<=datfin))=1,\"vac\",\"\")","v":""},{"$f":"IF(SUMPRODUCT((W25>=datdeb)*(W25<=datfin))=1,\"vac\",\"\")","v":""},{"$f":"IF(SUMPRODUCT((X25>=datdeb)*(X25<=datfin))=1,\"vac\",\"\")","v":""},{"$f":"IF(SUMPRODUCT((Y25>=datdeb)*(Y25<=datfin))=1,\"vac\",\"\")","v":""},{"$f":"IF(SUMPRODUCT((Z25>=datdeb)*(Z25<=datfin))=1,\"vac\",\"\")","v":""},{"$f":"IF(SUMPRODUCT((AA25>=datdeb)*(AA25<=datfin))=1,\"vac\",\"\")","v":""},{"$f":"IF(SUMPRODUCT((AB25>=datdeb)*(AB25<=datfin))=1,\"vac\",\"\")","v":""},{"$f":"IF(SUMPRODUCT((AC25>=datdeb)*(AC25<=datfin))=1,\"vac\",\"\")","v":""},{"$f":"IF(SUMPRODUCT((AD25>=datdeb)*(AD25<=datfin))=1,\"vac\",\"\")","v":""},{"$f":"IF(SUMPRODUCT((AE25>=datdeb)*(AE25<=datfin))=1,\"vac\",\"\")","v":""},{"$f":"IF(SUMPRODUCT((AF25>=datdeb)*(AF25<=datfin))=1,\"vac\",\"\")","v":""},{"$f":"IF(SUMPRODUCT((AG25>=datdeb)*(AG25<=datfin))=1,\"vac\",\"\")","v":""}]
[null,null,{"$f":"IFERROR(_xlfn.SWITCH($B$3,\"C1\",INDEX(Infos_2!$D$2:$D$1097,MATCH(C25,Infos_2!$C$2:$C$1097,0),1),\"C2\",INDEX(Infos_2!$G$2:$G$1097,MATCH(C25,Infos_2!$F$2:$F$1097,0), ,1),\"H\",INDEX(Infos_2!$J$2:$J$1097,MATCH(C25,Infos_2!$I$2:$I$1097,0), ,1),\"H1\",INDEX(Infos_2!$M$2:$M$1097,MATCH(C25,Infos_2!$L$2:$L$1097,0), ,1),\"H2\",INDEX(Infos_2!$P$2:$P$1097,MATCH(C25,Infos_2!$O$2:$O$1097,0), ,1)),\"\")","v":"T"},{"$f":"IFERROR(_xlfn.SWITCH($B$3,\"C1\",INDEX(Infos_2!$D$2:$D$1097,MATCH(D25,Infos_2!$C$2:$C$1097,0),1),\"C2\",INDEX(Infos_2!$G$2:$G$1097,MATCH(D25,Infos_2!$F$2:$F$1097,0), ,1),\"H\",INDEX(Infos_2!$J$2:$J$1097,MATCH(D25,Infos_2!$I$2:$I$1097,0), ,1),\"H1\",INDEX(Infos_2!$M$2:$M$1097,MATCH(D25,Infos_2!$L$2:$L$1097,0), ,1),\"H2\",INDEX(Infos_2!$P$2:$P$1097,MATCH(D25,Infos_2!$O$2:$O$1097,0), ,1)),\"\")","v":"T"},{"$f":"IFERROR(_xlfn.SWITCH($B$3,\"C1\",INDEX(Infos_2!$D$2:$D$1097,MATCH(E25,Infos_2!$C$2:$C$1097,0),1),\"C2\",INDEX(Infos_2!$G$2:$G$1097,MATCH(E25,Infos_2!$F$2:$F$1097,0), ,1),\"H\",INDEX(Infos_2!$J$2:$J$1097,MATCH(E25,Infos_2!$I$2:$I$1097,0), ,1),\"H1\",INDEX(Infos_2!$M$2:$M$1097,MATCH(E25,Infos_2!$L$2:$L$1097,0), ,1),\"H2\",INDEX(Infos_2!$P$2:$P$1097,MATCH(E25,Infos_2!$O$2:$O$1097,0), ,1)),\"\")","v":"T"},{"$f":"IFERROR(_xlfn.SWITCH($B$3,\"C1\",INDEX(Infos_2!$D$2:$D$1097,MATCH(F25,Infos_2!$C$2:$C$1097,0),1),\"C2\",INDEX(Infos_2!$G$2:$G$1097,MATCH(F25,Infos_2!$F$2:$F$1097,0), ,1),\"H\",INDEX(Infos_2!$J$2:$J$1097,MATCH(F25,Infos_2!$I$2:$I$1097,0), ,1),\"H1\",INDEX(Infos_2!$M$2:$M$1097,MATCH(F25,Infos_2!$L$2:$L$1097,0), ,1),\"H2\",INDEX(Infos_2!$P$2:$P$1097,MATCH(F25,Infos_2!$O$2:$O$1097,0), ,1)),\"\")","v":"T"},{"$f":"IFERROR(_xlfn.SWITCH($B$3,\"C1\",INDEX(Infos_2!$D$2:$D$1097,MATCH(G25,Infos_2!$C$2:$C$1097,0),1),\"C2\",INDEX(Infos_2!$G$2:$G$1097,MATCH(G25,Infos_2!$F$2:$F$1097,0), ,1),\"H\",INDEX(Infos_2!$J$2:$J$1097,MATCH(G25,Infos_2!$I$2:$I$1097,0), ,1),\"H1\",INDEX(Infos_2!$M$2:$M$1097,MATCH(G25,Infos_2!$L$2:$L$1097,0), ,1),\"H2\",INDEX(Infos_2!$P$2:$P$1097,MATCH(G25,Infos_2!$O$2:$O$1097,0), ,1)),\"\")","v":"T"},{"$f":"IFERROR(_xlfn.SWITCH($B$3,\"C1\",INDEX(Infos_2!$D$2:$D$1097,MATCH(H25,Infos_2!$C$2:$C$1097,0),1),\"C2\",INDEX(Infos_2!$G$2:$G$1097,MATCH(H25,Infos_2!$F$2:$F$1097,0), ,1),\"H\",INDEX(Infos_2!$J$2:$J$1097,MATCH(H25,Infos_2!$I$2:$I$1097,0), ,1),\"H1\",INDEX(Infos_2!$M$2:$M$1097,MATCH(H25,Infos_2!$L$2:$L$1097,0), ,1),\"H2\",INDEX(Infos_2!$P$2:$P$1097,MATCH(H25,Infos_2!$O$2:$O$1097,0), ,1)),\"\")","v":"R"},{"$f":"IFERROR(_xlfn.SWITCH($B$3,\"C1\",INDEX(Infos_2!$D$2:$D$1097,MATCH(I25,Infos_2!$C$2:$C$1097,0),1),\"C2\",INDEX(Infos_2!$G$2:$G$1097,MATCH(I25,Infos_2!$F$2:$F$1097,0), ,1),\"H\",INDEX(Infos_2!$J$2:$J$1097,MATCH(I25,Infos_2!$I$2:$I$1097,0), ,1),\"H1\",INDEX(Infos_2!$M$2:$M$1097,MATCH(I25,Infos_2!$L$2:$L$1097,0), ,1),\"H2\",INDEX(Infos_2!$P$2:$P$1097,MATCH(I25,Infos_2!$O$2:$O$1097,0), ,1)),\"\")","v":"R"},{"$f":"IFERROR(_xlfn.SWITCH($B$3,\"C1\",INDEX(Infos_2!$D$2:$D$1097,MATCH(J25,Infos_2!$C$2:$C$1097,0),1),\"C2\",INDEX(Infos_2!$G$2:$G$1097,MATCH(J25,Infos_2!$F$2:$F$1097,0), ,1),\"H\",INDEX(Infos_2!$J$2:$J$1097,MATCH(J25,Infos_2!$I$2:$I$1097,0), ,1),\"H1\",INDEX(Infos_2!$M$2:$M$1097,MATCH(J25,Infos_2!$L$2:$L$1097,0), ,1),\"H2\",INDEX(Infos_2!$P$2:$P$1097,MATCH(J25,Infos_2!$O$2:$O$1097,0), ,1)),\"\")","v":"T"},{"$f":"IFERROR(_xlfn.SWITCH($B$3,\"C1\",INDEX(Infos_2!$D$2:$D$1097,MATCH(K25,Infos_2!$C$2:$C$1097,0),1),\"C2\",INDEX(Infos_2!$G$2:$G$1097,MATCH(K25,Infos_2!$F$2:$F$1097,0), ,1),\"H\",INDEX(Infos_2!$J$2:$J$1097,MATCH(K25,Infos_2!$I$2:$I$1097,0), ,1),\"H1\",INDEX(Infos_2!$M$2:$M$1097,MATCH(K25,Infos_2!$L$2:$L$1097,0), ,1),\"H2\",INDEX(Infos_2!$P$2:$P$1097,MATCH(K25,Infos_2!$O$2:$O$1097,0), ,1)),\"\")","v":"T"},{"$f":"IFERROR(_xlfn.SWITCH($B$3,\"C1\",INDEX(Infos_2!$D$2:$D$1097,MATCH(L25,Infos_2!$C$2:$C$1097,0),1),\"C2\",INDEX(Infos_2!$G$2:$G$1097,MATCH(L25,Infos_2!$F$2:$F$1097,0), ,1),\"H\",INDEX(Infos_2!$J$2:$J$1097,MATCH(L25,Infos_2!$I$2:$I$1097,0), ,1),\"H1\",INDEX(Infos_2!$M$2:$M$1097,MATCH(L25,Infos_2!$L$2:$L$1097,0), ,1),\"H2\",INDEX(Infos_2!$P$2:$P$1097,MATCH(L25,Infos_2!$O$2:$O$1097,0), ,1)),\"\")","v":"T"},{"$f":"IFERROR(_xlfn.SWITCH($B$3,\"C1\",INDEX(Infos_2!$D$2:$D$1097,MATCH(M25,Infos_2!$C$2:$C$1097,0),1),\"C2\",INDEX(Infos_2!$G$2:$G$1097,MATCH(M25,Infos_2!$F$2:$F$1097,0), ,1),\"H\",INDEX(Infos_2!$J$2:$J$1097,MATCH(M25,Infos_2!$I$2:$I$1097,0), ,1),\"H1\",INDEX(Infos_2!$M$2:$M$1097,MATCH(M25,Infos_2!$L$2:$L$1097,0), ,1),\"H2\",INDEX(Infos_2!$P$2:$P$1097,MATCH(M25,Infos_2!$O$2:$O$1097,0), ,1)),\"\")","v":"T"},{"$f":"IFERROR(_xlfn.SWITCH($B$3,\"C1\",INDEX(Infos_2!$D$2:$D$1097,MATCH(N25,Infos_2!$C$2:$C$1097,0),1),\"C2\",INDEX(Infos_2!$G$2:$G$1097,MATCH(N25,Infos_2!$F$2:$F$1097,0), ,1),\"H\",INDEX(Infos_2!$J$2:$J$1097,MATCH(N25,Infos_2!$I$2:$I$1097,0), ,1),\"H1\",INDEX(Infos_2!$M$2:$M$1097,MATCH(N25,Infos_2!$L$2:$L$1097,0), ,1),\"H2\",INDEX(Infos_2!$P$2:$P$1097,MATCH(N25,Infos_2!$O$2:$O$1097,0), ,1)),\"\")","v":"T"},{"$f":"IFERROR(_xlfn.SWITCH($B$3,\"C1\",INDEX(Infos_2!$D$2:$D$1097,MATCH(O25,Infos_2!$C$2:$C$1097,0),1),\"C2\",INDEX(Infos_2!$G$2:$G$1097,MATCH(O25,Infos_2!$F$2:$F$1097,0), ,1),\"H\",INDEX(Infos_2!$J$2:$J$1097,MATCH(O25,Infos_2!$I$2:$I$1097,0), ,1),\"H1\",INDEX(Infos_2!$M$2:$M$1097,MATCH(O25,Infos_2!$L$2:$L$1097,0), ,1),\"H2\",INDEX(Infos_2!$P$2:$P$1097,MATCH(O25,Infos_2!$O$2:$O$1097,0), ,1)),\"\")","v":"R"},{"$f":"IFERROR(_xlfn.SWITCH($B$3,\"C1\",INDEX(Infos_2!$D$2:$D$1097,MATCH(P25,Infos_2!$C$2:$C$1097,0),1),\"C2\",INDEX(Infos_2!$G$2:$G$1097,MATCH(P25,Infos_2!$F$2:$F$1097,0), ,1),\"H\",INDEX(Infos_2!$J$2:$J$1097,MATCH(P25,Infos_2!$I$2:$I$1097,0), ,1),\"H1\",INDEX(Infos_2!$M$2:$M$1097,MATCH(P25,Infos_2!$L$2:$L$1097,0), ,1),\"H2\",INDEX(Infos_2!$P$2:$P$1097,MATCH(P25,Infos_2!$O$2:$O$1097,0), ,1)),\"\")","v":"R"},{"$f":"IFERROR(_xlfn.SWITCH($B$3,\"C1\",INDEX(Infos_2!$D$2:$D$1097,MATCH(Q25,Infos_2!$C$2:$C$1097,0),1),\"C2\",INDEX(Infos_2!$G$2:$G$1097,MATCH(Q25,Infos_2!$F$2:$F$1097,0), ,1),\"H\",INDEX(Infos_2!$J$2:$J$1097,MATCH(Q25,Infos_2!$I$2:$I$1097,0), ,1),\"H1\",INDEX(Infos_2!$M$2:$M$1097,MATCH(Q25,Infos_2!$L$2:$L$1097,0), ,1),\"H2\",INDEX(Infos_2!$P$2:$P$1097,MATCH(Q25,Infos_2!$O$2:$O$1097,0), ,1)),\"\")","v":"T"},{"$f":"IFERROR(_xlfn.SWITCH($B$3,\"C1\",INDEX(Infos_2!$D$2:$D$1097,MATCH(R25,Infos_2!$C$2:$C$1097,0),1),\"C2\",INDEX(Infos_2!$G$2:$G$1097,MATCH(R25,Infos_2!$F$2:$F$1097,0), ,1),\"H\",INDEX(Infos_2!$J$2:$J$1097,MATCH(R25,Infos_2!$I$2:$I$1097,0), ,1),\"H1\",INDEX(Infos_2!$M$2:$M$1097,MATCH(R25,Infos_2!$L$2:$L$1097,0), ,1),\"H2\",INDEX(Infos_2!$P$2:$P$1097,MATCH(R25,Infos_2!$O$2:$O$1097,0), ,1)),\"\")","v":"T"},{"$f":"IFERROR(_xlfn.SWITCH($B$3,\"C1\",INDEX(Infos_2!$D$2:$D$1097,MATCH(S25,Infos_2!$C$2:$C$1097,0),1),\"C2\",INDEX(Infos_2!$G$2:$G$1097,MATCH(S25,Infos_2!$F$2:$F$1097,0), ,1),\"H\",INDEX(Infos_2!$J$2:$J$1097,MATCH(S25,Infos_2!$I$2:$I$1097,0), ,1),\"H1\",INDEX(Infos_2!$M$2:$M$1097,MATCH(S25,Infos_2!$L$2:$L$1097,0), ,1),\"H2\",INDEX(Infos_2!$P$2:$P$1097,MATCH(S25,Infos_2!$O$2:$O$1097,0), ,1)),\"\")","v":"T"},{"$f":"IFERROR(_xlfn.SWITCH($B$3,\"C1\",INDEX(Infos_2!$D$2:$D$1097,MATCH(T25,Infos_2!$C$2:$C$1097,0),1),\"C2\",INDEX(Infos_2!$G$2:$G$1097,MATCH(T25,Infos_2!$F$2:$F$1097,0), ,1),\"H\",INDEX(Infos_2!$J$2:$J$1097,MATCH(T25,Infos_2!$I$2:$I$1097,0), ,1),\"H1\",INDEX(Infos_2!$M$2:$M$1097,MATCH(T25,Infos_2!$L$2:$L$1097,0), ,1),\"H2\",INDEX(Infos_2!$P$2:$P$1097,MATCH(T25,Infos_2!$O$2:$O$1097,0), ,1)),\"\")","v":"T"},{"$f":"IFERROR(_xlfn.SWITCH($B$3,\"C1\",INDEX(Infos_2!$D$2:$D$1097,MATCH(U25,Infos_2!$C$2:$C$1097,0),1),\"C2\",INDEX(Infos_2!$G$2:$G$1097,MATCH(U25,Infos_2!$F$2:$F$1097,0), ,1),\"H\",INDEX(Infos_2!$J$2:$J$1097,MATCH(U25,Infos_2!$I$2:$I$1097,0), ,1),\"H1\",INDEX(Infos_2!$M$2:$M$1097,MATCH(U25,Infos_2!$L$2:$L$1097,0), ,1),\"H2\",INDEX(Infos_2!$P$2:$P$1097,MATCH(U25,Infos_2!$O$2:$O$1097,0), ,1)),\"\")","v":"T"},{"$f":"IFERROR(_xlfn.SWITCH($B$3,\"C1\",INDEX(Infos_2!$D$2:$D$1097,MATCH(V25,Infos_2!$C$2:$C$1097,0),1),\"C2\",INDEX(Infos_2!$G$2:$G$1097,MATCH(V25,Infos_2!$F$2:$F$1097,0), ,1),\"H\",INDEX(Infos_2!$J$2:$J$1097,MATCH(V25,Infos_2!$I$2:$I$1097,0), ,1),\"H1\",INDEX(Infos_2!$M$2:$M$1097,MATCH(V25,Infos_2!$L$2:$L$1097,0), ,1),\"H2\",INDEX(Infos_2!$P$2:$P$1097,MATCH(V25,Infos_2!$O$2:$O$1097,0), ,1)),\"\")","v":"R"},{"$f":"IFERROR(_xlfn.SWITCH($B$3,\"C1\",INDEX(Infos_2!$D$2:$D$1097,MATCH(W25,Infos_2!$C$2:$C$1097,0),1),\"C2\",INDEX(Infos_2!$G$2:$G$1097,MATCH(W25,Infos_2!$F$2:$F$1097,0), ,1),\"H\",INDEX(Infos_2!$J$2:$J$1097,MATCH(W25,Infos_2!$I$2:$I$1097,0), ,1),\"H1\",INDEX(Infos_2!$M$2:$M$1097,MATCH(W25,Infos_2!$L$2:$L$1097,0), ,1),\"H2\",INDEX(Infos_2!$P$2:$P$1097,MATCH(W25,Infos_2!$O$2:$O$1097,0), ,1)),\"\")","v":"R"},{"$f":"IFERROR(_xlfn.SWITCH($B$3,\"C1\",INDEX(Infos_2!$D$2:$D$1097,MATCH(X25,Infos_2!$C$2:$C$1097,0),1),\"C2\",INDEX(Infos_2!$G$2:$G$1097,MATCH(X25,Infos_2!$F$2:$F$1097,0), ,1),\"H\",INDEX(Infos_2!$J$2:$J$1097,MATCH(X25,Infos_2!$I$2:$I$1097,0), ,1),\"H1\",INDEX(Infos_2!$M$2:$M$1097,MATCH(X25,Infos_2!$L$2:$L$1097,0), ,1),\"H2\",INDEX(Infos_2!$P$2:$P$1097,MATCH(X25,Infos_2!$O$2:$O$1097,0), ,1)),\"\")","v":"T"},{"$f":"IFERROR(_xlfn.SWITCH($B$3,\"C1\",INDEX(Infos_2!$D$2:$D$1097,MATCH(Y25,Infos_2!$C$2:$C$1097,0),1),\"C2\",INDEX(Infos_2!$G$2:$G$1097,MATCH(Y25,Infos_2!$F$2:$F$1097,0), ,1),\"H\",INDEX(Infos_2!$J$2:$J$1097,MATCH(Y25,Infos_2!$I$2:$I$1097,0), ,1),\"H1\",INDEX(Infos_2!$M$2:$M$1097,MATCH(Y25,Infos_2!$L$2:$L$1097,0), ,1),\"H2\",INDEX(Infos_2!$P$2:$P$1097,MATCH(Y25,Infos_2!$O$2:$O$1097,0), ,1)),\"\")","v":"T"},{"$f":"IFERROR(_xlfn.SWITCH($B$3,\"C1\",INDEX(Infos_2!$D$2:$D$1097,MATCH(Z25,Infos_2!$C$2:$C$1097,0),1),\"C2\",INDEX(Infos_2!$G$2:$G$1097,MATCH(Z25,Infos_2!$F$2:$F$1097,0), ,1),\"H\",INDEX(Infos_2!$J$2:$J$1097,MATCH(Z25,Infos_2!$I$2:$I$1097,0), ,1),\"H1\",INDEX(Infos_2!$M$2:$M$1097,MATCH(Z25,Infos_2!$L$2:$L$1097,0), ,1),\"H2\",INDEX(Infos_2!$P$2:$P$1097,MATCH(Z25,Infos_2!$O$2:$O$1097,0), ,1)),\"\")","v":"T"},{"$f":"IFERROR(_xlfn.SWITCH($B$3,\"C1\",INDEX(Infos_2!$D$2:$D$1097,MATCH(AA25,Infos_2!$C$2:$C$1097,0),1),\"C2\",INDEX(Infos_2!$G$2:$G$1097,MATCH(AA25,Infos_2!$F$2:$F$1097,0), ,1),\"H\",INDEX(Infos_2!$J$2:$J$1097,MATCH(AA25,Infos_2!$I$2:$I$1097,0), ,1),\"H1\",INDEX(Infos_2!$M$2:$M$1097,MATCH(AA25,Infos_2!$L$2:$L$1097,0), ,1),\"H2\",INDEX(Infos_2!$P$2:$P$1097,MATCH(AA25,Infos_2!$O$2:$O$1097,0), ,1)),\"\")","v":"T"},{"$f":"IFERROR(_xlfn.SWITCH($B$3,\"C1\",INDEX(Infos_2!$D$2:$D$1097,MATCH(AB25,Infos_2!$C$2:$C$1097,0),1),\"C2\",INDEX(Infos_2!$G$2:$G$1097,MATCH(AB25,Infos_2!$F$2:$F$1097,0), ,1),\"H\",INDEX(Infos_2!$J$2:$J$1097,MATCH(AB25,Infos_2!$I$2:$I$1097,0), ,1),\"H1\",INDEX(Infos_2!$M$2:$M$1097,MATCH(AB25,Infos_2!$L$2:$L$1097,0), ,1),\"H2\",INDEX(Infos_2!$P$2:$P$1097,MATCH(AB25,Infos_2!$O$2:$O$1097,0), ,1)),\"\")","v":"T"},{"$f":"IFERROR(_xlfn.SWITCH($B$3,\"C1\",INDEX(Infos_2!$D$2:$D$1097,MATCH(AC25,Infos_2!$C$2:$C$1097,0),1),\"C2\",INDEX(Infos_2!$G$2:$G$1097,MATCH(AC25,Infos_2!$F$2:$F$1097,0), ,1),\"H\",INDEX(Infos_2!$J$2:$J$1097,MATCH(AC25,Infos_2!$I$2:$I$1097,0), ,1),\"H1\",INDEX(Infos_2!$M$2:$M$1097,MATCH(AC25,Infos_2!$L$2:$L$1097,0), ,1),\"H2\",INDEX(Infos_2!$P$2:$P$1097,MATCH(AC25,Infos_2!$O$2:$O$1097,0), ,1)),\"\")","v":"R"},{"$f":"IFERROR(_xlfn.SWITCH($B$3,\"C1\",INDEX(Infos_2!$D$2:$D$1097,MATCH(AD25,Infos_2!$C$2:$C$1097,0),1),\"C2\",INDEX(Infos_2!$G$2:$G$1097,MATCH(AD25,Infos_2!$F$2:$F$1097,0), ,1),\"H\",INDEX(Infos_2!$J$2:$J$1097,MATCH(AD25,Infos_2!$I$2:$I$1097,0), ,1),\"H1\",INDEX(Infos_2!$M$2:$M$1097,MATCH(AD25,Infos_2!$L$2:$L$1097,0), ,1),\"H2\",INDEX(Infos_2!$P$2:$P$1097,MATCH(AD25,Infos_2!$O$2:$O$1097,0), ,1)),\"\")","v":"R"},{"$f":"IFERROR(_xlfn.SWITCH($B$3,\"C1\",INDEX(Infos_2!$D$2:$D$1097,MATCH(AE25,Infos_2!$C$2:$C$1097,0),1),\"C2\",INDEX(Infos_2!$G$2:$G$1097,MATCH(AE25,Infos_2!$F$2:$F$1097,0), ,1),\"H\",INDEX(Infos_2!$J$2:$J$1097,MATCH(AE25,Infos_2!$I$2:$I$1097,0), ,1),\"H1\",INDEX(Infos_2!$M$2:$M$1097,MATCH(AE25,Infos_2!$L$2:$L$1097,0), ,1),\"H2\",INDEX(Infos_2!$P$2:$P$1097,MATCH(AE25,Infos_2!$O$2:$O$1097,0), ,1)),\"\")","v":"T"},{"$f":"IFERROR(_xlfn.SWITCH($B$3,\"C1\",INDEX(Infos_2!$D$2:$D$1097,MATCH(AF25,Infos_2!$C$2:$C$1097,0),1),\"C2\",INDEX(Infos_2!$G$2:$G$1097,MATCH(AF25,Infos_2!$F$2:$F$1097,0), ,1),\"H\",INDEX(Infos_2!$J$2:$J$1097,MATCH(AF25,Infos_2!$I$2:$I$1097,0), ,1),\"H1\",INDEX(Infos_2!$M$2:$M$1097,MATCH(AF25,Infos_2!$L$2:$L$1097,0), ,1),\"H2\",INDEX(Infos_2!$P$2:$P$1097,MATCH(AF25,Infos_2!$O$2:$O$1097,0), ,1)),\"\")","v":"T"},{"$f":"IFERROR(_xlfn.SWITCH($B$3,\"C1\",INDEX(Infos_2!$D$2:$D$1097,MATCH(AG25,Infos_2!$C$2:$C$1097,0),1),\"C2\",INDEX(Infos_2!$G$2:$G$1097,MATCH(AG25,Infos_2!$F$2:$F$1097,0), ,1),\"H\",INDEX(Infos_2!$J$2:$J$1097,MATCH(AG25,Infos_2!$I$2:$I$1097,0), ,1),\"H1\",INDEX(Infos_2!$M$2:$M$1097,MATCH(AG25,Infos_2!$L$2:$L$1097,0), ,1),\"H2\",INDEX(Infos_2!$P$2:$P$1097,MATCH(AG25,Infos_2!$O$2:$O$1097,0), ,1)),\"\")","v":"T"},null,"sera caché"]
[1,{"$f":"bloc_nom","v":"NOM 50 Prénom 50"}]
[2,"NOM 51 Prénom 51"]
[3,"NOM 52 Prénom 52"]
[4,"NOM 53 Prénom 53"]
[5,"NOM 54 Prénom 54"]
[6,"NOM 55 Prénom 55"]
[7,"NOM 56 Prénom 56"]
[8,"NOM 57 Prénom 57"]
[9,"NOM 58 Prénom 58"]
[10,""]
[11,""]
[12,""]
[13,""]
[14,""]
[15,""]
[]
[null,null,{"$f":"EDATE($C25,1)","v":"2024-02-01"},{"$f":"C47+1","v":"2024-02-02"},"2024-02-03","2024-02-04","2024-02-05","2024-02-06","2024-02-07","2024-02-08","2024-02-09","2024-02-10","2024-02-11","2024-02-12","2024-02-13","2024-02-14","2024-02-15","2024-02-16","2024-02-17","2024-02-18","2024-02-19","2024-02-20","2024-02-21","2024-02-22","2024-02-23","2024-02-24","2024-02-25","2024-02-26","2024-02-27","2024-02-28",{"$f":"IF(MONTH($AD$47)<>MONTH(AD47+1),\"\",AD47+1)","v":"2024-02-29"},{"$f":"IF(AE47=\"\",\"\",IF(MONTH(AE47+1)<>MONTH(AE47),\"\",AE47+1))","v":""},{"$f":"IF(AF47=\"\",\"\",IF(MONTH(AF47+1)<>MONTH(AF47),\"\",AF47+1))","v":""}]
[null,{"$f":"PROPER(TEXT(C47,\"mmmm\"))","v":"Février"},{"$f":"C47","v":"2024-02-01"},"2024-02-02","2024-02-03","2024-02-04","2024-02-05","2024-02-06","2024-02-07","2024-02-08","2024-02-09","2024-02-10","2024-02-11","2024-02-12","2024-02-13","2024-02-14","2024-02-15","2024-02-16","2024-02-17","2024-02-18","2024-02-19","2024-02-20","2024-02-21","2024-02-22","2024-02-23","2024-02-24","2024-02-25","2024-02-26","2024-02-27","2024-02-28","2024-02-29","",""]
[null,"Férié",{"$f":"IF(C47=\"\",\"\",DATE($C$1,MATCH($B48,Infos!$A$2:$A$13,0),DAY(C$47)))","v":"2023-02-01"},{"$f":"IF(D47=\"\",\"\",DATE($C$1,MATCH($B48,Infos!$A$2:$A$13,0),DAY(D$47)))","v":"2023-02-02"},{"$f":"IF(E47=\"\",\"\",DATE($C$1,MATCH($B48,Infos!$A$2:$A$13,0),DAY(E$47)))","v":"2023-02-03"},{"$f":"IF(F47=\"\",\"\",DATE($C$1,MATCH($B48,Infos!$A$2:$A$13,0),DAY(F$47)))","v":"2023-02-04"},{"$f":"IF(G47=\"\",\"\",DATE($C$1,MATCH($B48,Infos!$A$2:$A$13,0),DAY(G$47)))","v":"2023-02-05"},{"$f":"IF(H47=\"\",\"\",DATE($C$1,MATCH($B48,Infos!$A$2:$A$13,0),DAY(H$47)))","v":"2023-02-06"},{"$f":"IF(I47=\"\",\"\",DATE($C$1,MATCH($B48,Infos!$A$2:$A$13,0),DAY(I$47)))","v":"2023-02-07"},{"$f":"IF(J47=\"\",\"\",DATE($C$1,MATCH($B48,Infos!$A$2:$A$13,0),DAY(J$47)))","v":"2023-02-08"},{"$f":"IF(K47=\"\",\"\",DATE($C$1,MATCH($B48,Infos!$A$2:$A$13,0),DAY(K$47)))","v":"2023-02-09"},{"$f":"IF(L47=\"\",\"\",DATE($C$1,MATCH($B48,Infos!$A$2:$A$13,0),DAY(L$47)))","v":"2023-02-10"},{"$f":"IF(M47=\"\",\"\",DATE($C$1,MATCH($B48,Infos!$A$2:$A$13,0),DAY(M$47)))","v":"2023-02-11"},{"$f":"IF(N47=\"\",\"\",DATE($C$1,MATCH($B48,Infos!$A$2:$A$13,0),DAY(N$47)))","v":"2023-02-12"},{"$f":"IF(O47=\"\",\"\",DATE($C$1,MATCH($B48,Infos!$A$2:$A$13,0),DAY(O$47)))","v":"2023-02-13"},{"$f":"IF(P47=\"\",\"\",DATE($C$1,MATCH($B48,Infos!$A$2:$A$13,0),DAY(P$47)))","v":"2023-02-14"},{"$f":"IF(Q47=\"\",\"\",DATE($C$1,MATCH($B48,Infos!$A$2:$A$13,0),DAY(Q$47)))","v":"2023-02-15"},{"$f":"IF(R47=\"\",\"\",DATE($C$1,MATCH($B48,Infos!$A$2:$A$13,0),DAY(R$47)))","v":"2023-02-16"},{"$f":"IF(S47=\"\",\"\",DATE($C$1,MATCH($B48,Infos!$A$2:$A$13,0),DAY(S$47)))","v":"2023-02-17"},{"$f":"IF(T47=\"\",\"\",DATE($C$1,MATCH($B48,Infos!$A$2:$A$13,0),DAY(T$47)))","v":"2023-02-18"},{"$f":"IF(U47=\"\",\"\",DATE($C$1,MATCH($B48,Infos!$A$2:$A$13,0),DAY(U$47)))","v":"2023-02-19"},{"$f":"IF(V47=\"\",\"\",DATE($C$1,MATCH($B48,Infos!$A$2:$A$13,0),DAY(V$47)))","v":"2023-02-20"},{"$f":"IF(W47=\"\",\"\",DATE($C$1,MATCH($B48,Infos!$A$2:$A$13,0),DAY(W$47)))","v":"2023-02-21"},{"$f":"IF(X47=\"\",\"\",DATE($C$1,MATCH($B48,Infos!$A$2:$A$13,0),DAY(X$47)))","v":"2023-02-22"},{"$f":"IF(Y47=\"\",\"\",DATE($C$1,MATCH($B48,Infos!$A$2:$A$13,0),DAY(Y$47)))","v":"2023-02-23"},{"$f":"IF(Z47=\"\",\"\",DATE($C$1,MATCH($B48,Infos!$A$2:$A$13,0),DAY(Z$47)))","v":"2023-02-24"},{"$f":"IF(AA47=\"\",\"\",DATE($C$1,MATCH($B48,Infos!$A$2:$A$13,0),DAY(AA$47)))","v":"2023-02-25"},{"$f":"IF(AB47=\"\",\"\",DATE($C$1,MATCH($B48,Infos!$A$2:$A$13,0),DAY(AB$47)))","v":"2023-02-26"},{"$f":"IF(AC47=\"\",\"\",DATE($C$1,MATCH($B48,Infos!$A$2:$A$13,0),DAY(AC$47)))","v":"2023-02-27"},{"$f":"IF(AD47=\"\",\"\",DATE($C$1,MATCH($B48,Infos!$A$2:$A$13,0),DAY(AD$47)))","v":"2023-02-28"},{"$f":"IF(AE47=\"\",\"\",DATE($C$1,MATCH($B48,Infos!$A$2:$A$13,0),DAY(AE$47)))","v":"2023-03-01"},{"$f":"IF(AF47=\"\",\"\",DATE($C$1,MATCH($B48,Infos!$A$2:$A$13,0),DAY(AF$47)))","v":""},{"$f":"IF(AG47=\"\",\"\",DATE($C$1,MATCH($B48,Infos!$A$2:$A$13,0),DAY(AG$47)))","v":""}]
[null,"WE",{"$f":"IF(C47<>\"\",IF(COUNTIF('Jours fériés'!$B$3:$B$15,Planning!C49),8,WEEKDAY(C49,2)),\"\")","v":3},{"$f":"IF(D47<>\"\",IF(COUNTIF('Jours fériés'!$B$3:$B$15,Planning!D49),8,WEEKDAY(D49,2)),\"\")","v":4},{"$f":"IF(E47<>\"\",IF(COUNTIF('Jours fériés'!$B$3:$B$15,Planning!E49),8,WEEKDAY(E49,2)),\"\")","v":5},{"$f":"IF(F47<>\"\",IF(COUNTIF('Jours fériés'!$B$3:$B$15,Planning!F49),8,WEEKDAY(F49,2)),\"\")","v":6},{"$f":"IF(G47<>\"\",IF(COUNTIF('Jours fériés'!$B$3:$B$15,Planning!G49),8,WEEKDAY(G49,2)),\"\")","v":7},{"$f":"IF(H47<>\"\",IF(COUNTIF('Jours fériés'!$B$3:$B$15,Planning!H49),8,WEEKDAY(H49,2)),\"\")","v":1},{"$f":"IF(I47<>\"\",IF(COUNTIF('Jours fériés'!$B$3:$B$15,Planning!I49),8,WEEKDAY(I49,2)),\"\")","v":2},{"$f":"IF(J47<>\"\",IF(COUNTIF('Jours fériés'!$B$3:$B$15,Planning!J49),8,WEEKDAY(J49,2)),\"\")","v":3},{"$f":"IF(K47<>\"\",IF(COUNTIF('Jours fériés'!$B$3:$B$15,Planning!K49),8,WEEKDAY(K49,2)),\"\")","v":4},{"$f":"IF(L47<>\"\",IF(COUNTIF('Jours fériés'!$B$3:$B$15,Planning!L49),8,WEEKDAY(L49,2)),\"\")","v":5},{"$f":"IF(M47<>\"\",IF(COUNTIF('Jours fériés'!$B$3:$B$15,Planning!M49),8,WEEKDAY(M49,2)),\"\")","v":6},{"$f":"IF(N47<>\"\",IF(COUNTIF('Jours fériés'!$B$3:$B$15,Planning!N49),8,WEEKDAY(N49,2)),\"\")","v":7},{"$f":"IF(O47<>\"\",IF(COUNTIF('Jours fériés'!$B$3:$B$15,Planning!O49),8,WEEKDAY(O49,2)),\"\")","v":1},{"$f":"IF(P47<>\"\",IF(COUNTIF('Jours fériés'!$B$3:$B$15,Planning!P49),8,WEEKDAY(P49,2)),\"\")","v":2},{"$f":"IF(Q47<>\"\",IF(COUNTIF('Jours fériés'!$B$3:$B$15,Planning!Q49),8,WEEKDAY(Q49,2)),\"\")","v":3},{"$f":"IF(R47<>\"\",IF(COUNTIF('Jours fériés'!$B$3:$B$15,Planning!R49),8,WEEKDAY(R49,2)),\"\")","v":4},{"$f":"IF(S47<>\"\",IF(COUNTIF('Jours fériés'!$B$3:$B$15,Planning!S49),8,WEEKDAY(S49,2)),\"\")","v":5},{"$f":"IF(T47<>\"\",IF(COUNTIF('Jours fériés'!$B$3:$B$15,Planning!T49),8,WEEKDAY(T49,2)),\"\")","v":6},{"$f":"IF(U47<>\"\",IF(COUNTIF('Jours fériés'!$B$3:$B$15,Planning!U49),8,WEEKDAY(U49,2)),\"\")","v":7},{"$f":"IF(V47<>\"\",IF(COUNTIF('Jours fériés'!$B$3:$B$15,Planning!V49),8,WEEKDAY(V49,2)),\"\")","v":1},{"$f":"IF(W47<>\"\",IF(COUNTIF('Jours fériés'!$B$3:$B$15,Planning!W49),8,WEEKDAY(W49,2)),\"\")","v":2},{"$f":"IF(X47<>\"\",IF(COUNTIF('Jours fériés'!$B$3:$B$15,Planning!X49),8,WEEKDAY(X49,2)),\"\")","v":3},{"$f":"IF(Y47<>\"\",IF(COUNTIF('Jours fériés'!$B$3:$B$15,Planning!Y49),8,WEEKDAY(Y49,2)),\"\")","v":4},{"$f":"IF(Z47<>\"\",IF(COUNTIF('Jours fériés'!$B$3:$B$15,Planning!Z49),8,WEEKDAY(Z49,2)),\"\")","v":5},{"$f":"IF(AA47<>\"\",IF(COUNTIF('Jours fériés'!$B$3:$B$15,Planning!AA49),8,WEEKDAY(AA49,2)),\"\")","v":6},{"$f":"IF(AB47<>\"\",IF(COUNTIF('Jours fériés'!$B$3:$B$15,Planning!AB49),8,WEEKDAY(AB49,2)),\"\")","v":7},{"$f":"IF(AC47<>\"\",IF(COUNTIF('Jours fériés'!$B$3:$B$15,Planning!AC49),8,WEEKDAY(AC49,2)),\"\")","v":1},{"$f":"IF(AD47<>\"\",IF(COUNTIF('Jours fériés'!$B$3:$B$15,Planning!AD49),8,WEEKDAY(AD49,2)),\"\")","v":2},{"$f":"IF(AE47<>\"\",IF(COUNTIF('Jours fériés'!$B$3:$B$15,Planning!AE49),8,WEEKDAY(AE49,2)),\"\")","v":3},{"$f":"IF(AF47<>\"\",IF(COUNTIF('Jours fériés'!$B$3:$B$15,Planning!AF49),8,WEEKDAY(AF49,2)),\"\")","v":""},{"$f":"IF(AG47<>\"\",IF(COUNTIF('Jours fériés'!$B$3:$B$15,Planning!AG49),8,WEEKDAY(AG49,2)),\"\")","v":""}]
[null,"VACANCES",{"$f":"IF(SUMPRODUCT((C47>=datdeb)*(C47<=datfin))=1,\"vac\",\"\")","v":""},{"$f":"IF(SUMPRODUCT((D47>=datdeb)*(D47<=datfin))=1,\"vac\",\"\")","v":""},{"$f":"IF(SUMPRODUCT((E47>=datdeb)*(E47<=datfin))=1,\"vac\",\"\")","v":""},{"$f":"IF(SUMPRODUCT((F47>=datdeb)*(F47<=datfin))=1,\"vac\",\"\")","v":""},{"$f":"IF(SUMPRODUCT((G47>=datdeb)*(G47<=datfin))=1,\"vac\",\"\")","v":""},{"$f":"IF(SUMPRODUCT((H47>=datdeb)*(H47<=datfin))=1,\"vac\",\"\")","v":""},{"$f":"IF(SUMPRODUCT((I47>=datdeb)*(I47<=datfin))=1,\"vac\",\"\")","v":""},{"$f":"IF(SUMPRODUCT((J47>=datdeb)*(J47<=datfin))=1,\"vac\",\"\")","v":""},{"$f":"IF(SUMPRODUCT((K47>=datdeb)*(K47<=datfin))=1,\"vac\",\"\")","v":""},{"$f":"IF(SUMPRODUCT((L47>=datdeb)*(L47<=datfin))=1,\"vac\",\"\")","v":""},{"$f":"IF(SUMPRODUCT((M47>=datdeb)*(M47<=datfin))=1,\"vac\",\"\")","v":""},{"$f":"IF(SUMPRODUCT((N47>=datdeb)*(N47<=datfin))=1,\"vac\",\"\")","v":""},{"$f":"IF(SUMPRODUCT((O47>=datdeb)*(O47<=datfin))=1,\"vac\",\"\")","v":""},{"$f":"IF(SUMPRODUCT((P47>=datdeb)*(P47<=datfin))=1,\"vac\",\"\")","v":""},{"$f":"IF(SUMPRODUCT((Q47>=datdeb)*(Q47<=datfin))=1,\"vac\",\"\")","v":""},{"$f":"IF(SUMPRODUCT((R47>=datdeb)*(R47<=datfin))=1,\"vac\",\"\")","v":""},{"$f":"IF(SUMPRODUCT((S47>=datdeb)*(S47<=datfin))=1,\"vac\",\"\")","v":"vac"},{"$f":"IF(SUMPRODUCT((T47>=datdeb)*(T47<=datfin))=1,\"vac\",\"\")","v":"vac"},{"$f":"IF(SUMPRODUCT((U47>=datdeb)*(U47<=datfin))=1,\"vac\",\"\")","v":"vac"},{"$f":"IF(SUMPRODUCT((V47>=datdeb)*(V47<=datfin))=1,\"vac\",\"\")","v":"vac"},{"$f":"IF(SUMPRODUCT((W47>=datdeb)*(W47<=datfin))=1,\"vac\",\"\")","v":"vac"},{"$f":"IF(SUMPRODUCT((X47>=datdeb)*(X47<=datfin))=1,\"vac\",\"\")","v":"vac"},{"$f":"IF(SUMPRODUCT((Y47>=datdeb)*(Y47<=datfin))=1,\"vac\",\"\")","v":"vac"},{"$f":"IF(SUMPRODUCT((Z47>=datdeb)*(Z47<=datfin))=1,\"vac\",\"\")","v":"vac"},{"$f":"IF(SUMPRODUCT((AA47>=datdeb)*(AA47<=datfin))=1,\"vac\",\"\")","v":"vac"},{"$f":"IF(SUMPRODUCT((AB47>=datdeb)*(AB47<=datfin))=1,\"vac\",\"\")","v":"vac"},{"$f":"IF(SUMPRODUCT((AC47>=datdeb)*(AC47<=datfin))=1,\"vac\",\"\")","v":"vac"},{"$f":"IF(SUMPRODUCT((AD47>=datdeb)*(AD47<=datfin))=1,\"vac\",\"\")","v":"vac"},{"$f":"IF(SUMPRODUCT((AE47>=datdeb)*(AE47<=datfin))=1,\"vac\",\"\")","v":"vac"},{"$f":"IF(SUMPRODUCT((AF47>=datdeb)*(AF47<=datfin))=1,\"vac\",\"\")","v":""},{"$f":"IF(SUMPRODUCT((AG47>=datdeb)*(AG47<=datfin))=1,\"vac\",\"\")","v":""}]
[null,null,{"$f":"IFERROR(_xlfn.SWITCH($B$3,\"C1\",INDEX(Infos_2!$D$2:$D$1097,MATCH(C47,Infos_2!$C$2:$C$1097,0),1),\"C2\",INDEX(Infos_2!$G$2:$G$1097,MATCH(C47,Infos_2!$F$2:$F$1097,0), ,1),\"H\",INDEX(Infos_2!$J$2:$J$1097,MATCH(C47,Infos_2!$I$2:$I$1097,0), ,1),\"H1\",INDEX(Infos_2!$M$2:$M$1097,MATCH(C47,Infos_2!$L$2:$L$1097,0), ,1),\"H2\",INDEX(Infos_2!$P$2:$P$1097,MATCH(C47,Infos_2!$O$2:$O$1097,0), ,1)),\"\")","v":"T"},{"$f":"IFERROR(_xlfn.SWITCH($B$3,\"C1\",INDEX(Infos_2!$D$2:$D$1097,MATCH(D47,Infos_2!$C$2:$C$1097,0),1),\"C2\",INDEX(Infos_2!$G$2:$G$1097,MATCH(D47,Infos_2!$F$2:$F$1097,0), ,1),\"H\",INDEX(Infos_2!$J$2:$J$1097,MATCH(D47,Infos_2!$I$2:$I$1097,0), ,1),\"H1\",INDEX(Infos_2!$M$2:$M$1097,MATCH(D47,Infos_2!$L$2:$L$1097,0), ,1),\"H2\",INDEX(Infos_2!$P$2:$P$1097,MATCH(D47,Infos_2!$O$2:$O$1097,0), ,1)),\"\")","v":"T"},{"$f":"IFERROR(_xlfn.SWITCH($B$3,\"C1\",INDEX(Infos_2!$D$2:$D$1097,MATCH(E47,Infos_2!$C$2:$C$1097,0),1),\"C2\",INDEX(Infos_2!$G$2:$G$1097,MATCH(E47,Infos_2!$F$2:$F$1097,0), ,1),\"H\",INDEX(Infos_2!$J$2:$J$1097,MATCH(E47,Infos_2!$I$2:$I$1097,0), ,1),\"H1\",INDEX(Infos_2!$M$2:$M$1097,MATCH(E47,Infos_2!$L$2:$L$1097,0), ,1),\"H2\",INDEX(Infos_2!$P$2:$P$1097,MATCH(E47,Infos_2!$O$2:$O$1097,0), ,1)),\"\")","v":"R"},{"$f":"IFERROR(_xlfn.SWITCH($B$3,\"C1\",INDEX(Infos_2!$D$2:$D$1097,MATCH(F47,Infos_2!$C$2:$C$1097,0),1),\"C2\",INDEX(Infos_2!$G$2:$G$1097,MATCH(F47,Infos_2!$F$2:$F$1097,0), ,1),\"H\",INDEX(Infos_2!$J$2:$J$1097,MATCH(F47,Infos_2!$I$2:$I$1097,0), ,1),\"H1\",INDEX(Infos_2!$M$2:$M$1097,MATCH(F47,Infos_2!$L$2:$L$1097,0), ,1),\"H2\",INDEX(Infos_2!$P$2:$P$1097,MATCH(F47,Infos_2!$O$2:$O$1097,0), ,1)),\"\")","v":"R"},{"$f":"IFERROR(_xlfn.SWITCH($B$3,\"C1\",INDEX(Infos_2!$D$2:$D$1097,MATCH(G47,Infos_2!$C$2:$C$1097,0),1),\"C2\",INDEX(Infos_2!$G$2:$G$1097,MATCH(G47,Infos_2!$F$2:$F$1097,0), ,1),\"H\",INDEX(Infos_2!$J$2:$J$1097,MATCH(G47,Infos_2!$I$2:$I$1097,0), ,1),\"H1\",INDEX(Infos_2!$M$2:$M$1097,MATCH(G47,Infos_2!$L$2:$L$1097,0), ,1),\"H2\",INDEX(Infos_2!$P$2:$P$1097,MATCH(G47,Infos_2!$O$2:$O$1097,0), ,1)),\"\")","v":"T"},{"$f":"IFERROR(_xlfn.SWITCH($B$3,\"C1\",INDEX(Infos_2!$D$2:$D$1097,MATCH(H47,Infos_2!$C$2:$C$1097,0),1),\"C2\",INDEX(Infos_2!$G$2:$G$1097,MATCH(H47,Infos_2!$F$2:$F$1097,0), ,1),\"H\",INDEX(Infos_2!$J$2:$J$1097,MATCH(H47,Infos_2!$I$2:$I$1097,0), ,1),\"H1\",INDEX(Infos_2!$M$2:$M$1097,MATCH(H47,Infos_2!$L$2:$L$1097,0), ,1),\"H2\",INDEX(Infos_2!$P$2:$P$1097,MATCH(H47,Infos_2!$O$2:$O$1097,0), ,1)),\"\")","v":"T"},{"$f":"IFERROR(_xlfn.SWITCH($B$3,\"C1\",INDEX(Infos_2!$D$2:$D$1097,MATCH(I47,Infos_2!$C$2:$C$1097,0),1),\"C2\",INDEX(Infos_2!$G$2:$G$1097,MATCH(I47,Infos_2!$F$2:$F$1097,0), ,1),\"H\",INDEX(Infos_2!$J$2:$J$1097,MATCH(I47,Infos_2!$I$2:$I$1097,0), ,1),\"H1\",INDEX(Infos_2!$M$2:$M$1097,MATCH(I47,Infos_2!$L$2:$L$1097,0), ,1),\"H2\",INDEX(Infos_2!$P$2:$P$1097,MATCH(I47,Infos_2!$O$2:$O$1097,0), ,1)),\"\")","v":"T"},{"$f":"IFERROR(_xlfn.SWITCH($B$3,\"C1\",INDEX(Infos_2!$D$2:$D$1097,MATCH(J47,Infos_2!$C$2:$C$1097,0),1),\"C2\",INDEX(Infos_2!$G$2:$G$1097,MATCH(J47,Infos_2!$F$2:$F$1097,0), ,1),\"H\",INDEX(Infos_2!$J$2:$J$1097,MATCH(J47,Infos_2!$I$2:$I$1097,0), ,1),\"H1\",INDEX(Infos_2!$M$2:$M$1097,MATCH(J47,Infos_2!$L$2:$L$1097,0), ,1),\"H2\",INDEX(Infos_2!$P$2:$P$1097,MATCH(J47,Infos_2!$O$2:$O$1097,0), ,1)),\"\")","v":"T"},{"$f":"IFERROR(_xlfn.SWITCH($B$3,\"C1\",INDEX(Infos_2!$D$2:$D$1097,MATCH(K47,Infos_2!$C$2:$C$1097,0),1),\"C2\",INDEX(Infos_2!$G$2:$G$1097,MATCH(K47,Infos_2!$F$2:$F$1097,0), ,1),\"H\",INDEX(Infos_2!$J$2:$J$1097,MATCH(K47,Infos_2!$I$2:$I$1097,0), ,1),\"H1\",INDEX(Infos_2!$M$2:$M$1097,MATCH(K47,Infos_2!$L$2:$L$1097,0), ,1),\"H2\",INDEX(Infos_2!$P$2:$P$1097,MATCH(K47,Infos_2!$O$2:$O$1097,0), ,1)),\"\")","v":"T"},{"$f":"IFERROR(_xlfn.SWITCH($B$3,\"C1\",INDEX(Infos_2!$D$2:$D$1097,MATCH(L47,Infos_2!$C$2:$C$1097,0),1),\"C2\",INDEX(Infos_2!$G$2:$G$1097,MATCH(L47,Infos_2!$F$2:$F$1097,0), ,1),\"H\",INDEX(Infos_2!$J$2:$J$1097,MATCH(L47,Infos_2!$I$2:$I$1097,0), ,1),\"H1\",INDEX(Infos_2!$M$2:$M$1097,MATCH(L47,Infos_2!$L$2:$L$1097,0), ,1),\"H2\",INDEX(Infos_2!$P$2:$P$1097,MATCH(L47,Infos_2!$O$2:$O$1097,0), ,1)),\"\")","v":"R"},{"$f":"IFERROR(_xlfn.SWITCH($B$3,\"C1\",INDEX(Infos_2!$D$2:$D$1097,MATCH(M47,Infos_2!$C$2:$C$1097,0),1),\"C2\",INDEX(Infos_2!$G$2:$G$1097,MATCH(M47,Infos_2!$F$2:$F$1097,0), ,1),\"H\",INDEX(Infos_2!$J$2:$J$1097,MATCH(M47,Infos_2!$I$2:$I$1097,0), ,1),\"H1\",INDEX(Infos_2!$M$2:$M$1097,MATCH(M47,Infos_2!$L$2:$L$1097,0), ,1),\"H2\",INDEX(Infos_2!$P$2:$P$1097,MATCH(M47,Infos_2!$O$2:$O$1097,0), ,1)),\"\")","v":"R"},{"$f":"IFERROR(_xlfn.SWITCH($B$3,\"C1\",INDEX(Infos_2!$D$2:$D$1097,MATCH(N47,Infos_2!$C$2:$C$1097,0),1),\"C2\",INDEX(Infos_2!$G$2:$G$1097,MATCH(N47,Infos_2!$F$2:$F$1097,0), ,1),\"H\",INDEX(Infos_2!$J$2:$J$1097,MATCH(N47,Infos_2!$I$2:$I$1097,0), ,1),\"H1\",INDEX(Infos_2!$M$2:$M$1097,MATCH(N47,Infos_2!$L$2:$L$1097,0), ,1),\"H2\",INDEX(Infos_2!$P$2:$P$1097,MATCH(N47,Infos_2!$O$2:$O$1097,0), ,1)),\"\")","v":"T"},{"$f":"IFERROR(_xlfn.SWITCH($B$3,\"C1\",INDEX(Infos_2!$D$2:$D$1097,MATCH(O47,Infos_2!$C$2:$C$1097,0),1),\"C2\",INDEX(Infos_2!$G$2:$G$1097,MATCH(O47,Infos_2!$F$2:$F$1097,0), ,1),\"H\",INDEX(Infos_2!$J$2:$J$1097,MATCH(O47,Infos_2!$I$2:$I$1097,0), ,1),\"H1\",INDEX(Infos_2!$M$2:$M$1097,MATCH(O47,Infos_2!$L$2:$L$1097,0), ,1),\"H2\",INDEX(Infos_2!$P$2:$P$1097,MATCH(O47,Infos_2!$O$2:$O$1097,0), ,1)),\"\")","v":"T"},{"$f":"IFERROR(_xlfn.SWITCH($B$3,\"C1\",INDEX(Infos_2!$D$2:$D$1097,MATCH(P47,Infos_2!$C$2:$C$1097,0),1),\"C2\",INDEX(Infos_2!$G$2:$G$1097,MATCH(P47,Infos_2!$F$2:$F$1097,0), ,1),\"H\",INDEX(Infos_2!$J$2:$J$1097,MATCH(P47,Infos_2!$I$2:$I$1097,0), ,1),\"H1\",INDEX(Infos_2!$M$2:$M$1097,MATCH(P47,Infos_2!$L$2:$L$1097,0), ,1),\"H2\",INDEX(Infos_2!$P$2:$P$1097,MATCH(P47,Infos_2!$O$2:$O$1097,0), ,1)),\"\")","v":"T"},{"$f":"IFERROR(_xlfn.SWITCH($B$3,\"C1\",INDEX(Infos_2!$D$2:$D$1097,MATCH(Q47,Infos_2!$C$2:$C$1097,0),1),\"C2\",INDEX(Infos_2!$G$2:$G$1097,MATCH(Q47,Infos_2!$F$2:$F$1097,0), ,1),\"H\",INDEX(Infos_2!$J$2:$J$1097,MATCH(Q47,Infos_2!$I$2:$I$1097,0), ,1),\"H1\",INDEX(Infos_2!$M$2:$M$1097,MATCH(Q47,Infos_2!$L$2:$L$1097,0), ,1),\"H2\",INDEX(Infos_2!$P$2:$P$1097,MATCH(Q47,Infos_2!$O$2:$O$1097,0), ,1)),\"\")","v":"T"},{"$f":"IFERROR(_xlfn.SWITCH($B$3,\"C1\",INDEX(Infos_2!$D$2:$D$1097,MATCH(R47,Infos_2!$C$2:$C$1097,0),1),\"C2\",INDEX(Infos_2!$G$2:$G$1097,MATCH(R47,Infos_2!$F$2:$F$1097,0), ,1),\"H\",INDEX(Infos_2!$J$2:$J$1097,MATCH(R47,Infos_2!$I$2:$I$1097,0), ,1),\"H1\",INDEX(Infos_2!$M$2:$M$1097,MATCH(R47,Infos_2!$L$2:$L$1097,0), ,1),\"H2\",INDEX(Infos_2!$P$2:$P$1097,MATCH(R47,Infos_2!$O$2:$O$1097,0), ,1)),\"\")","v":"T"},{"$f":"IFERROR(_xlfn.SWITCH($B$3,\"C1\",INDEX(Infos_2!$D$2:$D$1097,MATCH(S47,Infos_2!$C$2:$C$1097,0),1),\"C2\",INDEX(Infos_2!$G$2:$G$1097,MATCH(S47,Infos_2!$F$2:$F$1097,0), ,1),\"H\",INDEX(Infos_2!$J$2:$J$1097,MATCH(S47,Infos_2!$I$2:$I$1097,0), ,1),\"H1\",INDEX(Infos_2!$M$2:$M$1097,MATCH(S47,Infos_2!$L$2:$L$1097,0), ,1),\"H2\",INDEX(Infos_2!$P$2:$P$1097,MATCH(S47,Infos_2!$O$2:$O$1097,0), ,1)),\"\")","v":"R"},{"$f":"IFERROR(_xlfn.SWITCH($B$3,\"C1\",INDEX(Infos_2!$D$2:$D$1097,MATCH(T47,Infos_2!$C$2:$C$1097,0),1),\"C2\",INDEX(Infos_2!$G$2:$G$1097,MATCH(T47,Infos_2!$F$2:$F$1097,0), ,1),\"H\",INDEX(Infos_2!$J$2:$J$1097,MATCH(T47,Infos_2!$I$2:$I$1097,0), ,1),\"H1\",INDEX(Infos_2!$M$2:$M$1097,MATCH(T47,Infos_2!$L$2:$L$1097,0), ,1),\"H2\",INDEX(Infos_2!$P$2:$P$1097,MATCH(T47,Infos_2!$O$2:$O$1097,0), ,1)),\"\")","v":"R"},{"$f":"IFERROR(_xlfn.SWITCH($B$3,\"C1\",INDEX(Infos_2!$D$2:$D$1097,MATCH(U47,Infos_2!$C$2:$C$1097,0),1),\"C2\",INDEX(Infos_2!$G$2:$G$1097,MATCH(U47,Infos_2!$F$2:$F$1097,0), ,1),\"H\",INDEX(Infos_2!$J$2:$J$1097,MATCH(U47,Infos_2!$I$2:$I$1097,0), ,1),\"H1\",INDEX(Infos_2!$M$2:$M$1097,MATCH(U47,Infos_2!$L$2:$L$1097,0), ,1),\"H2\",INDEX(Infos_2!$P$2:$P$1097,MATCH(U47,Infos_2!$O$2:$O$1097,0), ,1)),\"\")","v":"T"},{"$f":"IFERROR(_xlfn.SWITCH($B$3,\"C1\",INDEX(Infos_2!$D$2:$D$1097,MATCH(V47,Infos_2!$C$2:$C$1097,0),1),\"C2\",INDEX(Infos_2!$G$2:$G$1097,MATCH(V47,Infos_2!$F$2:$F$1097,0), ,1),\"H\",INDEX(Infos_2!$J$2:$J$1097,MATCH(V47,Infos_2!$I$2:$I$1097,0), ,1),\"H1\",INDEX(Infos_2!$M$2:$M$1097,MATCH(V47,Infos_2!$L$2:$L$1097,0), ,1),\"H2\",INDEX(Infos_2!$P$2:$P$1097,MATCH(V47,Infos_2!$O$2:$O$1097,0), ,1)),\"\")","v":"T"},{"$f":"IFERROR(_xlfn.SWITCH($B$3,\"C1\",INDEX(Infos_2!$D$2:$D$1097,MATCH(W47,Infos_2!$C$2:$C$1097,0),1),\"C2\",INDEX(Infos_2!$G$2:$G$1097,MATCH(W47,Infos_2!$F$2:$F$1097,0), ,1),\"H\",INDEX(Infos_2!$J$2:$J$1097,MATCH(W47,Infos_2!$I$2:$I$1097,0), ,1),\"H1\",INDEX(Infos_2!$M$2:$M$1097,MATCH(W47,Infos_2!$L$2:$L$1097,0), ,1),\"H2\",INDEX(Infos_2!$P$2:$P$1097,MATCH(W47,Infos_2!$O$2:$O$1097,0), ,1)),\"\")","v":"T"},{"$f":"IFERROR(_xlfn.SWITCH($B$3,\"C1\",INDEX(Infos_2!$D$2:$D$1097,MATCH(X47,Infos_2!$C$2:$C$1097,0),1),\"C2\",INDEX(Infos_2!$G$2:$G$1097,MATCH(X47,Infos_2!$F$2:$F$1097,0), ,1),\"H\",INDEX(Infos_2!$J$2:$J$1097,MATCH(X47,Infos_2!$I$2:$I$1097,0), ,1),\"H1\",INDEX(Infos_2!$M$2:$M$1097,MATCH(X47,Infos_2!$L$2:$L$1097,0), ,1),\"H2\",INDEX(Infos_2!$P$2:$P$1097,MATCH(X47,Infos_2!$O$2:$O$1097,0), ,1)),\"\")","v":"T"},{"$f":"IFERROR(_xlfn.SWITCH($B$3,\"C1\",INDEX(Infos_2!$D$2:$D$1097,MATCH(Y47,Infos_2!$C$2:$C$1097,0),1),\"C2\",INDEX(Infos_2!$G$2:$G$1097,MATCH(Y47,Infos_2!$F$2:$F$1097,0), ,1),\"H\",INDEX(Infos_2!$J$2:$J$1097,MATCH(Y47,Infos_2!$I$2:$I$1097,0), ,1),\"H1\",INDEX(Infos_2!$M$2:$M$1097,MATCH(Y47,Infos_2!$L$2:$L$1097,0), ,1),\"H2\",INDEX(Infos_2!$P$2:$P$1097,MATCH(Y47,Infos_2!$O$2:$O$1097,0), ,1)),\"\")","v":"T"},{"$f":"IFERROR(_xlfn.SWITCH($B$3,\"C1\",INDEX(Infos_2!$D$2:$D$1097,MATCH(Z47,Infos_2!$C$2:$C$1097,0),1),\"C2\",INDEX(Infos_2!$G$2:$G$1097,MATCH(Z47,Infos_2!$F$2:$F$1097,0), ,1),\"H\",INDEX(Infos_2!$J$2:$J$1097,MATCH(Z47,Infos_2!$I$2:$I$1097,0), ,1),\"H1\",INDEX(Infos_2!$M$2:$M$1097,MATCH(Z47,Infos_2!$L$2:$L$1097,0), ,1),\"H2\",INDEX(Infos_2!$P$2:$P$1097,MATCH(Z47,Infos_2!$O$2:$O$1097,0), ,1)),\"\")","v":"R"},{"$f":"IFERROR(_xlfn.SWITCH($B$3,\"C1\",INDEX(Infos_2!$D$2:$D$1097,MATCH(AA47,Infos_2!$C$2:$C$1097,0),1),\"C2\",INDEX(Infos_2!$G$2:$G$1097,MATCH(AA47,Infos_2!$F$2:$F$1097,0), ,1),\"H\",INDEX(Infos_2!$J$2:$J$1097,MATCH(AA47,Infos_2!$I$2:$I$1097,0), ,1),\"H1\",INDEX(Infos_2!$M$2:$M$1097,MATCH(AA47,Infos_2!$L$2:$L$1097,0), ,1),\"H2\",INDEX(Infos_2!$P$2:$P$1097,MATCH(AA47,Infos_2!$O$2:$O$1097,0), ,1)),\"\")","v":"R"},{"$f":"IFERROR(_xlfn.SWITCH($B$3,\"C1\",INDEX(Infos_2!$D$2:$D$1097,MATCH(AB47,Infos_2!$C$2:$C$1097,0),1),\"C2\",INDEX(Infos_2!$G$2:$G$1097,MATCH(AB47,Infos_2!$F$2:$F$1097,0), ,1),\"H\",INDEX(Infos_2!$J$2:$J$1097,MATCH(AB47,Infos_2!$I$2:$I$1097,0), ,1),\"H1\",INDEX(Infos_2!$M$2:$M$1097,MATCH(AB47,Infos_2!$L$2:$L$1097,0), ,1),\"H2\",INDEX(Infos_2!$P$2:$P$1097,MATCH(AB47,Infos_2!$O$2:$O$1097,0), ,1)),\"\")","v":"T"},{"$f":"IFERROR(_xlfn.SWITCH($B$3,\"C1\",INDEX(Infos_2!$D$2:$D$1097,MATCH(AC47,Infos_2!$C$2:$C$1097,0),1),\"C2\",INDEX(Infos_2!$G$2:$G$1097,MATCH(AC47,Infos_2!$F$2:$F$1097,0), ,1),\"H\",INDEX(Infos_2!$J$2:$J$1097,MATCH(AC47,Infos_2!$I$2:$I$1097,0), ,1),\"H1\",INDEX(Infos_2!$M$2:$M$1097,MATCH(AC47,Infos_2!$L$2:$L$1097,0), ,1),\"H2\",INDEX(Infos_2!$P$2:$P$1097,MATCH(AC47,Infos_2!$O$2:$O$1097,0), ,1)),\"\")","v":"T"},{"$f":"IFERROR(_xlfn.SWITCH($B$3,\"C1\",INDEX(Infos_2!$D$2:$D$1097,MATCH(AD47,Infos_2!$C$2:$C$1097,0),1),\"C2\",INDEX(Infos_2!$G$2:$G$1097,MATCH(AD47,Infos_2!$F$2:$F$1097,0), ,1),\"H\",INDEX(Infos_2!$J$2:$J$1097,MATCH(AD47,Infos_2!$I$2:$I$1097,0), ,1),\"H1\",INDEX(Infos_2!$M$2:$M$1097,MATCH(AD47,Infos_2!$L$2:$L$1097,0), ,1),\"H2\",INDEX(Infos_2!$P$2:$P$1097,MATCH(AD47,Infos_2!$O$2:$O$1097,0), ,1)),\"\")","v":"T"},{"$f":"IFERROR(_xlfn.SWITCH($B$3,\"C1\",INDEX(Infos_2!$D$2:$D$1097,MATCH(AE47,Infos_2!$C$2:$C$1097,0),1),\"C2\",INDEX(Infos_2!$G$2:$G$1097,MATCH(AE47,Infos_2!$F$2:$F$1097,0), ,1),\"H\",INDEX(Infos_2!$J$2:$J$1097,MATCH(AE47,Infos_2!$I$2:$I$1097,0), ,1),\"H1\",INDEX(Infos_2!$M$2:$M$1097,MATCH(AE47,Infos_2!$L$2:$L$1097,0), ,1),\"H2\",INDEX(Infos_2!$P$2:$P$1097,MATCH(AE47,Infos_2!$O$2:$O$1097,0), ,1)),\"\")","v":"T"},{"$f":"IFERROR(_xlfn.SWITCH($B$3,\"C1\",INDEX(Infos_2!$D$2:$D$1097,MATCH(AF47,Infos_2!$C$2:$C$1097,0),1),\"C2\",INDEX(Infos_2!$G$2:$G$1097,MATCH(AF47,Infos_2!$F$2:$F$1097,0), ,1),\"H\",INDEX(Infos_2!$J$2:$J$1097,MATCH(AF47,Infos_2!$I$2:$I$1097,0), ,1),\"H1\",INDEX(Infos_2!$M$2:$M$1097,MATCH(AF47,Infos_2!$L$2:$L$1097,0), ,1),\"H2\",INDEX(Infos_2!$P$2:$P$1097,MATCH(AF47,Infos_2!$O$2:$O$1097,0), ,1)),\"\")","v":""},{"$f":"IFERROR(_xlfn.SWITCH($B$3,\"C1\",INDEX(Infos_2!$D$2:$D$1097,MATCH(AG47,Infos_2!$C$2:$C$1097,0),1),\"C2\",INDEX(Infos_2!$G$2:$G$1097,MATCH(AG47,Infos_2!$F$2:$F$1097,0), ,1),\"H\",INDEX(Infos_2!$J$2:$J$1097,MATCH(AG47,Infos_2!$I$2:$I$1097,0), ,1),\"H1\",INDEX(Infos_2!$M$2:$M$1097,MATCH(AG47,Infos_2!$L$2:$L$1097,0), ,1),\"H2\",INDEX(Infos_2!$P$2:$P$1097,MATCH(AG47,Infos_2!$O$2:$O$1097,0), ,1)),\"\")","v":""}]
[1,{"$f":"bloc_nom","v":"NOM 50 Prénom 50"}]
[2,"NOM 51 Prénom 51"]
[3,"NOM 52 Prénom 52"]
[4,"NOM 53 Prénom 53"]
[5,"NOM 54 Prénom 54"]
[6,"NOM 55 Prénom 55"]
[7,"NOM 56 Prénom 56"]
[8,"NOM 57 Prénom 57"]
[9,"NOM 58 Prénom 58"]
[10,""]
[11,""]
[12,""]
[13,""]
[14,""]
[15,""]
[]
[null,null,{"$f":"EDATE($C47,1)","v":"2024-03-01"},{"$f":"C69+1","v":"2024-03-02"},"2024-03-03","2024-03-04","2024-03-05","2024-03-06","2024-03-07","2024-03-08","2024-03-09","2024-03-10","2024-03-11","2024-03-12","2024-03-13","2024-03-14","2024-03-15","2024-03-16","2024-03-17","2024-03-18","2024-03-19","2024-03-20","2024-03-21","2024-03-22","2024-03-23","2024-03-24","2024-03-25","2024-03-26","2024-03-27","2024-03-28",{"$f":"IF(MONTH($AD69)<>MONTH(AD69+1),\"\",AD69+1)","v":"2024-03-29"},{"$f":"IF(AE69=\"\",\"\",IF(MONTH(AE69+1)<>MONTH(AE69),\"\",AE69+1))","v":"2024-03-30"},{"$f":"IF(AF69=\"\",\"\",IF(MONTH(AF69+1)<>MONTH(AF69),\"\",AF69+1))","v":"2024-03-31"}]
[null,{"$f":"PROPER(TEXT(C69,\"mmmm\"))","v":"Mars"},{"$f":"C69","v":"2024-03-01"},"2024-03-02","2024-03-03","2024-03-04","2024-03-05","2024-03-06","2024-03-07","2024-03-08","2024-03-09","2024-03-10","2024-03-11","2024-03-12","2024-03-13","2024-03-14","2024-03-15","2024-03-16","2024-03-17","2024-03-18","2024-03-19","2024-03-20","2024-03-21","2024-03-22","2024-03-23","2024-03-24","2024-03-25","2024-03-26","2024-03-27","2024-03-28","2024-03-29","2024-03-30","2024-03-31"]
[null,"Férié",{"$f":"IF(C69=\"\",\"\",DATE($C$1,MATCH($B70,Infos!$A$2:$A$13,0),DAY(C$69)))","v":"2023-03-01"},{"$f":"IF(D69=\"\",\"\",DATE($C$1,MATCH($B70,Infos!$A$2:$A$13,0),DAY(D$69)))","v":"2023-03-02"},{"$f":"IF(E69=\"\",\"\",DATE($C$1,MATCH($B70,Infos!$A$2:$A$13,0),DAY(E$69)))","v":"2023-03-03"},{"$f":"IF(F69=\"\",\"\",DATE($C$1,MATCH($B70,Infos!$A$2:$A$13,0),DAY(F$69)))","v":"2023-03-04"},{"$f":"IF(G69=\"\",\"\",DATE($C$1,MATCH($B70,Infos!$A$2:$A$13,0),DAY(G$69)))","v":"2023-03-05"},{"$f":"IF(H69=\"\",\"\",DATE($C$1,MATCH($B70,Infos!$A$2:$A$13,0),DAY(H$69)))","v":"2023-03-06"},{"$f":"IF(I69=\"\",\"\",DATE($C$1,MATCH($B70,Infos!$A$2:$A$13,0),DAY(I$69)))","v":"2023-03-07"},{"$f":"IF(J69=\"\",\"\",DATE($C$1,MATCH($B70,Infos!$A$2:$A$13,0),DAY(J$69)))","v":"2023-03-08"},{"$f":"IF(K69=\"\",\"\",DATE($C$1,MATCH($B70,Infos!$A$2:$A$13,0),DAY(K$69)))","v":"2023-03-09"},{"$f":"IF(L69=\"\",\"\",DATE($C$1,MATCH($B70,Infos!$A$2:$A$13,0),DAY(L$69)))","v":"2023-03-10"},{"$f":"IF(M69=\"\",\"\",DATE($C$1,MATCH($B70,Infos!$A$2:$A$13,0),DAY(M$69)))","v":"2023-03-11"},{"$f":"IF(N69=\"\",\"\",DATE($C$1,MATCH($B70,Infos!$A$2:$A$13,0),DAY(N$69)))","v":"2023-03-12"},{"$f":"IF(O69=\"\",\"\",DATE($C$1,MATCH($B70,Infos!$A$2:$A$13,0),DAY(O$69)))","v":"2023-03-13"},{"$f":"IF(P69=\"\",\"\",DATE($C$1,MATCH($B70,Infos!$A$2:$A$13,0),DAY(P$69)))","v":"2023-03-14"},{"$f":"IF(Q69=\"\",\"\",DATE($C$1,MATCH($B70,Infos!$A$2:$A$13,0),DAY(Q$69)))","v":"2023-03-15"},{"$f":"IF(R69=\"\",\"\",DATE($C$1,MATCH($B70,Infos!$A$2:$A$13,0),DAY(R$69)))","v":"2023-03-16"},{"$f":"IF(S69=\"\",\"\",DATE($C$1,MATCH($B70,Infos!$A$2:$A$13,0),DAY(S$69)))","v":"2023-03-17"},{"$f":"IF(T69=\"\",\"\",DATE($C$1,MATCH($B70,Infos!$A$2:$A$13,0),DAY(T$69)))","v":"2023-03-18"},{"$f":"IF(U69=\"\",\"\",DATE($C$1,MATCH($B70,Infos!$A$2:$A$13,0),DAY(U$69)))","v":"2023-03-19"},{"$f":"IF(V69=\"\",\"\",DATE($C$1,MATCH($B70,Infos!$A$2:$A$13,0),DAY(V$69)))","v":"2023-03-20"},{"$f":"IF(W69=\"\",\"\",DATE($C$1,MATCH($B70,Infos!$A$2:$A$13,0),DAY(W$69)))","v":"2023-03-21"},{"$f":"IF(X69=\"\",\"\",DATE($C$1,MATCH($B70,Infos!$A$2:$A$13,0),DAY(X$69)))","v":"2023-03-22"},{"$f":"IF(Y69=\"\",\"\",DATE($C$1,MATCH($B70,Infos!$A$2:$A$13,0),DAY(Y$69)))","v":"2023-03-23"},{"$f":"IF(Z69=\"\",\"\",DATE($C$1,MATCH($B70,Infos!$A$2:$A$13,0),DAY(Z$69)))","v":"2023-03-24"},{"$f":"IF(AA69=\"\",\"\",DATE($C$1,MATCH($B70,Infos!$A$2:$A$13,0),DAY(AA$69)))","v":"2023-03-25"},{"$f":"IF(AB69=\"\",\"\",DATE($C$1,MATCH($B70,Infos!$A$2:$A$13,0),DAY(AB$69)))","v":"2023-03-26"},{"$f":"IF(AC69=\"\",\"\",DATE($C$1,MATCH($B70,Infos!$A$2:$A$13,0),DAY(AC$69)))","v":"2023-03-27"},{"$f":"IF(AD69=\"\",\"\",DATE($C$1,MATCH($B70,Infos!$A$2:$A$13,0),DAY(AD$69)))","v":"2023-03-28"},{"$f":"IF(AE69=\"\",\"\",DATE($C$1,MATCH($B70,Infos!$A$2:$A$13,0),DAY(AE$69)))","v":"2023-03-29"},{"$f":"IF(AF69=\"\",\"\",DATE($C$1,MATCH($B70,Infos!$A$2:$A$13,0),DAY(AF$69)))","v":"2023-03-30"},{"$f":"IF(AG69=\"\",\"\",DATE($C$1,MATCH($B70,Infos!$A$2:$A$13,0),DAY(AG$69)))","v":"2023-03-31"}]
[null,"WE",{"$f":"IF(C69<>\"\",IF(COUNTIF('Jours fériés'!$B$3:$B$15,Planning!C71),8,WEEKDAY(C71,2)),\"\")","v":3},{"$f":"IF(D69<>\"\",IF(COUNTIF('Jours fériés'!$B$3:$B$15,Planning!D71),8,WEEKDAY(D71,2)),\"\")","v":4},{"$f":"IF(E69<>\"\",IF(COUNTIF('Jours fériés'!$B$3:$B$15,Planning!E71),8,WEEKDAY(E71,2)),\"\")","v":5},{"$f":"IF(F69<>\"\",IF(COUNTIF('Jours fériés'!$B$3:$B$15,Planning!F71),8,WEEKDAY(F71,2)),\"\")","v":6},{"$f":"IF(G69<>\"\",IF(COUNTIF('Jours fériés'!$B$3:$B$15,Planning!G71),8,WEEKDAY(G71,2)),\"\")","v":7},{"$f":"IF(H69<>\"\",IF(COUNTIF('Jours fériés'!$B$3:$B$15,Planning!H71),8,WEEKDAY(H71,2)),\"\")","v":1},{"$f":"IF(I69<>\"\",IF(COUNTIF('Jours fériés'!$B$3:$B$15,Planning!I71),8,WEEKDAY(I71,2)),\"\")","v":2},{"$f":"IF(J69<>\"\",IF(COUNTIF('Jours fériés'!$B$3:$B$15,Planning!J71),8,WEEKDAY(J71,2)),\"\")","v":3},{"$f":"IF(K69<>\"\",IF(COUNTIF('Jours fériés'!$B$3:$B$15,Planning!K71),8,WEEKDAY(K71,2)),\"\")","v":4},{"$f":"IF(L69<>\"\",IF(COUNTIF('Jours fériés'!$B$3:$B$15,Planning!L71),8,WEEKDAY(L71,2)),\"\")","v":5},{"$f":"IF(M69<>\"\",IF(COUNTIF('Jours fériés'!$B$3:$B$15,Planning!M71),8,WEEKDAY(M71,2)),\"\")","v":6},{"$f":"IF(N69<>\"\",IF(COUNTIF('Jours fériés'!$B$3:$B$15,Planning!N71),8,WEEKDAY(N71,2)),\"\")","v":7},{"$f":"IF(O69<>\"\",IF(COUNTIF('Jours fériés'!$B$3:$B$15,Planning!O71),8,WEEKDAY(O71,2)),\"\")","v":1},{"$f":"IF(P69<>\"\",IF(COUNTIF('Jours fériés'!$B$3:$B$15,Planning!P71),8,WEEKDAY(P71,2)),\"\")","v":2},{"$f":"IF(Q69<>\"\",IF(COUNTIF('Jours fériés'!$B$3:$B$15,Planning!Q71),8,WEEKDAY(Q71,2)),\"\")","v":3},{"$f":"IF(R69<>\"\",IF(COUNTIF('Jours fériés'!$B$3:$B$15,Planning!R71),8,WEEKDAY(R71,2)),\"\")","v":4},{"$f":"IF(S69<>\"\",IF(COUNTIF('Jours fériés'!$B$3:$B$15,Planning!S71),8,WEEKDAY(S71,2)),\"\")","v":5},{"$f":"IF(T69<>\"\",IF(COUNTIF('Jours fériés'!$B$3:$B$15,Planning!T71),8,WEEKDAY(T71,2)),\"\")","v":6},{"$f":"IF(U69<>\"\",IF(COUNTIF('Jours fériés'!$B$3:$B$15,Planning!U71),8,WEEKDAY(U71,2)),\"\")","v":7},{"$f":"IF(V69<>\"\",IF(COUNTIF('Jours fériés'!$B$3:$B$15,Planning!V71),8,WEEKDAY(V71,2)),\"\")","v":1},{"$f":"IF(W69<>\"\",IF(COUNTIF('Jours fériés'!$B$3:$B$15,Planning!W71),8,WEEKDAY(W71,2)),\"\")","v":2},{"$f":"IF(X69<>\"\",IF(COUNTIF('Jours fériés'!$B$3:$B$15,Planning!X71),8,WEEKDAY(X71,2)),\"\")","v":3},{"$f":"IF(Y69<>\"\",IF(COUNTIF('Jours fériés'!$B$3:$B$15,Planning!Y71),8,WEEKDAY(Y71,2)),\"\")","v":4},{"$f":"IF(Z69<>\"\",IF(COUNTIF('Jours fériés'!$B$3:$B$15,Planning!Z71),8,WEEKDAY(Z71,2)),\"\")","v":5},{"$f":"IF(AA69<>\"\",IF(COUNTIF('Jours fériés'!$B$3:$B$15,Planning!AA71),8,WEEKDAY(AA71,2)),\"\")","v":6},{"$f":"IF(AB69<>\"\",IF(COUNTIF('Jours fériés'!$B$3:$B$15,Planning!AB71),8,WEEKDAY(AB71,2)),\"\")","v":7},{"$f":"IF(AC69<>\"\",IF(COUNTIF('Jours fériés'!$B$3:$B$15,Planning!AC71),8,WEEKDAY(AC71,2)),\"\")","v":1},{"$f":"IF(AD69<>\"\",IF(COUNTIF('Jours fériés'!$B$3:$B$15,Planning!AD71),8,WEEKDAY(AD71,2)),\"\")","v":2},{"$f":"IF(AE69<>\"\",IF(COUNTIF('Jours fériés'!$B$3:$B$15,Planning!AE71),8,WEEKDAY(AE71,2)),\"\")","v":3},{"$f":"IF(AF69<>\"\",IF(COUNTIF('Jours fériés'!$B$3:$B$15,Planning!AF71),8,WEEKDAY(AF71,2)),\"\")","v":4},{"$f":"IF(AG69<>\"\",IF(COUNTIF('Jours fériés'!$B$3:$B$15,Planning!AG71),8,WEEKDAY(AG71,2)),\"\")","v":5}]
[null,"VACANCES",{"$f":"IF(SUMPRODUCT((C69>=datdeb)*(C69<=datfin))=1,\"vac\",\"\")","v":"vac"},{"$f":"IF(SUMPRODUCT((D69>=datdeb)*(D69<=datfin))=1,\"vac\",\"\")","v":"vac"},{"$f":"IF(SUMPRODUCT((E69>=datdeb)*(E69<=datfin))=1,\"vac\",\"\")","v":"vac"},{"$f":"IF(SUMPRODUCT((F69>=datdeb)*(F69<=datfin))=1,\"vac\",\"\")","v":"vac"},{"$f":"IF(SUMPRODUCT((G69>=datdeb)*(G69<=datfin))=1,\"vac\",\"\")","v":""},{"$f":"IF(SUMPRODUCT((H69>=datdeb)*(H69<=datfin))=1,\"vac\",\"\")","v":""},{"$f":"IF(SUMPRODUCT((I69>=datdeb)*(I69<=datfin))=1,\"vac\",\"\")","v":""},{"$f":"IF(SUMPRODUCT((J69>=datdeb)*(J69<=datfin))=1,\"vac\",\"\")","v":""},{"$f":"IF(SUMPRODUCT((K69>=datdeb)*(K69<=datfin))=1,\"vac\",\"\")","v":""},{"$f":"IF(SUMPRODUCT((L69>=datdeb)*(L69<=datfin))=1,\"vac\",\"\")","v":""},{"$f":"IF(SUMPRODUCT((M69>=datdeb)*(M69<=datfin))=1,\"vac\",\"\")","v":""},{"$f":"IF(SUMPRODUCT((N69>=datdeb)*(N69<=datfin))=1,\"vac\",\"\")","v":""},{"$f":"IF(SUMPRODUCT((O69>=datdeb)*(O69<=datfin))=1,\"vac\",\"\")","v":""},{"$f":"IF(SUMPRODUCT((P69>=datdeb)*(P69<=datfin))=1,\"vac\",\"\")","v":""},{"$f":"IF(SUMPRODUCT((Q69>=datdeb)*(Q69<=datfin))=1,\"vac\",\"\")","v":""},{"$f":"IF(SUMPRODUCT((R69>=datdeb)*(R69<=datfin))=1,\"vac\",\"\")","v":""},{"$f":"IF(SUMPRODUCT((S69>=datdeb)*(S69<=datfin))=1,\"vac\",\"\")","v":""},{"$f":"IF(SUMPRODUCT((T69>=datdeb)*(T69<=datfin))=1,\"vac\",\"\")","v":""},{"$f":"IF(SUMPRODUCT((U69>=datdeb)*(U69<=datfin))=1,\"vac\",\"\")","v":""},{"$f":"IF(SUMPRODUCT((V69>=datdeb)*(V69<=datfin))=1,\"vac\",\"\")","v":""},{"$f":"IF(SUMPRODUCT((W69>=datdeb)*(W69<=datfin))=1,\"vac\",\"\")","v":""},{"$f":"IF(SUMPRODUCT((X69>=datdeb)*(X69<=datfin))=1,\"vac\",\"\")","v":""},{"$f":"IF(SUMPRODUCT((Y69>=datdeb)*(Y69<=datfin))=1,\"vac\",\"\")","v":""},{"$f":"IF(SUMPRODUCT((Z69>=datdeb)*(Z69<=datfin))=1,\"vac\",\"\")","v":""},{"$f":"IF(SUMPRODUCT((AA69>=datdeb)*(AA69<=datfin))=1,\"vac\",\"\")","v":""},{"$f":"IF(SUMPRODUCT((AB69>=datdeb)*(AB69<=datfin))=1,\"vac\",\"\")","v":""},{"$f":"IF(SUMPRODUCT((AC69>=datdeb)*(AC69<=datfin))=1,\"vac\",\"\")","v":""},{"$f":"IF(SUMPRODUCT((AD69>=datdeb)*(AD69<=datfin))=1,\"vac\",\"\")","v":""},{"$f":"IF(SUMPRODUCT((AE69>=datdeb)*(AE69<=datfin))=1,\"vac\",\"\")","v":""},{"$f":"IF(SUMPRODUCT((AF69>=datdeb)*(AF69<=datfin))=1,\"vac\",\"\")","v":""},{"$f":"IF(SUMPRODUCT((AG69>=datdeb)*(AG69<=datfin))=1,\"vac\",\"\")","v":""}]
[null,null,{"$f":"IFERROR(_xlfn.SWITCH($B$3,\"C1\",INDEX(Infos_2!$D$2:$D$1097,MATCH(C69,Infos_2!$C$2:$C$1097,0),1),\"C2\",INDEX(Infos_2!$G$2:$G$1097,MATCH(C69,Infos_2!$F$2:$F$1097,0), ,1),\"H\",INDEX(Infos_2!$J$2:$J$1097,MATCH(C69,Infos_2!$I$2:$I$1097,0), ,1),\"H1\",INDEX(Infos_2!$M$2:$M$1097,MATCH(C69,Infos_2!$L$2:$L$1097,0), ,1),\"H2\",INDEX(Infos_2!$P$2:$P$1097,MATCH(C69,Infos_2!$O$2:$O$1097,0), ,1)),\"\")","v":"T"},{"$f":"IFERROR(_xlfn.SWITCH($B$3,\"C1\",INDEX(Infos_2!$D$2:$D$1097,MATCH(D69,Infos_2!$C$2:$C$1097,0),1),\"C2\",INDEX(Infos_2!$G$2:$G$1097,MATCH(D69,Infos_2!$F$2:$F$1097,0), ,1),\"H\",INDEX(Infos_2!$J$2:$J$1097,MATCH(D69,Infos_2!$I$2:$I$1097,0), ,1),\"H1\",INDEX(Infos_2!$M$2:$M$1097,MATCH(D69,Infos_2!$L$2:$L$1097,0), ,1),\"H2\",INDEX(Infos_2!$P$2:$P$1097,MATCH(D69,Infos_2!$O$2:$O$1097,0), ,1)),\"\")","v":"R"},{"$f":"IFERROR(_xlfn.SWITCH($B$3,\"C1\",INDEX(Infos_2!$D$2:$D$1097,MATCH(E69,Infos_2!$C$2:$C$1097,0),1),\"C2\",INDEX(Infos_2!$G$2:$G$1097,MATCH(E69,Infos_2!$F$2:$F$1097,0), ,1),\"H\",INDEX(Infos_2!$J$2:$J$1097,MATCH(E69,Infos_2!$I$2:$I$1097,0), ,1),\"H1\",INDEX(Infos_2!$M$2:$M$1097,MATCH(E69,Infos_2!$L$2:$L$1097,0), ,1),\"H2\",INDEX(Infos_2!$P$2:$P$1097,MATCH(E69,Infos_2!$O$2:$O$1097,0), ,1)),\"\")","v":"R"},{"$f":"IFERROR(_xlfn.SWITCH($B$3,\"C1\",INDEX(Infos_2!$D$2:$D$1097,MATCH(F69,Infos_2!$C$2:$C$1097,0),1),\"C2\",INDEX(Infos_2!$G$2:$G$1097,MATCH(F69,Infos_2!$F$2:$F$1097,0), ,1),\"H\",INDEX(Infos_2!$J$2:$J$1097,MATCH(F69,Infos_2!$I$2:$I$1097,0), ,1),\"H1\",INDEX(Infos_2!$M$2:$M$1097,MATCH(F69,Infos_2!$L$2:$L$1097,0), ,1),\"H2\",INDEX(Infos_2!$P$2:$P$1097,MATCH(F69,Infos_2!$O$2:$O$1097,0), ,1)),\"\")","v":"T"},{"$f":"IFERROR(_xlfn.SWITCH($B$3,\"C1\",INDEX(Infos_2!$D$2:$D$1097,MATCH(G69,Infos_2!$C$2:$C$1097,0),1),\"C2\",INDEX(Infos_2!$G$2:$G$1097,MATCH(G69,Infos_2!$F$2:$F$1097,0), ,1),\"H\",INDEX(Infos_2!$J$2:$J$1097,MATCH(G69,Infos_2!$I$2:$I$1097,0), ,1),\"H1\",INDEX(Infos_2!$M$2:$M$1097,MATCH(G69,Infos_2!$L$2:$L$1097,0), ,1),\"H2\",INDEX(Infos_2!$P$2:$P$1097,MATCH(G69,Infos_2!$O$2:$O$1097,0), ,1)),\"\")","v":"T"},{"$f":"IFERROR(_xlfn.SWITCH($B$3,\"C1\",INDEX(Infos_2!$D$2:$D$1097,MATCH(H69,Infos_2!$C$2:$C$1097,0),1),\"C2\",INDEX(Infos_2!$G$2:$G$1097,MATCH(H69,Infos_2!$F$2:$F$1097,0), ,1),\"H\",INDEX(Infos_2!$J$2:$J$1097,MATCH(H69,Infos_2!$I$2:$I$1097,0), ,1),\"H1\",INDEX(Infos_2!$M$2:$M$1097,MATCH(H69,Infos_2!$L$2:$L$1097,0), ,1),\"H2\",INDEX(Infos_2!$P$2:$P$1097,MATCH(H69,Infos_2!$O$2:$O$1097,0), ,1)),\"\")","v":"T"},{"$f":"IFERROR(_xlfn.SWITCH($B$3,\"C1\",INDEX(Infos_2!$D$2:$D$1097,MATCH(I69,Infos_2!$C$2:$C$1097,0),1),\"C2\",INDEX(Infos_2!$G$2:$G$1097,MATCH(I69,Infos_2!$F$2:$F$1097,0), ,1),\"H\",INDEX(Infos_2!$J$2:$J$1097,MATCH(I69,Infos_2!$I$2:$I$1097,0), ,1),\"H1\",INDEX(Infos_2!$M$2:$M$1097,MATCH(I69,Infos_2!$L$2:$L$1097,0), ,1),\"H2\",INDEX(Infos_2!$P$2:$P$1097,MATCH(I69,Infos_2!$O$2:$O$1097,0), ,1)),\"\")","v":"T"},{"$f":"IFERROR(_xlfn.SWITCH($B$3,\"C1\",INDEX(Infos_2!$D$2:$D$1097,MATCH(J69,Infos_2!$C$2:$C$1097,0),1),\"C2\",INDEX(Infos_2!$G$2:$G$1097,MATCH(J69,Infos_2!$F$2:$F$1097,0), ,1),\"H\",INDEX(Infos_2!$J$2:$J$1097,MATCH(J69,Infos_2!$I$2:$I$1097,0), ,1),\"H1\",INDEX(Infos_2!$M$2:$M$1097,MATCH(J69,Infos_2!$L$2:$L$1097,0), ,1),\"H2\",INDEX(Infos_2!$P$2:$P$1097,MATCH(J69,Infos_2!$O$2:$O$1097,0), ,1)),\"\")","v":"T"},{"$f":"IFERROR(_xlfn.SWITCH($B$3,\"C1\",INDEX(Infos_2!$D$2:$D$1097,MATCH(K69,Infos_2!$C$2:$C$1097,0),1),\"C2\",INDEX(Infos_2!$G$2:$G$1097,MATCH(K69,Infos_2!$F$2:$F$1097,0), ,1),\"H\",INDEX(Infos_2!$J$2:$J$1097,MATCH(K69,Infos_2!$I$2:$I$1097,0), ,1),\"H1\",INDEX(Infos_2!$M$2:$M$1097,MATCH(K69,Infos_2!$L$2:$L$1097,0), ,1),\"H2\",INDEX(Infos_2!$P$2:$P$1097,MATCH(K69,Infos_2!$O$2:$O$1097,0), ,1)),\"\")","v":"R"},{"$f":"IFERROR(_xlfn.SWITCH($B$3,\"C1\",INDEX(Infos_2!$D$2:$D$1097,MATCH(L69,Infos_2!$C$2:$C$1097,0),1),\"C2\",INDEX(Infos_2!$G$2:$G$1097,MATCH(L69,Infos_2!$F$2:$F$1097,0), ,1),\"H\",INDEX(Infos_2!$J$2:$J$1097,MATCH(L69,Infos_2!$I$2:$I$1097,0), ,1),\"H1\",INDEX(Infos_2!$M$2:$M$1097,MATCH(L69,Infos_2!$L$2:$L$1097,0), ,1),\"H2\",INDEX(Infos_2!$P$2:$P$1097,MATCH(L69,Infos_2!$O$2:$O$1097,0), ,1)),\"\")","v":"R"},{"$f":"IFERROR(_xlfn.SWITCH($B$3,\"C1\",INDEX(Infos_2!$D$2:$D$1097,MATCH(M69,Infos_2!$C$2:$C$1097,0),1),\"C2\",INDEX(Infos_2!$G$2:$G$1097,MATCH(M69,Infos_2!$F$2:$F$1097,0), ,1),\"H\",INDEX(Infos_2!$J$2:$J$1097,MATCH(M69,Infos_2!$I$2:$I$1097,0), ,1),\"H1\",INDEX(Infos_2!$M$2:$M$1097,MATCH(M69,Infos_2!$L$2:$L$1097,0), ,1),\"H2\",INDEX(Infos_2!$P$2:$P$1097,MATCH(M69,Infos_2!$O$2:$O$1097,0), ,1)),\"\")","v":"T"},{"$f":"IFERROR(_xlfn.SWITCH($B$3,\"C1\",INDEX(Infos_2!$D$2:$D$1097,MATCH(N69,Infos_2!$C$2:$C$1097,0),1),\"C2\",INDEX(Infos_2!$G$2:$G$1097,MATCH(N69,Infos_2!$F$2:$F$1097,0), ,1),\"H\",INDEX(Infos_2!$J$2:$J$1097,MATCH(N69,Infos_2!$I$2:$I$1097,0), ,1),\"H1\",INDEX(Infos_2!$M$2:$M$1097,MATCH(N69,Infos_2!$L$2:$L$1097,0), ,1),\"H2\",INDEX(Infos_2!$P$2:$P$1097,MATCH(N69,Infos_2!$O$2:$O$1097,0), ,1)),\"\")","v":"T"},{"$f":"IFERROR(_xlfn.SWITCH($B$3,\"C1\",INDEX(Infos_2!$D$2:$D$1097,MATCH(O69,Infos_2!$C$2:$C$1097,0),1),\"C2\",INDEX(Infos_2!$G$2:$G$1097,MATCH(O69,Infos_2!$F$2:$F$1097,0), ,1),\"H\",INDEX(Infos_2!$J$2:$J$1097,MATCH(O69,Infos_2!$I$2:$I$1097,0), ,1),\"H1\",INDEX(Infos_2!$M$2:$M$1097,MATCH(O69,Infos_2!$L$2:$L$1097,0), ,1),\"H2\",INDEX(Infos_2!$P$2:$P$1097,MATCH(O69,Infos_2!$O$2:$O$1097,0), ,1)),\"\")","v":"T"},{"$f":"IFERROR(_xlfn.SWITCH($B$3,\"C1\",INDEX(Infos_2!$D$2:$D$1097,MATCH(P69,Infos_2!$C$2:$C$1097,0),1),\"C2\",INDEX(Infos_2!$G$2:$G$1097,MATCH(P69,Infos_2!$F$2:$F$1097,0), ,1),\"H\",INDEX(Infos_2!$J$2:$J$1097,MATCH(P69,Infos_2!$I$2:$I$1097,0), ,1),\"H1\",INDEX(Infos_2!$M$2:$M$1097,MATCH(P69,Infos_2!$L$2:$L$1097,0), ,1),\"H2\",INDEX(Infos_2!$P$2:$P$1097,MATCH(P69,Infos_2!$O$2:$O$1097,0), ,1)),\"\")","v":"T"},{"$f":"IFERROR(_xlfn.SWITCH($B$3,\"C1\",INDEX(Infos_2!$D$2:$D$1097,MATCH(Q69,Infos_2!$C$2:$C$1097,0),1),\"C2\",INDEX(Infos_2!$G$2:$G$1097,MATCH(Q69,Infos_2!$F$2:$F$1097,0), ,1),\"H\",INDEX(Infos_2!$J$2:$J$1097,MATCH(Q69,Infos_2!$I$2:$I$1097,0), ,1),\"H1\",INDEX(Infos_2!$M$2:$M$1097,MATCH(Q69,Infos_2!$L$2:$L$1097,0), ,1),\"H2\",INDEX(Infos_2!$P$2:$P$1097,MATCH(Q69,Infos_2!$O$2:$O$1097,0), ,1)),\"\")","v":"T"},{"$f":"IFERROR(_xlfn.SWITCH($B$3,\"C1\",INDEX(Infos_2!$D$2:$D$1097,MATCH(R69,Infos_2!$C$2:$C$1097,0),1),\"C2\",INDEX(Infos_2!$G$2:$G$1097,MATCH(R69,Infos_2!$F$2:$F$1097,0), ,1),\"H\",INDEX(Infos_2!$J$2:$J$1097,MATCH(R69,Infos_2!$I$2:$I$1097,0), ,1),\"H1\",INDEX(Infos_2!$M$2:$M$1097,MATCH(R69,Infos_2!$L$2:$L$1097,0), ,1),\"H2\",INDEX(Infos_2!$P$2:$P$1097,MATCH(R69,Infos_2!$O$2:$O$1097,0), ,1)),\"\")","v":"R"},{"$f":"IFERROR(_xlfn.SWITCH($B$3,\"C1\",INDEX(Infos_2!$D$2:$D$1097,MATCH(S69,Infos_2!$C$2:$C$1097,0),1),\"C2\",INDEX(Infos_2!$G$2:$G$1097,MATCH(S69,Infos_2!$F$2:$F$1097,0), ,1),\"H\",INDEX(Infos_2!$J$2:$J$1097,MATCH(S69,Infos_2!$I$2:$I$1097,0), ,1),\"H1\",INDEX(Infos_2!$M$2:$M$1097,MATCH(S69,Infos_2!$L$2:$L$1097,0), ,1),\"H2\",INDEX(Infos_2!$P$2:$P$1097,MATCH(S69,Infos_2!$O$2:$O$1097,0), ,1)),\"\")","v":"R"},{"$f":"IFERROR(_xlfn.SWITCH($B$3,\"C1\",INDEX(Infos_2!$D$2:$D$1097,MATCH(T69,Infos_2!$C$2:$C$1097,0),1),\"C2\",INDEX(Infos_2!$G$2:$G$1097,MATCH(T69,Infos_2!$F$2:$F$1097,0), ,1),\"H\",INDEX(Infos_2!$J$2:$J$1097,MATCH(T69,Infos_2!$I$2:$I$1097,0), ,1),\"H1\",INDEX(Infos_2!$M$2:$M$1097,MATCH(T69,Infos_2!$L$2:$L$1097,0), ,1),\"H2\",INDEX(Infos_2!$P$2:$P$1097,MATCH(T69,Infos_2!$O$2:$O$1097,0), ,1)),\"\")","v":"T"},{"$f":"IFERROR(_xlfn.SWITCH($B$3,\"C1\",INDEX(Infos_2!$D$2:$D$1097,MATCH(U69,Infos_2!$C$2:$C$1097,0),1),\"C2\",INDEX(Infos_2!$G$2:$G$1097,MATCH(U69,Infos_2!$F$2:$F$1097,0), ,1),\"H\",INDEX(Infos_2!$J$2:$J$1097,MATCH(U69,Infos_2!$I$2:$I$1097,0), ,1),\"H1\",INDEX(Infos_2!$M$2:$M$1097,MATCH(U69,Infos_2!$L$2:$L$1097,0), ,1),\"H2\",INDEX(Infos_2!$P$2:$P$1097,MATCH(U69,Infos_2!$O$2:$O$1097,0), ,1)),\"\")","v":"T"},{"$f":"IFERROR(_xlfn.SWITCH($B$3,\"C1\",INDEX(Infos_2!$D$2:$D$1097,MATCH(V69,Infos_2!$C$2:$C$1097,0),1),\"C2\",INDEX(Infos_2!$G$2:$G$1097,MATCH(V69,Infos_2!$F$2:$F$1097,0), ,1),\"H\",INDEX(Infos_2!$J$2:$J$1097,MATCH(V69,Infos_2!$I$2:$I$1097,0), ,1),\"H1\",INDEX(Infos_2!$M$2:$M$1097,MATCH(V69,Infos_2!$L$2:$L$1097,0), ,1),\"H2\",INDEX(Infos_2!$P$2:$P$1097,MATCH(V69,Infos_2!$O$2:$O$1097,0), ,1)),\"\")","v":"T"},{"$f":"IFERROR(_xlfn.SWITCH($B$3,\"C1\",INDEX(Infos_2!$D$2:$D$1097,MATCH(W69,Infos_2!$C$2:$C$1097,0),1),\"C2\",INDEX(Infos_2!$G$2:$G$1097,MATCH(W69,Infos_2!$F$2:$F$1097,0), ,1),\"H\",INDEX(Infos_2!$J$2:$J$1097,MATCH(W69,Infos_2!$I$2:$I$1097,0), ,1),\"H1\",INDEX(Infos_2!$M$2:$M$1097,MATCH(W69,Infos_2!$L$2:$L$1097,0), ,1),\"H2\",INDEX(Infos_2!$P$2:$P$1097,MATCH(W69,Infos_2!$O$2:$O$1097,0), ,1)),\"\")","v":"T"},{"$f":"IFERROR(_xlfn.SWITCH($B$3,\"C1\",INDEX(Infos_2!$D$2:$D$1097,MATCH(X69,Infos_2!$C$2:$C$1097,0),1),\"C2\",INDEX(Infos_2!$G$2:$G$1097,MATCH(X69,Infos_2!$F$2:$F$1097,0), ,1),\"H\",INDEX(Infos_2!$J$2:$J$1097,MATCH(X69,Infos_2!$I$2:$I$1097,0), ,1),\"H1\",INDEX(Infos_2!$M$2:$M$1097,MATCH(X69,Infos_2!$L$2:$L$1097,0), ,1),\"H2\",INDEX(Infos_2!$P$2:$P$1097,MATCH(X69,Infos_2!$O$2:$O$1097,0), ,1)),\"\")","v":"T"},{"$f":"IFERROR(_xlfn.SWITCH($B$3,\"C1\",INDEX(Infos_2!$D$2:$D$1097,MATCH(Y69,Infos_2!$C$2:$C$1097,0),1),\"C2\",INDEX(Infos_2!$G$2:$G$1097,MATCH(Y69,Infos_2!$F$2:$F$1097,0), ,1),\"H\",INDEX(Infos_2!$J$2:$J$1097,MATCH(Y69,Infos_2!$I$2:$I$1097,0), ,1),\"H1\",INDEX(Infos_2!$M$2:$M$1097,MATCH(Y69,Infos_2!$L$2:$L$1097,0), ,1),\"H2\",INDEX(Infos_2!$P$2:$P$1097,MATCH(Y69,Infos_2!$O$2:$O$1097,0), ,1)),\"\")","v":"R"},{"$f":"IFERROR(_xlfn.SWITCH($B$3,\"C1\",INDEX(Infos_2!$D$2:$D$1097,MATCH(Z69,Infos_2!$C$2:$C$1097,0),1),\"C2\",INDEX(Infos_2!$G$2:$G$1097,MATCH(Z69,Infos_2!$F$2:$F$1097,0), ,1),\"H\",INDEX(Infos_2!$J$2:$J$1097,MATCH(Z69,Infos_2!$I$2:$I$1097,0), ,1),\"H1\",INDEX(Infos_2!$M$2:$M$1097,MATCH(Z69,Infos_2!$L$2:$L$1097,0), ,1),\"H2\",INDEX(Infos_2!$P$2:$P$1097,MATCH(Z69,Infos_2!$O$2:$O$1097,0), ,1)),\"\")","v":"R"},{"$f":"IFERROR(_xlfn.SWITCH($B$3,\"C1\",INDEX(Infos_2!$D$2:$D$1097,MATCH(AA69,Infos_2!$C$2:$C$1097,0),1),\"C2\",INDEX(Infos_2!$G$2:$G$1097,MATCH(AA69,Infos_2!$F$2:$F$1097,0), ,1),\"H\",INDEX(Infos_2!$J$2:$J$1097,MATCH(AA69,Infos_2!$I$2:$I$1097,0), ,1),\"H1\",INDEX(Infos_2!$M$2:$M$1097,MATCH(AA69,Infos_2!$L$2:$L$1097,0), ,1),\"H2\",INDEX(Infos_2!$P$2:$P$1097,MATCH(AA69,Infos_2!$O$2:$O$1097,0), ,1)),\"\")","v":"T"},{"$f":"IFERROR(_xlfn.SWITCH($B$3,\"C1\",INDEX(Infos_2!$D$2:$D$1097,MATCH(AB69,Infos_2!$C$2:$C$1097,0),1),\"C2\",INDEX(Infos_2!$G$2:$G$1097,MATCH(AB69,Infos_2!$F$2:$F$1097,0), ,1),\"H\",INDEX(Infos_2!$J$2:$J$1097,MATCH(AB69,Infos_2!$I$2:$I$1097,0), ,1),\"H1\",INDEX(Infos_2!$M$2:$M$1097,MATCH(AB69,Infos_2!$L$2:$L$1097,0), ,1),\"H2\",INDEX(Infos_2!$P$2:$P$1097,MATCH(AB69,Infos_2!$O$2:$O$1097,0), ,1)),\"\")","v":"T"},{"$f":"IFERROR(_xlfn.SWITCH($B$3,\"C1\",INDEX(Infos_2!$D$2:$D$1097,MATCH(AC69,Infos_2!$C$2:$C$1097,0),1),\"C2\",INDEX(Infos_2!$G$2:$G$1097,MATCH(AC69,Infos_2!$F$2:$F$1097,0), ,1),\"H\",INDEX(Infos_2!$J$2:$J$1097,MATCH(AC69,Infos_2!$I$2:$I$1097,0), ,1),\"H1\",INDEX(Infos_2!$M$2:$M$1097,MATCH(AC69,Infos_2!$L$2:$L$1097,0), ,1),\"H2\",INDEX(Infos_2!$P$2:$P$1097,MATCH(AC69,Infos_2!$O$2:$O$1097,0), ,1)),\"\")","v":"T"},{"$f":"IFERROR(_xlfn.SWITCH($B$3,\"C1\",INDEX(Infos_2!$D$2:$D$1097,MATCH(AD69,Infos_2!$C$2:$C$1097,0),1),\"C2\",INDEX(Infos_2!$G$2:$G$1097,MATCH(AD69,Infos_2!$F$2:$F$1097,0), ,1),\"H\",INDEX(Infos_2!$J$2:$J$1097,MATCH(AD69,Infos_2!$I$2:$I$1097,0), ,1),\"H1\",INDEX(Infos_2!$M$2:$M$1097,MATCH(AD69,Infos_2!$L$2:$L$1097,0), ,1),\"H2\",INDEX(Infos_2!$P$2:$P$1097,MATCH(AD69,Infos_2!$O$2:$O$1097,0), ,1)),\"\")","v":"T"},{"$f":"IFERROR(_xlfn.SWITCH($B$3,\"C1\",INDEX(Infos_2!$D$2:$D$1097,MATCH(AE69,Infos_2!$C$2:$C$1097,0),1),\"C2\",INDEX(Infos_2!$G$2:$G$1097,MATCH(AE69,Infos_2!$F$2:$F$1097,0), ,1),\"H\",INDEX(Infos_2!$J$2:$J$1097,MATCH(AE69,Infos_2!$I$2:$I$1097,0), ,1),\"H1\",INDEX(Infos_2!$M$2:$M$1097,MATCH(AE69,Infos_2!$L$2:$L$1097,0), ,1),\"H2\",INDEX(Infos_2!$P$2:$P$1097,MATCH(AE69,Infos_2!$O$2:$O$1097,0), ,1)),\"\")","v":"T"},{"$f":"IFERROR(_xlfn.SWITCH($B$3,\"C1\",INDEX(Infos_2!$D$2:$D$1097,MATCH(AF69,Infos_2!$C$2:$C$1097,0),1),\"C2\",INDEX(Infos_2!$G$2:$G$1097,MATCH(AF69,Infos_2!$F$2:$F$1097,0), ,1),\"H\",INDEX(Infos_2!$J$2:$J$1097,MATCH(AF69,Infos_2!$I$2:$I$1097,0), ,1),\"H1\",INDEX(Infos_2!$M$2:$M$1097,MATCH(AF69,Infos_2!$L$2:$L$1097,0), ,1),\"H2\",INDEX(Infos_2!$P$2:$P$1097,MATCH(AF69,Infos_2!$O$2:$O$1097,0), ,1)),\"\")","v":"R"},{"$f":"IFERROR(_xlfn.SWITCH($B$3,\"C1\",INDEX(Infos_2!$D$2:$D$1097,MATCH(AG69,Infos_2!$C$2:$C$1097,0),1),\"C2\",INDEX(Infos_2!$G$2:$G$1097,MATCH(AG69,Infos_2!$F$2:$F$1097,0), ,1),\"H\",INDEX(Infos_2!$J$2:$J$1097,MATCH(AG69,Infos_2!$I$2:$I$1097,0), ,1),\"H1\",INDEX(Infos_2!$M$2:$M$1097,MATCH(AG69,Infos_2!$L$2:$L$1097,0), ,1),\"H2\",INDEX(Infos_2!$P$2:$P$1097,MATCH(AG69,Infos_2!$O$2:$O$1097,0), ,1)),\"\")","v":"R"}]
[1,{"$f":"bloc_nom","v":"NOM 50 Prénom 50"}]
[2,"NOM 51 Prénom 51"]
[3,"NOM 52 Prénom 52"]
[4,"NOM 53 Prénom 53"]
[5,"NOM 54 Prénom 54"]
[6,"NOM 55 Prénom 55"]
[7,"NOM 56 Prénom 56"]
[8,"NOM 57 Prénom 57"]
[9,"NOM 58 Prénom 58"]
[10,""]
[11,""]
[12,""]
[13,""]
[14,""]
[15,""]
[]
[null,null,{"$f":"EDATE($C69,1)","v":"2024-04-01"},{"$f":"C91+1","v":"2024-04-02"},"2024-04-03","2024-04-04","2024-04-05","2024-04-06","2024-04-07","2024-04-08","2024-04-09","2024-04-10","2024-04-11","2024-04-12","2024-04-13","2024-04-14","2024-04-15","2024-04-16","2024-04-17","2024-04-18","2024-04-19","2024-04-20","2024-04-21","2024-04-22","2024-04-23","2024-04-24","2024-04-25","2024-04-26","2024-04-27","2024-04-28",{"$f":"IF(MONTH($AD91)<>MONTH(AD91+1),\"\",AD91+1)","v":"2024-04-29"},{"$f":"IF(AE91=\"\",\"\",IF(MONTH(AE91+1)<>MONTH(AE91),\"\",AE91+1))","v":"2024-04-30"},{"$f":"IF(AF91=\"\",\"\",IF(MONTH(AF91+1)<>MONTH(AF91),\"\",AF91+1))","v":""}]
[null,{"$f":"PROPER(TEXT(C91,\"mmmm\"))","v":"Avril"},{"$f":"C91","v":"2024-04-01"},"2024-04-02","2024-04-03","2024-04-04","2024-04-05","2024-04-06","2024-04-07","2024-04-08","2024-04-09","2024-04-10","2024-04-11","2024-04-12","2024-04-13","2024-04-14","2024-04-15","2024-04-16","2024-04-17","2024-04-18","2024-04-19","2024-04-20","2024-04-21","2024-04-22","2024-04-23","2024-04-24","2024-04-25","2024-04-26","2024-04-27","2024-04-28","2024-04-29","2024-04-30",""]
[null,"Férié",{"$f":"IF(C91=\"\",\"\",DATE($C$1,MATCH($B92,Infos!$A$2:$A$13,0),DAY(C$91)))","v":"2023-04-01"},{"$f":"IF(D91=\"\",\"\",DATE($C$1,MATCH($B92,Infos!$A$2:$A$13,0),DAY(D$91)))","v":"2023-04-02"},{"$f":"IF(E91=\"\",\"\",DATE($C$1,MATCH($B92,Infos!$A$2:$A$13,0),DAY(E$91)))","v":"2023-04-03"},{"$f":"IF(F91=\"\",\"\",DATE($C$1,MATCH($B92,Infos!$A$2:$A$13,0),DAY(F$91)))","v":"2023-04-04"},{"$f":"IF(G91=\"\",\"\",DATE($C$1,MATCH($B92,Infos!$A$2:$A$13,0),DAY(G$91)))","v":"2023-04-05"},{"$f":"IF(H91=\"\",\"\",DATE($C$1,MATCH($B92,Infos!$A$2:$A$13,0),DAY(H$91)))","v":"2023-04-06"},{"$f":"IF(I91=\"\",\"\",DATE($C$1,MATCH($B92,Infos!$A$2:$A$13,0),DAY(I$91)))","v":"2023-04-07"},{"$f":"IF(J91=\"\",\"\",DATE($C$1,MATCH($B92,Infos!$A$2:$A$13,0),DAY(J$91)))","v":"2023-04-08"},{"$f":"IF(K91=\"\",\"\",DATE($C$1,MATCH($B92,Infos!$A$2:$A$13,0),DAY(K$91)))","v":"2023-04-09"},{"$f":"IF(L91=\"\",\"\",DATE($C$1,MATCH($B92,Infos!$A$2:$A$13,0),DAY(L$91)))","v":"2023-04-10"},{"$f":"IF(M91=\"\",\"\",DATE($C$1,MATCH($B92,Infos!$A$2:$A$13,0),DAY(M$91)))","v":"2023-04-11"},{"$f":"IF(N91=\"\",\"\",DATE($C$1,MATCH($B92,Infos!$A$2:$A$13,0),DAY(N$91)))","v":"2023-04-12"},{"$f":"IF(O91=\"\",\"\",DATE($C$1,MATCH($B92,Infos!$A$2:$A$13,0),DAY(O$91)))","v":"2023-04-13"},{"$f":"IF(P91=\"\",\"\",DATE($C$1,MATCH($B92,Infos!$A$2:$A$13,0),DAY(P$91)))","v":"2023-04-14"},{"$f":"IF(Q91=\"\",\"\",DATE($C$1,MATCH($B92,Infos!$A$2:$A$13,0),DAY(Q$91)))","v":"2023-04-15"},{"$f":"IF(R91=\"\",\"\",DATE($C$1,MATCH($B92,Infos!$A$2:$A$13,0),DAY(R$91)))","v":"2023-04-16"},{"$f":"IF(S91=\"\",\"\",DATE($C$1,MATCH($B92,Infos!$A$2:$A$13,0),DAY(S$91)))","v":"2023-04-17"},{"$f":"IF(T91=\"\",\"\",DATE($C$1,MATCH($B92,Infos!$A$2:$A$13,0),DAY(T$91)))","v":"2023-04-18"},{"$f":"IF(U91=\"\",\"\",DATE($C$1,MATCH($B92,Infos!$A$2:$A$13,0),DAY(U$91)))","v":"2023-04-19"},{"$f":"IF(V91=\"\",\"\",DATE($C$1,MATCH($B92,Infos!$A$2:$A$13,0),DAY(V$91)))","v":"2023-04-20"},{"$f":"IF(W91=\"\",\"\",DATE($C$1,MATCH($B92,Infos!$A$2:$A$13,0),DAY(W$91)))","v":"2023-04-21"},{"$f":"IF(X91=\"\",\"\",DATE($C$1,MATCH($B92,Infos!$A$2:$A$13,0),DAY(X$91)))","v":"2023-04-22"},{"$f":"IF(Y91=\"\",\"\",DATE($C$1,MATCH($B92,Infos!$A$2:$A$13,0),DAY(Y$91)))","v":"2023-04-23"},{"$f":"IF(Z91=\"\",\"\",DATE($C$1,MATCH($B92,Infos!$A$2:$A$13,0),DAY(Z$91)))","v":"2023-04-24"},{"$f":"IF(AA91=\"\",\"\",DATE($C$1,MATCH($B92,Infos!$A$2:$A$13,0),DAY(AA$91)))","v":"2023-04-25"},{"$f":"IF(AB91=\"\",\"\",DATE($C$1,MATCH($B92,Infos!$A$2:$A$13,0),DAY(AB$91)))","v":"2023-04-26"},{"$f":"IF(AC91=\"\",\"\",DATE($C$1,MATCH($B92,Infos!$A$2:$A$13,0),DAY(AC$91)))","v":"2023-04-27"},{"$f":"IF(AD91=\"\",\"\",DATE($C$1,MATCH($B92,Infos!$A$2:$A$13,0),DAY(AD$91)))","v":"2023-04-28"},{"$f":"IF(AE91=\"\",\"\",DATE($C$1,MATCH($B92,Infos!$A$2:$A$13,0),DAY(AE$91)))","v":"2023-04-29"},{"$f":"IF(AF91=\"\",\"\",DATE($C$1,MATCH($B92,Infos!$A$2:$A$13,0),DAY(AF$91)))","v":"2023-04-30"},{"$f":"IF(AG91=\"\",\"\",DATE($C$1,MATCH($B92,Infos!$A$2:$A$13,0),DAY(AG$91)))","v":""}]
[null,"WE",{"$f":"IF(C91<>\"\",IF(COUNTIF('Jours fériés'!$B$3:$B$15,Planning!C93),8,WEEKDAY(C93,2)),\"\")","v":6},{"$f":"IF(D91<>\"\",IF(COUNTIF('Jours fériés'!$B$3:$B$15,Planning!D93),8,WEEKDAY(D93,2)),\"\")","v":7},{"$f":"IF(E91<>\"\",IF(COUNTIF('Jours fériés'!$B$3:$B$15,Planning!E93),8,WEEKDAY(E93,2)),\"\")","v":1},{"$f":"IF(F91<>\"\",IF(COUNTIF('Jours fériés'!$B$3:$B$15,Planning!F93),8,WEEKDAY(F93,2)),\"\")","v":2},{"$f":"IF(G91<>\"\",IF(COUNTIF('Jours fériés'!$B$3:$B$15,Planning!G93),8,WEEKDAY(G93,2)),\"\")","v":3},{"$f":"IF(H91<>\"\",IF(COUNTIF('Jours fériés'!$B$3:$B$15,Planning!H93),8,WEEKDAY(H93,2)),\"\")","v":4},{"$f":"IF(I91<>\"\",IF(COUNTIF('Jours fériés'!$B$3:$B$15,Planning!I93),8,WEEKDAY(I93,2)),\"\")","v":5},{"$f":"IF(J91<>\"\",IF(COUNTIF('Jours fériés'!$B$3:$B$15,Planning!J93),8,WEEKDAY(J93,2)),\"\")","v":6},{"$f":"IF(K91<>\"\",IF(COUNTIF('Jours fériés'!$B$3:$B$15,Planning!K93),8,WEEKDAY(K93,2)),\"\")","v":8},{"$f":"IF(L91<>\"\",IF(COUNTIF('Jours fériés'!$B$3:$B$15,Planning!L93),8,WEEKDAY(L93,2)),\"\")","v":8},{"$f":"IF(M91<>\"\",IF(COUNTIF('Jours fériés'!$B$3:$B$15,Planning!M93),8,WEEKDAY(M93,2)),\"\")","v":2},{"$f":"IF(N91<>\"\",IF(COUNTIF('Jours fériés'!$B$3:$B$15,Planning!N93),8,WEEKDAY(N93,2)),\"\")","v":3},{"$f":"IF(O91<>\"\",IF(COUNTIF('Jours fériés'!$B$3:$B$15,Planning!O93),8,WEEKDAY(O93,2)),\"\")","v":4},{"$f":"IF(P91<>\"\",IF(COUNTIF('Jours fériés'!$B$3:$B$15,Planning!P93),8,WEEKDAY(P93,2)),\"\")","v":5},{"$f":"IF(Q91<>\"\",IF(COUNTIF('Jours fériés'!$B$3:$B$15,Planning!Q93),8,WEEKDAY(Q93,2)),\"\")","v":6},{"$f":"IF(R91<>\"\",IF(COUNTIF('Jours fériés'!$B$3:$B$15,Planning!R93),8,WEEKDAY(R93,2)),\"\")","v":7},{"$f":"IF(S91<>\"\",IF(COUNTIF('Jours fériés'!$B$3:$B$15,Planning!S93),8,WEEKDAY(S93,2)),\"\")","v":1},{"$f":"IF(T91<>\"\",IF(COUNTIF('Jours fériés'!$B$3:$B$15,Planning!T93),8,WEEKDAY(T93,2)),\"\")","v":2},{"$f":"IF(U91<>\"\",IF(COUNTIF('Jours fériés'!$B$3:$B$15,Planning!U93),8,WEEKDAY(U93,2)),\"\")","v":3},{"$f":"IF(V91<>\"\",IF(COUNTIF('Jours fériés'!$B$3:$B$15,Planning!V93),8,WEEKDAY(V93,2)),\"\")","v":4},{"$f":"IF(W91<>\"\",IF(COUNTIF('Jours fériés'!$B$3:$B$15,Planning!W93),8,WEEKDAY(W93,2)),\"\")","v":5},{"$f":"IF(X91<>\"\",IF(COUNTIF('Jours fériés'!$B$3:$B$15,Planning!X93),8,WEEKDAY(X93,2)),\"\")","v":6},{"$f":"IF(Y91<>\"\",IF(COUNTIF('Jours fériés'!$B$3:$B$15,Planning!Y93),8,WEEKDAY(Y93,2)),\"\")","v":7},{"$f":"IF(Z91<>\"\",IF(COUNTIF('Jours fériés'!$B$3:$B$15,Planning!Z93),8,WEEKDAY(Z93,2)),\"\")","v":1},{"$f":"IF(AA91<>\"\",IF(COUNTIF('Jours fériés'!$B$3:$B$15,Planning!AA93),8,WEEKDAY(AA93,2)),\"\")","v":2},{"$f":"IF(AB91<>\"\",IF(COUNTIF('Jours fériés'!$B$3:$B$15,Planning!AB93),8,WEEKDAY(AB93,2)),\"\")","v":3},{"$f":"IF(AC91<>\"\",IF(COUNTIF('Jours fériés'!$B$3:$B$15,Planning!AC93),8,WEEKDAY(AC93,2)),\"\")","v":4},{"$f":"IF(AD91<>\"\",IF(COUNTIF('Jours fériés'!$B$3:$B$15,Planning!AD93),8,WEEKDAY(AD93,2)),\"\")","v":5},{"$f":"IF(AE91<>\"\",IF(COUNTIF('Jours fériés'!$B$3:$B$15,Planning!AE93),8,WEEKDAY(AE93,2)),\"\")","v":6},{"$f":"IF(AF91<>\"\",IF(COUNTIF('Jours fériés'!$B$3:$B$15,Planning!AF93),8,WEEKDAY(AF93,2)),\"\")","v":7},{"$f":"IF(AG91<>\"\",IF(COUNTIF('Jours fériés'!$B$3:$B$15,Planning!AG93),8,WEEKDAY(AG93,2)),\"\")","v":""}]
[null,"VACANCES",{"$f":"IF(SUMPRODUCT((C91>=datdeb)*(C91<=datfin))=1,\"vac\",\"\")","v":""},{"$f":"IF(SUMPRODUCT((D91>=datdeb)*(D91<=datfin))=1,\"vac\",\"\")","v":""},{"$f":"IF(SUMPRODUCT((E91>=datdeb)*(E91<=datfin))=1,\"vac\",\"\")","v":""},{"$f":"IF(SUMPRODUCT((F91>=datdeb)*(F91<=datfin))=1,\"vac\",\"\")","v":""},{"$f":"IF(SUMPRODUCT((G91>=datdeb)*(G91<=datfin))=1,\"vac\",\"\")","v":""},{"$f":"IF(SUMPRODUCT((H91>=datdeb)*(H91<=datfin))=1,\"vac\",\"\")","v":""},{"$f":"IF(SUMPRODUCT((I91>=datdeb)*(I91<=datfin))=1,\"vac\",\"\")","v":""},{"$f":"IF(SUMPRODUCT((J91>=datdeb)*(J91<=datfin))=1,\"vac\",\"\")","v":""},{"$f":"IF(SUMPRODUCT((K91>=datdeb)*(K91<=datfin))=1,\"vac\",\"\")","v":""},{"$f":"IF(SUMPRODUCT((L91>=datdeb)*(L91<=datfin))=1,\"vac\",\"\")","v":""},{"$f":"IF(SUMPRODUCT((M91>=datdeb)*(M91<=datfin))=1,\"vac\",\"\")","v":""},{"$f":"IF(SUMPRODUCT((N91>=datdeb)*(N91<=datfin))=1,\"vac\",\"\")","v":""},{"$f":"IF(SUMPRODUCT((O91>=datdeb)*(O91<=datfin))=1,\"vac\",\"\")","v":"vac"},{"$f":"IF(SUMPRODUCT((P91>=datdeb)*(P91<=datfin))=1,\"vac\",\"\")","v":"vac"},{"$f":"IF(SUMPRODUCT((Q91>=datdeb)*(Q91<=datfin))=1,\"vac\",\"\")","v":"vac"},{"$f":"IF(SUMPRODUCT((R91>=datdeb)*(R91<=datfin))=1,\"vac\",\"\")","v":"vac"},{"$f":"IF(SUMPRODUCT((S91>=datdeb)*(S91<=datfin))=1,\"vac\",\"\")","v":"vac"},{"$f":"IF(SUMPRODUCT((T91>=datdeb)*(T91<=datfin))=1,\"vac\",\"\")","v":"vac"},{"$f":"IF(SUMPRODUCT((U91>=datdeb)*(U91<=datfin))=1,\"vac\",\"\")","v":"vac"},{"$f":"IF(SUMPRODUCT((V91>=datdeb)*(V91<=datfin))=1,\"vac\",\"\")","v":"vac"},{"$f":"IF(SUMPRODUCT((W91>=datdeb)*(W91<=datfin))=1,\"vac\",\"\")","v":"vac"},{"$f":"IF(SUMPRODUCT((X91>=datdeb)*(X91<=datfin))=1,\"vac\",\"\")","v":"vac"},{"$f":"IF(SUMPRODUCT((Y91>=datdeb)*(Y91<=datfin))=1,\"vac\",\"\")","v":"vac"},{"$f":"IF(SUMPRODUCT((Z91>=datdeb)*(Z91<=datfin))=1,\"vac\",\"\")","v":"vac"},{"$f":"IF(SUMPRODUCT((AA91>=datdeb)*(AA91<=datfin))=1,\"vac\",\"\")","v":"vac"},{"$f":"IF(SUMPRODUCT((AB91>=datdeb)*(AB91<=datfin))=1,\"vac\",\"\")","v":"vac"},{"$f":"IF(SUMPRODUCT((AC91>=datdeb)*(AC91<=datfin))=1,\"vac\",\"\")","v":"vac"},{"$f":"IF(SUMPRODUCT((AD91>=datdeb)*(AD91<=datfin))=1,\"vac\",\"\")","v":"vac"},{"$f":"IF(SUMPRODUCT((AE91>=datdeb)*(AE91<=datfin))=1,\"vac\",\"\")","v":"vac"},{"$f":"IF(SUMPRODUCT((AF91>=datdeb)*(AF91<=datfin))=1,\"vac\",\"\")","v":""},{"$f":"IF(SUMPRODUCT((AG91>=datdeb)*(AG91<=datfin))=1,\"vac\",\"\")","v":""}]
[null,null,{"$f":"IFERROR(_xlfn.SWITCH($B$3,\"C1\",INDEX(Infos_2!$D$2:$D$1097,MATCH(C91,Infos_2!$C$2:$C$1097,0),1),\"C2\",INDEX(Infos_2!$G$2:$G$1097,MATCH(C91,Infos_2!$F$2:$F$1097,0), ,1),\"H\",INDEX(Infos_2!$J$2:$J$1097,MATCH(C91,Infos_2!$I$2:$I$1097,0), ,1),\"H1\",INDEX(Infos_2!$M$2:$M$1097,MATCH(C91,Infos_2!$L$2:$L$1097,0), ,1),\"H2\",INDEX(Infos_2!$P$2:$P$1097,MATCH(C91,Infos_2!$O$2:$O$1097,0), ,1)),\"\")","v":"T"},{"$f":"IFERROR(_xlfn.SWITCH($B$3,\"C1\",INDEX(Infos_2!$D$2:$D$1097,MATCH(D91,Infos_2!$C$2:$C$1097,0),1),\"C2\",INDEX(Infos_2!$G$2:$G$1097,MATCH(D91,Infos_2!$F$2:$F$1097,0), ,1),\"H\",INDEX(Infos_2!$J$2:$J$1097,MATCH(D91,Infos_2!$I$2:$I$1097,0), ,1),\"H1\",INDEX(Infos_2!$M$2:$M$1097,MATCH(D91,Infos_2!$L$2:$L$1097,0), ,1),\"H2\",INDEX(Infos_2!$P$2:$P$1097,MATCH(D91,Infos_2!$O$2:$O$1097,0), ,1)),\"\")","v":"T"},{"$f":"IFERROR(_xlfn.SWITCH($B$3,\"C1\",INDEX(Infos_2!$D$2:$D$1097,MATCH(E91,Infos_2!$C$2:$C$1097,0),1),\"C2\",INDEX(Infos_2!$G$2:$G$1097,MATCH(E91,Infos_2!$F$2:$F$1097,0), ,1),\"H\",INDEX(Infos_2!$J$2:$J$1097,MATCH(E91,Infos_2!$I$2:$I$1097,0), ,1),\"H1\",INDEX(Infos_2!$M$2:$M$1097,MATCH(E91,Infos_2!$L$2:$L$1097,0), ,1),\"H2\",INDEX(Infos_2!$P$2:$P$1097,MATCH(E91,Infos_2!$O$2:$O$1097,0), ,1)),\"\")","v":"T"},{"$f":"IFERROR(_xlfn.SWITCH($B$3,\"C1\",INDEX(Infos_2!$D$2:$D$1097,MATCH(F91,Infos_2!$C$2:$C$1097,0),1),\"C2\",INDEX(Infos_2!$G$2:$G$1097,MATCH(F91,Infos_2!$F$2:$F$1097,0), ,1),\"H\",INDEX(Infos_2!$J$2:$J$1097,MATCH(F91,Infos_2!$I$2:$I$1097,0), ,1),\"H1\",INDEX(Infos_2!$M$2:$M$1097,MATCH(F91,Infos_2!$L$2:$L$1097,0), ,1),\"H2\",INDEX(Infos_2!$P$2:$P$1097,MATCH(F91,Infos_2!$O$2:$O$1097,0), ,1)),\"\")","v":"T"},{"$f":"IFERROR(_xlfn.SWITCH($B$3,\"C1\",INDEX(Infos_2!$D$2:$D$1097,MATCH(G91,Infos_2!$C$2:$C$1097,0),1),\"C2\",INDEX(Infos_2!$G$2:$G$1097,MATCH(G91,Infos_2!$F$2:$F$1097,0), ,1),\"H\",INDEX(Infos_2!$J$2:$J$1097,MATCH(G91,Infos_2!$I$2:$I$1097,0), ,1),\"H1\",INDEX(Infos_2!$M$2:$M$1097,MATCH(G91,Infos_2!$L$2:$L$1097,0), ,1),\"H2\",INDEX(Infos_2!$P$2:$P$1097,MATCH(G91,Infos_2!$O$2:$O$1097,0), ,1)),\"\")","v":"T"},{"$f":"IFERROR(_xlfn.SWITCH($B$3,\"C1\",INDEX(Infos_2!$D$2:$D$1097,MATCH(H91,Infos_2!$C$2:$C$1097,0),1),\"C2\",INDEX(Infos_2!$G$2:$G$1097,MATCH(H91,Infos_2!$F$2:$F$1097,0), ,1),\"H\",INDEX(Infos_2!$J$2:$J$1097,MATCH(H91,Infos_2!$I$2:$I$1097,0), ,1),\"H1\",INDEX(Infos_2!$M$2:$M$1097,MATCH(H91,Infos_2!$L$2:$L$1097,0), ,1),\"H2\",INDEX(Infos_2!$P$2:$P$1097,MATCH(H91,Infos_2!$O$2:$O$1097,0), ,1)),\"\")","v":"R"},{"$f":"IFERROR(_xlfn.SWITCH($B$3,\"C1\",INDEX(Infos_2!$D$2:$D$1097,MATCH(I91,Infos_2!$C$2:$C$1097,0),1),\"C2\",INDEX(Infos_2!$G$2:$G$1097,MATCH(I91,Infos_2!$F$2:$F$1097,0), ,1),\"H\",INDEX(Infos_2!$J$2:$J$1097,MATCH(I91,Infos_2!$I$2:$I$1097,0), ,1),\"H1\",INDEX(Infos_2!$M$2:$M$1097,MATCH(I91,Infos_2!$L$2:$L$1097,0), ,1),\"H2\",INDEX(Infos_2!$P$2:$P$1097,MATCH(I91,Infos_2!$O$2:$O$1097,0), ,1)),\"\")","v":"R"},{"$f":"IFERROR(_xlfn.SWITCH($B$3,\"C1\",INDEX(Infos_2!$D$2:$D$1097,MATCH(J91,Infos_2!$C$2:$C$1097,0),1),\"C2\",INDEX(Infos_2!$G$2:$G$1097,MATCH(J91,Infos_2!$F$2:$F$1097,0), ,1),\"H\",INDEX(Infos_2!$J$2:$J$1097,MATCH(J91,Infos_2!$I$2:$I$1097,0), ,1),\"H1\",INDEX(Infos_2!$M$2:$M$1097,MATCH(J91,Infos_2!$L$2:$L$1097,0), ,1),\"H2\",INDEX(Infos_2!$P$2:$P$1097,MATCH(J91,Infos_2!$O$2:$O$1097,0), ,1)),\"\")","v":"T"},{"$f":"IFERROR(_xlfn.SWITCH($B$3,\"C1\",INDEX(Infos_2!$D$2:$D$1097,MATCH(K91,Infos_2!$C$2:$C$1097,0),1),\"C2\",INDEX(Infos_2!$G$2:$G$1097,MATCH(K91,Infos_2!$F$2:$F$1097,0), ,1),\"H\",INDEX(Infos_2!$J$2:$J$1097,MATCH(K91,Infos_2!$I$2:$I$1097,0), ,1),\"H1\",INDEX(Infos_2!$M$2:$M$1097,MATCH(K91,Infos_2!$L$2:$L$1097,0), ,1),\"H2\",INDEX(Infos_2!$P$2:$P$1097,MATCH(K91,Infos_2!$O$2:$O$1097,0), ,1)),\"\")","v":"T"},{"$f":"IFERROR(_xlfn.SWITCH($B$3,\"C1\",INDEX(Infos_2!$D$2:$D$1097,MATCH(L91,Infos_2!$C$2:$C$1097,0),1),\"C2\",INDEX(Infos_2!$G$2:$G$1097,MATCH(L91,Infos_2!$F$2:$F$1097,0), ,1),\"H\",INDEX(Infos_2!$J$2:$J$1097,MATCH(L91,Infos_2!$I$2:$I$1097,0), ,1),\"H1\",INDEX(Infos_2!$M$2:$M$1097,MATCH(L91,Infos_2!$L$2:$L$1097,0), ,1),\"H2\",INDEX(Infos_2!$P$2:$P$1097,MATCH(L91,Infos_2!$O$2:$O$1097,0), ,1)),\"\")","v":"T"},{"$f":"IFERROR(_xlfn.SWITCH($B$3,\"C1\",INDEX(Infos_2!$D$2:$D$1097,MATCH(M91,Infos_2!$C$2:$C$1097,0),1),\"C2\",INDEX(Infos_2!$G$2:$G$1097,MATCH(M91,Infos_2!$F$2:$F$1097,0), ,1),\"H\",INDEX(Infos_2!$J$2:$J$1097,MATCH(M91,Infos_2!$I$2:$I$1097,0), ,1),\"H1\",INDEX(Infos_2!$M$2:$M$1097,MATCH(M91,Infos_2!$L$2:$L$1097,0), ,1),\"H2\",INDEX(Infos_2!$P$2:$P$1097,MATCH(M91,Infos_2!$O$2:$O$1097,0), ,1)),\"\")","v":"T"},{"$f":"IFERROR(_xlfn.SWITCH($B$3,\"C1\",INDEX(Infos_2!$D$2:$D$1097,MATCH(N91,Infos_2!$C$2:$C$1097,0),1),\"C2\",INDEX(Infos_2!$G$2:$G$1097,MATCH(N91,Infos_2!$F$2:$F$1097,0), ,1),\"H\",INDEX(Infos_2!$J$2:$J$1097,MATCH(N91,Infos_2!$I$2:$I$1097,0), ,1),\"H1\",INDEX(Infos_2!$M$2:$M$1097,MATCH(N91,Infos_2!$L$2:$L$1097,0), ,1),\"H2\",INDEX(Infos_2!$P$2:$P$1097,MATCH(N91,Infos_2!$O$2:$O$1097,0), ,1)),\"\")","v":"T"},{"$f":"IFERROR(_xlfn.SWITCH($B$3,\"C1\",INDEX(Infos_2!$D$2:$D$1097,MATCH(O91,Infos_2!$C$2:$C$1097,0),1),\"C2\",INDEX(Infos_2!$G$2:$G$1097,MATCH(O91,Infos_2!$F$2:$F$1097,0), ,1),\"H\",INDEX(Infos_2!$J$2:$J$1097,MATCH(O91,Infos_2!$I$2:$I$1097,0), ,1),\"H1\",INDEX(Infos_2!$M$2:$M$1097,MATCH(O91,Infos_2!$L$2:$L$1097,0), ,1),\"H2\",INDEX(Infos_2!$P$2:$P$1097,MATCH(O91,Infos_2!$O$2:$O$1097,0), ,1)),\"\")","v":"R"},{"$f":"IFERROR(_xlfn.SWITCH($B$3,\"C1\",INDEX(Infos_2!$D$2:$D$1097,MATCH(P91,Infos_2!$C$2:$C$1097,0),1),\"C2\",INDEX(Infos_2!$G$2:$G$1097,MATCH(P91,Infos_2!$F$2:$F$1097,0), ,1),\"H\",INDEX(Infos_2!$J$2:$J$1097,MATCH(P91,Infos_2!$I$2:$I$1097,0), ,1),\"H1\",INDEX(Infos_2!$M$2:$M$1097,MATCH(P91,Infos_2!$L$2:$L$1097,0), ,1),\"H2\",INDEX(Infos_2!$P$2:$P$1097,MATCH(P91,Infos_2!$O$2:$O$1097,0), ,1)),\"\")","v":"R"},{"$f":"IFERROR(_xlfn.SWITCH($B$3,\"C1\",INDEX(Infos_2!$D$2:$D$1097,MATCH(Q91,Infos_2!$C$2:$C$1097,0),1),\"C2\",INDEX(Infos_2!$G$2:$G$1097,MATCH(Q91,Infos_2!$F$2:$F$1097,0), ,1),\"H\",INDEX(Infos_2!$J$2:$J$1097,MATCH(Q91,Infos_2!$I$2:$I$1097,0), ,1),\"H1\",INDEX(Infos_2!$M$2:$M$1097,MATCH(Q91,Infos_2!$L$2:$L$1097,0), ,1),\"H2\",INDEX(Infos_2!$P$2:$P$1097,MATCH(Q91,Infos_2!$O$2:$O$1097,0), ,1)),\"\")","v":"T"},{"$f":"IFERROR(_xlfn.SWITCH($B$3,\"C1\",INDEX(Infos_2!$D$2:$D$1097,MATCH(R91,Infos_2!$C$2:$C$1097,0),1),\"C2\",INDEX(Infos_2!$G$2:$G$1097,MATCH(R91,Infos_2!$F$2:$F$1097,0), ,1),\"H\",INDEX(Infos_2!$J$2:$J$1097,MATCH(R91,Infos_2!$I$2:$I$1097,0), ,1),\"H1\",INDEX(Infos_2!$M$2:$M$1097,MATCH(R91,Infos_2!$L$2:$L$1097,0), ,1),\"H2\",INDEX(Infos_2!$P$2:$P$1097,MATCH(R91,Infos_2!$O$2:$O$1097,0), ,1)),\"\")","v":"T"},{"$f":"IFERROR(_xlfn.SWITCH($B$3,\"C1\",INDEX(Infos_2!$D$2:$D$1097,MATCH(S91,Infos_2!$C$2:$C$1097,0),1),\"C2\",INDEX(Infos_2!$G$2:$G$1097,MATCH(S91,Infos_2!$F$2:$F$1097,0), ,1),\"H\",INDEX(Infos_2!$J$2:$J$1097,MATCH(S91,Infos_2!$I$2:$I$1097,0), ,1),\"H1\",INDEX(Infos_2!$M$2:$M$1097,MATCH(S91,Infos_2!$L$2:$L$1097,0), ,1),\"H2\",INDEX(Infos_2!$P$2:$P$1097,MATCH(S91,Infos_2!$O$2:$O$1097,0), ,1)),\"\")","v":"T"},{"$f":"IFERROR(_xlfn.SWITCH($B$3,\"C1\",INDEX(Infos_2!$D$2:$D$1097,MATCH(T91,Infos_2!$C$2:$C$1097,0),1),\"C2\",INDEX(Infos_2!$G$2:$G$1097,MATCH(T91,Infos_2!$F$2:$F$1097,0), ,1),\"H\",INDEX(Infos_2!$J$2:$J$1097,MATCH(T91,Infos_2!$I$2:$I$1097,0), ,1),\"H1\",INDEX(Infos_2!$M$2:$M$1097,MATCH(T91,Infos_2!$L$2:$L$1097,0), ,1),\"H2\",INDEX(Infos_2!$P$2:$P$1097,MATCH(T91,Infos_2!$O$2:$O$1097,0), ,1)),\"\")","v":"T"},{"$f":"IFERROR(_xlfn.SWITCH($B$3,\"C1\",INDEX(Infos_2!$D$2:$D$1097,MATCH(U91,Infos_2!$C$2:$C$1097,0),1),\"C2\",INDEX(Infos_2!$G$2:$G$1097,MATCH(U91,Infos_2!$F$2:$F$1097,0), ,1),\"H\",INDEX(Infos_2!$J$2:$J$1097,MATCH(U91,Infos_2!$I$2:$I$1097,0), ,1),\"H1\",INDEX(Infos_2!$M$2:$M$1097,MATCH(U91,Infos_2!$L$2:$L$1097,0), ,1),\"H2\",INDEX(Infos_2!$P$2:$P$1097,MATCH(U91,Infos_2!$O$2:$O$1097,0), ,1)),\"\")","v":"T"},{"$f":"IFERROR(_xlfn.SWITCH($B$3,\"C1\",INDEX(Infos_2!$D$2:$D$1097,MATCH(V91,Infos_2!$C$2:$C$1097,0),1),\"C2\",INDEX(Infos_2!$G$2:$G$1097,MATCH(V91,Infos_2!$F$2:$F$1097,0), ,1),\"H\",INDEX(Infos_2!$J$2:$J$1097,MATCH(V91,Infos_2!$I$2:$I$1097,0), ,1),\"H1\",INDEX(Infos_2!$M$2:$M$1097,MATCH(V91,Infos_2!$L$2:$L$1097,0), ,1),\"H2\",INDEX(Infos_2!$P$2:$P$1097,MATCH(V91,Infos_2!$O$2:$O$1097,0), ,1)),\"\")","v":"R"},{"$f":"IFERROR(_xlfn.SWITCH($B$3,\"C1\",INDEX(Infos_2!$D$2:$D$1097,MATCH(W91,Infos_2!$C$2:$C$1097,0),1),\"C2\",INDEX(Infos_2!$G$2:$G$1097,MATCH(W91,Infos_2!$F$2:$F$1097,0), ,1),\"H\",INDEX(Infos_2!$J$2:$J$1097,MATCH(W91,Infos_2!$I$2:$I$1097,0), ,1),\"H1\",INDEX(Infos_2!$M$2:$M$1097,MATCH(W91,Infos_2!$L$2:$L$1097,0), ,1),\"H2\",INDEX(Infos_2!$P$2:$P$1097,MATCH(W91,Infos_2!$O$2:$O$1097,0), ,1)),\"\")","v":"R"},{"$f":"IFERROR(_xlfn.SWITCH($B$3,\"C1\",INDEX(Infos_2!$D$2:$D$1097,MATCH(X91,Infos_2!$C$2:$C$1097,0),1),\"C2\",INDEX(Infos_2!$G$2:$G$1097,MATCH(X91,Infos_2!$F$2:$F$1097,0), ,1),\"H\",INDEX(Infos_2!$J$2:$J$1097,MATCH(X91,Infos_2!$I$2:$I$1097,0), ,1),\"H1\",INDEX(Infos_2!$M$2:$M$1097,MATCH(X91,Infos_2!$L$2:$L$1097,0), ,1),\"H2\",INDEX(Infos_2!$P$2:$P$1097,MATCH(X91,Infos_2!$O$2:$O$1097,0), ,1)),\"\")","v":"T"},{"$f":"IFERROR(_xlfn.SWITCH($B$3,\"C1\",INDEX(Infos_2!$D$2:$D$1097,MATCH(Y91,Infos_2!$C$2:$C$1097,0),1),\"C2\",INDEX(Infos_2!$G$2:$G$1097,MATCH(Y91,Infos_2!$F$2:$F$1097,0), ,1),\"H\",INDEX(Infos_2!$J$2:$J$1097,MATCH(Y91,Infos_2!$I$2:$I$1097,0), ,1),\"H1\",INDEX(Infos_2!$M$2:$M$1097,MATCH(Y91,Infos_2!$L$2:$L$1097,0), ,1),\"H2\",INDEX(Infos_2!$P$2:$P$1097,MATCH(Y91,Infos_2!$O$2:$O$1097,0), ,1)),\"\")","v":"T"},{"$f":"IFERROR(_xlfn.SWITCH($B$3,\"C1\",INDEX(Infos_2!$D$2:$D$1097,MATCH(Z91,Infos_2!$C$2:$C$1097,0),1),\"C2\",INDEX(Infos_2!$G$2:$G$1097,MATCH(Z91,Infos_2!$F$2:$F$1097,0), ,1),\"H\",INDEX(Infos_2!$J$2:$J$1097,MATCH(Z91,Infos_2!$I$2:$I$1097,0), ,1),\"H1\",INDEX(Infos_2!$M$2:$M$1097,MATCH(Z91,Infos_2!$L$2:$L$1097,0), ,1),\"H2\",INDEX(Infos_2!$P$2:$P$1097,MATCH(Z91,Infos_2!$O$2:$O$1097,0), ,1)),\"\")","v":"T"},{"$f":"IFERROR(_xlfn.SWITCH($B$3,\"C1\",INDEX(Infos_2!$D$2:$D$1097,MATCH(AA91,Infos_2!$C$2:$C$1097,0),1),\"C2\",INDEX(Infos_2!$G$2:$G$1097,MATCH(AA91,Infos_2!$F$2:$F$1097,0), ,1),\"H\",INDEX(Infos_2!$J$2:$J$1097,MATCH(AA91,Infos_2!$I$2:$I$1097,0), ,1),\"H1\",INDEX(Infos_2!$M$2:$M$1097,MATCH(AA91,Infos_2!$L$2:$L$1097,0), ,1),\"H2\",INDEX(Infos_2!$P$2:$P$1097,MATCH(AA91,Infos_2!$O$2:$O$1097,0), ,1)),\"\")","v":"T"},{"$f":"IFERROR(_xlfn.SWITCH($B$3,\"C1\",INDEX(Infos_2!$D$2:$D$1097,MATCH(AB91,Infos_2!$C$2:$C$1097,0),1),\"C2\",INDEX(Infos_2!$G$2:$G$1097,MATCH(AB91,Infos_2!$F$2:$F$1097,0), ,1),\"H\",INDEX(Infos_2!$J$2:$J$1097,MATCH(AB91,Infos_2!$I$2:$I$1097,0), ,1),\"H1\",INDEX(Infos_2!$M$2:$M$1097,MATCH(AB91,Infos_2!$L$2:$L$1097,0), ,1),\"H2\",INDEX(Infos_2!$P$2:$P$1097,MATCH(AB91,Infos_2!$O$2:$O$1097,0), ,1)),\"\")","v":"T"},{"$f":"IFERROR(_xlfn.SWITCH($B$3,\"C1\",INDEX(Infos_2!$D$2:$D$1097,MATCH(AC91,Infos_2!$C$2:$C$1097,0),1),\"C2\",INDEX(Infos_2!$G$2:$G$1097,MATCH(AC91,Infos_2!$F$2:$F$1097,0), ,1),\"H\",INDEX(Infos_2!$J$2:$J$1097,MATCH(AC91,Infos_2!$I$2:$I$1097,0), ,1),\"H1\",INDEX(Infos_2!$M$2:$M$1097,MATCH(AC91,Infos_2!$L$2:$L$1097,0), ,1),\"H2\",INDEX(Infos_2!$P$2:$P$1097,MATCH(AC91,Infos_2!$O$2:$O$1097,0), ,1)),\"\")","v":"R"},{"$f":"IFERROR(_xlfn.SWITCH($B$3,\"C1\",INDEX(Infos_2!$D$2:$D$1097,MATCH(AD91,Infos_2!$C$2:$C$1097,0),1),\"C2\",INDEX(Infos_2!$G$2:$G$1097,MATCH(AD91,Infos_2!$F$2:$F$1097,0), ,1),\"H\",INDEX(Infos_2!$J$2:$J$1097,MATCH(AD91,Infos_2!$I$2:$I$1097,0), ,1),\"H1\",INDEX(Infos_2!$M$2:$M$1097,MATCH(AD91,Infos_2!$L$2:$L$1097,0), ,1),\"H2\",INDEX(Infos_2!$P$2:$P$1097,MATCH(AD91,Infos_2!$O$2:$O$1097,0), ,1)),\"\")","v":"R"},{"$f":"IFERROR(_xlfn.SWITCH($B$3,\"C1\",INDEX(Infos_2!$D$2:$D$1097,MATCH(AE91,Infos_2!$C$2:$C$1097,0),1),\"C2\",INDEX(Infos_2!$G$2:$G$1097,MATCH(AE91,Infos_2!$F$2:$F$1097,0), ,1),\"H\",INDEX(Infos_2!$J$2:$J$1097,MATCH(AE91,Infos_2!$I$2:$I$1097,0), ,1),\"H1\",INDEX(Infos_2!$M$2:$M$1097,MATCH(AE91,Infos_2!$L$2:$L$1097,0), ,1),\"H2\",INDEX(Infos_2!$P$2:$P$1097,MATCH(AE91,Infos_2!$O$2:$O$1097,0), ,1)),\"\")","v":"T"},{"$f":"IFERROR(_xlfn.SWITCH($B$3,\"C1\",INDEX(Infos_2!$D$2:$D$1097,MATCH(AF91,Infos_2!$C$2:$C$1097,0),1),\"C2\",INDEX(Infos_2!$G$2:$G$1097,MATCH(AF91,Infos_2!$F$2:$F$1097,0), ,1),\"H\",INDEX(Infos_2!$J$2:$J$1097,MATCH(AF91,Infos_2!$I$2:$I$1097,0), ,1),\"H1\",INDEX(Infos_2!$M$2:$M$1097,MATCH(AF91,Infos_2!$L$2:$L$1097,0), ,1),\"H2\",INDEX(Infos_2!$P$2:$P$1097,MATCH(AF91,Infos_2!$O$2:$O$1097,0), ,1)),\"\")","v":"T"},{"$f":"IFERROR(_xlfn.SWITCH($B$3,\"C1\",INDEX(Infos_2!$D$2:$D$1097,MATCH(AG91,Infos_2!$C$2:$C$1097,0),1),\"C2\",INDEX(Infos_2!$G$2:$G$1097,MATCH(AG91,Infos_2!$F$2:$F$1097,0), ,1),\"H\",INDEX(Infos_2!$J$2:$J$1097,MATCH(AG91,Infos_2!$I$2:$I$1097,0), ,1),\"H1\",INDEX(Infos_2!$M$2:$M$1097,MATCH(AG91,Infos_2!$L$2:$L$1097,0), ,1),\"H2\",INDEX(Infos_2!$P$2:$P$1097,MATCH(AG91,Infos_2!$O$2:$O$1097,0), ,1)),\"\")","v":""}]
[1,{"$f":"bloc_nom","v":"NOM 50 Prénom 50"}]
[2,"NOM 51 Prénom 51"]
[3,"NOM 52 Prénom 52"]
[4,"NOM 53 Prénom 53"]
[5,"NOM 54 Prénom 54"]
[6,"NOM 55 Prénom 55"]
[7,"NOM 56 Prénom 56"]
[8,"NOM 57 Prénom 57"]
[9,"NOM 58 Prénom 58"]
[10,""]
[11,""]
[12,""]
[13,""]
[14,""]
[15,""]
[]
[null,null,{"$f":"EDATE($C91,1)","v":"2024-05-01"},{"$f":"C113+1","v":"2024-05-02"},"2024-05-03","2024-05-04","2024-05-05","2024-05-06","2024-05-07","2024-05-08","2024-05-09","2024-05-10","2024-05-11","2024-05-12","2024-05-13","2024-05-14","2024-05-15","2024-05-16","2024-05-17","2024-05-18","2024-05-19","2024-05-20","2024-05-21","2024-05-22","2024-05-23","2024-05-24","2024-05-25","2024-05-26","2024-05-27","2024-05-28",{"$f":"IF(MONTH($AD113)<>MONTH(AD113+1),\"\",AD113+1)","v":"2024-05-29"},{"$f":"IF(AE113=\"\",\"\",IF(MONTH(AE113+1)<>MONTH(AE113),\"\",AE113+1))","v":"2024-05-30"},{"$f":"IF(AF113=\"\",\"\",IF(MONTH(AF113+1)<>MONTH(AF113),\"\",AF113+1))","v":"2024-05-31"}]
[null,{"$f":"PROPER(TEXT(C113,\"mmmm\"))","v":"Mai"},{"$f":"C113","v":"2024-05-01"},"2024-05-02","2024-05-03","2024-05-04","2024-05-05","2024-05-06","2024-05-07","2024-05-08","2024-05-09","2024-05-10","2024-05-11","2024-05-12","2024-05-13","2024-05-14","2024-05-15","2024-05-16","2024-05-17","2024-05-18","2024-05-19","2024-05-20","2024-05-21","2024-05-22","2024-05-23","2024-05-24","2024-05-25","2024-05-26","2024-05-27","2024-05-28","2024-05-29","2024-05-30","2024-05-31"]
[null,"Férié",{"$f":"IF(C113=\"\",\"\",DATE($C$1,MATCH($B114,Infos!$A$2:$A$13,0),DAY(C$113)))","v":"2023-05-01"},{"$f":"IF(D113=\"\",\"\",DATE($C$1,MATCH($B114,Infos!$A$2:$A$13,0),DAY(D$113)))","v":"2023-05-02"},{"$f":"IF(E113=\"\",\"\",DATE($C$1,MATCH($B114,Infos!$A$2:$A$13,0),DAY(E$113)))","v":"2023-05-03"},{"$f":"IF(F113=\"\",\"\",DATE($C$1,MATCH($B114,Infos!$A$2:$A$13,0),DAY(F$113)))","v":"2023-05-04"},{"$f":"IF(G113=\"\",\"\",DATE($C$1,MATCH($B114,Infos!$A$2:$A$13,0),DAY(G$113)))","v":"2023-05-05"},{"$f":"IF(H113=\"\",\"\",DATE($C$1,MATCH($B114,Infos!$A$2:$A$13,0),DAY(H$113)))","v":"2023-05-06"},{"$f":"IF(I113=\"\",\"\",DATE($C$1,MATCH($B114,Infos!$A$2:$A$13,0),DAY(I$113)))","v":"2023-05-07"},{"$f":"IF(J113=\"\",\"\",DATE($C$1,MATCH($B114,Infos!$A$2:$A$13,0),DAY(J$113)))","v":"2023-05-08"},{"$f":"IF(K113=\"\",\"\",DATE($C$1,MATCH($B114,Infos!$A$2:$A$13,0),DAY(K$113)))","v":"2023-05-09"},{"$f":"IF(L113=\"\",\"\",DATE($C$1,MATCH($B114,Infos!$A$2:$A$13,0),DAY(L$113)))","v":"2023-05-10"},{"$f":"IF(M113=\"\",\"\",DATE($C$1,MATCH($B114,Infos!$A$2:$A$13,0),DAY(M$113)))","v":"2023-05-11"},{"$f":"IF(N113=\"\",\"\",DATE($C$1,MATCH($B114,Infos!$A$2:$A$13,0),DAY(N$113)))","v":"2023-05-12"},{"$f":"IF(O113=\"\",\"\",DATE($C$1,MATCH($B114,Infos!$A$2:$A$13,0),DAY(O$113)))","v":"2023-05-13"},{"$f":"IF(P113=\"\",\"\",DATE($C$1,MATCH($B114,Infos!$A$2:$A$13,0),DAY(P$113)))","v":"2023-05-14"},{"$f":"IF(Q113=\"\",\"\",DATE($C$1,MATCH($B114,Infos!$A$2:$A$13,0),DAY(Q$113)))","v":"2023-05-15"},{"$f":"IF(R113=\"\",\"\",DATE($C$1,MATCH($B114,Infos!$A$2:$A$13,0),DAY(R$113)))","v":"2023-05-16"},{"$f":"IF(S113=\"\",\"\",DATE($C$1,MATCH($B114,Infos!$A$2:$A$13,0),DAY(S$113)))","v":"2023-05-17"},{"$f":"IF(T113=\"\",\"\",DATE($C$1,MATCH($B114,Infos!$A$2:$A$13,0),DAY(T$113)))","v":"2023-05-18"},{"$f":"IF(U113=\"\",\"\",DATE($C$1,MATCH($B114,Infos!$A$2:$A$13,0),DAY(U$113)))","v":"2023-05-19"},{"$f":"IF(V113=\"\",\"\",DATE($C$1,MATCH($B114,Infos!$A$2:$A$13,0),DAY(V$113)))","v":"2023-05-20"},{"$f":"IF(W113=\"\",\"\",DATE($C$1,MATCH($B114,Infos!$A$2:$A$13,0),DAY(W$113)))","v":"2023-05-21"},{"$f":"IF(X113=\"\",\"\",DATE($C$1,MATCH($B114,Infos!$A$2:$A$13,0),DAY(X$113)))","v":"2023-05-22"},{"$f":"IF(Y113=\"\",\"\",DATE($C$1,MATCH($B114,Infos!$A$2:$A$13,0),DAY(Y$113)))","v":"2023-05-23"},{"$f":"IF(Z113=\"\",\"\",DATE($C$1,MATCH($B114,Infos!$A$2:$A$13,0),DAY(Z$113)))","v":"2023-05-24"},{"$f":"IF(AA113=\"\",\"\",DATE($C$1,MATCH($B114,Infos!$A$2:$A$13,0),DAY(AA$113)))","v":"2023-05-25"},{"$f":"IF(AB113=\"\",\"\",DATE($C$1,MATCH($B114,Infos!$A$2:$A$13,0),DAY(AB$113)))","v":"2023-05-26"},{"$f":"IF(AC113=\"\",\"\",DATE($C$1,MATCH($B114,Infos!$A$2:$A$13,0),DAY(AC$113)))","v":"2023-05-27"},{"$f":"IF(AD113=\"\",\"\",DATE($C$1,MATCH($B114,Infos!$A$2:$A$13,0),DAY(AD$113)))","v":"2023-05-28"},{"$f":"IF(AE113=\"\",\"\",DATE($C$1,MATCH($B114,Infos!$A$2:$A$13,0),DAY(AE$113)))","v":"2023-05-29"},{"$f":"IF(AF113=\"\",\"\",DATE($C$1,MATCH($B114,Infos!$A$2:$A$13,0),DAY(AF$113)))","v":"2023-05-30"},{"$f":"IF(AG113=\"\",\"\",DATE($C$1,MATCH($B114,Infos!$A$2:$A$13,0),DAY(AG$113)))","v":"2023-05-31"}]
[null,"WE",{"$f":"IF(C113<>\"\",IF(COUNTIF('Jours fériés'!$B$3:$B$15,Planning!C115),8,WEEKDAY(C115,2)),\"\")","v":8},{"$f":"IF(D113<>\"\",IF(COUNTIF('Jours fériés'!$B$3:$B$15,Planning!D115),8,WEEKDAY(D115,2)),\"\")","v":2},{"$f":"IF(E113<>\"\",IF(COUNTIF('Jours fériés'!$B$3:$B$15,Planning!E115),8,WEEKDAY(E115,2)),\"\")","v":3},{"$f":"IF(F113<>\"\",IF(COUNTIF('Jours fériés'!$B$3:$B$15,Planning!F115),8,WEEKDAY(F115,2)),\"\")","v":4},{"$f":"IF(G113<>\"\",IF(COUNTIF('Jours fériés'!$B$3:$B$15,Planning!G115),8,WEEKDAY(G115,2)),\"\")","v":5},{"$f":"IF(H113<>\"\",IF(COUNTIF('Jours fériés'!$B$3:$B$15,Planning!H115),8,WEEKDAY(H115,2)),\"\")","v":6},{"$f":"IF(I113<>\"\",IF(COUNTIF('Jours fériés'!$B$3:$B$15,Planning!I115),8,WEEKDAY(I115,2)),\"\")","v":7},{"$f":"IF(J113<>\"\",IF(COUNTIF('Jours fériés'!$B$3:$B$15,Planning!J115),8,WEEKDAY(J115,2)),\"\")","v":8},{"$f":"IF(K113<>\"\",IF(COUNTIF('Jours fériés'!$B$3:$B$15,Planning!K115),8,WEEKDAY(K115,2)),\"\")","v":2},{"$f":"IF(L113<>\"\",IF(COUNTIF('Jours fériés'!$B$3:$B$15,Planning!L115),8,WEEKDAY(L115,2)),\"\")","v":3},{"$f":"IF(M113<>\"\",IF(COUNTIF('Jours fériés'!$B$3:$B$15,Planning!M115),8,WEEKDAY(M115,2)),\"\")","v":4},{"$f":"IF(N113<>\"\",IF(COUNTIF('Jours fériés'!$B$3:$B$15,Planning!N115),8,WEEKDAY(N115,2)),\"\")","v":5},{"$f":"IF(O113<>\"\",IF(COUNTIF('Jours fériés'!$B$3:$B$15,Planning!O115),8,WEEKDAY(O115,2)),\"\")","v":6},{"$f":"IF(P113<>\"\",IF(COUNTIF('Jours fériés'!$B$3:$B$15,Planning!P115),8,WEEKDAY(P115,2)),\"\")","v":7},{"$f":"IF(Q113<>\"\",IF(COUNTIF('Jours fériés'!$B$3:$B$15,Planning!Q115),8,WEEKDAY(Q115,2)),\"\")","v":1},{"$f":"IF(R113<>\"\",IF(COUNTIF('Jours fériés'!$B$3:$B$15,Planning!R115),8,WEEKDAY(R115,2)),\"\")","v":2},{"$f":"IF(S113<>\"\",IF(COUNTIF('Jours fériés'!$B$3:$B$15,Planning!S115),8,WEEKDAY(S115,2)),\"\")","v":3},{"$f":"IF(T113<>\"\",IF(COUNTIF('Jours fériés'!$B$3:$B$15,Planning!T115),8,WEEKDAY(T115,2)),\"\")","v":8},{"$f":"IF(U113<>\"\",IF(COUNTIF('Jours fériés'!$B$3:$B$15,Planning!U115),8,WEEKDAY(U115,2)),\"\")","v":5},{"$f":"IF(V113<>\"\",IF(COUNTIF('Jours fériés'!$B$3:$B$15,Planning!V115),8,WEEKDAY(V115,2)),\"\")","v":6},{"$f":"IF(W113<>\"\",IF(COUNTIF('Jours fériés'!$B$3:$B$15,Planning!W115),8,WEEKDAY(W115,2)),\"\")","v":7},{"$f":"IF(X113<>\"\",IF(COUNTIF('Jours fériés'!$B$3:$B$15,Planning!X115),8,WEEKDAY(X115,2)),\"\")","v":1},{"$f":"IF(Y113<>\"\",IF(COUNTIF('Jours fériés'!$B$3:$B$15,Planning!Y115),8,WEEKDAY(Y115,2)),\"\")","v":2},{"$f":"IF(Z113<>\"\",IF(COUNTIF('Jours fériés'!$B$3:$B$15,Planning!Z115),8,WEEKDAY(Z115,2)),\"\")","v":3},{"$f":"IF(AA113<>\"\",IF(COUNTIF('Jours fériés'!$B$3:$B$15,Planning!AA115),8,WEEKDAY(AA115,2)),\"\")","v":4},{"$f":"IF(AB113<>\"\",IF(COUNTIF('Jours fériés'!$B$3:$B$15,Planning!AB115),8,WEEKDAY(AB115,2)),\"\")","v":5},{"$f":"IF(AC113<>\"\",IF(COUNTIF('Jours fériés'!$B$3:$B$15,Planning!AC115),8,WEEKDAY(AC115,2)),\"\")","v":6},{"$f":"IF(AD113<>\"\",IF(COUNTIF('Jours fériés'!$B$3:$B$15,Planning!AD115),8,WEEKDAY(AD115,2)),\"\")","v":8},{"$f":"IF(AE113<>\"\",IF(COUNTIF('Jours fériés'!$B$3:$B$15,Planning!AE115),8,WEEKDAY(AE115,2)),\"\")","v":8},{"$f":"IF(AF113<>\"\",IF(COUNTIF('Jours fériés'!$B$3:$B$15,Planning!AF115),8,WEEKDAY(AF115,2)),\"\")","v":2},{"$f":"IF(AG113<>\"\",IF(COUNTIF('Jours fériés'!$B$3:$B$15,Planning!AG115),8,WEEKDAY(AG115,2)),\"\")","v":3}]
[null,"VACANCES",{"$f":"IF(SUMPRODUCT((C113>=datdeb)*(C113<=datfin))=1,\"vac\",\"\")","v":""},{"$f":"IF(SUMPRODUCT((D113>=datdeb)*(D113<=datfin))=1,\"vac\",\"\")","v":""},{"$f":"IF(SUMPRODUCT((E113>=datdeb)*(E113<=datfin))=1,\"vac\",\"\")","v":""},{"$f":"IF(SUMPRODUCT((F113>=datdeb)*(F113<=datfin))=1,\"vac\",\"\")","v":""},{"$f":"IF(SUMPRODUCT((G113>=datdeb)*(G113<=datfin))=1,\"vac\",\"\")","v":""},{"$f":"IF(SUMPRODUCT((H113>=datdeb)*(H113<=datfin))=1,\"vac\",\"\")","v":""},{"$f":"IF(SUMPRODUCT((I113>=datdeb)*(I113<=datfin))=1,\"vac\",\"\")","v":""},{"$f":"IF(SUMPRODUCT((J113>=datdeb)*(J113<=datfin))=1,\"vac\",\"\")","v":""},{"$f":"IF(SUMPRODUCT((K113>=datdeb)*(K113<=datfin))=1,\"vac\",\"\")","v":""},{"$f":"IF(SUMPRODUCT((L113>=datdeb)*(L113<=datfin))=1,\"vac\",\"\")","v":""},{"$f":"IF(SUMPRODUCT((M113>=datdeb)*(M113<=datfin))=1,\"vac\",\"\")","v":""},{"$f":"IF(SUMPRODUCT((N113>=datdeb)*(N113<=datfin))=1,\"vac\",\"\")","v":""},{"$f":"IF(SUMPRODUCT((O113>=datdeb)*(O113<=datfin))=1,\"vac\",\"\")","v":""},{"$f":"IF(SUMPRODUCT((P113>=datdeb)*(P113<=datfin))=1,\"vac\",\"\")","v":""},{"$f":"IF(SUMPRODUCT((Q113>=datdeb)*(Q113<=datfin))=1,\"vac\",\"\")","v":""},{"$f":"IF(SUMPRODUCT((R113>=datdeb)*(R113<=datfin))=1,\"vac\",\"\")","v":""},{"$f":"IF(SUMPRODUCT((S113>=datdeb)*(S113<=datfin))=1,\"vac\",\"\")","v":""},{"$f":"IF(SUMPRODUCT((T113>=datdeb)*(T113<=datfin))=1,\"vac\",\"\")","v":""},{"$f":"IF(SUMPRODUCT((U113>=datdeb)*(U113<=datfin))=1,\"vac\",\"\")","v":""},{"$f":"IF(SUMPRODUCT((V113>=datdeb)*(V113<=datfin))=1,\"vac\",\"\")","v":""},{"$f":"IF(SUMPRODUCT((W113>=datdeb)*(W113<=datfin))=1,\"vac\",\"\")","v":""},{"$f":"IF(SUMPRODUCT((X113>=datdeb)*(X113<=datfin))=1,\"vac\",\"\")","v":""},{"$f":"IF(SUMPRODUCT((Y113>=datdeb)*(Y113<=datfin))=1,\"vac\",\"\")","v":""},{"$f":"IF(SUMPRODUCT((Z113>=datdeb)*(Z113<=datfin))=1,\"vac\",\"\")","v":""},{"$f":"IF(SUMPRODUCT((AA113>=datdeb)*(AA113<=datfin))=1,\"vac\",\"\")","v":""},{"$f":"IF(SUMPRODUCT((AB113>=datdeb)*(AB113<=datfin))=1,\"vac\",\"\")","v":""},{"$f":"IF(SUMPRODUCT((AC113>=datdeb)*(AC113<=datfin))=1,\"vac\",\"\")","v":""},{"$f":"IF(SUMPRODUCT((AD113>=datdeb)*(AD113<=datfin))=1,\"vac\",\"\")","v":""},{"$f":"IF(SUMPRODUCT((AE113>=datdeb)*(AE113<=datfin))=1,\"vac\",\"\")","v":""},{"$f":"IF(SUMPRODUCT((AF113>=datdeb)*(AF113<=datfin))=1,\"vac\",\"\")","v":""},{"$f":"IF(SUMPRODUCT((AG113>=datdeb)*(AG113<=datfin))=1,\"vac\",\"\")","v":""}]
[null,null,{"$f":"IFERROR(_xlfn.SWITCH($B$3,\"C1\",INDEX(Infos_2!$D$2:$D$1097,MATCH(C113,Infos_2!$C$2:$C$1097,0),1),\"C2\",INDEX(Infos_2!$G$2:$G$1097,MATCH(C113,Infos_2!$F$2:$F$1097,0), ,1),\"H\",INDEX(Infos_2!$J$2:$J$1097,MATCH(C113,Infos_2!$I$2:$I$1097,0), ,1),\"H1\",INDEX(Infos_2!$M$2:$M$1097,MATCH(C113,Infos_2!$L$2:$L$1097,0), ,1),\"H2\",INDEX(Infos_2!$P$2:$P$1097,MATCH(C113,Infos_2!$O$2:$O$1097,0), ,1)),\"\")","v":"T"},{"$f":"IFERROR(_xlfn.SWITCH($B$3,\"C1\",INDEX(Infos_2!$D$2:$D$1097,MATCH(D113,Infos_2!$C$2:$C$1097,0),1),\"C2\",INDEX(Infos_2!$G$2:$G$1097,MATCH(D113,Infos_2!$F$2:$F$1097,0), ,1),\"H\",INDEX(Infos_2!$J$2:$J$1097,MATCH(D113,Infos_2!$I$2:$I$1097,0), ,1),\"H1\",INDEX(Infos_2!$M$2:$M$1097,MATCH(D113,Infos_2!$L$2:$L$1097,0), ,1),\"H2\",INDEX(Infos_2!$P$2:$P$1097,MATCH(D113,Infos_2!$O$2:$O$1097,0), ,1)),\"\")","v":"T"},{"$f":"IFERROR(_xlfn.SWITCH($B$3,\"C1\",INDEX(Infos_2!$D$2:$D$1097,MATCH(E113,Infos_2!$C$2:$C$1097,0),1),\"C2\",INDEX(Infos_2!$G$2:$G$1097,MATCH(E113,Infos_2!$F$2:$F$1097,0), ,1),\"H\",INDEX(Infos_2!$J$2:$J$1097,MATCH(E113,Infos_2!$I$2:$I$1097,0), ,1),\"H1\",INDEX(Infos_2!$M$2:$M$1097,MATCH(E113,Infos_2!$L$2:$L$1097,0), ,1),\"H2\",INDEX(Infos_2!$P$2:$P$1097,MATCH(E113,Infos_2!$O$2:$O$1097,0), ,1)),\"\")","v":"T"},{"$f":"IFERROR(_xlfn.SWITCH($B$3,\"C1\",INDEX(Infos_2!$D$2:$D$1097,MATCH(F113,Infos_2!$C$2:$C$1097,0),1),\"C2\",INDEX(Infos_2!$G$2:$G$1097,MATCH(F113,Infos_2!$F$2:$F$1097,0), ,1),\"H\",INDEX(Infos_2!$J$2:$J$1097,MATCH(F113,Infos_2!$I$2:$I$1097,0), ,1),\"H1\",INDEX(Infos_2!$M$2:$M$1097,MATCH(F113,Infos_2!$L$2:$L$1097,0), ,1),\"H2\",INDEX(Infos_2!$P$2:$P$1097,MATCH(F113,Infos_2!$O$2:$O$1097,0), ,1)),\"\")","v":"R"},{"$f":"IFERROR(_xlfn.SWITCH($B$3,\"C1\",INDEX(Infos_2!$D$2:$D$1097,MATCH(G113,Infos_2!$C$2:$C$1097,0),1),\"C2\",INDEX(Infos_2!$G$2:$G$1097,MATCH(G113,Infos_2!$F$2:$F$1097,0), ,1),\"H\",INDEX(Infos_2!$J$2:$J$1097,MATCH(G113,Infos_2!$I$2:$I$1097,0), ,1),\"H1\",INDEX(Infos_2!$M$2:$M$1097,MATCH(G113,Infos_2!$L$2:$L$1097,0), ,1),\"H2\",INDEX(Infos_2!$P$2:$P$1097,MATCH(G113,Infos_2!$O$2:$O$1097,0), ,1)),\"\")","v":"R"},{"$f":"IFERROR(_xlfn.SWITCH($B$3,\"C1\",INDEX(Infos_2!$D$2:$D$1097,MATCH(H113,Infos_2!$C$2:$C$1097,0),1),\"C2\",INDEX(Infos_2!$G$2:$G$1097,MATCH(H113,Infos_2!$F$2:$F$1097,0), ,1),\"H\",INDEX(Infos_2!$J$2:$J$1097,MATCH(H113,Infos_2!$I$2:$I$1097,0), ,1),\"H1\",INDEX(Infos_2!$M$2:$M$1097,MATCH(H113,Infos_2!$L$2:$L$1097,0), ,1),\"H2\",INDEX(Infos_2!$P$2:$P$1097,MATCH(H113,Infos_2!$O$2:$O$1097,0), ,1)),\"\")","v":"T"},{"$f":"IFERROR(_xlfn.SWITCH($B$3,\"C1\",INDEX(Infos_2!$D$2:$D$1097,MATCH(I113,Infos_2!$C$2:$C$1097,0),1),\"C2\",INDEX(Infos_2!$G$2:$G$1097,MATCH(I113,Infos_2!$F$2:$F$1097,0), ,1),\"H\",INDEX(Infos_2!$J$2:$J$1097,MATCH(I113,Infos_2!$I$2:$I$1097,0), ,1),\"H1\",INDEX(Infos_2!$M$2:$M$1097,MATCH(I113,Infos_2!$L$2:$L$1097,0), ,1),\"H2\",INDEX(Infos_2!$P$2:$P$1097,MATCH(I113,Infos_2!$O$2:$O$1097,0), ,1)),\"\")","v":"T"},{"$f":"IFERROR(_xlfn.SWITCH($B$3,\"C1\",INDEX(Infos_2!$D$2:$D$1097,MATCH(J113,Infos_2!$C$2:$C$1097,0),1),\"C2\",INDEX(Infos_2!$G$2:$G$1097,MATCH(J113,Infos_2!$F$2:$F$1097,0), ,1),\"H\",INDEX(Infos_2!$J$2:$J$1097,MATCH(J113,Infos_2!$I$2:$I$1097,0), ,1),\"H1\",INDEX(Infos_2!$M$2:$M$1097,MATCH(J113,Infos_2!$L$2:$L$1097,0), ,1),\"H2\",INDEX(Infos_2!$P$2:$P$1097,MATCH(J113,Infos_2!$O$2:$O$1097,0), ,1)),\"\")","v":"T"},{"$f":"IFERROR(_xlfn.SWITCH($B$3,\"C1\",INDEX(Infos_2!$D$2:$D$1097,MATCH(K113,Infos_2!$C$2:$C$1097,0),1),\"C2\",INDEX(Infos_2!$G$2:$G$1097,MATCH(K113,Infos_2!$F$2:$F$1097,0), ,1),\"H\",INDEX(Infos_2!$J$2:$J$1097,MATCH(K113,Infos_2!$I$2:$I$1097,0), ,1),\"H1\",INDEX(Infos_2!$M$2:$M$1097,MATCH(K113,Infos_2!$L$2:$L$1097,0), ,1),\"H2\",INDEX(Infos_2!$P$2:$P$1097,MATCH(K113,Infos_2!$O$2:$O$1097,0), ,1)),\"\")","v":"T"},{"$f":"IFERROR(_xlfn.SWITCH($B$3,\"C1\",INDEX(Infos_2!$D$2:$D$1097,MATCH(L113,Infos_2!$C$2:$C$1097,0),1),\"C2\",INDEX(Infos_2!$G$2:$G$1097,MATCH(L113,Infos_2!$F$2:$F$1097,0), ,1),\"H\",INDEX(Infos_2!$J$2:$J$1097,MATCH(L113,Infos_2!$I$2:$I$1097,0), ,1),\"H1\",INDEX(Infos_2!$M$2:$M$1097,MATCH(L113,Infos_2!$L$2:$L$1097,0), ,1),\"H2\",INDEX(Infos_2!$P$2:$P$1097,MATCH(L113,Infos_2!$O$2:$O$1097,0), ,1)),\"\")","v":"T"},{"$f":"IFERROR(_xlfn.SWITCH($B$3,\"C1\",INDEX(Infos_2!$D$2:$D$1097,MATCH(M113,Infos_2!$C$2:$C$1097,0),1),\"C2\",INDEX(Infos_2!$G$2:$G$1097,MATCH(M113,Infos_2!$F$2:$F$1097,0), ,1),\"H\",INDEX(Infos_2!$J$2:$J$1097,MATCH(M113,Infos_2!$I$2:$I$1097,0), ,1),\"H1\",INDEX(Infos_2!$M$2:$M$1097,MATCH(M113,Infos_2!$L$2:$L$1097,0), ,1),\"H2\",INDEX(Infos_2!$P$2:$P$1097,MATCH(M113,Infos_2!$O$2:$O$1097,0), ,1)),\"\")","v":"R"},{"$f":"IFERROR(_xlfn.SWITCH($B$3,\"C1\",INDEX(Infos_2!$D$2:$D$1097,MATCH(N113,Infos_2!$C$2:$C$1097,0),1),\"C2\",INDEX(Infos_2!$G$2:$G$1097,MATCH(N113,Infos_2!$F$2:$F$1097,0), ,1),\"H\",INDEX(Infos_2!$J$2:$J$1097,MATCH(N113,Infos_2!$I$2:$I$1097,0), ,1),\"H1\",INDEX(Infos_2!$M$2:$M$1097,MATCH(N113,Infos_2!$L$2:$L$1097,0), ,1),\"H2\",INDEX(Infos_2!$P$2:$P$1097,MATCH(N113,Infos_2!$O$2:$O$1097,0), ,1)),\"\")","v":"R"},{"$f":"IFERROR(_xlfn.SWITCH($B$3,\"C1\",INDEX(Infos_2!$D$2:$D$1097,MATCH(O113,Infos_2!$C$2:$C$1097,0),1),\"C2\",INDEX(Infos_2!$G$2:$G$1097,MATCH(O113,Infos_2!$F$2:$F$1097,0), ,1),\"H\",INDEX(Infos_2!$J$2:$J$1097,MATCH(O113,Infos_2!$I$2:$I$1097,0), ,1),\"H1\",INDEX(Infos_2!$M$2:$M$1097,MATCH(O113,Infos_2!$L$2:$L$1097,0), ,1),\"H2\",INDEX(Infos_2!$P$2:$P$1097,MATCH(O113,Infos_2!$O$2:$O$1097,0), ,1)),\"\")","v":"T"},{"$f":"IFERROR(_xlfn.SWITCH($B$3,\"C1\",INDEX(Infos_2!$D$2:$D$1097,MATCH(P113,Infos_2!$C$2:$C$1097,0),1),\"C2\",INDEX(Infos_2!$G$2:$G$1097,MATCH(P113,Infos_2!$F$2:$F$1097,0), ,1),\"H\",INDEX(Infos_2!$J$2:$J$1097,MATCH(P113,Infos_2!$I$2:$I$1097,0), ,1),\"H1\",INDEX(Infos_2!$M$2:$M$1097,MATCH(P113,Infos_2!$L$2:$L$1097,0), ,1),\"H2\",INDEX(Infos_2!$P$2:$P$1097,MATCH(P113,Infos_2!$O$2:$O$1097,0), ,1)),\"\")","v":"T"},{"$f":"IFERROR(_xlfn.SWITCH($B$3,\"C1\",INDEX(Infos_2!$D$2:$D$1097,MATCH(Q113,Infos_2!$C$2:$C$1097,0),1),\"C2\",INDEX(Infos_2!$G$2:$G$1097,MATCH(Q113,Infos_2!$F$2:$F$1097,0), ,1),\"H\",INDEX(Infos_2!$J$2:$J$1097,MATCH(Q113,Infos_2!$I$2:$I$1097,0), ,1),\"H1\",INDEX(Infos_2!$M$2:$M$1097,MATCH(Q113,Infos_2!$L$2:$L$1097,0), ,1),\"H2\",INDEX(Infos_2!$P$2:$P$1097,MATCH(Q113,Infos_2!$O$2:$O$1097,0), ,1)),\"\")","v":"T"},{"$f":"IFERROR(_xlfn.SWITCH($B$3,\"C1\",INDEX(Infos_2!$D$2:$D$1097,MATCH(R113,Infos_2!$C$2:$C$1097,0),1),\"C2\",INDEX(Infos_2!$G$2:$G$1097,MATCH(R113,Infos_2!$F$2:$F$1097,0), ,1),\"H\",INDEX(Infos_2!$J$2:$J$1097,MATCH(R113,Infos_2!$I$2:$I$1097,0), ,1),\"H1\",INDEX(Infos_2!$M$2:$M$1097,MATCH(R113,Infos_2!$L$2:$L$1097,0), ,1),\"H2\",INDEX(Infos_2!$P$2:$P$1097,MATCH(R113,Infos_2!$O$2:$O$1097,0), ,1)),\"\")","v":"T"},{"$f":"IFERROR(_xlfn.SWITCH($B$3,\"C1\",INDEX(Infos_2!$D$2:$D$1097,MATCH(S113,Infos_2!$C$2:$C$1097,0),1),\"C2\",INDEX(Infos_2!$G$2:$G$1097,MATCH(S113,Infos_2!$F$2:$F$1097,0), ,1),\"H\",INDEX(Infos_2!$J$2:$J$1097,MATCH(S113,Infos_2!$I$2:$I$1097,0), ,1),\"H1\",INDEX(Infos_2!$M$2:$M$1097,MATCH(S113,Infos_2!$L$2:$L$1097,0), ,1),\"H2\",INDEX(Infos_2!$P$2:$P$1097,MATCH(S113,Infos_2!$O$2:$O$1097,0), ,1)),\"\")","v":"T"},{"$f":"IFERROR(_xlfn.SWITCH($B$3,\"C1\",INDEX(Infos_2!$D$2:$D$1097,MATCH(T113,Infos_2!$C$2:$C$1097,0),1),\"C2\",INDEX(Infos_2!$G$2:$G$1097,MATCH(T113,Infos_2!$F$2:$F$1097,0), ,1),\"H\",INDEX(Infos_2!$J$2:$J$1097,MATCH(T113,Infos_2!$I$2:$I$1097,0), ,1),\"H1\",INDEX(Infos_2!$M$2:$M$1097,MATCH(T113,Infos_2!$L$2:$L$1097,0), ,1),\"H2\",INDEX(Infos_2!$P$2:$P$1097,MATCH(T113,Infos_2!$O$2:$O$1097,0), ,1)),\"\")","v":"R"},{"$f":"IFERROR(_xlfn.SWITCH($B$3,\"C1\",INDEX(Infos_2!$D$2:$D$1097,MATCH(U113,Infos_2!$C$2:$C$1097,0),1),\"C2\",INDEX(Infos_2!$G$2:$G$1097,MATCH(U113,Infos_2!$F$2:$F$1097,0), ,1),\"H\",INDEX(Infos_2!$J$2:$J$1097,MATCH(U113,Infos_2!$I$2:$I$1097,0), ,1),\"H1\",INDEX(Infos_2!$M$2:$M$1097,MATCH(U113,Infos_2!$L$2:$L$1097,0), ,1),\"H2\",INDEX(Infos_2!$P$2:$P$1097,MATCH(U113,Infos_2!$O$2:$O$1097,0), ,1)),\"\")","v":"R"},{"$f":"IFERROR(_xlfn.SWITCH($B$3,\"C1\",INDEX(Infos_2!$D$2:$D$1097,MATCH(V113,Infos_2!$C$2:$C$1097,0),1),\"C2\",INDEX(Infos_2!$G$2:$G$1097,MATCH(V113,Infos_2!$F$2:$F$1097,0), ,1),\"H\",INDEX(Infos_2!$J$2:$J$1097,MATCH(V113,Infos_2!$I$2:$I$1097,0), ,1),\"H1\",INDEX(Infos_2!$M$2:$M$1097,MATCH(V113,Infos_2!$L$2:$L$1097,0), ,1),\"H2\",INDEX(Infos_2!$P$2:$P$1097,MATCH(V113,Infos_2!$O$2:$O$1097,0), ,1)),\"\")","v":"T"},{"$f":"IFERROR(_xlfn.SWITCH($B$3,\"C1\",INDEX(Infos_2!$D$2:$D$1097,MATCH(W113,Infos_2!$C$2:$C$1097,0),1),\"C2\",INDEX(Infos_2!$G$2:$G$1097,MATCH(W113,Infos_2!$F$2:$F$1097,0), ,1),\"H\",INDEX(Infos_2!$J$2:$J$1097,MATCH(W113,Infos_2!$I$2:$I$1097,0), ,1),\"H1\",INDEX(Infos_2!$M$2:$M$1097,MATCH(W113,Infos_2!$L$2:$L$1097,0), ,1),\"H2\",INDEX(Infos_2!$P$2:$P$1097,MATCH(W113,Infos_2!$O$2:$O$1097,0), ,1)),\"\")","v":"T"},{"$f":"IFERROR(_xlfn.SWITCH($B$3,\"C1\",INDEX(Infos_2!$D$2:$D$1097,MATCH(X113,Infos_2!$C$2:$C$1097,0),1),\"C2\",INDEX(Infos_2!$G$2:$G$1097,MATCH(X113,Infos_2!$F$2:$F$1097,0), ,1),\"H\",INDEX(Infos_2!$J$2:$J$1097,MATCH(X113,Infos_2!$I$2:$I$1097,0), ,1),\"H1\",INDEX(Infos_2!$M$2:$M$1097,MATCH(X113,Infos_2!$L$2:$L$1097,0), ,1),\"H2\",INDEX(Infos_2!$P$2:$P$1097,MATCH(X113,Infos_2!$O$2:$O$1097,0), ,1)),\"\")","v":"T"},{"$f":"IFERROR(_xlfn.SWITCH($B$3,\"C1\",INDEX(Infos_2!$D$2:$D$1097,MATCH(Y113,Infos_2!$C$2:$C$1097,0),1),\"C2\",INDEX(Infos_2!$G$2:$G$1097,MATCH(Y113,Infos_2!$F$2:$F$1097,0), ,1),\"H\",INDEX(Infos_2!$J$2:$J$1097,MATCH(Y113,Infos_2!$I$2:$I$1097,0), ,1),\"H1\",INDEX(Infos_2!$M$2:$M$1097,MATCH(Y113,Infos_2!$L$2:$L$1097,0), ,1),\"H2\",INDEX(Infos_2!$P$2:$P$1097,MATCH(Y113,Infos_2!$O$2:$O$1097,0), ,1)),\"\")","v":"T"},{"$f":"IFERROR(_xlfn.SWITCH($B$3,\"C1\",INDEX(Infos_2!$D$2:$D$1097,MATCH(Z113,Infos_2!$C$2:$C$1097,0),1),\"C2\",INDEX(Infos_2!$G$2:$G$1097,MATCH(Z113,Infos_2!$F$2:$F$1097,0), ,1),\"H\",INDEX(Infos_2!$J$2:$J$1097,MATCH(Z113,Infos_2!$I$2:$I$1097,0), ,1),\"H1\",INDEX(Infos_2!$M$2:$M$1097,MATCH(Z113,Infos_2!$L$2:$L$1097,0), ,1),\"H2\",INDEX(Infos_2!$P$2:$P$1097,MATCH(Z113,Infos_2!$O$2:$O$1097,0), ,1)),\"\")","v":"T"},{"$f":"IFERROR(_xlfn.SWITCH($B$3,\"C1\",INDEX(Infos_2!$D$2:$D$1097,MATCH(AA113,Infos_2!$C$2:$C$1097,0),1),\"C2\",INDEX(Infos_2!$G$2:$G$1097,MATCH(AA113,Infos_2!$F$2:$F$1097,0), ,1),\"H\",INDEX(Infos_2!$J$2:$J$1097,MATCH(AA113,Infos_2!$I$2:$I$1097,0), ,1),\"H1\",INDEX(Infos_2!$M$2:$M$1097,MATCH(AA113,Infos_2!$L$2:$L$1097,0), ,1),\"H2\",INDEX(Infos_2!$P$2:$P$1097,MATCH(AA113,Infos_2!$O$2:$O$1097,0), ,1)),\"\")","v":"R"},{"$f":"IFERROR(_xlfn.SWITCH($B$3,\"C1\",INDEX(Infos_2!$D$2:$D$1097,MATCH(AB113,Infos_2!$C$2:$C$1097,0),1),\"C2\",INDEX(Infos_2!$G$2:$G$1097,MATCH(AB113,Infos_2!$F$2:$F$1097,0), ,1),\"H\",INDEX(Infos_2!$J$2:$J$1097,MATCH(AB113,Infos_2!$I$2:$I$1097,0), ,1),\"H1\",INDEX(Infos_2!$M$2:$M$1097,MATCH(AB113,Infos_2!$L$2:$L$1097,0), ,1),\"H2\",INDEX(Infos_2!$P$2:$P$1097,MATCH(AB113,Infos_2!$O$2:$O$1097,0), ,1)),\"\")","v":"R"},{"$f":"IFERROR(_xlfn.SWITCH($B$3,\"C1\",INDEX(Infos_2!$D$2:$D$1097,MATCH(AC113,Infos_2!$C$2:$C$1097,0),1),\"C2\",INDEX(Infos_2!$G$2:$G$1097,MATCH(AC113,Infos_2!$F$2:$F$1097,0), ,1),\"H\",INDEX(Infos_2!$J$2:$J$1097,MATCH(AC113,Infos_2!$I$2:$I$1097,0), ,1),\"H1\",INDEX(Infos_2!$M$2:$M$1097,MATCH(AC113,Infos_2!$L$2:$L$1097,0), ,1),\"H2\",INDEX(Infos_2!$P$2:$P$1097,MATCH(AC113,Infos_2!$O$2:$O$1097,0), ,1)),\"\")","v":"T"},{"$f":"IFERROR(_xlfn.SWITCH($B$3,\"C1\",INDEX(Infos_2!$D$2:$D$1097,MATCH(AD113,Infos_2!$C$2:$C$1097,0),1),\"C2\",INDEX(Infos_2!$G$2:$G$1097,MATCH(AD113,Infos_2!$F$2:$F$1097,0), ,1),\"H\",INDEX(Infos_2!$J$2:$J$1097,MATCH(AD113,Infos_2!$I$2:$I$1097,0), ,1),\"H1\",INDEX(Infos_2!$M$2:$M$1097,MATCH(AD113,Infos_2!$L$2:$L$1097,0), ,1),\"H2\",INDEX(Infos_2!$P$2:$P$1097,MATCH(AD113,Infos_2!$O$2:$O$1097,0), ,1)),\"\")","v":"T"},{"$f":"IFERROR(_xlfn.SWITCH($B$3,\"C1\",INDEX(Infos_2!$D$2:$D$1097,MATCH(AE113,Infos_2!$C$2:$C$1097,0),1),\"C2\",INDEX(Infos_2!$G$2:$G$1097,MATCH(AE113,Infos_2!$F$2:$F$1097,0), ,1),\"H\",INDEX(Infos_2!$J$2:$J$1097,MATCH(AE113,Infos_2!$I$2:$I$1097,0), ,1),\"H1\",INDEX(Infos_2!$M$2:$M$1097,MATCH(AE113,Infos_2!$L$2:$L$1097,0), ,1),\"H2\",INDEX(Infos_2!$P$2:$P$1097,MATCH(AE113,Infos_2!$O$2:$O$1097,0), ,1)),\"\")","v":"T"},{"$f":"IFERROR(_xlfn.SWITCH($B$3,\"C1\",INDEX(Infos_2!$D$2:$D$1097,MATCH(AF113,Infos_2!$C$2:$C$1097,0),1),\"C2\",INDEX(Infos_2!$G$2:$G$1097,MATCH(AF113,Infos_2!$F$2:$F$1097,0), ,1),\"H\",INDEX(Infos_2!$J$2:$J$1097,MATCH(AF113,Infos_2!$I$2:$I$1097,0), ,1),\"H1\",INDEX(Infos_2!$M$2:$M$1097,MATCH(AF113,Infos_2!$L$2:$L$1097,0), ,1),\"H2\",INDEX(Infos_2!$P$2:$P$1097,MATCH(AF113,Infos_2!$O$2:$O$1097,0), ,1)),\"\")","v":"T"},{"$f":"IFERROR(_xlfn.SWITCH($B$3,\"C1\",INDEX(Infos_2!$D$2:$D$1097,MATCH(AG113,Infos_2!$C$2:$C$1097,0),1),\"C2\",INDEX(Infos_2!$G$2:$G$1097,MATCH(AG113,Infos_2!$F$2:$F$1097,0), ,1),\"H\",INDEX(Infos_2!$J$2:$J$1097,MATCH(AG113,Infos_2!$I$2:$I$1097,0), ,1),\"H1\",INDEX(Infos_2!$M$2:$M$1097,MATCH(AG113,Infos_2!$L$2:$L$1097,0), ,1),\"H2\",INDEX(Infos_2!$P$2:$P$1097,MATCH(AG113,Infos_2!$O$2:$O$1097,0), ,1)),\"\")","v":"T"}]
[1,{"$f":"bloc_nom","v":"NOM 50 Prénom 50"}]
[2,"NOM 51 Prénom 51"]
[3,"NOM 52 Prénom 52"]
[4,"NOM 53 Prénom 53"]
[5,"NOM 54 Prénom 54"]
[6,"NOM 55 Prénom 55"]
[7,"NOM 56 Prénom 56"]
[8,"NOM 57 Prénom 57"]
[9,"NOM 58 Prénom 58"]
[10,""]
[11,""]
[12,""]
[13,""]
[14,""]
[15,""]
[]
[null,null,{"$f":"EDATE($C113,1)","v":"2024-06-01"},{"$f":"C135+1","v":"2024-06-02"},"2024-06-03","2024-06-04","2024-06-05","2024-06-06","2024-06-07","2024-06-08","2024-06-09","2024-06-10","2024-06-11","2024-06-12","2024-06-13","2024-06-14","2024-06-15","2024-06-16","2024-06-17","2024-06-18","2024-06-19","2024-06-20","2024-06-21","2024-06-22","2024-06-23","2024-06-24","2024-06-25","2024-06-26","2024-06-27","2024-06-28",{"$f":"IF(MONTH($AD135)<>MONTH(AD135+1),\"\",AD135+1)","v":"2024-06-29"},{"$f":"IF(AE135=\"\",\"\",IF(MONTH(AE135+1)<>MONTH(AE135),\"\",AE135+1))","v":"2024-06-30"},{"$f":"IF(AF135=\"\",\"\",IF(MONTH(AF135+1)<>MONTH(AF135),\"\",AF135+1))","v":""}]
[null,{"$f":"INDEX(Infos!$A$2:$B$13,MATCH(B114,Infos!$A$2:$A$13,0)+1,1)","v":"Juin"},{"$f":"C135","v":"2024-06-01"},"2024-06-02","2024-06-03","2024-06-04","2024-06-05","2024-06-06","2024-06-07","2024-06-08","2024-06-09","2024-06-10","2024-06-11","2024-06-12","2024-06-13","2024-06-14","2024-06-15","2024-06-16","2024-06-17","2024-06-18","2024-06-19","2024-06-20","2024-06-21","2024-06-22","2024-06-23","2024-06-24","2024-06-25","2024-06-26","2024-06-27","2024-06-28","2024-06-29","2024-06-30",""]
[null,"Férié",{"$f":"IF(C135=\"\",\"\",DATE($C$1,MATCH($B136,Infos!$A$2:$A$13,0),DAY(C$135)))","v":"2023-06-01"},{"$f":"IF(D135=\"\",\"\",DATE($C$1,MATCH($B136,Infos!$A$2:$A$13,0),DAY(D$135)))","v":"2023-06-02"},{"$f":"IF(E135=\"\",\"\",DATE($C$1,MATCH($B136,Infos!$A$2:$A$13,0),DAY(E$135)))","v":"2023-06-03"},{"$f":"IF(F135=\"\",\"\",DATE($C$1,MATCH($B136,Infos!$A$2:$A$13,0),DAY(F$135)))","v":"2023-06-04"},{"$f":"IF(G135=\"\",\"\",DATE($C$1,MATCH($B136,Infos!$A$2:$A$13,0),DAY(G$135)))","v":"2023-06-05"},{"$f":"IF(H135=\"\",\"\",DATE($C$1,MATCH($B136,Infos!$A$2:$A$13,0),DAY(H$135)))","v":"2023-06-06"},{"$f":"IF(I135=\"\",\"\",DATE($C$1,MATCH($B136,Infos!$A$2:$A$13,0),DAY(I$135)))","v":"2023-06-07"},{"$f":"IF(J135=\"\",\"\",DATE($C$1,MATCH($B136,Infos!$A$2:$A$13,0),DAY(J$135)))","v":"2023-06-08"},{"$f":"IF(K135=\"\",\"\",DATE($C$1,MATCH($B136,Infos!$A$2:$A$13,0),DAY(K$135)))","v":"2023-06-09"},{"$f":"IF(L135=\"\",\"\",DATE($C$1,MATCH($B136,Infos!$A$2:$A$13,0),DAY(L$135)))","v":"2023-06-10"},{"$f":"IF(M135=\"\",\"\",DATE($C$1,MATCH($B136,Infos!$A$2:$A$13,0),DAY(M$135)))","v":"2023-06-11"},{"$f":"IF(N135=\"\",\"\",DATE($C$1,MATCH($B136,Infos!$A$2:$A$13,0),DAY(N$135)))","v":"2023-06-12"},{"$f":"IF(O135=\"\",\"\",DATE($C$1,MATCH($B136,Infos!$A$2:$A$13,0),DAY(O$135)))","v":"2023-06-13"},{"$f":"IF(P135=\"\",\"\",DATE($C$1,MATCH($B136,Infos!$A$2:$A$13,0),DAY(P$135)))","v":"2023-06-14"},{"$f":"IF(Q135=\"\",\"\",DATE($C$1,MATCH($B136,Infos!$A$2:$A$13,0),DAY(Q$135)))","v":"2023-06-15"},{"$f":"IF(R135=\"\",\"\",DATE($C$1,MATCH($B136,Infos!$A$2:$A$13,0),DAY(R$135)))","v":"2023-06-16"},{"$f":"IF(S135=\"\",\"\",DATE($C$1,MATCH($B136,Infos!$A$2:$A$13,0),DAY(S$135)))","v":"2023-06-17"},{"$f":"IF(T135=\"\",\"\",DATE($C$1,MATCH($B136,Infos!$A$2:$A$13,0),DAY(T$135)))","v":"2023-06-18"},{"$f":"IF(U135=\"\",\"\",DATE($C$1,MATCH($B136,Infos!$A$2:$A$13,0),DAY(U$135)))","v":"2023-06-19"},{"$f":"IF(V135=\"\",\"\",DATE($C$1,MATCH($B136,Infos!$A$2:$A$13,0),DAY(V$135)))","v":"2023-06-20"},{"$f":"IF(W135=\"\",\"\",DATE($C$1,MATCH($B136,Infos!$A$2:$A$13,0),DAY(W$135)))","v":"2023-06-21"},{"$f":"IF(X135=\"\",\"\",DATE($C$1,MATCH($B136,Infos!$A$2:$A$13,0),DAY(X$135)))","v":"2023-06-22"},{"$f":"IF(Y135=\"\",\"\",DATE($C$1,MATCH($B136,Infos!$A$2:$A$13,0),DAY(Y$135)))","v":"2023-06-23"},{"$f":"IF(Z135=\"\",\"\",DATE($C$1,MATCH($B136,Infos!$A$2:$A$13,0),DAY(Z$135)))","v":"2023-06-24"},{"$f":"IF(AA135=\"\",\"\",DATE($C$1,MATCH($B136,Infos!$A$2:$A$13,0),DAY(AA$135)))","v":"2023-06-25"},{"$f":"IF(AB135=\"\",\"\",DATE($C$1,MATCH($B136,Infos!$A$2:$A$13,0),DAY(AB$135)))","v":"2023-06-26"},{"$f":"IF(AC135=\"\",\"\",DATE($C$1,MATCH($B136,Infos!$A$2:$A$13,0),DAY(AC$135)))","v":"2023-06-27"},{"$f":"IF(AD135=\"\",\"\",DATE($C$1,MATCH($B136,Infos!$A$2:$A$13,0),DAY(AD$135)))","v":"2023-06-28"},{"$f":"IF(AE135=\"\",\"\",DATE($C$1,MATCH($B136,Infos!$A$2:$A$13,0),DAY(AE$135)))","v":"2023-06-29"},{"$f":"IF(AF135=\"\",\"\",DATE($C$1,MATCH($B136,Infos!$A$2:$A$13,0),DAY(AF$135)))","v":"2023-06-30"},{"$f":"IF(AG135=\"\",\"\",DATE($C$1,MATCH($B136,Infos!$A$2:$A$13,0),DAY(AG$135)))","v":""}]
[null,"WE",{"$f":"IF(C135<>\"\",IF(COUNTIF('Jours fériés'!$B$3:$B$15,Planning!C137),8,WEEKDAY(C137,2)),\"\")","v":4},{"$f":"IF(D135<>\"\",IF(COUNTIF('Jours fériés'!$B$3:$B$15,Planning!D137),8,WEEKDAY(D137,2)),\"\")","v":5},{"$f":"IF(E135<>\"\",IF(COUNTIF('Jours fériés'!$B$3:$B$15,Planning!E137),8,WEEKDAY(E137,2)),\"\")","v":6},{"$f":"IF(F135<>\"\",IF(COUNTIF('Jours fériés'!$B$3:$B$15,Planning!F137),8,WEEKDAY(F137,2)),\"\")","v":7},{"$f":"IF(G135<>\"\",IF(COUNTIF('Jours fériés'!$B$3:$B$15,Planning!G137),8,WEEKDAY(G137,2)),\"\")","v":1},{"$f":"IF(H135<>\"\",IF(COUNTIF('Jours fériés'!$B$3:$B$15,Planning!H137),8,WEEKDAY(H137,2)),\"\")","v":2},{"$f":"IF(I135<>\"\",IF(COUNTIF('Jours fériés'!$B$3:$B$15,Planning!I137),8,WEEKDAY(I137,2)),\"\")","v":3},{"$f":"IF(J135<>\"\",IF(COUNTIF('Jours fériés'!$B$3:$B$15,Planning!J137),8,WEEKDAY(J137,2)),\"\")","v":4},{"$f":"IF(K135<>\"\",IF(COUNTIF('Jours fériés'!$B$3:$B$15,Planning!K137),8,WEEKDAY(K137,2)),\"\")","v":5},{"$f":"IF(L135<>\"\",IF(COUNTIF('Jours fériés'!$B$3:$B$15,Planning!L137),8,WEEKDAY(L137,2)),\"\")","v":6},{"$f":"IF(M135<>\"\",IF(COUNTIF('Jours fériés'!$B$3:$B$15,Planning!M137),8,WEEKDAY(M137,2)),\"\")","v":7},{"$f":"IF(N135<>\"\",IF(COUNTIF('Jours fériés'!$B$3:$B$15,Planning!N137),8,WEEKDAY(N137,2)),\"\")","v":1},{"$f":"IF(O135<>\"\",IF(COUNTIF('Jours fériés'!$B$3:$B$15,Planning!O137),8,WEEKDAY(O137,2)),\"\")","v":2},{"$f":"IF(P135<>\"\",IF(COUNTIF('Jours fériés'!$B$3:$B$15,Planning!P137),8,WEEKDAY(P137,2)),\"\")","v":3},{"$f":"IF(Q135<>\"\",IF(COUNTIF('Jours fériés'!$B$3:$B$15,Planning!Q137),8,WEEKDAY(Q137,2)),\"\")","v":4},{"$f":"IF(R135<>\"\",IF(COUNTIF('Jours fériés'!$B$3:$B$15,Planning!R137),8,WEEKDAY(R137,2)),\"\")","v":5},{"$f":"IF(S135<>\"\",IF(COUNTIF('Jours fériés'!$B$3:$B$15,Planning!S137),8,WEEKDAY(S137,2)),\"\")","v":6},{"$f":"IF(T135<>\"\",IF(COUNTIF('Jours fériés'!$B$3:$B$15,Planning!T137),8,WEEKDAY(T137,2)),\"\")","v":7},{"$f":"IF(U135<>\"\",IF(COUNTIF('Jours fériés'!$B$3:$B$15,Planning!U137),8,WEEKDAY(U137,2)),\"\")","v":1},{"$f":"IF(V135<>\"\",IF(COUNTIF('Jours fériés'!$B$3:$B$15,Planning!V137),8,WEEKDAY(V137,2)),\"\")","v":2},{"$f":"IF(W135<>\"\",IF(COUNTIF('Jours fériés'!$B$3:$B$15,Planning!W137),8,WEEKDAY(W137,2)),\"\")","v":3},{"$f":"IF(X135<>\"\",IF(COUNTIF('Jours fériés'!$B$3:$B$15,Planning!X137),8,WEEKDAY(X137,2)),\"\")","v":4},{"$f":"IF(Y135<>\"\",IF(COUNTIF('Jours fériés'!$B$3:$B$15,Planning!Y137),8,WEEKDAY(Y137,2)),\"\")","v":5},{"$f":"IF(Z135<>\"\",IF(COUNTIF('Jours fériés'!$B$3:$B$15,Planning!Z137),8,WEEKDAY(Z137,2)),\"\")","v":6},{"$f":"IF(AA135<>\"\",IF(COUNTIF('Jours fériés'!$B$3:$B$15,Planning!AA137),8,WEEKDAY(AA137,2)),\"\")","v":7},{"$f":"IF(AB135<>\"\",IF(COUNTIF('Jours fériés'!$B$3:$B$15,Planning!AB137),8,WEEKDAY(AB137,2)),\"\")","v":1},{"$f":"IF(AC135<>\"\",IF(COUNTIF('Jours fériés'!$B$3:$B$15,Planning!AC137),8,WEEKDAY(AC137,2)),\"\")","v":2},{"$f":"IF(AD135<>\"\",IF(COUNTIF('Jours fériés'!$B$3:$B$15,Planning!AD137),8,WEEKDAY(AD137,2)),\"\")","v":3},{"$f":"IF(AE135<>\"\",IF(COUNTIF('Jours fériés'!$B$3:$B$15,Planning!AE137),8,WEEKDAY(AE137,2)),\"\")","v":4},{"$f":"IF(AF135<>\"\",IF(COUNTIF('Jours fériés'!$B$3:$B$15,Planning!AF137),8,WEEKDAY(AF137,2)),\"\")","v":5},{"$f":"IF(AG135<>\"\",IF(COUNTIF('Jours fériés'!$B$3:$B$15,Planning!AG137),8,WEEKDAY(AG137,2)),\"\")","v":""}]
[null,"VACANCES",{"$f":"IF(SUMPRODUCT((C135>=datdeb)*(C135<=datfin))=1,\"vac\",\"\")","v":""},{"$f":"IF(SUMPRODUCT((D135>=datdeb)*(D135<=datfin))=1,\"vac\",\"\")","v":""},{"$f":"IF(SUMPRODUCT((E135>=datdeb)*(E135<=datfin))=1,\"vac\",\"\")","v":""},{"$f":"IF(SUMPRODUCT((F135>=datdeb)*(F135<=datfin))=1,\"vac\",\"\")","v":""},{"$f":"IF(SUMPRODUCT((G135>=datdeb)*(G135<=datfin))=1,\"vac\",\"\")","v":""},{"$f":"IF(SUMPRODUCT((H135>=datdeb)*(H135<=datfin))=1,\"vac\",\"\")","v":""},{"$f":"IF(SUMPRODUCT((I135>=datdeb)*(I135<=datfin))=1,\"vac\",\"\")","v":""},{"$f":"IF(SUMPRODUCT((J135>=datdeb)*(J135<=datfin))=1,\"vac\",\"\")","v":""},{"$f":"IF(SUMPRODUCT((K135>=datdeb)*(K135<=datfin))=1,\"vac\",\"\")","v":""},{"$f":"IF(SUMPRODUCT((L135>=datdeb)*(L135<=datfin))=1,\"vac\",\"\")","v":""},{"$f":"IF(SUMPRODUCT((M135>=datdeb)*(M135<=datfin))=1,\"vac\",\"\")","v":""},{"$f":"IF(SUMPRODUCT((N135>=datdeb)*(N135<=datfin))=1,\"vac\",\"\")","v":""},{"$f":"IF(SUMPRODUCT((O135>=datdeb)*(O135<=datfin))=1,\"vac\",\"\")","v":""},{"$f":"IF(SUMPRODUCT((P135>=datdeb)*(P135<=datfin))=1,\"vac\",\"\")","v":""},{"$f":"IF(SUMPRODUCT((Q135>=datdeb)*(Q135<=datfin))=1,\"vac\",\"\")","v":""},{"$f":"IF(SUMPRODUCT((R135>=datdeb)*(R135<=datfin))=1,\"vac\",\"\")","v":""},{"$f":"IF(SUMPRODUCT((S135>=datdeb)*(S135<=datfin))=1,\"vac\",\"\")","v":""},{"$f":"IF(SUMPRODUCT((T135>=datdeb)*(T135<=datfin))=1,\"vac\",\"\")","v":""},{"$f":"IF(SUMPRODUCT((U135>=datdeb)*(U135<=datfin))=1,\"vac\",\"\")","v":""},{"$f":"IF(SUMPRODUCT((V135>=datdeb)*(V135<=datfin))=1,\"vac\",\"\")","v":""},{"$f":"IF(SUMPRODUCT((W135>=datdeb)*(W135<=datfin))=1,\"vac\",\"\")","v":""},{"$f":"IF(SUMPRODUCT((X135>=datdeb)*(X135<=datfin))=1,\"vac\",\"\")","v":""},{"$f":"IF(SUMPRODUCT((Y135>=datdeb)*(Y135<=datfin))=1,\"vac\",\"\")","v":""},{"$f":"IF(SUMPRODUCT((Z135>=datdeb)*(Z135<=datfin))=1,\"vac\",\"\")","v":""},{"$f":"IF(SUMPRODUCT((AA135>=datdeb)*(AA135<=datfin))=1,\"vac\",\"\")","v":""},{"$f":"IF(SUMPRODUCT((AB135>=datdeb)*(AB135<=datfin))=1,\"vac\",\"\")","v":""},{"$f":"IF(SUMPRODUCT((AC135>=datdeb)*(AC135<=datfin))=1,\"vac\",\"\")","v":""},{"$f":"IF(SUMPRODUCT((AD135>=datdeb)*(AD135<=datfin))=1,\"vac\",\"\")","v":""},{"$f":"IF(SUMPRODUCT((AE135>=datdeb)*(AE135<=datfin))=1,\"vac\",\"\")","v":""},{"$f":"IF(SUMPRODUCT((AF135>=datdeb)*(AF135<=datfin))=1,\"vac\",\"\")","v":""},{"$f":"IF(SUMPRODUCT((AG135>=datdeb)*(AG135<=datfin))=1,\"vac\",\"\")","v":""}]
[null,null,{"$f":"IFERROR(_xlfn.SWITCH($B$3,\"C1\",INDEX(Infos_2!$D$2:$D$1097,MATCH(C135,Infos_2!$C$2:$C$1097,0),1),\"C2\",INDEX(Infos_2!$G$2:$G$1097,MATCH(C135,Infos_2!$F$2:$F$1097,0), ,1),\"H\",INDEX(Infos_2!$J$2:$J$1097,MATCH(C135,Infos_2!$I$2:$I$1097,0), ,1),\"H1\",INDEX(Infos_2!$M$2:$M$1097,MATCH(C135,Infos_2!$L$2:$L$1097,0), ,1),\"H2\",INDEX(Infos_2!$P$2:$P$1097,MATCH(C135,Infos_2!$O$2:$O$1097,0), ,1)),\"\")","v":"R"},{"$f":"IFERROR(_xlfn.SWITCH($B$3,\"C1\",INDEX(Infos_2!$D$2:$D$1097,MATCH(D135,Infos_2!$C$2:$C$1097,0),1),\"C2\",INDEX(Infos_2!$G$2:$G$1097,MATCH(D135,Infos_2!$F$2:$F$1097,0), ,1),\"H\",INDEX(Infos_2!$J$2:$J$1097,MATCH(D135,Infos_2!$I$2:$I$1097,0), ,1),\"H1\",INDEX(Infos_2!$M$2:$M$1097,MATCH(D135,Infos_2!$L$2:$L$1097,0), ,1),\"H2\",INDEX(Infos_2!$P$2:$P$1097,MATCH(D135,Infos_2!$O$2:$O$1097,0), ,1)),\"\")","v":"R"},{"$f":"IFERROR(_xlfn.SWITCH($B$3,\"C1\",INDEX(Infos_2!$D$2:$D$1097,MATCH(E135,Infos_2!$C$2:$C$1097,0),1),\"C2\",INDEX(Infos_2!$G$2:$G$1097,MATCH(E135,Infos_2!$F$2:$F$1097,0), ,1),\"H\",INDEX(Infos_2!$J$2:$J$1097,MATCH(E135,Infos_2!$I$2:$I$1097,0), ,1),\"H1\",INDEX(Infos_2!$M$2:$M$1097,MATCH(E135,Infos_2!$L$2:$L$1097,0), ,1),\"H2\",INDEX(Infos_2!$P$2:$P$1097,MATCH(E135,Infos_2!$O$2:$O$1097,0), ,1)),\"\")","v":"T"},{"$f":"IFERROR(_xlfn.SWITCH($B$3,\"C1\",INDEX(Infos_2!$D$2:$D$1097,MATCH(F135,Infos_2!$C$2:$C$1097,0),1),\"C2\",INDEX(Infos_2!$G$2:$G$1097,MATCH(F135,Infos_2!$F$2:$F$1097,0), ,1),\"H\",INDEX(Infos_2!$J$2:$J$1097,MATCH(F135,Infos_2!$I$2:$I$1097,0), ,1),\"H1\",INDEX(Infos_2!$M$2:$M$1097,MATCH(F135,Infos_2!$L$2:$L$1097,0), ,1),\"H2\",INDEX(Infos_2!$P$2:$P$1097,MATCH(F135,Infos_2!$O$2:$O$1097,0), ,1)),\"\")","v":"T"},{"$f":"IFERROR(_xlfn.SWITCH($B$3,\"C1\",INDEX(Infos_2!$D$2:$D$1097,MATCH(G135,Infos_2!$C$2:$C$1097,0),1),\"C2\",INDEX(Infos_2!$G$2:$G$1097,MATCH(G135,Infos_2!$F$2:$F$1097,0), ,1),\"H\",INDEX(Infos_2!$J$2:$J$1097,MATCH(G135,Infos_2!$I$2:$I$1097,0), ,1),\"H1\",INDEX(Infos_2!$M$2:$M$1097,MATCH(G135,Infos_2!$L$2:$L$1097,0), ,1),\"H2\",INDEX(Infos_2!$P$2:$P$1097,MATCH(G135,Infos_2!$O$2:$O$1097,0), ,1)),\"\")","v":"T"},{"$f":"IFERROR(_xlfn.SWITCH($B$3,\"C1\",INDEX(Infos_2!$D$2:$D$1097,MATCH(H135,Infos_2!$C$2:$C$1097,0),1),\"C2\",INDEX(Infos_2!$G$2:$G$1097,MATCH(H135,Infos_2!$F$2:$F$1097,0), ,1),\"H\",INDEX(Infos_2!$J$2:$J$1097,MATCH(H135,Infos_2!$I$2:$I$1097,0), ,1),\"H1\",INDEX(Infos_2!$M$2:$M$1097,MATCH(H135,Infos_2!$L$2:$L$1097,0), ,1),\"H2\",INDEX(Infos_2!$P$2:$P$1097,MATCH(H135,Infos_2!$O$2:$O$1097,0), ,1)),\"\")","v":"T"},{"$f":"IFERROR(_xlfn.SWITCH($B$3,\"C1\",INDEX(Infos_2!$D$2:$D$1097,MATCH(I135,Infos_2!$C$2:$C$1097,0),1),\"C2\",INDEX(Infos_2!$G$2:$G$1097,MATCH(I135,Infos_2!$F$2:$F$1097,0), ,1),\"H\",INDEX(Infos_2!$J$2:$J$1097,MATCH(I135,Infos_2!$I$2:$I$1097,0), ,1),\"H1\",INDEX(Infos_2!$M$2:$M$1097,MATCH(I135,Infos_2!$L$2:$L$1097,0), ,1),\"H2\",INDEX(Infos_2!$P$2:$P$1097,MATCH(I135,Infos_2!$O$2:$O$1097,0), ,1)),\"\")","v":"T"},{"$f":"IFERROR(_xlfn.SWITCH($B$3,\"C1\",INDEX(Infos_2!$D$2:$D$1097,MATCH(J135,Infos_2!$C$2:$C$1097,0),1),\"C2\",INDEX(Infos_2!$G$2:$G$1097,MATCH(J135,Infos_2!$F$2:$F$1097,0), ,1),\"H\",INDEX(Infos_2!$J$2:$J$1097,MATCH(J135,Infos_2!$I$2:$I$1097,0), ,1),\"H1\",INDEX(Infos_2!$M$2:$M$1097,MATCH(J135,Infos_2!$L$2:$L$1097,0), ,1),\"H2\",INDEX(Infos_2!$P$2:$P$1097,MATCH(J135,Infos_2!$O$2:$O$1097,0), ,1)),\"\")","v":"R"},{"$f":"IFERROR(_xlfn.SWITCH($B$3,\"C1\",INDEX(Infos_2!$D$2:$D$1097,MATCH(K135,Infos_2!$C$2:$C$1097,0),1),\"C2\",INDEX(Infos_2!$G$2:$G$1097,MATCH(K135,Infos_2!$F$2:$F$1097,0), ,1),\"H\",INDEX(Infos_2!$J$2:$J$1097,MATCH(K135,Infos_2!$I$2:$I$1097,0), ,1),\"H1\",INDEX(Infos_2!$M$2:$M$1097,MATCH(K135,Infos_2!$L$2:$L$1097,0), ,1),\"H2\",INDEX(Infos_2!$P$2:$P$1097,MATCH(K135,Infos_2!$O$2:$O$1097,0), ,1)),\"\")","v":"R"},{"$f":"IFERROR(_xlfn.SWITCH($B$3,\"C1\",INDEX(Infos_2!$D$2:$D$1097,MATCH(L135,Infos_2!$C$2:$C$1097,0),1),\"C2\",INDEX(Infos_2!$G$2:$G$1097,MATCH(L135,Infos_2!$F$2:$F$1097,0), ,1),\"H\",INDEX(Infos_2!$J$2:$J$1097,MATCH(L135,Infos_2!$I$2:$I$1097,0), ,1),\"H1\",INDEX(Infos_2!$M$2:$M$1097,MATCH(L135,Infos_2!$L$2:$L$1097,0), ,1),\"H2\",INDEX(Infos_2!$P$2:$P$1097,MATCH(L135,Infos_2!$O$2:$O$1097,0), ,1)),\"\")","v":"T"},{"$f":"IFERROR(_xlfn.SWITCH($B$3,\"C1\",INDEX(Infos_2!$D$2:$D$1097,MATCH(M135,Infos_2!$C$2:$C$1097,0),1),\"C2\",INDEX(Infos_2!$G$2:$G$1097,MATCH(M135,Infos_2!$F$2:$F$1097,0), ,1),\"H\",INDEX(Infos_2!$J$2:$J$1097,MATCH(M135,Infos_2!$I$2:$I$1097,0), ,1),\"H1\",INDEX(Infos_2!$M$2:$M$1097,MATCH(M135,Infos_2!$L$2:$L$1097,0), ,1),\"H2\",INDEX(Infos_2!$P$2:$P$1097,MATCH(M135,Infos_2!$O$2:$O$1097,0), ,1)),\"\")","v":"T"},{"$f":"IFERROR(_xlfn.SWITCH($B$3,\"C1\",INDEX(Infos_2!$D$2:$D$1097,MATCH(N135,Infos_2!$C$2:$C$1097,0),1),\"C2\",INDEX(Infos_2!$G$2:$G$1097,MATCH(N135,Infos_2!$F$2:$F$1097,0), ,1),\"H\",INDEX(Infos_2!$J$2:$J$1097,MATCH(N135,Infos_2!$I$2:$I$1097,0), ,1),\"H1\",INDEX(Infos_2!$M$2:$M$1097,MATCH(N135,Infos_2!$L$2:$L$1097,0), ,1),\"H2\",INDEX(Infos_2!$P$2:$P$1097,MATCH(N135,Infos_2!$O$2:$O$1097,0), ,1)),\"\")","v":"T"},{"$f":"IFERROR(_xlfn.SWITCH($B$3,\"C1\",INDEX(Infos_2!$D$2:$D$1097,MATCH(O135,Infos_2!$C$2:$C$1097,0),1),\"C2\",INDEX(Infos_2!$G$2:$G$1097,MATCH(O135,Infos_2!$F$2:$F$1097,0), ,1),\"H\",INDEX(Infos_2!$J$2:$J$1097,MATCH(O135,Infos_2!$I$2:$I$1097,0), ,1),\"H1\",INDEX(Infos_2!$M$2:$M$1097,MATCH(O135,Infos_2!$L$2:$L$1097,0), ,1),\"H2\",INDEX(Infos_2!$P$2:$P$1097,MATCH(O135,Infos_2!$O$2:$O$1097,0), ,1)),\"\")","v":"T"},{"$f":"IFERROR(_xlfn.SWITCH($B$3,\"C1\",INDEX(Infos_2!$D$2:$D$1097,MATCH(P135,Infos_2!$C$2:$C$1097,0),1),\"C2\",INDEX(Infos_2!$G$2:$G$1097,MATCH(P135,Infos_2!$F$2:$F$1097,0), ,1),\"H\",INDEX(Infos_2!$J$2:$J$1097,MATCH(P135,Infos_2!$I$2:$I$1097,0), ,1),\"H1\",INDEX(Infos_2!$M$2:$M$1097,MATCH(P135,Infos_2!$L$2:$L$1097,0), ,1),\"H2\",INDEX(Infos_2!$P$2:$P$1097,MATCH(P135,Infos_2!$O$2:$O$1097,0), ,1)),\"\")","v":"T"},{"$f":"IFERROR(_xlfn.SWITCH($B$3,\"C1\",INDEX(Infos_2!$D$2:$D$1097,MATCH(Q135,Infos_2!$C$2:$C$1097,0),1),\"C2\",INDEX(Infos_2!$G$2:$G$1097,MATCH(Q135,Infos_2!$F$2:$F$1097,0), ,1),\"H\",INDEX(Infos_2!$J$2:$J$1097,MATCH(Q135,Infos_2!$I$2:$I$1097,0), ,1),\"H1\",INDEX(Infos_2!$M$2:$M$1097,MATCH(Q135,Infos_2!$L$2:$L$1097,0), ,1),\"H2\",INDEX(Infos_2!$P$2:$P$1097,MATCH(Q135,Infos_2!$O$2:$O$1097,0), ,1)),\"\")","v":"R"},{"$f":"IFERROR(_xlfn.SWITCH($B$3,\"C1\",INDEX(Infos_2!$D$2:$D$1097,MATCH(R135,Infos_2!$C$2:$C$1097,0),1),\"C2\",INDEX(Infos_2!$G$2:$G$1097,MATCH(R135,Infos_2!$F$2:$F$1097,0), ,1),\"H\",INDEX(Infos_2!$J$2:$J$1097,MATCH(R135,Infos_2!$I$2:$I$1097,0), ,1),\"H1\",INDEX(Infos_2!$M$2:$M$1097,MATCH(R135,Infos_2!$L$2:$L$1097,0), ,1),\"H2\",INDEX(Infos_2!$P$2:$P$1097,MATCH(R135,Infos_2!$O$2:$O$1097,0), ,1)),\"\")","v":"R"},{"$f":"IFERROR(_xlfn.SWITCH($B$3,\"C1\",INDEX(Infos_2!$D$2:$D$1097,MATCH(S135,Infos_2!$C$2:$C$1097,0),1),\"C2\",INDEX(Infos_2!$G$2:$G$1097,MATCH(S135,Infos_2!$F$2:$F$1097,0), ,1),\"H\",INDEX(Infos_2!$J$2:$J$1097,MATCH(S135,Infos_2!$I$2:$I$1097,0), ,1),\"H1\",INDEX(Infos_2!$M$2:$M$1097,MATCH(S135,Infos_2!$L$2:$L$1097,0), ,1),\"H2\",INDEX(Infos_2!$P$2:$P$1097,MATCH(S135,Infos_2!$O$2:$O$1097,0), ,1)),\"\")","v":"T"},{"$f":"IFERROR(_xlfn.SWITCH($B$3,\"C1\",INDEX(Infos_2!$D$2:$D$1097,MATCH(T135,Infos_2!$C$2:$C$1097,0),1),\"C2\",INDEX(Infos_2!$G$2:$G$1097,MATCH(T135,Infos_2!$F$2:$F$1097,0), ,1),\"H\",INDEX(Infos_2!$J$2:$J$1097,MATCH(T135,Infos_2!$I$2:$I$1097,0), ,1),\"H1\",INDEX(Infos_2!$M$2:$M$1097,MATCH(T135,Infos_2!$L$2:$L$1097,0), ,1),\"H2\",INDEX(Infos_2!$P$2:$P$1097,MATCH(T135,Infos_2!$O$2:$O$1097,0), ,1)),\"\")","v":"T"},{"$f":"IFERROR(_xlfn.SWITCH($B$3,\"C1\",INDEX(Infos_2!$D$2:$D$1097,MATCH(U135,Infos_2!$C$2:$C$1097,0),1),\"C2\",INDEX(Infos_2!$G$2:$G$1097,MATCH(U135,Infos_2!$F$2:$F$1097,0), ,1),\"H\",INDEX(Infos_2!$J$2:$J$1097,MATCH(U135,Infos_2!$I$2:$I$1097,0), ,1),\"H1\",INDEX(Infos_2!$M$2:$M$1097,MATCH(U135,Infos_2!$L$2:$L$1097,0), ,1),\"H2\",INDEX(Infos_2!$P$2:$P$1097,MATCH(U135,Infos_2!$O$2:$O$1097,0), ,1)),\"\")","v":"T"},{"$f":"IFERROR(_xlfn.SWITCH($B$3,\"C1\",INDEX(Infos_2!$D$2:$D$1097,MATCH(V135,Infos_2!$C$2:$C$1097,0),1),\"C2\",INDEX(Infos_2!$G$2:$G$1097,MATCH(V135,Infos_2!$F$2:$F$1097,0), ,1),\"H\",INDEX(Infos_2!$J$2:$J$1097,MATCH(V135,Infos_2!$I$2:$I$1097,0), ,1),\"H1\",INDEX(Infos_2!$M$2:$M$1097,MATCH(V135,Infos_2!$L$2:$L$1097,0), ,1),\"H2\",INDEX(Infos_2!$P$2:$P$1097,MATCH(V135,Infos_2!$O$2:$O$1097,0), ,1)),\"\")","v":"T"},{"$f":"IFERROR(_xlfn.SWITCH($B$3,\"C1\",INDEX(Infos_2!$D$2:$D$1097,MATCH(W135,Infos_2!$C$2:$C$1097,0),1),\"C2\",INDEX(Infos_2!$G$2:$G$1097,MATCH(W135,Infos_2!$F$2:$F$1097,0), ,1),\"H\",INDEX(Infos_2!$J$2:$J$1097,MATCH(W135,Infos_2!$I$2:$I$1097,0), ,1),\"H1\",INDEX(Infos_2!$M$2:$M$1097,MATCH(W135,Infos_2!$L$2:$L$1097,0), ,1),\"H2\",INDEX(Infos_2!$P$2:$P$1097,MATCH(W135,Infos_2!$O$2:$O$1097,0), ,1)),\"\")","v":"T"},{"$f":"IFERROR(_xlfn.SWITCH($B$3,\"C1\",INDEX(Infos_2!$D$2:$D$1097,MATCH(X135,Infos_2!$C$2:$C$1097,0),1),\"C2\",INDEX(Infos_2!$G$2:$G$1097,MATCH(X135,Infos_2!$F$2:$F$1097,0), ,1),\"H\",INDEX(Infos_2!$J$2:$J$1097,MATCH(X135,Infos_2!$I$2:$I$1097,0), ,1),\"H1\",INDEX(Infos_2!$M$2:$M$1097,MATCH(X135,Infos_2!$L$2:$L$1097,0), ,1),\"H2\",INDEX(Infos_2!$P$2:$P$1097,MATCH(X135,Infos_2!$O$2:$O$1097,0), ,1)),\"\")","v":"R"},{"$f":"IFERROR(_xlfn.SWITCH($B$3,\"C1\",INDEX(Infos_2!$D$2:$D$1097,MATCH(Y135,Infos_2!$C$2:$C$1097,0),1),\"C2\",INDEX(Infos_2!$G$2:$G$1097,MATCH(Y135,Infos_2!$F$2:$F$1097,0), ,1),\"H\",INDEX(Infos_2!$J$2:$J$1097,MATCH(Y135,Infos_2!$I$2:$I$1097,0), ,1),\"H1\",INDEX(Infos_2!$M$2:$M$1097,MATCH(Y135,Infos_2!$L$2:$L$1097,0), ,1),\"H2\",INDEX(Infos_2!$P$2:$P$1097,MATCH(Y135,Infos_2!$O$2:$O$1097,0), ,1)),\"\")","v":"R"},{"$f":"IFERROR(_xlfn.SWITCH($B$3,\"C1\",INDEX(Infos_2!$D$2:$D$1097,MATCH(Z135,Infos_2!$C$2:$C$1097,0),1),\"C2\",INDEX(Infos_2!$G$2:$G$1097,MATCH(Z135,Infos_2!$F$2:$F$1097,0), ,1),\"H\",INDEX(Infos_2!$J$2:$J$1097,MATCH(Z135,Infos_2!$I$2:$I$1097,0), ,1),\"H1\",INDEX(Infos_2!$M$2:$M$1097,MATCH(Z135,Infos_2!$L$2:$L$1097,0), ,1),\"H2\",INDEX(Infos_2!$P$2:$P$1097,MATCH(Z135,Infos_2!$O$2:$O$1097,0), ,1)),\"\")","v":"T"},{"$f":"IFERROR(_xlfn.SWITCH($B$3,\"C1\",INDEX(Infos_2!$D$2:$D$1097,MATCH(AA135,Infos_2!$C$2:$C$1097,0),1),\"C2\",INDEX(Infos_2!$G$2:$G$1097,MATCH(AA135,Infos_2!$F$2:$F$1097,0), ,1),\"H\",INDEX(Infos_2!$J$2:$J$1097,MATCH(AA135,Infos_2!$I$2:$I$1097,0), ,1),\"H1\",INDEX(Infos_2!$M$2:$M$1097,MATCH(AA135,Infos_2!$L$2:$L$1097,0), ,1),\"H2\",INDEX(Infos_2!$P$2:$P$1097,MATCH(AA135,Infos_2!$O$2:$O$1097,0), ,1)),\"\")","v":"T"},{"$f":"IFERROR(_xlfn.SWITCH($B$3,\"C1\",INDEX(Infos_2!$D$2:$D$1097,MATCH(AB135,Infos_2!$C$2:$C$1097,0),1),\"C2\",INDEX(Infos_2!$G$2:$G$1097,MATCH(AB135,Infos_2!$F$2:$F$1097,0), ,1),\"H\",INDEX(Infos_2!$J$2:$J$1097,MATCH(AB135,Infos_2!$I$2:$I$1097,0), ,1),\"H1\",INDEX(Infos_2!$M$2:$M$1097,MATCH(AB135,Infos_2!$L$2:$L$1097,0), ,1),\"H2\",INDEX(Infos_2!$P$2:$P$1097,MATCH(AB135,Infos_2!$O$2:$O$1097,0), ,1)),\"\")","v":"T"},{"$f":"IFERROR(_xlfn.SWITCH($B$3,\"C1\",INDEX(Infos_2!$D$2:$D$1097,MATCH(AC135,Infos_2!$C$2:$C$1097,0),1),\"C2\",INDEX(Infos_2!$G$2:$G$1097,MATCH(AC135,Infos_2!$F$2:$F$1097,0), ,1),\"H\",INDEX(Infos_2!$J$2:$J$1097,MATCH(AC135,Infos_2!$I$2:$I$1097,0), ,1),\"H1\",INDEX(Infos_2!$M$2:$M$1097,MATCH(AC135,Infos_2!$L$2:$L$1097,0), ,1),\"H2\",INDEX(Infos_2!$P$2:$P$1097,MATCH(AC135,Infos_2!$O$2:$O$1097,0), ,1)),\"\")","v":"T"},{"$f":"IFERROR(_xlfn.SWITCH($B$3,\"C1\",INDEX(Infos_2!$D$2:$D$1097,MATCH(AD135,Infos_2!$C$2:$C$1097,0),1),\"C2\",INDEX(Infos_2!$G$2:$G$1097,MATCH(AD135,Infos_2!$F$2:$F$1097,0), ,1),\"H\",INDEX(Infos_2!$J$2:$J$1097,MATCH(AD135,Infos_2!$I$2:$I$1097,0), ,1),\"H1\",INDEX(Infos_2!$M$2:$M$1097,MATCH(AD135,Infos_2!$L$2:$L$1097,0), ,1),\"H2\",INDEX(Infos_2!$P$2:$P$1097,MATCH(AD135,Infos_2!$O$2:$O$1097,0), ,1)),\"\")","v":"T"},{"$f":"IFERROR(_xlfn.SWITCH($B$3,\"C1\",INDEX(Infos_2!$D$2:$D$1097,MATCH(AE135,Infos_2!$C$2:$C$1097,0),1),\"C2\",INDEX(Infos_2!$G$2:$G$1097,MATCH(AE135,Infos_2!$F$2:$F$1097,0), ,1),\"H\",INDEX(Infos_2!$J$2:$J$1097,MATCH(AE135,Infos_2!$I$2:$I$1097,0), ,1),\"H1\",INDEX(Infos_2!$M$2:$M$1097,MATCH(AE135,Infos_2!$L$2:$L$1097,0), ,1),\"H2\",INDEX(Infos_2!$P$2:$P$1097,MATCH(AE135,Infos_2!$O$2:$O$1097,0), ,1)),\"\")","v":"R"},{"$f":"IFERROR(_xlfn.SWITCH($B$3,\"C1\",INDEX(Infos_2!$D$2:$D$1097,MATCH(AF135,Infos_2!$C$2:$C$1097,0),1),\"C2\",INDEX(Infos_2!$G$2:$G$1097,MATCH(AF135,Infos_2!$F$2:$F$1097,0), ,1),\"H\",INDEX(Infos_2!$J$2:$J$1097,MATCH(AF135,Infos_2!$I$2:$I$1097,0), ,1),\"H1\",INDEX(Infos_2!$M$2:$M$1097,MATCH(AF135,Infos_2!$L$2:$L$1097,0), ,1),\"H2\",INDEX(Infos_2!$P$2:$P$1097,MATCH(AF135,Infos_2!$O$2:$O$1097,0), ,1)),\"\")","v":"R"},{"$f":"IFERROR(_xlfn.SWITCH($B$3,\"C1\",INDEX(Infos_2!$D$2:$D$1097,MATCH(AG135,Infos_2!$C$2:$C$1097,0),1),\"C2\",INDEX(Infos_2!$G$2:$G$1097,MATCH(AG135,Infos_2!$F$2:$F$1097,0), ,1),\"H\",INDEX(Infos_2!$J$2:$J$1097,MATCH(AG135,Infos_2!$I$2:$I$1097,0), ,1),\"H1\",INDEX(Infos_2!$M$2:$M$1097,MATCH(AG135,Infos_2!$L$2:$L$1097,0), ,1),\"H2\",INDEX(Infos_2!$P$2:$P$1097,MATCH(AG135,Infos_2!$O$2:$O$1097,0), ,1)),\"\")","v":""}]
[1,{"$f":"bloc_nom","v":"NOM 50 Prénom 50"}]
[2,"NOM 51 Prénom 51"]
[3,"NOM 52 Prénom 52"]
[4,"NOM 53 Prénom 53"]
[5,"NOM 54 Prénom 54"]
[6,"NOM 55 Prénom 55"]
[7,"NOM 56 Prénom 56"]
[8,"NOM 57 Prénom 57"]
[9,"NOM 58 Prénom 58"]
[10,""]
[11,""]
[12,""]
[13,""]
[14,""]
[15,""]
[]
[null,null,{"$f":"EDATE($C135,1)","v":"2024-07-01"},{"$f":"C157+1","v":"2024-07-02"},"2024-07-03","2024-07-04","2024-07-05","2024-07-06","2024-07-07","2024-07-08","2024-07-09","2024-07-10","2024-07-11","2024-07-12","2024-07-13","2024-07-14","2024-07-15","2024-07-16","2024-07-17","2024-07-18","2024-07-19","2024-07-20","2024-07-21","2024-07-22","2024-07-23","2024-07-24","2024-07-25","2024-07-26","2024-07-27","2024-07-28",{"$f":"IF(MONTH($AD157)<>MONTH(AD157+1),\"\",AD157+1)","v":"2024-07-29"},{"$f":"IF(AE157=\"\",\"\",IF(MONTH(AE157+1)<>MONTH(AE157),\"\",AE157+1))","v":"2024-07-30"},{"$f":"IF(AF157=\"\",\"\",IF(MONTH(AF157+1)<>MONTH(AF157),\"\",AF157+1))","v":"2024-07-31"}]
[null,{"$f":"INDEX(Infos!$A$2:$B$13,MATCH(B136,Infos!$A$2:$A$13,0)+1,1)","v":"Juillet"},{"$f":"C157","v":"2024-07-01"},"2024-07-02","2024-07-03","2024-07-04","2024-07-05","2024-07-06","2024-07-07","2024-07-08","2024-07-09","2024-07-10","2024-07-11","2024-07-12","2024-07-13","2024-07-14","2024-07-15","2024-07-16","2024-07-17","2024-07-18","2024-07-19","2024-07-20","2024-07-21","2024-07-22","2024-07-23","2024-07-24","2024-07-25","2024-07-26","2024-07-27","2024-07-28","2024-07-29","2024-07-30","2024-07-31"]
[null,"Férié",{"$f":"IF(C157=\"\",\"\",DATE($C$1,MATCH($B158,Infos!$A$2:$A$13,0),DAY(C$157)))","v":"2023-07-01"},{"$f":"IF(D157=\"\",\"\",DATE($C$1,MATCH($B158,Infos!$A$2:$A$13,0),DAY(D$157)))","v":"2023-07-02"},{"$f":"IF(E157=\"\",\"\",DATE($C$1,MATCH($B158,Infos!$A$2:$A$13,0),DAY(E$157)))","v":"2023-07-03"},{"$f":"IF(F157=\"\",\"\",DATE($C$1,MATCH($B158,Infos!$A$2:$A$13,0),DAY(F$157)))","v":"2023-07-04"},{"$f":"IF(G157=\"\",\"\",DATE($C$1,MATCH($B158,Infos!$A$2:$A$13,0),DAY(G$157)))","v":"2023-07-05"},{"$f":"IF(H157=\"\",\"\",DATE($C$1,MATCH($B158,Infos!$A$2:$A$13,0),DAY(H$157)))","v":"2023-07-06"},{"$f":"IF(I157=\"\",\"\",DATE($C$1,MATCH($B158,Infos!$A$2:$A$13,0),DAY(I$157)))","v":"2023-07-07"},{"$f":"IF(J157=\"\",\"\",DATE($C$1,MATCH($B158,Infos!$A$2:$A$13,0),DAY(J$157)))","v":"2023-07-08"},{"$f":"IF(K157=\"\",\"\",DATE($C$1,MATCH($B158,Infos!$A$2:$A$13,0),DAY(K$157)))","v":"2023-07-09"},{"$f":"IF(L157=\"\",\"\",DATE($C$1,MATCH($B158,Infos!$A$2:$A$13,0),DAY(L$157)))","v":"2023-07-10"},{"$f":"IF(M157=\"\",\"\",DATE($C$1,MATCH($B158,Infos!$A$2:$A$13,0),DAY(M$157)))","v":"2023-07-11"},{"$f":"IF(N157=\"\",\"\",DATE($C$1,MATCH($B158,Infos!$A$2:$A$13,0),DAY(N$157)))","v":"2023-07-12"},{"$f":"IF(O157=\"\",\"\",DATE($C$1,MATCH($B158,Infos!$A$2:$A$13,0),DAY(O$157)))","v":"2023-07-13"},{"$f":"IF(P157=\"\",\"\",DATE($C$1,MATCH($B158,Infos!$A$2:$A$13,0),DAY(P$157)))","v":"2023-07-14"},{"$f":"IF(Q157=\"\",\"\",DATE($C$1,MATCH($B158,Infos!$A$2:$A$13,0),DAY(Q$157)))","v":"2023-07-15"},{"$f":"IF(R157=\"\",\"\",DATE($C$1,MATCH($B158,Infos!$A$2:$A$13,0),DAY(R$157)))","v":"2023-07-16"},{"$f":"IF(S157=\"\",\"\",DATE($C$1,MATCH($B158,Infos!$A$2:$A$13,0),DAY(S$157)))","v":"2023-07-17"},{"$f":"IF(T157=\"\",\"\",DATE($C$1,MATCH($B158,Infos!$A$2:$A$13,0),DAY(T$157)))","v":"2023-07-18"},{"$f":"IF(U157=\"\",\"\",DATE($C$1,MATCH($B158,Infos!$A$2:$A$13,0),DAY(U$157)))","v":"2023-07-19"},{"$f":"IF(V157=\"\",\"\",DATE($C$1,MATCH($B158,Infos!$A$2:$A$13,0),DAY(V$157)))","v":"2023-07-20"},{"$f":"IF(W157=\"\",\"\",DATE($C$1,MATCH($B158,Infos!$A$2:$A$13,0),DAY(W$157)))","v":"2023-07-21"},{"$f":"IF(X157=\"\",\"\",DATE($C$1,MATCH($B158,Infos!$A$2:$A$13,0),DAY(X$157)))","v":"2023-07-22"},{"$f":"IF(Y157=\"\",\"\",DATE($C$1,MATCH($B158,Infos!$A$2:$A$13,0),DAY(Y$157)))","v":"2023-07-23"},{"$f":"IF(Z157=\"\",\"\",DATE($C$1,MATCH($B158,Infos!$A$2:$A$13,0),DAY(Z$157)))","v":"2023-07-24"},{"$f":"IF(AA157=\"\",\"\",DATE($C$1,MATCH($B158,Infos!$A$2:$A$13,0),DAY(AA$157)))","v":"2023-07-25"},{"$f":"IF(AB157=\"\",\"\",DATE($C$1,MATCH($B158,Infos!$A$2:$A$13,0),DAY(AB$157)))","v":"2023-07-26"},{"$f":"IF(AC157=\"\",\"\",DATE($C$1,MATCH($B158,Infos!$A$2:$A$13,0),DAY(AC$157)))","v":"2023-07-27"},{"$f":"IF(AD157=\"\",\"\",DATE($C$1,MATCH($B158,Infos!$A$2:$A$13,0),DAY(AD$157)))","v":"2023-07-28"},{"$f":"IF(AE157=\"\",\"\",DATE($C$1,MATCH($B158,Infos!$A$2:$A$13,0),DAY(AE$157)))","v":"2023-07-29"},{"$f":"IF(AF157=\"\",\"\",DATE($C$1,MATCH($B158,Infos!$A$2:$A$13,0),DAY(AF$157)))","v":"2023-07-30"},{"$f":"IF(AG157=\"\",\"\",DATE($C$1,MATCH($B158,Infos!$A$2:$A$13,0),DAY(AG$157)))","v":"2023-07-31"}]
[null,"WE",{"$f":"IF(C157<>\"\",IF(COUNTIF('Jours fériés'!$B$3:$B$15,Planning!C159),8,WEEKDAY(C159,2)),\"\")","v":6},{"$f":"IF(D157<>\"\",IF(COUNTIF('Jours fériés'!$B$3:$B$15,Planning!D159),8,WEEKDAY(D159,2)),\"\")","v":7},{"$f":"IF(E157<>\"\",IF(COUNTIF('Jours fériés'!$B$3:$B$15,Planning!E159),8,WEEKDAY(E159,2)),\"\")","v":1},{"$f":"IF(F157<>\"\",IF(COUNTIF('Jours fériés'!$B$3:$B$15,Planning!F159),8,WEEKDAY(F159,2)),\"\")","v":2},{"$f":"IF(G157<>\"\",IF(COUNTIF('Jours fériés'!$B$3:$B$15,Planning!G159),8,WEEKDAY(G159,2)),\"\")","v":3},{"$f":"IF(H157<>\"\",IF(COUNTIF('Jours fériés'!$B$3:$B$15,Planning!H159),8,WEEKDAY(H159,2)),\"\")","v":4},{"$f":"IF(I157<>\"\",IF(COUNTIF('Jours fériés'!$B$3:$B$15,Planning!I159),8,WEEKDAY(I159,2)),\"\")","v":5},{"$f":"IF(J157<>\"\",IF(COUNTIF('Jours fériés'!$B$3:$B$15,Planning!J159),8,WEEKDAY(J159,2)),\"\")","v":6},{"$f":"IF(K157<>\"\",IF(COUNTIF('Jours fériés'!$B$3:$B$15,Planning!K159),8,WEEKDAY(K159,2)),\"\")","v":7},{"$f":"IF(L157<>\"\",IF(COUNTIF('Jours fériés'!$B$3:$B$15,Planning!L159),8,WEEKDAY(L159,2)),\"\")","v":1},{"$f":"IF(M157<>\"\",IF(COUNTIF('Jours fériés'!$B$3:$B$15,Planning!M159),8,WEEKDAY(M159,2)),\"\")","v":2},{"$f":"IF(N157<>\"\",IF(COUNTIF('Jours fériés'!$B$3:$B$15,Planning!N159),8,WEEKDAY(N159,2)),\"\")","v":3},{"$f":"IF(O157<>\"\",IF(COUNTIF('Jours fériés'!$B$3:$B$15,Planning!O159),8,WEEKDAY(O159,2)),\"\")","v":4},{"$f":"IF(P157<>\"\",IF(COUNTIF('Jours fériés'!$B$3:$B$15,Planning!P159),8,WEEKDAY(P159,2)),\"\")","v":8},{"$f":"IF(Q157<>\"\",IF(COUNTIF('Jours fériés'!$B$3:$B$15,Planning!Q159),8,WEEKDAY(Q159,2)),\"\")","v":6},{"$f":"IF(R157<>\"\",IF(COUNTIF('Jours fériés'!$B$3:$B$15,Planning!R159),8,WEEKDAY(R159,2)),\"\")","v":7},{"$f":"IF(S157<>\"\",IF(COUNTIF('Jours fériés'!$B$3:$B$15,Planning!S159),8,WEEKDAY(S159,2)),\"\")","v":1},{"$f":"IF(T157<>\"\",IF(COUNTIF('Jours fériés'!$B$3:$B$15,Planning!T159),8,WEEKDAY(T159,2)),\"\")","v":2},{"$f":"IF(U157<>\"\",IF(COUNTIF('Jours fériés'!$B$3:$B$15,Planning!U159),8,WEEKDAY(U159,2)),\"\")","v":3},{"$f":"IF(V157<>\"\",IF(COUNTIF('Jours fériés'!$B$3:$B$15,Planning!V159),8,WEEKDAY(V159,2)),\"\")","v":4},{"$f":"IF(W157<>\"\",IF(COUNTIF('Jours fériés'!$B$3:$B$15,Planning!W159),8,WEEKDAY(W159,2)),\"\")","v":5},{"$f":"IF(X157<>\"\",IF(COUNTIF('Jours fériés'!$B$3:$B$15,Planning!X159),8,WEEKDAY(X159,2)),\"\")","v":6},{"$f":"IF(Y157<>\"\",IF(COUNTIF('Jours fériés'!$B$3:$B$15,Planning!Y159),8,WEEKDAY(Y159,2)),\"\")","v":7},{"$f":"IF(Z157<>\"\",IF(COUNTIF('Jours fériés'!$B$3:$B$15,Planning!Z159),8,WEEKDAY(Z159,2)),\"\")","v":1},{"$f":"IF(AA157<>\"\",IF(COUNTIF('Jours fériés'!$B$3:$B$15,Planning!AA159),8,WEEKDAY(AA159,2)),\"\")","v":2},{"$f":"IF(AB157<>\"\",IF(COUNTIF('Jours fériés'!$B$3:$B$15,Planning!AB159),8,WEEKDAY(AB159,2)),\"\")","v":3},{"$f":"IF(AC157<>\"\",IF(COUNTIF('Jours fériés'!$B$3:$B$15,Planning!AC159),8,WEEKDAY(AC159,2)),\"\")","v":4},{"$f":"IF(AD157<>\"\",IF(COUNTIF('Jours fériés'!$B$3:$B$15,Planning!AD159),8,WEEKDAY(AD159,2)),\"\")","v":5},{"$f":"IF(AE157<>\"\",IF(COUNTIF('Jours fériés'!$B$3:$B$15,Planning!AE159),8,WEEKDAY(AE159,2)),\"\")","v":6},{"$f":"IF(AF157<>\"\",IF(COUNTIF('Jours fériés'!$B$3:$B$15,Planning!AF159),8,WEEKDAY(AF159,2)),\"\")","v":7},{"$f":"IF(AG157<>\"\",IF(COUNTIF('Jours fériés'!$B$3:$B$15,Planning!AG159),8,WEEKDAY(AG159,2)),\"\")","v":1}]
[null,"VACANCES",{"$f":"IF(SUMPRODUCT((C157>=datdeb)*(C157<=datfin))=1,\"vac\",\"\")","v":""},{"$f":"IF(SUMPRODUCT((D157>=datdeb)*(D157<=datfin))=1,\"vac\",\"\")","v":""},{"$f":"IF(SUMPRODUCT((E157>=datdeb)*(E157<=datfin))=1,\"vac\",\"\")","v":""},{"$f":"IF(SUMPRODUCT((F157>=datdeb)*(F157<=datfin))=1,\"vac\",\"\")","v":""},{"$f":"IF(SUMPRODUCT((G157>=datdeb)*(G157<=datfin))=1,\"vac\",\"\")","v":""},{"$f":"IF(SUMPRODUCT((H157>=datdeb)*(H157<=datfin))=1,\"vac\",\"\")","v":"vac"},{"$f":"IF(SUMPRODUCT((I157>=datdeb)*(I157<=datfin))=1,\"vac\",\"\")","v":"vac"},{"$f":"IF(SUMPRODUCT((J157>=datdeb)*(J157<=datfin))=1,\"vac\",\"\")","v":"vac"},{"$f":"IF(SUMPRODUCT((K157>=datdeb)*(K157<=datfin))=1,\"vac\",\"\")","v":"vac"},{"$f":"IF(SUMPRODUCT((L157>=datdeb)*(L157<=datfin))=1,\"vac\",\"\")","v":"vac"},{"$f":"IF(SUMPRODUCT((M157>=datdeb)*(M157<=datfin))=1,\"vac\",\"\")","v":"vac"},{"$f":"IF(SUMPRODUCT((N157>=datdeb)*(N157<=datfin))=1,\"vac\",\"\")","v":"vac"},{"$f":"IF(SUMPRODUCT((O157>=datdeb)*(O157<=datfin))=1,\"vac\",\"\")","v":"vac"},{"$f":"IF(SUMPRODUCT((P157>=datdeb)*(P157<=datfin))=1,\"vac\",\"\")","v":"vac"},{"$f":"IF(SUMPRODUCT((Q157>=datdeb)*(Q157<=datfin))=1,\"vac\",\"\")","v":"vac"},{"$f":"IF(SUMPRODUCT((R157>=datdeb)*(R157<=datfin))=1,\"vac\",\"\")","v":"vac"},{"$f":"IF(SUMPRODUCT((S157>=datdeb)*(S157<=datfin))=1,\"vac\",\"\")","v":"vac"},{"$f":"IF(SUMPRODUCT((T157>=datdeb)*(T157<=datfin))=1,\"vac\",\"\")","v":"vac"},{"$f":"IF(SUMPRODUCT((U157>=datdeb)*(U157<=datfin))=1,\"vac\",\"\")","v":"vac"},{"$f":"IF(SUMPRODUCT((V157>=datdeb)*(V157<=datfin))=1,\"vac\",\"\")","v":"vac"},{"$f":"IF(SUMPRODUCT((W157>=datdeb)*(W157<=datfin))=1,\"vac\",\"\")","v":"vac"},{"$f":"IF(SUMPRODUCT((X157>=datdeb)*(X157<=datfin))=1,\"vac\",\"\")","v":"vac"},{"$f":"IF(SUMPRODUCT((Y157>=datdeb)*(Y157<=datfin))=1,\"vac\",\"\")","v":"vac"},{"$f":"IF(SUMPRODUCT((Z157>=datdeb)*(Z157<=datfin))=1,\"vac\",\"\")","v":"vac"},{"$f":"IF(SUMPRODUCT((AA157>=datdeb)*(AA157<=datfin))=1,\"vac\",\"\")","v":"vac"},{"$f":"IF(SUMPRODUCT((AB157>=datdeb)*(AB157<=datfin))=1,\"vac\",\"\")","v":"vac"},{"$f":"IF(SUMPRODUCT((AC157>=datdeb)*(AC157<=datfin))=1,\"vac\",\"\")","v":"vac"},{"$f":"IF(SUMPRODUCT((AD157>=datdeb)*(AD157<=datfin))=1,\"vac\",\"\")","v":"vac"},{"$f":"IF(SUMPRODUCT((AE157>=datdeb)*(AE157<=datfin))=1,\"vac\",\"\")","v":"vac"},{"$f":"IF(SUMPRODUCT((AF157>=datdeb)*(AF157<=datfin))=1,\"vac\",\"\")","v":"vac"},{"$f":"IF(SUMPRODUCT((AG157>=datdeb)*(AG157<=datfin))=1,\"vac\",\"\")","v":"vac"}]
[null,null,{"$f":"IFERROR(_xlfn.SWITCH($B$3,\"C1\",INDEX(Infos_2!$D$2:$D$1097,MATCH(C157,Infos_2!$C$2:$C$1097,0),1),\"C2\",INDEX(Infos_2!$G$2:$G$1097,MATCH(C157,Infos_2!$F$2:$F$1097,0), ,1),\"H\",INDEX(Infos_2!$J$2:$J$1097,MATCH(C157,Infos_2!$I$2:$I$1097,0), ,1),\"H1\",INDEX(Infos_2!$M$2:$M$1097,MATCH(C157,Infos_2!$L$2:$L$1097,0), ,1),\"H2\",INDEX(Infos_2!$P$2:$P$1097,MATCH(C157,Infos_2!$O$2:$O$1097,0), ,1)),\"\")","v":"T"},{"$f":"IFERROR(_xlfn.SWITCH($B$3,\"C1\",INDEX(Infos_2!$D$2:$D$1097,MATCH(D157,Infos_2!$C$2:$C$1097,0),1),\"C2\",INDEX(Infos_2!$G$2:$G$1097,MATCH(D157,Infos_2!$F$2:$F$1097,0), ,1),\"H\",INDEX(Infos_2!$J$2:$J$1097,MATCH(D157,Infos_2!$I$2:$I$1097,0), ,1),\"H1\",INDEX(Infos_2!$M$2:$M$1097,MATCH(D157,Infos_2!$L$2:$L$1097,0), ,1),\"H2\",INDEX(Infos_2!$P$2:$P$1097,MATCH(D157,Infos_2!$O$2:$O$1097,0), ,1)),\"\")","v":"T"},{"$f":"IFERROR(_xlfn.SWITCH($B$3,\"C1\",INDEX(Infos_2!$D$2:$D$1097,MATCH(E157,Infos_2!$C$2:$C$1097,0),1),\"C2\",INDEX(Infos_2!$G$2:$G$1097,MATCH(E157,Infos_2!$F$2:$F$1097,0), ,1),\"H\",INDEX(Infos_2!$J$2:$J$1097,MATCH(E157,Infos_2!$I$2:$I$1097,0), ,1),\"H1\",INDEX(Infos_2!$M$2:$M$1097,MATCH(E157,Infos_2!$L$2:$L$1097,0), ,1),\"H2\",INDEX(Infos_2!$P$2:$P$1097,MATCH(E157,Infos_2!$O$2:$O$1097,0), ,1)),\"\")","v":"T"},{"$f":"IFERROR(_xlfn.SWITCH($B$3,\"C1\",INDEX(Infos_2!$D$2:$D$1097,MATCH(F157,Infos_2!$C$2:$C$1097,0),1),\"C2\",INDEX(Infos_2!$G$2:$G$1097,MATCH(F157,Infos_2!$F$2:$F$1097,0), ,1),\"H\",INDEX(Infos_2!$J$2:$J$1097,MATCH(F157,Infos_2!$I$2:$I$1097,0), ,1),\"H1\",INDEX(Infos_2!$M$2:$M$1097,MATCH(F157,Infos_2!$L$2:$L$1097,0), ,1),\"H2\",INDEX(Infos_2!$P$2:$P$1097,MATCH(F157,Infos_2!$O$2:$O$1097,0), ,1)),\"\")","v":"T"},{"$f":"IFERROR(_xlfn.SWITCH($B$3,\"C1\",INDEX(Infos_2!$D$2:$D$1097,MATCH(G157,Infos_2!$C$2:$C$1097,0),1),\"C2\",INDEX(Infos_2!$G$2:$G$1097,MATCH(G157,Infos_2!$F$2:$F$1097,0), ,1),\"H\",INDEX(Infos_2!$J$2:$J$1097,MATCH(G157,Infos_2!$I$2:$I$1097,0), ,1),\"H1\",INDEX(Infos_2!$M$2:$M$1097,MATCH(G157,Infos_2!$L$2:$L$1097,0), ,1),\"H2\",INDEX(Infos_2!$P$2:$P$1097,MATCH(G157,Infos_2!$O$2:$O$1097,0), ,1)),\"\")","v":"T"},{"$f":"IFERROR(_xlfn.SWITCH($B$3,\"C1\",INDEX(Infos_2!$D$2:$D$1097,MATCH(H157,Infos_2!$C$2:$C$1097,0),1),\"C2\",INDEX(Infos_2!$G$2:$G$1097,MATCH(H157,Infos_2!$F$2:$F$1097,0), ,1),\"H\",INDEX(Infos_2!$J$2:$J$1097,MATCH(H157,Infos_2!$I$2:$I$1097,0), ,1),\"H1\",INDEX(Infos_2!$M$2:$M$1097,MATCH(H157,Infos_2!$L$2:$L$1097,0), ,1),\"H2\",INDEX(Infos_2!$P$2:$P$1097,MATCH(H157,Infos_2!$O$2:$O$1097,0), ,1)),\"\")","v":"R"},{"$f":"IFERROR(_xlfn.SWITCH($B$3,\"C1\",INDEX(Infos_2!$D$2:$D$1097,MATCH(I157,Infos_2!$C$2:$C$1097,0),1),\"C2\",INDEX(Infos_2!$G$2:$G$1097,MATCH(I157,Infos_2!$F$2:$F$1097,0), ,1),\"H\",INDEX(Infos_2!$J$2:$J$1097,MATCH(I157,Infos_2!$I$2:$I$1097,0), ,1),\"H1\",INDEX(Infos_2!$M$2:$M$1097,MATCH(I157,Infos_2!$L$2:$L$1097,0), ,1),\"H2\",INDEX(Infos_2!$P$2:$P$1097,MATCH(I157,Infos_2!$O$2:$O$1097,0), ,1)),\"\")","v":"R"},{"$f":"IFERROR(_xlfn.SWITCH($B$3,\"C1\",INDEX(Infos_2!$D$2:$D$1097,MATCH(J157,Infos_2!$C$2:$C$1097,0),1),\"C2\",INDEX(Infos_2!$G$2:$G$1097,MATCH(J157,Infos_2!$F$2:$F$1097,0), ,1),\"H\",INDEX(Infos_2!$J$2:$J$1097,MATCH(J157,Infos_2!$I$2:$I$1097,0), ,1),\"H1\",INDEX(Infos_2!$M$2:$M$1097,MATCH(J157,Infos_2!$L$2:$L$1097,0), ,1),\"H2\",INDEX(Infos_2!$P$2:$P$1097,MATCH(J157,Infos_2!$O$2:$O$1097,0), ,1)),\"\")","v":"T"},{"$f":"IFERROR(_xlfn.SWITCH($B$3,\"C1\",INDEX(Infos_2!$D$2:$D$1097,MATCH(K157,Infos_2!$C$2:$C$1097,0),1),\"C2\",INDEX(Infos_2!$G$2:$G$1097,MATCH(K157,Infos_2!$F$2:$F$1097,0), ,1),\"H\",INDEX(Infos_2!$J$2:$J$1097,MATCH(K157,Infos_2!$I$2:$I$1097,0), ,1),\"H1\",INDEX(Infos_2!$M$2:$M$1097,MATCH(K157,Infos_2!$L$2:$L$1097,0), ,1),\"H2\",INDEX(Infos_2!$P$2:$P$1097,MATCH(K157,Infos_2!$O$2:$O$1097,0), ,1)),\"\")","v":"T"},{"$f":"IFERROR(_xlfn.SWITCH($B$3,\"C1\",INDEX(Infos_2!$D$2:$D$1097,MATCH(L157,Infos_2!$C$2:$C$1097,0),1),\"C2\",INDEX(Infos_2!$G$2:$G$1097,MATCH(L157,Infos_2!$F$2:$F$1097,0), ,1),\"H\",INDEX(Infos_2!$J$2:$J$1097,MATCH(L157,Infos_2!$I$2:$I$1097,0), ,1),\"H1\",INDEX(Infos_2!$M$2:$M$1097,MATCH(L157,Infos_2!$L$2:$L$1097,0), ,1),\"H2\",INDEX(Infos_2!$P$2:$P$1097,MATCH(L157,Infos_2!$O$2:$O$1097,0), ,1)),\"\")","v":"T"},{"$f":"IFERROR(_xlfn.SWITCH($B$3,\"C1\",INDEX(Infos_2!$D$2:$D$1097,MATCH(M157,Infos_2!$C$2:$C$1097,0),1),\"C2\",INDEX(Infos_2!$G$2:$G$1097,MATCH(M157,Infos_2!$F$2:$F$1097,0), ,1),\"H\",INDEX(Infos_2!$J$2:$J$1097,MATCH(M157,Infos_2!$I$2:$I$1097,0), ,1),\"H1\",INDEX(Infos_2!$M$2:$M$1097,MATCH(M157,Infos_2!$L$2:$L$1097,0), ,1),\"H2\",INDEX(Infos_2!$P$2:$P$1097,MATCH(M157,Infos_2!$O$2:$O$1097,0), ,1)),\"\")","v":"T"},{"$f":"IFERROR(_xlfn.SWITCH($B$3,\"C1\",INDEX(Infos_2!$D$2:$D$1097,MATCH(N157,Infos_2!$C$2:$C$1097,0),1),\"C2\",INDEX(Infos_2!$G$2:$G$1097,MATCH(N157,Infos_2!$F$2:$F$1097,0), ,1),\"H\",INDEX(Infos_2!$J$2:$J$1097,MATCH(N157,Infos_2!$I$2:$I$1097,0), ,1),\"H1\",INDEX(Infos_2!$M$2:$M$1097,MATCH(N157,Infos_2!$L$2:$L$1097,0), ,1),\"H2\",INDEX(Infos_2!$P$2:$P$1097,MATCH(N157,Infos_2!$O$2:$O$1097,0), ,1)),\"\")","v":"T"},{"$f":"IFERROR(_xlfn.SWITCH($B$3,\"C1\",INDEX(Infos_2!$D$2:$D$1097,MATCH(O157,Infos_2!$C$2:$C$1097,0),1),\"C2\",INDEX(Infos_2!$G$2:$G$1097,MATCH(O157,Infos_2!$F$2:$F$1097,0), ,1),\"H\",INDEX(Infos_2!$J$2:$J$1097,MATCH(O157,Infos_2!$I$2:$I$1097,0), ,1),\"H1\",INDEX(Infos_2!$M$2:$M$1097,MATCH(O157,Infos_2!$L$2:$L$1097,0), ,1),\"H2\",INDEX(Infos_2!$P$2:$P$1097,MATCH(O157,Infos_2!$O$2:$O$1097,0), ,1)),\"\")","v":"R"},{"$f":"IFERROR(_xlfn.SWITCH($B$3,\"C1\",INDEX(Infos_2!$D$2:$D$1097,MATCH(P157,Infos_2!$C$2:$C$1097,0),1),\"C2\",INDEX(Infos_2!$G$2:$G$1097,MATCH(P157,Infos_2!$F$2:$F$1097,0), ,1),\"H\",INDEX(Infos_2!$J$2:$J$1097,MATCH(P157,Infos_2!$I$2:$I$1097,0), ,1),\"H1\",INDEX(Infos_2!$M$2:$M$1097,MATCH(P157,Infos_2!$L$2:$L$1097,0), ,1),\"H2\",INDEX(Infos_2!$P$2:$P$1097,MATCH(P157,Infos_2!$O$2:$O$1097,0), ,1)),\"\")","v":"R"},{"$f":"IFERROR(_xlfn.SWITCH($B$3,\"C1\",INDEX(Infos_2!$D$2:$D$1097,MATCH(Q157,Infos_2!$C$2:$C$1097,0),1),\"C2\",INDEX(Infos_2!$G$2:$G$1097,MATCH(Q157,Infos_2!$F$2:$F$1097,0), ,1),\"H\",INDEX(Infos_2!$J$2:$J$1097,MATCH(Q157,Infos_2!$I$2:$I$1097,0), ,1),\"H1\",INDEX(Infos_2!$M$2:$M$1097,MATCH(Q157,Infos_2!$L$2:$L$1097,0), ,1),\"H2\",INDEX(Infos_2!$P$2:$P$1097,MATCH(Q157,Infos_2!$O$2:$O$1097,0), ,1)),\"\")","v":"T"},{"$f":"IFERROR(_xlfn.SWITCH($B$3,\"C1\",INDEX(Infos_2!$D$2:$D$1097,MATCH(R157,Infos_2!$C$2:$C$1097,0),1),\"C2\",INDEX(Infos_2!$G$2:$G$1097,MATCH(R157,Infos_2!$F$2:$F$1097,0), ,1),\"H\",INDEX(Infos_2!$J$2:$J$1097,MATCH(R157,Infos_2!$I$2:$I$1097,0), ,1),\"H1\",INDEX(Infos_2!$M$2:$M$1097,MATCH(R157,Infos_2!$L$2:$L$1097,0), ,1),\"H2\",INDEX(Infos_2!$P$2:$P$1097,MATCH(R157,Infos_2!$O$2:$O$1097,0), ,1)),\"\")","v":"T"},{"$f":"IFERROR(_xlfn.SWITCH($B$3,\"C1\",INDEX(Infos_2!$D$2:$D$1097,MATCH(S157,Infos_2!$C$2:$C$1097,0),1),\"C2\",INDEX(Infos_2!$G$2:$G$1097,MATCH(S157,Infos_2!$F$2:$F$1097,0), ,1),\"H\",INDEX(Infos_2!$J$2:$J$1097,MATCH(S157,Infos_2!$I$2:$I$1097,0), ,1),\"H1\",INDEX(Infos_2!$M$2:$M$1097,MATCH(S157,Infos_2!$L$2:$L$1097,0), ,1),\"H2\",INDEX(Infos_2!$P$2:$P$1097,MATCH(S157,Infos_2!$O$2:$O$1097,0), ,1)),\"\")","v":"T"},{"$f":"IFERROR(_xlfn.SWITCH($B$3,\"C1\",INDEX(Infos_2!$D$2:$D$1097,MATCH(T157,Infos_2!$C$2:$C$1097,0),1),\"C2\",INDEX(Infos_2!$G$2:$G$1097,MATCH(T157,Infos_2!$F$2:$F$1097,0), ,1),\"H\",INDEX(Infos_2!$J$2:$J$1097,MATCH(T157,Infos_2!$I$2:$I$1097,0), ,1),\"H1\",INDEX(Infos_2!$M$2:$M$1097,MATCH(T157,Infos_2!$L$2:$L$1097,0), ,1),\"H2\",INDEX(Infos_2!$P$2:$P$1097,MATCH(T157,Infos_2!$O$2:$O$1097,0), ,1)),\"\")","v":"T"},{"$f":"IFERROR(_xlfn.SWITCH($B$3,\"C1\",INDEX(Infos_2!$D$2:$D$1097,MATCH(U157,Infos_2!$C$2:$C$1097,0),1),\"C2\",INDEX(Infos_2!$G$2:$G$1097,MATCH(U157,Infos_2!$F$2:$F$1097,0), ,1),\"H\",INDEX(Infos_2!$J$2:$J$1097,MATCH(U157,Infos_2!$I$2:$I$1097,0), ,1),\"H1\",INDEX(Infos_2!$M$2:$M$1097,MATCH(U157,Infos_2!$L$2:$L$1097,0), ,1),\"H2\",INDEX(Infos_2!$P$2:$P$1097,MATCH(U157,Infos_2!$O$2:$O$1097,0), ,1)),\"\")","v":"T"},{"$f":"IFERROR(_xlfn.SWITCH($B$3,\"C1\",INDEX(Infos_2!$D$2:$D$1097,MATCH(V157,Infos_2!$C$2:$C$1097,0),1),\"C2\",INDEX(Infos_2!$G$2:$G$1097,MATCH(V157,Infos_2!$F$2:$F$1097,0), ,1),\"H\",INDEX(Infos_2!$J$2:$J$1097,MATCH(V157,Infos_2!$I$2:$I$1097,0), ,1),\"H1\",INDEX(Infos_2!$M$2:$M$1097,MATCH(V157,Infos_2!$L$2:$L$1097,0), ,1),\"H2\",INDEX(Infos_2!$P$2:$P$1097,MATCH(V157,Infos_2!$O$2:$O$1097,0), ,1)),\"\")","v":"R"},{"$f":"IFERROR(_xlfn.SWITCH($B$3,\"C1\",INDEX(Infos_2!$D$2:$D$1097,MATCH(W157,Infos_2!$C$2:$C$1097,0),1),\"C2\",INDEX(Infos_2!$G$2:$G$1097,MATCH(W157,Infos_2!$F$2:$F$1097,0), ,1),\"H\",INDEX(Infos_2!$J$2:$J$1097,MATCH(W157,Infos_2!$I$2:$I$1097,0), ,1),\"H1\",INDEX(Infos_2!$M$2:$M$1097,MATCH(W157,Infos_2!$L$2:$L$1097,0), ,1),\"H2\",INDEX(Infos_2!$P$2:$P$1097,MATCH(W157,Infos_2!$O$2:$O$1097,0), ,1)),\"\")","v":"R"},{"$f":"IFERROR(_xlfn.SWITCH($B$3,\"C1\",INDEX(Infos_2!$D$2:$D$1097,MATCH(X157,Infos_2!$C$2:$C$1097,0),1),\"C2\",INDEX(Infos_2!$G$2:$G$1097,MATCH(X157,Infos_2!$F$2:$F$1097,0), ,1),\"H\",INDEX(Infos_2!$J$2:$J$1097,MATCH(X157,Infos_2!$I$2:$I$1097,0), ,1),\"H1\",INDEX(Infos_2!$M$2:$M$1097,MATCH(X157,Infos_2!$L$2:$L$1097,0), ,1),\"H2\",INDEX(Infos_2!$P$2:$P$1097,MATCH(X157,Infos_2!$O$2:$O$1097,0), ,1)),\"\")","v":"T"},{"$f":"IFERROR(_xlfn.SWITCH($B$3,\"C1\",INDEX(Infos_2!$D$2:$D$1097,MATCH(Y157,Infos_2!$C$2:$C$1097,0),1),\"C2\",INDEX(Infos_2!$G$2:$G$1097,MATCH(Y157,Infos_2!$F$2:$F$1097,0), ,1),\"H\",INDEX(Infos_2!$J$2:$J$1097,MATCH(Y157,Infos_2!$I$2:$I$1097,0), ,1),\"H1\",INDEX(Infos_2!$M$2:$M$1097,MATCH(Y157,Infos_2!$L$2:$L$1097,0), ,1),\"H2\",INDEX(Infos_2!$P$2:$P$1097,MATCH(Y157,Infos_2!$O$2:$O$1097,0), ,1)),\"\")","v":"T"},{"$f":"IFERROR(_xlfn.SWITCH($B$3,\"C1\",INDEX(Infos_2!$D$2:$D$1097,MATCH(Z157,Infos_2!$C$2:$C$1097,0),1),\"C2\",INDEX(Infos_2!$G$2:$G$1097,MATCH(Z157,Infos_2!$F$2:$F$1097,0), ,1),\"H\",INDEX(Infos_2!$J$2:$J$1097,MATCH(Z157,Infos_2!$I$2:$I$1097,0), ,1),\"H1\",INDEX(Infos_2!$M$2:$M$1097,MATCH(Z157,Infos_2!$L$2:$L$1097,0), ,1),\"H2\",INDEX(Infos_2!$P$2:$P$1097,MATCH(Z157,Infos_2!$O$2:$O$1097,0), ,1)),\"\")","v":"T"},{"$f":"IFERROR(_xlfn.SWITCH($B$3,\"C1\",INDEX(Infos_2!$D$2:$D$1097,MATCH(AA157,Infos_2!$C$2:$C$1097,0),1),\"C2\",INDEX(Infos_2!$G$2:$G$1097,MATCH(AA157,Infos_2!$F$2:$F$1097,0), ,1),\"H\",INDEX(Infos_2!$J$2:$J$1097,MATCH(AA157,Infos_2!$I$2:$I$1097,0), ,1),\"H1\",INDEX(Infos_2!$M$2:$M$1097,MATCH(AA157,Infos_2!$L$2:$L$1097,0), ,1),\"H2\",INDEX(Infos_2!$P$2:$P$1097,MATCH(AA157,Infos_2!$O$2:$O$1097,0), ,1)),\"\")","v":"T"},{"$f":"IFERROR(_xlfn.SWITCH($B$3,\"C1\",INDEX(Infos_2!$D$2:$D$1097,MATCH(AB157,Infos_2!$C$2:$C$1097,0),1),\"C2\",INDEX(Infos_2!$G$2:$G$1097,MATCH(AB157,Infos_2!$F$2:$F$1097,0), ,1),\"H\",INDEX(Infos_2!$J$2:$J$1097,MATCH(AB157,Infos_2!$I$2:$I$1097,0), ,1),\"H1\",INDEX(Infos_2!$M$2:$M$1097,MATCH(AB157,Infos_2!$L$2:$L$1097,0), ,1),\"H2\",INDEX(Infos_2!$P$2:$P$1097,MATCH(AB157,Infos_2!$O$2:$O$1097,0), ,1)),\"\")","v":"T"},{"$f":"IFERROR(_xlfn.SWITCH($B$3,\"C1\",INDEX(Infos_2!$D$2:$D$1097,MATCH(AC157,Infos_2!$C$2:$C$1097,0),1),\"C2\",INDEX(Infos_2!$G$2:$G$1097,MATCH(AC157,Infos_2!$F$2:$F$1097,0), ,1),\"H\",INDEX(Infos_2!$J$2:$J$1097,MATCH(AC157,Infos_2!$I$2:$I$1097,0), ,1),\"H1\",INDEX(Infos_2!$M$2:$M$1097,MATCH(AC157,Infos_2!$L$2:$L$1097,0), ,1),\"H2\",INDEX(Infos_2!$P$2:$P$1097,MATCH(AC157,Infos_2!$O$2:$O$1097,0), ,1)),\"\")","v":"R"},{"$f":"IFERROR(_xlfn.SWITCH($B$3,\"C1\",INDEX(Infos_2!$D$2:$D$1097,MATCH(AD157,Infos_2!$C$2:$C$1097,0),1),\"C2\",INDEX(Infos_2!$G$2:$G$1097,MATCH(AD157,Infos_2!$F$2:$F$1097,0), ,1),\"H\",INDEX(Infos_2!$J$2:$J$1097,MATCH(AD157,Infos_2!$I$2:$I$1097,0), ,1),\"H1\",INDEX(Infos_2!$M$2:$M$1097,MATCH(AD157,Infos_2!$L$2:$L$1097,0), ,1),\"H2\",INDEX(Infos_2!$P$2:$P$1097,MATCH(AD157,Infos_2!$O$2:$O$1097,0), ,1)),\"\")","v":"R"},{"$f":"IFERROR(_xlfn.SWITCH($B$3,\"C1\",INDEX(Infos_2!$D$2:$D$1097,MATCH(AE157,Infos_2!$C$2:$C$1097,0),1),\"C2\",INDEX(Infos_2!$G$2:$G$1097,MATCH(AE157,Infos_2!$F$2:$F$1097,0), ,1),\"H\",INDEX(Infos_2!$J$2:$J$1097,MATCH(AE157,Infos_2!$I$2:$I$1097,0), ,1),\"H1\",INDEX(Infos_2!$M$2:$M$1097,MATCH(AE157,Infos_2!$L$2:$L$1097,0), ,1),\"H2\",INDEX(Infos_2!$P$2:$P$1097,MATCH(AE157,Infos_2!$O$2:$O$1097,0), ,1)),\"\")","v":"T"},{"$f":"IFERROR(_xlfn.SWITCH($B$3,\"C1\",INDEX(Infos_2!$D$2:$D$1097,MATCH(AF157,Infos_2!$C$2:$C$1097,0),1),\"C2\",INDEX(Infos_2!$G$2:$G$1097,MATCH(AF157,Infos_2!$F$2:$F$1097,0), ,1),\"H\",INDEX(Infos_2!$J$2:$J$1097,MATCH(AF157,Infos_2!$I$2:$I$1097,0), ,1),\"H1\",INDEX(Infos_2!$M$2:$M$1097,MATCH(AF157,Infos_2!$L$2:$L$1097,0), ,1),\"H2\",INDEX(Infos_2!$P$2:$P$1097,MATCH(AF157,Infos_2!$O$2:$O$1097,0), ,1)),\"\")","v":"T"},{"$f":"IFERROR(_xlfn.SWITCH($B$3,\"C1\",INDEX(Infos_2!$D$2:$D$1097,MATCH(AG157,Infos_2!$C$2:$C$1097,0),1),\"C2\",INDEX(Infos_2!$G$2:$G$1097,MATCH(AG157,Infos_2!$F$2:$F$1097,0), ,1),\"H\",INDEX(Infos_2!$J$2:$J$1097,MATCH(AG157,Infos_2!$I$2:$I$1097,0), ,1),\"H1\",INDEX(Infos_2!$M$2:$M$1097,MATCH(AG157,Infos_2!$L$2:$L$1097,0), ,1),\"H2\",INDEX(Infos_2!$P$2:$P$1097,MATCH(AG157,Infos_2!$O$2:$O$1097,0), ,1)),\"\")","v":"T"}]
[1,{"$f":"bloc_nom","v":"NOM 50 Prénom 50"}]
[2,"NOM 51 Prénom 51"]
[3,"NOM 52 Prénom 52"]
[4,"NOM 53 Prénom 53"]
[5,"NOM 54 Prénom 54"]
[6,"NOM 55 Prénom 55"]
[7,"NOM 56 Prénom 56"]
[8,"NOM 57 Prénom 57"]
[9,"NOM 58 Prénom 58"]
[10,""]
[11,""]
[12,""]
[13,""]
[14,""]
[15,""]
[]
[null,null,{"$f":"EDATE($C157,1)","v":"2024-08-01"},{"$f":"C179+1","v":"2024-08-02"},"2024-08-03","2024-08-04","2024-08-05","2024-08-06","2024-08-07","2024-08-08","2024-08-09","2024-08-10","2024-08-11","2024-08-12","2024-08-13","2024-08-14","2024-08-15","2024-08-16","2024-08-17","2024-08-18","2024-08-19","2024-08-20","2024-08-21","2024-08-22","2024-08-23","2024-08-24","2024-08-25","2024-08-26","2024-08-27","2024-08-28",{"$f":"IF(MONTH($AD179)<>MONTH(AD179+1),\"\",AD179+1)","v":"2024-08-29"},{"$f":"IF(AE179=\"\",\"\",IF(MONTH(AE179+1)<>MONTH(AE179),\"\",AE179+1))","v":"2024-08-30"},{"$f":"IF(AF179=\"\",\"\",IF(MONTH(AF179+1)<>MONTH(AF179),\"\",AF179+1))","v":"2024-08-31"}]
[null,{"$f":"INDEX(Infos!$A$2:$B$13,MATCH(B158,Infos!$A$2:$A$13,0)+1,1)","v":"Août"},{"$f":"C179","v":"2024-08-01"},"2024-08-02","2024-08-03","2024-08-04","2024-08-05","2024-08-06","2024-08-07","2024-08-08","2024-08-09","2024-08-10","2024-08-11","2024-08-12","2024-08-13","2024-08-14","2024-08-15","2024-08-16","2024-08-17","2024-08-18","2024-08-19","2024-08-20","2024-08-21","2024-08-22","2024-08-23","2024-08-24","2024-08-25","2024-08-26","2024-08-27","2024-08-28","2024-08-29","2024-08-30","2024-08-31"]
[null,"Férié",{"$f":"IF(C179=\"\",\"\",DATE($C$1,MATCH($B180,Infos!$A$2:$A$13,0),DAY(C$179)))","v":"2023-08-01"},{"$f":"IF(D179=\"\",\"\",DATE($C$1,MATCH($B180,Infos!$A$2:$A$13,0),DAY(D$179)))","v":"2023-08-02"},{"$f":"IF(E179=\"\",\"\",DATE($C$1,MATCH($B180,Infos!$A$2:$A$13,0),DAY(E$179)))","v":"2023-08-03"},{"$f":"IF(F179=\"\",\"\",DATE($C$1,MATCH($B180,Infos!$A$2:$A$13,0),DAY(F$179)))","v":"2023-08-04"},{"$f":"IF(G179=\"\",\"\",DATE($C$1,MATCH($B180,Infos!$A$2:$A$13,0),DAY(G$179)))","v":"2023-08-05"},{"$f":"IF(H179=\"\",\"\",DATE($C$1,MATCH($B180,Infos!$A$2:$A$13,0),DAY(H$179)))","v":"2023-08-06"},{"$f":"IF(I179=\"\",\"\",DATE($C$1,MATCH($B180,Infos!$A$2:$A$13,0),DAY(I$179)))","v":"2023-08-07"},{"$f":"IF(J179=\"\",\"\",DATE($C$1,MATCH($B180,Infos!$A$2:$A$13,0),DAY(J$179)))","v":"2023-08-08"},{"$f":"IF(K179=\"\",\"\",DATE($C$1,MATCH($B180,Infos!$A$2:$A$13,0),DAY(K$179)))","v":"2023-08-09"},{"$f":"IF(L179=\"\",\"\",DATE($C$1,MATCH($B180,Infos!$A$2:$A$13,0),DAY(L$179)))","v":"2023-08-10"},{"$f":"IF(M179=\"\",\"\",DATE($C$1,MATCH($B180,Infos!$A$2:$A$13,0),DAY(M$179)))","v":"2023-08-11"},{"$f":"IF(N179=\"\",\"\",DATE($C$1,MATCH($B180,Infos!$A$2:$A$13,0),DAY(N$179)))","v":"2023-08-12"},{"$f":"IF(O179=\"\",\"\",DATE($C$1,MATCH($B180,Infos!$A$2:$A$13,0),DAY(O$179)))","v":"2023-08-13"},{"$f":"IF(P179=\"\",\"\",DATE($C$1,MATCH($B180,Infos!$A$2:$A$13,0),DAY(P$179)))","v":"2023-08-14"},{"$f":"IF(Q179=\"\",\"\",DATE($C$1,MATCH($B180,Infos!$A$2:$A$13,0),DAY(Q$179)))","v":"2023-08-15"},{"$f":"IF(R179=\"\",\"\",DATE($C$1,MATCH($B180,Infos!$A$2:$A$13,0),DAY(R$179)))","v":"2023-08-16"},{"$f":"IF(S179=\"\",\"\",DATE($C$1,MATCH($B180,Infos!$A$2:$A$13,0),DAY(S$179)))","v":"2023-08-17"},{"$f":"IF(T179=\"\",\"\",DATE($C$1,MATCH($B180,Infos!$A$2:$A$13,0),DAY(T$179)))","v":"2023-08-18"},{"$f":"IF(U179=\"\",\"\",DATE($C$1,MATCH($B180,Infos!$A$2:$A$13,0),DAY(U$179)))","v":"2023-08-19"},{"$f":"IF(V179=\"\",\"\",DATE($C$1,MATCH($B180,Infos!$A$2:$A$13,0),DAY(V$179)))","v":"2023-08-20"},{"$f":"IF(W179=\"\",\"\",DATE($C$1,MATCH($B180,Infos!$A$2:$A$13,0),DAY(W$179)))","v":"2023-08-21"},{"$f":"IF(X179=\"\",\"\",DATE($C$1,MATCH($B180,Infos!$A$2:$A$13,0),DAY(X$179)))","v":"2023-08-22"},{"$f":"IF(Y179=\"\",\"\",DATE($C$1,MATCH($B180,Infos!$A$2:$A$13,0),DAY(Y$179)))","v":"2023-08-23"},{"$f":"IF(Z179=\"\",\"\",DATE($C$1,MATCH($B180,Infos!$A$2:$A$13,0),DAY(Z$179)))","v":"2023-08-24"},{"$f":"IF(AA179=\"\",\"\",DATE($C$1,MATCH($B180,Infos!$A$2:$A$13,0),DAY(AA$179)))","v":"2023-08-25"},{"$f":"IF(AB179=\"\",\"\",DATE($C$1,MATCH($B180,Infos!$A$2:$A$13,0),DAY(AB$179)))","v":"2023-08-26"},{"$f":"IF(AC179=\"\",\"\",DATE($C$1,MATCH($B180,Infos!$A$2:$A$13,0),DAY(AC$179)))","v":"2023-08-27"},{"$f":"IF(AD179=\"\",\"\",DATE($C$1,MATCH($B180,Infos!$A$2:$A$13,0),DAY(AD$179)))","v":"2023-08-28"},{"$f":"IF(AE179=\"\",\"\",DATE($C$1,MATCH($B180,Infos!$A$2:$A$13,0),DAY(AE$179)))","v":"2023-08-29"},{"$f":"IF(AF179=\"\",\"\",DATE($C$1,MATCH($B180,Infos!$A$2:$A$13,0),DAY(AF$179)))","v":"2023-08-30"},{"$f":"IF(AG179=\"\",\"\",DATE($C$1,MATCH($B180,Infos!$A$2:$A$13,0),DAY(AG$179)))","v":"2023-08-31"}]
[null,"WE",{"$f":"IF(C179<>\"\",IF(COUNTIF('Jours fériés'!$B$3:$B$15,Planning!C181),8,WEEKDAY(C181,2)),\"\")","v":2},{"$f":"IF(D179<>\"\",IF(COUNTIF('Jours fériés'!$B$3:$B$15,Planning!D181),8,WEEKDAY(D181,2)),\"\")","v":3},{"$f":"IF(E179<>\"\",IF(COUNTIF('Jours fériés'!$B$3:$B$15,Planning!E181),8,WEEKDAY(E181,2)),\"\")","v":4},{"$f":"IF(F179<>\"\",IF(COUNTIF('Jours fériés'!$B$3:$B$15,Planning!F181),8,WEEKDAY(F181,2)),\"\")","v":5},{"$f":"IF(G179<>\"\",IF(COUNTIF('Jours fériés'!$B$3:$B$15,Planning!G181),8,WEEKDAY(G181,2)),\"\")","v":6},{"$f":"IF(H179<>\"\",IF(COUNTIF('Jours fériés'!$B$3:$B$15,Planning!H181),8,WEEKDAY(H181,2)),\"\")","v":7},{"$f":"IF(I179<>\"\",IF(COUNTIF('Jours fériés'!$B$3:$B$15,Planning!I181),8,WEEKDAY(I181,2)),\"\")","v":1},{"$f":"IF(J179<>\"\",IF(COUNTIF('Jours fériés'!$B$3:$B$15,Planning!J181),8,WEEKDAY(J181,2)),\"\")","v":2},{"$f":"IF(K179<>\"\",IF(COUNTIF('Jours fériés'!$B$3:$B$15,Planning!K181),8,WEEKDAY(K181,2)),\"\")","v":3},{"$f":"IF(L179<>\"\",IF(COUNTIF('Jours fériés'!$B$3:$B$15,Planning!L181),8,WEEKDAY(L181,2)),\"\")","v":4},{"$f":"IF(M179<>\"\",IF(COUNTIF('Jours fériés'!$B$3:$B$15,Planning!M181),8,WEEKDAY(M181,2)),\"\")","v":5},{"$f":"IF(N179<>\"\",IF(COUNTIF('Jours fériés'!$B$3:$B$15,Planning!N181),8,WEEKDAY(N181,2)),\"\")","v":6},{"$f":"IF(O179<>\"\",IF(COUNTIF('Jours fériés'!$B$3:$B$15,Planning!O181),8,WEEKDAY(O181,2)),\"\")","v":7},{"$f":"IF(P179<>\"\",IF(COUNTIF('Jours fériés'!$B$3:$B$15,Planning!P181),8,WEEKDAY(P181,2)),\"\")","v":1},{"$f":"IF(Q179<>\"\",IF(COUNTIF('Jours fériés'!$B$3:$B$15,Planning!Q181),8,WEEKDAY(Q181,2)),\"\")","v":8},{"$f":"IF(R179<>\"\",IF(COUNTIF('Jours fériés'!$B$3:$B$15,Planning!R181),8,WEEKDAY(R181,2)),\"\")","v":3},{"$f":"IF(S179<>\"\",IF(COUNTIF('Jours fériés'!$B$3:$B$15,Planning!S181),8,WEEKDAY(S181,2)),\"\")","v":4},{"$f":"IF(T179<>\"\",IF(COUNTIF('Jours fériés'!$B$3:$B$15,Planning!T181),8,WEEKDAY(T181,2)),\"\")","v":5},{"$f":"IF(U179<>\"\",IF(COUNTIF('Jours fériés'!$B$3:$B$15,Planning!U181),8,WEEKDAY(U181,2)),\"\")","v":6},{"$f":"IF(V179<>\"\",IF(COUNTIF('Jours fériés'!$B$3:$B$15,Planning!V181),8,WEEKDAY(V181,2)),\"\")","v":7},{"$f":"IF(W179<>\"\",IF(COUNTIF('Jours fériés'!$B$3:$B$15,Planning!W181),8,WEEKDAY(W181,2)),\"\")","v":1},{"$f":"IF(X179<>\"\",IF(COUNTIF('Jours fériés'!$B$3:$B$15,Planning!X181),8,WEEKDAY(X181,2)),\"\")","v":2},{"$f":"IF(Y179<>\"\",IF(COUNTIF('Jours fériés'!$B$3:$B$15,Planning!Y181),8,WEEKDAY(Y181,2)),\"\")","v":3},{"$f":"IF(Z179<>\"\",IF(COUNTIF('Jours fériés'!$B$3:$B$15,Planning!Z181),8,WEEKDAY(Z181,2)),\"\")","v":4},{"$f":"IF(AA179<>\"\",IF(COUNTIF('Jours fériés'!$B$3:$B$15,Planning!AA181),8,WEEKDAY(AA181,2)),\"\")","v":5},{"$f":"IF(AB179<>\"\",IF(COUNTIF('Jours fériés'!$B$3:$B$15,Planning!AB181),8,WEEKDAY(AB181,2)),\"\")","v":6},{"$f":"IF(AC179<>\"\",IF(COUNTIF('Jours fériés'!$B$3:$B$15,Planning!AC181),8,WEEKDAY(AC181,2)),\"\")","v":7},{"$f":"IF(AD179<>\"\",IF(COUNTIF('Jours fériés'!$B$3:$B$15,Planning!AD181),8,WEEKDAY(AD181,2)),\"\")","v":1},{"$f":"IF(AE179<>\"\",IF(COUNTIF('Jours fériés'!$B$3:$B$15,Planning!AE181),8,WEEKDAY(AE181,2)),\"\")","v":2},{"$f":"IF(AF179<>\"\",IF(COUNTIF('Jours fériés'!$B$3:$B$15,Planning!AF181),8,WEEKDAY(AF181,2)),\"\")","v":3},{"$f":"IF(AG179<>\"\",IF(COUNTIF('Jours fériés'!$B$3:$B$15,Planning!AG181),8,WEEKDAY(AG181,2)),\"\")","v":4}]
[null,"VACANCES",{"$f":"IF(SUMPRODUCT((C179>=datdeb)*(C179<=datfin))=1,\"vac\",\"\")","v":"vac"},{"$f":"IF(SUMPRODUCT((D179>=datdeb)*(D179<=datfin))=1,\"vac\",\"\")","v":"vac"},{"$f":"IF(SUMPRODUCT((E179>=datdeb)*(E179<=datfin))=1,\"vac\",\"\")","v":"vac"},{"$f":"IF(SUMPRODUCT((F179>=datdeb)*(F179<=datfin))=1,\"vac\",\"\")","v":"vac"},{"$f":"IF(SUMPRODUCT((G179>=datdeb)*(G179<=datfin))=1,\"vac\",\"\")","v":"vac"},{"$f":"IF(SUMPRODUCT((H179>=datdeb)*(H179<=datfin))=1,\"vac\",\"\")","v":"vac"},{"$f":"IF(SUMPRODUCT((I179>=datdeb)*(I179<=datfin))=1,\"vac\",\"\")","v":"vac"},{"$f":"IF(SUMPRODUCT((J179>=datdeb)*(J179<=datfin))=1,\"vac\",\"\")","v":"vac"},{"$f":"IF(SUMPRODUCT((K179>=datdeb)*(K179<=datfin))=1,\"vac\",\"\")","v":"vac"},{"$f":"IF(SUMPRODUCT((L179>=datdeb)*(L179<=datfin))=1,\"vac\",\"\")","v":"vac"},{"$f":"IF(SUMPRODUCT((M179>=datdeb)*(M179<=datfin))=1,\"vac\",\"\")","v":"vac"},{"$f":"IF(SUMPRODUCT((N179>=datdeb)*(N179<=datfin))=1,\"vac\",\"\")","v":"vac"},{"$f":"IF(SUMPRODUCT((O179>=datdeb)*(O179<=datfin))=1,\"vac\",\"\")","v":"vac"},{"$f":"IF(SUMPRODUCT((P179>=datdeb)*(P179<=datfin))=1,\"vac\",\"\")","v":"vac"},{"$f":"IF(SUMPRODUCT((Q179>=datdeb)*(Q179<=datfin))=1,\"vac\",\"\")","v":"vac"},{"$f":"IF(SUMPRODUCT((R179>=datdeb)*(R179<=datfin))=1,\"vac\",\"\")","v":"vac"},{"$f":"IF(SUMPRODUCT((S179>=datdeb)*(S179<=datfin))=1,\"vac\",\"\")","v":"vac"},{"$f":"IF(SUMPRODUCT((T179>=datdeb)*(T179<=datfin))=1,\"vac\",\"\")","v":"vac"},{"$f":"IF(SUMPRODUCT((U179>=datdeb)*(U179<=datfin))=1,\"vac\",\"\")","v":"vac"},{"$f":"IF(SUMPRODUCT((V179>=datdeb)*(V179<=datfin))=1,\"vac\",\"\")","v":"vac"},{"$f":"IF(SUMPRODUCT((W179>=datdeb)*(W179<=datfin))=1,\"vac\",\"\")","v":"vac"},{"$f":"IF(SUMPRODUCT((X179>=datdeb)*(X179<=datfin))=1,\"vac\",\"\")","v":"vac"},{"$f":"IF(SUMPRODUCT((Y179>=datdeb)*(Y179<=datfin))=1,\"vac\",\"\")","v":"vac"},{"$f":"IF(SUMPRODUCT((Z179>=datdeb)*(Z179<=datfin))=1,\"vac\",\"\")","v":"vac"},{"$f":"IF(SUMPRODUCT((AA179>=datdeb)*(AA179<=datfin))=1,\"vac\",\"\")","v":"vac"},{"$f":"IF(SUMPRODUCT((AB179>=datdeb)*(AB179<=datfin))=1,\"vac\",\"\")","v":"vac"},{"$f":"IF(SUMPRODUCT((AC179>=datdeb)*(AC179<=datfin))=1,\"vac\",\"\")","v":"vac"},{"$f":"IF(SUMPRODUCT((AD179>=datdeb)*(AD179<=datfin))=1,\"vac\",\"\")","v":"vac"},{"$f":"IF(SUMPRODUCT((AE179>=datdeb)*(AE179<=datfin))=1,\"vac\",\"\")","v":"vac"},{"$f":"IF(SUMPRODUCT((AF179>=datdeb)*(AF179<=datfin))=1,\"vac\",\"\")","v":"vac"},{"$f":"IF(SUMPRODUCT((AG179>=datdeb)*(AG179<=datfin))=1,\"vac\",\"\")","v":"vac"}]
[null,null,{"$f":"IFERROR(_xlfn.SWITCH($B$3,\"C1\",INDEX(Infos_2!$D$2:$D$1097,MATCH(C179,Infos_2!$C$2:$C$1097,0),1),\"C2\",INDEX(Infos_2!$G$2:$G$1097,MATCH(C179,Infos_2!$F$2:$F$1097,0), ,1),\"H\",INDEX(Infos_2!$J$2:$J$1097,MATCH(C179,Infos_2!$I$2:$I$1097,0), ,1),\"H1\",INDEX(Infos_2!$M$2:$M$1097,MATCH(C179,Infos_2!$L$2:$L$1097,0), ,1),\"H2\",INDEX(Infos_2!$P$2:$P$1097,MATCH(C179,Infos_2!$O$2:$O$1097,0), ,1)),\"\")","v":"T"},{"$f":"IFERROR(_xlfn.SWITCH($B$3,\"C1\",INDEX(Infos_2!$D$2:$D$1097,MATCH(D179,Infos_2!$C$2:$C$1097,0),1),\"C2\",INDEX(Infos_2!$G$2:$G$1097,MATCH(D179,Infos_2!$F$2:$F$1097,0), ,1),\"H\",INDEX(Infos_2!$J$2:$J$1097,MATCH(D179,Infos_2!$I$2:$I$1097,0), ,1),\"H1\",INDEX(Infos_2!$M$2:$M$1097,MATCH(D179,Infos_2!$L$2:$L$1097,0), ,1),\"H2\",INDEX(Infos_2!$P$2:$P$1097,MATCH(D179,Infos_2!$O$2:$O$1097,0), ,1)),\"\")","v":"T"},{"$f":"IFERROR(_xlfn.SWITCH($B$3,\"C1\",INDEX(Infos_2!$D$2:$D$1097,MATCH(E179,Infos_2!$C$2:$C$1097,0),1),\"C2\",INDEX(Infos_2!$G$2:$G$1097,MATCH(E179,Infos_2!$F$2:$F$1097,0), ,1),\"H\",INDEX(Infos_2!$J$2:$J$1097,MATCH(E179,Infos_2!$I$2:$I$1097,0), ,1),\"H1\",INDEX(Infos_2!$M$2:$M$1097,MATCH(E179,Infos_2!$L$2:$L$1097,0), ,1),\"H2\",INDEX(Infos_2!$P$2:$P$1097,MATCH(E179,Infos_2!$O$2:$O$1097,0), ,1)),\"\")","v":"R"},{"$f":"IFERROR(_xlfn.SWITCH($B$3,\"C1\",INDEX(Infos_2!$D$2:$D$1097,MATCH(F179,Infos_2!$C$2:$C$1097,0),1),\"C2\",INDEX(Infos_2!$G$2:$G$1097,MATCH(F179,Infos_2!$F$2:$F$1097,0), ,1),\"H\",INDEX(Infos_2!$J$2:$J$1097,MATCH(F179,Infos_2!$I$2:$I$1097,0), ,1),\"H1\",INDEX(Infos_2!$M$2:$M$1097,MATCH(F179,Infos_2!$L$2:$L$1097,0), ,1),\"H2\",INDEX(Infos_2!$P$2:$P$1097,MATCH(F179,Infos_2!$O$2:$O$1097,0), ,1)),\"\")","v":"R"},{"$f":"IFERROR(_xlfn.SWITCH($B$3,\"C1\",INDEX(Infos_2!$D$2:$D$1097,MATCH(G179,Infos_2!$C$2:$C$1097,0),1),\"C2\",INDEX(Infos_2!$G$2:$G$1097,MATCH(G179,Infos_2!$F$2:$F$1097,0), ,1),\"H\",INDEX(Infos_2!$J$2:$J$1097,MATCH(G179,Infos_2!$I$2:$I$1097,0), ,1),\"H1\",INDEX(Infos_2!$M$2:$M$1097,MATCH(G179,Infos_2!$L$2:$L$1097,0), ,1),\"H2\",INDEX(Infos_2!$P$2:$P$1097,MATCH(G179,Infos_2!$O$2:$O$1097,0), ,1)),\"\")","v":"T"},{"$f":"IFERROR(_xlfn.SWITCH($B$3,\"C1\",INDEX(Infos_2!$D$2:$D$1097,MATCH(H179,Infos_2!$C$2:$C$1097,0),1),\"C2\",INDEX(Infos_2!$G$2:$G$1097,MATCH(H179,Infos_2!$F$2:$F$1097,0), ,1),\"H\",INDEX(Infos_2!$J$2:$J$1097,MATCH(H179,Infos_2!$I$2:$I$1097,0), ,1),\"H1\",INDEX(Infos_2!$M$2:$M$1097,MATCH(H179,Infos_2!$L$2:$L$1097,0), ,1),\"H2\",INDEX(Infos_2!$P$2:$P$1097,MATCH(H179,Infos_2!$O$2:$O$1097,0), ,1)),\"\")","v":"T"},{"$f":"IFERROR(_xlfn.SWITCH($B$3,\"C1\",INDEX(Infos_2!$D$2:$D$1097,MATCH(I179,Infos_2!$C$2:$C$1097,0),1),\"C2\",INDEX(Infos_2!$G$2:$G$1097,MATCH(I179,Infos_2!$F$2:$F$1097,0), ,1),\"H\",INDEX(Infos_2!$J$2:$J$1097,MATCH(I179,Infos_2!$I$2:$I$1097,0), ,1),\"H1\",INDEX(Infos_2!$M$2:$M$1097,MATCH(I179,Infos_2!$L$2:$L$1097,0), ,1),\"H2\",INDEX(Infos_2!$P$2:$P$1097,MATCH(I179,Infos_2!$O$2:$O$1097,0), ,1)),\"\")","v":"T"},{"$f":"IFERROR(_xlfn.SWITCH($B$3,\"C1\",INDEX(Infos_2!$D$2:$D$1097,MATCH(J179,Infos_2!$C$2:$C$1097,0),1),\"C2\",INDEX(Infos_2!$G$2:$G$1097,MATCH(J179,Infos_2!$F$2:$F$1097,0), ,1),\"H\",INDEX(Infos_2!$J$2:$J$1097,MATCH(J179,Infos_2!$I$2:$I$1097,0), ,1),\"H1\",INDEX(Infos_2!$M$2:$M$1097,MATCH(J179,Infos_2!$L$2:$L$1097,0), ,1),\"H2\",INDEX(Infos_2!$P$2:$P$1097,MATCH(J179,Infos_2!$O$2:$O$1097,0), ,1)),\"\")","v":"T"},{"$f":"IFERROR(_xlfn.SWITCH($B$3,\"C1\",INDEX(Infos_2!$D$2:$D$1097,MATCH(K179,Infos_2!$C$2:$C$1097,0),1),\"C2\",INDEX(Infos_2!$G$2:$G$1097,MATCH(K179,Infos_2!$F$2:$F$1097,0), ,1),\"H\",INDEX(Infos_2!$J$2:$J$1097,MATCH(K179,Infos_2!$I$2:$I$1097,0), ,1),\"H1\",INDEX(Infos_2!$M$2:$M$1097,MATCH(K179,Infos_2!$L$2:$L$1097,0), ,1),\"H2\",INDEX(Infos_2!$P$2:$P$1097,MATCH(K179,Infos_2!$O$2:$O$1097,0), ,1)),\"\")","v":"T"},{"$f":"IFERROR(_xlfn.SWITCH($B$3,\"C1\",INDEX(Infos_2!$D$2:$D$1097,MATCH(L179,Infos_2!$C$2:$C$1097,0),1),\"C2\",INDEX(Infos_2!$G$2:$G$1097,MATCH(L179,Infos_2!$F$2:$F$1097,0), ,1),\"H\",INDEX(Infos_2!$J$2:$J$1097,MATCH(L179,Infos_2!$I$2:$I$1097,0), ,1),\"H1\",INDEX(Infos_2!$M$2:$M$1097,MATCH(L179,Infos_2!$L$2:$L$1097,0), ,1),\"H2\",INDEX(Infos_2!$P$2:$P$1097,MATCH(L179,Infos_2!$O$2:$O$1097,0), ,1)),\"\")","v":"R"},{"$f":"IFERROR(_xlfn.SWITCH($B$3,\"C1\",INDEX(Infos_2!$D$2:$D$1097,MATCH(M179,Infos_2!$C$2:$C$1097,0),1),\"C2\",INDEX(Infos_2!$G$2:$G$1097,MATCH(M179,Infos_2!$F$2:$F$1097,0), ,1),\"H\",INDEX(Infos_2!$J$2:$J$1097,MATCH(M179,Infos_2!$I$2:$I$1097,0), ,1),\"H1\",INDEX(Infos_2!$M$2:$M$1097,MATCH(M179,Infos_2!$L$2:$L$1097,0), ,1),\"H2\",INDEX(Infos_2!$P$2:$P$1097,MATCH(M179,Infos_2!$O$2:$O$1097,0), ,1)),\"\")","v":"R"},{"$f":"IFERROR(_xlfn.SWITCH($B$3,\"C1\",INDEX(Infos_2!$D$2:$D$1097,MATCH(N179,Infos_2!$C$2:$C$1097,0),1),\"C2\",INDEX(Infos_2!$G$2:$G$1097,MATCH(N179,Infos_2!$F$2:$F$1097,0), ,1),\"H\",INDEX(Infos_2!$J$2:$J$1097,MATCH(N179,Infos_2!$I$2:$I$1097,0), ,1),\"H1\",INDEX(Infos_2!$M$2:$M$1097,MATCH(N179,Infos_2!$L$2:$L$1097,0), ,1),\"H2\",INDEX(Infos_2!$P$2:$P$1097,MATCH(N179,Infos_2!$O$2:$O$1097,0), ,1)),\"\")","v":"T"},{"$f":"IFERROR(_xlfn.SWITCH($B$3,\"C1\",INDEX(Infos_2!$D$2:$D$1097,MATCH(O179,Infos_2!$C$2:$C$1097,0),1),\"C2\",INDEX(Infos_2!$G$2:$G$1097,MATCH(O179,Infos_2!$F$2:$F$1097,0), ,1),\"H\",INDEX(Infos_2!$J$2:$J$1097,MATCH(O179,Infos_2!$I$2:$I$1097,0), ,1),\"H1\",INDEX(Infos_2!$M$2:$M$1097,MATCH(O179,Infos_2!$L$2:$L$1097,0), ,1),\"H2\",INDEX(Infos_2!$P$2:$P$1097,MATCH(O179,Infos_2!$O$2:$O$1097,0), ,1)),\"\")","v":"T"},{"$f":"IFERROR(_xlfn.SWITCH($B$3,\"C1\",INDEX(Infos_2!$D$2:$D$1097,MATCH(P179,Infos_2!$C$2:$C$1097,0),1),\"C2\",INDEX(Infos_2!$G$2:$G$1097,MATCH(P179,Infos_2!$F$2:$F$1097,0), ,1),\"H\",INDEX(Infos_2!$J$2:$J$1097,MATCH(P179,Infos_2!$I$2:$I$1097,0), ,1),\"H1\",INDEX(Infos_2!$M$2:$M$1097,MATCH(P179,Infos_2!$L$2:$L$1097,0), ,1),\"H2\",INDEX(Infos_2!$P$2:$P$1097,MATCH(P179,Infos_2!$O$2:$O$1097,0), ,1)),\"\")","v":"T"},{"$f":"IFERROR(_xlfn.SWITCH($B$3,\"C1\",INDEX(Infos_2!$D$2:$D$1097,MATCH(Q179,Infos_2!$C$2:$C$1097,0),1),\"C2\",INDEX(Infos_2!$G$2:$G$1097,MATCH(Q179,Infos_2!$F$2:$F$1097,0), ,1),\"H\",INDEX(Infos_2!$J$2:$J$1097,MATCH(Q179,Infos_2!$I$2:$I$1097,0), ,1),\"H1\",INDEX(Infos_2!$M$2:$M$1097,MATCH(Q179,Infos_2!$L$2:$L$1097,0), ,1),\"H2\",INDEX(Infos_2!$P$2:$P$1097,MATCH(Q179,Infos_2!$O$2:$O$1097,0), ,1)),\"\")","v":"T"},{"$f":"IFERROR(_xlfn.SWITCH($B$3,\"C1\",INDEX(Infos_2!$D$2:$D$1097,MATCH(R179,Infos_2!$C$2:$C$1097,0),1),\"C2\",INDEX(Infos_2!$G$2:$G$1097,MATCH(R179,Infos_2!$F$2:$F$1097,0), ,1),\"H\",INDEX(Infos_2!$J$2:$J$1097,MATCH(R179,Infos_2!$I$2:$I$1097,0), ,1),\"H1\",INDEX(Infos_2!$M$2:$M$1097,MATCH(R179,Infos_2!$L$2:$L$1097,0), ,1),\"H2\",INDEX(Infos_2!$P$2:$P$1097,MATCH(R179,Infos_2!$O$2:$O$1097,0), ,1)),\"\")","v":"T"},{"$f":"IFERROR(_xlfn.SWITCH($B$3,\"C1\",INDEX(Infos_2!$D$2:$D$1097,MATCH(S179,Infos_2!$C$2:$C$1097,0),1),\"C2\",INDEX(Infos_2!$G$2:$G$1097,MATCH(S179,Infos_2!$F$2:$F$1097,0), ,1),\"H\",INDEX(Infos_2!$J$2:$J$1097,MATCH(S179,Infos_2!$I$2:$I$1097,0), ,1),\"H1\",INDEX(Infos_2!$M$2:$M$1097,MATCH(S179,Infos_2!$L$2:$L$1097,0), ,1),\"H2\",INDEX(Infos_2!$P$2:$P$1097,MATCH(S179,Infos_2!$O$2:$O$1097,0), ,1)),\"\")","v":"R"},{"$f":"IFERROR(_xlfn.SWITCH($B$3,\"C1\",INDEX(Infos_2!$D$2:$D$1097,MATCH(T179,Infos_2!$C$2:$C$1097,0),1),\"C2\",INDEX(Infos_2!$G$2:$G$1097,MATCH(T179,Infos_2!$F$2:$F$1097,0), ,1),\"H\",INDEX(Infos_2!$J$2:$J$1097,MATCH(T179,Infos_2!$I$2:$I$1097,0), ,1),\"H1\",INDEX(Infos_2!$M$2:$M$1097,MATCH(T179,Infos_2!$L$2:$L$1097,0), ,1),\"H2\",INDEX(Infos_2!$P$2:$P$1097,MATCH(T179,Infos_2!$O$2:$O$1097,0), ,1)),\"\")","v":"R"},{"$f":"IFERROR(_xlfn.SWITCH($B$3,\"C1\",INDEX(Infos_2!$D$2:$D$1097,MATCH(U179,Infos_2!$C$2:$C$1097,0),1),\"C2\",INDEX(Infos_2!$G$2:$G$1097,MATCH(U179,Infos_2!$F$2:$F$1097,0), ,1),\"H\",INDEX(Infos_2!$J$2:$J$1097,MATCH(U179,Infos_2!$I$2:$I$1097,0), ,1),\"H1\",INDEX(Infos_2!$M$2:$M$1097,MATCH(U179,Infos_2!$L$2:$L$1097,0), ,1),\"H2\",INDEX(Infos_2!$P$2:$P$1097,MATCH(U179,Infos_2!$O$2:$O$1097,0), ,1)),\"\")","v":"T"},{"$f":"IFERROR(_xlfn.SWITCH($B$3,\"C1\",INDEX(Infos_2!$D$2:$D$1097,MATCH(V179,Infos_2!$C$2:$C$1097,0),1),\"C2\",INDEX(Infos_2!$G$2:$G$1097,MATCH(V179,Infos_2!$F$2:$F$1097,0), ,1),\"H\",INDEX(Infos_2!$J$2:$J$1097,MATCH(V179,Infos_2!$I$2:$I$1097,0), ,1),\"H1\",INDEX(Infos_2!$M$2:$M$1097,MATCH(V179,Infos_2!$L$2:$L$1097,0), ,1),\"H2\",INDEX(Infos_2!$P$2:$P$1097,MATCH(V179,Infos_2!$O$2:$O$1097,0), ,1)),\"\")","v":"T"},{"$f":"IFERROR(_xlfn.SWITCH($B$3,\"C1\",INDEX(Infos_2!$D$2:$D$1097,MATCH(W179,Infos_2!$C$2:$C$1097,0),1),\"C2\",INDEX(Infos_2!$G$2:$G$1097,MATCH(W179,Infos_2!$F$2:$F$1097,0), ,1),\"H\",INDEX(Infos_2!$J$2:$J$1097,MATCH(W179,Infos_2!$I$2:$I$1097,0), ,1),\"H1\",INDEX(Infos_2!$M$2:$M$1097,MATCH(W179,Infos_2!$L$2:$L$1097,0), ,1),\"H2\",INDEX(Infos_2!$P$2:$P$1097,MATCH(W179,Infos_2!$O$2:$O$1097,0), ,1)),\"\")","v":"T"},{"$f":"IFERROR(_xlfn.SWITCH($B$3,\"C1\",INDEX(Infos_2!$D$2:$D$1097,MATCH(X179,Infos_2!$C$2:$C$1097,0),1),\"C2\",INDEX(Infos_2!$G$2:$G$1097,MATCH(X179,Infos_2!$F$2:$F$1097,0), ,1),\"H\",INDEX(Infos_2!$J$2:$J$1097,MATCH(X179,Infos_2!$I$2:$I$1097,0), ,1),\"H1\",INDEX(Infos_2!$M$2:$M$1097,MATCH(X179,Infos_2!$L$2:$L$1097,0), ,1),\"H2\",INDEX(Infos_2!$P$2:$P$1097,MATCH(X179,Infos_2!$O$2:$O$1097,0), ,1)),\"\")","v":"T"},{"$f":"IFERROR(_xlfn.SWITCH($B$3,\"C1\",INDEX(Infos_2!$D$2:$D$1097,MATCH(Y179,Infos_2!$C$2:$C$1097,0),1),\"C2\",INDEX(Infos_2!$G$2:$G$1097,MATCH(Y179,Infos_2!$F$2:$F$1097,0), ,1),\"H\",INDEX(Infos_2!$J$2:$J$1097,MATCH(Y179,Infos_2!$I$2:$I$1097,0), ,1),\"H1\",INDEX(Infos_2!$M$2:$M$1097,MATCH(Y179,Infos_2!$L$2:$L$1097,0), ,1),\"H2\",INDEX(Infos_2!$P$2:$P$1097,MATCH(Y179,Infos_2!$O$2:$O$1097,0), ,1)),\"\")","v":"T"},{"$f":"IFERROR(_xlfn.SWITCH($B$3,\"C1\",INDEX(Infos_2!$D$2:$D$1097,MATCH(Z179,Infos_2!$C$2:$C$1097,0),1),\"C2\",INDEX(Infos_2!$G$2:$G$1097,MATCH(Z179,Infos_2!$F$2:$F$1097,0), ,1),\"H\",INDEX(Infos_2!$J$2:$J$1097,MATCH(Z179,Infos_2!$I$2:$I$1097,0), ,1),\"H1\",INDEX(Infos_2!$M$2:$M$1097,MATCH(Z179,Infos_2!$L$2:$L$1097,0), ,1),\"H2\",INDEX(Infos_2!$P$2:$P$1097,MATCH(Z179,Infos_2!$O$2:$O$1097,0), ,1)),\"\")","v":"R"},{"$f":"IFERROR(_xlfn.SWITCH($B$3,\"C1\",INDEX(Infos_2!$D$2:$D$1097,MATCH(AA179,Infos_2!$C$2:$C$1097,0),1),\"C2\",INDEX(Infos_2!$G$2:$G$1097,MATCH(AA179,Infos_2!$F$2:$F$1097,0), ,1),\"H\",INDEX(Infos_2!$J$2:$J$1097,MATCH(AA179,Infos_2!$I$2:$I$1097,0), ,1),\"H1\",INDEX(Infos_2!$M$2:$M$1097,MATCH(AA179,Infos_2!$L$2:$L$1097,0), ,1),\"H2\",INDEX(Infos_2!$P$2:$P$1097,MATCH(AA179,Infos_2!$O$2:$O$1097,0), ,1)),\"\")","v":"R"},{"$f":"IFERROR(_xlfn.SWITCH($B$3,\"C1\",INDEX(Infos_2!$D$2:$D$1097,MATCH(AB179,Infos_2!$C$2:$C$1097,0),1),\"C2\",INDEX(Infos_2!$G$2:$G$1097,MATCH(AB179,Infos_2!$F$2:$F$1097,0), ,1),\"H\",INDEX(Infos_2!$J$2:$J$1097,MATCH(AB179,Infos_2!$I$2:$I$1097,0), ,1),\"H1\",INDEX(Infos_2!$M$2:$M$1097,MATCH(AB179,Infos_2!$L$2:$L$1097,0), ,1),\"H2\",INDEX(Infos_2!$P$2:$P$1097,MATCH(AB179,Infos_2!$O$2:$O$1097,0), ,1)),\"\")","v":"T"},{"$f":"IFERROR(_xlfn.SWITCH($B$3,\"C1\",INDEX(Infos_2!$D$2:$D$1097,MATCH(AC179,Infos_2!$C$2:$C$1097,0),1),\"C2\",INDEX(Infos_2!$G$2:$G$1097,MATCH(AC179,Infos_2!$F$2:$F$1097,0), ,1),\"H\",INDEX(Infos_2!$J$2:$J$1097,MATCH(AC179,Infos_2!$I$2:$I$1097,0), ,1),\"H1\",INDEX(Infos_2!$M$2:$M$1097,MATCH(AC179,Infos_2!$L$2:$L$1097,0), ,1),\"H2\",INDEX(Infos_2!$P$2:$P$1097,MATCH(AC179,Infos_2!$O$2:$O$1097,0), ,1)),\"\")","v":"T"},{"$f":"IFERROR(_xlfn.SWITCH($B$3,\"C1\",INDEX(Infos_2!$D$2:$D$1097,MATCH(AD179,Infos_2!$C$2:$C$1097,0),1),\"C2\",INDEX(Infos_2!$G$2:$G$1097,MATCH(AD179,Infos_2!$F$2:$F$1097,0), ,1),\"H\",INDEX(Infos_2!$J$2:$J$1097,MATCH(AD179,Infos_2!$I$2:$I$1097,0), ,1),\"H1\",INDEX(Infos_2!$M$2:$M$1097,MATCH(AD179,Infos_2!$L$2:$L$1097,0), ,1),\"H2\",INDEX(Infos_2!$P$2:$P$1097,MATCH(AD179,Infos_2!$O$2:$O$1097,0), ,1)),\"\")","v":"T"},{"$f":"IFERROR(_xlfn.SWITCH($B$3,\"C1\",INDEX(Infos_2!$D$2:$D$1097,MATCH(AE179,Infos_2!$C$2:$C$1097,0),1),\"C2\",INDEX(Infos_2!$G$2:$G$1097,MATCH(AE179,Infos_2!$F$2:$F$1097,0), ,1),\"H\",INDEX(Infos_2!$J$2:$J$1097,MATCH(AE179,Infos_2!$I$2:$I$1097,0), ,1),\"H1\",INDEX(Infos_2!$M$2:$M$1097,MATCH(AE179,Infos_2!$L$2:$L$1097,0), ,1),\"H2\",INDEX(Infos_2!$P$2:$P$1097,MATCH(AE179,Infos_2!$O$2:$O$1097,0), ,1)),\"\")","v":"T"},{"$f":"IFERROR(_xlfn.SWITCH($B$3,\"C1\",INDEX(Infos_2!$D$2:$D$1097,MATCH(AF179,Infos_2!$C$2:$C$1097,0),1),\"C2\",INDEX(Infos_2!$G$2:$G$1097,MATCH(AF179,Infos_2!$F$2:$F$1097,0), ,1),\"H\",INDEX(Infos_2!$J$2:$J$1097,MATCH(AF179,Infos_2!$I$2:$I$1097,0), ,1),\"H1\",INDEX(Infos_2!$M$2:$M$1097,MATCH(AF179,Infos_2!$L$2:$L$1097,0), ,1),\"H2\",INDEX(Infos_2!$P$2:$P$1097,MATCH(AF179,Infos_2!$O$2:$O$1097,0), ,1)),\"\")","v":"T"},{"$f":"IFERROR(_xlfn.SWITCH($B$3,\"C1\",INDEX(Infos_2!$D$2:$D$1097,MATCH(AG179,Infos_2!$C$2:$C$1097,0),1),\"C2\",INDEX(Infos_2!$G$2:$G$1097,MATCH(AG179,Infos_2!$F$2:$F$1097,0), ,1),\"H\",INDEX(Infos_2!$J$2:$J$1097,MATCH(AG179,Infos_2!$I$2:$I$1097,0), ,1),\"H1\",INDEX(Infos_2!$M$2:$M$1097,MATCH(AG179,Infos_2!$L$2:$L$1097,0), ,1),\"H2\",INDEX(Infos_2!$P$2:$P$1097,MATCH(AG179,Infos_2!$O$2:$O$1097,0), ,1)),\"\")","v":"R"}]
[1,{"$f":"bloc_nom","v":"NOM 50 Prénom 50"}]
[2,"NOM 51 Prénom 51"]
[3,"NOM 52 Prénom 52"]
[4,"NOM 53 Prénom 53"]
[5,"NOM 54 Prénom 54"]
[6,"NOM 55 Prénom 55"]
[7,"NOM 56 Prénom 56"]
[8,"NOM 57 Prénom 57"]
[9,"NOM 58 Prénom 58"]
[10,""]
[11,""]
[12,""]
[13,""]
[14,""]
[15,""]
[]
[null,null,{"$f":"EDATE($C179,1)","v":"2024-09-01"},{"$f":"C201+1","v":"2024-09-02"},"2024-09-03","2024-09-04","2024-09-05","2024-09-06","2024-09-07","2024-09-08","2024-09-09","2024-09-10","2024-09-11","2024-09-12","2024-09-13","2024-09-14","2024-09-15","2024-09-16","2024-09-17","2024-09-18","2024-09-19","2024-09-20","2024-09-21","2024-09-22","2024-09-23","2024-09-24","2024-09-25","2024-09-26","2024-09-27","2024-09-28",{"$f":"IF(MONTH($AD201)<>MONTH(AD201+1),\"\",AD201+1)","v":"2024-09-29"},{"$f":"IF(AE201=\"\",\"\",IF(MONTH(AE201+1)<>MONTH(AE201),\"\",AE201+1))","v":"2024-09-30"},{"$f":"IF(AF201=\"\",\"\",IF(MONTH(AF201+1)<>MONTH(AF201),\"\",AF201+1))","v":""}]
[null,{"$f":"INDEX(Infos!$A$2:$B$13,MATCH(B180,Infos!$A$2:$A$13,0)+1,1)","v":"Septembre"},{"$f":"C201","v":"2024-09-01"},"2024-09-02","2024-09-03","2024-09-04","2024-09-05","2024-09-06","2024-09-07","2024-09-08","2024-09-09","2024-09-10","2024-09-11","2024-09-12","2024-09-13","2024-09-14","2024-09-15","2024-09-16","2024-09-17","2024-09-18","2024-09-19","2024-09-20","2024-09-21","2024-09-22","2024-09-23","2024-09-24","2024-09-25","2024-09-26","2024-09-27","2024-09-28","2024-09-29","2024-09-30",""]
[null,"Férié",{"$f":"IF(C201=\"\",\"\",DATE($C$1,MATCH($B202,Infos!$A$2:$A$13,0),DAY(C$201)))","v":"2023-09-01"},{"$f":"IF(D201=\"\",\"\",DATE($C$1,MATCH($B202,Infos!$A$2:$A$13,0),DAY(D$201)))","v":"2023-09-02"},{"$f":"IF(E201=\"\",\"\",DATE($C$1,MATCH($B202,Infos!$A$2:$A$13,0),DAY(E$201)))","v":"2023-09-03"},{"$f":"IF(F201=\"\",\"\",DATE($C$1,MATCH($B202,Infos!$A$2:$A$13,0),DAY(F$201)))","v":"2023-09-04"},{"$f":"IF(G201=\"\",\"\",DATE($C$1,MATCH($B202,Infos!$A$2:$A$13,0),DAY(G$201)))","v":"2023-09-05"},{"$f":"IF(H201=\"\",\"\",DATE($C$1,MATCH($B202,Infos!$A$2:$A$13,0),DAY(H$201)))","v":"2023-09-06"},{"$f":"IF(I201=\"\",\"\",DATE($C$1,MATCH($B202,Infos!$A$2:$A$13,0),DAY(I$201)))","v":"2023-09-07"},{"$f":"IF(J201=\"\",\"\",DATE($C$1,MATCH($B202,Infos!$A$2:$A$13,0),DAY(J$201)))","v":"2023-09-08"},{"$f":"IF(K201=\"\",\"\",DATE($C$1,MATCH($B202,Infos!$A$2:$A$13,0),DAY(K$201)))","v":"2023-09-09"},{"$f":"IF(L201=\"\",\"\",DATE($C$1,MATCH($B202,Infos!$A$2:$A$13,0),DAY(L$201)))","v":"2023-09-10"},{"$f":"IF(M201=\"\",\"\",DATE($C$1,MATCH($B202,Infos!$A$2:$A$13,0),DAY(M$201)))","v":"2023-09-11"},{"$f":"IF(N201=\"\",\"\",DATE($C$1,MATCH($B202,Infos!$A$2:$A$13,0),DAY(N$201)))","v":"2023-09-12"},{"$f":"IF(O201=\"\",\"\",DATE($C$1,MATCH($B202,Infos!$A$2:$A$13,0),DAY(O$201)))","v":"2023-09-13"},{"$f":"IF(P201=\"\",\"\",DATE($C$1,MATCH($B202,Infos!$A$2:$A$13,0),DAY(P$201)))","v":"2023-09-14"},{"$f":"IF(Q201=\"\",\"\",DATE($C$1,MATCH($B202,Infos!$A$2:$A$13,0),DAY(Q$201)))","v":"2023-09-15"},{"$f":"IF(R201=\"\",\"\",DATE($C$1,MATCH($B202,Infos!$A$2:$A$13,0),DAY(R$201)))","v":"2023-09-16"},{"$f":"IF(S201=\"\",\"\",DATE($C$1,MATCH($B202,Infos!$A$2:$A$13,0),DAY(S$201)))","v":"2023-09-17"},{"$f":"IF(T201=\"\",\"\",DATE($C$1,MATCH($B202,Infos!$A$2:$A$13,0),DAY(T$201)))","v":"2023-09-18"},{"$f":"IF(U201=\"\",\"\",DATE($C$1,MATCH($B202,Infos!$A$2:$A$13,0),DAY(U$201)))","v":"2023-09-19"},{"$f":"IF(V201=\"\",\"\",DATE($C$1,MATCH($B202,Infos!$A$2:$A$13,0),DAY(V$201)))","v":"2023-09-20"},{"$f":"IF(W201=\"\",\"\",DATE($C$1,MATCH($B202,Infos!$A$2:$A$13,0),DAY(W$201)))","v":"2023-09-21"},{"$f":"IF(X201=\"\",\"\",DATE($C$1,MATCH($B202,Infos!$A$2:$A$13,0),DAY(X$201)))","v":"2023-09-22"},{"$f":"IF(Y201=\"\",\"\",DATE($C$1,MATCH($B202,Infos!$A$2:$A$13,0),DAY(Y$201)))","v":"2023-09-23"},{"$f":"IF(Z201=\"\",\"\",DATE($C$1,MATCH($B202,Infos!$A$2:$A$13,0),DAY(Z$201)))","v":"2023-09-24"},{"$f":"IF(AA201=\"\",\"\",DATE($C$1,MATCH($B202,Infos!$A$2:$A$13,0),DAY(AA$201)))","v":"2023-09-25"},{"$f":"IF(AB201=\"\",\"\",DATE($C$1,MATCH($B202,Infos!$A$2:$A$13,0),DAY(AB$201)))","v":"2023-09-26"},{"$f":"IF(AC201=\"\",\"\",DATE($C$1,MATCH($B202,Infos!$A$2:$A$13,0),DAY(AC$201)))","v":"2023-09-27"},{"$f":"IF(AD201=\"\",\"\",DATE($C$1,MATCH($B202,Infos!$A$2:$A$13,0),DAY(AD$201)))","v":"2023-09-28"},{"$f":"IF(AE201=\"\",\"\",DATE($C$1,MATCH($B202,Infos!$A$2:$A$13,0),DAY(AE$201)))","v":"2023-09-29"},{"$f":"IF(AF201=\"\",\"\",DATE($C$1,MATCH($B202,Infos!$A$2:$A$13,0),DAY(AF$201)))","v":"2023-09-30"},{"$f":"IF(AG201=\"\",\"\",DATE($C$1,MATCH($B202,Infos!$A$2:$A$13,0),DAY(AG$201)))","v":""}]
[null,"WE",{"$f":"IF(C201<>\"\",IF(COUNTIF('Jours fériés'!$B$3:$B$15,Planning!C203),8,WEEKDAY(C203,2)),\"\")","v":5},{"$f":"IF(D201<>\"\",IF(COUNTIF('Jours fériés'!$B$3:$B$15,Planning!D203),8,WEEKDAY(D203,2)),\"\")","v":6},{"$f":"IF(E201<>\"\",IF(COUNTIF('Jours fériés'!$B$3:$B$15,Planning!E203),8,WEEKDAY(E203,2)),\"\")","v":7},{"$f":"IF(F201<>\"\",IF(COUNTIF('Jours fériés'!$B$3:$B$15,Planning!F203),8,WEEKDAY(F203,2)),\"\")","v":1},{"$f":"IF(G201<>\"\",IF(COUNTIF('Jours fériés'!$B$3:$B$15,Planning!G203),8,WEEKDAY(G203,2)),\"\")","v":2},{"$f":"IF(H201<>\"\",IF(COUNTIF('Jours fériés'!$B$3:$B$15,Planning!H203),8,WEEKDAY(H203,2)),\"\")","v":3},{"$f":"IF(I201<>\"\",IF(COUNTIF('Jours fériés'!$B$3:$B$15,Planning!I203),8,WEEKDAY(I203,2)),\"\")","v":4},{"$f":"IF(J201<>\"\",IF(COUNTIF('Jours fériés'!$B$3:$B$15,Planning!J203),8,WEEKDAY(J203,2)),\"\")","v":5},{"$f":"IF(K201<>\"\",IF(COUNTIF('Jours fériés'!$B$3:$B$15,Planning!K203),8,WEEKDAY(K203,2)),\"\")","v":6},{"$f":"IF(L201<>\"\",IF(COUNTIF('Jours fériés'!$B$3:$B$15,Planning!L203),8,WEEKDAY(L203,2)),\"\")","v":7},{"$f":"IF(M201<>\"\",IF(COUNTIF('Jours fériés'!$B$3:$B$15,Planning!M203),8,WEEKDAY(M203,2)),\"\")","v":1},{"$f":"IF(N201<>\"\",IF(COUNTIF('Jours fériés'!$B$3:$B$15,Planning!N203),8,WEEKDAY(N203,2)),\"\")","v":2},{"$f":"IF(O201<>\"\",IF(COUNTIF('Jours fériés'!$B$3:$B$15,Planning!O203),8,WEEKDAY(O203,2)),\"\")","v":3},{"$f":"IF(P201<>\"\",IF(COUNTIF('Jours fériés'!$B$3:$B$15,Planning!P203),8,WEEKDAY(P203,2)),\"\")","v":4},{"$f":"IF(Q201<>\"\",IF(COUNTIF('Jours fériés'!$B$3:$B$15,Planning!Q203),8,WEEKDAY(Q203,2)),\"\")","v":5},{"$f":"IF(R201<>\"\",IF(COUNTIF('Jours fériés'!$B$3:$B$15,Planning!R203),8,WEEKDAY(R203,2)),\"\")","v":6},{"$f":"IF(S201<>\"\",IF(COUNTIF('Jours fériés'!$B$3:$B$15,Planning!S203),8,WEEKDAY(S203,2)),\"\")","v":7},{"$f":"IF(T201<>\"\",IF(COUNTIF('Jours fériés'!$B$3:$B$15,Planning!T203),8,WEEKDAY(T203,2)),\"\")","v":1},{"$f":"IF(U201<>\"\",IF(COUNTIF('Jours fériés'!$B$3:$B$15,Planning!U203),8,WEEKDAY(U203,2)),\"\")","v":2},{"$f":"IF(V201<>\"\",IF(COUNTIF('Jours fériés'!$B$3:$B$15,Planning!V203),8,WEEKDAY(V203,2)),\"\")","v":3},{"$f":"IF(W201<>\"\",IF(COUNTIF('Jours fériés'!$B$3:$B$15,Planning!W203),8,WEEKDAY(W203,2)),\"\")","v":4},{"$f":"IF(X201<>\"\",IF(COUNTIF('Jours fériés'!$B$3:$B$15,Planning!X203),8,WEEKDAY(X203,2)),\"\")","v":5},{"$f":"IF(Y201<>\"\",IF(COUNTIF('Jours fériés'!$B$3:$B$15,Planning!Y203),8,WEEKDAY(Y203,2)),\"\")","v":6},{"$f":"IF(Z201<>\"\",IF(COUNTIF('Jours fériés'!$B$3:$B$15,Planning!Z203),8,WEEKDAY(Z203,2)),\"\")","v":7},{"$f":"IF(AA201<>\"\",IF(COUNTIF('Jours fériés'!$B$3:$B$15,Planning!AA203),8,WEEKDAY(AA203,2)),\"\")","v":1},{"$f":"IF(AB201<>\"\",IF(COUNTIF('Jours fériés'!$B$3:$B$15,Planning!AB203),8,WEEKDAY(AB203,2)),\"\")","v":2},{"$f":"IF(AC201<>\"\",IF(COUNTIF('Jours fériés'!$B$3:$B$15,Planning!AC203),8,WEEKDAY(AC203,2)),\"\")","v":3},{"$f":"IF(AD201<>\"\",IF(COUNTIF('Jours fériés'!$B$3:$B$15,Planning!AD203),8,WEEKDAY(AD203,2)),\"\")","v":4},{"$f":"IF(AE201<>\"\",IF(COUNTIF('Jours fériés'!$B$3:$B$15,Planning!AE203),8,WEEKDAY(AE203,2)),\"\")","v":5},{"$f":"IF(AF201<>\"\",IF(COUNTIF('Jours fériés'!$B$3:$B$15,Planning!AF203),8,WEEKDAY(AF203,2)),\"\")","v":6},{"$f":"IF(AG201<>\"\",IF(COUNTIF('Jours fériés'!$B$3:$B$15,Planning!AG203),8,WEEKDAY(AG203,2)),\"\")","v":""}]
[null,"VACANCES",{"$f":"IF(SUMPRODUCT((C201>=datdeb)*(C201<=datfin))=1,\"vac\",\"\")","v":"vac"},{"$f":"IF(SUMPRODUCT((D201>=datdeb)*(D201<=datfin))=1,\"vac\",\"\")","v":"vac"},{"$f":"IF(SUMPRODUCT((E201>=datdeb)*(E201<=datfin))=1,\"vac\",\"\")","v":""},{"$f":"IF(SUMPRODUCT((F201>=datdeb)*(F201<=datfin))=1,\"vac\",\"\")","v":""},{"$f":"IF(SUMPRODUCT((G201>=datdeb)*(G201<=datfin))=1,\"vac\",\"\")","v":""},{"$f":"IF(SUMPRODUCT((H201>=datdeb)*(H201<=datfin))=1,\"vac\",\"\")","v":""},{"$f":"IF(SUMPRODUCT((I201>=datdeb)*(I201<=datfin))=1,\"vac\",\"\")","v":""},{"$f":"IF(SUMPRODUCT((J201>=datdeb)*(J201<=datfin))=1,\"vac\",\"\")","v":""},{"$f":"IF(SUMPRODUCT((K201>=datdeb)*(K201<=datfin))=1,\"vac\",\"\")","v":""},{"$f":"IF(SUMPRODUCT((L201>=datdeb)*(L201<=datfin))=1,\"vac\",\"\")","v":""},{"$f":"IF(SUMPRODUCT((M201>=datdeb)*(M201<=datfin))=1,\"vac\",\"\")","v":""},{"$f":"IF(SUMPRODUCT((N201>=datdeb)*(N201<=datfin))=1,\"vac\",\"\")","v":""},{"$f":"IF(SUMPRODUCT((O201>=datdeb)*(O201<=datfin))=1,\"vac\",\"\")","v":""},{"$f":"IF(SUMPRODUCT((P201>=datdeb)*(P201<=datfin))=1,\"vac\",\"\")","v":""},{"$f":"IF(SUMPRODUCT((Q201>=datdeb)*(Q201<=datfin))=1,\"vac\",\"\")","v":""},{"$f":"IF(SUMPRODUCT((R201>=datdeb)*(R201<=datfin))=1,\"vac\",\"\")","v":""},{"$f":"IF(SUMPRODUCT((S201>=datdeb)*(S201<=datfin))=1,\"vac\",\"\")","v":""},{"$f":"IF(SUMPRODUCT((T201>=datdeb)*(T201<=datfin))=1,\"vac\",\"\")","v":""},{"$f":"IF(SUMPRODUCT((U201>=datdeb)*(U201<=datfin))=1,\"vac\",\"\")","v":""},{"$f":"IF(SUMPRODUCT((V201>=datdeb)*(V201<=datfin))=1,\"vac\",\"\")","v":""},{"$f":"IF(SUMPRODUCT((W201>=datdeb)*(W201<=datfin))=1,\"vac\",\"\")","v":""},{"$f":"IF(SUMPRODUCT((X201>=datdeb)*(X201<=datfin))=1,\"vac\",\"\")","v":""},{"$f":"IF(SUMPRODUCT((Y201>=datdeb)*(Y201<=datfin))=1,\"vac\",\"\")","v":""},{"$f":"IF(SUMPRODUCT((Z201>=datdeb)*(Z201<=datfin))=1,\"vac\",\"\")","v":""},{"$f":"IF(SUMPRODUCT((AA201>=datdeb)*(AA201<=datfin))=1,\"vac\",\"\")","v":""},{"$f":"IF(SUMPRODUCT((AB201>=datdeb)*(AB201<=datfin))=1,\"vac\",\"\")","v":""},{"$f":"IF(SUMPRODUCT((AC201>=datdeb)*(AC201<=datfin))=1,\"vac\",\"\")","v":""},{"$f":"IF(SUMPRODUCT((AD201>=datdeb)*(AD201<=datfin))=1,\"vac\",\"\")","v":""},{"$f":"IF(SUMPRODUCT((AE201>=datdeb)*(AE201<=datfin))=1,\"vac\",\"\")","v":""},{"$f":"IF(SUMPRODUCT((AF201>=datdeb)*(AF201<=datfin))=1,\"vac\",\"\")","v":""},{"$f":"IF(SUMPRODUCT((AG201>=datdeb)*(AG201<=datfin))=1,\"vac\",\"\")","v":""}]
[null,null,{"$f":"IFERROR(_xlfn.SWITCH($B$3,\"C1\",INDEX(Infos_2!$D$2:$D$1097,MATCH(C201,Infos_2!$C$2:$C$1097,0),1),\"C2\",INDEX(Infos_2!$G$2:$G$1097,MATCH(C201,Infos_2!$F$2:$F$1097,0), ,1),\"H\",INDEX(Infos_2!$J$2:$J$1097,MATCH(C201,Infos_2!$I$2:$I$1097,0), ,1),\"H1\",INDEX(Infos_2!$M$2:$M$1097,MATCH(C201,Infos_2!$L$2:$L$1097,0), ,1),\"H2\",INDEX(Infos_2!$P$2:$P$1097,MATCH(C201,Infos_2!$O$2:$O$1097,0), ,1)),\"\")","v":"R"},{"$f":"IFERROR(_xlfn.SWITCH($B$3,\"C1\",INDEX(Infos_2!$D$2:$D$1097,MATCH(D201,Infos_2!$C$2:$C$1097,0),1),\"C2\",INDEX(Infos_2!$G$2:$G$1097,MATCH(D201,Infos_2!$F$2:$F$1097,0), ,1),\"H\",INDEX(Infos_2!$J$2:$J$1097,MATCH(D201,Infos_2!$I$2:$I$1097,0), ,1),\"H1\",INDEX(Infos_2!$M$2:$M$1097,MATCH(D201,Infos_2!$L$2:$L$1097,0), ,1),\"H2\",INDEX(Infos_2!$P$2:$P$1097,MATCH(D201,Infos_2!$O$2:$O$1097,0), ,1)),\"\")","v":"T"},{"$f":"IFERROR(_xlfn.SWITCH($B$3,\"C1\",INDEX(Infos_2!$D$2:$D$1097,MATCH(E201,Infos_2!$C$2:$C$1097,0),1),\"C2\",INDEX(Infos_2!$G$2:$G$1097,MATCH(E201,Infos_2!$F$2:$F$1097,0), ,1),\"H\",INDEX(Infos_2!$J$2:$J$1097,MATCH(E201,Infos_2!$I$2:$I$1097,0), ,1),\"H1\",INDEX(Infos_2!$M$2:$M$1097,MATCH(E201,Infos_2!$L$2:$L$1097,0), ,1),\"H2\",INDEX(Infos_2!$P$2:$P$1097,MATCH(E201,Infos_2!$O$2:$O$1097,0), ,1)),\"\")","v":"T"},{"$f":"IFERROR(_xlfn.SWITCH($B$3,\"C1\",INDEX(Infos_2!$D$2:$D$1097,MATCH(F201,Infos_2!$C$2:$C$1097,0),1),\"C2\",INDEX(Infos_2!$G$2:$G$1097,MATCH(F201,Infos_2!$F$2:$F$1097,0), ,1),\"H\",INDEX(Infos_2!$J$2:$J$1097,MATCH(F201,Infos_2!$I$2:$I$1097,0), ,1),\"H1\",INDEX(Infos_2!$M$2:$M$1097,MATCH(F201,Infos_2!$L$2:$L$1097,0), ,1),\"H2\",INDEX(Infos_2!$P$2:$P$1097,MATCH(F201,Infos_2!$O$2:$O$1097,0), ,1)),\"\")","v":"T"},{"$f":"IFERROR(_xlfn.SWITCH($B$3,\"C1\",INDEX(Infos_2!$D$2:$D$1097,MATCH(G201,Infos_2!$C$2:$C$1097,0),1),\"C2\",INDEX(Infos_2!$G$2:$G$1097,MATCH(G201,Infos_2!$F$2:$F$1097,0), ,1),\"H\",INDEX(Infos_2!$J$2:$J$1097,MATCH(G201,Infos_2!$I$2:$I$1097,0), ,1),\"H1\",INDEX(Infos_2!$M$2:$M$1097,MATCH(G201,Infos_2!$L$2:$L$1097,0), ,1),\"H2\",INDEX(Infos_2!$P$2:$P$1097,MATCH(G201,Infos_2!$O$2:$O$1097,0), ,1)),\"\")","v":"T"},{"$f":"IFERROR(_xlfn.SWITCH($B$3,\"C1\",INDEX(Infos_2!$D$2:$D$1097,MATCH(H201,Infos_2!$C$2:$C$1097,0),1),\"C2\",INDEX(Infos_2!$G$2:$G$1097,MATCH(H201,Infos_2!$F$2:$F$1097,0), ,1),\"H\",INDEX(Infos_2!$J$2:$J$1097,MATCH(H201,Infos_2!$I$2:$I$1097,0), ,1),\"H1\",INDEX(Infos_2!$M$2:$M$1097,MATCH(H201,Infos_2!$L$2:$L$1097,0), ,1),\"H2\",INDEX(Infos_2!$P$2:$P$1097,MATCH(H201,Infos_2!$O$2:$O$1097,0), ,1)),\"\")","v":"T"},{"$f":"IFERROR(_xlfn.SWITCH($B$3,\"C1\",INDEX(Infos_2!$D$2:$D$1097,MATCH(I201,Infos_2!$C$2:$C$1097,0),1),\"C2\",INDEX(Infos_2!$G$2:$G$1097,MATCH(I201,Infos_2!$F$2:$F$1097,0), ,1),\"H\",INDEX(Infos_2!$J$2:$J$1097,MATCH(I201,Infos_2!$I$2:$I$1097,0), ,1),\"H1\",INDEX(Infos_2!$M$2:$M$1097,MATCH(I201,Infos_2!$L$2:$L$1097,0), ,1),\"H2\",INDEX(Infos_2!$P$2:$P$1097,MATCH(I201,Infos_2!$O$2:$O$1097,0), ,1)),\"\")","v":"R"},{"$f":"IFERROR(_xlfn.SWITCH($B$3,\"C1\",INDEX(Infos_2!$D$2:$D$1097,MATCH(J201,Infos_2!$C$2:$C$1097,0),1),\"C2\",INDEX(Infos_2!$G$2:$G$1097,MATCH(J201,Infos_2!$F$2:$F$1097,0), ,1),\"H\",INDEX(Infos_2!$J$2:$J$1097,MATCH(J201,Infos_2!$I$2:$I$1097,0), ,1),\"H1\",INDEX(Infos_2!$M$2:$M$1097,MATCH(J201,Infos_2!$L$2:$L$1097,0), ,1),\"H2\",INDEX(Infos_2!$P$2:$P$1097,MATCH(J201,Infos_2!$O$2:$O$1097,0), ,1)),\"\")","v":"R"},{"$f":"IFERROR(_xlfn.SWITCH($B$3,\"C1\",INDEX(Infos_2!$D$2:$D$1097,MATCH(K201,Infos_2!$C$2:$C$1097,0),1),\"C2\",INDEX(Infos_2!$G$2:$G$1097,MATCH(K201,Infos_2!$F$2:$F$1097,0), ,1),\"H\",INDEX(Infos_2!$J$2:$J$1097,MATCH(K201,Infos_2!$I$2:$I$1097,0), ,1),\"H1\",INDEX(Infos_2!$M$2:$M$1097,MATCH(K201,Infos_2!$L$2:$L$1097,0), ,1),\"H2\",INDEX(Infos_2!$P$2:$P$1097,MATCH(K201,Infos_2!$O$2:$O$1097,0), ,1)),\"\")","v":"T"},{"$f":"IFERROR(_xlfn.SWITCH($B$3,\"C1\",INDEX(Infos_2!$D$2:$D$1097,MATCH(L201,Infos_2!$C$2:$C$1097,0),1),\"C2\",INDEX(Infos_2!$G$2:$G$1097,MATCH(L201,Infos_2!$F$2:$F$1097,0), ,1),\"H\",INDEX(Infos_2!$J$2:$J$1097,MATCH(L201,Infos_2!$I$2:$I$1097,0), ,1),\"H1\",INDEX(Infos_2!$M$2:$M$1097,MATCH(L201,Infos_2!$L$2:$L$1097,0), ,1),\"H2\",INDEX(Infos_2!$P$2:$P$1097,MATCH(L201,Infos_2!$O$2:$O$1097,0), ,1)),\"\")","v":"T"},{"$f":"IFERROR(_xlfn.SWITCH($B$3,\"C1\",INDEX(Infos_2!$D$2:$D$1097,MATCH(M201,Infos_2!$C$2:$C$1097,0),1),\"C2\",INDEX(Infos_2!$G$2:$G$1097,MATCH(M201,Infos_2!$F$2:$F$1097,0), ,1),\"H\",INDEX(Infos_2!$J$2:$J$1097,MATCH(M201,Infos_2!$I$2:$I$1097,0), ,1),\"H1\",INDEX(Infos_2!$M$2:$M$1097,MATCH(M201,Infos_2!$L$2:$L$1097,0), ,1),\"H2\",INDEX(Infos_2!$P$2:$P$1097,MATCH(M201,Infos_2!$O$2:$O$1097,0), ,1)),\"\")","v":"T"},{"$f":"IFERROR(_xlfn.SWITCH($B$3,\"C1\",INDEX(Infos_2!$D$2:$D$1097,MATCH(N201,Infos_2!$C$2:$C$1097,0),1),\"C2\",INDEX(Infos_2!$G$2:$G$1097,MATCH(N201,Infos_2!$F$2:$F$1097,0), ,1),\"H\",INDEX(Infos_2!$J$2:$J$1097,MATCH(N201,Infos_2!$I$2:$I$1097,0), ,1),\"H1\",INDEX(Infos_2!$M$2:$M$1097,MATCH(N201,Infos_2!$L$2:$L$1097,0), ,1),\"H2\",INDEX(Infos_2!$P$2:$P$1097,MATCH(N201,Infos_2!$O$2:$O$1097,0), ,1)),\"\")","v":"T"},{"$f":"IFERROR(_xlfn.SWITCH($B$3,\"C1\",INDEX(Infos_2!$D$2:$D$1097,MATCH(O201,Infos_2!$C$2:$C$1097,0),1),\"C2\",INDEX(Infos_2!$G$2:$G$1097,MATCH(O201,Infos_2!$F$2:$F$1097,0), ,1),\"H\",INDEX(Infos_2!$J$2:$J$1097,MATCH(O201,Infos_2!$I$2:$I$1097,0), ,1),\"H1\",INDEX(Infos_2!$M$2:$M$1097,MATCH(O201,Infos_2!$L$2:$L$1097,0), ,1),\"H2\",INDEX(Infos_2!$P$2:$P$1097,MATCH(O201,Infos_2!$O$2:$O$1097,0), ,1)),\"\")","v":"T"},{"$f":"IFERROR(_xlfn.SWITCH($B$3,\"C1\",INDEX(Infos_2!$D$2:$D$1097,MATCH(P201,Infos_2!$C$2:$C$1097,0),1),\"C2\",INDEX(Infos_2!$G$2:$G$1097,MATCH(P201,Infos_2!$F$2:$F$1097,0), ,1),\"H\",INDEX(Infos_2!$J$2:$J$1097,MATCH(P201,Infos_2!$I$2:$I$1097,0), ,1),\"H1\",INDEX(Infos_2!$M$2:$M$1097,MATCH(P201,Infos_2!$L$2:$L$1097,0), ,1),\"H2\",INDEX(Infos_2!$P$2:$P$1097,MATCH(P201,Infos_2!$O$2:$O$1097,0), ,1)),\"\")","v":"R"},{"$f":"IFERROR(_xlfn.SWITCH($B$3,\"C1\",INDEX(Infos_2!$D$2:$D$1097,MATCH(Q201,Infos_2!$C$2:$C$1097,0),1),\"C2\",INDEX(Infos_2!$G$2:$G$1097,MATCH(Q201,Infos_2!$F$2:$F$1097,0), ,1),\"H\",INDEX(Infos_2!$J$2:$J$1097,MATCH(Q201,Infos_2!$I$2:$I$1097,0), ,1),\"H1\",INDEX(Infos_2!$M$2:$M$1097,MATCH(Q201,Infos_2!$L$2:$L$1097,0), ,1),\"H2\",INDEX(Infos_2!$P$2:$P$1097,MATCH(Q201,Infos_2!$O$2:$O$1097,0), ,1)),\"\")","v":"R"},{"$f":"IFERROR(_xlfn.SWITCH($B$3,\"C1\",INDEX(Infos_2!$D$2:$D$1097,MATCH(R201,Infos_2!$C$2:$C$1097,0),1),\"C2\",INDEX(Infos_2!$G$2:$G$1097,MATCH(R201,Infos_2!$F$2:$F$1097,0), ,1),\"H\",INDEX(Infos_2!$J$2:$J$1097,MATCH(R201,Infos_2!$I$2:$I$1097,0), ,1),\"H1\",INDEX(Infos_2!$M$2:$M$1097,MATCH(R201,Infos_2!$L$2:$L$1097,0), ,1),\"H2\",INDEX(Infos_2!$P$2:$P$1097,MATCH(R201,Infos_2!$O$2:$O$1097,0), ,1)),\"\")","v":"T"},{"$f":"IFERROR(_xlfn.SWITCH($B$3,\"C1\",INDEX(Infos_2!$D$2:$D$1097,MATCH(S201,Infos_2!$C$2:$C$1097,0),1),\"C2\",INDEX(Infos_2!$G$2:$G$1097,MATCH(S201,Infos_2!$F$2:$F$1097,0), ,1),\"H\",INDEX(Infos_2!$J$2:$J$1097,MATCH(S201,Infos_2!$I$2:$I$1097,0), ,1),\"H1\",INDEX(Infos_2!$M$2:$M$1097,MATCH(S201,Infos_2!$L$2:$L$1097,0), ,1),\"H2\",INDEX(Infos_2!$P$2:$P$1097,MATCH(S201,Infos_2!$O$2:$O$1097,0), ,1)),\"\")","v":"T"},{"$f":"IFERROR(_xlfn.SWITCH($B$3,\"C1\",INDEX(Infos_2!$D$2:$D$1097,MATCH(T201,Infos_2!$C$2:$C$1097,0),1),\"C2\",INDEX(Infos_2!$G$2:$G$1097,MATCH(T201,Infos_2!$F$2:$F$1097,0), ,1),\"H\",INDEX(Infos_2!$J$2:$J$1097,MATCH(T201,Infos_2!$I$2:$I$1097,0), ,1),\"H1\",INDEX(Infos_2!$M$2:$M$1097,MATCH(T201,Infos_2!$L$2:$L$1097,0), ,1),\"H2\",INDEX(Infos_2!$P$2:$P$1097,MATCH(T201,Infos_2!$O$2:$O$1097,0), ,1)),\"\")","v":"T"},{"$f":"IFERROR(_xlfn.SWITCH($B$3,\"C1\",INDEX(Infos_2!$D$2:$D$1097,MATCH(U201,Infos_2!$C$2:$C$1097,0),1),\"C2\",INDEX(Infos_2!$G$2:$G$1097,MATCH(U201,Infos_2!$F$2:$F$1097,0), ,1),\"H\",INDEX(Infos_2!$J$2:$J$1097,MATCH(U201,Infos_2!$I$2:$I$1097,0), ,1),\"H1\",INDEX(Infos_2!$M$2:$M$1097,MATCH(U201,Infos_2!$L$2:$L$1097,0), ,1),\"H2\",INDEX(Infos_2!$P$2:$P$1097,MATCH(U201,Infos_2!$O$2:$O$1097,0), ,1)),\"\")","v":"T"},{"$f":"IFERROR(_xlfn.SWITCH($B$3,\"C1\",INDEX(Infos_2!$D$2:$D$1097,MATCH(V201,Infos_2!$C$2:$C$1097,0),1),\"C2\",INDEX(Infos_2!$G$2:$G$1097,MATCH(V201,Infos_2!$F$2:$F$1097,0), ,1),\"H\",INDEX(Infos_2!$J$2:$J$1097,MATCH(V201,Infos_2!$I$2:$I$1097,0), ,1),\"H1\",INDEX(Infos_2!$M$2:$M$1097,MATCH(V201,Infos_2!$L$2:$L$1097,0), ,1),\"H2\",INDEX(Infos_2!$P$2:$P$1097,MATCH(V201,Infos_2!$O$2:$O$1097,0), ,1)),\"\")","v":"T"},{"$f":"IFERROR(_xlfn.SWITCH($B$3,\"C1\",INDEX(Infos_2!$D$2:$D$1097,MATCH(W201,Infos_2!$C$2:$C$1097,0),1),\"C2\",INDEX(Infos_2!$G$2:$G$1097,MATCH(W201,Infos_2!$F$2:$F$1097,0), ,1),\"H\",INDEX(Infos_2!$J$2:$J$1097,MATCH(W201,Infos_2!$I$2:$I$1097,0), ,1),\"H1\",INDEX(Infos_2!$M$2:$M$1097,MATCH(W201,Infos_2!$L$2:$L$1097,0), ,1),\"H2\",INDEX(Infos_2!$P$2:$P$1097,MATCH(W201,Infos_2!$O$2:$O$1097,0), ,1)),\"\")","v":"R"},{"$f":"IFERROR(_xlfn.SWITCH($B$3,\"C1\",INDEX(Infos_2!$D$2:$D$1097,MATCH(X201,Infos_2!$C$2:$C$1097,0),1),\"C2\",INDEX(Infos_2!$G$2:$G$1097,MATCH(X201,Infos_2!$F$2:$F$1097,0), ,1),\"H\",INDEX(Infos_2!$J$2:$J$1097,MATCH(X201,Infos_2!$I$2:$I$1097,0), ,1),\"H1\",INDEX(Infos_2!$M$2:$M$1097,MATCH(X201,Infos_2!$L$2:$L$1097,0), ,1),\"H2\",INDEX(Infos_2!$P$2:$P$1097,MATCH(X201,Infos_2!$O$2:$O$1097,0), ,1)),\"\")","v":"R"},{"$f":"IFERROR(_xlfn.SWITCH($B$3,\"C1\",INDEX(Infos_2!$D$2:$D$1097,MATCH(Y201,Infos_2!$C$2:$C$1097,0),1),\"C2\",INDEX(Infos_2!$G$2:$G$1097,MATCH(Y201,Infos_2!$F$2:$F$1097,0), ,1),\"H\",INDEX(Infos_2!$J$2:$J$1097,MATCH(Y201,Infos_2!$I$2:$I$1097,0), ,1),\"H1\",INDEX(Infos_2!$M$2:$M$1097,MATCH(Y201,Infos_2!$L$2:$L$1097,0), ,1),\"H2\",INDEX(Infos_2!$P$2:$P$1097,MATCH(Y201,Infos_2!$O$2:$O$1097,0), ,1)),\"\")","v":"T"},{"$f":"IFERROR(_xlfn.SWITCH($B$3,\"C1\",INDEX(Infos_2!$D$2:$D$1097,MATCH(Z201,Infos_2!$C$2:$C$1097,0),1),\"C2\",INDEX(Infos_2!$G$2:$G$1097,MATCH(Z201,Infos_2!$F$2:$F$1097,0), ,1),\"H\",INDEX(Infos_2!$J$2:$J$1097,MATCH(Z201,Infos_2!$I$2:$I$1097,0), ,1),\"H1\",INDEX(Infos_2!$M$2:$M$1097,MATCH(Z201,Infos_2!$L$2:$L$1097,0), ,1),\"H2\",INDEX(Infos_2!$P$2:$P$1097,MATCH(Z201,Infos_2!$O$2:$O$1097,0), ,1)),\"\")","v":"T"},{"$f":"IFERROR(_xlfn.SWITCH($B$3,\"C1\",INDEX(Infos_2!$D$2:$D$1097,MATCH(AA201,Infos_2!$C$2:$C$1097,0),1),\"C2\",INDEX(Infos_2!$G$2:$G$1097,MATCH(AA201,Infos_2!$F$2:$F$1097,0), ,1),\"H\",INDEX(Infos_2!$J$2:$J$1097,MATCH(AA201,Infos_2!$I$2:$I$1097,0), ,1),\"H1\",INDEX(Infos_2!$M$2:$M$1097,MATCH(AA201,Infos_2!$L$2:$L$1097,0), ,1),\"H2\",INDEX(Infos_2!$P$2:$P$1097,MATCH(AA201,Infos_2!$O$2:$O$1097,0), ,1)),\"\")","v":"T"},{"$f":"IFERROR(_xlfn.SWITCH($B$3,\"C1\",INDEX(Infos_2!$D$2:$D$1097,MATCH(AB201,Infos_2!$C$2:$C$1097,0),1),\"C2\",INDEX(Infos_2!$G$2:$G$1097,MATCH(AB201,Infos_2!$F$2:$F$1097,0), ,1),\"H\",INDEX(Infos_2!$J$2:$J$1097,MATCH(AB201,Infos_2!$I$2:$I$1097,0), ,1),\"H1\",INDEX(Infos_2!$M$2:$M$1097,MATCH(AB201,Infos_2!$L$2:$L$1097,0), ,1),\"H2\",INDEX(Infos_2!$P$2:$P$1097,MATCH(AB201,Infos_2!$O$2:$O$1097,0), ,1)),\"\")","v":"T"},{"$f":"IFERROR(_xlfn.SWITCH($B$3,\"C1\",INDEX(Infos_2!$D$2:$D$1097,MATCH(AC201,Infos_2!$C$2:$C$1097,0),1),\"C2\",INDEX(Infos_2!$G$2:$G$1097,MATCH(AC201,Infos_2!$F$2:$F$1097,0), ,1),\"H\",INDEX(Infos_2!$J$2:$J$1097,MATCH(AC201,Infos_2!$I$2:$I$1097,0), ,1),\"H1\",INDEX(Infos_2!$M$2:$M$1097,MATCH(AC201,Infos_2!$L$2:$L$1097,0), ,1),\"H2\",INDEX(Infos_2!$P$2:$P$1097,MATCH(AC201,Infos_2!$O$2:$O$1097,0), ,1)),\"\")","v":"T"},{"$f":"IFERROR(_xlfn.SWITCH($B$3,\"C1\",INDEX(Infos_2!$D$2:$D$1097,MATCH(AD201,Infos_2!$C$2:$C$1097,0),1),\"C2\",INDEX(Infos_2!$G$2:$G$1097,MATCH(AD201,Infos_2!$F$2:$F$1097,0), ,1),\"H\",INDEX(Infos_2!$J$2:$J$1097,MATCH(AD201,Infos_2!$I$2:$I$1097,0), ,1),\"H1\",INDEX(Infos_2!$M$2:$M$1097,MATCH(AD201,Infos_2!$L$2:$L$1097,0), ,1),\"H2\",INDEX(Infos_2!$P$2:$P$1097,MATCH(AD201,Infos_2!$O$2:$O$1097,0), ,1)),\"\")","v":"R"},{"$f":"IFERROR(_xlfn.SWITCH($B$3,\"C1\",INDEX(Infos_2!$D$2:$D$1097,MATCH(AE201,Infos_2!$C$2:$C$1097,0),1),\"C2\",INDEX(Infos_2!$G$2:$G$1097,MATCH(AE201,Infos_2!$F$2:$F$1097,0), ,1),\"H\",INDEX(Infos_2!$J$2:$J$1097,MATCH(AE201,Infos_2!$I$2:$I$1097,0), ,1),\"H1\",INDEX(Infos_2!$M$2:$M$1097,MATCH(AE201,Infos_2!$L$2:$L$1097,0), ,1),\"H2\",INDEX(Infos_2!$P$2:$P$1097,MATCH(AE201,Infos_2!$O$2:$O$1097,0), ,1)),\"\")","v":"R"},{"$f":"IFERROR(_xlfn.SWITCH($B$3,\"C1\",INDEX(Infos_2!$D$2:$D$1097,MATCH(AF201,Infos_2!$C$2:$C$1097,0),1),\"C2\",INDEX(Infos_2!$G$2:$G$1097,MATCH(AF201,Infos_2!$F$2:$F$1097,0), ,1),\"H\",INDEX(Infos_2!$J$2:$J$1097,MATCH(AF201,Infos_2!$I$2:$I$1097,0), ,1),\"H1\",INDEX(Infos_2!$M$2:$M$1097,MATCH(AF201,Infos_2!$L$2:$L$1097,0), ,1),\"H2\",INDEX(Infos_2!$P$2:$P$1097,MATCH(AF201,Infos_2!$O$2:$O$1097,0), ,1)),\"\")","v":"T"},{"$f":"IFERROR(_xlfn.SWITCH($B$3,\"C1\",INDEX(Infos_2!$D$2:$D$1097,MATCH(AG201,Infos_2!$C$2:$C$1097,0),1),\"C2\",INDEX(Infos_2!$G$2:$G$1097,MATCH(AG201,Infos_2!$F$2:$F$1097,0), ,1),\"H\",INDEX(Infos_2!$J$2:$J$1097,MATCH(AG201,Infos_2!$I$2:$I$1097,0), ,1),\"H1\",INDEX(Infos_2!$M$2:$M$1097,MATCH(AG201,Infos_2!$L$2:$L$1097,0), ,1),\"H2\",INDEX(Infos_2!$P$2:$P$1097,MATCH(AG201,Infos_2!$O$2:$O$1097,0), ,1)),\"\")","v":""}]
[1,{"$f":"bloc_nom","v":"NOM 50 Prénom 50"}]
[2,"NOM 51 Prénom 51"]
[3,"NOM 52 Prénom 52"]
[4,"NOM 53 Prénom 53"]
[5,"NOM 54 Prénom 54"]
[6,"NOM 55 Prénom 55"]
[7,"NOM 56 Prénom 56"]
[8,"NOM 57 Prénom 57"]
[9,"NOM 58 Prénom 58"]
[10,""]
[11,""]
[12,""]
[13,""]
[14,""]
[15,""]
[]
[null,null,{"$f":"EDATE($C201,1)","v":"2024-10-01"},{"$f":"C223+1","v":"2024-10-02"},"2024-10-03","2024-10-04","2024-10-05","2024-10-06","2024-10-07","2024-10-08","2024-10-09","2024-10-10","2024-10-11","2024-10-12","2024-10-13","2024-10-14","2024-10-15","2024-10-16","2024-10-17","2024-10-18","2024-10-19","2024-10-20","2024-10-21","2024-10-22","2024-10-23","2024-10-24","2024-10-25","2024-10-26","2024-10-27","2024-10-28",{"$f":"IF(MONTH($AD223)<>MONTH(AD223+1),\"\",AD223+1)","v":"2024-10-29"},{"$f":"IF(AE223=\"\",\"\",IF(MONTH(AE223+1)<>MONTH(AE223),\"\",AE223+1))","v":"2024-10-30"},{"$f":"IF(AF223=\"\",\"\",IF(MONTH(AF223+1)<>MONTH(AF223),\"\",AF223+1))","v":"2024-10-31"}]
[null,{"$f":"INDEX(Infos!$A$2:$B$13,MATCH(B202,Infos!$A$2:$A$13,0)+1,1)","v":"Octobre"},{"$f":"C223","v":"2024-10-01"},"2024-10-02","2024-10-03","2024-10-04","2024-10-05","2024-10-06","2024-10-07","2024-10-08","2024-10-09","2024-10-10","2024-10-11","2024-10-12","2024-10-13","2024-10-14","2024-10-15","2024-10-16","2024-10-17","2024-10-18","2024-10-19","2024-10-20","2024-10-21","2024-10-22","2024-10-23","2024-10-24","2024-10-25","2024-10-26","2024-10-27","2024-10-28","2024-10-29","2024-10-30","2024-10-31"]
[null,"Férié",{"$f":"IF(C223=\"\",\"\",DATE($C$1,MATCH($B224,Infos!$A$2:$A$13,0),DAY(C$223)))","v":"2023-10-01"},{"$f":"IF(D223=\"\",\"\",DATE($C$1,MATCH($B224,Infos!$A$2:$A$13,0),DAY(D$223)))","v":"2023-10-02"},{"$f":"IF(E223=\"\",\"\",DATE($C$1,MATCH($B224,Infos!$A$2:$A$13,0),DAY(E$223)))","v":"2023-10-03"},{"$f":"IF(F223=\"\",\"\",DATE($C$1,MATCH($B224,Infos!$A$2:$A$13,0),DAY(F$223)))","v":"2023-10-04"},{"$f":"IF(G223=\"\",\"\",DATE($C$1,MATCH($B224,Infos!$A$2:$A$13,0),DAY(G$223)))","v":"2023-10-05"},{"$f":"IF(H223=\"\",\"\",DATE($C$1,MATCH($B224,Infos!$A$2:$A$13,0),DAY(H$223)))","v":"2023-10-06"},{"$f":"IF(I223=\"\",\"\",DATE($C$1,MATCH($B224,Infos!$A$2:$A$13,0),DAY(I$223)))","v":"2023-10-07"},{"$f":"IF(J223=\"\",\"\",DATE($C$1,MATCH($B224,Infos!$A$2:$A$13,0),DAY(J$223)))","v":"2023-10-08"},{"$f":"IF(K223=\"\",\"\",DATE($C$1,MATCH($B224,Infos!$A$2:$A$13,0),DAY(K$223)))","v":"2023-10-09"},{"$f":"IF(L223=\"\",\"\",DATE($C$1,MATCH($B224,Infos!$A$2:$A$13,0),DAY(L$223)))","v":"2023-10-10"},{"$f":"IF(M223=\"\",\"\",DATE($C$1,MATCH($B224,Infos!$A$2:$A$13,0),DAY(M$223)))","v":"2023-10-11"},{"$f":"IF(N223=\"\",\"\",DATE($C$1,MATCH($B224,Infos!$A$2:$A$13,0),DAY(N$223)))","v":"2023-10-12"},{"$f":"IF(O223=\"\",\"\",DATE($C$1,MATCH($B224,Infos!$A$2:$A$13,0),DAY(O$223)))","v":"2023-10-13"},{"$f":"IF(P223=\"\",\"\",DATE($C$1,MATCH($B224,Infos!$A$2:$A$13,0),DAY(P$223)))","v":"2023-10-14"},{"$f":"IF(Q223=\"\",\"\",DATE($C$1,MATCH($B224,Infos!$A$2:$A$13,0),DAY(Q$223)))","v":"2023-10-15"},{"$f":"IF(R223=\"\",\"\",DATE($C$1,MATCH($B224,Infos!$A$2:$A$13,0),DAY(R$223)))","v":"2023-10-16"},{"$f":"IF(S223=\"\",\"\",DATE($C$1,MATCH($B224,Infos!$A$2:$A$13,0),DAY(S$223)))","v":"2023-10-17"},{"$f":"IF(T223=\"\",\"\",DATE($C$1,MATCH($B224,Infos!$A$2:$A$13,0),DAY(T$223)))","v":"2023-10-18"},{"$f":"IF(U223=\"\",\"\",DATE($C$1,MATCH($B224,Infos!$A$2:$A$13,0),DAY(U$223)))","v":"2023-10-19"},{"$f":"IF(V223=\"\",\"\",DATE($C$1,MATCH($B224,Infos!$A$2:$A$13,0),DAY(V$223)))","v":"2023-10-20"},{"$f":"IF(W223=\"\",\"\",DATE($C$1,MATCH($B224,Infos!$A$2:$A$13,0),DAY(W$223)))","v":"2023-10-21"},{"$f":"IF(X223=\"\",\"\",DATE($C$1,MATCH($B224,Infos!$A$2:$A$13,0),DAY(X$223)))","v":"2023-10-22"},{"$f":"IF(Y223=\"\",\"\",DATE($C$1,MATCH($B224,Infos!$A$2:$A$13,0),DAY(Y$223)))","v":"2023-10-23"},{"$f":"IF(Z223=\"\",\"\",DATE($C$1,MATCH($B224,Infos!$A$2:$A$13,0),DAY(Z$223)))","v":"2023-10-24"},{"$f":"IF(AA223=\"\",\"\",DATE($C$1,MATCH($B224,Infos!$A$2:$A$13,0),DAY(AA$223)))","v":"2023-10-25"},{"$f":"IF(AB223=\"\",\"\",DATE($C$1,MATCH($B224,Infos!$A$2:$A$13,0),DAY(AB$223)))","v":"2023-10-26"},{"$f":"IF(AC223=\"\",\"\",DATE($C$1,MATCH($B224,Infos!$A$2:$A$13,0),DAY(AC$223)))","v":"2023-10-27"},{"$f":"IF(AD223=\"\",\"\",DATE($C$1,MATCH($B224,Infos!$A$2:$A$13,0),DAY(AD$223)))","v":"2023-10-28"},{"$f":"IF(AE223=\"\",\"\",DATE($C$1,MATCH($B224,Infos!$A$2:$A$13,0),DAY(AE$223)))","v":"2023-10-29"},{"$f":"IF(AF223=\"\",\"\",DATE($C$1,MATCH($B224,Infos!$A$2:$A$13,0),DAY(AF$223)))","v":"2023-10-30"},{"$f":"IF(AG223=\"\",\"\",DATE($C$1,MATCH($B224,Infos!$A$2:$A$13,0),DAY(AG$223)))","v":"2023-10-31"}]
[null,"WE",{"$f":"IF(C223<>\"\",IF(COUNTIF('Jours fériés'!$B$3:$B$15,Planning!C225),8,WEEKDAY(C225,2)),\"\")","v":7},{"$f":"IF(D223<>\"\",IF(COUNTIF('Jours fériés'!$B$3:$B$15,Planning!D225),8,WEEKDAY(D225,2)),\"\")","v":1},{"$f":"IF(E223<>\"\",IF(COUNTIF('Jours fériés'!$B$3:$B$15,Planning!E225),8,WEEKDAY(E225,2)),\"\")","v":2},{"$f":"IF(F223<>\"\",IF(COUNTIF('Jours fériés'!$B$3:$B$15,Planning!F225),8,WEEKDAY(F225,2)),\"\")","v":3},{"$f":"IF(G223<>\"\",IF(COUNTIF('Jours fériés'!$B$3:$B$15,Planning!G225),8,WEEKDAY(G225,2)),\"\")","v":4},{"$f":"IF(H223<>\"\",IF(COUNTIF('Jours fériés'!$B$3:$B$15,Planning!H225),8,WEEKDAY(H225,2)),\"\")","v":5},{"$f":"IF(I223<>\"\",IF(COUNTIF('Jours fériés'!$B$3:$B$15,Planning!I225),8,WEEKDAY(I225,2)),\"\")","v":6},{"$f":"IF(J223<>\"\",IF(COUNTIF('Jours fériés'!$B$3:$B$15,Planning!J225),8,WEEKDAY(J225,2)),\"\")","v":7},{"$f":"IF(K223<>\"\",IF(COUNTIF('Jours fériés'!$B$3:$B$15,Planning!K225),8,WEEKDAY(K225,2)),\"\")","v":1},{"$f":"IF(L223<>\"\",IF(COUNTIF('Jours fériés'!$B$3:$B$15,Planning!L225),8,WEEKDAY(L225,2)),\"\")","v":2},{"$f":"IF(M223<>\"\",IF(COUNTIF('Jours fériés'!$B$3:$B$15,Planning!M225),8,WEEKDAY(M225,2)),\"\")","v":3},{"$f":"IF(N223<>\"\",IF(COUNTIF('Jours fériés'!$B$3:$B$15,Planning!N225),8,WEEKDAY(N225,2)),\"\")","v":4},{"$f":"IF(O223<>\"\",IF(COUNTIF('Jours fériés'!$B$3:$B$15,Planning!O225),8,WEEKDAY(O225,2)),\"\")","v":5},{"$f":"IF(P223<>\"\",IF(COUNTIF('Jours fériés'!$B$3:$B$15,Planning!P225),8,WEEKDAY(P225,2)),\"\")","v":6},{"$f":"IF(Q223<>\"\",IF(COUNTIF('Jours fériés'!$B$3:$B$15,Planning!Q225),8,WEEKDAY(Q225,2)),\"\")","v":7},{"$f":"IF(R223<>\"\",IF(COUNTIF('Jours fériés'!$B$3:$B$15,Planning!R225),8,WEEKDAY(R225,2)),\"\")","v":1},{"$f":"IF(S223<>\"\",IF(COUNTIF('Jours fériés'!$B$3:$B$15,Planning!S225),8,WEEKDAY(S225,2)),\"\")","v":2},{"$f":"IF(T223<>\"\",IF(COUNTIF('Jours fériés'!$B$3:$B$15,Planning!T225),8,WEEKDAY(T225,2)),\"\")","v":3},{"$f":"IF(U223<>\"\",IF(COUNTIF('Jours fériés'!$B$3:$B$15,Planning!U225),8,WEEKDAY(U225,2)),\"\")","v":4},{"$f":"IF(V223<>\"\",IF(COUNTIF('Jours fériés'!$B$3:$B$15,Planning!V225),8,WEEKDAY(V225,2)),\"\")","v":5},{"$f":"IF(W223<>\"\",IF(COUNTIF('Jours fériés'!$B$3:$B$15,Planning!W225),8,WEEKDAY(W225,2)),\"\")","v":6},{"$f":"IF(X223<>\"\",IF(COUNTIF('Jours fériés'!$B$3:$B$15,Planning!X225),8,WEEKDAY(X225,2)),\"\")","v":7},{"$f":"IF(Y223<>\"\",IF(COUNTIF('Jours fériés'!$B$3:$B$15,Planning!Y225),8,WEEKDAY(Y225,2)),\"\")","v":1},{"$f":"IF(Z223<>\"\",IF(COUNTIF('Jours fériés'!$B$3:$B$15,Planning!Z225),8,WEEKDAY(Z225,2)),\"\")","v":2},{"$f":"IF(AA223<>\"\",IF(COUNTIF('Jours fériés'!$B$3:$B$15,Planning!AA225),8,WEEKDAY(AA225,2)),\"\")","v":3},{"$f":"IF(AB223<>\"\",IF(COUNTIF('Jours fériés'!$B$3:$B$15,Planning!AB225),8,WEEKDAY(AB225,2)),\"\")","v":4},{"$f":"IF(AC223<>\"\",IF(COUNTIF('Jours fériés'!$B$3:$B$15,Planning!AC225),8,WEEKDAY(AC225,2)),\"\")","v":5},{"$f":"IF(AD223<>\"\",IF(COUNTIF('Jours fériés'!$B$3:$B$15,Planning!AD225),8,WEEKDAY(AD225,2)),\"\")","v":6},{"$f":"IF(AE223<>\"\",IF(COUNTIF('Jours fériés'!$B$3:$B$15,Planning!AE225),8,WEEKDAY(AE225,2)),\"\")","v":7},{"$f":"IF(AF223<>\"\",IF(COUNTIF('Jours fériés'!$B$3:$B$15,Planning!AF225),8,WEEKDAY(AF225,2)),\"\")","v":1},{"$f":"IF(AG223<>\"\",IF(COUNTIF('Jours fériés'!$B$3:$B$15,Planning!AG225),8,WEEKDAY(AG225,2)),\"\")","v":2}]
[null,"VACANCES",{"$f":"IF(SUMPRODUCT((C223>=datdeb)*(C223<=datfin))=1,\"vac\",\"\")","v":""},{"$f":"IF(SUMPRODUCT((D223>=datdeb)*(D223<=datfin))=1,\"vac\",\"\")","v":""},{"$f":"IF(SUMPRODUCT((E223>=datdeb)*(E223<=datfin))=1,\"vac\",\"\")","v":""},{"$f":"IF(SUMPRODUCT((F223>=datdeb)*(F223<=datfin))=1,\"vac\",\"\")","v":""},{"$f":"IF(SUMPRODUCT((G223>=datdeb)*(G223<=datfin))=1,\"vac\",\"\")","v":""},{"$f":"IF(SUMPRODUCT((H223>=datdeb)*(H223<=datfin))=1,\"vac\",\"\")","v":""},{"$f":"IF(SUMPRODUCT((I223>=datdeb)*(I223<=datfin))=1,\"vac\",\"\")","v":""},{"$f":"IF(SUMPRODUCT((J223>=datdeb)*(J223<=datfin))=1,\"vac\",\"\")","v":""},{"$f":"IF(SUMPRODUCT((K223>=datdeb)*(K223<=datfin))=1,\"vac\",\"\")","v":""},{"$f":"IF(SUMPRODUCT((L223>=datdeb)*(L223<=datfin))=1,\"vac\",\"\")","v":""},{"$f":"IF(SUMPRODUCT((M223>=datdeb)*(M223<=datfin))=1,\"vac\",\"\")","v":""},{"$f":"IF(SUMPRODUCT((N223>=datdeb)*(N223<=datfin))=1,\"vac\",\"\")","v":""},{"$f":"IF(SUMPRODUCT((O223>=datdeb)*(O223<=datfin))=1,\"vac\",\"\")","v":""},{"$f":"IF(SUMPRODUCT((P223>=datdeb)*(P223<=datfin))=1,\"vac\",\"\")","v":""},{"$f":"IF(SUMPRODUCT((Q223>=datdeb)*(Q223<=datfin))=1,\"vac\",\"\")","v":""},{"$f":"IF(SUMPRODUCT((R223>=datdeb)*(R223<=datfin))=1,\"vac\",\"\")","v":""},{"$f":"IF(SUMPRODUCT((S223>=datdeb)*(S223<=datfin))=1,\"vac\",\"\")","v":""},{"$f":"IF(SUMPRODUCT((T223>=datdeb)*(T223<=datfin))=1,\"vac\",\"\")","v":""},{"$f":"IF(SUMPRODUCT((U223>=datdeb)*(U223<=datfin))=1,\"vac\",\"\")","v":"vac"},{"$f":"IF(SUMPRODUCT((V223>=datdeb)*(V223<=datfin))=1,\"vac\",\"\")","v":"vac"},{"$f":"IF(SUMPRODUCT((W223>=datdeb)*(W223<=datfin))=1,\"vac\",\"\")","v":"vac"},{"$f":"IF(SUMPRODUCT((X223>=datdeb)*(X223<=datfin))=1,\"vac\",\"\")","v":"vac"},{"$f":"IF(SUMPRODUCT((Y223>=datdeb)*(Y223<=datfin))=1,\"vac\",\"\")","v":"vac"},{"$f":"IF(SUMPRODUCT((Z223>=datdeb)*(Z223<=datfin))=1,\"vac\",\"\")","v":"vac"},{"$f":"IF(SUMPRODUCT((AA223>=datdeb)*(AA223<=datfin))=1,\"vac\",\"\")","v":"vac"},{"$f":"IF(SUMPRODUCT((AB223>=datdeb)*(AB223<=datfin))=1,\"vac\",\"\")","v":"vac"},{"$f":"IF(SUMPRODUCT((AC223>=datdeb)*(AC223<=datfin))=1,\"vac\",\"\")","v":"vac"},{"$f":"IF(SUMPRODUCT((AD223>=datdeb)*(AD223<=datfin))=1,\"vac\",\"\")","v":"vac"},{"$f":"IF(SUMPRODUCT((AE223>=datdeb)*(AE223<=datfin))=1,\"vac\",\"\")","v":"vac"},{"$f":"IF(SUMPRODUCT((AF223>=datdeb)*(AF223<=datfin))=1,\"vac\",\"\")","v":"vac"},{"$f":"IF(SUMPRODUCT((AG223>=datdeb)*(AG223<=datfin))=1,\"vac\",\"\")","v":"vac"}]
[null,null,{"$f":"IFERROR(_xlfn.SWITCH($B$3,\"C1\",INDEX(Infos_2!$D$2:$D$1097,MATCH(C223,Infos_2!$C$2:$C$1097,0),1),\"C2\",INDEX(Infos_2!$G$2:$G$1097,MATCH(C223,Infos_2!$F$2:$F$1097,0), ,1),\"H\",INDEX(Infos_2!$J$2:$J$1097,MATCH(C223,Infos_2!$I$2:$I$1097,0), ,1),\"H1\",INDEX(Infos_2!$M$2:$M$1097,MATCH(C223,Infos_2!$L$2:$L$1097,0), ,1),\"H2\",INDEX(Infos_2!$P$2:$P$1097,MATCH(C223,Infos_2!$O$2:$O$1097,0), ,1)),\"\")","v":"T"},{"$f":"IFERROR(_xlfn.SWITCH($B$3,\"C1\",INDEX(Infos_2!$D$2:$D$1097,MATCH(D223,Infos_2!$C$2:$C$1097,0),1),\"C2\",INDEX(Infos_2!$G$2:$G$1097,MATCH(D223,Infos_2!$F$2:$F$1097,0), ,1),\"H\",INDEX(Infos_2!$J$2:$J$1097,MATCH(D223,Infos_2!$I$2:$I$1097,0), ,1),\"H1\",INDEX(Infos_2!$M$2:$M$1097,MATCH(D223,Infos_2!$L$2:$L$1097,0), ,1),\"H2\",INDEX(Infos_2!$P$2:$P$1097,MATCH(D223,Infos_2!$O$2:$O$1097,0), ,1)),\"\")","v":"T"},{"$f":"IFERROR(_xlfn.SWITCH($B$3,\"C1\",INDEX(Infos_2!$D$2:$D$1097,MATCH(E223,Infos_2!$C$2:$C$1097,0),1),\"C2\",INDEX(Infos_2!$G$2:$G$1097,MATCH(E223,Infos_2!$F$2:$F$1097,0), ,1),\"H\",INDEX(Infos_2!$J$2:$J$1097,MATCH(E223,Infos_2!$I$2:$I$1097,0), ,1),\"H1\",INDEX(Infos_2!$M$2:$M$1097,MATCH(E223,Infos_2!$L$2:$L$1097,0), ,1),\"H2\",INDEX(Infos_2!$P$2:$P$1097,MATCH(E223,Infos_2!$O$2:$O$1097,0), ,1)),\"\")","v":"T"},{"$f":"IFERROR(_xlfn.SWITCH($B$3,\"C1\",INDEX(Infos_2!$D$2:$D$1097,MATCH(F223,Infos_2!$C$2:$C$1097,0),1),\"C2\",INDEX(Infos_2!$G$2:$G$1097,MATCH(F223,Infos_2!$F$2:$F$1097,0), ,1),\"H\",INDEX(Infos_2!$J$2:$J$1097,MATCH(F223,Infos_2!$I$2:$I$1097,0), ,1),\"H1\",INDEX(Infos_2!$M$2:$M$1097,MATCH(F223,Infos_2!$L$2:$L$1097,0), ,1),\"H2\",INDEX(Infos_2!$P$2:$P$1097,MATCH(F223,Infos_2!$O$2:$O$1097,0), ,1)),\"\")","v":"T"},{"$f":"IFERROR(_xlfn.SWITCH($B$3,\"C1\",INDEX(Infos_2!$D$2:$D$1097,MATCH(G223,Infos_2!$C$2:$C$1097,0),1),\"C2\",INDEX(Infos_2!$G$2:$G$1097,MATCH(G223,Infos_2!$F$2:$F$1097,0), ,1),\"H\",INDEX(Infos_2!$J$2:$J$1097,MATCH(G223,Infos_2!$I$2:$I$1097,0), ,1),\"H1\",INDEX(Infos_2!$M$2:$M$1097,MATCH(G223,Infos_2!$L$2:$L$1097,0), ,1),\"H2\",INDEX(Infos_2!$P$2:$P$1097,MATCH(G223,Infos_2!$O$2:$O$1097,0), ,1)),\"\")","v":"R"},{"$f":"IFERROR(_xlfn.SWITCH($B$3,\"C1\",INDEX(Infos_2!$D$2:$D$1097,MATCH(H223,Infos_2!$C$2:$C$1097,0),1),\"C2\",INDEX(Infos_2!$G$2:$G$1097,MATCH(H223,Infos_2!$F$2:$F$1097,0), ,1),\"H\",INDEX(Infos_2!$J$2:$J$1097,MATCH(H223,Infos_2!$I$2:$I$1097,0), ,1),\"H1\",INDEX(Infos_2!$M$2:$M$1097,MATCH(H223,Infos_2!$L$2:$L$1097,0), ,1),\"H2\",INDEX(Infos_2!$P$2:$P$1097,MATCH(H223,Infos_2!$O$2:$O$1097,0), ,1)),\"\")","v":"R"},{"$f":"IFERROR(_xlfn.SWITCH($B$3,\"C1\",INDEX(Infos_2!$D$2:$D$1097,MATCH(I223,Infos_2!$C$2:$C$1097,0),1),\"C2\",INDEX(Infos_2!$G$2:$G$1097,MATCH(I223,Infos_2!$F$2:$F$1097,0), ,1),\"H\",INDEX(Infos_2!$J$2:$J$1097,MATCH(I223,Infos_2!$I$2:$I$1097,0), ,1),\"H1\",INDEX(Infos_2!$M$2:$M$1097,MATCH(I223,Infos_2!$L$2:$L$1097,0), ,1),\"H2\",INDEX(Infos_2!$P$2:$P$1097,MATCH(I223,Infos_2!$O$2:$O$1097,0), ,1)),\"\")","v":"T"},{"$f":"IFERROR(_xlfn.SWITCH($B$3,\"C1\",INDEX(Infos_2!$D$2:$D$1097,MATCH(J223,Infos_2!$C$2:$C$1097,0),1),\"C2\",INDEX(Infos_2!$G$2:$G$1097,MATCH(J223,Infos_2!$F$2:$F$1097,0), ,1),\"H\",INDEX(Infos_2!$J$2:$J$1097,MATCH(J223,Infos_2!$I$2:$I$1097,0), ,1),\"H1\",INDEX(Infos_2!$M$2:$M$1097,MATCH(J223,Infos_2!$L$2:$L$1097,0), ,1),\"H2\",INDEX(Infos_2!$P$2:$P$1097,MATCH(J223,Infos_2!$O$2:$O$1097,0), ,1)),\"\")","v":"T"},{"$f":"IFERROR(_xlfn.SWITCH($B$3,\"C1\",INDEX(Infos_2!$D$2:$D$1097,MATCH(K223,Infos_2!$C$2:$C$1097,0),1),\"C2\",INDEX(Infos_2!$G$2:$G$1097,MATCH(K223,Infos_2!$F$2:$F$1097,0), ,1),\"H\",INDEX(Infos_2!$J$2:$J$1097,MATCH(K223,Infos_2!$I$2:$I$1097,0), ,1),\"H1\",INDEX(Infos_2!$M$2:$M$1097,MATCH(K223,Infos_2!$L$2:$L$1097,0), ,1),\"H2\",INDEX(Infos_2!$P$2:$P$1097,MATCH(K223,Infos_2!$O$2:$O$1097,0), ,1)),\"\")","v":"T"},{"$f":"IFERROR(_xlfn.SWITCH($B$3,\"C1\",INDEX(Infos_2!$D$2:$D$1097,MATCH(L223,Infos_2!$C$2:$C$1097,0),1),\"C2\",INDEX(Infos_2!$G$2:$G$1097,MATCH(L223,Infos_2!$F$2:$F$1097,0), ,1),\"H\",INDEX(Infos_2!$J$2:$J$1097,MATCH(L223,Infos_2!$I$2:$I$1097,0), ,1),\"H1\",INDEX(Infos_2!$M$2:$M$1097,MATCH(L223,Infos_2!$L$2:$L$1097,0), ,1),\"H2\",INDEX(Infos_2!$P$2:$P$1097,MATCH(L223,Infos_2!$O$2:$O$1097,0), ,1)),\"\")","v":"T"},{"$f":"IFERROR(_xlfn.SWITCH($B$3,\"C1\",INDEX(Infos_2!$D$2:$D$1097,MATCH(M223,Infos_2!$C$2:$C$1097,0),1),\"C2\",INDEX(Infos_2!$G$2:$G$1097,MATCH(M223,Infos_2!$F$2:$F$1097,0), ,1),\"H\",INDEX(Infos_2!$J$2:$J$1097,MATCH(M223,Infos_2!$I$2:$I$1097,0), ,1),\"H1\",INDEX(Infos_2!$M$2:$M$1097,MATCH(M223,Infos_2!$L$2:$L$1097,0), ,1),\"H2\",INDEX(Infos_2!$P$2:$P$1097,MATCH(M223,Infos_2!$O$2:$O$1097,0), ,1)),\"\")","v":"T"},{"$f":"IFERROR(_xlfn.SWITCH($B$3,\"C1\",INDEX(Infos_2!$D$2:$D$1097,MATCH(N223,Infos_2!$C$2:$C$1097,0),1),\"C2\",INDEX(Infos_2!$G$2:$G$1097,MATCH(N223,Infos_2!$F$2:$F$1097,0), ,1),\"H\",INDEX(Infos_2!$J$2:$J$1097,MATCH(N223,Infos_2!$I$2:$I$1097,0), ,1),\"H1\",INDEX(Infos_2!$M$2:$M$1097,MATCH(N223,Infos_2!$L$2:$L$1097,0), ,1),\"H2\",INDEX(Infos_2!$P$2:$P$1097,MATCH(N223,Infos_2!$O$2:$O$1097,0), ,1)),\"\")","v":"R"},{"$f":"IFERROR(_xlfn.SWITCH($B$3,\"C1\",INDEX(Infos_2!$D$2:$D$1097,MATCH(O223,Infos_2!$C$2:$C$1097,0),1),\"C2\",INDEX(Infos_2!$G$2:$G$1097,MATCH(O223,Infos_2!$F$2:$F$1097,0), ,1),\"H\",INDEX(Infos_2!$J$2:$J$1097,MATCH(O223,Infos_2!$I$2:$I$1097,0), ,1),\"H1\",INDEX(Infos_2!$M$2:$M$1097,MATCH(O223,Infos_2!$L$2:$L$1097,0), ,1),\"H2\",INDEX(Infos_2!$P$2:$P$1097,MATCH(O223,Infos_2!$O$2:$O$1097,0), ,1)),\"\")","v":"R"},{"$f":"IFERROR(_xlfn.SWITCH($B$3,\"C1\",INDEX(Infos_2!$D$2:$D$1097,MATCH(P223,Infos_2!$C$2:$C$1097,0),1),\"C2\",INDEX(Infos_2!$G$2:$G$1097,MATCH(P223,Infos_2!$F$2:$F$1097,0), ,1),\"H\",INDEX(Infos_2!$J$2:$J$1097,MATCH(P223,Infos_2!$I$2:$I$1097,0), ,1),\"H1\",INDEX(Infos_2!$M$2:$M$1097,MATCH(P223,Infos_2!$L$2:$L$1097,0), ,1),\"H2\",INDEX(Infos_2!$P$2:$P$1097,MATCH(P223,Infos_2!$O$2:$O$1097,0), ,1)),\"\")","v":"T"},{"$f":"IFERROR(_xlfn.SWITCH($B$3,\"C1\",INDEX(Infos_2!$D$2:$D$1097,MATCH(Q223,Infos_2!$C$2:$C$1097,0),1),\"C2\",INDEX(Infos_2!$G$2:$G$1097,MATCH(Q223,Infos_2!$F$2:$F$1097,0), ,1),\"H\",INDEX(Infos_2!$J$2:$J$1097,MATCH(Q223,Infos_2!$I$2:$I$1097,0), ,1),\"H1\",INDEX(Infos_2!$M$2:$M$1097,MATCH(Q223,Infos_2!$L$2:$L$1097,0), ,1),\"H2\",INDEX(Infos_2!$P$2:$P$1097,MATCH(Q223,Infos_2!$O$2:$O$1097,0), ,1)),\"\")","v":"T"},{"$f":"IFERROR(_xlfn.SWITCH($B$3,\"C1\",INDEX(Infos_2!$D$2:$D$1097,MATCH(R223,Infos_2!$C$2:$C$1097,0),1),\"C2\",INDEX(Infos_2!$G$2:$G$1097,MATCH(R223,Infos_2!$F$2:$F$1097,0), ,1),\"H\",INDEX(Infos_2!$J$2:$J$1097,MATCH(R223,Infos_2!$I$2:$I$1097,0), ,1),\"H1\",INDEX(Infos_2!$M$2:$M$1097,MATCH(R223,Infos_2!$L$2:$L$1097,0), ,1),\"H2\",INDEX(Infos_2!$P$2:$P$1097,MATCH(R223,Infos_2!$O$2:$O$1097,0), ,1)),\"\")","v":"T"},{"$f":"IFERROR(_xlfn.SWITCH($B$3,\"C1\",INDEX(Infos_2!$D$2:$D$1097,MATCH(S223,Infos_2!$C$2:$C$1097,0),1),\"C2\",INDEX(Infos_2!$G$2:$G$1097,MATCH(S223,Infos_2!$F$2:$F$1097,0), ,1),\"H\",INDEX(Infos_2!$J$2:$J$1097,MATCH(S223,Infos_2!$I$2:$I$1097,0), ,1),\"H1\",INDEX(Infos_2!$M$2:$M$1097,MATCH(S223,Infos_2!$L$2:$L$1097,0), ,1),\"H2\",INDEX(Infos_2!$P$2:$P$1097,MATCH(S223,Infos_2!$O$2:$O$1097,0), ,1)),\"\")","v":"T"},{"$f":"IFERROR(_xlfn.SWITCH($B$3,\"C1\",INDEX(Infos_2!$D$2:$D$1097,MATCH(T223,Infos_2!$C$2:$C$1097,0),1),\"C2\",INDEX(Infos_2!$G$2:$G$1097,MATCH(T223,Infos_2!$F$2:$F$1097,0), ,1),\"H\",INDEX(Infos_2!$J$2:$J$1097,MATCH(T223,Infos_2!$I$2:$I$1097,0), ,1),\"H1\",INDEX(Infos_2!$M$2:$M$1097,MATCH(T223,Infos_2!$L$2:$L$1097,0), ,1),\"H2\",INDEX(Infos_2!$P$2:$P$1097,MATCH(T223,Infos_2!$O$2:$O$1097,0), ,1)),\"\")","v":"T"},{"$f":"IFERROR(_xlfn.SWITCH($B$3,\"C1\",INDEX(Infos_2!$D$2:$D$1097,MATCH(U223,Infos_2!$C$2:$C$1097,0),1),\"C2\",INDEX(Infos_2!$G$2:$G$1097,MATCH(U223,Infos_2!$F$2:$F$1097,0), ,1),\"H\",INDEX(Infos_2!$J$2:$J$1097,MATCH(U223,Infos_2!$I$2:$I$1097,0), ,1),\"H1\",INDEX(Infos_2!$M$2:$M$1097,MATCH(U223,Infos_2!$L$2:$L$1097,0), ,1),\"H2\",INDEX(Infos_2!$P$2:$P$1097,MATCH(U223,Infos_2!$O$2:$O$1097,0), ,1)),\"\")","v":"R"},{"$f":"IFERROR(_xlfn.SWITCH($B$3,\"C1\",INDEX(Infos_2!$D$2:$D$1097,MATCH(V223,Infos_2!$C$2:$C$1097,0),1),\"C2\",INDEX(Infos_2!$G$2:$G$1097,MATCH(V223,Infos_2!$F$2:$F$1097,0), ,1),\"H\",INDEX(Infos_2!$J$2:$J$1097,MATCH(V223,Infos_2!$I$2:$I$1097,0), ,1),\"H1\",INDEX(Infos_2!$M$2:$M$1097,MATCH(V223,Infos_2!$L$2:$L$1097,0), ,1),\"H2\",INDEX(Infos_2!$P$2:$P$1097,MATCH(V223,Infos_2!$O$2:$O$1097,0), ,1)),\"\")","v":"R"},{"$f":"IFERROR(_xlfn.SWITCH($B$3,\"C1\",INDEX(Infos_2!$D$2:$D$1097,MATCH(W223,Infos_2!$C$2:$C$1097,0),1),\"C2\",INDEX(Infos_2!$G$2:$G$1097,MATCH(W223,Infos_2!$F$2:$F$1097,0), ,1),\"H\",INDEX(Infos_2!$J$2:$J$1097,MATCH(W223,Infos_2!$I$2:$I$1097,0), ,1),\"H1\",INDEX(Infos_2!$M$2:$M$1097,MATCH(W223,Infos_2!$L$2:$L$1097,0), ,1),\"H2\",INDEX(Infos_2!$P$2:$P$1097,MATCH(W223,Infos_2!$O$2:$O$1097,0), ,1)),\"\")","v":"T"},{"$f":"IFERROR(_xlfn.SWITCH($B$3,\"C1\",INDEX(Infos_2!$D$2:$D$1097,MATCH(X223,Infos_2!$C$2:$C$1097,0),1),\"C2\",INDEX(Infos_2!$G$2:$G$1097,MATCH(X223,Infos_2!$F$2:$F$1097,0), ,1),\"H\",INDEX(Infos_2!$J$2:$J$1097,MATCH(X223,Infos_2!$I$2:$I$1097,0), ,1),\"H1\",INDEX(Infos_2!$M$2:$M$1097,MATCH(X223,Infos_2!$L$2:$L$1097,0), ,1),\"H2\",INDEX(Infos_2!$P$2:$P$1097,MATCH(X223,Infos_2!$O$2:$O$1097,0), ,1)),\"\")","v":"T"},{"$f":"IFERROR(_xlfn.SWITCH($B$3,\"C1\",INDEX(Infos_2!$D$2:$D$1097,MATCH(Y223,Infos_2!$C$2:$C$1097,0),1),\"C2\",INDEX(Infos_2!$G$2:$G$1097,MATCH(Y223,Infos_2!$F$2:$F$1097,0), ,1),\"H\",INDEX(Infos_2!$J$2:$J$1097,MATCH(Y223,Infos_2!$I$2:$I$1097,0), ,1),\"H1\",INDEX(Infos_2!$M$2:$M$1097,MATCH(Y223,Infos_2!$L$2:$L$1097,0), ,1),\"H2\",INDEX(Infos_2!$P$2:$P$1097,MATCH(Y223,Infos_2!$O$2:$O$1097,0), ,1)),\"\")","v":"T"},{"$f":"IFERROR(_xlfn.SWITCH($B$3,\"C1\",INDEX(Infos_2!$D$2:$D$1097,MATCH(Z223,Infos_2!$C$2:$C$1097,0),1),\"C2\",INDEX(Infos_2!$G$2:$G$1097,MATCH(Z223,Infos_2!$F$2:$F$1097,0), ,1),\"H\",INDEX(Infos_2!$J$2:$J$1097,MATCH(Z223,Infos_2!$I$2:$I$1097,0), ,1),\"H1\",INDEX(Infos_2!$M$2:$M$1097,MATCH(Z223,Infos_2!$L$2:$L$1097,0), ,1),\"H2\",INDEX(Infos_2!$P$2:$P$1097,MATCH(Z223,Infos_2!$O$2:$O$1097,0), ,1)),\"\")","v":"T"},{"$f":"IFERROR(_xlfn.SWITCH($B$3,\"C1\",INDEX(Infos_2!$D$2:$D$1097,MATCH(AA223,Infos_2!$C$2:$C$1097,0),1),\"C2\",INDEX(Infos_2!$G$2:$G$1097,MATCH(AA223,Infos_2!$F$2:$F$1097,0), ,1),\"H\",INDEX(Infos_2!$J$2:$J$1097,MATCH(AA223,Infos_2!$I$2:$I$1097,0), ,1),\"H1\",INDEX(Infos_2!$M$2:$M$1097,MATCH(AA223,Infos_2!$L$2:$L$1097,0), ,1),\"H2\",INDEX(Infos_2!$P$2:$P$1097,MATCH(AA223,Infos_2!$O$2:$O$1097,0), ,1)),\"\")","v":"T"},{"$f":"IFERROR(_xlfn.SWITCH($B$3,\"C1\",INDEX(Infos_2!$D$2:$D$1097,MATCH(AB223,Infos_2!$C$2:$C$1097,0),1),\"C2\",INDEX(Infos_2!$G$2:$G$1097,MATCH(AB223,Infos_2!$F$2:$F$1097,0), ,1),\"H\",INDEX(Infos_2!$J$2:$J$1097,MATCH(AB223,Infos_2!$I$2:$I$1097,0), ,1),\"H1\",INDEX(Infos_2!$M$2:$M$1097,MATCH(AB223,Infos_2!$L$2:$L$1097,0), ,1),\"H2\",INDEX(Infos_2!$P$2:$P$1097,MATCH(AB223,Infos_2!$O$2:$O$1097,0), ,1)),\"\")","v":"R"},{"$f":"IFERROR(_xlfn.SWITCH($B$3,\"C1\",INDEX(Infos_2!$D$2:$D$1097,MATCH(AC223,Infos_2!$C$2:$C$1097,0),1),\"C2\",INDEX(Infos_2!$G$2:$G$1097,MATCH(AC223,Infos_2!$F$2:$F$1097,0), ,1),\"H\",INDEX(Infos_2!$J$2:$J$1097,MATCH(AC223,Infos_2!$I$2:$I$1097,0), ,1),\"H1\",INDEX(Infos_2!$M$2:$M$1097,MATCH(AC223,Infos_2!$L$2:$L$1097,0), ,1),\"H2\",INDEX(Infos_2!$P$2:$P$1097,MATCH(AC223,Infos_2!$O$2:$O$1097,0), ,1)),\"\")","v":"R"},{"$f":"IFERROR(_xlfn.SWITCH($B$3,\"C1\",INDEX(Infos_2!$D$2:$D$1097,MATCH(AD223,Infos_2!$C$2:$C$1097,0),1),\"C2\",INDEX(Infos_2!$G$2:$G$1097,MATCH(AD223,Infos_2!$F$2:$F$1097,0), ,1),\"H\",INDEX(Infos_2!$J$2:$J$1097,MATCH(AD223,Infos_2!$I$2:$I$1097,0), ,1),\"H1\",INDEX(Infos_2!$M$2:$M$1097,MATCH(AD223,Infos_2!$L$2:$L$1097,0), ,1),\"H2\",INDEX(Infos_2!$P$2:$P$1097,MATCH(AD223,Infos_2!$O$2:$O$1097,0), ,1)),\"\")","v":"T"},{"$f":"IFERROR(_xlfn.SWITCH($B$3,\"C1\",INDEX(Infos_2!$D$2:$D$1097,MATCH(AE223,Infos_2!$C$2:$C$1097,0),1),\"C2\",INDEX(Infos_2!$G$2:$G$1097,MATCH(AE223,Infos_2!$F$2:$F$1097,0), ,1),\"H\",INDEX(Infos_2!$J$2:$J$1097,MATCH(AE223,Infos_2!$I$2:$I$1097,0), ,1),\"H1\",INDEX(Infos_2!$M$2:$M$1097,MATCH(AE223,Infos_2!$L$2:$L$1097,0), ,1),\"H2\",INDEX(Infos_2!$P$2:$P$1097,MATCH(AE223,Infos_2!$O$2:$O$1097,0), ,1)),\"\")","v":"T"},{"$f":"IFERROR(_xlfn.SWITCH($B$3,\"C1\",INDEX(Infos_2!$D$2:$D$1097,MATCH(AF223,Infos_2!$C$2:$C$1097,0),1),\"C2\",INDEX(Infos_2!$G$2:$G$1097,MATCH(AF223,Infos_2!$F$2:$F$1097,0), ,1),\"H\",INDEX(Infos_2!$J$2:$J$1097,MATCH(AF223,Infos_2!$I$2:$I$1097,0), ,1),\"H1\",INDEX(Infos_2!$M$2:$M$1097,MATCH(AF223,Infos_2!$L$2:$L$1097,0), ,1),\"H2\",INDEX(Infos_2!$P$2:$P$1097,MATCH(AF223,Infos_2!$O$2:$O$1097,0), ,1)),\"\")","v":"T"},{"$f":"IFERROR(_xlfn.SWITCH($B$3,\"C1\",INDEX(Infos_2!$D$2:$D$1097,MATCH(AG223,Infos_2!$C$2:$C$1097,0),1),\"C2\",INDEX(Infos_2!$G$2:$G$1097,MATCH(AG223,Infos_2!$F$2:$F$1097,0), ,1),\"H\",INDEX(Infos_2!$J$2:$J$1097,MATCH(AG223,Infos_2!$I$2:$I$1097,0), ,1),\"H1\",INDEX(Infos_2!$M$2:$M$1097,MATCH(AG223,Infos_2!$L$2:$L$1097,0), ,1),\"H2\",INDEX(Infos_2!$P$2:$P$1097,MATCH(AG223,Infos_2!$O$2:$O$1097,0), ,1)),\"\")","v":"T"}]
[1,{"$f":"bloc_nom","v":"NOM 50 Prénom 50"}]
[2,"NOM 51 Prénom 51"]
[3,"NOM 52 Prénom 52"]
[4,"NOM 53 Prénom 53"]
[5,"NOM 54 Prénom 54"]
[6,"NOM 55 Prénom 55"]
[7,"NOM 56 Prénom 56"]
[8,"NOM 57 Prénom 57"]
[9,"NOM 58 Prénom 58"]
[10,""]
[11,""]
[12,""]
[13,""]
[14,""]
[15,""]
[]
[null,null,{"$f":"EDATE($C223,1)","v":"2024-11-01"},{"$f":"C245+1","v":"2024-11-02"},"2024-11-03","2024-11-04","2024-11-05","2024-11-06","2024-11-07","2024-11-08","2024-11-09","2024-11-10","2024-11-11","2024-11-12","2024-11-13","2024-11-14","2024-11-15","2024-11-16","2024-11-17","2024-11-18","2024-11-19","2024-11-20","2024-11-21","2024-11-22","2024-11-23","2024-11-24","2024-11-25","2024-11-26","2024-11-27","2024-11-28",{"$f":"IF(MONTH($AD245)<>MONTH(AD245+1),\"\",AD245+1)","v":"2024-11-29"},{"$f":"IF(AE245=\"\",\"\",IF(MONTH(AE245+1)<>MONTH(AE245),\"\",AE245+1))","v":"2024-11-30"},{"$f":"IF(AF245=\"\",\"\",IF(MONTH(AF245+1)<>MONTH(AF245),\"\",AF245+1))","v":""}]
[null,{"$f":"INDEX(Infos!$A$2:$B$13,MATCH(B224,Infos!$A$2:$A$13,0)+1,1)","v":"Novembre"},{"$f":"C245","v":"2024-11-01"},"2024-11-02","2024-11-03","2024-11-04","2024-11-05","2024-11-06","2024-11-07","2024-11-08","2024-11-09","2024-11-10","2024-11-11","2024-11-12","2024-11-13","2024-11-14","2024-11-15","2024-11-16","2024-11-17","2024-11-18","2024-11-19","2024-11-20","2024-11-21","2024-11-22","2024-11-23","2024-11-24","2024-11-25","2024-11-26","2024-11-27","2024-11-28","2024-11-29","2024-11-30",""]
[null,"Férié",{"$f":"IF(C245=\"\",\"\",DATE($C$1,MATCH($B246,Infos!$A$2:$A$13,0),DAY(C$245)))","v":"2023-11-01"},{"$f":"IF(D245=\"\",\"\",DATE($C$1,MATCH($B246,Infos!$A$2:$A$13,0),DAY(D$245)))","v":"2023-11-02"},{"$f":"IF(E245=\"\",\"\",DATE($C$1,MATCH($B246,Infos!$A$2:$A$13,0),DAY(E$245)))","v":"2023-11-03"},{"$f":"IF(F245=\"\",\"\",DATE($C$1,MATCH($B246,Infos!$A$2:$A$13,0),DAY(F$245)))","v":"2023-11-04"},{"$f":"IF(G245=\"\",\"\",DATE($C$1,MATCH($B246,Infos!$A$2:$A$13,0),DAY(G$245)))","v":"2023-11-05"},{"$f":"IF(H245=\"\",\"\",DATE($C$1,MATCH($B246,Infos!$A$2:$A$13,0),DAY(H$245)))","v":"2023-11-06"},{"$f":"IF(I245=\"\",\"\",DATE($C$1,MATCH($B246,Infos!$A$2:$A$13,0),DAY(I$245)))","v":"2023-11-07"},{"$f":"IF(J245=\"\",\"\",DATE($C$1,MATCH($B246,Infos!$A$2:$A$13,0),DAY(J$245)))","v":"2023-11-08"},{"$f":"IF(K245=\"\",\"\",DATE($C$1,MATCH($B246,Infos!$A$2:$A$13,0),DAY(K$245)))","v":"2023-11-09"},{"$f":"IF(L245=\"\",\"\",DATE($C$1,MATCH($B246,Infos!$A$2:$A$13,0),DAY(L$245)))","v":"2023-11-10"},{"$f":"IF(M245=\"\",\"\",DATE($C$1,MATCH($B246,Infos!$A$2:$A$13,0),DAY(M$245)))","v":"2023-11-11"},{"$f":"IF(N245=\"\",\"\",DATE($C$1,MATCH($B246,Infos!$A$2:$A$13,0),DAY(N$245)))","v":"2023-11-12"},{"$f":"IF(O245=\"\",\"\",DATE($C$1,MATCH($B246,Infos!$A$2:$A$13,0),DAY(O$245)))","v":"2023-11-13"},{"$f":"IF(P245=\"\",\"\",DATE($C$1,MATCH($B246,Infos!$A$2:$A$13,0),DAY(P$245)))","v":"2023-11-14"},{"$f":"IF(Q245=\"\",\"\",DATE($C$1,MATCH($B246,Infos!$A$2:$A$13,0),DAY(Q$245)))","v":"2023-11-15"},{"$f":"IF(R245=\"\",\"\",DATE($C$1,MATCH($B246,Infos!$A$2:$A$13,0),DAY(R$245)))","v":"2023-11-16"},{"$f":"IF(S245=\"\",\"\",DATE($C$1,MATCH($B246,Infos!$A$2:$A$13,0),DAY(S$245)))","v":"2023-11-17"},{"$f":"IF(T245=\"\",\"\",DATE($C$1,MATCH($B246,Infos!$A$2:$A$13,0),DAY(T$245)))","v":"2023-11-18"},{"$f":"IF(U245=\"\",\"\",DATE($C$1,MATCH($B246,Infos!$A$2:$A$13,0),DAY(U$245)))","v":"2023-11-19"},{"$f":"IF(V245=\"\",\"\",DATE($C$1,MATCH($B246,Infos!$A$2:$A$13,0),DAY(V$245)))","v":"2023-11-20"},{"$f":"IF(W245=\"\",\"\",DATE($C$1,MATCH($B246,Infos!$A$2:$A$13,0),DAY(W$245)))","v":"2023-11-21"},{"$f":"IF(X245=\"\",\"\",DATE($C$1,MATCH($B246,Infos!$A$2:$A$13,0),DAY(X$245)))","v":"2023-11-22"},{"$f":"IF(Y245=\"\",\"\",DATE($C$1,MATCH($B246,Infos!$A$2:$A$13,0),DAY(Y$245)))","v":"2023-11-23"},{"$f":"IF(Z245=\"\",\"\",DATE($C$1,MATCH($B246,Infos!$A$2:$A$13,0),DAY(Z$245)))","v":"2023-11-24"},{"$f":"IF(AA245=\"\",\"\",DATE($C$1,MATCH($B246,Infos!$A$2:$A$13,0),DAY(AA$245)))","v":"2023-11-25"},{"$f":"IF(AB245=\"\",\"\",DATE($C$1,MATCH($B246,Infos!$A$2:$A$13,0),DAY(AB$245)))","v":"2023-11-26"},{"$f":"IF(AC245=\"\",\"\",DATE($C$1,MATCH($B246,Infos!$A$2:$A$13,0),DAY(AC$245)))","v":"2023-11-27"},{"$f":"IF(AD245=\"\",\"\",DATE($C$1,MATCH($B246,Infos!$A$2:$A$13,0),DAY(AD$245)))","v":"2023-11-28"},{"$f":"IF(AE245=\"\",\"\",DATE($C$1,MATCH($B246,Infos!$A$2:$A$13,0),DAY(AE$245)))","v":"2023-11-29"},{"$f":"IF(AF245=\"\",\"\",DATE($C$1,MATCH($B246,Infos!$A$2:$A$13,0),DAY(AF$245)))","v":"2023-11-30"},{"$f":"IF(AG245=\"\",\"\",DATE($C$1,MATCH($B246,Infos!$A$2:$A$13,0),DAY(AG$245)))","v":""}]
[null,"WE",{"$f":"IF(C245<>\"\",IF(COUNTIF('Jours fériés'!$B$3:$B$15,Planning!C247),8,WEEKDAY(C247,2)),\"\")","v":8},{"$f":"IF(D245<>\"\",IF(COUNTIF('Jours fériés'!$B$3:$B$15,Planning!D247),8,WEEKDAY(D247,2)),\"\")","v":4},{"$f":"IF(E245<>\"\",IF(COUNTIF('Jours fériés'!$B$3:$B$15,Planning!E247),8,WEEKDAY(E247,2)),\"\")","v":5},{"$f":"IF(F245<>\"\",IF(COUNTIF('Jours fériés'!$B$3:$B$15,Planning!F247),8,WEEKDAY(F247,2)),\"\")","v":6},{"$f":"IF(G245<>\"\",IF(COUNTIF('Jours fériés'!$B$3:$B$15,Planning!G247),8,WEEKDAY(G247,2)),\"\")","v":7},{"$f":"IF(H245<>\"\",IF(COUNTIF('Jours fériés'!$B$3:$B$15,Planning!H247),8,WEEKDAY(H247,2)),\"\")","v":1},{"$f":"IF(I245<>\"\",IF(COUNTIF('Jours fériés'!$B$3:$B$15,Planning!I247),8,WEEKDAY(I247,2)),\"\")","v":2},{"$f":"IF(J245<>\"\",IF(COUNTIF('Jours fériés'!$B$3:$B$15,Planning!J247),8,WEEKDAY(J247,2)),\"\")","v":3},{"$f":"IF(K245<>\"\",IF(COUNTIF('Jours fériés'!$B$3:$B$15,Planning!K247),8,WEEKDAY(K247,2)),\"\")","v":4},{"$f":"IF(L245<>\"\",IF(COUNTIF('Jours fériés'!$B$3:$B$15,Planning!L247),8,WEEKDAY(L247,2)),\"\")","v":5},{"$f":"IF(M245<>\"\",IF(COUNTIF('Jours fériés'!$B$3:$B$15,Planning!M247),8,WEEKDAY(M247,2)),\"\")","v":8},{"$f":"IF(N245<>\"\",IF(COUNTIF('Jours fériés'!$B$3:$B$15,Planning!N247),8,WEEKDAY(N247,2)),\"\")","v":7},{"$f":"IF(O245<>\"\",IF(COUNTIF('Jours fériés'!$B$3:$B$15,Planning!O247),8,WEEKDAY(O247,2)),\"\")","v":1},{"$f":"IF(P245<>\"\",IF(COUNTIF('Jours fériés'!$B$3:$B$15,Planning!P247),8,WEEKDAY(P247,2)),\"\")","v":2},{"$f":"IF(Q245<>\"\",IF(COUNTIF('Jours fériés'!$B$3:$B$15,Planning!Q247),8,WEEKDAY(Q247,2)),\"\")","v":3},{"$f":"IF(R245<>\"\",IF(COUNTIF('Jours fériés'!$B$3:$B$15,Planning!R247),8,WEEKDAY(R247,2)),\"\")","v":4},{"$f":"IF(S245<>\"\",IF(COUNTIF('Jours fériés'!$B$3:$B$15,Planning!S247),8,WEEKDAY(S247,2)),\"\")","v":5},{"$f":"IF(T245<>\"\",IF(COUNTIF('Jours fériés'!$B$3:$B$15,Planning!T247),8,WEEKDAY(T247,2)),\"\")","v":6},{"$f":"IF(U245<>\"\",IF(COUNTIF('Jours fériés'!$B$3:$B$15,Planning!U247),8,WEEKDAY(U247,2)),\"\")","v":7},{"$f":"IF(V245<>\"\",IF(COUNTIF('Jours fériés'!$B$3:$B$15,Planning!V247),8,WEEKDAY(V247,2)),\"\")","v":1},{"$f":"IF(W245<>\"\",IF(COUNTIF('Jours fériés'!$B$3:$B$15,Planning!W247),8,WEEKDAY(W247,2)),\"\")","v":2},{"$f":"IF(X245<>\"\",IF(COUNTIF('Jours fériés'!$B$3:$B$15,Planning!X247),8,WEEKDAY(X247,2)),\"\")","v":3},{"$f":"IF(Y245<>\"\",IF(COUNTIF('Jours fériés'!$B$3:$B$15,Planning!Y247),8,WEEKDAY(Y247,2)),\"\")","v":4},{"$f":"IF(Z245<>\"\",IF(COUNTIF('Jours fériés'!$B$3:$B$15,Planning!Z247),8,WEEKDAY(Z247,2)),\"\")","v":5},{"$f":"IF(AA245<>\"\",IF(COUNTIF('Jours fériés'!$B$3:$B$15,Planning!AA247),8,WEEKDAY(AA247,2)),\"\")","v":6},{"$f":"IF(AB245<>\"\",IF(COUNTIF('Jours fériés'!$B$3:$B$15,Planning!AB247),8,WEEKDAY(AB247,2)),\"\")","v":7},{"$f":"IF(AC245<>\"\",IF(COUNTIF('Jours fériés'!$B$3:$B$15,Planning!AC247),8,WEEKDAY(AC247,2)),\"\")","v":1},{"$f":"IF(AD245<>\"\",IF(COUNTIF('Jours fériés'!$B$3:$B$15,Planning!AD247),8,WEEKDAY(AD247,2)),\"\")","v":2},{"$f":"IF(AE245<>\"\",IF(COUNTIF('Jours fériés'!$B$3:$B$15,Planning!AE247),8,WEEKDAY(AE247,2)),\"\")","v":3},{"$f":"IF(AF245<>\"\",IF(COUNTIF('Jours fériés'!$B$3:$B$15,Planning!AF247),8,WEEKDAY(AF247,2)),\"\")","v":4},{"$f":"IF(AG245<>\"\",IF(COUNTIF('Jours fériés'!$B$3:$B$15,Planning!AG247),8,WEEKDAY(AG247,2)),\"\")","v":""}]
[null,"VACANCES",{"$f":"IF(SUMPRODUCT((C245>=datdeb)*(C245<=datfin))=1,\"vac\",\"\")","v":"vac"},{"$f":"IF(SUMPRODUCT((D245>=datdeb)*(D245<=datfin))=1,\"vac\",\"\")","v":"vac"},{"$f":"IF(SUMPRODUCT((E245>=datdeb)*(E245<=datfin))=1,\"vac\",\"\")","v":"vac"},{"$f":"IF(SUMPRODUCT((F245>=datdeb)*(F245<=datfin))=1,\"vac\",\"\")","v":"vac"},{"$f":"IF(SUMPRODUCT((G245>=datdeb)*(G245<=datfin))=1,\"vac\",\"\")","v":""},{"$f":"IF(SUMPRODUCT((H245>=datdeb)*(H245<=datfin))=1,\"vac\",\"\")","v":""},{"$f":"IF(SUMPRODUCT((I245>=datdeb)*(I245<=datfin))=1,\"vac\",\"\")","v":""},{"$f":"IF(SUMPRODUCT((J245>=datdeb)*(J245<=datfin))=1,\"vac\",\"\")","v":""},{"$f":"IF(SUMPRODUCT((K245>=datdeb)*(K245<=datfin))=1,\"vac\",\"\")","v":""},{"$f":"IF(SUMPRODUCT((L245>=datdeb)*(L245<=datfin))=1,\"vac\",\"\")","v":""},{"$f":"IF(SUMPRODUCT((M245>=datdeb)*(M245<=datfin))=1,\"vac\",\"\")","v":""},{"$f":"IF(SUMPRODUCT((N245>=datdeb)*(N245<=datfin))=1,\"vac\",\"\")","v":""},{"$f":"IF(SUMPRODUCT((O245>=datdeb)*(O245<=datfin))=1,\"vac\",\"\")","v":""},{"$f":"IF(SUMPRODUCT((P245>=datdeb)*(P245<=datfin))=1,\"vac\",\"\")","v":""},{"$f":"IF(SUMPRODUCT((Q245>=datdeb)*(Q245<=datfin))=1,\"vac\",\"\")","v":""},{"$f":"IF(SUMPRODUCT((R245>=datdeb)*(R245<=datfin))=1,\"vac\",\"\")","v":""},{"$f":"IF(SUMPRODUCT((S245>=datdeb)*(S245<=datfin))=1,\"vac\",\"\")","v":""},{"$f":"IF(SUMPRODUCT((T245>=datdeb)*(T245<=datfin))=1,\"vac\",\"\")","v":""},{"$f":"IF(SUMPRODUCT((U245>=datdeb)*(U245<=datfin))=1,\"vac\",\"\")","v":""},{"$f":"IF(SUMPRODUCT((V245>=datdeb)*(V245<=datfin))=1,\"vac\",\"\")","v":""},{"$f":"IF(SUMPRODUCT((W245>=datdeb)*(W245<=datfin))=1,\"vac\",\"\")","v":""},{"$f":"IF(SUMPRODUCT((X245>=datdeb)*(X245<=datfin))=1,\"vac\",\"\")","v":""},{"$f":"IF(SUMPRODUCT((Y245>=datdeb)*(Y245<=datfin))=1,\"vac\",\"\")","v":""},{"$f":"IF(SUMPRODUCT((Z245>=datdeb)*(Z245<=datfin))=1,\"vac\",\"\")","v":""},{"$f":"IF(SUMPRODUCT((AA245>=datdeb)*(AA245<=datfin))=1,\"vac\",\"\")","v":""},{"$f":"IF(SUMPRODUCT((AB245>=datdeb)*(AB245<=datfin))=1,\"vac\",\"\")","v":""},{"$f":"IF(SUMPRODUCT((AC245>=datdeb)*(AC245<=datfin))=1,\"vac\",\"\")","v":""},{"$f":"IF(SUMPRODUCT((AD245>=datdeb)*(AD245<=datfin))=1,\"vac\",\"\")","v":""},{"$f":"IF(SUMPRODUCT((AE245>=datdeb)*(AE245<=datfin))=1,\"vac\",\"\")","v":""},{"$f":"IF(SUMPRODUCT((AF245>=datdeb)*(AF245<=datfin))=1,\"vac\",\"\")","v":""},{"$f":"IF(SUMPRODUCT((AG245>=datdeb)*(AG245<=datfin))=1,\"vac\",\"\")","v":""}]
[null,null,{"$f":"IFERROR(_xlfn.SWITCH($B$3,\"C1\",INDEX(Infos_2!$D$2:$D$1097,MATCH(C245,Infos_2!$C$2:$C$1097,0),1),\"C2\",INDEX(Infos_2!$G$2:$G$1097,MATCH(C245,Infos_2!$F$2:$F$1097,0), ,1),\"H\",INDEX(Infos_2!$J$2:$J$1097,MATCH(C245,Infos_2!$I$2:$I$1097,0), ,1),\"H1\",INDEX(Infos_2!$M$2:$M$1097,MATCH(C245,Infos_2!$L$2:$L$1097,0), ,1),\"H2\",INDEX(Infos_2!$P$2:$P$1097,MATCH(C245,Infos_2!$O$2:$O$1097,0), ,1)),\"\")","v":"T"},{"$f":"IFERROR(_xlfn.SWITCH($B$3,\"C1\",INDEX(Infos_2!$D$2:$D$1097,MATCH(D245,Infos_2!$C$2:$C$1097,0),1),\"C2\",INDEX(Infos_2!$G$2:$G$1097,MATCH(D245,Infos_2!$F$2:$F$1097,0), ,1),\"H\",INDEX(Infos_2!$J$2:$J$1097,MATCH(D245,Infos_2!$I$2:$I$1097,0), ,1),\"H1\",INDEX(Infos_2!$M$2:$M$1097,MATCH(D245,Infos_2!$L$2:$L$1097,0), ,1),\"H2\",INDEX(Infos_2!$P$2:$P$1097,MATCH(D245,Infos_2!$O$2:$O$1097,0), ,1)),\"\")","v":"R"},{"$f":"IFERROR(_xlfn.SWITCH($B$3,\"C1\",INDEX(Infos_2!$D$2:$D$1097,MATCH(E245,Infos_2!$C$2:$C$1097,0),1),\"C2\",INDEX(Infos_2!$G$2:$G$1097,MATCH(E245,Infos_2!$F$2:$F$1097,0), ,1),\"H\",INDEX(Infos_2!$J$2:$J$1097,MATCH(E245,Infos_2!$I$2:$I$1097,0), ,1),\"H1\",INDEX(Infos_2!$M$2:$M$1097,MATCH(E245,Infos_2!$L$2:$L$1097,0), ,1),\"H2\",INDEX(Infos_2!$P$2:$P$1097,MATCH(E245,Infos_2!$O$2:$O$1097,0), ,1)),\"\")","v":"R"},{"$f":"IFERROR(_xlfn.SWITCH($B$3,\"C1\",INDEX(Infos_2!$D$2:$D$1097,MATCH(F245,Infos_2!$C$2:$C$1097,0),1),\"C2\",INDEX(Infos_2!$G$2:$G$1097,MATCH(F245,Infos_2!$F$2:$F$1097,0), ,1),\"H\",INDEX(Infos_2!$J$2:$J$1097,MATCH(F245,Infos_2!$I$2:$I$1097,0), ,1),\"H1\",INDEX(Infos_2!$M$2:$M$1097,MATCH(F245,Infos_2!$L$2:$L$1097,0), ,1),\"H2\",INDEX(Infos_2!$P$2:$P$1097,MATCH(F245,Infos_2!$O$2:$O$1097,0), ,1)),\"\")","v":"T"},{"$f":"IFERROR(_xlfn.SWITCH($B$3,\"C1\",INDEX(Infos_2!$D$2:$D$1097,MATCH(G245,Infos_2!$C$2:$C$1097,0),1),\"C2\",INDEX(Infos_2!$G$2:$G$1097,MATCH(G245,Infos_2!$F$2:$F$1097,0), ,1),\"H\",INDEX(Infos_2!$J$2:$J$1097,MATCH(G245,Infos_2!$I$2:$I$1097,0), ,1),\"H1\",INDEX(Infos_2!$M$2:$M$1097,MATCH(G245,Infos_2!$L$2:$L$1097,0), ,1),\"H2\",INDEX(Infos_2!$P$2:$P$1097,MATCH(G245,Infos_2!$O$2:$O$1097,0), ,1)),\"\")","v":"T"},{"$f":"IFERROR(_xlfn.SWITCH($B$3,\"C1\",INDEX(Infos_2!$D$2:$D$1097,MATCH(H245,Infos_2!$C$2:$C$1097,0),1),\"C2\",INDEX(Infos_2!$G$2:$G$1097,MATCH(H245,Infos_2!$F$2:$F$1097,0), ,1),\"H\",INDEX(Infos_2!$J$2:$J$1097,MATCH(H245,Infos_2!$I$2:$I$1097,0), ,1),\"H1\",INDEX(Infos_2!$M$2:$M$1097,MATCH(H245,Infos_2!$L$2:$L$1097,0), ,1),\"H2\",INDEX(Infos_2!$P$2:$P$1097,MATCH(H245,Infos_2!$O$2:$O$1097,0), ,1)),\"\")","v":"T"},{"$f":"IFERROR(_xlfn.SWITCH($B$3,\"C1\",INDEX(Infos_2!$D$2:$D$1097,MATCH(I245,Infos_2!$C$2:$C$1097,0),1),\"C2\",INDEX(Infos_2!$G$2:$G$1097,MATCH(I245,Infos_2!$F$2:$F$1097,0), ,1),\"H\",INDEX(Infos_2!$J$2:$J$1097,MATCH(I245,Infos_2!$I$2:$I$1097,0), ,1),\"H1\",INDEX(Infos_2!$M$2:$M$1097,MATCH(I245,Infos_2!$L$2:$L$1097,0), ,1),\"H2\",INDEX(Infos_2!$P$2:$P$1097,MATCH(I245,Infos_2!$O$2:$O$1097,0), ,1)),\"\")","v":"T"},{"$f":"IFERROR(_xlfn.SWITCH($B$3,\"C1\",INDEX(Infos_2!$D$2:$D$1097,MATCH(J245,Infos_2!$C$2:$C$1097,0),1),\"C2\",INDEX(Infos_2!$G$2:$G$1097,MATCH(J245,Infos_2!$F$2:$F$1097,0), ,1),\"H\",INDEX(Infos_2!$J$2:$J$1097,MATCH(J245,Infos_2!$I$2:$I$1097,0), ,1),\"H1\",INDEX(Infos_2!$M$2:$M$1097,MATCH(J245,Infos_2!$L$2:$L$1097,0), ,1),\"H2\",INDEX(Infos_2!$P$2:$P$1097,MATCH(J245,Infos_2!$O$2:$O$1097,0), ,1)),\"\")","v":"T"},{"$f":"IFERROR(_xlfn.SWITCH($B$3,\"C1\",INDEX(Infos_2!$D$2:$D$1097,MATCH(K245,Infos_2!$C$2:$C$1097,0),1),\"C2\",INDEX(Infos_2!$G$2:$G$1097,MATCH(K245,Infos_2!$F$2:$F$1097,0), ,1),\"H\",INDEX(Infos_2!$J$2:$J$1097,MATCH(K245,Infos_2!$I$2:$I$1097,0), ,1),\"H1\",INDEX(Infos_2!$M$2:$M$1097,MATCH(K245,Infos_2!$L$2:$L$1097,0), ,1),\"H2\",INDEX(Infos_2!$P$2:$P$1097,MATCH(K245,Infos_2!$O$2:$O$1097,0), ,1)),\"\")","v":"R"},{"$f":"IFERROR(_xlfn.SWITCH($B$3,\"C1\",INDEX(Infos_2!$D$2:$D$1097,MATCH(L245,Infos_2!$C$2:$C$1097,0),1),\"C2\",INDEX(Infos_2!$G$2:$G$1097,MATCH(L245,Infos_2!$F$2:$F$1097,0), ,1),\"H\",INDEX(Infos_2!$J$2:$J$1097,MATCH(L245,Infos_2!$I$2:$I$1097,0), ,1),\"H1\",INDEX(Infos_2!$M$2:$M$1097,MATCH(L245,Infos_2!$L$2:$L$1097,0), ,1),\"H2\",INDEX(Infos_2!$P$2:$P$1097,MATCH(L245,Infos_2!$O$2:$O$1097,0), ,1)),\"\")","v":"R"},{"$f":"IFERROR(_xlfn.SWITCH($B$3,\"C1\",INDEX(Infos_2!$D$2:$D$1097,MATCH(M245,Infos_2!$C$2:$C$1097,0),1),\"C2\",INDEX(Infos_2!$G$2:$G$1097,MATCH(M245,Infos_2!$F$2:$F$1097,0), ,1),\"H\",INDEX(Infos_2!$J$2:$J$1097,MATCH(M245,Infos_2!$I$2:$I$1097,0), ,1),\"H1\",INDEX(Infos_2!$M$2:$M$1097,MATCH(M245,Infos_2!$L$2:$L$1097,0), ,1),\"H2\",INDEX(Infos_2!$P$2:$P$1097,MATCH(M245,Infos_2!$O$2:$O$1097,0), ,1)),\"\")","v":"T"},{"$f":"IFERROR(_xlfn.SWITCH($B$3,\"C1\",INDEX(Infos_2!$D$2:$D$1097,MATCH(N245,Infos_2!$C$2:$C$1097,0),1),\"C2\",INDEX(Infos_2!$G$2:$G$1097,MATCH(N245,Infos_2!$F$2:$F$1097,0), ,1),\"H\",INDEX(Infos_2!$J$2:$J$1097,MATCH(N245,Infos_2!$I$2:$I$1097,0), ,1),\"H1\",INDEX(Infos_2!$M$2:$M$1097,MATCH(N245,Infos_2!$L$2:$L$1097,0), ,1),\"H2\",INDEX(Infos_2!$P$2:$P$1097,MATCH(N245,Infos_2!$O$2:$O$1097,0), ,1)),\"\")","v":"T"},{"$f":"IFERROR(_xlfn.SWITCH($B$3,\"C1\",INDEX(Infos_2!$D$2:$D$1097,MATCH(O245,Infos_2!$C$2:$C$1097,0),1),\"C2\",INDEX(Infos_2!$G$2:$G$1097,MATCH(O245,Infos_2!$F$2:$F$1097,0), ,1),\"H\",INDEX(Infos_2!$J$2:$J$1097,MATCH(O245,Infos_2!$I$2:$I$1097,0), ,1),\"H1\",INDEX(Infos_2!$M$2:$M$1097,MATCH(O245,Infos_2!$L$2:$L$1097,0), ,1),\"H2\",INDEX(Infos_2!$P$2:$P$1097,MATCH(O245,Infos_2!$O$2:$O$1097,0), ,1)),\"\")","v":"T"},{"$f":"IFERROR(_xlfn.SWITCH($B$3,\"C1\",INDEX(Infos_2!$D$2:$D$1097,MATCH(P245,Infos_2!$C$2:$C$1097,0),1),\"C2\",INDEX(Infos_2!$G$2:$G$1097,MATCH(P245,Infos_2!$F$2:$F$1097,0), ,1),\"H\",INDEX(Infos_2!$J$2:$J$1097,MATCH(P245,Infos_2!$I$2:$I$1097,0), ,1),\"H1\",INDEX(Infos_2!$M$2:$M$1097,MATCH(P245,Infos_2!$L$2:$L$1097,0), ,1),\"H2\",INDEX(Infos_2!$P$2:$P$1097,MATCH(P245,Infos_2!$O$2:$O$1097,0), ,1)),\"\")","v":"T"},{"$f":"IFERROR(_xlfn.SWITCH($B$3,\"C1\",INDEX(Infos_2!$D$2:$D$1097,MATCH(Q245,Infos_2!$C$2:$C$1097,0),1),\"C2\",INDEX(Infos_2!$G$2:$G$1097,MATCH(Q245,Infos_2!$F$2:$F$1097,0), ,1),\"H\",INDEX(Infos_2!$J$2:$J$1097,MATCH(Q245,Infos_2!$I$2:$I$1097,0), ,1),\"H1\",INDEX(Infos_2!$M$2:$M$1097,MATCH(Q245,Infos_2!$L$2:$L$1097,0), ,1),\"H2\",INDEX(Infos_2!$P$2:$P$1097,MATCH(Q245,Infos_2!$O$2:$O$1097,0), ,1)),\"\")","v":"T"},{"$f":"IFERROR(_xlfn.SWITCH($B$3,\"C1\",INDEX(Infos_2!$D$2:$D$1097,MATCH(R245,Infos_2!$C$2:$C$1097,0),1),\"C2\",INDEX(Infos_2!$G$2:$G$1097,MATCH(R245,Infos_2!$F$2:$F$1097,0), ,1),\"H\",INDEX(Infos_2!$J$2:$J$1097,MATCH(R245,Infos_2!$I$2:$I$1097,0), ,1),\"H1\",INDEX(Infos_2!$M$2:$M$1097,MATCH(R245,Infos_2!$L$2:$L$1097,0), ,1),\"H2\",INDEX(Infos_2!$P$2:$P$1097,MATCH(R245,Infos_2!$O$2:$O$1097,0), ,1)),\"\")","v":"R"},{"$f":"IFERROR(_xlfn.SWITCH($B$3,\"C1\",INDEX(Infos_2!$D$2:$D$1097,MATCH(S245,Infos_2!$C$2:$C$1097,0),1),\"C2\",INDEX(Infos_2!$G$2:$G$1097,MATCH(S245,Infos_2!$F$2:$F$1097,0), ,1),\"H\",INDEX(Infos_2!$J$2:$J$1097,MATCH(S245,Infos_2!$I$2:$I$1097,0), ,1),\"H1\",INDEX(Infos_2!$M$2:$M$1097,MATCH(S245,Infos_2!$L$2:$L$1097,0), ,1),\"H2\",INDEX(Infos_2!$P$2:$P$1097,MATCH(S245,Infos_2!$O$2:$O$1097,0), ,1)),\"\")","v":"R"},{"$f":"IFERROR(_xlfn.SWITCH($B$3,\"C1\",INDEX(Infos_2!$D$2:$D$1097,MATCH(T245,Infos_2!$C$2:$C$1097,0),1),\"C2\",INDEX(Infos_2!$G$2:$G$1097,MATCH(T245,Infos_2!$F$2:$F$1097,0), ,1),\"H\",INDEX(Infos_2!$J$2:$J$1097,MATCH(T245,Infos_2!$I$2:$I$1097,0), ,1),\"H1\",INDEX(Infos_2!$M$2:$M$1097,MATCH(T245,Infos_2!$L$2:$L$1097,0), ,1),\"H2\",INDEX(Infos_2!$P$2:$P$1097,MATCH(T245,Infos_2!$O$2:$O$1097,0), ,1)),\"\")","v":"T"},{"$f":"IFERROR(_xlfn.SWITCH($B$3,\"C1\",INDEX(Infos_2!$D$2:$D$1097,MATCH(U245,Infos_2!$C$2:$C$1097,0),1),\"C2\",INDEX(Infos_2!$G$2:$G$1097,MATCH(U245,Infos_2!$F$2:$F$1097,0), ,1),\"H\",INDEX(Infos_2!$J$2:$J$1097,MATCH(U245,Infos_2!$I$2:$I$1097,0), ,1),\"H1\",INDEX(Infos_2!$M$2:$M$1097,MATCH(U245,Infos_2!$L$2:$L$1097,0), ,1),\"H2\",INDEX(Infos_2!$P$2:$P$1097,MATCH(U245,Infos_2!$O$2:$O$1097,0), ,1)),\"\")","v":"T"},{"$f":"IFERROR(_xlfn.SWITCH($B$3,\"C1\",INDEX(Infos_2!$D$2:$D$1097,MATCH(V245,Infos_2!$C$2:$C$1097,0),1),\"C2\",INDEX(Infos_2!$G$2:$G$1097,MATCH(V245,Infos_2!$F$2:$F$1097,0), ,1),\"H\",INDEX(Infos_2!$J$2:$J$1097,MATCH(V245,Infos_2!$I$2:$I$1097,0), ,1),\"H1\",INDEX(Infos_2!$M$2:$M$1097,MATCH(V245,Infos_2!$L$2:$L$1097,0), ,1),\"H2\",INDEX(Infos_2!$P$2:$P$1097,MATCH(V245,Infos_2!$O$2:$O$1097,0), ,1)),\"\")","v":"T"},{"$f":"IFERROR(_xlfn.SWITCH($B$3,\"C1\",INDEX(Infos_2!$D$2:$D$1097,MATCH(W245,Infos_2!$C$2:$C$1097,0),1),\"C2\",INDEX(Infos_2!$G$2:$G$1097,MATCH(W245,Infos_2!$F$2:$F$1097,0), ,1),\"H\",INDEX(Infos_2!$J$2:$J$1097,MATCH(W245,Infos_2!$I$2:$I$1097,0), ,1),\"H1\",INDEX(Infos_2!$M$2:$M$1097,MATCH(W245,Infos_2!$L$2:$L$1097,0), ,1),\"H2\",INDEX(Infos_2!$P$2:$P$1097,MATCH(W245,Infos_2!$O$2:$O$1097,0), ,1)),\"\")","v":"T"},{"$f":"IFERROR(_xlfn.SWITCH($B$3,\"C1\",INDEX(Infos_2!$D$2:$D$1097,MATCH(X245,Infos_2!$C$2:$C$1097,0),1),\"C2\",INDEX(Infos_2!$G$2:$G$1097,MATCH(X245,Infos_2!$F$2:$F$1097,0), ,1),\"H\",INDEX(Infos_2!$J$2:$J$1097,MATCH(X245,Infos_2!$I$2:$I$1097,0), ,1),\"H1\",INDEX(Infos_2!$M$2:$M$1097,MATCH(X245,Infos_2!$L$2:$L$1097,0), ,1),\"H2\",INDEX(Infos_2!$P$2:$P$1097,MATCH(X245,Infos_2!$O$2:$O$1097,0), ,1)),\"\")","v":"T"},{"$f":"IFERROR(_xlfn.SWITCH($B$3,\"C1\",INDEX(Infos_2!$D$2:$D$1097,MATCH(Y245,Infos_2!$C$2:$C$1097,0),1),\"C2\",INDEX(Infos_2!$G$2:$G$1097,MATCH(Y245,Infos_2!$F$2:$F$1097,0), ,1),\"H\",INDEX(Infos_2!$J$2:$J$1097,MATCH(Y245,Infos_2!$I$2:$I$1097,0), ,1),\"H1\",INDEX(Infos_2!$M$2:$M$1097,MATCH(Y245,Infos_2!$L$2:$L$1097,0), ,1),\"H2\",INDEX(Infos_2!$P$2:$P$1097,MATCH(Y245,Infos_2!$O$2:$O$1097,0), ,1)),\"\")","v":"R"},{"$f":"IFERROR(_xlfn.SWITCH($B$3,\"C1\",INDEX(Infos_2!$D$2:$D$1097,MATCH(Z245,Infos_2!$C$2:$C$1097,0),1),\"C2\",INDEX(Infos_2!$G$2:$G$1097,MATCH(Z245,Infos_2!$F$2:$F$1097,0), ,1),\"H\",INDEX(Infos_2!$J$2:$J$1097,MATCH(Z245,Infos_2!$I$2:$I$1097,0), ,1),\"H1\",INDEX(Infos_2!$M$2:$M$1097,MATCH(Z245,Infos_2!$L$2:$L$1097,0), ,1),\"H2\",INDEX(Infos_2!$P$2:$P$1097,MATCH(Z245,Infos_2!$O$2:$O$1097,0), ,1)),\"\")","v":"R"},{"$f":"IFERROR(_xlfn.SWITCH($B$3,\"C1\",INDEX(Infos_2!$D$2:$D$1097,MATCH(AA245,Infos_2!$C$2:$C$1097,0),1),\"C2\",INDEX(Infos_2!$G$2:$G$1097,MATCH(AA245,Infos_2!$F$2:$F$1097,0), ,1),\"H\",INDEX(Infos_2!$J$2:$J$1097,MATCH(AA245,Infos_2!$I$2:$I$1097,0), ,1),\"H1\",INDEX(Infos_2!$M$2:$M$1097,MATCH(AA245,Infos_2!$L$2:$L$1097,0), ,1),\"H2\",INDEX(Infos_2!$P$2:$P$1097,MATCH(AA245,Infos_2!$O$2:$O$1097,0), ,1)),\"\")","v":"T"},{"$f":"IFERROR(_xlfn.SWITCH($B$3,\"C1\",INDEX(Infos_2!$D$2:$D$1097,MATCH(AB245,Infos_2!$C$2:$C$1097,0),1),\"C2\",INDEX(Infos_2!$G$2:$G$1097,MATCH(AB245,Infos_2!$F$2:$F$1097,0), ,1),\"H\",INDEX(Infos_2!$J$2:$J$1097,MATCH(AB245,Infos_2!$I$2:$I$1097,0), ,1),\"H1\",INDEX(Infos_2!$M$2:$M$1097,MATCH(AB245,Infos_2!$L$2:$L$1097,0), ,1),\"H2\",INDEX(Infos_2!$P$2:$P$1097,MATCH(AB245,Infos_2!$O$2:$O$1097,0), ,1)),\"\")","v":"T"},{"$f":"IFERROR(_xlfn.SWITCH($B$3,\"C1\",INDEX(Infos_2!$D$2:$D$1097,MATCH(AC245,Infos_2!$C$2:$C$1097,0),1),\"C2\",INDEX(Infos_2!$G$2:$G$1097,MATCH(AC245,Infos_2!$F$2:$F$1097,0), ,1),\"H\",INDEX(Infos_2!$J$2:$J$1097,MATCH(AC245,Infos_2!$I$2:$I$1097,0), ,1),\"H1\",INDEX(Infos_2!$M$2:$M$1097,MATCH(AC245,Infos_2!$L$2:$L$1097,0), ,1),\"H2\",INDEX(Infos_2!$P$2:$P$1097,MATCH(AC245,Infos_2!$O$2:$O$1097,0), ,1)),\"\")","v":"T"},{"$f":"IFERROR(_xlfn.SWITCH($B$3,\"C1\",INDEX(Infos_2!$D$2:$D$1097,MATCH(AD245,Infos_2!$C$2:$C$1097,0),1),\"C2\",INDEX(Infos_2!$G$2:$G$1097,MATCH(AD245,Infos_2!$F$2:$F$1097,0), ,1),\"H\",INDEX(Infos_2!$J$2:$J$1097,MATCH(AD245,Infos_2!$I$2:$I$1097,0), ,1),\"H1\",INDEX(Infos_2!$M$2:$M$1097,MATCH(AD245,Infos_2!$L$2:$L$1097,0), ,1),\"H2\",INDEX(Infos_2!$P$2:$P$1097,MATCH(AD245,Infos_2!$O$2:$O$1097,0), ,1)),\"\")","v":"T"},{"$f":"IFERROR(_xlfn.SWITCH($B$3,\"C1\",INDEX(Infos_2!$D$2:$D$1097,MATCH(AE245,Infos_2!$C$2:$C$1097,0),1),\"C2\",INDEX(Infos_2!$G$2:$G$1097,MATCH(AE245,Infos_2!$F$2:$F$1097,0), ,1),\"H\",INDEX(Infos_2!$J$2:$J$1097,MATCH(AE245,Infos_2!$I$2:$I$1097,0), ,1),\"H1\",INDEX(Infos_2!$M$2:$M$1097,MATCH(AE245,Infos_2!$L$2:$L$1097,0), ,1),\"H2\",INDEX(Infos_2!$P$2:$P$1097,MATCH(AE245,Infos_2!$O$2:$O$1097,0), ,1)),\"\")","v":"T"},{"$f":"IFERROR(_xlfn.SWITCH($B$3,\"C1\",INDEX(Infos_2!$D$2:$D$1097,MATCH(AF245,Infos_2!$C$2:$C$1097,0),1),\"C2\",INDEX(Infos_2!$G$2:$G$1097,MATCH(AF245,Infos_2!$F$2:$F$1097,0), ,1),\"H\",INDEX(Infos_2!$J$2:$J$1097,MATCH(AF245,Infos_2!$I$2:$I$1097,0), ,1),\"H1\",INDEX(Infos_2!$M$2:$M$1097,MATCH(AF245,Infos_2!$L$2:$L$1097,0), ,1),\"H2\",INDEX(Infos_2!$P$2:$P$1097,MATCH(AF245,Infos_2!$O$2:$O$1097,0), ,1)),\"\")","v":"R"},{"$f":"IFERROR(_xlfn.SWITCH($B$3,\"C1\",INDEX(Infos_2!$D$2:$D$1097,MATCH(AG245,Infos_2!$C$2:$C$1097,0),1),\"C2\",INDEX(Infos_2!$G$2:$G$1097,MATCH(AG245,Infos_2!$F$2:$F$1097,0), ,1),\"H\",INDEX(Infos_2!$J$2:$J$1097,MATCH(AG245,Infos_2!$I$2:$I$1097,0), ,1),\"H1\",INDEX(Infos_2!$M$2:$M$1097,MATCH(AG245,Infos_2!$L$2:$L$1097,0), ,1),\"H2\",INDEX(Infos_2!$P$2:$P$1097,MATCH(AG245,Infos_2!$O$2:$O$1097,0), ,1)),\"\")","v":""}]
[1,{"$f":"bloc_nom","v":"NOM 50 Prénom 50"}]
[2,"NOM 51 Prénom 51"]
[3,"NOM 52 Prénom 52"]
[4,"NOM 53 Prénom 53"]
[5,"NOM 54 Prénom 54"]
[6,"NOM 55 Prénom 55"]
[7,"NOM 56 Prénom 56"]
[8,"NOM 57 Prénom 57"]
[9,"NOM 58 Prénom 58"]
[10,""]
[11,""]
[12,""]
[13,""]
[14,""]
[15,""]
[null,null,null,null,null,null,null,null,null,null,null,null,null,null,null,null,null,null,null,null,null,null,null,null,null,null,null,null,null,null,null,null,null,null,null,null,null,null,null,null,null,null,null,null,null,null,null,null,null,null,null,null,null,null,null,null,null,null,null,null,null,null,null,null,null,null,null,null,null,null,null,null,null,null,null,null,null,null,null,null,null,null,null,null,null,null,null,null,null,null,null,null,null,null,null,null,null,null,null,null,null,null,null,null,null,null,null,null,null,null,null,null,null,null,null,null,null,null,null,null,null,null,null,null,null,null,null,null,null,null,null,null,null,null,null,null,null,null,null,null,null,null,null,null,null,null,null,null,null,null,null,null,null,null,null,null,null,null,null,null,null,null,null,null,null,null,null,null,null,null,null,null,null,null,null,null,null,null,null,null,null,null,null,null,null,null,null,null,null,null,null,null,null,null,null,null,null,null,null,null,null,null,null,null,null,null,null,null,null,null,null,null,null,null,null,null,null,null,null,null,null,null,null,null,null,null,null,null,null,null,null,null,null,null,null,null,null,null,null,null,null,null,null,null,null,null,null,null,null,null,null,null,null,null,null,null,null,null,null,null,null,null,null,null,null,null,null,null,null,null,null,null,null,null,null,null,null,null,null,null,null,null,null,null,null,null,null,null,null,null,null,null,null,null,null,null,null,null,null,null,null,null,null,null,null,null,null,null,null,null,null,null,null,null,null,null,null,null,null,null,null,null,null,null,null,null,null,null,null,null,null,null,null,null,null,null,null,null,null,null,null,null,null,null,null,null,null,null,null,null,null,null,null,null,null,null,null,null,null,null,null,null,null,null,null,null,null,null,null,null,null,null,null,null,null,null,null,null,null,null,null,null,null,null,null,null,null,null,null,null,null,null,null,null,null,null,null,null,null,null,null,null,null,null,null,null,null,null,null,null,null,null,null,null,null,null,null,null,null,null,null,null,null,null,null,null,null,null,null,null,null,null,null,null,null,null,null,null,null,null,null,null,null,null,null,null,null,null,null,null,null,null,null,null,null,null,null,null,null,null,null,null,null,null,null,null,null,null,null,null,null,null,null,null,null,null,null,null,null,null,null,null,null,null,null,null,null,null,null,null,null,null,null,null,null,null,null,null,null,null,null,null,null,null,null,null,null,null,null,null,null,null,null,null,null,null,null,null,null,null,null,null,null,null,null,null,null,null,null,null,null,null,null,null,null,null,null,null,null,null,null,null,null,null,null,null,null,null,null,null,null,null,null,null,null,null,null,null,null,null,null,null,null,null,null,null,null,null,null,null,null,null,null,null,null,null,null,null,null,null,null,null,null,null,null,null,null,null,null,null,null,null,null,null,null,null,null,null,null,null,null,null,null,null,null,null,null,null,null,null,null,null,null,null,null,null,null,null,null,null,null,null,null,null,null,null,null,null,null,null,null,null,null,null,null,null,null,null,null,null,null,null,null,null,null,null,null,null,null,null,null,null,null,null,null,null,null,null,null,null,null,null,null,null,null,null,null,null,null,null,null,null,null,null,null,null,null,null,null,null,null,null,null,null,null,null,null,null,null,null,null,null,null,null,null,null,null,null,null,null,null,null,null,null,null,null,null,null,null,null,null,null,null,null,null,null,null,null,null,null,null,null,null,null,null,null,null,null,null,null,null,null,null,null,null,null,null,null,null,null,null,null,null,null,null,null,null,null,null,null,null,null,null,null,null,null,null,null,null,null,null,null,null,null,null,null,null,null,null,null,null,null,null,null,null,null,null,null,null,null,null,null,null,null,null,null,null,null,null,null,null,null,null,null,null,null,null,null,null,null,null,null,null,null,null,null,null,null,null,null,null,null,null,null,null,null,null,null,null,null,null,null,null,null,null,null,null,null,null,null,null,null,null,null,null,null,null,null,null,null,null,null,null,null,null,null,null,null,null,null,null,null,null,null,null,null,null,null,null,null,null,null,null,null,null,null,null,null,null,null,null,null,null,null,null,null,null,null,null,null,null,null,null,null,null,null,null,null,null,null,null,null,null,null,null,null,null,null,null,null,null,null,null,null,null,null,null,null,null,null,null,null,null,null,null,null,null,null,null,null,null,null,null,null,null,null,null,null,null,null,null,null,null,null,null,null,null,null,null,null,null,null,null,null,null,null,null,null,null,null,null,null,null,null,null,null,null,null,null,null,null,null,null,null,null,null,null,null,null,null,null,null,null,null,null,null,null,null,null,null,null,null,null,null,null,null,null,null,null,null,null,null,null,null,null,null,null,null,null,null,null,null,null,null,null,null,null,null,null,null,"n"]