{"text_format":"1","workbook":"xlsx","n_sheets":9,"sheets":["Accueil","Liste CDPF","Taux horaire","synthèse","720661 essilor","723806 urgence med","723314 médiathèque","723315 mission pénitentiaire","723775 EPIN"],"not_rendered":{"charts":0,"images":2,"macros":1,"external_links":0,"defined_names":7,"comments":0,"pivot_tables":0},"unopened":[],"bounds":{"document_bytes":16777216,"sheet_cells":100000,"rows_first":2000,"rows_last":500,"rows_between":2000,"halvings":0,"cell_chars":16384,"cell_head_chars":4096},"cells_cut":0,"cells_raw":0,"read":"whole","date_system":"1900"}

{"sheet":"Accueil","index":0,"n_rows":58,"n_cols":1,"rows_kept":58,"cut":false,"hidden":false,"merged":[[0,0,1,0]]}
["BIENVENUE DANS LA MOB"]
[]
[]
["Pour faciliter le travail des opérationnels, il a été convenu que certains éléments seront alimentés par les assistantes : "]
[]
["-        Maladies,"]
{"$rows_left_out":53}
{"sheet":"Liste CDPF","index":1,"n_rows":103,"n_cols":3,"rows_kept":103,"cut":false,"hidden":false,"merged":[]}
[{"$f":"{\"Accueil\",\"Liste CDPF\",\"720661 essilor\",\"723806 urgence med\",\"723314 médiathèque\",\"723315 mission pénit\",\"723775 EPIN\",\"Taux horaire\",\"synthèse\"}","v":"Accueil"}]
["faire F9 sur cellule A pour actualiser liste ci-dessous"]
[]
[]
[]
[]
{"$rows_left_out":98}
{"sheet":"Taux horaire","index":2,"n_rows":32,"n_cols":3,"rows_kept":32,"cut":false,"hidden":false,"merged":[]}
["FEP 01/07/2023"]
["FILIERE EXPLOITATION"]
["NIVEAU ","TX/H"]
["APP1",0]
["APP2",0]
["ASPA",11.75,"AS1A"]
{"$rows_left_out":27}
{"sheet":"synthèse","index":3,"n_rows":115,"n_cols":5,"rows_kept":115,"cut":false,"hidden":false,"merged":[]}
[{"$f":"Synthèse","v":"Accueil"}]
[]
[null,null,"Budget","Coût total mois","delta"]
[3,{"$f":"IFERROR(INDEX(ListeCDPF,,A5+1),\"\")","v":"720661 essilor"},{"$f":"IFERROR(INDIRECT(\"'\"&$B4&\"'!$Az$2\"),\"\")","v":0},{"$f":"IFERROR(INDIRECT(\"'\"&$B4&\"'!$BA$2\"),\"\")","v":17229.773333333334},{"$f":"D4-C4","v":17229.773333333334}]
[4,{"$f":"IFERROR(INDEX(ListeCDPF,,A6+1),\"\")","v":"723806 urgence med"},{"$f":"IFERROR(INDIRECT(\"'\"&$B5&\"'!$Az$2\"),\"\")","v":0},534.625,{"$f":"D5-C5","v":534.625}]
[5,"723314 médiathèque",0,2303.6,2303.6]
{"$rows_left_out":110}
{"sheet":"720661 essilor","index":4,"n_rows":115,"n_cols":56,"rows_kept":115,"cut":false,"hidden":false,"merged":[]}
[null,null,null,null,null,null,null,"2023-09-01",null,null,null,null,null,null,null,null,null,null,null,null,null,null,null,null,null,null,null,null,null,null,null,null,null,null,null,null,null,null,null,null,null,null,null,null,null,null,null,"²"]
[720661,"ESSILOR",null,null,null,null,null,null,"2019-08-05","2019-08-06","2019-08-07","2019-08-01","2019-08-02","2019-08-03","2019-08-04",null,null,{"$f":"H1","v":"2023-09-01"},{"$f":"R2+1","v":"2023-09-02"},{"$f":"S2+1","v":"2023-09-03"},"2023-09-04","2023-09-05","2023-09-06","2023-09-07","2023-09-08","2023-09-09","2023-09-10","2023-09-11","2023-09-12","2023-09-13","2023-09-14","2023-09-15","2023-09-16","2023-09-17","2023-09-18","2023-09-19","2023-09-20","2023-09-21","2023-09-22","2023-09-23","2023-09-24","2023-09-25","2023-09-26","2023-09-27","2023-09-28","2023-09-29","2023-09-30","2023-10-01",{"$f":"#REF!+1","v":{"$error":"#REF!"}},{"$f":"AW2+1","v":{"$error":"#REF!"}},null,null,{"$f":"SUM(BA115,BA111,BA107,BA103,BA91,BA87,BA83,BA79,BA75,BA71,BA67,BA63,BA59,BA55,BA51,BA47,BA43,BA39,BA35,BA31,BA27,BA23,BA19,BA15,BA11,BA7)+SUM(BC4:BC115)","v":17229.773333333334}]
["Nom","Prénom","CDD \n- \nCDI","QUALIFICATION","Taux Horaire","Commentaire","Libellé",{"$f":"+H1","v":"2023-09-01"},1,2,3,4,5,6,7,null,null,{"$f":"+R2","v":"2023-09-01"},{"$f":"+S2","v":"2023-09-02"},"2023-09-03","2023-09-04","2023-09-05","2023-09-06","2023-09-07","2023-09-08","2023-09-09","2023-09-10","2023-09-11","2023-09-12","2023-09-13","2023-09-14","2023-09-15","2023-09-16","2023-09-17","2023-09-18","2023-09-19","2023-09-20","2023-09-21","2023-09-22","2023-09-23","2023-09-24","2023-09-25","2023-09-26","2023-09-27","2023-09-28","2023-09-29","2023-09-30","2023-10-01",null,"H travaillées mois","Libellé","Total heures mois","Coût total mois","AVPP","Primes","justification H Plus et Primes"]
["OULAI GOUALI","BOUDOU PAULINE","CDI","ASCA",{"$f":"VLOOKUP(D4,'Taux horaire'!$A$4:$B$31,2,FALSE)","v":11.79},null,"HEURE CAT",65,2.5,2.5,2.5,2.5,2.5,"R","R",null,null,3,{"$f":"+$N4","v":"R"},{"$f":"+$O4","v":"R"},3,3,3,3,3,{"$f":"+$N4","v":"R"},{"$f":"+$O4","v":"R"},3,3,3,3,3,{"$f":"+$N4","v":"R"},{"$f":"+$O4","v":"R"},3,3,3,3,3,{"$f":"+$N4","v":"R"},{"$f":"+$O4","v":"R"},3,3,3,3,3,{"$f":"+$N4","v":"R"},{"$f":"+$O4","v":"R"},"h contrat",{"$f":"H4","v":65},"HEURE CAT",{"$f":"+H4","v":65},{"$f":"AZ4*E4","v":766.34999999999991}]
[null,null,{"$f":"+C4","v":"CDI"},"ASCA",11.79,null,"H. ABS",null,null,null,null,null,null,null,null,null,null,null,null,null,null,null,null,null,null,null,null,null,null,null,null,null,null,null,null,null,null,null,null,null,null,null,null,null,null,null,null,null,"h travaillable",{"$f":"SUM(R4:AV4)","v":63},"H. ABS",{"$f":"SUM(R5:AV5)","v":0},{"$f":"AZ5*E5","v":0}]
[null,null,"CDI","ASCA",11.79,null,"H. SUP",null,null,null,null,null,null,null,null,null,null,null,null,null,null,null,null,null,null,null,null,null,null,null,null,null,null,null,null,null,null,null,null,null,null,null,null,null,null,null,null,null,"h travaillées",{"$f":"AX5-AZ5+AZ6","v":63},"H. SUP / COMP",{"$f":"SUM(R6:AV6)","v":0},{"$f":"IF(H4<35*52/12,IF(BB6=\"O\",AZ6*1.1*E6,AZ6*1.11*E6),AZ6*1.25*E6)","v":0},{"$f":"IF(C4=\"CDI\",IF(AZ6<AZ4*0.1,\"N\",\"O\"),\"N\")","v":"N"}]
{"$rows_left_out":110}
{"sheet":"723806 urgence med","index":5,"n_rows":15,"n_cols":56,"rows_kept":15,"cut":false,"hidden":false,"merged":[]}
[null,null,null,null,null,null,null,"2023-09-01",null,null,null,null,null,null,null,null,null,null,null,null,null,null,null,null,null,null,null,null,null,null,null,null,null,null,null,null,null,null,null,null,null,null,null,null,null,null,null,"²"]
[723806,"URGENCE MED",null,null,null,null,null,null,"2019-08-05","2019-08-06","2019-08-07","2019-08-01","2019-08-02","2019-08-03","2019-08-04",null,null,{"$f":"H1","v":"2023-09-01"},{"$f":"R2+1","v":"2023-09-02"},"2023-09-03","2023-09-04","2023-09-05","2023-09-06","2023-09-07","2023-09-08","2023-09-09","2023-09-10","2023-09-11","2023-09-12","2023-09-13","2023-09-14","2023-09-15","2023-09-16","2023-09-17","2023-09-18","2023-09-19","2023-09-20","2023-09-21","2023-09-22","2023-09-23","2023-09-24","2023-09-25","2023-09-26","2023-09-27","2023-09-28","2023-09-29","2023-09-30","2023-10-01",{"$f":"#REF!+1","v":{"$error":"#REF!"}},{"$f":"AW2+1","v":{"$error":"#REF!"}},null,0,{"$f":"SUM(BA15,BA11,BA7,BC4:BC15)","v":534.625}]
["Nom","Prénom","CDD \n- \nCDI","QUALIFICATION","Taux Horaire","Commentaire","Libellé",{"$f":"H1","v":"2023-09-01"},1,2,3,4,5,6,7,null,null,{"$f":"+R2","v":"2023-09-01"},"2023-09-02","2023-09-03","2023-09-04","2023-09-05","2023-09-06","2023-09-07","2023-09-08","2023-09-09","2023-09-10","2023-09-11","2023-09-12","2023-09-13","2023-09-14","2023-09-15","2023-09-16","2023-09-17","2023-09-18","2023-09-19","2023-09-20","2023-09-21","2023-09-22","2023-09-23","2023-09-24","2023-09-25","2023-09-26","2023-09-27","2023-09-28","2023-09-29","2023-09-30","2023-10-01",null,"H travaillées mois","Libellé","Total heures mois","Coût total mois","AVPP","Primes","justification H Plus et Primes"]
["BAMBOU","KARIMA","CDI","ASPA",{"$f":"VLOOKUP(D4,'Taux horaire'!$A$4:$B$31,2,FALSE)","v":11.75},"avpp essilor","HEURE CAT",{"$f":"(SUBTOTAL(9,I4:O4))*52/12","v":39},1.5,1.5,1.5,1.5,1.5,1.5,"R",null,null,{"$f":"$M$4","v":1.5},{"$f":"$N$4","v":1.5},{"$f":"$O$4","v":"R"},{"$f":"$I$4","v":1.5},{"$f":"$J$4","v":1.5},{"$f":"$K$4","v":1.5},{"$f":"$L$4","v":1.5},{"$f":"$M$4","v":1.5},{"$f":"$N$4","v":1.5},{"$f":"$O$4","v":"R"},{"$f":"$I$4","v":1.5},{"$f":"$J$4","v":1.5},{"$f":"$K$4","v":1.5},{"$f":"$L$4","v":1.5},{"$f":"$M$4","v":1.5},{"$f":"$N$4","v":1.5},{"$f":"$O$4","v":"R"},{"$f":"$I$4","v":1.5},{"$f":"$J$4","v":1.5},{"$f":"$K$4","v":1.5},{"$f":"$L$4","v":1.5},{"$f":"$M$4","v":1.5},{"$f":"$N$4","v":1.5},{"$f":"$O$4","v":"R"},{"$f":"$I$4","v":1.5},{"$f":"$J$4","v":1.5},{"$f":"$K$4","v":1.5},{"$f":"$L$4","v":1.5},{"$f":"$M$4","v":1.5},{"$f":"$N$4","v":1.5},{"$f":"$O$4","v":"R"},"h contrat",{"$f":"H4","v":39},"HEURE CAT",{"$f":"+H4","v":39},{"$f":"AZ4*E4","v":458.25}]
[null,null,{"$f":"+C4","v":"CDI"},"ASPA",11.75,null,"H. ABS",null,null,null,null,null,null,null,null,null,null,null,null,null,null,null,null,null,null,null,null,null,null,null,null,null,null,null,null,null,null,null,null,null,null,null,null,null,null,null,null,null,"h travaillable",{"$f":"SUM(R4:AV4)","v":39},"H. ABS",{"$f":"SUM(R5:AV5)","v":0},{"$f":"AZ5*E5","v":0}]
[null,null,"CDI","ASPA",11.75,null,"H. SUP",null,null,null,null,null,null,null,null,null,null,null,null,null,null,null,null,null,null,null,null,null,null,null,null,null,null,null,null,null,null,null,null,null,null,null,null,null,null,null,null,null,"h travaillées",{"$f":"AX5-AZ5+AZ6","v":39},"H. SUP",{"$f":"SUM(R6:AV6)","v":0},{"$f":"IF(H4<35*52/12,IF(BB6=\"O\",AZ6*1.1*E6,AZ6*1.11*E6),AZ6*1.25*E6)","v":0},{"$f":"IF(C4=\"CDI\",IF(AZ6<AZ4*0.1,\"N\",\"O\"),\"N\")","v":"N"}]
{"$rows_left_out":10}
{"sheet":"723314 médiathèque","index":6,"n_rows":27,"n_cols":56,"rows_kept":27,"cut":false,"hidden":false,"merged":[]}
[null,null,null,null,null,null,null,"2023-09-01",null,null,null,null,null,null,null,null,null,null,null,null,null,null,null,null,null,null,null,null,null,null,null,null,null,null,null,null,null,null,null,null,null,null,null,null,null,null,null,"²"]
[723314,"MEDIATHEQUE CHARENTON",null,null,null,null,null,null,"2019-08-05","2019-08-06","2019-08-07","2019-08-01","2019-08-02","2019-08-03","2019-08-04",null,null,{"$f":"H1","v":"2023-09-01"},{"$f":"R2+1","v":"2023-09-02"},"2023-09-03","2023-09-04","2023-09-05","2023-09-06","2023-09-07","2023-09-08","2023-09-09","2023-09-10","2023-09-11","2023-09-12","2023-09-13","2023-09-14","2023-09-15","2023-09-16","2023-09-17","2023-09-18","2023-09-19","2023-09-20","2023-09-21","2023-09-22","2023-09-23","2023-09-24","2023-09-25","2023-09-26","2023-09-27","2023-09-28","2023-09-29","2023-09-30","2023-10-01",{"$f":"#REF!+1","v":{"$error":"#REF!"}},{"$f":"AW2+1","v":{"$error":"#REF!"}},null,null,{"$f":"SUM(BA27,BA23,BA15,BA11,BA7,BC4:BC27)","v":2303.6}]
["Nom","Prénom","CDD \n- \nCDI","QUALIFICATION","Taux Horaire","Commentaire","Libellé",{"$f":"H1","v":"2023-09-01"},1,2,3,4,5,6,7,null,null,{"$f":"+R2","v":"2023-09-01"},"2023-09-02","2023-09-03","2023-09-04","2023-09-05","2023-09-06","2023-09-07","2023-09-08","2023-09-09","2023-09-10","2023-09-11","2023-09-12","2023-09-13","2023-09-14","2023-09-15","2023-09-16","2023-09-17","2023-09-18","2023-09-19","2023-09-20","2023-09-21","2023-09-22","2023-09-23","2023-09-24","2023-09-25","2023-09-26","2023-09-27","2023-09-28","2023-09-29","2023-09-30","2023-10-01",null,"H travaillées mois","Libellé","Total heures mois","Coût total mois","AVPP","Primes","justification H Plus et Primes"]
["MARTINS PIMENTA","MAGDA VALERIA","CDI","ASCA",{"$f":"VLOOKUP(D4,'Taux horaire'!$A$4:$B$31,2,FALSE)","v":11.79},null,"HEURE CAT",{"$f":"(SUBTOTAL(9,I4:O4))*52/12","v":65},3,3,3,3,3,"R","R",null,null,{"$f":"+$M4","v":3},{"$f":"+$N4","v":"R"},{"$f":"+$O4","v":"R"},{"$f":"+$I4","v":3},{"$f":"+$J4","v":3},{"$f":"+$K4","v":3},{"$f":"+$L4","v":3},{"$f":"+$M4","v":3},{"$f":"+$N4","v":"R"},{"$f":"+$O4","v":"R"},{"$f":"+$I4","v":3},{"$f":"+$J4","v":3},{"$f":"+$K4","v":3},{"$f":"+$L4","v":3},{"$f":"+$M4","v":3},{"$f":"+$N4","v":"R"},{"$f":"+$O4","v":"R"},{"$f":"+$I4","v":3},{"$f":"+$J4","v":3},{"$f":"+$K4","v":3},{"$f":"+$L4","v":3},{"$f":"+$M4","v":3},{"$f":"+$N4","v":"R"},{"$f":"+$O4","v":"R"},{"$f":"+$I4","v":3},{"$f":"+$J4","v":3},{"$f":"+$K4","v":3},{"$f":"+$L4","v":3},{"$f":"+$M4","v":3},{"$f":"+$N4","v":"R"},{"$f":"+$O4","v":"R"},"h contrat",{"$f":"H4","v":65},"HEURE CAT",{"$f":"+H4","v":65},{"$f":"AZ4*E4","v":766.34999999999991}]
[null,null,{"$f":"+C4","v":"CDI"},"ASCA",11.79,null,"H. ABS",null,null,null,null,null,null,null,null,null,null,null,null,null,null,null,null,null,null,null,null,null,null,null,null,null,null,null,null,null,null,null,null,null,null,null,null,null,null,null,null,null,"h travaillable",{"$f":"SUM(R4:AV4)","v":63},"H. ABS",{"$f":"SUM(R5:AV5)","v":0},{"$f":"AZ5*E5","v":0}]
[null,null,"CDI","ASCA",11.79,null,"H. SUP",null,null,null,null,null,null,null,null,null,null,null,null,null,null,null,null,null,null,null,null,null,null,null,null,null,null,null,null,null,null,null,null,null,null,null,null,null,null,null,null,null,"h travaillées",{"$f":"AX5-AZ5+AZ6","v":63},"H. SUP",{"$f":"SUM(R6:AV6)","v":0},{"$f":"IF(H4<35*52/12,IF(BB6=\"O\",AZ6*1.1*E6,AZ6*1.11*E6),AZ6*1.25*E6)","v":0},{"$f":"IF(C4=\"CDI\",IF(AZ6<AZ4*0.1,\"N\",\"O\"),\"N\")","v":"N"}]
{"$rows_left_out":22}
{"sheet":"723315 mission pénitentiaire","index":7,"n_rows":19,"n_cols":81,"rows_kept":19,"cut":false,"hidden":false,"merged":[]}
[9,1,null,null,null,null,null,"2023-09-01",null,null,null,null,null,null,null,null,null,null,null,null,null,null,null,null,null,null,null,null,null,null,null,null,null,null,null,null,null,null,null,null,null,null,null,null,null,null,null,"²",null,null,null,null,null,null,null,null,null,null,null,null,null,null,null,null,null,null,null,null,null,null,null,null,"JF",null,null,null,null,null,null,"JANVIER",2023]
[723315,"UGAP MISSION PENITENTIAIRE",null,null,null,null,null,null,"lun","mar","mer","jeu","ven","sam","dim",null,null,{"$f":"DATE(B1+2022,A1,1)","v":"2023-09-01"},{"$f":"R2+1","v":"2023-09-02"},"2023-09-03","2023-09-04","2023-09-05","2023-09-06","2023-09-07","2023-09-08","2023-09-09","2023-09-10","2023-09-11","2023-09-12","2023-09-13","2023-09-14","2023-09-15","2023-09-16","2023-09-17","2023-09-18","2023-09-19","2023-09-20","2023-09-21","2023-09-22","2023-09-23","2023-09-24","2023-09-25","2023-09-26","2023-09-27","2023-09-28","2023-09-29","2023-09-30","2023-10-01",{"$f":"#REF!+1","v":{"$error":"#REF!"}},{"$f":"AW2+1","v":{"$error":"#REF!"}},null,null,{"$f":"SUM(BA7,BA11,BC4:BC19,BA15,BA19)","v":894.07499999999993},null,null,null,null,null,null,null,null,null,null,null,null,null,null,null,null,null,null,null,null,null,null,null,null,null,null,"FÉVRIER",2024]
["Nom","Prénom","CDD \n- \nCDI","QUALIFICATION","Taux Horaire","Commentaire","Libellé",{"$f":"H1","v":"2023-09-01"},1,2,3,4,5,6,7,null,null,{"$f":"+R2","v":"2023-09-01"},"2023-09-02","2023-09-03","2023-09-04","2023-09-05","2023-09-06","2023-09-07","2023-09-08","2023-09-09","2023-09-10","2023-09-11","2023-09-12","2023-09-13","2023-09-14","2023-09-15","2023-09-16","2023-09-17","2023-09-18","2023-09-19","2023-09-20","2023-09-21","2023-09-22","2023-09-23","2023-09-24","2023-09-25","2023-09-26","2023-09-27","2023-09-28","2023-09-29","2023-09-30","2023-10-01",null,"H travaillées mois","Libellé","Total heures mois","Coût total mois","AVPP","Primes","justification H Plus et Primes",null,null,null,null,null,null,null,null,null,null,null,null,null,null,null,null,null,null,null,null,null,null,null,"MARS",2025]
["MOUGAMADOU TAMBIRE","HASINA","CDI","ASCA",{"$f":"VLOOKUP(D4,'Taux horaire'!$A$4:$B$31,2,FALSE)","v":11.79},null,"HEURE CAT",{"$f":"(SUBTOTAL(9,I4:O4))*52/12","v":75.833333333333329},3.5,3.5,3.5,3.5,3.5,"R","R",null,null,{"$f":"IF(TEXT(R2,\"jjj\")=\"lun\",$I$4,IF(TEXT(R2,\"jjj\")=\"mar\", $J$4,IF(TEXT(R2,\"jjj\")=\"mer\", $K$4,IF(TEXT(R2,\"jjj\")=\"jeu\", $L$4,IF(TEXT(R2,\"jjj\")=\"ven\", $M$4,IF(TEXT(R2,\"jjj\")=\"sam\", $N$4,$O$4))))))","v":3.5},{"$f":"IF(TEXT(S2,\"jjj\")=\"lun\",$I$4,IF(TEXT(S2,\"jjj\")=\"mar\", $J$4,IF(TEXT(S2,\"jjj\")=\"mer\", $K$4,IF(TEXT(S2,\"jjj\")=\"jeu\", $L$4,IF(TEXT(S2,\"jjj\")=\"ven\", $M$4,IF(TEXT(S2,\"jjj\")=\"sam\", $N$4,$O$4))))))","v":"R"},{"$f":"IF(TEXT(T2,\"jjj\")=\"lun\",$I$4,IF(TEXT(T2,\"jjj\")=\"mar\", $J$4,IF(TEXT(T2,\"jjj\")=\"mer\", $K$4,IF(TEXT(T2,\"jjj\")=\"jeu\", $L$4,IF(TEXT(T2,\"jjj\")=\"ven\", $M$4,IF(TEXT(T2,\"jjj\")=\"sam\", $N$4,$O$4))))))","v":"R"},{"$f":"IF(TEXT(U2,\"jjj\")=\"lun\",$I$4,IF(TEXT(U2,\"jjj\")=\"mar\", $J$4,IF(TEXT(U2,\"jjj\")=\"mer\", $K$4,IF(TEXT(U2,\"jjj\")=\"jeu\", $L$4,IF(TEXT(U2,\"jjj\")=\"ven\", $M$4,IF(TEXT(U2,\"jjj\")=\"sam\", $N$4,$O$4))))))","v":3.5},{"$f":"IF(TEXT(V2,\"jjj\")=\"lun\",$I$4,IF(TEXT(V2,\"jjj\")=\"mar\", $J$4,IF(TEXT(V2,\"jjj\")=\"mer\", $K$4,IF(TEXT(V2,\"jjj\")=\"jeu\", $L$4,IF(TEXT(V2,\"jjj\")=\"ven\", $M$4,IF(TEXT(V2,\"jjj\")=\"sam\", $N$4,$O$4))))))","v":3.5},3.5,3.5,3.5,"R","R",3.5,3.5,3.5,3.5,3.5,"R","R",3.5,3.5,3.5,3.5,3.5,"R","R",3.5,3.5,3.5,3.5,3.5,"R","R","h contrat",{"$f":"H4","v":75.833333333333329},"HEURE CAT",{"$f":"+H4","v":75.833333333333329},{"$f":"AZ4*E4","v":894.07499999999993},null,null,null,null,null,null,null,null,null,null,null,null,null,null,null,null,null,null,null,null,null,null,null,null,null,null,"AVRIL",2026]
[null,null,{"$f":"+C4","v":"CDI"},"ASCA",11.79,null,"H. ABS",null,null,null,null,null,null,null,null,null,null,null,null,null,null,null,null,null,null,null,null,null,null,null,null,null,null,null,null,null,null,null,null,null,null,null,null,null,null,null,null,null,"h travaillable",{"$f":"SUM(R4:AV4)","v":73.5},"H. ABS",{"$f":"SUM(R5:AV5)","v":0},{"$f":"AZ5*E5","v":0},null,null,null,null,null,null,null,null,null,null,null,null,null,null,null,null,null,null,null,null,null,null,null,null,null,null,"MAI",2027]
[null,null,"CDI","ASCA",11.79,null,"H. SUP",null,null,null,null,null,null,null,null,null,null,null,null,null,null,null,null,null,null,null,null,null,null,null,null,null,null,null,null,null,null,null,null,null,null,null,null,null,null,null,null,null,"h travaillées",{"$f":"AX5-AZ5+AZ6","v":73.5},"H. SUP",{"$f":"SUM(R6:AV6)","v":0},{"$f":"IF(H4<35*52/12,IF(BB6=\"O\",AZ6*1.1*E6,AZ6*1.11*E6),AZ6*1.25*E6)","v":0},{"$f":"IF(C4=\"CDI\",IF(AZ6<AZ4*0.1,\"N\",\"O\"),\"N\")","v":"N"},null,null,null,null,null,null,null,null,null,null,null,null,null,null,null,null,null,null,null,null,null,null,null,null,null,"JUIN",2028]
{"$rows_left_out":14}
{"sheet":"723775 EPIN","index":8,"n_rows":27,"n_cols":56,"rows_kept":27,"cut":false,"hidden":false,"merged":[]}
[null,null,null,null,null,null,null,"2023-09-01",null,null,null,null,null,null,null,null,null,null,null,null,null,null,null,null,null,null,null,null,null,null,null,null,null,null,null,null,null,null,null,null,null,null,null,null,null,null,null,"²"]
[723775,"ECOLE EPIN",null,null,null,"INTERMITTENT",null,null,"2019-08-05","2019-08-06","2019-08-07","2019-08-01","2019-08-02","2019-08-03","2019-08-04",null,null,{"$f":"H1","v":"2023-09-01"},{"$f":"R2+1","v":"2023-09-02"},"2023-09-03","2023-09-04","2023-09-05","2023-09-06","2023-09-07","2023-09-08","2023-09-09","2023-09-10","2023-09-11","2023-09-12","2023-09-13","2023-09-14","2023-09-15","2023-09-16","2023-09-17","2023-09-18","2023-09-19","2023-09-20","2023-09-21","2023-09-22","2023-09-23","2023-09-24","2023-09-25","2023-09-26","2023-09-27","2023-09-28","2023-09-29","2023-09-30","2023-10-01",{"$f":"#REF!+1","v":{"$error":"#REF!"}},{"$f":"AW2+1","v":{"$error":"#REF!"}},null,null,{"$f":"SUM(BA27,BA23,BA19,BA15,BA11,BA7,BC4:BC27)","v":2214.9959666666668}]
["Nom","Prénom","CDD \n- \nCDI","QUALIFICATION","Taux Horaire","Commentaire","Libellé",{"$f":"H1","v":"2023-09-01"},1,2,3,4,5,6,7,null,null,{"$f":"+R2","v":"2023-09-01"},"2023-09-02","2023-09-03","2023-09-04","2023-09-05","2023-09-06","2023-09-07","2023-09-08","2023-09-09","2023-09-10","2023-09-11","2023-09-12","2023-09-13","2023-09-14","2023-09-15","2023-09-16","2023-09-17","2023-09-18","2023-09-19","2023-09-20","2023-09-21","2023-09-22","2023-09-23","2023-09-24","2023-09-25","2023-09-26","2023-09-27","2023-09-28","2023-09-29","2023-09-30","2023-10-01",null,"H travaillées mois","Libellé","Total heures mois","Coût total mois","AVPP","Primes","justification H Plus et Primes"]
["ALCINE","GRESELINE","CDI","ASCA",{"$f":"VLOOKUP(D4,'Taux horaire'!$A$4:$B$31,2,FALSE)","v":11.79},null,"HEURE CAT",54.17,3.5,3.5,3.5,3.5,2.75,"R","R",null,null,{"$f":"+$M4","v":2.75},{"$f":"+$N4","v":"R"},{"$f":"+$O4","v":"R"},{"$f":"+$I4","v":3.5},{"$f":"+$J4","v":3.5},{"$f":"+$K4","v":3.5},{"$f":"+$L4","v":3.5},{"$f":"+$M4","v":2.75},{"$f":"+$N4","v":"R"},{"$f":"+$O4","v":"R"},{"$f":"+$I4","v":3.5},{"$f":"+$J4","v":3.5},{"$f":"+$K4","v":3.5},{"$f":"+$L4","v":3.5},{"$f":"+$M4","v":2.75},{"$f":"+$N4","v":"R"},{"$f":"+$O4","v":"R"},{"$f":"+$I4","v":3.5},{"$f":"+$J4","v":3.5},{"$f":"+$K4","v":3.5},{"$f":"+$L4","v":3.5},{"$f":"+$M4","v":2.75},{"$f":"+$N4","v":"R"},{"$f":"+$O4","v":"R"},{"$f":"+$I4","v":3.5},{"$f":"+$J4","v":3.5},{"$f":"+$K4","v":3.5},{"$f":"+$L4","v":3.5},{"$f":"+$M4","v":2.75},{"$f":"+$N4","v":"R"},{"$f":"+$O4","v":"R"},"h contrat",{"$f":"H4","v":54.17},"HEURE CAT",{"$f":"+H4","v":54.17},{"$f":"AZ4*E4","v":638.66430000000003}]
[null,null,{"$f":"+C4","v":"CDI"},"ASCA",11.79,null,"H. ABS",null,null,null,null,null,null,null,null,null,null,null,null,null,null,null,null,null,null,null,null,3.5,3.5,3.5,3.5,2.75,null,null,3.5,3.5,3.5,3.5,2.75,null,null,3.5,3.5,3.5,3.5,2.75,null,null,"h travaillable",{"$f":"SUM(R4:AV4)","v":69.75},"H. ABS",{"$f":"SUM(R5:AV5)","v":50.25},{"$f":"AZ5*E5","v":592.44749999999999}]
[null,null,"CDI","ASCA",11.79,null,"H. SUP",null,null,null,null,null,null,null,null,null,null,null,null,null,null,null,null,null,null,null,null,null,null,null,null,null,null,null,null,null,null,null,null,null,null,null,null,null,null,null,null,null,"h travaillées",{"$f":"AX5-AZ5+AZ6","v":19.5},"H. SUP",{"$f":"SUM(R6:AV6)","v":0},{"$f":"IF(H4<35*52/12,IF(BB6=\"O\",AZ6*1.1*E6,AZ6*1.11*E6),AZ6*1.25*E6)","v":0},{"$f":"IF(C4=\"CDI\",IF(AZ6<AZ4*0.1,\"N\",\"O\"),\"N\")","v":"N"}]
{"$rows_left_out":21}