{"text_format":"1","workbook":"xlsx","n_sheets":21,"sheets":["Vos 9 piliers de vie","Objectif SMARTER","Etapes vers objectif","Liste costumes actuels","Utile vs inutile","Costumes à jeter","Synthèse 1","Préciser et trier","A porter seul","A partager","A donner","Aporterseul","Apartager","Synthèse 2","Synthèse 2 essai","24 forces de caractère","Forces","Talents","Qualités","Synthèse 3","Synthèse finale"],"not_rendered":{"charts":0,"images":0,"macros":1,"external_links":0,"defined_names":6,"comments":1,"pivot_tables":0},"unopened":[],"bounds":{"document_bytes":16777216,"sheet_cells":100000,"rows_first":2000,"rows_last":500,"rows_between":2000,"halvings":0,"cell_chars":16384,"cell_head_chars":4096},"cells_cut":0,"cells_raw":0,"read":"whole","date_system":"1900"}

{"sheet":"Vos 9 piliers de vie","index":0,"n_rows":29,"n_cols":4,"rows_kept":29,"cut":false,"hidden":false,"merged":[]}
["Etape 1 : Etat des lieux, bilan, prise de recul. Soyez vous-même."]
[]
["Inscrivez la date du jour (JJ/MM/AAAA) :"]
[]
["Vos 9 piliers de vie :","Questions à poser :","Note actuelle sur 10","Note souhaitée dans 6 mois sur 10"]
["Vie de famille : parents, frères, oncles, maris, épouse, enfants… ","Comment vous sentez-vous dans votre sphère familiale ?"]
["Vie amoureuse","Comment vous sentez-vous dans ce pilier ?"]
["Vie sociale (amis, copains, collègues…)","Comment décrivez-vous votre cadre social ? Plutôt un petit cercle d’amis, ou large… "]
["Vie professionnelle","Avez-vous choisi librement votre métier et votre poste actuel ?"]
["Plaisirs personnels = petites actions du quotidien qui vous font du bien (lire, marcher, profiter du soleil…), et qui ne dépendent QUE de VOUS.","Quelle est la dernière action que vous avez réalisée qui vous a procuré de la détente, de la joie ?"]
["Hygiène de vie = votre corps, sous un aspect fonctionnel (sport, sommeil, alimentation, prise de médicaments). ","Dormez-vous bien ?\nPrenez vous soin de votre alimentation ?\nPratiquez vous une activité physique régulière ?"]
["Gestion du quotidien = administratif, ménage, courses, argent.","Gérez-vous facilement votre quotidien ?"]
["Actions pour le monde = temps, argent, actions concrètes (tri déchets, don, vêtements…).","Quelles actions pour le monde faites-vous ?"]
["Epanouissement personnel = réflexion sur soi, confiance en soi, développement personnel.","Comment vous aimeriez vous épanouir davantage ?"]
[]
[]
[]
["Pour liste déroulante :"]
[]
[1]
[2]
[3]
[4]
[5]
[6]
[7]
[8]
[9]
[10]

{"sheet":"Objectif SMARTER","index":1,"n_rows":19,"n_cols":8,"rows_kept":19,"cut":false,"hidden":false,"merged":[]}
["Etape 2 : Un 1er jet de votre objectif SMARTER"]
[]
["Définissez votre objectif SMARTER :"]
["Important : votre objectif doit inclure les 2 dimensions suivantes : relationnelle et santé."]
["Objectif écrit :","S = Spécifique : précis, concret","M = Mesurable : définir un indicateur mesurable","A = Atteignable, Accessible","R = Réalisable dans le contexte actuel","T = Temporairement défini => objectif doit être atteint à telle date","E = Enthousiasmant et inspirant !","R = Réévaluable"]
["Je veux…"]
[]
[]
["Définissez la note que vous devez obtenir dans vos 9 piliers de vie pour atteindre votre objectif :"]
["Pilier de vie :","Note à obtenir sur 10 pour atteindre votre objectif","Rappel note actuelle","Rappel note souhaitée (indépendamment de l'objectif)"]
["Vie de famille : parents, frères, oncles, mari, épouse, enfants… ",null,{"$f":"'Vos 9 piliers de vie'!C6","v":0},{"$f":"+'Vos 9 piliers de vie'!D6","v":0}]
["Vie amoureuse",null,{"$f":"'Vos 9 piliers de vie'!C7","v":0},{"$f":"+'Vos 9 piliers de vie'!D7","v":0}]
["Vie sociale",null,{"$f":"'Vos 9 piliers de vie'!C8","v":0},{"$f":"+'Vos 9 piliers de vie'!D8","v":0}]
["Vie professionnelle",null,{"$f":"'Vos 9 piliers de vie'!C9","v":0},{"$f":"+'Vos 9 piliers de vie'!D9","v":0}]
["Plaisirs personnels",null,{"$f":"'Vos 9 piliers de vie'!C10","v":0},{"$f":"+'Vos 9 piliers de vie'!D10","v":0}]
["Hygiène de vie",null,{"$f":"'Vos 9 piliers de vie'!C11","v":0},{"$f":"+'Vos 9 piliers de vie'!D11","v":0}]
["Gestion du quotidien",null,{"$f":"'Vos 9 piliers de vie'!C12","v":0},{"$f":"+'Vos 9 piliers de vie'!D12","v":0}]
["Action pour le monde",null,{"$f":"'Vos 9 piliers de vie'!C13","v":0},{"$f":"+'Vos 9 piliers de vie'!D13","v":0}]
["Epanouissement personnel",null,{"$f":"'Vos 9 piliers de vie'!C14","v":0},{"$f":"+'Vos 9 piliers de vie'!D14","v":0}]

{"sheet":"Etapes vers objectif","index":2,"n_rows":12,"n_cols":7,"rows_kept":12,"cut":false,"hidden":false,"merged":[[2,3,2,6],[2,1,2,2]]}
["Etape 2 : Définition de l'objectif"]
[]
[null,"Rappel de votre objectif :",null,{"$f":"+'Objectif SMARTER'!$A$6","v":"Je veux…"}]
[]
[]
["Listez les grandes étapes à passer pour atteindre votre objectif (5 max.) :"]
["Etape","Par ordre de réalisation : nom de l'étape","Pourquoi cette étape est utile ?\n(Lier cette étape à l’objectif)","Durée de réalisation réaliste\nET pour quand doit-elle être réalisée ? (Date limite, …)","De qui avez-vous besoin pour réaliser cette étape ?\n(Services, collègues, supérieurs membres de votre famille, amis, institutions, clients, fournisseurs, etc.)","Quelles tâches/ actions précises et concrêtes doivent être faites pour réussir cette étape ?\n(= qui donnent des résultats/objectif)","Critère(s) mesurable(s) de réalisation de l'étape ?"]
[1]
[2]
[3]
[4]
[5]

{"sheet":"Liste costumes actuels","index":3,"n_rows":32,"n_cols":11,"rows_kept":32,"cut":false,"hidden":false,"merged":[]}
["Etape 3 : Je sais quels rôles actuels je dois conserver ou jeter, pour réussir sans tout perdre"]
[]
["Listez vos costumes/ rôles portés actuellement (10 max.) :"]
["Costume n°",1,2,3,4,5,6,7,8,9,10]
["Nom du rôle-costume endossé","Leader","Manager (en interne)","Partenaire commercial (à l'externe)","Mari / Amant","Père","Oncle, fils, etc. (vie familiale)","Ami / copain (vie sociale)","Loisirs (activités, clubs, etc.)","Dormeur","Sportif"]
["Symbole qui représente ce rôle-costume (figurine, vêtements, objet distinctif)","Cravate","Casquette spécifique","Bracelet, amulette","Anneau, bracelet, amulette, paire de lunettes, style de vêtement","Casquette spécifique, tee shirt spécifique","Type de chaussures","Type de pull","Porte clé qui représente votre activité","Pyjama","Statut, effigie, photo, portrait d'un sportif inspirant"]
["Quand le portez-vous ? (Situations, contextes, horaires précis…)","- Lors de séances avec M. G.\n- En rdv avec le client H"]
["Poids ressenti sur 10\n(0 = très léger, 10 = trop lourd)",10,9,8,8,7,8,5,4,9,9]
["Porté avec qui ?\n(membres de votre famille, amis, collègues, supérieurs, etc.)","Avec M. X, M. G, M. H, Mme. Z"]
["Combien d’heures le portez-vous /jour, /semaine, /mois, /année ? (en moyenne)","10h/jour"]
["Action 1","Répondre aux mails & aux appels importants","Communiquer les actions prioritaires à mes équipes directes.","Répondre aux principaux partenaires externes de l'entreprise","Communiquer régulièrement avec elle/lui","Apporter de l'amour à mon enfant selon son langage de l'amour (= cadeaux, moments de qualité, services rendus, toucher physique, paroles valorisantes)","Appeler les membres X, Y, et R de ma famille 1 fois/mois.","Passer du temps avec mes ami(e)s","Lire 30 minutes/semaine un livre \"plaisir\".","Suivre un rituel du coucher identique tous les soirs.","Acheter mes tenues et mon matériel de sport."]
["Action 2","Présenter les résultats de l'entreprise","Encourager et motiver toutes les personnes que je manage.","Gérer la relation avec les fournisseurs","Accorder x heures par jour/semaine à elle/lui","M'assurer que mon/mes enfant(s) à des vêtements propres à mettre chaque jour.","Répondre aux appels de mon père.","Rencontrer de nouvelles personnes","Participer au carnaval de ma ville avec mon enfant.","Ne pas regarder d'écrans au moins 1h avant de me coucher.","Courir 2 fois / semaine pendant 30 minutes minimum."]
["Action 3","Définir et valider la vision/stratégie à moyen et à long terme pour l'entreprise. Réflexions et discusssions stratégiques","Informer Mme J, M. O, et l'équipe X, des actions à entreprendre cette semaine","Gérer la relation avec les clients","Répondre à ses demandes/messages/sollicitations","Accompagner mon/mes enfant(s) à ses activités extra-scolaires. Assurer les déplacements de mon/mes enfant(s)","Soutenir Mme X dans les x prochains mois.","Appeler/écrire à mes ami(e)s X, Z, et A au moins 1 fois/mois.","Prendre 7 jours de vacances tous les 3 mois.","Me lever chaque matin à une heure fixe.","M'étirer 10 minutes tous les soirs à 21h00."]
["Action 4","Gérer des rdv et appeler les clients/partenaires/fournisseurs/ etc.","Communiquer les objectifs à atteindre aux directeurs des différents services/ unités/ départements.","Gérer la relation avec la presse","Emmener ma femme/mon mari au restaurant en tête à tête au moins 1 fois/semaine.","Assurer l'éducation de mon enfant et aider mon/mes enfant(s) dans ses apprentissages.","Organiser un weekend avec X et Y au moins 2 fois/an.","Répondre à mes ami(e)s dans les 3 jours.","Pratiquer une activité qui me plaît chaque semaine, pendant x heures minimum.","Méditer, visualiser, ou prendre un temps calme chaque jour de 10 minutes au réveil / à 13h00 / au coucher.","Boire au moins 1,5 litres d'eau par jour."]
["Action 5","M'informer des tendances actuelles et futures qui pourraient impacter l'entreprise + Me former : min. 1 formation /an","Déléguer le travail 1 et 2 à Mme O.","Gérer la relation avec les partenaires financiers","Programmer au moins 1 we entre amoureux/mois.","Assurer un environnement sain, propre et sécurisé pour mon/mes enfant(s)","Me rendre disponible pour les anniversaires de P, S, et J chaque année.","Programmer au moins 1 sortie avec mes amis W, R, et U /mois.","Visiter des expositions/lieux/musées","Manger léger tous les soirs du lundi au vendredi, sans sucre ni café.","Manger des légumes midi et soir, et des protéines matin et midi."]
[]
["Notes : préciser le plus possibles les actions que vous faites déjà."]
[]
[]
["Exemple :"]
[{"$f":"+A4","v":"Costume n°"},1,2,3,4,5,6,7,8,9,10]
[{"$f":"+A5","v":"Nom du rôle-costume endossé"},"Leader","Manager (en interne)","Partenaire commercial (à l'externe)","Mari / Amant","Père","Oncle, fils, etc. (vie familiale)","Ami / copain (vie sociale)","Loisirs (activités, clubs, etc.)","Dormeur","Sportif"]
[{"$f":"+A6","v":"Symbole qui représente ce rôle-costume (figurine, vêtements, objet distinctif)"},"Cravate","Casquette spécifique","Bracelet, amulette","Anneau, bracelet, amulette, paire de lunettes, style de vêtement","Casquette spécifique, tee shirt spécifique","Type de chaussures","Type de pull","Porte clé qui représente votre activité","Pyjama","Statut, effigie, photo, portrait d'un sportif inspirant"]
[{"$f":"+A7","v":"Quand le portez-vous ? (Situations, contextes, horaires précis…)"},"- Lors de séances avec M. G.\n- En rdv avec le client H",0,0,0,0,0,0,0,0,0]
[{"$f":"+A8","v":"Poids ressenti sur 10\n(0 = très léger, 10 = trop lourd)"},10,9,8,8,7,8,5,4,9,9]
[{"$f":"+A9","v":"Porté avec qui ?\n(membres de votre famille, amis, collègues, supérieurs, etc.)"},"Avec M. X, M. G, M. H, Mme. Z",0,0,0,0,0,0,0,0,0]
[{"$f":"+A10","v":"Combien d’heures le portez-vous /jour, /semaine, /mois, /année ? (en moyenne)"},"10h/jour",0,0,0,0,0,0,0,0,0]
[{"$f":"+A11","v":"Action 1"},"Répondre aux mails & aux appels importants","Communiquer les actions prioritaires à mes équipes directes.","Répondre aux principaux partenaires externes de l'entreprise","Communiquer régulièrement avec elle/lui","Apporter de l'amour à mon enfant selon son langage de l'amour (= cadeaux, moments de qualité, services rendus, toucher physique, paroles valorisantes)","Appeler les membres X, Y, et R de ma famille 1 fois/mois.","Passer du temps avec mes ami(e)s","Lire 30 minutes/semaine un livre \"plaisir\".","Suivre un rituel du coucher identique tous les soirs.","Acheter mes tenues et mon matériel de sport."]
[{"$f":"+A12","v":"Action 2"},"Présenter les résultats de l'entreprise","Encourager et motiver toutes les personnes que je manage.","Gérer la relation avec les fournisseurs","Accorder x heures par jour/semaine à elle/lui","M'assurer que mon/mes enfant(s) à des vêtements propres à mettre chaque jour.","Répondre aux appels de mon père.","Rencontrer de nouvelles personnes","Participer au carnaval de ma ville avec mon enfant.","Ne pas regarder d'écrans au moins 1h avant de me coucher.","Courir 2 fois / semaine pendant 30 minutes minimum."]
[{"$f":"+A13","v":"Action 3"},"Définir et valider la vision/stratégie à moyen et à long terme pour l'entreprise. Réflexions et discusssions stratégiques","Informer Mme J, M. O, et l'équipe X, des actions à entreprendre cette semaine","Gérer la relation avec les clients","Répondre à ses demandes/messages/sollicitations","Accompagner mon/mes enfant(s) à ses activités extra-scolaires. Assurer les déplacements de mon/mes enfant(s)","Soutenir Mme X dans les x prochains mois.","Appeler/écrire à mes ami(e)s X, Z, et A au moins 1 fois/mois.","Prendre 7 jours de vacances tous les 3 mois.","Me lever chaque matin à une heure fixe.","M'étirer 10 minutes tous les soirs à 21h00."]
[{"$f":"+A14","v":"Action 4"},"Gérer des rdv et appeler les clients/partenaires/fournisseurs/ etc.","Communiquer les objectifs à atteindre aux directeurs des différents services/ unités/ départements.","Gérer la relation avec la presse","Emmener ma femme/mon mari au restaurant en tête à tête au moins 1 fois/semaine.","Assurer l'éducation de mon enfant et aider mon/mes enfant(s) dans ses apprentissages.","Organiser un weekend avec X et Y au moins 2 fois/an.","Répondre à mes ami(e)s dans les 3 jours.","Pratiquer une activité qui me plaît chaque semaine, pendant x heures minimum.","Méditer, visualiser, ou prendre un temps calme chaque jour de 10 minutes au réveil / à 13h00 / au coucher.","Boire au moins 1,5 litres d'eau par jour."]
[{"$f":"+A15","v":"Action 5"},"M'informer des tendances actuelles et futures qui pourraient impacter l'entreprise + Me former : min. 1 formation /an","Déléguer le travail 1 et 2 à Mme O.","Gérer la relation avec les partenaires financiers","Programmer au moins 1 we entre amoureux/mois.","Assurer un environnement sain, propre et sécurisé pour mon/mes enfant(s)","Me rendre disponible pour les anniversaires de P, S, et J chaque année.","Programmer au moins 1 sortie avec mes amis W, R, et U /mois.","Visiter des expositions/lieux/musées","Manger léger tous les soirs du lundi au vendredi, sans sucre ni café.","Manger des légumes midi et soir, et des protéines matin et midi."]

{"sheet":"Utile vs inutile","index":4,"n_rows":28,"n_cols":11,"rows_kept":28,"cut":false,"hidden":false,"merged":[[2,0,2,1],[2,2,2,6]]}
["Etape 3 : Je sais quels rôles actuels je dois conserver ou jeter, pour réussir sans tout perdre !"]
[]
["Rappel de votre objectif :",null,{"$f":"+'Objectif SMARTER'!$A$6","v":"Je veux…"}]
[]
["A GARDER"]
["A JETER"]
[]
["Evaluez l'utilité de chaque costume/ rôle porté actuellement au regard de votre objectif :"]
["Formule pour A GARDER",{"$f":"B14&\"_\"&COUNTIF($B$14:B$14,$A$5)","v":"A GARDER_1"},{"$f":"C14&\"_\"&COUNTIF($B$14:C$14,$A$5)","v":"A GARDER_2"},{"$f":"D14&\"_\"&COUNTIF($B$14:D$14,$A$5)","v":"A GARDER_3"},{"$f":"E14&\"_\"&COUNTIF($B$14:E$14,$A$5)","v":"A GARDER_4"},{"$f":"F14&\"_\"&COUNTIF($B$14:F$14,$A$5)","v":"A GARDER_5"},{"$f":"G14&\"_\"&COUNTIF($B$14:G$14,$A$5)","v":"A GARDER_6"},{"$f":"H14&\"_\"&COUNTIF($B$14:H$14,$A$5)","v":"A GARDER_7"},{"$f":"I14&\"_\"&COUNTIF($B$14:I$14,$A$5)","v":"A GARDER_8"},{"$f":"J14&\"_\"&COUNTIF($B$14:J$14,$A$5)","v":"A GARDER_9"},{"$f":"K14&\"_\"&COUNTIF($B$14:K$14,$A$5)","v":"A GARDER_10"}]
["Formule pour A JETER",{"$f":"B14&\"_\"&COUNTIF($B$14:B$14,$A$6)","v":"A GARDER_0"},{"$f":"C14&\"_\"&COUNTIF($B$14:C$14,$A$6)","v":"A GARDER_0"},{"$f":"D14&\"_\"&COUNTIF($B$14:D$14,$A$6)","v":"A GARDER_0"},{"$f":"E14&\"_\"&COUNTIF($B$14:E$14,$A$6)","v":"A GARDER_0"},{"$f":"F14&\"_\"&COUNTIF($B$14:F$14,$A$6)","v":"A GARDER_0"},{"$f":"G14&\"_\"&COUNTIF($B$14:G$14,$A$6)","v":"A GARDER_0"},{"$f":"H14&\"_\"&COUNTIF($B$14:H$14,$A$6)","v":"A GARDER_0"},{"$f":"I14&\"_\"&COUNTIF($B$14:I$14,$A$6)","v":"A GARDER_0"},{"$f":"J14&\"_\"&COUNTIF($B$14:J$14,$A$6)","v":"A GARDER_0"},{"$f":"K14&\"_\"&COUNTIF($B$14:K$14,$A$6)","v":"A GARDER_0"}]
[{"$f":"+'Liste costumes actuels'!A4","v":"Costume n°"},{"$f":"+'Liste costumes actuels'!B4","v":1},{"$f":"+'Liste costumes actuels'!C4","v":2},{"$f":"+'Liste costumes actuels'!D4","v":3},{"$f":"+'Liste costumes actuels'!E4","v":4},{"$f":"+'Liste costumes actuels'!F4","v":5},{"$f":"+'Liste costumes actuels'!G4","v":6},{"$f":"+'Liste costumes actuels'!H4","v":7},{"$f":"+'Liste costumes actuels'!I4","v":8},{"$f":"+'Liste costumes actuels'!J4","v":9},{"$f":"+'Liste costumes actuels'!K4","v":10}]
[{"$f":"+'Liste costumes actuels'!A5","v":"Nom du rôle-costume endossé"},{"$f":"+'Liste costumes actuels'!B5","v":"Leader"},{"$f":"+'Liste costumes actuels'!C5","v":"Manager (en interne)"},{"$f":"+'Liste costumes actuels'!D5","v":"Partenaire commercial (à l'externe)"},{"$f":"+'Liste costumes actuels'!E5","v":"Mari / Amant"},{"$f":"+'Liste costumes actuels'!F5","v":"Père"},{"$f":"+'Liste costumes actuels'!G5","v":"Oncle, fils, etc. (vie familiale)"},{"$f":"+'Liste costumes actuels'!H5","v":"Ami / copain (vie sociale)"},{"$f":"+'Liste costumes actuels'!I5","v":"Loisirs (activités, clubs, etc.)"},{"$f":"+'Liste costumes actuels'!J5","v":"Dormeur"},{"$f":"+'Liste costumes actuels'!K5","v":"Sportif"}]
["Utilité sur 10 / objectif visé\n(0 = inutile, 10 = indispensable)",10,9,10,8,8,5,6,6,10,7]
["A garder / A jeter ?","A GARDER","A GARDER","A GARDER","A GARDER","A GARDER","A GARDER","A GARDER","A GARDER","A GARDER","A GARDER"]
["Pourquoi ce costume est utile / objectif ?\n(lier ce costume à une valeur haute = qui augmente votre énergie)","Car",0,0,0,0,0,0,0,0,0]
["Quand doit-il être porté ? \n(Etape(s) vers objectif, situations, contextes, lieux, horaires précis, niveau d'énergie requis, etc.)","- En réunion\n- En rdv avec les clients X et F",0,0,0,0,0,0,0,0,0]
["Avec qui doit-il être porté ?\n(membres de votre famille, amis, collègues, supérieurs, etc.)","Avec les membres du CA",0,0,0,0,0,0,0,0,0]
["Combien d’heures doit-il être porté min. / max. par jour/ semaine/ mois/ année ?\n(pour atteindre l'objectif)","5h max./jour","5h min./semaine","2h min./semaine","24h min./semaine (2h/jour en semaine + 7h/jour les we)","24h min./semaine (2h/jour en semaine + 7h/jour les we)","4h min./mois","2h min./semaine","1h min./semaine","7h min./jour","2h min./semaine"]
[]
[]
["Exemple :"]
[{"$f":"+A11","v":"Costume n°"},{"$f":"+B11","v":1},2,3,4,5,6,7,8,9,10]
[{"$f":"+A12","v":"Nom du rôle-costume endossé"},{"$f":"+B12","v":"Leader"},"Manager (en interne)","Partenaire commercial (à l'externe)","Mari / Amant","Père","Oncle, fils, etc. (vie familiale)","Ami / copain (vie sociale)","Loisirs (activités, clubs, etc.)","Dormeur","Sportif"]
[{"$f":"+A13","v":"Utilité sur 10 / objectif visé\n(0 = inutile, 10 = indispensable)"},{"$f":"+B13","v":10},9,10,8,8,5,6,6,10,7]
[{"$f":"+A15","v":"Pourquoi ce costume est utile / objectif ?\n(lier ce costume à une valeur haute = qui augmente votre énergie)"},"Car",0,0,0,0,0,0,0,0,0]
["Quand doit-il être porté ? \n(Etape(s) vers objectif, situations, contextes, lieux, horaires précis, niveau d'énergie requis, etc.)","- En réunion\n- En rdv avec les clients X et F",0,0,0,0,0,0,0,0,0]
["Avec qui doit-il être porté ?\n(membres de votre famille, amis, collègues, supérieurs, etc.)","Avec les membres du CA",0,0,0,0,0,0,0,0,0]
["Combien d’heures doit-il être porté min. / max. par jour/ semaine/ mois/ année ?\n(pour atteindre l'objectif)","5h max./jour","5h min./semaine","2h min./semaine","24h min./semaine (2h/jour en semaine + 7h/jour les we)","24h min./semaine (2h/jour en semaine + 7h/jour les we)","4h min./mois","2h min./semaine","1h min./semaine","7h min./jour","2h min./semaine"]

{"sheet":"Costumes à jeter","index":5,"n_rows":16,"n_cols":11,"rows_kept":16,"cut":false,"hidden":false,"merged":[[4,0,4,1],[4,2,4,6]]}
["Etape 4 : Je modifie mes rôles actuels pour atteindre mon objectif sans devoir tout faire !"]
[]
["A JETER"]
[]
["Rappel de votre objectif :",null,{"$f":"+'Objectif SMARTER'!$A$6","v":"Je veux…"}]
[]
["Précisez comment vous allez jeter certains de vos rôles-costumes :"]
["Formule",1,2,3,4,5,6,7,8,9,10]
[{"$f":"+'Liste costumes actuels'!A4","v":"Costume n°"},{"$f":"IFERROR(HLOOKUP($A$3&\"_\"&B$8,'Utile vs inutile'!$10:18,2,0),\"\")","v":""},{"$f":"IFERROR(HLOOKUP($A$3&\"_\"&C$8,'Utile vs inutile'!$10:18,2,0),\"\")","v":""},{"$f":"IFERROR(HLOOKUP($A$3&\"_\"&D$8,'Utile vs inutile'!$10:18,2,0),\"\")","v":""},{"$f":"IFERROR(HLOOKUP($A$3&\"_\"&E$8,'Utile vs inutile'!$10:18,2,0),\"\")","v":""},{"$f":"IFERROR(HLOOKUP($A$3&\"_\"&F$8,'Utile vs inutile'!$10:18,2,0),\"\")","v":""},{"$f":"IFERROR(HLOOKUP($A$3&\"_\"&G$8,'Utile vs inutile'!$10:18,2,0),\"\")","v":""},{"$f":"IFERROR(HLOOKUP($A$3&\"_\"&H$8,'Utile vs inutile'!$10:18,2,0),\"\")","v":""},{"$f":"IFERROR(HLOOKUP($A$3&\"_\"&I$8,'Utile vs inutile'!$10:18,2,0),\"\")","v":""},{"$f":"IFERROR(HLOOKUP($A$3&\"_\"&J$8,'Utile vs inutile'!$10:18,2,0),\"\")","v":""},{"$f":"IFERROR(HLOOKUP($A$3&\"_\"&K$8,'Utile vs inutile'!$10:18,2,0),\"\")","v":""}]
["Nom du costume",{"$f":"IFERROR(HLOOKUP($A$3&\"_\"&B$8,'Utile vs inutile'!$10:18,3,0),\"\")","v":""},{"$f":"IFERROR(HLOOKUP($A$3&\"_\"&C$8,'Utile vs inutile'!$10:18,3,0),\"\")","v":""},{"$f":"IFERROR(HLOOKUP($A$3&\"_\"&D$8,'Utile vs inutile'!$10:18,3,0),\"\")","v":""},{"$f":"IFERROR(HLOOKUP($A$3&\"_\"&E$8,'Utile vs inutile'!$10:18,3,0),\"\")","v":""},{"$f":"IFERROR(HLOOKUP($A$3&\"_\"&F$8,'Utile vs inutile'!$10:18,3,0),\"\")","v":""},{"$f":"IFERROR(HLOOKUP($A$3&\"_\"&G$8,'Utile vs inutile'!$10:18,3,0),\"\")","v":""},{"$f":"IFERROR(HLOOKUP($A$3&\"_\"&H$8,'Utile vs inutile'!$10:18,3,0),\"\")","v":""},{"$f":"IFERROR(HLOOKUP($A$3&\"_\"&I$8,'Utile vs inutile'!$10:18,3,0),\"\")","v":""},{"$f":"IFERROR(HLOOKUP($A$3&\"_\"&J$8,'Utile vs inutile'!$10:18,3,0),\"\")","v":""},{"$f":"IFERROR(HLOOKUP($A$3&\"_\"&K$8,'Utile vs inutile'!$10:18,3,0),\"\")","v":""}]
["Comment ?\n(Déléguer, arrêter cette production, arrêter ce service, embaucher, cesser ou modifier la relation, etc.)"]
["Quelles actions à faire pour le jeter ? (Annonces, réunions, etc.)"]
["Qui cela implique ?"]
["Quand allez-vous le jeter ?"]
["Combien cela va vous coûter ?\n(Prix financier, émotionnel, relationnel…)"]
["Quelles conséquences positives / votre objectif ?"]

{"sheet":"Synthèse 1","index":6,"n_rows":22,"n_cols":11,"rows_kept":22,"cut":false,"hidden":false,"merged":[[2,1,2,4]]}
["Synthèse 1 des rôles-costumes à endosser :"]
[]
["Objectif rappel :",{"$f":"+'Objectif SMARTER'!$A$6","v":"Je veux…"}]
[]
["A GARDER"]
[]
["Synthèse des rôles-costumes à porter pour atteindre votre objectif :"]
["Pour formule",1,2,3,4,5,6,7,8,9,10]
[{"$f":"+'Liste costumes actuels'!A4","v":"Costume n°"},{"$f":"IFERROR(HLOOKUP($A$5&\"_\"&B$8,'Utile vs inutile'!$9:$18,3,0),\"\")","v":1},{"$f":"IFERROR(HLOOKUP($A$5&\"_\"&C$8,'Utile vs inutile'!$9:$18,3,0),\"\")","v":2},{"$f":"IFERROR(HLOOKUP($A$5&\"_\"&D$8,'Utile vs inutile'!$9:$18,3,0),\"\")","v":3},{"$f":"IFERROR(HLOOKUP($A$5&\"_\"&E$8,'Utile vs inutile'!$9:$18,3,0),\"\")","v":4},{"$f":"IFERROR(HLOOKUP($A$5&\"_\"&F$8,'Utile vs inutile'!$9:$18,3,0),\"\")","v":5},{"$f":"IFERROR(HLOOKUP($A$5&\"_\"&G$8,'Utile vs inutile'!$9:$18,3,0),\"\")","v":6},{"$f":"IFERROR(HLOOKUP($A$5&\"_\"&H$8,'Utile vs inutile'!$9:$18,3,0),\"\")","v":7},{"$f":"IFERROR(HLOOKUP($A$5&\"_\"&I$8,'Utile vs inutile'!$9:$18,3,0),\"\")","v":8},{"$f":"IFERROR(HLOOKUP($A$5&\"_\"&J$8,'Utile vs inutile'!$9:$18,3,0),\"\")","v":9},{"$f":"IFERROR(HLOOKUP($A$5&\"_\"&K$8,'Utile vs inutile'!$9:$18,3,0),\"\")","v":10}]
[{"$f":"+'Liste costumes actuels'!A5","v":"Nom du rôle-costume endossé"},{"$f":"IFERROR(HLOOKUP($A$5&\"_\"&B$8,'Utile vs inutile'!$9:$18,4,0),\"\")","v":"Leader"},{"$f":"IFERROR(HLOOKUP($A$5&\"_\"&C$8,'Utile vs inutile'!$9:$18,4,0),\"\")","v":"Manager (en interne)"},{"$f":"IFERROR(HLOOKUP($A$5&\"_\"&D$8,'Utile vs inutile'!$9:$18,4,0),\"\")","v":"Partenaire commercial (à l'externe)"},{"$f":"IFERROR(HLOOKUP($A$5&\"_\"&E$8,'Utile vs inutile'!$9:$18,4,0),\"\")","v":"Mari / Amant"},{"$f":"IFERROR(HLOOKUP($A$5&\"_\"&F$8,'Utile vs inutile'!$9:$18,4,0),\"\")","v":"Père"},{"$f":"IFERROR(HLOOKUP($A$5&\"_\"&G$8,'Utile vs inutile'!$9:$18,4,0),\"\")","v":"Oncle, fils, etc. (vie familiale)"},{"$f":"IFERROR(HLOOKUP($A$5&\"_\"&H$8,'Utile vs inutile'!$9:$18,4,0),\"\")","v":"Ami / copain (vie sociale)"},{"$f":"IFERROR(HLOOKUP($A$5&\"_\"&I$8,'Utile vs inutile'!$9:$18,4,0),\"\")","v":"Loisirs (activités, clubs, etc.)"},{"$f":"IFERROR(HLOOKUP($A$5&\"_\"&J$8,'Utile vs inutile'!$9:$18,4,0),\"\")","v":"Dormeur"},{"$f":"IFERROR(HLOOKUP($A$5&\"_\"&K$8,'Utile vs inutile'!$9:$18,4,0),\"\")","v":"Sportif"}]
[{"$f":"+'Liste costumes actuels'!A6","v":"Symbole qui représente ce rôle-costume (figurine, vêtements, objet distinctif)"},{"$f":"+IFERROR(HLOOKUP(B$10,'Liste costumes actuels'!$A$5:$K$20,2,0),\"\")","v":"Cravate"},{"$f":"+IFERROR(HLOOKUP(C$10,'Liste costumes actuels'!$A$5:$K$20,2,0),\"\")","v":"Casquette spécifique"},{"$f":"+IFERROR(HLOOKUP(D$10,'Liste costumes actuels'!$A$5:$K$20,2,0),\"\")","v":"Bracelet, amulette"},{"$f":"+IFERROR(HLOOKUP(E$10,'Liste costumes actuels'!$A$5:$K$20,2,0),\"\")","v":"Anneau, bracelet, amulette, paire de lunettes, style de vêtement"},{"$f":"+IFERROR(HLOOKUP(F$10,'Liste costumes actuels'!$A$5:$K$20,2,0),\"\")","v":"Casquette spécifique, tee shirt spécifique"},{"$f":"+IFERROR(HLOOKUP(G$10,'Liste costumes actuels'!$A$5:$K$20,2,0),\"\")","v":"Type de chaussures"},{"$f":"+IFERROR(HLOOKUP(H$10,'Liste costumes actuels'!$A$5:$K$20,2,0),\"\")","v":"Type de pull"},{"$f":"+IFERROR(HLOOKUP(I$10,'Liste costumes actuels'!$A$5:$K$20,2,0),\"\")","v":"Porte clé qui représente votre activité"},{"$f":"+IFERROR(HLOOKUP(J$10,'Liste costumes actuels'!$A$5:$K$20,2,0),\"\")","v":"Pyjama"},{"$f":"+IFERROR(HLOOKUP(K$10,'Liste costumes actuels'!$A$5:$K$20,2,0),\"\")","v":"Statut, effigie, photo, portrait d'un sportif inspirant"}]
[{"$f":"+'Utile vs inutile'!A13","v":"Utilité sur 10 / objectif visé\n(0 = inutile, 10 = indispensable)"},{"$f":"IFERROR(HLOOKUP(B$10,'Utile vs inutile'!$12:$18,2,0),\"\")","v":10},{"$f":"IFERROR(HLOOKUP(C$10,'Utile vs inutile'!$12:$18,2,0),\"\")","v":9},{"$f":"IFERROR(HLOOKUP(D$10,'Utile vs inutile'!$12:$18,2,0),\"\")","v":10},{"$f":"IFERROR(HLOOKUP(E$10,'Utile vs inutile'!$12:$18,2,0),\"\")","v":8},{"$f":"IFERROR(HLOOKUP(F$10,'Utile vs inutile'!$12:$18,2,0),\"\")","v":8},{"$f":"IFERROR(HLOOKUP(G$10,'Utile vs inutile'!$12:$18,2,0),\"\")","v":5},{"$f":"IFERROR(HLOOKUP(H$10,'Utile vs inutile'!$12:$18,2,0),\"\")","v":6},{"$f":"IFERROR(HLOOKUP(I$10,'Utile vs inutile'!$12:$18,2,0),\"\")","v":6},{"$f":"IFERROR(HLOOKUP(J$10,'Utile vs inutile'!$12:$18,2,0),\"\")","v":10},{"$f":"IFERROR(HLOOKUP(K$10,'Utile vs inutile'!$12:$18,2,0),\"\")","v":7}]
[{"$f":"+'Utile vs inutile'!A15","v":"Pourquoi ce costume est utile / objectif ?\n(lier ce costume à une valeur haute = qui augmente votre énergie)"},{"$f":"IFERROR(HLOOKUP(B$10,'Utile vs inutile'!$12:$18,4,0),\"\")","v":"Car"},{"$f":"IFERROR(HLOOKUP(C$10,'Utile vs inutile'!$12:$18,4,0),\"\")","v":0},{"$f":"IFERROR(HLOOKUP(D$10,'Utile vs inutile'!$12:$18,4,0),\"\")","v":0},{"$f":"IFERROR(HLOOKUP(E$10,'Utile vs inutile'!$12:$18,4,0),\"\")","v":0},{"$f":"IFERROR(HLOOKUP(F$10,'Utile vs inutile'!$12:$18,4,0),\"\")","v":0},{"$f":"IFERROR(HLOOKUP(G$10,'Utile vs inutile'!$12:$18,4,0),\"\")","v":0},{"$f":"IFERROR(HLOOKUP(H$10,'Utile vs inutile'!$12:$18,4,0),\"\")","v":0},{"$f":"IFERROR(HLOOKUP(I$10,'Utile vs inutile'!$12:$18,4,0),\"\")","v":0},{"$f":"IFERROR(HLOOKUP(J$10,'Utile vs inutile'!$12:$18,4,0),\"\")","v":0},{"$f":"IFERROR(HLOOKUP(K$10,'Utile vs inutile'!$12:$18,4,0),\"\")","v":0}]
[{"$f":"+'Liste costumes actuels'!A8","v":"Poids ressenti sur 10\n(0 = très léger, 10 = trop lourd)"},{"$f":"+IFERROR(HLOOKUP(B$10,'Liste costumes actuels'!$A$5:$K$20,4,0),\"\")","v":10},{"$f":"+IFERROR(HLOOKUP(C$10,'Liste costumes actuels'!$A$5:$K$20,4,0),\"\")","v":9},{"$f":"+IFERROR(HLOOKUP(D$10,'Liste costumes actuels'!$A$5:$K$20,4,0),\"\")","v":8},{"$f":"+IFERROR(HLOOKUP(E$10,'Liste costumes actuels'!$A$5:$K$20,4,0),\"\")","v":8},{"$f":"+IFERROR(HLOOKUP(F$10,'Liste costumes actuels'!$A$5:$K$20,4,0),\"\")","v":7},{"$f":"+IFERROR(HLOOKUP(G$10,'Liste costumes actuels'!$A$5:$K$20,4,0),\"\")","v":8},{"$f":"+IFERROR(HLOOKUP(H$10,'Liste costumes actuels'!$A$5:$K$20,4,0),\"\")","v":5},{"$f":"+IFERROR(HLOOKUP(I$10,'Liste costumes actuels'!$A$5:$K$20,4,0),\"\")","v":4},{"$f":"+IFERROR(HLOOKUP(J$10,'Liste costumes actuels'!$A$5:$K$20,4,0),\"\")","v":9},{"$f":"+IFERROR(HLOOKUP(K$10,'Liste costumes actuels'!$A$5:$K$20,4,0),\"\")","v":9}]
[{"$f":"+'Utile vs inutile'!A16","v":"Quand doit-il être porté ? \n(Etape(s) vers objectif, situations, contextes, lieux, horaires précis, niveau d'énergie requis, etc.)"},{"$f":"IFERROR(HLOOKUP(B$10,'Utile vs inutile'!$12:$18,5,0),\"\")","v":"- En réunion\n- En rdv avec les clients X et F"},{"$f":"IFERROR(HLOOKUP(C$10,'Utile vs inutile'!$12:$18,5,0),\"\")","v":0},{"$f":"IFERROR(HLOOKUP(D$10,'Utile vs inutile'!$12:$18,5,0),\"\")","v":0},{"$f":"IFERROR(HLOOKUP(E$10,'Utile vs inutile'!$12:$18,5,0),\"\")","v":0},{"$f":"IFERROR(HLOOKUP(F$10,'Utile vs inutile'!$12:$18,5,0),\"\")","v":0},{"$f":"IFERROR(HLOOKUP(G$10,'Utile vs inutile'!$12:$18,5,0),\"\")","v":0},{"$f":"IFERROR(HLOOKUP(H$10,'Utile vs inutile'!$12:$18,5,0),\"\")","v":0},{"$f":"IFERROR(HLOOKUP(I$10,'Utile vs inutile'!$12:$18,5,0),\"\")","v":0},{"$f":"IFERROR(HLOOKUP(J$10,'Utile vs inutile'!$12:$18,5,0),\"\")","v":0},{"$f":"IFERROR(HLOOKUP(K$10,'Utile vs inutile'!$12:$18,5,0),\"\")","v":0}]
[{"$f":"+'Utile vs inutile'!A17","v":"Avec qui doit-il être porté ?\n(membres de votre famille, amis, collègues, supérieurs, etc.)"},{"$f":"IFERROR(HLOOKUP(B$10,'Utile vs inutile'!$12:$18,6,0),\"\")","v":"Avec les membres du CA"},{"$f":"IFERROR(HLOOKUP(C$10,'Utile vs inutile'!$12:$18,6,0),\"\")","v":0},{"$f":"IFERROR(HLOOKUP(D$10,'Utile vs inutile'!$12:$18,6,0),\"\")","v":0},{"$f":"IFERROR(HLOOKUP(E$10,'Utile vs inutile'!$12:$18,6,0),\"\")","v":0},{"$f":"IFERROR(HLOOKUP(F$10,'Utile vs inutile'!$12:$18,6,0),\"\")","v":0},{"$f":"IFERROR(HLOOKUP(G$10,'Utile vs inutile'!$12:$18,6,0),\"\")","v":0},{"$f":"IFERROR(HLOOKUP(H$10,'Utile vs inutile'!$12:$18,6,0),\"\")","v":0},{"$f":"IFERROR(HLOOKUP(I$10,'Utile vs inutile'!$12:$18,6,0),\"\")","v":0},{"$f":"IFERROR(HLOOKUP(J$10,'Utile vs inutile'!$12:$18,6,0),\"\")","v":0},{"$f":"IFERROR(HLOOKUP(K$10,'Utile vs inutile'!$12:$18,6,0),\"\")","v":0}]
[{"$f":"+'Utile vs inutile'!A18","v":"Combien d’heures doit-il être porté min. / max. par jour/ semaine/ mois/ année ?\n(pour atteindre l'objectif)"},{"$f":"IFERROR(HLOOKUP(B$10,'Utile vs inutile'!$12:$18,7,0),\"\")","v":"5h max./jour"},{"$f":"IFERROR(HLOOKUP(C$10,'Utile vs inutile'!$12:$18,7,0),\"\")","v":"5h min./semaine"},{"$f":"IFERROR(HLOOKUP(D$10,'Utile vs inutile'!$12:$18,7,0),\"\")","v":"2h min./semaine"},{"$f":"IFERROR(HLOOKUP(E$10,'Utile vs inutile'!$12:$18,7,0),\"\")","v":"24h min./semaine (2h/jour en semaine + 7h/jour les we)"},{"$f":"IFERROR(HLOOKUP(F$10,'Utile vs inutile'!$12:$18,7,0),\"\")","v":"24h min./semaine (2h/jour en semaine + 7h/jour les we)"},{"$f":"IFERROR(HLOOKUP(G$10,'Utile vs inutile'!$12:$18,7,0),\"\")","v":"4h min./mois"},{"$f":"IFERROR(HLOOKUP(H$10,'Utile vs inutile'!$12:$18,7,0),\"\")","v":"2h min./semaine"},{"$f":"IFERROR(HLOOKUP(I$10,'Utile vs inutile'!$12:$18,7,0),\"\")","v":"1h min./semaine"},{"$f":"IFERROR(HLOOKUP(J$10,'Utile vs inutile'!$12:$18,7,0),\"\")","v":"7h min./jour"},{"$f":"IFERROR(HLOOKUP(K$10,'Utile vs inutile'!$12:$18,7,0),\"\")","v":"2h min./semaine"}]
[{"$f":"+'Liste costumes actuels'!A11","v":"Action 1"},{"$f":"+IFERROR(HLOOKUP(B$10,'Liste costumes actuels'!$A$5:$K$20,7,0),\"\")","v":"Répondre aux mails & aux appels importants"},{"$f":"+IFERROR(HLOOKUP(C$10,'Liste costumes actuels'!$A$5:$K$20,7,0),\"\")","v":"Communiquer les actions prioritaires à mes équipes directes."},{"$f":"+IFERROR(HLOOKUP(D$10,'Liste costumes actuels'!$A$5:$K$20,7,0),\"\")","v":"Répondre aux principaux partenaires externes de l'entreprise"},{"$f":"+IFERROR(HLOOKUP(E$10,'Liste costumes actuels'!$A$5:$K$20,7,0),\"\")","v":"Communiquer régulièrement avec elle/lui"},{"$f":"+IFERROR(HLOOKUP(F$10,'Liste costumes actuels'!$A$5:$K$20,7,0),\"\")","v":"Apporter de l'amour à mon enfant selon son langage de l'amour (= cadeaux, moments de qualité, services rendus, toucher physique, paroles valorisantes)"},{"$f":"+IFERROR(HLOOKUP(G$10,'Liste costumes actuels'!$A$5:$K$20,7,0),\"\")","v":"Appeler les membres X, Y, et R de ma famille 1 fois/mois."},{"$f":"+IFERROR(HLOOKUP(H$10,'Liste costumes actuels'!$A$5:$K$20,7,0),\"\")","v":"Passer du temps avec mes ami(e)s"},{"$f":"+IFERROR(HLOOKUP(I$10,'Liste costumes actuels'!$A$5:$K$20,7,0),\"\")","v":"Lire 30 minutes/semaine un livre \"plaisir\"."},{"$f":"+IFERROR(HLOOKUP(J$10,'Liste costumes actuels'!$A$5:$K$20,7,0),\"\")","v":"Suivre un rituel du coucher identique tous les soirs."},{"$f":"+IFERROR(HLOOKUP(K$10,'Liste costumes actuels'!$A$5:$K$20,7,0),\"\")","v":"Acheter mes tenues et mon matériel de sport."}]
[{"$f":"+'Liste costumes actuels'!A12","v":"Action 2"},{"$f":"+IFERROR(HLOOKUP(B$10,'Liste costumes actuels'!$A$5:$K$20,8,0),\"\")","v":"Présenter les résultats de l'entreprise"},{"$f":"+IFERROR(HLOOKUP(C$10,'Liste costumes actuels'!$A$5:$K$20,8,0),\"\")","v":"Encourager et motiver toutes les personnes que je manage."},{"$f":"+IFERROR(HLOOKUP(D$10,'Liste costumes actuels'!$A$5:$K$20,8,0),\"\")","v":"Gérer la relation avec les fournisseurs"},{"$f":"+IFERROR(HLOOKUP(E$10,'Liste costumes actuels'!$A$5:$K$20,8,0),\"\")","v":"Accorder x heures par jour/semaine à elle/lui"},{"$f":"+IFERROR(HLOOKUP(F$10,'Liste costumes actuels'!$A$5:$K$20,8,0),\"\")","v":"M'assurer que mon/mes enfant(s) à des vêtements propres à mettre chaque jour."},{"$f":"+IFERROR(HLOOKUP(G$10,'Liste costumes actuels'!$A$5:$K$20,8,0),\"\")","v":"Répondre aux appels de mon père."},{"$f":"+IFERROR(HLOOKUP(H$10,'Liste costumes actuels'!$A$5:$K$20,8,0),\"\")","v":"Rencontrer de nouvelles personnes"},{"$f":"+IFERROR(HLOOKUP(I$10,'Liste costumes actuels'!$A$5:$K$20,8,0),\"\")","v":"Participer au carnaval de ma ville avec mon enfant."},{"$f":"+IFERROR(HLOOKUP(J$10,'Liste costumes actuels'!$A$5:$K$20,8,0),\"\")","v":"Ne pas regarder d'écrans au moins 1h avant de me coucher."},{"$f":"+IFERROR(HLOOKUP(K$10,'Liste costumes actuels'!$A$5:$K$20,8,0),\"\")","v":"Courir 2 fois / semaine pendant 30 minutes minimum."}]
[{"$f":"+'Liste costumes actuels'!A13","v":"Action 3"},{"$f":"+IFERROR(HLOOKUP(B$10,'Liste costumes actuels'!$A$5:$K$20,9,0),\"\")","v":"Définir et valider la vision/stratégie à moyen et à long terme pour l'entreprise. Réflexions et discusssions stratégiques"},{"$f":"+IFERROR(HLOOKUP(C$10,'Liste costumes actuels'!$A$5:$K$20,9,0),\"\")","v":"Informer Mme J, M. O, et l'équipe X, des actions à entreprendre cette semaine"},{"$f":"+IFERROR(HLOOKUP(D$10,'Liste costumes actuels'!$A$5:$K$20,9,0),\"\")","v":"Gérer la relation avec les clients"},{"$f":"+IFERROR(HLOOKUP(E$10,'Liste costumes actuels'!$A$5:$K$20,9,0),\"\")","v":"Répondre à ses demandes/messages/sollicitations"},{"$f":"+IFERROR(HLOOKUP(F$10,'Liste costumes actuels'!$A$5:$K$20,9,0),\"\")","v":"Accompagner mon/mes enfant(s) à ses activités extra-scolaires. Assurer les déplacements de mon/mes enfant(s)"},{"$f":"+IFERROR(HLOOKUP(G$10,'Liste costumes actuels'!$A$5:$K$20,9,0),\"\")","v":"Soutenir Mme X dans les x prochains mois."},{"$f":"+IFERROR(HLOOKUP(H$10,'Liste costumes actuels'!$A$5:$K$20,9,0),\"\")","v":"Appeler/écrire à mes ami(e)s X, Z, et A au moins 1 fois/mois."},{"$f":"+IFERROR(HLOOKUP(I$10,'Liste costumes actuels'!$A$5:$K$20,9,0),\"\")","v":"Prendre 7 jours de vacances tous les 3 mois."},{"$f":"+IFERROR(HLOOKUP(J$10,'Liste costumes actuels'!$A$5:$K$20,9,0),\"\")","v":"Me lever chaque matin à une heure fixe."},{"$f":"+IFERROR(HLOOKUP(K$10,'Liste costumes actuels'!$A$5:$K$20,9,0),\"\")","v":"M'étirer 10 minutes tous les soirs à 21h00."}]
[{"$f":"+'Liste costumes actuels'!A14","v":"Action 4"},{"$f":"+IFERROR(HLOOKUP(B$10,'Liste costumes actuels'!$A$5:$K$20,10,0),\"\")","v":"Gérer des rdv et appeler les clients/partenaires/fournisseurs/ etc."},{"$f":"+IFERROR(HLOOKUP(C$10,'Liste costumes actuels'!$A$5:$K$20,10,0),\"\")","v":"Communiquer les objectifs à atteindre aux directeurs des différents services/ unités/ départements."},{"$f":"+IFERROR(HLOOKUP(D$10,'Liste costumes actuels'!$A$5:$K$20,10,0),\"\")","v":"Gérer la relation avec la presse"},{"$f":"+IFERROR(HLOOKUP(E$10,'Liste costumes actuels'!$A$5:$K$20,10,0),\"\")","v":"Emmener ma femme/mon mari au restaurant en tête à tête au moins 1 fois/semaine."},{"$f":"+IFERROR(HLOOKUP(F$10,'Liste costumes actuels'!$A$5:$K$20,10,0),\"\")","v":"Assurer l'éducation de mon enfant et aider mon/mes enfant(s) dans ses apprentissages."},{"$f":"+IFERROR(HLOOKUP(G$10,'Liste costumes actuels'!$A$5:$K$20,10,0),\"\")","v":"Organiser un weekend avec X et Y au moins 2 fois/an."},{"$f":"+IFERROR(HLOOKUP(H$10,'Liste costumes actuels'!$A$5:$K$20,10,0),\"\")","v":"Répondre à mes ami(e)s dans les 3 jours."},{"$f":"+IFERROR(HLOOKUP(I$10,'Liste costumes actuels'!$A$5:$K$20,10,0),\"\")","v":"Pratiquer une activité qui me plaît chaque semaine, pendant x heures minimum."},{"$f":"+IFERROR(HLOOKUP(J$10,'Liste costumes actuels'!$A$5:$K$20,10,0),\"\")","v":"Méditer, visualiser, ou prendre un temps calme chaque jour de 10 minutes au réveil / à 13h00 / au coucher."},{"$f":"+IFERROR(HLOOKUP(K$10,'Liste costumes actuels'!$A$5:$K$20,10,0),\"\")","v":"Boire au moins 1,5 litres d'eau par jour."}]
[{"$f":"+'Liste costumes actuels'!A15","v":"Action 5"},{"$f":"+IFERROR(HLOOKUP(B$10,'Liste costumes actuels'!$A$5:$K$20,11,0),\"\")","v":"M'informer des tendances actuelles et futures qui pourraient impacter l'entreprise + Me former : min. 1 formation /an"},{"$f":"+IFERROR(HLOOKUP(C$10,'Liste costumes actuels'!$A$5:$K$20,11,0),\"\")","v":"Déléguer le travail 1 et 2 à Mme O."},{"$f":"+IFERROR(HLOOKUP(D$10,'Liste costumes actuels'!$A$5:$K$20,11,0),\"\")","v":"Gérer la relation avec les partenaires financiers"},{"$f":"+IFERROR(HLOOKUP(E$10,'Liste costumes actuels'!$A$5:$K$20,11,0),\"\")","v":"Programmer au moins 1 we entre amoureux/mois."},{"$f":"+IFERROR(HLOOKUP(F$10,'Liste costumes actuels'!$A$5:$K$20,11,0),\"\")","v":"Assurer un environnement sain, propre et sécurisé pour mon/mes enfant(s)"},{"$f":"+IFERROR(HLOOKUP(G$10,'Liste costumes actuels'!$A$5:$K$20,11,0),\"\")","v":"Me rendre disponible pour les anniversaires de P, S, et J chaque année."},{"$f":"+IFERROR(HLOOKUP(H$10,'Liste costumes actuels'!$A$5:$K$20,11,0),\"\")","v":"Programmer au moins 1 sortie avec mes amis W, R, et U /mois."},{"$f":"+IFERROR(HLOOKUP(I$10,'Liste costumes actuels'!$A$5:$K$20,11,0),\"\")","v":"Visiter des expositions/lieux/musées"},{"$f":"+IFERROR(HLOOKUP(J$10,'Liste costumes actuels'!$A$5:$K$20,11,0),\"\")","v":"Manger léger tous les soirs du lundi au vendredi, sans sucre ni café."},{"$f":"+IFERROR(HLOOKUP(K$10,'Liste costumes actuels'!$A$5:$K$20,11,0),\"\")","v":"Manger des légumes midi et soir, et des protéines matin et midi."}]

{"sheet":"Préciser et trier","index":7,"n_rows":167,"n_cols":15,"rows_kept":167,"cut":false,"hidden":false,"merged":[[2,1,2,2],[2,3,2,7]]}
[null,"Etape 4 : Je modifie mes rôles actuels pour atteindre mon objectif sans devoir tout faire !"]
[]
[null,"Rappel de votre objectif :",null,{"$f":"+'Objectif SMARTER'!$A$6","v":"Je veux…"}]
[]
[null,"Tableau automatique : Transpose = CTRL+MAJ+ENTER"]
[null,{"$f":"TRANSPOSE('Synthèse 1'!$A$9:$K$22)","v":"Costume n°"},"Nom du rôle-costume endossé","Symbole qui représente ce rôle-costume (figurine, vêtements, objet distinctif)","Utilité sur 10 / objectif visé\n(0 = inutile, 10 = indispensable)","Pourquoi ce costume est utile / objectif ?\n(lier ce costume à une valeur haute = qui augmente votre énergie)","Poids ressenti sur 10\n(0 = très léger, 10 = trop lourd)","Quand doit-il être porté ? \n(Etape(s) vers objectif, situations, contextes, lieux, horaires précis, niveau d'énergie requis, etc.)","Avec qui doit-il être porté ?\n(membres de votre famille, amis, collègues, supérieurs, etc.)","Combien d’heures doit-il être porté min. / max. par jour/ semaine/ mois/ année ?\n(pour atteindre l'objectif)","Action 1","Action 2","Action 3","Action 4","Action 5"]
[null,1,"Leader","Cravate",10,"Car",10,"- En réunion\n- En rdv avec les clients X et F","Avec les membres du CA","5h max./jour","Répondre aux mails & aux appels importants","Présenter les résultats de l'entreprise","Définir et valider la vision/stratégie à moyen et à long terme pour l'entreprise. Réflexions et discusssions stratégiques","Gérer des rdv et appeler les clients/partenaires/fournisseurs/ etc.","M'informer des tendances actuelles et futures qui pourraient impacter l'entreprise + Me former : min. 1 formation /an"]
[null,2,"Manager (en interne)","Casquette spécifique",9,0,9,0,0,"5h min./semaine","Communiquer les actions prioritaires à mes équipes directes.","Encourager et motiver toutes les personnes que je manage.","Informer Mme J, M. O, et l'équipe X, des actions à entreprendre cette semaine","Communiquer les objectifs à atteindre aux directeurs des différents services/ unités/ départements.","Déléguer le travail 1 et 2 à Mme O."]
[null,3,"Partenaire commercial (à l'externe)","Bracelet, amulette",10,0,8,0,0,"2h min./semaine","Répondre aux principaux partenaires externes de l'entreprise","Gérer la relation avec les fournisseurs","Gérer la relation avec les clients","Gérer la relation avec la presse","Gérer la relation avec les partenaires financiers"]
[null,4,"Mari / Amant","Anneau, bracelet, amulette, paire de lunettes, style de vêtement",8,0,8,0,0,"24h min./semaine (2h/jour en semaine + 7h/jour les we)","Communiquer régulièrement avec elle/lui","Accorder x heures par jour/semaine à elle/lui","Répondre à ses demandes/messages/sollicitations","Emmener ma femme/mon mari au restaurant en tête à tête au moins 1 fois/semaine.","Programmer au moins 1 we entre amoureux/mois."]
[null,5,"Père","Casquette spécifique, tee shirt spécifique",8,0,7,0,0,"24h min./semaine (2h/jour en semaine + 7h/jour les we)","Apporter de l'amour à mon enfant selon son langage de l'amour (= cadeaux, moments de qualité, services rendus, toucher physique, paroles valorisantes)","M'assurer que mon/mes enfant(s) à des vêtements propres à mettre chaque jour.","Accompagner mon/mes enfant(s) à ses activités extra-scolaires. Assurer les déplacements de mon/mes enfant(s)","Assurer l'éducation de mon enfant et aider mon/mes enfant(s) dans ses apprentissages.","Assurer un environnement sain, propre et sécurisé pour mon/mes enfant(s)"]
[null,6,"Oncle, fils, etc. (vie familiale)","Type de chaussures",5,0,8,0,0,"4h min./mois","Appeler les membres X, Y, et R de ma famille 1 fois/mois.","Répondre aux appels de mon père.","Soutenir Mme X dans les x prochains mois.","Organiser un weekend avec X et Y au moins 2 fois/an.","Me rendre disponible pour les anniversaires de P, S, et J chaque année."]
[null,7,"Ami / copain (vie sociale)","Type de pull",6,0,5,0,0,"2h min./semaine","Passer du temps avec mes ami(e)s","Rencontrer de nouvelles personnes","Appeler/écrire à mes ami(e)s X, Z, et A au moins 1 fois/mois.","Répondre à mes ami(e)s dans les 3 jours.","Programmer au moins 1 sortie avec mes amis W, R, et U /mois."]
[null,8,"Loisirs (activités, clubs, etc.)","Porte clé qui représente votre activité",6,0,4,0,0,"1h min./semaine","Lire 30 minutes/semaine un livre \"plaisir\".","Participer au carnaval de ma ville avec mon enfant.","Prendre 7 jours de vacances tous les 3 mois.","Pratiquer une activité qui me plaît chaque semaine, pendant x heures minimum.","Visiter des expositions/lieux/musées"]
[null,9,"Dormeur","Pyjama",10,0,9,0,0,"7h min./jour","Suivre un rituel du coucher identique tous les soirs.","Ne pas regarder d'écrans au moins 1h avant de me coucher.","Me lever chaque matin à une heure fixe.","Méditer, visualiser, ou prendre un temps calme chaque jour de 10 minutes au réveil / à 13h00 / au coucher.","Manger léger tous les soirs du lundi au vendredi, sans sucre ni café."]
[null,10,"Sportif","Statut, effigie, photo, portrait d'un sportif inspirant",7,0,9,0,0,"2h min./semaine","Acheter mes tenues et mon matériel de sport.","Courir 2 fois / semaine pendant 30 minutes minimum.","M'étirer 10 minutes tous les soirs à 21h00.","Boire au moins 1,5 litres d'eau par jour.","Manger des légumes midi et soir, et des protéines matin et midi."]
[null,"","","","","","","","","","","","","",""]
[]
[null,"Pour formules :"]
[null,"A porter seul","Lignes à grouper = je n'y arrive pas."]
[null,"A donner"]
[null,"A partager"]
[null,"Sous-action 1"]
[null,"Sous-action 2"]
[null,"Sous-action 3"]
[null,"Sous-action 4"]
[null,"Sous-action 5"]
[null,"Sous-action 6"]
[null,"Sous-action 7"]
[null,"Sous-action 8"]
[null,"Sous-action 9"]
[null,"Sous-action 10"]
[null," = Quoi faire ?"]
[]
[null,"Lister max. 5 sous-actions / action. Vérifier que vos actions/ sous-actions comprennent bien celles indiquées dans l'onglet \"Etapes vers objectif\" :"]
[]
[null,{"$f":"+B$6","v":"Costume n°"},{"$f":"+C$6","v":"Nom du rôle-costume endossé"},{"$f":"+K$6","v":"Action 1"},{"$f":"+L$6","v":"Action 2"},"Action 3","Action 4","Action 5"]
[null,{"$f":"+B7","v":1},{"$f":"+C7","v":"Leader"},{"$f":"+K7","v":"Répondre aux mails & aux appels importants"},{"$f":"+L7","v":"Présenter les résultats de l'entreprise"},{"$f":"+M7","v":"Définir et valider la vision/stratégie à moyen et à long terme pour l'entreprise. Réflexions et discusssions stratégiques"},{"$f":"+N7","v":"Gérer des rdv et appeler les clients/partenaires/fournisseurs/ etc."},{"$f":"+O7","v":"M'informer des tendances actuelles et futures qui pourraient impacter l'entreprise + Me former : min. 1 formation /an"}]
[null,{"$f":"+$B$38","v":1},"Utilité de cette action sur 10 / objectif ?",9,8,9,10,6]
[null,{"$f":"+$B$38","v":1},"Pourquoi cette action est-elle utile ou inutile ? Bénéfices réels/ objectif ?","Parce que XXX","Car xxx","Car ggg","Parce que FFF","Car JJJ"]
[null,{"$f":"+$B$38","v":1},{"$f":"$B$23","v":"Sous-action 1"},"Répondre aux clients externes","S'assurer que les résultats sont corrects",{"$f":"\"A compléter costume \"&$B41&\" \"&F$37&\" \"&Tableau145[[#This Row],[Colonne2]]","v":"A compléter costume 1 Action 3 Sous-action 1"},{"$f":"\"A compléter costume \"&$B41&\" \"&G$37&\" \"&Tableau145[[#This Row],[Colonne2]]","v":"A compléter costume 1 Action 4 Sous-action 1"},{"$f":"\"A compléter costume \"&$B41&\" \"&H$37&\" \"&Tableau145[[#This Row],[Colonne2]]","v":"A compléter costume 1 Action 5 Sous-action 1"}]
[null,1,{"$f":"C41&$B$33","v":"Sous-action 1 = Quoi faire ?"},"A porter seul","A porter seul","A partager","A partager","A porter seul"]
[null,1,{"$f":"$B$24","v":"Sous-action 2"},"Répondre aux fournisseurs","Anticiper le travail à produire par les équipes",{"$f":"\"A compléter costume \"&$B43&\" \"&F$37&\" \"&Tableau145[[#This Row],[Colonne2]]","v":"A compléter costume 1 Action 3 Sous-action 2"},{"$f":"\"A compléter costume \"&$B43&\" \"&G$37&\" \"&Tableau145[[#This Row],[Colonne2]]","v":"A compléter costume 1 Action 4 Sous-action 2"},{"$f":"\"A compléter costume \"&$B43&\" \"&H$37&\" \"&Tableau145[[#This Row],[Colonne2]]","v":"A compléter costume 1 Action 5 Sous-action 2"}]
[null,1,{"$f":"C43&$B$33","v":"Sous-action 2 = Quoi faire ?"},"A donner","A partager","A partager","A porter seul","A partager"]
[null,1,{"$f":"$B$25","v":"Sous-action 3"},"Répondre aux demandes nouvelles venant de l'externe",{"$f":"\"A compléter costume \"&$B45&\" \"&E$37&\" \"&Tableau145[[#This Row],[Colonne2]]","v":"A compléter costume 1 Action 2 Sous-action 3"},{"$f":"\"A compléter costume \"&$B45&\" \"&F$37&\" \"&Tableau145[[#This Row],[Colonne2]]","v":"A compléter costume 1 Action 3 Sous-action 3"},{"$f":"\"A compléter costume \"&$B45&\" \"&G$37&\" \"&Tableau145[[#This Row],[Colonne2]]","v":"A compléter costume 1 Action 4 Sous-action 3"},{"$f":"\"A compléter costume \"&$B45&\" \"&H$37&\" \"&Tableau145[[#This Row],[Colonne2]]","v":"A compléter costume 1 Action 5 Sous-action 3"}]
[null,1,{"$f":"C45&$B$33","v":"Sous-action 3 = Quoi faire ?"},"A porter seul","A partager","A donner","A donner","A porter seul"]
[null,1,{"$f":"$B$26","v":"Sous-action 4"},"Répondre aux clients internes",{"$f":"\"A compléter costume \"&$B47&\" \"&E$37&\" \"&Tableau145[[#This Row],[Colonne2]]","v":"A compléter costume 1 Action 2 Sous-action 4"},{"$f":"\"A compléter costume \"&$B47&\" \"&F$37&\" \"&Tableau145[[#This Row],[Colonne2]]","v":"A compléter costume 1 Action 3 Sous-action 4"},{"$f":"\"A compléter costume \"&$B47&\" \"&G$37&\" \"&Tableau145[[#This Row],[Colonne2]]","v":"A compléter costume 1 Action 4 Sous-action 4"},{"$f":"\"A compléter costume \"&$B47&\" \"&H$37&\" \"&Tableau145[[#This Row],[Colonne2]]","v":"A compléter costume 1 Action 5 Sous-action 4"}]
[null,1,{"$f":"C47&$B$33","v":"Sous-action 4 = Quoi faire ?"},"A partager","A porter seul","A porter seul","A partager","A partager"]
[null,1,{"$f":"$B$27","v":"Sous-action 5"},"Répondre à la Presse",{"$f":"\"A compléter costume \"&$B49&\" \"&E$37&\" \"&Tableau145[[#This Row],[Colonne2]]","v":"A compléter costume 1 Action 2 Sous-action 5"},{"$f":"\"A compléter costume \"&$B49&\" \"&F$37&\" \"&Tableau145[[#This Row],[Colonne2]]","v":"A compléter costume 1 Action 3 Sous-action 5"},{"$f":"\"A compléter costume \"&$B49&\" \"&G$37&\" \"&Tableau145[[#This Row],[Colonne2]]","v":"A compléter costume 1 Action 4 Sous-action 5"},{"$f":"\"A compléter costume \"&$B49&\" \"&H$37&\" \"&Tableau145[[#This Row],[Colonne2]]","v":"A compléter costume 1 Action 5 Sous-action 5"}]
[null,1,{"$f":"C49&$B$33","v":"Sous-action 5 = Quoi faire ?"},"A partager","A partager","A partager","A donner","A porter seul"]
[null,{"$f":"+B8","v":2},{"$f":"+C8","v":"Manager (en interne)"},{"$f":"+K8","v":"Communiquer les actions prioritaires à mes équipes directes."},{"$f":"+L8","v":"Encourager et motiver toutes les personnes que je manage."},{"$f":"+M8","v":"Informer Mme J, M. O, et l'équipe X, des actions à entreprendre cette semaine"},{"$f":"+N8","v":"Communiquer les objectifs à atteindre aux directeurs des différents services/ unités/ départements."},{"$f":"+O8","v":"Déléguer le travail 1 et 2 à Mme O."}]
[null,{"$f":"+$B$51","v":2},"Utilité de cette action sur 10 / objectif ?",6,7,8]
[null,2,"Pourquoi cette action est-elle utile ou inutile ? Bénéfices réels/ objectif ?","Car jjj","Parce que ooo"]
[null,2,{"$f":"$B$23","v":"Sous-action 1"},{"$f":"\"A compléter costume \"&$B54&\" \"&D$37&\" \"&$C54","v":"A compléter costume 2 Action 1 Sous-action 1"},"A compléter costume 2 Action 2 Sous-action 1","A compléter costume 2 Action 3 Sous-action 1","A compléter costume 2 Action 4 Sous-action 1","A compléter costume 2 Action 5 Sous-action 1"]
[null,2,{"$f":"C54&$B$33","v":"Sous-action 1 = Quoi faire ?"},"A partager","A porter seul","A porter seul","A donner","A porter seul"]
[null,2,{"$f":"$B$24","v":"Sous-action 2"},{"$f":"\"A compléter costume \"&$B56&\" \"&D$37&\" \"&$C56","v":"A compléter costume 2 Action 1 Sous-action 2"},"A compléter costume 2 Action 2 Sous-action 2","A compléter costume 2 Action 3 Sous-action 2","A compléter costume 2 Action 4 Sous-action 2","A compléter costume 2 Action 5 Sous-action 2"]
[null,2,{"$f":"C56&$B$33","v":"Sous-action 2 = Quoi faire ?"},"A porter seul","A donner","A partager","A porter seul","A porter seul"]
[null,2,{"$f":"$B$25","v":"Sous-action 3"},{"$f":"\"A compléter costume \"&$B58&\" \"&D$37&\" \"&$C58","v":"A compléter costume 2 Action 1 Sous-action 3"},"A compléter costume 2 Action 2 Sous-action 3","A compléter costume 2 Action 3 Sous-action 3","A compléter costume 2 Action 4 Sous-action 3","A compléter costume 2 Action 5 Sous-action 3"]
[null,2,{"$f":"C58&$B$33","v":"Sous-action 3 = Quoi faire ?"},"A partager","A porter seul","A porter seul","A porter seul","A porter seul"]
[null,2,{"$f":"$B$26","v":"Sous-action 4"},{"$f":"\"A compléter costume \"&$B60&\" \"&D$37&\" \"&$C60","v":"A compléter costume 2 Action 1 Sous-action 4"},"A compléter costume 2 Action 2 Sous-action 4","A compléter costume 2 Action 3 Sous-action 4","A compléter costume 2 Action 4 Sous-action 4","A compléter costume 2 Action 5 Sous-action 4"]
[null,2,{"$f":"C60&$B$33","v":"Sous-action 4 = Quoi faire ?"},"A partager","A partager","A donner","A porter seul","A partager"]
[null,2,{"$f":"$B$27","v":"Sous-action 5"},{"$f":"\"A compléter costume \"&$B62&\" \"&D$37&\" \"&$C62","v":"A compléter costume 2 Action 1 Sous-action 5"},"A compléter costume 2 Action 2 Sous-action 5","A compléter costume 2 Action 3 Sous-action 5","A compléter costume 2 Action 4 Sous-action 5","A compléter costume 2 Action 5 Sous-action 5"]
[null,2,{"$f":"C62&$B$33","v":"Sous-action 5 = Quoi faire ?"},"A donner","A porter seul","A porter seul","A partager","A porter seul"]
[null,{"$f":"+B9","v":3},{"$f":"+C9","v":"Partenaire commercial (à l'externe)"},{"$f":"+K9","v":"Répondre aux principaux partenaires externes de l'entreprise"},{"$f":"+L9","v":"Gérer la relation avec les fournisseurs"},{"$f":"+M9","v":"Gérer la relation avec les clients"},{"$f":"+N9","v":"Gérer la relation avec la presse"},{"$f":"+O9","v":"Gérer la relation avec les partenaires financiers"}]
[null,{"$f":"+$B$64","v":3},"Utilité de cette action sur 10 / objectif ?"]
[null,3,"Pourquoi cette action est-elle utile ou inutile ? Bénéfices réels/ objectif ?"]
[null,3,{"$f":"$B$23","v":"Sous-action 1"},{"$f":"\"A compléter costume \"&$B67&\" \"&D$37&\" \"&$C67","v":"A compléter costume 3 Action 1 Sous-action 1"},"A compléter costume 3 Action 2 Sous-action 1","A compléter costume 3 Action 3 Sous-action 1","A compléter costume 3 Action 4 Sous-action 1","A compléter costume 3 Action 5 Sous-action 1"]
[null,3,{"$f":"C67&$B$33","v":"Sous-action 1 = Quoi faire ?"},"A donner","A porter seul","A partager","A partager","A donner"]
[null,3,{"$f":"$B$24","v":"Sous-action 2"},{"$f":"\"A compléter costume \"&$B69&\" \"&D$37&\" \"&$C69","v":"A compléter costume 3 Action 1 Sous-action 2"},"A compléter costume 3 Action 2 Sous-action 2","A compléter costume 3 Action 3 Sous-action 2","A compléter costume 3 Action 4 Sous-action 2","A compléter costume 3 Action 5 Sous-action 2"]
[null,3,{"$f":"C69&$B$33","v":"Sous-action 2 = Quoi faire ?"},"A donner","A porter seul","A porter seul","A porter seul","A partager"]
[null,3,{"$f":"$B$25","v":"Sous-action 3"},{"$f":"\"A compléter costume \"&$B71&\" \"&D$37&\" \"&$C71","v":"A compléter costume 3 Action 1 Sous-action 3"},"A compléter costume 3 Action 2 Sous-action 3","A compléter costume 3 Action 3 Sous-action 3","A compléter costume 3 Action 4 Sous-action 3","A compléter costume 3 Action 5 Sous-action 3"]
[null,3,{"$f":"C71&$B$33","v":"Sous-action 3 = Quoi faire ?"},"A porter seul","A porter seul","A donner","A partager","A porter seul"]
[null,3,{"$f":"$B$26","v":"Sous-action 4"},{"$f":"\"A compléter costume \"&$B73&\" \"&D$37&\" \"&$C73","v":"A compléter costume 3 Action 1 Sous-action 4"},"A compléter costume 3 Action 2 Sous-action 4","A compléter costume 3 Action 3 Sous-action 4","A compléter costume 3 Action 4 Sous-action 4","A compléter costume 3 Action 5 Sous-action 4"]
[null,3,{"$f":"C73&$B$33","v":"Sous-action 4 = Quoi faire ?"},"A porter seul","A porter seul","A partager","A partager","A partager"]
[null,3,{"$f":"$B$27","v":"Sous-action 5"},{"$f":"\"A compléter costume \"&$B75&\" \"&D$37&\" \"&$C75","v":"A compléter costume 3 Action 1 Sous-action 5"},"A compléter costume 3 Action 2 Sous-action 5","A compléter costume 3 Action 3 Sous-action 5","A compléter costume 3 Action 4 Sous-action 5","A compléter costume 3 Action 5 Sous-action 5"]
[null,3,{"$f":"C75&$B$33","v":"Sous-action 5 = Quoi faire ?"},"A donner","A partager","A porter seul","A partager","A porter seul"]
[null,{"$f":"+B10","v":4},{"$f":"+C10","v":"Mari / Amant"},{"$f":"+K10","v":"Communiquer régulièrement avec elle/lui"},{"$f":"+L10","v":"Accorder x heures par jour/semaine à elle/lui"},{"$f":"+M10","v":"Répondre à ses demandes/messages/sollicitations"},{"$f":"+N10","v":"Emmener ma femme/mon mari au restaurant en tête à tête au moins 1 fois/semaine."},{"$f":"+O10","v":"Programmer au moins 1 we entre amoureux/mois."}]
[null,{"$f":"+$B$77","v":4},"Utilité de cette action sur 10 / objectif ?",7,5,8,6,7]
[null,4,"Pourquoi cette action est-elle utile ou inutile ? Bénéfices réels/ objectif ?","Parce que hhh","Car ooo","Parce que pppp"]
[null,4,{"$f":"$B$23","v":"Sous-action 1"},{"$f":"\"A compléter costume \"&$B80&\" \"&D$37&\" \"&$C80","v":"A compléter costume 4 Action 1 Sous-action 1"},{"$f":"\"A compléter costume \"&$B80&\" \"&E$37&\" \"&$C80","v":"A compléter costume 4 Action 2 Sous-action 1"},{"$f":"\"A compléter costume \"&$B80&\" \"&F$37&\" \"&$C80","v":"A compléter costume 4 Action 3 Sous-action 1"},{"$f":"\"A compléter costume \"&$B80&\" \"&G$37&\" \"&$C80","v":"A compléter costume 4 Action 4 Sous-action 1"},{"$f":"\"A compléter costume \"&$B80&\" \"&H$37&\" \"&$C80","v":"A compléter costume 4 Action 5 Sous-action 1"}]
[null,4,{"$f":"C80&$B$33","v":"Sous-action 1 = Quoi faire ?"},"A donner","A partager","A partager","A porter seul","A partager"]
[null,4,{"$f":"$B$24","v":"Sous-action 2"},{"$f":"\"A compléter costume \"&$B82&\" \"&D$37&\" \"&$C82","v":"A compléter costume 4 Action 1 Sous-action 2"},{"$f":"\"A compléter costume \"&$B82&\" \"&E$37&\" \"&$C82","v":"A compléter costume 4 Action 2 Sous-action 2"},{"$f":"\"A compléter costume \"&$B82&\" \"&F$37&\" \"&$C82","v":"A compléter costume 4 Action 3 Sous-action 2"},{"$f":"\"A compléter costume \"&$B82&\" \"&G$37&\" \"&$C82","v":"A compléter costume 4 Action 4 Sous-action 2"},"A compléter costume 4 Action 5 Sous-action 2"]
[null,4,{"$f":"C82&$B$33","v":"Sous-action 2 = Quoi faire ?"},"A porter seul","A porter seul","A porter seul","A porter seul","A partager"]
[null,4,{"$f":"$B$25","v":"Sous-action 3"},{"$f":"\"A compléter costume \"&$B84&\" \"&D$37&\" \"&$C84","v":"A compléter costume 4 Action 1 Sous-action 3"},{"$f":"\"A compléter costume \"&$B84&\" \"&E$37&\" \"&$C84","v":"A compléter costume 4 Action 2 Sous-action 3"},{"$f":"\"A compléter costume \"&$B84&\" \"&F$37&\" \"&$C84","v":"A compléter costume 4 Action 3 Sous-action 3"},{"$f":"\"A compléter costume \"&$B84&\" \"&G$37&\" \"&$C84","v":"A compléter costume 4 Action 4 Sous-action 3"},"A compléter costume 4 Action 5 Sous-action 3"]
[null,4,{"$f":"C84&$B$33","v":"Sous-action 3 = Quoi faire ?"},"A porter seul","A porter seul","A partager","A porter seul","A porter seul"]
[null,4,{"$f":"$B$26","v":"Sous-action 4"},{"$f":"\"A compléter costume \"&$B86&\" \"&D$37&\" \"&$C86","v":"A compléter costume 4 Action 1 Sous-action 4"},{"$f":"\"A compléter costume \"&$B86&\" \"&E$37&\" \"&$C86","v":"A compléter costume 4 Action 2 Sous-action 4"},{"$f":"\"A compléter costume \"&$B86&\" \"&F$37&\" \"&$C86","v":"A compléter costume 4 Action 3 Sous-action 4"},{"$f":"\"A compléter costume \"&$B86&\" \"&G$37&\" \"&$C86","v":"A compléter costume 4 Action 4 Sous-action 4"},"A compléter costume 4 Action 5 Sous-action 4"]
[null,4,{"$f":"C86&$B$33","v":"Sous-action 4 = Quoi faire ?"},"A donner","A partager","A donner","A partager","A donner"]
[null,4,{"$f":"$B$27","v":"Sous-action 5"},{"$f":"\"A compléter costume \"&$B88&\" \"&D$37&\" \"&$C88","v":"A compléter costume 4 Action 1 Sous-action 5"},{"$f":"\"A compléter costume \"&$B88&\" \"&E$37&\" \"&$C88","v":"A compléter costume 4 Action 2 Sous-action 5"},{"$f":"\"A compléter costume \"&$B88&\" \"&F$37&\" \"&$C88","v":"A compléter costume 4 Action 3 Sous-action 5"},{"$f":"\"A compléter costume \"&$B88&\" \"&G$37&\" \"&$C88","v":"A compléter costume 4 Action 4 Sous-action 5"},"A compléter costume 4 Action 5 Sous-action 5"]
[null,4,{"$f":"C88&$B$33","v":"Sous-action 5 = Quoi faire ?"},"A partager","A donner","A partager","A porter seul","A partager"]
[null,{"$f":"+B11","v":5},{"$f":"+C11","v":"Père"},{"$f":"+K11","v":"Apporter de l'amour à mon enfant selon son langage de l'amour (= cadeaux, moments de qualité, services rendus, toucher physique, paroles valorisantes)"},{"$f":"+L11","v":"M'assurer que mon/mes enfant(s) à des vêtements propres à mettre chaque jour."},{"$f":"+M11","v":"Accompagner mon/mes enfant(s) à ses activités extra-scolaires. Assurer les déplacements de mon/mes enfant(s)"},{"$f":"+N11","v":"Assurer l'éducation de mon enfant et aider mon/mes enfant(s) dans ses apprentissages."},{"$f":"+O11","v":"Assurer un environnement sain, propre et sécurisé pour mon/mes enfant(s)"}]
[null,{"$f":"+$B$90","v":5},"Utilité de cette action sur 10 / objectif ?",4,6,8,7,7]
[null,5,"Pourquoi cette action est-elle utile ou inutile ? Bénéfices réels/ objectif ?"]
[null,5,{"$f":"$B$23","v":"Sous-action 1"},"Aller chercher mon enfant à l'école chaque lundi et mardi soir.",{"$f":"\"A compléter costume \"&$B93&\" \"&E$37&\" \"&$C93","v":"A compléter costume 5 Action 2 Sous-action 1"},"A compléter costume 5 Action 3 Sous-action 1","A compléter costume 5 Action 4 Sous-action 1","A compléter costume 5 Action 5 Sous-action 1"]
[null,5,{"$f":"C93&$B$33","v":"Sous-action 1 = Quoi faire ?"},"A partager","A partager","A partager","A partager","A partager"]
[null,5,{"$f":"$B$24","v":"Sous-action 2"},{"$f":"\"A compléter costume \"&$B95&\" \"&D$37&\" \"&$C95","v":"A compléter costume 5 Action 1 Sous-action 2"},"A compléter costume 5 Action 2 Sous-action 2","A compléter costume 5 Action 3 Sous-action 2","A compléter costume 5 Action 4 Sous-action 2","A compléter costume 5 Action 5 Sous-action 2"]
[null,5,{"$f":"C95&$B$33","v":"Sous-action 2 = Quoi faire ?"},"A partager","A partager","A partager","A partager","A partager"]
[null,5,{"$f":"$B$25","v":"Sous-action 3"},{"$f":"\"A compléter costume \"&$B97&\" \"&D$37&\" \"&$C97","v":"A compléter costume 5 Action 1 Sous-action 3"},"A compléter costume 5 Action 2 Sous-action 3","A compléter costume 5 Action 3 Sous-action 3","A compléter costume 5 Action 4 Sous-action 3","A compléter costume 5 Action 5 Sous-action 3"]
[null,5,{"$f":"C97&$B$33","v":"Sous-action 3 = Quoi faire ?"},"A partager","A partager","A donner","A donner","A partager"]
[null,5,{"$f":"$B$26","v":"Sous-action 4"},{"$f":"\"A compléter costume \"&$B99&\" \"&D$37&\" \"&$C99","v":"A compléter costume 5 Action 1 Sous-action 4"},"A compléter costume 5 Action 2 Sous-action 4","A compléter costume 5 Action 3 Sous-action 4","A compléter costume 5 Action 4 Sous-action 4","A compléter costume 5 Action 5 Sous-action 4"]
[null,5,{"$f":"C99&$B$33","v":"Sous-action 4 = Quoi faire ?"},"A porter seul","A partager","A partager","A partager","A partager"]
[null,5,{"$f":"$B$27","v":"Sous-action 5"},{"$f":"\"A compléter costume \"&$B101&\" \"&D$37&\" \"&$C101","v":"A compléter costume 5 Action 1 Sous-action 5"},"A compléter costume 5 Action 2 Sous-action 5","A compléter costume 5 Action 3 Sous-action 5","A compléter costume 5 Action 4 Sous-action 5","A compléter costume 5 Action 5 Sous-action 5"]
[null,5,{"$f":"C101&$B$33","v":"Sous-action 5 = Quoi faire ?"},"A porter seul","A porter seul","A partager","A porter seul","A partager"]
[null,6,{"$f":"+C12","v":"Oncle, fils, etc. (vie familiale)"},{"$f":"K12","v":"Appeler les membres X, Y, et R de ma famille 1 fois/mois."},{"$f":"L12","v":"Répondre aux appels de mon père."},{"$f":"M12","v":"Soutenir Mme X dans les x prochains mois."},{"$f":"N12","v":"Organiser un weekend avec X et Y au moins 2 fois/an."},{"$f":"O12","v":"Me rendre disponible pour les anniversaires de P, S, et J chaque année."}]
[null,6,"Utilité de cette action sur 10 / objectif ?",10,8,6,10,5]
[null,6,"Pourquoi cette action est-elle utile ou inutile ? Bénéfices réels/ objectif ?","A compléter","A compléter","A compléter","A compléter","A compléter"]
[null,6,{"$f":"$B$23","v":"Sous-action 1"},{"$f":"\"A compléter costume \"&$B106&\" \"&D37&\" \"&$C106","v":"A compléter costume 6 Action 1 Sous-action 1"},{"$f":"\"A compléter costume \"&$B106&\" \"&E37&\" \"&$C106","v":"A compléter costume 6 Action 2 Sous-action 1"},{"$f":"\"A compléter costume \"&$B106&\" \"&F37&\" \"&$C106","v":"A compléter costume 6 Action 3 Sous-action 1"},{"$f":"\"A compléter costume \"&$B106&\" \"&G37&\" \"&$C106","v":"A compléter costume 6 Action 4 Sous-action 1"},{"$f":"\"A compléter costume \"&$B106&\" \"&H37&\" \"&$C106","v":"A compléter costume 6 Action 5 Sous-action 1"}]
[null,6,{"$f":"C106&$B$33","v":"Sous-action 1 = Quoi faire ?"},"A porter seul","A partager","A donner","A porter seul","A partager"]
[null,6,{"$f":"B24","v":"Sous-action 2"},{"$f":"\"A compléter costume \"&$B108&\" \"&D37&\" \"&$C108","v":"A compléter costume 6 Action 1 Sous-action 2"},{"$f":"\"A compléter costume \"&$B108&\" \"&E37&\" \"&$C108","v":"A compléter costume 6 Action 2 Sous-action 2"},{"$f":"\"A compléter costume \"&$B108&\" \"&F37&\" \"&$C108","v":"A compléter costume 6 Action 3 Sous-action 2"},{"$f":"\"A compléter costume \"&$B108&\" \"&G37&\" \"&$C108","v":"A compléter costume 6 Action 4 Sous-action 2"},{"$f":"\"A compléter costume \"&$B108&\" \"&H37&\" \"&$C108","v":"A compléter costume 6 Action 5 Sous-action 2"}]
[null,6,{"$f":"C108&B33","v":"Sous-action 2 = Quoi faire ?"},"A partager","A donner","A porter seul","A partager","A donner"]
[null,6,{"$f":"B25","v":"Sous-action 3"},{"$f":"\"A compléter costume \"&$B110&\" \"&D37&\" \"&$C110","v":"A compléter costume 6 Action 1 Sous-action 3"},{"$f":"\"A compléter costume \"&$B110&\" \"&E37&\" \"&$C110","v":"A compléter costume 6 Action 2 Sous-action 3"},{"$f":"\"A compléter costume \"&$B110&\" \"&F37&\" \"&$C110","v":"A compléter costume 6 Action 3 Sous-action 3"},{"$f":"\"A compléter costume \"&$B110&\" \"&G37&\" \"&$C110","v":"A compléter costume 6 Action 4 Sous-action 3"},{"$f":"\"A compléter costume \"&$B110&\" \"&H37&\" \"&$C110","v":"A compléter costume 6 Action 5 Sous-action 3"}]
[null,6,{"$f":"C110&B33","v":"Sous-action 3 = Quoi faire ?"},"A donner","A porter seul","A partager","A donner","A porter seul"]
[null,6,{"$f":"B26","v":"Sous-action 4"},{"$f":"\"A compléter costume \"&$B112&\" \"&D37&\" \"&$C112","v":"A compléter costume 6 Action 1 Sous-action 4"},{"$f":"\"A compléter costume \"&$B112&\" \"&E37&\" \"&$C112","v":"A compléter costume 6 Action 2 Sous-action 4"},{"$f":"\"A compléter costume \"&$B112&\" \"&F37&\" \"&$C112","v":"A compléter costume 6 Action 3 Sous-action 4"},{"$f":"\"A compléter costume \"&$B112&\" \"&G37&\" \"&$C112","v":"A compléter costume 6 Action 4 Sous-action 4"},{"$f":"\"A compléter costume \"&$B112&\" \"&H37&\" \"&$C112","v":"A compléter costume 6 Action 5 Sous-action 4"}]
[null,6,{"$f":"C112&B33","v":"Sous-action 4 = Quoi faire ?"},"A porter seul","A partager","A donner","A porter seul","A partager"]
[null,6,{"$f":"B27","v":"Sous-action 5"},{"$f":"\"A compléter costume \"&$B114&\" \"&D37&\" \"&$C114","v":"A compléter costume 6 Action 1 Sous-action 5"},{"$f":"\"A compléter costume \"&$B114&\" \"&E37&\" \"&$C114","v":"A compléter costume 6 Action 2 Sous-action 5"},{"$f":"\"A compléter costume \"&$B114&\" \"&F37&\" \"&$C114","v":"A compléter costume 6 Action 3 Sous-action 5"},{"$f":"\"A compléter costume \"&$B114&\" \"&G37&\" \"&$C114","v":"A compléter costume 6 Action 4 Sous-action 5"},{"$f":"\"A compléter costume \"&$B114&\" \"&H37&\" \"&$C114","v":"A compléter costume 6 Action 5 Sous-action 5"}]
[null,6,{"$f":"C114&B33","v":"Sous-action 5 = Quoi faire ?"},"A partager","A donner","A porter seul","A partager","A donner"]
[null,{"$f":"+B13","v":7},{"$f":"+C13","v":"Ami / copain (vie sociale)"},{"$f":"+K13","v":"Passer du temps avec mes ami(e)s"},{"$f":"+L13","v":"Rencontrer de nouvelles personnes"},{"$f":"+M13","v":"Appeler/écrire à mes ami(e)s X, Z, et A au moins 1 fois/mois."},{"$f":"+N13","v":"Répondre à mes ami(e)s dans les 3 jours."},{"$f":"+O13","v":"Programmer au moins 1 sortie avec mes amis W, R, et U /mois."}]
[null,{"$f":"+$B$116","v":7},"Utilité de cette action sur 10 / objectif ?"]
[null,7,"Pourquoi cette action est-elle utile ou inutile ? Bénéfices réels/ objectif ?","Parce que ggg","Car wwww","Parce que iii"]
[null,7,{"$f":"$B$23","v":"Sous-action 1"},{"$f":"\"A compléter costume \"&$B119&\" \"&D$37&\" \"&$C119","v":"A compléter costume 7 Action 1 Sous-action 1"},"A compléter costume 7 Action 2 Sous-action 1","A compléter costume 7 Action 3 Sous-action 1","A compléter costume 7 Action 4 Sous-action 1","A compléter costume 7 Action 5 Sous-action 1"]
[null,7,{"$f":"C119&$B$33","v":"Sous-action 1 = Quoi faire ?"},"A partager","A porter seul","A partager","A partager","A partager"]
[null,7,{"$f":"$B$24","v":"Sous-action 2"},"A compléter costume 7 Action 1 Sous-action 2","A compléter costume 7 Action 2 Sous-action 2","A compléter costume 7 Action 3 Sous-action 2","A compléter costume 7 Action 4 Sous-action 2","A compléter costume 7 Action 5 Sous-action 2"]
[null,7,{"$f":"C121&$B$33","v":"Sous-action 2 = Quoi faire ?"},"A porter seul","A porter seul","A partager","A partager","A porter seul"]
[null,7,{"$f":"$B$25","v":"Sous-action 3"},"A compléter costume 7 Action 1 Sous-action 3","A compléter costume 7 Action 2 Sous-action 3","A compléter costume 7 Action 3 Sous-action 3","A compléter costume 7 Action 4 Sous-action 3","A compléter costume 7 Action 5 Sous-action 3"]
[null,7,{"$f":"C123&$B$33","v":"Sous-action 3 = Quoi faire ?"},"A partager","A partager","A partager","A partager","A donner"]
[null,7,{"$f":"$B$26","v":"Sous-action 4"},"A compléter costume 7 Action 1 Sous-action 4","A compléter costume 7 Action 2 Sous-action 4","A compléter costume 7 Action 3 Sous-action 4","A compléter costume 7 Action 4 Sous-action 4","A compléter costume 7 Action 5 Sous-action 4"]
[null,7,{"$f":"C125&$B$33","v":"Sous-action 4 = Quoi faire ?"},"A partager","A partager","A partager","A partager","A partager"]
[null,7,{"$f":"$B$27","v":"Sous-action 5"},"A compléter costume 7 Action 1 Sous-action 5","A compléter costume 7 Action 2 Sous-action 5","A compléter costume 7 Action 3 Sous-action 5","A compléter costume 7 Action 4 Sous-action 5","A compléter costume 7 Action 5 Sous-action 5"]
[null,7,{"$f":"C127&$B$33","v":"Sous-action 5 = Quoi faire ?"},"A donner","A partager","A porter seul","A donner","A porter seul"]
[null,{"$f":"+B14","v":8},{"$f":"+C14","v":"Loisirs (activités, clubs, etc.)"},{"$f":"+K14","v":"Lire 30 minutes/semaine un livre \"plaisir\"."},{"$f":"+L14","v":"Participer au carnaval de ma ville avec mon enfant."},{"$f":"+M14","v":"Prendre 7 jours de vacances tous les 3 mois."},{"$f":"+N14","v":"Pratiquer une activité qui me plaît chaque semaine, pendant x heures minimum."},{"$f":"+O14","v":"Visiter des expositions/lieux/musées"}]
[null,{"$f":"+$B$129","v":8},"Utilité de cette action sur 10 / objectif ?"]
[null,8,"Pourquoi cette action est-elle utile ou inutile ? Bénéfices réels/ objectif ?"]
[null,8,{"$f":"$B$23","v":"Sous-action 1"},{"$f":"\"A compléter costume \"&$B132&\" \"&D$37&\" \"&$C132","v":"A compléter costume 8 Action 1 Sous-action 1"},"A compléter costume 8 Action 2 Sous-action 1","A compléter costume 8 Action 3 Sous-action 1","A compléter costume 8 Action 4 Sous-action 1","A compléter costume 8 Action 5 Sous-action 1"]
[null,8,{"$f":"C132&$B$33","v":"Sous-action 1 = Quoi faire ?"},"A porter seul","A partager","A partager","A donner","A porter seul"]
[null,8,{"$f":"$B$24","v":"Sous-action 2"},{"$f":"\"A compléter costume \"&$B134&\" \"&D$37&\" \"&$C134","v":"A compléter costume 8 Action 1 Sous-action 2"},"A compléter costume 8 Action 2 Sous-action 2","A compléter costume 8 Action 3 Sous-action 2","A compléter costume 8 Action 4 Sous-action 2","A compléter costume 8 Action 5 Sous-action 2"]
[null,8,{"$f":"C134&$B$33","v":"Sous-action 2 = Quoi faire ?"},"A porter seul","A porter seul","A porter seul","A partager","A porter seul"]
[null,8,{"$f":"$B$25","v":"Sous-action 3"},{"$f":"\"A compléter costume \"&$B136&\" \"&D$37&\" \"&$C136","v":"A compléter costume 8 Action 1 Sous-action 3"},"A compléter costume 8 Action 2 Sous-action 3","A compléter costume 8 Action 3 Sous-action 3","A compléter costume 8 Action 4 Sous-action 3","A compléter costume 8 Action 5 Sous-action 3"]
[null,8,{"$f":"C136&$B$33","v":"Sous-action 3 = Quoi faire ?"},"A donner","A partager","A donner","A partager","A porter seul"]
[null,8,{"$f":"$B$26","v":"Sous-action 4"},{"$f":"\"A compléter costume \"&$B138&\" \"&D$37&\" \"&$C138","v":"A compléter costume 8 Action 1 Sous-action 4"},"A compléter costume 8 Action 2 Sous-action 4","A compléter costume 8 Action 3 Sous-action 4","A compléter costume 8 Action 4 Sous-action 4","A compléter costume 8 Action 5 Sous-action 4"]
[null,8,{"$f":"C138&$B$33","v":"Sous-action 4 = Quoi faire ?"},"A porter seul","A porter seul","A partager","A porter seul","A porter seul"]
[null,8,{"$f":"$B$27","v":"Sous-action 5"},{"$f":"\"A compléter costume \"&$B140&\" \"&D$37&\" \"&$C140","v":"A compléter costume 8 Action 1 Sous-action 5"},"A compléter costume 8 Action 2 Sous-action 5","A compléter costume 8 Action 3 Sous-action 5","A compléter costume 8 Action 4 Sous-action 5","A compléter costume 8 Action 5 Sous-action 5"]
[null,8,{"$f":"C140&$B$33","v":"Sous-action 5 = Quoi faire ?"},"A partager","A donner","A partager","A partager","A partager"]
[null,{"$f":"+B15","v":9},{"$f":"+C15","v":"Dormeur"},{"$f":"+K15","v":"Suivre un rituel du coucher identique tous les soirs."},{"$f":"+L15","v":"Ne pas regarder d'écrans au moins 1h avant de me coucher."},{"$f":"+M15","v":"Me lever chaque matin à une heure fixe."},{"$f":"+N15","v":"Méditer, visualiser, ou prendre un temps calme chaque jour de 10 minutes au réveil / à 13h00 / au coucher."},{"$f":"+O15","v":"Manger léger tous les soirs du lundi au vendredi, sans sucre ni café."}]
[null,{"$f":"+$B$142","v":9},"Utilité de cette action sur 10 / objectif ?"]
[null,9,"Pourquoi cette action est-elle utile ou inutile ? Bénéfices réels/ objectif ?"]
[null,9,{"$f":"$B$23","v":"Sous-action 1"},"Me coucher chaque soir à heure fixe.",{"$f":"\"A compléter costume \"&$B145&\" \"&E$37&\" \"&$C145","v":"A compléter costume 9 Action 2 Sous-action 1"},"A compléter costume 9 Action 3 Sous-action 1","A compléter costume 9 Action 4 Sous-action 1","A compléter costume 9 Action 5 Sous-action 1"]
[null,9,{"$f":"C145&$B$33","v":"Sous-action 1 = Quoi faire ?"},"A porter seul","A partager","A partager","A partager","A porter seul"]
[null,9,{"$f":"$B$24","v":"Sous-action 2"},{"$f":"\"A compléter costume \"&$B147&\" \"&D$37&\" \"&$C147","v":"A compléter costume 9 Action 1 Sous-action 2"},"A compléter costume 9 Action 2 Sous-action 2","A compléter costume 9 Action 3 Sous-action 2","A compléter costume 9 Action 4 Sous-action 2","A compléter costume 9 Action 5 Sous-action 2"]
[null,9,{"$f":"C147&$B$33","v":"Sous-action 2 = Quoi faire ?"},"A donner","A porter seul","A porter seul","A porter seul","A porter seul"]
[null,9,{"$f":"$B$25","v":"Sous-action 3"},{"$f":"\"A compléter costume \"&$B149&\" \"&D$37&\" \"&$C149","v":"A compléter costume 9 Action 1 Sous-action 3"},"A compléter costume 9 Action 2 Sous-action 3","A compléter costume 9 Action 3 Sous-action 3","A compléter costume 9 Action 4 Sous-action 3","A compléter costume 9 Action 5 Sous-action 3"]
[null,9,{"$f":"C149&$B$33","v":"Sous-action 3 = Quoi faire ?"},"A donner","A porter seul","A porter seul","A porter seul","A porter seul"]
[null,9,{"$f":"$B$26","v":"Sous-action 4"},{"$f":"\"A compléter costume \"&$B151&\" \"&D$37&\" \"&$C151","v":"A compléter costume 9 Action 1 Sous-action 4"},"A compléter costume 9 Action 2 Sous-action 4","A compléter costume 9 Action 3 Sous-action 4","A compléter costume 9 Action 4 Sous-action 4","A compléter costume 9 Action 5 Sous-action 4"]
[null,9,{"$f":"C151&$B$33","v":"Sous-action 4 = Quoi faire ?"},"A porter seul","A porter seul","A porter seul","A porter seul","A partager"]
[null,9,{"$f":"$B$27","v":"Sous-action 5"},{"$f":"\"A compléter costume \"&$B153&\" \"&D$37&\" \"&$C153","v":"A compléter costume 9 Action 1 Sous-action 5"},"A compléter costume 9 Action 2 Sous-action 5","A compléter costume 9 Action 3 Sous-action 5","A compléter costume 9 Action 4 Sous-action 5","A compléter costume 9 Action 5 Sous-action 5"]
[null,9,{"$f":"C153&$B$33","v":"Sous-action 5 = Quoi faire ?"},"A partager","A partager","A porter seul","A partager","A partager"]
[null,{"$f":"+B16","v":10},{"$f":"+C16","v":"Sportif"},{"$f":"+K16","v":"Acheter mes tenues et mon matériel de sport."},{"$f":"+L16","v":"Courir 2 fois / semaine pendant 30 minutes minimum."},{"$f":"+M16","v":"M'étirer 10 minutes tous les soirs à 21h00."},{"$f":"+N16","v":"Boire au moins 1,5 litres d'eau par jour."},{"$f":"+O16","v":"Manger des légumes midi et soir, et des protéines matin et midi."}]
[null,{"$f":"+$B$155","v":10},"Utilité de cette action sur 10 / objectif ?"]
[null,10,"Pourquoi cette action est-elle utile ou inutile ? Bénéfices réels/ objectif ?"]
[null,10,{"$f":"$B$23","v":"Sous-action 1"},{"$f":"\"A compléter costume \"&$B158&\" \"&D$37&\" \"&$C158","v":"A compléter costume 10 Action 1 Sous-action 1"},"A compléter costume 10 Action 2 Sous-action 1","A compléter costume 10 Action 3 Sous-action 1","A compléter costume 10 Action 4 Sous-action 1","A compléter costume 10 Action 5 Sous-action 1"]
[null,10,{"$f":"C158&$B$33","v":"Sous-action 1 = Quoi faire ?"},"A partager","A partager","A partager","A partager","A donner"]
[null,10,{"$f":"$B$24","v":"Sous-action 2"},{"$f":"\"A compléter costume \"&$B160&\" \"&D$37&\" \"&$C160","v":"A compléter costume 10 Action 1 Sous-action 2"},"A compléter costume 10 Action 2 Sous-action 2","A compléter costume 10 Action 3 Sous-action 2","A compléter costume 10 Action 4 Sous-action 2","A compléter costume 10 Action 5 Sous-action 2"]
[null,10,{"$f":"C160&$B$33","v":"Sous-action 2 = Quoi faire ?"},"A donner","A partager","A donner","A partager","A donner"]
[null,10,{"$f":"$B$25","v":"Sous-action 3"},{"$f":"\"A compléter costume \"&$B162&\" \"&D$37&\" \"&$C162","v":"A compléter costume 10 Action 1 Sous-action 3"},"A compléter costume 10 Action 2 Sous-action 3","A compléter costume 10 Action 3 Sous-action 3","A compléter costume 10 Action 4 Sous-action 3","A compléter costume 10 Action 5 Sous-action 3"]
[null,10,{"$f":"C162&$B$33","v":"Sous-action 3 = Quoi faire ?"},"A partager","A partager","A partager","A donner","A porter seul"]
[null,10,{"$f":"$B$26","v":"Sous-action 4"},{"$f":"\"A compléter costume \"&$B164&\" \"&D$37&\" \"&$C164","v":"A compléter costume 10 Action 1 Sous-action 4"},"A compléter costume 10 Action 2 Sous-action 4","A compléter costume 10 Action 3 Sous-action 4","A compléter costume 10 Action 4 Sous-action 4","A compléter costume 10 Action 5 Sous-action 4"]
[null,10,{"$f":"C164&$B$33","v":"Sous-action 4 = Quoi faire ?"},"A donner","A donner","A partager","A partager","A porter seul"]
[null,10,{"$f":"$B$27","v":"Sous-action 5"},{"$f":"\"A compléter costume \"&$B166&\" \"&D$37&\" \"&$C166","v":"A compléter costume 10 Action 1 Sous-action 5"},"A compléter costume 10 Action 2 Sous-action 5","A compléter costume 10 Action 3 Sous-action 5","A compléter costume 10 Action 4 Sous-action 5","A compléter costume 10 Action 5 Sous-action 5"]
[null,10,{"$f":"C166&$B$33","v":"Sous-action 5 = Quoi faire ?"},"A partager","A donner","A partager","A partager","A porter seul"]

{"sheet":"A porter seul","index":8,"n_rows":679,"n_cols":19,"rows_kept":679,"cut":false,"hidden":false,"merged":[[2,2,2,3],[2,4,2,8]]}
[null,null,"Tableau 1 = synthèse de sous-actions à porter seul :"]
[]
[null,"A porter seul","Rappel de votre objectif :",null,{"$f":"+'Objectif SMARTER'!$A$6","v":"Je veux…"}]
[null,null,null,null,null,null,null,null,null,null,null,null,"cf. onglet \"Etapes vers objectif\""]
[null,null,"Costume n°","Nom du rôle-costume","Actions","Sous-actions","Pourquoi réaliser seul cette sous-action ?","Pourquoi partager (scinder) cette sous-action en plusieurs sous-sous-actions ?\nPourquoi déléguer une partie de cette sous-action ?","Pourquoi cette sous-action est-elle utile/ objectif ?\nQuels sont ses bénéfices / objectif ?","Avec qui vous devez partager cette sous-action ? (Membres de votre famille, amis, collègues, supérieurs, etc.)\nEt que doit(vent) faire précisément cette/ces personne(s) ?","Quelle sous-sous-action précise vous devez réaliser seul ?","Critère de réalisation cette sous-action.\n(rendu final visible et mesurable / objectif)","Au cours de quelle(s) étape(s) / votre objectif devez-vous réaliser cette sous-action ?","Quand devez-vous réaliser cette sous-action ?\n(contextes, horaires précis, régularité ou pas, moments de la journée, période(s) de l'année, etc.)","Où devez-vous réaliser cette sous-action ?\n(lieux précis)","Avec qui devez-vous réaliser cette sous-action ?\n(personnes précises)","Comment devez-vous réaliser cette sous-action ? \n(niveau d'énergie requis, humeur, qualité(s), force(s), ou talent(s) requis, etc.)","Combien d’heures min./ max. consacrer à cette sous-action par jour/ semaine/ mois/ année ?","Suite à donner à cette sous-action ?\n(durée prévue d’utilisation, date limite de réalisation, conséquences long terme, etc.)"]
[{"$f":"IF(B6=$B$3,B6&\"_\"&COUNTIF($B$6:$B6,$B$3),\"\")","v":"A porter seul_1"},{"$f":"IF(C6=\"\",\"\",\"A porter seul\")","v":"A porter seul"},1,"Leader","Répondre aux mails & aux appels importants","Répondre aux clients externes","Parce que ggg",null,"Car elle me permet de réaliser…",null,null,"Cette sous-action est réalisée si…","L'étape 1, et l'étape 4","Le matin entre 07h00 et 8h00.","Au bureau à VILLE, ou dans mon bureau chez moi.","Avec Mme J et M. K.","Je dois avoir un niveau d'énergie de min. 7/10 et être de bonne humeur. Qualités requises :…","1h/semaine max.","Pas de fin : cette action sera encore nécessaire dans 5 ans."]
[{"$f":"IF(B7=$B$3,B7&\"_\"&COUNTIF($B$6:$B7,$B$3),\"\")","v":"A porter seul_2"},{"$f":"IF(C7=\"\",\"\",\"A porter seul\")","v":"A porter seul"},1,"Leader","Répondre aux mails & aux appels importants","Répondre aux demandes nouvelles venant de l'externe","Car hhh",null,"Parce qu'elle me permet de faire…",null,null,"Cette sous-action est réalisée quand…","L'étape 1 et 2.","Entre 14h00 et 14h30.","Au bureau à VILLE, ou dans mon bureau chez moi.","Avec Mme O.","Peu importe mon humeur. Niveau d'énergie min. 4/10. Qualité requise…","2h/mois max","Fin de cette action à prévoir quand j'aurai réalisé l'action ACTION."]
[{"$f":"IF(B8=$B$3,B8&\"_\"&COUNTIF($B$6:$B8,$B$3),\"\")","v":"A porter seul_3"},"A porter seul",1,"Leader","Présenter les résultats de l'entreprise","S'assurer que les résultats sont corrects","Parce que oooo",null,null,null,null,null,"Toutes les étapes.","Entre 13h00 et 13h10.","Au bureau à VILLE, ou dans mon bureau chez moi.",null,"Talent requis = ","5h/année max."]
[{"$f":"IF(B9=$B$3,B9&\"_\"&COUNTIF($B$6:$B9,$B$3),\"\")","v":"A porter seul_4"},"A porter seul",1,"Leader","Présenter les résultats de l'entreprise","A compléter costume 1 Action 2 Sous-action 4","Car kkk",null,null,null,null,null,"L'étape 3 et 5.",null,null,null,null,"30 minutes/jour minimum"]
[{"$f":"IF(B10=$B$3,B10&\"_\"&COUNTIF($B$6:$B10,$B$3),\"\")","v":"A porter seul_5"},"A porter seul",1,"Leader","Définir et valider la vision/stratégie à moyen et à long terme pour l'entreprise. Réflexions et discusssions stratégiques","A compléter costume 1 Action 3 Sous-action 4",null,null,null,null,null,null,"L'étape 5.",null,null,null,null,"2h/jour minimum"]
[{"$f":"IF(B11=$B$3,B11&\"_\"&COUNTIF($B$6:$B11,$B$3),\"\")","v":"A porter seul_6"},"A porter seul",1,"Leader","Gérer des rdv et appeler les clients/partenaires/fournisseurs/ etc.","A compléter costume 1 Action 4 Sous-action 2"]
[{"$f":"IF(B12=$B$3,B12&\"_\"&COUNTIF($B$6:$B12,$B$3),\"\")","v":"A porter seul_7"},"A porter seul",1,"Leader","M'informer des tendances actuelles et futures qui pourraient impacter l'entreprise + Me former : min. 1 formation /an","A compléter costume 1 Action 5 Sous-action 1"]
[{"$f":"IF(B13=$B$3,B13&\"_\"&COUNTIF($B$6:$B13,$B$3),\"\")","v":"A porter seul_8"},"A porter seul",1,"Leader","M'informer des tendances actuelles et futures qui pourraient impacter l'entreprise + Me former : min. 1 formation /an","A compléter costume 1 Action 5 Sous-action 3"]
[{"$f":"IF(B14=$B$3,B14&\"_\"&COUNTIF($B$6:$B14,$B$3),\"\")","v":"A porter seul_9"},"A porter seul",1,"Leader","M'informer des tendances actuelles et futures qui pourraient impacter l'entreprise + Me former : min. 1 formation /an","A compléter costume 1 Action 5 Sous-action 5"]
[{"$f":"IF(B15=$B$3,B15&\"_\"&COUNTIF($B$6:$B15,$B$3),\"\")","v":"A porter seul_10"},"A porter seul",2,"Manager (en interne)","Communiquer les actions prioritaires à mes équipes directes.","A compléter costume 2 Action 1 Sous-action 2"]
[{"$f":"IF(B16=$B$3,B16&\"_\"&COUNTIF($B$6:$B16,$B$3),\"\")","v":"A porter seul_11"},"A porter seul",2,"Manager (en interne)","Encourager et motiver toutes les personnes que je manage.","A compléter costume 2 Action 2 Sous-action 1"]
[{"$f":"IF(B17=$B$3,B17&\"_\"&COUNTIF($B$6:$B17,$B$3),\"\")","v":"A porter seul_12"},"A porter seul",2,"Manager (en interne)","Encourager et motiver toutes les personnes que je manage.","A compléter costume 2 Action 2 Sous-action 3"]
[{"$f":"IF(B18=$B$3,B18&\"_\"&COUNTIF($B$6:$B18,$B$3),\"\")","v":"A porter seul_13"},"A porter seul",2,"Manager (en interne)","Encourager et motiver toutes les personnes que je manage.","A compléter costume 2 Action 2 Sous-action 5"]
[{"$f":"IF(B19=$B$3,B19&\"_\"&COUNTIF($B$6:$B19,$B$3),\"\")","v":"A porter seul_14"},"A porter seul",2,"Manager (en interne)","Informer Mme J, M. O, et l'équipe X, des actions à entreprendre cette semaine","A compléter costume 2 Action 3 Sous-action 1"]
[{"$f":"IF(B20=$B$3,B20&\"_\"&COUNTIF($B$6:$B20,$B$3),\"\")","v":"A porter seul_15"},"A porter seul",2,"Manager (en interne)","Informer Mme J, M. O, et l'équipe X, des actions à entreprendre cette semaine","A compléter costume 2 Action 3 Sous-action 3"]
[{"$f":"IF(B21=$B$3,B21&\"_\"&COUNTIF($B$6:$B21,$B$3),\"\")","v":"A porter seul_16"},"A porter seul",2,"Manager (en interne)","Informer Mme J, M. O, et l'équipe X, des actions à entreprendre cette semaine","A compléter costume 2 Action 3 Sous-action 5"]
[{"$f":"IF(B22=$B$3,B22&\"_\"&COUNTIF($B$6:$B22,$B$3),\"\")","v":"A porter seul_17"},"A porter seul",2,"Manager (en interne)","Communiquer les objectifs à atteindre aux directeurs des différents services/ unités/ départements.","A compléter costume 2 Action 4 Sous-action 2"]
[{"$f":"IF(B23=$B$3,B23&\"_\"&COUNTIF($B$6:$B23,$B$3),\"\")","v":"A porter seul_18"},"A porter seul",2,"Manager (en interne)","Communiquer les objectifs à atteindre aux directeurs des différents services/ unités/ départements.","A compléter costume 2 Action 4 Sous-action 3"]
[{"$f":"IF(B24=$B$3,B24&\"_\"&COUNTIF($B$6:$B24,$B$3),\"\")","v":"A porter seul_19"},"A porter seul",2,"Manager (en interne)","Communiquer les objectifs à atteindre aux directeurs des différents services/ unités/ départements.","A compléter costume 2 Action 4 Sous-action 4"]
[{"$f":"IF(B25=$B$3,B25&\"_\"&COUNTIF($B$6:$B25,$B$3),\"\")","v":"A porter seul_20"},"A porter seul",2,"Manager (en interne)","Déléguer le travail 1 et 2 à Mme O.","A compléter costume 2 Action 5 Sous-action 1"]
[{"$f":"IF(B26=$B$3,B26&\"_\"&COUNTIF($B$6:$B26,$B$3),\"\")","v":"A porter seul_21"},"A porter seul",2,"Manager (en interne)","Déléguer le travail 1 et 2 à Mme O.","A compléter costume 2 Action 5 Sous-action 2"]
[{"$f":"IF(B27=$B$3,B27&\"_\"&COUNTIF($B$6:$B27,$B$3),\"\")","v":"A porter seul_22"},"A porter seul",2,"Manager (en interne)","Déléguer le travail 1 et 2 à Mme O.","A compléter costume 2 Action 5 Sous-action 3"]
[{"$f":"IF(B28=$B$3,B28&\"_\"&COUNTIF($B$6:$B28,$B$3),\"\")","v":"A porter seul_23"},"A porter seul",2,"Manager (en interne)","Déléguer le travail 1 et 2 à Mme O.","A compléter costume 2 Action 5 Sous-action 5"]
[{"$f":"IF(B29=$B$3,B29&\"_\"&COUNTIF($B$6:$B29,$B$3),\"\")","v":"A porter seul_24"},"A porter seul",3,"Partenaire commercial (à l'externe)","Répondre aux principaux partenaires externes de l'entreprise","A compléter costume 3 Action 1 Sous-action 3"]
[{"$f":"IF(B30=$B$3,B30&\"_\"&COUNTIF($B$6:$B30,$B$3),\"\")","v":"A porter seul_25"},"A porter seul",3,"Partenaire commercial (à l'externe)","Répondre aux principaux partenaires externes de l'entreprise","A compléter costume 3 Action 1 Sous-action 4"]
[{"$f":"IF(B31=$B$3,B31&\"_\"&COUNTIF($B$6:$B31,$B$3),\"\")","v":"A porter seul_26"},"A porter seul",3,"Partenaire commercial (à l'externe)","Gérer la relation avec les fournisseurs","A compléter costume 3 Action 2 Sous-action 1"]
[{"$f":"IF(B32=$B$3,B32&\"_\"&COUNTIF($B$6:$B32,$B$3),\"\")","v":"A porter seul_27"},"A porter seul",3,"Partenaire commercial (à l'externe)","Gérer la relation avec les fournisseurs","A compléter costume 3 Action 2 Sous-action 2"]
[{"$f":"IF(B33=$B$3,B33&\"_\"&COUNTIF($B$6:$B33,$B$3),\"\")","v":"A porter seul_28"},"A porter seul",3,"Partenaire commercial (à l'externe)","Gérer la relation avec les fournisseurs","A compléter costume 3 Action 2 Sous-action 3"]
[{"$f":"IF(B34=$B$3,B34&\"_\"&COUNTIF($B$6:$B34,$B$3),\"\")","v":"A porter seul_29"},"A porter seul",3,"Partenaire commercial (à l'externe)","Gérer la relation avec les fournisseurs","A compléter costume 3 Action 2 Sous-action 4"]
[{"$f":"IF(B35=$B$3,B35&\"_\"&COUNTIF($B$6:$B35,$B$3),\"\")","v":"A porter seul_30"},"A porter seul",3,"Partenaire commercial (à l'externe)","Gérer la relation avec les clients","A compléter costume 3 Action 3 Sous-action 2"]
[{"$f":"IF(B36=$B$3,B36&\"_\"&COUNTIF($B$6:$B36,$B$3),\"\")","v":"A porter seul_31"},"A porter seul",3,"Partenaire commercial (à l'externe)","Gérer la relation avec les clients","A compléter costume 3 Action 3 Sous-action 5"]
[{"$f":"IF(B37=$B$3,B37&\"_\"&COUNTIF($B$6:$B37,$B$3),\"\")","v":"A porter seul_32"},"A porter seul",3,"Partenaire commercial (à l'externe)","Gérer la relation avec la presse","A compléter costume 3 Action 4 Sous-action 2"]
[{"$f":"IF(B38=$B$3,B38&\"_\"&COUNTIF($B$6:$B38,$B$3),\"\")","v":"A porter seul_33"},"A porter seul",3,"Partenaire commercial (à l'externe)","Gérer la relation avec les partenaires financiers","A compléter costume 3 Action 5 Sous-action 3"]
[{"$f":"IF(B39=$B$3,B39&\"_\"&COUNTIF($B$6:$B39,$B$3),\"\")","v":"A porter seul_34"},"A porter seul",3,"Partenaire commercial (à l'externe)","Gérer la relation avec les partenaires financiers","A compléter costume 3 Action 5 Sous-action 5"]
[{"$f":"IF(B40=$B$3,B40&\"_\"&COUNTIF($B$6:$B40,$B$3),\"\")","v":"A porter seul_35"},"A porter seul",4,"Mari / Amant","Communiquer régulièrement avec elle/lui","A compléter costume 4 Action 1 Sous-action 2"]
[{"$f":"IF(B41=$B$3,B41&\"_\"&COUNTIF($B$6:$B41,$B$3),\"\")","v":"A porter seul_36"},"A porter seul",4,"Mari / Amant","Communiquer régulièrement avec elle/lui","A compléter costume 4 Action 1 Sous-action 3"]
[{"$f":"IF(B42=$B$3,B42&\"_\"&COUNTIF($B$6:$B42,$B$3),\"\")","v":"A porter seul_37"},"A porter seul",4,"Mari / Amant","Accorder x heures par jour/semaine à elle/lui","A compléter costume 4 Action 2 Sous-action 2"]
[{"$f":"IF(B43=$B$3,B43&\"_\"&COUNTIF($B$6:$B43,$B$3),\"\")","v":"A porter seul_38"},"A porter seul",4,"Mari / Amant","Accorder x heures par jour/semaine à elle/lui","A compléter costume 4 Action 2 Sous-action 3"]
[{"$f":"IF(B44=$B$3,B44&\"_\"&COUNTIF($B$6:$B44,$B$3),\"\")","v":"A porter seul_39"},"A porter seul",4,"Mari / Amant","Répondre à ses demandes/messages/sollicitations","A compléter costume 4 Action 3 Sous-action 2"]
[{"$f":"IF(B45=$B$3,B45&\"_\"&COUNTIF($B$6:$B45,$B$3),\"\")","v":"A porter seul_40"},"A porter seul",4,"Mari / Amant","Emmener ma femme/mon mari au restaurant en tête à tête au moins 1 fois/semaine.","A compléter costume 4 Action 4 Sous-action 1"]
[{"$f":"IF(B46=$B$3,B46&\"_\"&COUNTIF($B$6:$B46,$B$3),\"\")","v":"A porter seul_41"},"A porter seul",4,"Mari / Amant","Emmener ma femme/mon mari au restaurant en tête à tête au moins 1 fois/semaine.","A compléter costume 4 Action 4 Sous-action 2"]
[{"$f":"IF(B47=$B$3,B47&\"_\"&COUNTIF($B$6:$B47,$B$3),\"\")","v":"A porter seul_42"},"A porter seul",4,"Mari / Amant","Emmener ma femme/mon mari au restaurant en tête à tête au moins 1 fois/semaine.","A compléter costume 4 Action 4 Sous-action 3"]
[{"$f":"IF(B48=$B$3,B48&\"_\"&COUNTIF($B$6:$B48,$B$3),\"\")","v":"A porter seul_43"},"A porter seul",4,"Mari / Amant","Emmener ma femme/mon mari au restaurant en tête à tête au moins 1 fois/semaine.","A compléter costume 4 Action 4 Sous-action 5"]
[{"$f":"IF(B49=$B$3,B49&\"_\"&COUNTIF($B$6:$B49,$B$3),\"\")","v":"A porter seul_44"},"A porter seul",4,"Mari / Amant","Programmer au moins 1 we entre amoureux/mois.","A compléter costume 4 Action 5 Sous-action 3"]
[{"$f":"IF(B50=$B$3,B50&\"_\"&COUNTIF($B$6:$B50,$B$3),\"\")","v":"A porter seul_45"},"A porter seul",5,"Père","Apporter de l'amour à mon enfant selon son langage de l'amour (= cadeaux, moments de qualité, services rendus, toucher physique, paroles valorisantes)","A compléter costume 5 Action 1 Sous-action 4"]
[{"$f":"IF(B51=$B$3,B51&\"_\"&COUNTIF($B$6:$B51,$B$3),\"\")","v":"A porter seul_46"},"A porter seul",5,"Père","Apporter de l'amour à mon enfant selon son langage de l'amour (= cadeaux, moments de qualité, services rendus, toucher physique, paroles valorisantes)","A compléter costume 5 Action 1 Sous-action 5"]
[{"$f":"IF(B52=$B$3,B52&\"_\"&COUNTIF($B$6:$B52,$B$3),\"\")","v":"A porter seul_47"},"A porter seul",5,"Père","M'assurer que mon/mes enfant(s) à des vêtements propres à mettre chaque jour.","A compléter costume 5 Action 2 Sous-action 5"]
[{"$f":"IF(B53=$B$3,B53&\"_\"&COUNTIF($B$6:$B53,$B$3),\"\")","v":"A porter seul_48"},"A porter seul",5,"Père","Assurer l'éducation de mon enfant et aider mon/mes enfant(s) dans ses apprentissages.","A compléter costume 5 Action 4 Sous-action 5"]
[{"$f":"IF(B54=$B$3,B54&\"_\"&COUNTIF($B$6:$B54,$B$3),\"\")","v":"A porter seul_49"},"A porter seul",6,"Oncle, fils, etc. (vie familiale)","Appeler les membres X, Y, et R de ma famille 1 fois/mois.","A compléter costume 6 Action 1 Sous-action 1"]
[{"$f":"IF(B55=$B$3,B55&\"_\"&COUNTIF($B$6:$B55,$B$3),\"\")","v":"A porter seul_50"},"A porter seul",6,"Oncle, fils, etc. (vie familiale)","Appeler les membres X, Y, et R de ma famille 1 fois/mois.","A compléter costume 6 Action 1 Sous-action 4"]
[{"$f":"IF(B56=$B$3,B56&\"_\"&COUNTIF($B$6:$B56,$B$3),\"\")","v":"A porter seul_51"},"A porter seul",6,"Oncle, fils, etc. (vie familiale)","Répondre aux appels de mon père.","A compléter costume 6 Action 2 Sous-action 3"]
[{"$f":"IF(B57=$B$3,B57&\"_\"&COUNTIF($B$6:$B57,$B$3),\"\")","v":"A porter seul_52"},"A porter seul",6,"Oncle, fils, etc. (vie familiale)","Soutenir Mme X dans les x prochains mois.","A compléter costume 6 Action 3 Sous-action 2"]
[{"$f":"IF(B58=$B$3,B58&\"_\"&COUNTIF($B$6:$B58,$B$3),\"\")","v":"A porter seul_53"},"A porter seul",6,"Oncle, fils, etc. (vie familiale)","Soutenir Mme X dans les x prochains mois.","A compléter costume 6 Action 3 Sous-action 5"]
[{"$f":"IF(B59=$B$3,B59&\"_\"&COUNTIF($B$6:$B59,$B$3),\"\")","v":"A porter seul_54"},"A porter seul",6,"Oncle, fils, etc. (vie familiale)","Organiser un weekend avec X et Y au moins 2 fois/an.","A compléter costume 6 Action 4 Sous-action 1"]
[{"$f":"IF(B60=$B$3,B60&\"_\"&COUNTIF($B$6:$B60,$B$3),\"\")","v":"A porter seul_55"},"A porter seul",6,"Oncle, fils, etc. (vie familiale)","Organiser un weekend avec X et Y au moins 2 fois/an.","A compléter costume 6 Action 4 Sous-action 4"]
[{"$f":"IF(B61=$B$3,B61&\"_\"&COUNTIF($B$6:$B61,$B$3),\"\")","v":"A porter seul_56"},"A porter seul",6,"Oncle, fils, etc. (vie familiale)","Me rendre disponible pour les anniversaires de P, S, et J chaque année.","A compléter costume 6 Action 5 Sous-action 3"]
[{"$f":"IF(B62=$B$3,B62&\"_\"&COUNTIF($B$6:$B62,$B$3),\"\")","v":"A porter seul_57"},"A porter seul",7,"Ami / copain (vie sociale)","Passer du temps avec mes ami(e)s","A compléter costume 7 Action 1 Sous-action 2"]
[{"$f":"IF(B63=$B$3,B63&\"_\"&COUNTIF($B$6:$B63,$B$3),\"\")","v":"A porter seul_58"},"A porter seul",7,"Ami / copain (vie sociale)","Rencontrer de nouvelles personnes","A compléter costume 7 Action 2 Sous-action 1"]
[{"$f":"IF(B64=$B$3,B64&\"_\"&COUNTIF($B$6:$B64,$B$3),\"\")","v":"A porter seul_59"},"A porter seul",7,"Ami / copain (vie sociale)","Rencontrer de nouvelles personnes","A compléter costume 7 Action 2 Sous-action 2"]
[{"$f":"IF(B65=$B$3,B65&\"_\"&COUNTIF($B$6:$B65,$B$3),\"\")","v":"A porter seul_60"},"A porter seul",7,"Ami / copain (vie sociale)","Appeler/écrire à mes ami(e)s X, Z, et A au moins 1 fois/mois.","A compléter costume 7 Action 3 Sous-action 5"]
[{"$f":"IF(B66=$B$3,B66&\"_\"&COUNTIF($B$6:$B66,$B$3),\"\")","v":"A porter seul_61"},"A porter seul",7,"Ami / copain (vie sociale)","Programmer au moins 1 sortie avec mes amis W, R, et U /mois.","A compléter costume 7 Action 5 Sous-action 2"]
[{"$f":"IF(B67=$B$3,B67&\"_\"&COUNTIF($B$6:$B67,$B$3),\"\")","v":"A porter seul_62"},"A porter seul",7,"Ami / copain (vie sociale)","Programmer au moins 1 sortie avec mes amis W, R, et U /mois.","A compléter costume 7 Action 5 Sous-action 5"]
[{"$f":"IF(B68=$B$3,B68&\"_\"&COUNTIF($B$6:$B68,$B$3),\"\")","v":"A porter seul_63"},"A porter seul",8,"Loisirs (activités, clubs, etc.)","Lire 30 minutes/semaine un livre \"plaisir\".","A compléter costume 8 Action 1 Sous-action 1"]
[{"$f":"IF(B69=$B$3,B69&\"_\"&COUNTIF($B$6:$B69,$B$3),\"\")","v":"A porter seul_64"},"A porter seul",8,"Loisirs (activités, clubs, etc.)","Lire 30 minutes/semaine un livre \"plaisir\".","A compléter costume 8 Action 1 Sous-action 2"]
[{"$f":"IF(B70=$B$3,B70&\"_\"&COUNTIF($B$6:$B70,$B$3),\"\")","v":"A porter seul_65"},"A porter seul",8,"Loisirs (activités, clubs, etc.)","Lire 30 minutes/semaine un livre \"plaisir\".","A compléter costume 8 Action 1 Sous-action 4"]
[{"$f":"IF(B71=$B$3,B71&\"_\"&COUNTIF($B$6:$B71,$B$3),\"\")","v":"A porter seul_66"},{"$f":"IF(C71=\"\",\"\",\"A porter seul\")","v":"A porter seul"},8,"Loisirs (activités, clubs, etc.)","Participer au carnaval de ma ville avec mon enfant.","A compléter costume 8 Action 2 Sous-action 2"]
[{"$f":"IF(B72=$B$3,B72&\"_\"&COUNTIF($B$6:$B72,$B$3),\"\")","v":"A porter seul_67"},"A porter seul",8,"Loisirs (activités, clubs, etc.)","Participer au carnaval de ma ville avec mon enfant.","A compléter costume 8 Action 2 Sous-action 4"]
[{"$f":"IF(B73=$B$3,B73&\"_\"&COUNTIF($B$6:$B73,$B$3),\"\")","v":"A porter seul_68"},"A porter seul",8,"Loisirs (activités, clubs, etc.)","Prendre 7 jours de vacances tous les 3 mois.","A compléter costume 8 Action 3 Sous-action 2"]
[{"$f":"IF(B74=$B$3,B74&\"_\"&COUNTIF($B$6:$B74,$B$3),\"\")","v":"A porter seul_69"},"A porter seul",8,"Loisirs (activités, clubs, etc.)","Pratiquer une activité qui me plaît chaque semaine, pendant x heures minimum.","A compléter costume 8 Action 4 Sous-action 4"]
[{"$f":"IF(B75=$B$3,B75&\"_\"&COUNTIF($B$6:$B75,$B$3),\"\")","v":"A porter seul_70"},"A porter seul",8,"Loisirs (activités, clubs, etc.)","Visiter des expositions/lieux/musées","A compléter costume 8 Action 5 Sous-action 1"]
[{"$f":"IF(B76=$B$3,B76&\"_\"&COUNTIF($B$6:$B76,$B$3),\"\")","v":"A porter seul_71"},"A porter seul",8,"Loisirs (activités, clubs, etc.)","Visiter des expositions/lieux/musées","A compléter costume 8 Action 5 Sous-action 2"]
[{"$f":"IF(B77=$B$3,B77&\"_\"&COUNTIF($B$6:$B77,$B$3),\"\")","v":"A porter seul_72"},"A porter seul",8,"Loisirs (activités, clubs, etc.)","Visiter des expositions/lieux/musées","A compléter costume 8 Action 5 Sous-action 3"]
[{"$f":"IF(B78=$B$3,B78&\"_\"&COUNTIF($B$6:$B78,$B$3),\"\")","v":"A porter seul_73"},"A porter seul",8,"Loisirs (activités, clubs, etc.)","Visiter des expositions/lieux/musées","A compléter costume 8 Action 5 Sous-action 4"]
[{"$f":"IF(B79=$B$3,B79&\"_\"&COUNTIF($B$6:$B79,$B$3),\"\")","v":"A porter seul_74"},"A porter seul",9,"Dormeur","Suivre un rituel du coucher identique tous les soirs.","Me coucher chaque soir à heure fixe."]
[{"$f":"IF(B80=$B$3,B80&\"_\"&COUNTIF($B$6:$B80,$B$3),\"\")","v":"A porter seul_75"},"A porter seul",9,"Dormeur","Suivre un rituel du coucher identique tous les soirs.","A compléter costume 9 Action 1 Sous-action 4"]
[{"$f":"IF(B81=$B$3,B81&\"_\"&COUNTIF($B$6:$B81,$B$3),\"\")","v":"A porter seul_76"},"A porter seul",9,"Dormeur","Ne pas regarder d'écrans au moins 1h avant de me coucher.","A compléter costume 9 Action 2 Sous-action 2"]
[{"$f":"IF(B82=$B$3,B82&\"_\"&COUNTIF($B$6:$B82,$B$3),\"\")","v":"A porter seul_77"},"A porter seul",9,"Dormeur","Ne pas regarder d'écrans au moins 1h avant de me coucher.","A compléter costume 9 Action 2 Sous-action 3"]
[{"$f":"IF(B83=$B$3,B83&\"_\"&COUNTIF($B$6:$B83,$B$3),\"\")","v":"A porter seul_78"},"A porter seul",9,"Dormeur","Ne pas regarder d'écrans au moins 1h avant de me coucher.","A compléter costume 9 Action 2 Sous-action 4"]
[{"$f":"IF(B84=$B$3,B84&\"_\"&COUNTIF($B$6:$B84,$B$3),\"\")","v":"A porter seul_79"},"A porter seul",9,"Dormeur","Me lever chaque matin à une heure fixe.","A compléter costume 9 Action 3 Sous-action 2"]
[{"$f":"IF(B85=$B$3,B85&\"_\"&COUNTIF($B$6:$B85,$B$3),\"\")","v":"A porter seul_80"},"A porter seul",9,"Dormeur","Me lever chaque matin à une heure fixe.","A compléter costume 9 Action 3 Sous-action 3"]
[{"$f":"IF(B86=$B$3,B86&\"_\"&COUNTIF($B$6:$B86,$B$3),\"\")","v":"A porter seul_81"},"A porter seul",9,"Dormeur","Me lever chaque matin à une heure fixe.","A compléter costume 9 Action 3 Sous-action 4"]
[{"$f":"IF(B87=$B$3,B87&\"_\"&COUNTIF($B$6:$B87,$B$3),\"\")","v":"A porter seul_82"},"A porter seul",9,"Dormeur","Me lever chaque matin à une heure fixe.","A compléter costume 9 Action 3 Sous-action 5"]
[{"$f":"IF(B88=$B$3,B88&\"_\"&COUNTIF($B$6:$B88,$B$3),\"\")","v":"A porter seul_83"},"A porter seul",9,"Dormeur","Méditer, visualiser, ou prendre un temps calme chaque jour de 10 minutes au réveil / à 13h00 / au coucher.","A compléter costume 9 Action 4 Sous-action 2"]
[{"$f":"IF(B89=$B$3,B89&\"_\"&COUNTIF($B$6:$B89,$B$3),\"\")","v":"A porter seul_84"},"A porter seul",9,"Dormeur","Méditer, visualiser, ou prendre un temps calme chaque jour de 10 minutes au réveil / à 13h00 / au coucher.","A compléter costume 9 Action 4 Sous-action 3"]
[{"$f":"IF(B90=$B$3,B90&\"_\"&COUNTIF($B$6:$B90,$B$3),\"\")","v":"A porter seul_85"},"A porter seul",9,"Dormeur","Méditer, visualiser, ou prendre un temps calme chaque jour de 10 minutes au réveil / à 13h00 / au coucher.","A compléter costume 9 Action 4 Sous-action 4"]
[{"$f":"IF(B91=$B$3,B91&\"_\"&COUNTIF($B$6:$B91,$B$3),\"\")","v":"A porter seul_86"},"A porter seul",9,"Dormeur","Manger léger tous les soirs du lundi au vendredi, sans sucre ni café.","A compléter costume 9 Action 5 Sous-action 1"]
[{"$f":"IF(B92=$B$3,B92&\"_\"&COUNTIF($B$6:$B92,$B$3),\"\")","v":"A porter seul_87"},"A porter seul",9,"Dormeur","Manger léger tous les soirs du lundi au vendredi, sans sucre ni café.","A compléter costume 9 Action 5 Sous-action 2"]
[{"$f":"IF(B93=$B$3,B93&\"_\"&COUNTIF($B$6:$B93,$B$3),\"\")","v":"A porter seul_88"},"A porter seul",9,"Dormeur","Manger léger tous les soirs du lundi au vendredi, sans sucre ni café.","A compléter costume 9 Action 5 Sous-action 3"]
[{"$f":"IF(B94=$B$3,B94&\"_\"&COUNTIF($B$6:$B94,$B$3),\"\")","v":"A porter seul_89"},"A porter seul",10,"Sportif","Manger des légumes midi et soir, et des protéines matin et midi.","A compléter costume 10 Action 5 Sous-action 3"]
[{"$f":"IF(B95=$B$3,B95&\"_\"&COUNTIF($B$6:$B95,$B$3),\"\")","v":"A porter seul_90"},"A porter seul",10,"Sportif","Manger des légumes midi et soir, et des protéines matin et midi.","A compléter costume 10 Action 5 Sous-action 4"]
[{"$f":"IF(B96=$B$3,B96&\"_\"&COUNTIF($B$6:$B96,$B$3),\"\")","v":"A porter seul_91"},"A porter seul",10,"Sportif","Manger des légumes midi et soir, et des protéines matin et midi.","A compléter costume 10 Action 5 Sous-action 5"]
[{"$f":"IF(B97=$B$3,B97&\"_\"&COUNTIF($B$6:$B97,$B$3),\"\")","v":""},""]
[{"$f":"IF(B98=$B$3,B98&\"_\"&COUNTIF($B$6:$B98,$B$3),\"\")","v":""},""]
[{"$f":"IF(B99=$B$3,B99&\"_\"&COUNTIF($B$6:$B99,$B$3),\"\")","v":""},""]
[{"$f":"IF(B100=$B$3,B100&\"_\"&COUNTIF($B$6:$B100,$B$3),\"\")","v":""},""]
[{"$f":"IF(B101=$B$3,B101&\"_\"&COUNTIF($B$6:$B101,$B$3),\"\")","v":""},""]
[{"$f":"IF(B102=$B$3,B102&\"_\"&COUNTIF($B$6:$B102,$B$3),\"\")","v":""},""]
[{"$f":"IF(B103=$B$3,B103&\"_\"&COUNTIF($B$6:$B103,$B$3),\"\")","v":""},""]
[{"$f":"IF(B104=$B$3,B104&\"_\"&COUNTIF($B$6:$B104,$B$3),\"\")","v":""},""]
[{"$f":"IF(B105=$B$3,B105&\"_\"&COUNTIF($B$6:$B105,$B$3),\"\")","v":""},""]
[{"$f":"IF(B106=$B$3,B106&\"_\"&COUNTIF($B$6:$B106,$B$3),\"\")","v":""},""]
[{"$f":"IF(B107=$B$3,B107&\"_\"&COUNTIF($B$6:$B107,$B$3),\"\")","v":""},""]
[{"$f":"IF(B108=$B$3,B108&\"_\"&COUNTIF($B$6:$B108,$B$3),\"\")","v":""},""]
[{"$f":"IF(B109=$B$3,B109&\"_\"&COUNTIF($B$6:$B109,$B$3),\"\")","v":""},""]
[{"$f":"IF(B110=$B$3,B110&\"_\"&COUNTIF($B$6:$B110,$B$3),\"\")","v":""},""]
[{"$f":"IF(B111=$B$3,B111&\"_\"&COUNTIF($B$6:$B111,$B$3),\"\")","v":""},""]
[{"$f":"IF(B112=$B$3,B112&\"_\"&COUNTIF($B$6:$B112,$B$3),\"\")","v":""},""]
[{"$f":"IF(B113=$B$3,B113&\"_\"&COUNTIF($B$6:$B113,$B$3),\"\")","v":""},""]
[{"$f":"IF(B114=$B$3,B114&\"_\"&COUNTIF($B$6:$B114,$B$3),\"\")","v":""},""]
[{"$f":"IF(B115=$B$3,B115&\"_\"&COUNTIF($B$6:$B115,$B$3),\"\")","v":""},""]
[{"$f":"IF(B116=$B$3,B116&\"_\"&COUNTIF($B$6:$B116,$B$3),\"\")","v":""},""]
[{"$f":"IF(B117=$B$3,B117&\"_\"&COUNTIF($B$6:$B117,$B$3),\"\")","v":""},""]
[{"$f":"IF(B118=$B$3,B118&\"_\"&COUNTIF($B$6:$B118,$B$3),\"\")","v":""},""]
[{"$f":"IF(B119=$B$3,B119&\"_\"&COUNTIF($B$6:$B119,$B$3),\"\")","v":""},""]
[{"$f":"IF(B120=$B$3,B120&\"_\"&COUNTIF($B$6:$B120,$B$3),\"\")","v":""},""]
[{"$f":"IF(B121=$B$3,B121&\"_\"&COUNTIF($B$6:$B121,$B$3),\"\")","v":""},""]
[{"$f":"IF(B122=$B$3,B122&\"_\"&COUNTIF($B$6:$B122,$B$3),\"\")","v":""},""]
[{"$f":"IF(B123=$B$3,B123&\"_\"&COUNTIF($B$6:$B123,$B$3),\"\")","v":""},""]
[{"$f":"IF(B124=$B$3,B124&\"_\"&COUNTIF($B$6:$B124,$B$3),\"\")","v":""},""]
[{"$f":"IF(B125=$B$3,B125&\"_\"&COUNTIF($B$6:$B125,$B$3),\"\")","v":""},""]
[{"$f":"IF(B126=$B$3,B126&\"_\"&COUNTIF($B$6:$B126,$B$3),\"\")","v":""},""]
[{"$f":"IF(B127=$B$3,B127&\"_\"&COUNTIF($B$6:$B127,$B$3),\"\")","v":""},""]
[{"$f":"IF(B128=$B$3,B128&\"_\"&COUNTIF($B$6:$B128,$B$3),\"\")","v":""},""]
[{"$f":"IF(B129=$B$3,B129&\"_\"&COUNTIF($B$6:$B129,$B$3),\"\")","v":""},""]
[{"$f":"IF(B130=$B$3,B130&\"_\"&COUNTIF($B$6:$B130,$B$3),\"\")","v":""},""]
[{"$f":"IF(B131=$B$3,B131&\"_\"&COUNTIF($B$6:$B131,$B$3),\"\")","v":""},""]
[{"$f":"IF(B132=$B$3,B132&\"_\"&COUNTIF($B$6:$B132,$B$3),\"\")","v":""},""]
[{"$f":"IF(B133=$B$3,B133&\"_\"&COUNTIF($B$6:$B133,$B$3),\"\")","v":""},""]
[{"$f":"IF(B134=$B$3,B134&\"_\"&COUNTIF($B$6:$B134,$B$3),\"\")","v":""},""]
[{"$f":"IF(B135=$B$3,B135&\"_\"&COUNTIF($B$6:$B135,$B$3),\"\")","v":""},{"$f":"IF(C135=\"\",\"\",\"A porter seul\")","v":""}]
[{"$f":"IF(B136=$B$3,B136&\"_\"&COUNTIF($B$6:$B136,$B$3),\"\")","v":""},""]
[{"$f":"IF(B137=$B$3,B137&\"_\"&COUNTIF($B$6:$B137,$B$3),\"\")","v":""},""]
[{"$f":"IF(B138=$B$3,B138&\"_\"&COUNTIF($B$6:$B138,$B$3),\"\")","v":""},""]
[{"$f":"IF(B139=$B$3,B139&\"_\"&COUNTIF($B$6:$B139,$B$3),\"\")","v":""},""]
[{"$f":"IF(B140=$B$3,B140&\"_\"&COUNTIF($B$6:$B140,$B$3),\"\")","v":""},""]
[{"$f":"IF(B141=$B$3,B141&\"_\"&COUNTIF($B$6:$B141,$B$3),\"\")","v":""},""]
[{"$f":"IF(B142=$B$3,B142&\"_\"&COUNTIF($B$6:$B142,$B$3),\"\")","v":""},""]
[{"$f":"IF(B143=$B$3,B143&\"_\"&COUNTIF($B$6:$B143,$B$3),\"\")","v":""},""]
[{"$f":"IF(B144=$B$3,B144&\"_\"&COUNTIF($B$6:$B144,$B$3),\"\")","v":""},""]
[{"$f":"IF(B145=$B$3,B145&\"_\"&COUNTIF($B$6:$B145,$B$3),\"\")","v":""},""]
[{"$f":"IF(B146=$B$3,B146&\"_\"&COUNTIF($B$6:$B146,$B$3),\"\")","v":""},""]
[{"$f":"IF(B147=$B$3,B147&\"_\"&COUNTIF($B$6:$B147,$B$3),\"\")","v":""},""]
[{"$f":"IF(B148=$B$3,B148&\"_\"&COUNTIF($B$6:$B148,$B$3),\"\")","v":""},""]
[{"$f":"IF(B149=$B$3,B149&\"_\"&COUNTIF($B$6:$B149,$B$3),\"\")","v":""},""]
[{"$f":"IF(B150=$B$3,B150&\"_\"&COUNTIF($B$6:$B150,$B$3),\"\")","v":""},""]
[{"$f":"IF(B151=$B$3,B151&\"_\"&COUNTIF($B$6:$B151,$B$3),\"\")","v":""},""]
[{"$f":"IF(B152=$B$3,B152&\"_\"&COUNTIF($B$6:$B152,$B$3),\"\")","v":""},""]
[{"$f":"IF(B153=$B$3,B153&\"_\"&COUNTIF($B$6:$B153,$B$3),\"\")","v":""},""]
[{"$f":"IF(B154=$B$3,B154&\"_\"&COUNTIF($B$6:$B154,$B$3),\"\")","v":""},""]
[{"$f":"IF(B155=$B$3,B155&\"_\"&COUNTIF($B$6:$B155,$B$3),\"\")","v":""},""]
[{"$f":"IF(B156=$B$3,B156&\"_\"&COUNTIF($B$6:$B156,$B$3),\"\")","v":""},""]
[{"$f":"IF(B157=$B$3,B157&\"_\"&COUNTIF($B$6:$B157,$B$3),\"\")","v":""},""]
[{"$f":"IF(B158=$B$3,B158&\"_\"&COUNTIF($B$6:$B158,$B$3),\"\")","v":""},""]
[{"$f":"IF(B159=$B$3,B159&\"_\"&COUNTIF($B$6:$B159,$B$3),\"\")","v":""},""]
[{"$f":"IF(B160=$B$3,B160&\"_\"&COUNTIF($B$6:$B160,$B$3),\"\")","v":""},""]
[{"$f":"IF(B161=$B$3,B161&\"_\"&COUNTIF($B$6:$B161,$B$3),\"\")","v":""},""]
[{"$f":"IF(B162=$B$3,B162&\"_\"&COUNTIF($B$6:$B162,$B$3),\"\")","v":""},""]
[{"$f":"IF(B163=$B$3,B163&\"_\"&COUNTIF($B$6:$B163,$B$3),\"\")","v":""},""]
[{"$f":"IF(B164=$B$3,B164&\"_\"&COUNTIF($B$6:$B164,$B$3),\"\")","v":""},""]
[{"$f":"IF(B165=$B$3,B165&\"_\"&COUNTIF($B$6:$B165,$B$3),\"\")","v":""},""]
[{"$f":"IF(B166=$B$3,B166&\"_\"&COUNTIF($B$6:$B166,$B$3),\"\")","v":""},""]
[{"$f":"IF(B167=$B$3,B167&\"_\"&COUNTIF($B$6:$B167,$B$3),\"\")","v":""},""]
[{"$f":"IF(B168=$B$3,B168&\"_\"&COUNTIF($B$6:$B168,$B$3),\"\")","v":""},""]
[{"$f":"IF(B169=$B$3,B169&\"_\"&COUNTIF($B$6:$B169,$B$3),\"\")","v":""},""]
[{"$f":"IF(B170=$B$3,B170&\"_\"&COUNTIF($B$6:$B170,$B$3),\"\")","v":""},""]
[{"$f":"IF(B171=$B$3,B171&\"_\"&COUNTIF($B$6:$B171,$B$3),\"\")","v":""},""]
[{"$f":"IF(B172=$B$3,B172&\"_\"&COUNTIF($B$6:$B172,$B$3),\"\")","v":""},""]
[{"$f":"IF(B173=$B$3,B173&\"_\"&COUNTIF($B$6:$B173,$B$3),\"\")","v":""},""]
[{"$f":"IF(B174=$B$3,B174&\"_\"&COUNTIF($B$6:$B174,$B$3),\"\")","v":""},""]
[{"$f":"IF(B175=$B$3,B175&\"_\"&COUNTIF($B$6:$B175,$B$3),\"\")","v":""},""]
[{"$f":"IF(B176=$B$3,B176&\"_\"&COUNTIF($B$6:$B176,$B$3),\"\")","v":""},""]
[{"$f":"IF(B177=$B$3,B177&\"_\"&COUNTIF($B$6:$B177,$B$3),\"\")","v":""},""]
[{"$f":"IF(B178=$B$3,B178&\"_\"&COUNTIF($B$6:$B178,$B$3),\"\")","v":""},""]
[{"$f":"IF(B179=$B$3,B179&\"_\"&COUNTIF($B$6:$B179,$B$3),\"\")","v":""},""]
[{"$f":"IF(B180=$B$3,B180&\"_\"&COUNTIF($B$6:$B180,$B$3),\"\")","v":""},""]
[{"$f":"IF(B181=$B$3,B181&\"_\"&COUNTIF($B$6:$B181,$B$3),\"\")","v":""},""]
[{"$f":"IF(B182=$B$3,B182&\"_\"&COUNTIF($B$6:$B182,$B$3),\"\")","v":""},""]
[{"$f":"IF(B183=$B$3,B183&\"_\"&COUNTIF($B$6:$B183,$B$3),\"\")","v":""},""]
[{"$f":"IF(B184=$B$3,B184&\"_\"&COUNTIF($B$6:$B184,$B$3),\"\")","v":""},""]
[{"$f":"IF(B185=$B$3,B185&\"_\"&COUNTIF($B$6:$B185,$B$3),\"\")","v":""},""]
[{"$f":"IF(B186=$B$3,B186&\"_\"&COUNTIF($B$6:$B186,$B$3),\"\")","v":""},""]
[{"$f":"IF(B187=$B$3,B187&\"_\"&COUNTIF($B$6:$B187,$B$3),\"\")","v":""},""]
[{"$f":"IF(B188=$B$3,B188&\"_\"&COUNTIF($B$6:$B188,$B$3),\"\")","v":""},""]
[{"$f":"IF(B189=$B$3,B189&\"_\"&COUNTIF($B$6:$B189,$B$3),\"\")","v":""},""]
[{"$f":"IF(B190=$B$3,B190&\"_\"&COUNTIF($B$6:$B190,$B$3),\"\")","v":""},""]
[{"$f":"IF(B191=$B$3,B191&\"_\"&COUNTIF($B$6:$B191,$B$3),\"\")","v":""},""]
[{"$f":"IF(B192=$B$3,B192&\"_\"&COUNTIF($B$6:$B192,$B$3),\"\")","v":""},""]
[{"$f":"IF(B193=$B$3,B193&\"_\"&COUNTIF($B$6:$B193,$B$3),\"\")","v":""},""]
[{"$f":"IF(B194=$B$3,B194&\"_\"&COUNTIF($B$6:$B194,$B$3),\"\")","v":""},""]
[{"$f":"IF(B195=$B$3,B195&\"_\"&COUNTIF($B$6:$B195,$B$3),\"\")","v":""},""]
[{"$f":"IF(B196=$B$3,B196&\"_\"&COUNTIF($B$6:$B196,$B$3),\"\")","v":""},""]
[{"$f":"IF(B197=$B$3,B197&\"_\"&COUNTIF($B$6:$B197,$B$3),\"\")","v":""},""]
[{"$f":"IF(B198=$B$3,B198&\"_\"&COUNTIF($B$6:$B198,$B$3),\"\")","v":""},""]
[{"$f":"IF(B199=$B$3,B199&\"_\"&COUNTIF($B$6:$B199,$B$3),\"\")","v":""},{"$f":"IF(C199=\"\",\"\",\"A porter seul\")","v":""}]
[{"$f":"IF(B200=$B$3,B200&\"_\"&COUNTIF($B$6:$B200,$B$3),\"\")","v":""},""]
[{"$f":"IF(B201=$B$3,B201&\"_\"&COUNTIF($B$6:$B201,$B$3),\"\")","v":""},""]
[{"$f":"IF(B202=$B$3,B202&\"_\"&COUNTIF($B$6:$B202,$B$3),\"\")","v":""},""]
[{"$f":"IF(B203=$B$3,B203&\"_\"&COUNTIF($B$6:$B203,$B$3),\"\")","v":""},""]
[{"$f":"IF(B204=$B$3,B204&\"_\"&COUNTIF($B$6:$B204,$B$3),\"\")","v":""},""]
[{"$f":"IF(B205=$B$3,B205&\"_\"&COUNTIF($B$6:$B205,$B$3),\"\")","v":""},""]
[{"$f":"IF(B206=$B$3,B206&\"_\"&COUNTIF($B$6:$B206,$B$3),\"\")","v":""},""]
[{"$f":"IF(B207=$B$3,B207&\"_\"&COUNTIF($B$6:$B207,$B$3),\"\")","v":""},""]
[{"$f":"IF(B208=$B$3,B208&\"_\"&COUNTIF($B$6:$B208,$B$3),\"\")","v":""},""]
[{"$f":"IF(B209=$B$3,B209&\"_\"&COUNTIF($B$6:$B209,$B$3),\"\")","v":""},""]
[{"$f":"IF(B210=$B$3,B210&\"_\"&COUNTIF($B$6:$B210,$B$3),\"\")","v":""},""]
[{"$f":"IF(B211=$B$3,B211&\"_\"&COUNTIF($B$6:$B211,$B$3),\"\")","v":""},""]
[{"$f":"IF(B212=$B$3,B212&\"_\"&COUNTIF($B$6:$B212,$B$3),\"\")","v":""},""]
[{"$f":"IF(B213=$B$3,B213&\"_\"&COUNTIF($B$6:$B213,$B$3),\"\")","v":""},""]
[{"$f":"IF(B214=$B$3,B214&\"_\"&COUNTIF($B$6:$B214,$B$3),\"\")","v":""},""]
[{"$f":"IF(B215=$B$3,B215&\"_\"&COUNTIF($B$6:$B215,$B$3),\"\")","v":""},""]
[{"$f":"IF(B216=$B$3,B216&\"_\"&COUNTIF($B$6:$B216,$B$3),\"\")","v":""},""]
[{"$f":"IF(B217=$B$3,B217&\"_\"&COUNTIF($B$6:$B217,$B$3),\"\")","v":""},""]
[{"$f":"IF(B218=$B$3,B218&\"_\"&COUNTIF($B$6:$B218,$B$3),\"\")","v":""},""]
[{"$f":"IF(B219=$B$3,B219&\"_\"&COUNTIF($B$6:$B219,$B$3),\"\")","v":""},""]
[{"$f":"IF(B220=$B$3,B220&\"_\"&COUNTIF($B$6:$B220,$B$3),\"\")","v":""},""]
[{"$f":"IF(B221=$B$3,B221&\"_\"&COUNTIF($B$6:$B221,$B$3),\"\")","v":""},""]
[{"$f":"IF(B222=$B$3,B222&\"_\"&COUNTIF($B$6:$B222,$B$3),\"\")","v":""},""]
[{"$f":"IF(B223=$B$3,B223&\"_\"&COUNTIF($B$6:$B223,$B$3),\"\")","v":""},""]
[{"$f":"IF(B224=$B$3,B224&\"_\"&COUNTIF($B$6:$B224,$B$3),\"\")","v":""},""]
[{"$f":"IF(B225=$B$3,B225&\"_\"&COUNTIF($B$6:$B225,$B$3),\"\")","v":""},""]
[{"$f":"IF(B226=$B$3,B226&\"_\"&COUNTIF($B$6:$B226,$B$3),\"\")","v":""},""]
[{"$f":"IF(B227=$B$3,B227&\"_\"&COUNTIF($B$6:$B227,$B$3),\"\")","v":""},""]
[{"$f":"IF(B228=$B$3,B228&\"_\"&COUNTIF($B$6:$B228,$B$3),\"\")","v":""},""]
[{"$f":"IF(B229=$B$3,B229&\"_\"&COUNTIF($B$6:$B229,$B$3),\"\")","v":""},""]
[{"$f":"IF(B230=$B$3,B230&\"_\"&COUNTIF($B$6:$B230,$B$3),\"\")","v":""},""]
[{"$f":"IF(B231=$B$3,B231&\"_\"&COUNTIF($B$6:$B231,$B$3),\"\")","v":""},""]
[{"$f":"IF(B232=$B$3,B232&\"_\"&COUNTIF($B$6:$B232,$B$3),\"\")","v":""},""]
[{"$f":"IF(B233=$B$3,B233&\"_\"&COUNTIF($B$6:$B233,$B$3),\"\")","v":""},""]
[{"$f":"IF(B234=$B$3,B234&\"_\"&COUNTIF($B$6:$B234,$B$3),\"\")","v":""},""]
[{"$f":"IF(B235=$B$3,B235&\"_\"&COUNTIF($B$6:$B235,$B$3),\"\")","v":""},""]
[{"$f":"IF(B236=$B$3,B236&\"_\"&COUNTIF($B$6:$B236,$B$3),\"\")","v":""},""]
[{"$f":"IF(B237=$B$3,B237&\"_\"&COUNTIF($B$6:$B237,$B$3),\"\")","v":""},""]
[{"$f":"IF(B238=$B$3,B238&\"_\"&COUNTIF($B$6:$B238,$B$3),\"\")","v":""},""]
[{"$f":"IF(B239=$B$3,B239&\"_\"&COUNTIF($B$6:$B239,$B$3),\"\")","v":""},""]
[{"$f":"IF(B240=$B$3,B240&\"_\"&COUNTIF($B$6:$B240,$B$3),\"\")","v":""},""]
[{"$f":"IF(B241=$B$3,B241&\"_\"&COUNTIF($B$6:$B241,$B$3),\"\")","v":""},""]
[{"$f":"IF(B242=$B$3,B242&\"_\"&COUNTIF($B$6:$B242,$B$3),\"\")","v":""},""]
[{"$f":"IF(B243=$B$3,B243&\"_\"&COUNTIF($B$6:$B243,$B$3),\"\")","v":""},""]
[{"$f":"IF(B244=$B$3,B244&\"_\"&COUNTIF($B$6:$B244,$B$3),\"\")","v":""},""]
[{"$f":"IF(B245=$B$3,B245&\"_\"&COUNTIF($B$6:$B245,$B$3),\"\")","v":""},""]
[{"$f":"IF(B246=$B$3,B246&\"_\"&COUNTIF($B$6:$B246,$B$3),\"\")","v":""},""]
[{"$f":"IF(B247=$B$3,B247&\"_\"&COUNTIF($B$6:$B247,$B$3),\"\")","v":""},""]
[{"$f":"IF(B248=$B$3,B248&\"_\"&COUNTIF($B$6:$B248,$B$3),\"\")","v":""},""]
[{"$f":"IF(B249=$B$3,B249&\"_\"&COUNTIF($B$6:$B249,$B$3),\"\")","v":""},""]
[{"$f":"IF(B250=$B$3,B250&\"_\"&COUNTIF($B$6:$B250,$B$3),\"\")","v":""},""]
[{"$f":"IF(B251=$B$3,B251&\"_\"&COUNTIF($B$6:$B251,$B$3),\"\")","v":""},""]
[{"$f":"IF(B252=$B$3,B252&\"_\"&COUNTIF($B$6:$B252,$B$3),\"\")","v":""},""]
[{"$f":"IF(B253=$B$3,B253&\"_\"&COUNTIF($B$6:$B253,$B$3),\"\")","v":""},""]
[{"$f":"IF(B254=$B$3,B254&\"_\"&COUNTIF($B$6:$B254,$B$3),\"\")","v":""},""]
[{"$f":"IF(B255=$B$3,B255&\"_\"&COUNTIF($B$6:$B255,$B$3),\"\")","v":""},""]
[{"$f":"IF(B256=$B$3,B256&\"_\"&COUNTIF($B$6:$B256,$B$3),\"\")","v":""},""]
[{"$f":"IF(B257=$B$3,B257&\"_\"&COUNTIF($B$6:$B257,$B$3),\"\")","v":""},""]
[{"$f":"IF(B258=$B$3,B258&\"_\"&COUNTIF($B$6:$B258,$B$3),\"\")","v":""},""]
[{"$f":"IF(B259=$B$3,B259&\"_\"&COUNTIF($B$6:$B259,$B$3),\"\")","v":""},""]
[{"$f":"IF(B260=$B$3,B260&\"_\"&COUNTIF($B$6:$B260,$B$3),\"\")","v":""},""]
[{"$f":"IF(B261=$B$3,B261&\"_\"&COUNTIF($B$6:$B261,$B$3),\"\")","v":""},""]
[{"$f":"IF(B262=$B$3,B262&\"_\"&COUNTIF($B$6:$B262,$B$3),\"\")","v":""},""]
[{"$f":"IF(B263=$B$3,B263&\"_\"&COUNTIF($B$6:$B263,$B$3),\"\")","v":""},{"$f":"IF(C263=\"\",\"\",\"A porter seul\")","v":""}]
[{"$f":"IF(B264=$B$3,B264&\"_\"&COUNTIF($B$6:$B264,$B$3),\"\")","v":""},""]
[{"$f":"IF(B265=$B$3,B265&\"_\"&COUNTIF($B$6:$B265,$B$3),\"\")","v":""},""]
[{"$f":"IF(B266=$B$3,B266&\"_\"&COUNTIF($B$6:$B266,$B$3),\"\")","v":""},""]
[{"$f":"IF(B267=$B$3,B267&\"_\"&COUNTIF($B$6:$B267,$B$3),\"\")","v":""},""]
[{"$f":"IF(B268=$B$3,B268&\"_\"&COUNTIF($B$6:$B268,$B$3),\"\")","v":""},""]
[{"$f":"IF(B269=$B$3,B269&\"_\"&COUNTIF($B$6:$B269,$B$3),\"\")","v":""},""]
[{"$f":"IF(B270=$B$3,B270&\"_\"&COUNTIF($B$6:$B270,$B$3),\"\")","v":""},""]
[{"$f":"IF(B271=$B$3,B271&\"_\"&COUNTIF($B$6:$B271,$B$3),\"\")","v":""},""]
[{"$f":"IF(B272=$B$3,B272&\"_\"&COUNTIF($B$6:$B272,$B$3),\"\")","v":""},""]
[{"$f":"IF(B273=$B$3,B273&\"_\"&COUNTIF($B$6:$B273,$B$3),\"\")","v":""},""]
[{"$f":"IF(B274=$B$3,B274&\"_\"&COUNTIF($B$6:$B274,$B$3),\"\")","v":""},""]
[{"$f":"IF(B275=$B$3,B275&\"_\"&COUNTIF($B$6:$B275,$B$3),\"\")","v":""},""]
[{"$f":"IF(B276=$B$3,B276&\"_\"&COUNTIF($B$6:$B276,$B$3),\"\")","v":""},""]
[{"$f":"IF(B277=$B$3,B277&\"_\"&COUNTIF($B$6:$B277,$B$3),\"\")","v":""},""]
[{"$f":"IF(B278=$B$3,B278&\"_\"&COUNTIF($B$6:$B278,$B$3),\"\")","v":""},""]
[{"$f":"IF(B279=$B$3,B279&\"_\"&COUNTIF($B$6:$B279,$B$3),\"\")","v":""},""]
[{"$f":"IF(B280=$B$3,B280&\"_\"&COUNTIF($B$6:$B280,$B$3),\"\")","v":""},""]
[{"$f":"IF(B281=$B$3,B281&\"_\"&COUNTIF($B$6:$B281,$B$3),\"\")","v":""},""]
[{"$f":"IF(B282=$B$3,B282&\"_\"&COUNTIF($B$6:$B282,$B$3),\"\")","v":""},""]
[{"$f":"IF(B283=$B$3,B283&\"_\"&COUNTIF($B$6:$B283,$B$3),\"\")","v":""},""]
[{"$f":"IF(B284=$B$3,B284&\"_\"&COUNTIF($B$6:$B284,$B$3),\"\")","v":""},""]
[{"$f":"IF(B285=$B$3,B285&\"_\"&COUNTIF($B$6:$B285,$B$3),\"\")","v":""},""]
[{"$f":"IF(B286=$B$3,B286&\"_\"&COUNTIF($B$6:$B286,$B$3),\"\")","v":""},""]
[{"$f":"IF(B287=$B$3,B287&\"_\"&COUNTIF($B$6:$B287,$B$3),\"\")","v":""},""]
[{"$f":"IF(B288=$B$3,B288&\"_\"&COUNTIF($B$6:$B288,$B$3),\"\")","v":""},""]
[{"$f":"IF(B289=$B$3,B289&\"_\"&COUNTIF($B$6:$B289,$B$3),\"\")","v":""},""]
[{"$f":"IF(B290=$B$3,B290&\"_\"&COUNTIF($B$6:$B290,$B$3),\"\")","v":""},""]
[{"$f":"IF(B291=$B$3,B291&\"_\"&COUNTIF($B$6:$B291,$B$3),\"\")","v":""},""]
[{"$f":"IF(B292=$B$3,B292&\"_\"&COUNTIF($B$6:$B292,$B$3),\"\")","v":""},""]
[{"$f":"IF(B293=$B$3,B293&\"_\"&COUNTIF($B$6:$B293,$B$3),\"\")","v":""},""]
[{"$f":"IF(B294=$B$3,B294&\"_\"&COUNTIF($B$6:$B294,$B$3),\"\")","v":""},""]
[{"$f":"IF(B295=$B$3,B295&\"_\"&COUNTIF($B$6:$B295,$B$3),\"\")","v":""},""]
[{"$f":"IF(B296=$B$3,B296&\"_\"&COUNTIF($B$6:$B296,$B$3),\"\")","v":""},""]
[{"$f":"IF(B297=$B$3,B297&\"_\"&COUNTIF($B$6:$B297,$B$3),\"\")","v":""},""]
[{"$f":"IF(B298=$B$3,B298&\"_\"&COUNTIF($B$6:$B298,$B$3),\"\")","v":""},""]
[{"$f":"IF(B299=$B$3,B299&\"_\"&COUNTIF($B$6:$B299,$B$3),\"\")","v":""},""]
[{"$f":"IF(B300=$B$3,B300&\"_\"&COUNTIF($B$6:$B300,$B$3),\"\")","v":""},""]
[{"$f":"IF(B301=$B$3,B301&\"_\"&COUNTIF($B$6:$B301,$B$3),\"\")","v":""},""]
[{"$f":"IF(B302=$B$3,B302&\"_\"&COUNTIF($B$6:$B302,$B$3),\"\")","v":""},""]
[{"$f":"IF(B303=$B$3,B303&\"_\"&COUNTIF($B$6:$B303,$B$3),\"\")","v":""},""]
[{"$f":"IF(B304=$B$3,B304&\"_\"&COUNTIF($B$6:$B304,$B$3),\"\")","v":""},""]
[{"$f":"IF(B305=$B$3,B305&\"_\"&COUNTIF($B$6:$B305,$B$3),\"\")","v":""},""]
[{"$f":"IF(B306=$B$3,B306&\"_\"&COUNTIF($B$6:$B306,$B$3),\"\")","v":""},""]
[{"$f":"IF(B307=$B$3,B307&\"_\"&COUNTIF($B$6:$B307,$B$3),\"\")","v":""},""]
[{"$f":"IF(B308=$B$3,B308&\"_\"&COUNTIF($B$6:$B308,$B$3),\"\")","v":""},""]
[{"$f":"IF(B309=$B$3,B309&\"_\"&COUNTIF($B$6:$B309,$B$3),\"\")","v":""},""]
[{"$f":"IF(B310=$B$3,B310&\"_\"&COUNTIF($B$6:$B310,$B$3),\"\")","v":""},""]
[{"$f":"IF(B311=$B$3,B311&\"_\"&COUNTIF($B$6:$B311,$B$3),\"\")","v":""},""]
[{"$f":"IF(B312=$B$3,B312&\"_\"&COUNTIF($B$6:$B312,$B$3),\"\")","v":""},""]
[{"$f":"IF(B313=$B$3,B313&\"_\"&COUNTIF($B$6:$B313,$B$3),\"\")","v":""},""]
[{"$f":"IF(B314=$B$3,B314&\"_\"&COUNTIF($B$6:$B314,$B$3),\"\")","v":""},""]
[{"$f":"IF(B315=$B$3,B315&\"_\"&COUNTIF($B$6:$B315,$B$3),\"\")","v":""},""]
[{"$f":"IF(B316=$B$3,B316&\"_\"&COUNTIF($B$6:$B316,$B$3),\"\")","v":""},""]
[{"$f":"IF(B317=$B$3,B317&\"_\"&COUNTIF($B$6:$B317,$B$3),\"\")","v":""},""]
[{"$f":"IF(B318=$B$3,B318&\"_\"&COUNTIF($B$6:$B318,$B$3),\"\")","v":""},""]
[{"$f":"IF(B319=$B$3,B319&\"_\"&COUNTIF($B$6:$B319,$B$3),\"\")","v":""},""]
[{"$f":"IF(B320=$B$3,B320&\"_\"&COUNTIF($B$6:$B320,$B$3),\"\")","v":""},""]
[{"$f":"IF(B321=$B$3,B321&\"_\"&COUNTIF($B$6:$B321,$B$3),\"\")","v":""},""]
[{"$f":"IF(B322=$B$3,B322&\"_\"&COUNTIF($B$6:$B322,$B$3),\"\")","v":""},""]
[{"$f":"IF(B323=$B$3,B323&\"_\"&COUNTIF($B$6:$B323,$B$3),\"\")","v":""},""]
[{"$f":"IF(B324=$B$3,B324&\"_\"&COUNTIF($B$6:$B324,$B$3),\"\")","v":""},""]
[{"$f":"IF(B325=$B$3,B325&\"_\"&COUNTIF($B$6:$B325,$B$3),\"\")","v":""},""]
[{"$f":"IF(B326=$B$3,B326&\"_\"&COUNTIF($B$6:$B326,$B$3),\"\")","v":""},""]
[{"$f":"IF(B327=$B$3,B327&\"_\"&COUNTIF($B$6:$B327,$B$3),\"\")","v":""},{"$f":"IF(C327=\"\",\"\",\"A porter seul\")","v":""}]
[{"$f":"IF(B328=$B$3,B328&\"_\"&COUNTIF($B$6:$B328,$B$3),\"\")","v":""},""]
[{"$f":"IF(B329=$B$3,B329&\"_\"&COUNTIF($B$6:$B329,$B$3),\"\")","v":""},""]
[{"$f":"IF(B330=$B$3,B330&\"_\"&COUNTIF($B$6:$B330,$B$3),\"\")","v":""},""]
[{"$f":"IF(B331=$B$3,B331&\"_\"&COUNTIF($B$6:$B331,$B$3),\"\")","v":""},""]
[{"$f":"IF(B332=$B$3,B332&\"_\"&COUNTIF($B$6:$B332,$B$3),\"\")","v":""},""]
[{"$f":"IF(B333=$B$3,B333&\"_\"&COUNTIF($B$6:$B333,$B$3),\"\")","v":""},""]
[{"$f":"IF(B334=$B$3,B334&\"_\"&COUNTIF($B$6:$B334,$B$3),\"\")","v":""},""]
[{"$f":"IF(B335=$B$3,B335&\"_\"&COUNTIF($B$6:$B335,$B$3),\"\")","v":""},""]
[{"$f":"IF(B336=$B$3,B336&\"_\"&COUNTIF($B$6:$B336,$B$3),\"\")","v":""},""]
[{"$f":"IF(B337=$B$3,B337&\"_\"&COUNTIF($B$6:$B337,$B$3),\"\")","v":""},""]
[{"$f":"IF(B338=$B$3,B338&\"_\"&COUNTIF($B$6:$B338,$B$3),\"\")","v":""},""]
[{"$f":"IF(B339=$B$3,B339&\"_\"&COUNTIF($B$6:$B339,$B$3),\"\")","v":""},""]
[{"$f":"IF(B340=$B$3,B340&\"_\"&COUNTIF($B$6:$B340,$B$3),\"\")","v":""},""]
[{"$f":"IF(B341=$B$3,B341&\"_\"&COUNTIF($B$6:$B341,$B$3),\"\")","v":""},""]
[{"$f":"IF(B342=$B$3,B342&\"_\"&COUNTIF($B$6:$B342,$B$3),\"\")","v":""},""]
[{"$f":"IF(B343=$B$3,B343&\"_\"&COUNTIF($B$6:$B343,$B$3),\"\")","v":""},""]
[{"$f":"IF(B344=$B$3,B344&\"_\"&COUNTIF($B$6:$B344,$B$3),\"\")","v":""},""]
[{"$f":"IF(B345=$B$3,B345&\"_\"&COUNTIF($B$6:$B345,$B$3),\"\")","v":""},""]
[{"$f":"IF(B346=$B$3,B346&\"_\"&COUNTIF($B$6:$B346,$B$3),\"\")","v":""},""]
[{"$f":"IF(B347=$B$3,B347&\"_\"&COUNTIF($B$6:$B347,$B$3),\"\")","v":""},""]
[{"$f":"IF(B348=$B$3,B348&\"_\"&COUNTIF($B$6:$B348,$B$3),\"\")","v":""},""]
[{"$f":"IF(B349=$B$3,B349&\"_\"&COUNTIF($B$6:$B349,$B$3),\"\")","v":""},""]
[{"$f":"IF(B350=$B$3,B350&\"_\"&COUNTIF($B$6:$B350,$B$3),\"\")","v":""},""]
[{"$f":"IF(B351=$B$3,B351&\"_\"&COUNTIF($B$6:$B351,$B$3),\"\")","v":""},""]
[{"$f":"IF(B352=$B$3,B352&\"_\"&COUNTIF($B$6:$B352,$B$3),\"\")","v":""},""]
[{"$f":"IF(B353=$B$3,B353&\"_\"&COUNTIF($B$6:$B353,$B$3),\"\")","v":""},""]
[{"$f":"IF(B354=$B$3,B354&\"_\"&COUNTIF($B$6:$B354,$B$3),\"\")","v":""},""]
[{"$f":"IF(B355=$B$3,B355&\"_\"&COUNTIF($B$6:$B355,$B$3),\"\")","v":""},""]
[{"$f":"IF(B356=$B$3,B356&\"_\"&COUNTIF($B$6:$B356,$B$3),\"\")","v":""},""]
[{"$f":"IF(B357=$B$3,B357&\"_\"&COUNTIF($B$6:$B357,$B$3),\"\")","v":""},""]
[{"$f":"IF(B358=$B$3,B358&\"_\"&COUNTIF($B$6:$B358,$B$3),\"\")","v":""},""]
[{"$f":"IF(B359=$B$3,B359&\"_\"&COUNTIF($B$6:$B359,$B$3),\"\")","v":""},""]
[{"$f":"IF(B360=$B$3,B360&\"_\"&COUNTIF($B$6:$B360,$B$3),\"\")","v":""},""]
[{"$f":"IF(B361=$B$3,B361&\"_\"&COUNTIF($B$6:$B361,$B$3),\"\")","v":""},""]
[{"$f":"IF(B362=$B$3,B362&\"_\"&COUNTIF($B$6:$B362,$B$3),\"\")","v":""},""]
[{"$f":"IF(B363=$B$3,B363&\"_\"&COUNTIF($B$6:$B363,$B$3),\"\")","v":""},""]
[{"$f":"IF(B364=$B$3,B364&\"_\"&COUNTIF($B$6:$B364,$B$3),\"\")","v":""},""]
[{"$f":"IF(B365=$B$3,B365&\"_\"&COUNTIF($B$6:$B365,$B$3),\"\")","v":""},""]
[{"$f":"IF(B366=$B$3,B366&\"_\"&COUNTIF($B$6:$B366,$B$3),\"\")","v":""},""]
[{"$f":"IF(B367=$B$3,B367&\"_\"&COUNTIF($B$6:$B367,$B$3),\"\")","v":""},""]
[{"$f":"IF(B368=$B$3,B368&\"_\"&COUNTIF($B$6:$B368,$B$3),\"\")","v":""},""]
[{"$f":"IF(B369=$B$3,B369&\"_\"&COUNTIF($B$6:$B369,$B$3),\"\")","v":""},""]
[{"$f":"IF(B370=$B$3,B370&\"_\"&COUNTIF($B$6:$B370,$B$3),\"\")","v":""},""]
[{"$f":"IF(B371=$B$3,B371&\"_\"&COUNTIF($B$6:$B371,$B$3),\"\")","v":""},""]
[{"$f":"IF(B372=$B$3,B372&\"_\"&COUNTIF($B$6:$B372,$B$3),\"\")","v":""},""]
[{"$f":"IF(B373=$B$3,B373&\"_\"&COUNTIF($B$6:$B373,$B$3),\"\")","v":""},""]
[{"$f":"IF(B374=$B$3,B374&\"_\"&COUNTIF($B$6:$B374,$B$3),\"\")","v":""},""]
[{"$f":"IF(B375=$B$3,B375&\"_\"&COUNTIF($B$6:$B375,$B$3),\"\")","v":""},""]
[{"$f":"IF(B376=$B$3,B376&\"_\"&COUNTIF($B$6:$B376,$B$3),\"\")","v":""},""]
[{"$f":"IF(B377=$B$3,B377&\"_\"&COUNTIF($B$6:$B377,$B$3),\"\")","v":""},""]
[{"$f":"IF(B378=$B$3,B378&\"_\"&COUNTIF($B$6:$B378,$B$3),\"\")","v":""},""]
[{"$f":"IF(B379=$B$3,B379&\"_\"&COUNTIF($B$6:$B379,$B$3),\"\")","v":""},""]
[{"$f":"IF(B380=$B$3,B380&\"_\"&COUNTIF($B$6:$B380,$B$3),\"\")","v":""},""]
[{"$f":"IF(B381=$B$3,B381&\"_\"&COUNTIF($B$6:$B381,$B$3),\"\")","v":""},""]
[{"$f":"IF(B382=$B$3,B382&\"_\"&COUNTIF($B$6:$B382,$B$3),\"\")","v":""},""]
[{"$f":"IF(B383=$B$3,B383&\"_\"&COUNTIF($B$6:$B383,$B$3),\"\")","v":""},""]
[{"$f":"IF(B384=$B$3,B384&\"_\"&COUNTIF($B$6:$B384,$B$3),\"\")","v":""},""]
[{"$f":"IF(B385=$B$3,B385&\"_\"&COUNTIF($B$6:$B385,$B$3),\"\")","v":""},""]
[{"$f":"IF(B386=$B$3,B386&\"_\"&COUNTIF($B$6:$B386,$B$3),\"\")","v":""},""]
[{"$f":"IF(B387=$B$3,B387&\"_\"&COUNTIF($B$6:$B387,$B$3),\"\")","v":""},""]
[{"$f":"IF(B388=$B$3,B388&\"_\"&COUNTIF($B$6:$B388,$B$3),\"\")","v":""},""]
[{"$f":"IF(B389=$B$3,B389&\"_\"&COUNTIF($B$6:$B389,$B$3),\"\")","v":""},""]
[{"$f":"IF(B390=$B$3,B390&\"_\"&COUNTIF($B$6:$B390,$B$3),\"\")","v":""},""]
[{"$f":"IF(B391=$B$3,B391&\"_\"&COUNTIF($B$6:$B391,$B$3),\"\")","v":""},{"$f":"IF(C391=\"\",\"\",\"A porter seul\")","v":""}]
[{"$f":"IF(B392=$B$3,B392&\"_\"&COUNTIF($B$6:$B392,$B$3),\"\")","v":""},""]
[{"$f":"IF(B393=$B$3,B393&\"_\"&COUNTIF($B$6:$B393,$B$3),\"\")","v":""},""]
[{"$f":"IF(B394=$B$3,B394&\"_\"&COUNTIF($B$6:$B394,$B$3),\"\")","v":""},""]
[{"$f":"IF(B395=$B$3,B395&\"_\"&COUNTIF($B$6:$B395,$B$3),\"\")","v":""},""]
[{"$f":"IF(B396=$B$3,B396&\"_\"&COUNTIF($B$6:$B396,$B$3),\"\")","v":""},""]
[{"$f":"IF(B397=$B$3,B397&\"_\"&COUNTIF($B$6:$B397,$B$3),\"\")","v":""},""]
[{"$f":"IF(B398=$B$3,B398&\"_\"&COUNTIF($B$6:$B398,$B$3),\"\")","v":""},""]
[{"$f":"IF(B399=$B$3,B399&\"_\"&COUNTIF($B$6:$B399,$B$3),\"\")","v":""},""]
[{"$f":"IF(B400=$B$3,B400&\"_\"&COUNTIF($B$6:$B400,$B$3),\"\")","v":""},""]
[{"$f":"IF(B401=$B$3,B401&\"_\"&COUNTIF($B$6:$B401,$B$3),\"\")","v":""},""]
[{"$f":"IF(B402=$B$3,B402&\"_\"&COUNTIF($B$6:$B402,$B$3),\"\")","v":""},""]
[{"$f":"IF(B403=$B$3,B403&\"_\"&COUNTIF($B$6:$B403,$B$3),\"\")","v":""},""]
[{"$f":"IF(B404=$B$3,B404&\"_\"&COUNTIF($B$6:$B404,$B$3),\"\")","v":""},""]
[{"$f":"IF(B405=$B$3,B405&\"_\"&COUNTIF($B$6:$B405,$B$3),\"\")","v":""},""]
[{"$f":"IF(B406=$B$3,B406&\"_\"&COUNTIF($B$6:$B406,$B$3),\"\")","v":""},""]
[{"$f":"IF(B407=$B$3,B407&\"_\"&COUNTIF($B$6:$B407,$B$3),\"\")","v":""},""]
[{"$f":"IF(B408=$B$3,B408&\"_\"&COUNTIF($B$6:$B408,$B$3),\"\")","v":""},""]
[{"$f":"IF(B409=$B$3,B409&\"_\"&COUNTIF($B$6:$B409,$B$3),\"\")","v":""},""]
[{"$f":"IF(B410=$B$3,B410&\"_\"&COUNTIF($B$6:$B410,$B$3),\"\")","v":""},""]
[{"$f":"IF(B411=$B$3,B411&\"_\"&COUNTIF($B$6:$B411,$B$3),\"\")","v":""},""]
[{"$f":"IF(B412=$B$3,B412&\"_\"&COUNTIF($B$6:$B412,$B$3),\"\")","v":""},""]
[{"$f":"IF(B413=$B$3,B413&\"_\"&COUNTIF($B$6:$B413,$B$3),\"\")","v":""},""]
[{"$f":"IF(B414=$B$3,B414&\"_\"&COUNTIF($B$6:$B414,$B$3),\"\")","v":""},""]
[{"$f":"IF(B415=$B$3,B415&\"_\"&COUNTIF($B$6:$B415,$B$3),\"\")","v":""},""]
[{"$f":"IF(B416=$B$3,B416&\"_\"&COUNTIF($B$6:$B416,$B$3),\"\")","v":""},""]
[{"$f":"IF(B417=$B$3,B417&\"_\"&COUNTIF($B$6:$B417,$B$3),\"\")","v":""},""]
[{"$f":"IF(B418=$B$3,B418&\"_\"&COUNTIF($B$6:$B418,$B$3),\"\")","v":""},""]
[{"$f":"IF(B419=$B$3,B419&\"_\"&COUNTIF($B$6:$B419,$B$3),\"\")","v":""},""]
[{"$f":"IF(B420=$B$3,B420&\"_\"&COUNTIF($B$6:$B420,$B$3),\"\")","v":""},""]
[{"$f":"IF(B421=$B$3,B421&\"_\"&COUNTIF($B$6:$B421,$B$3),\"\")","v":""},""]
[{"$f":"IF(B422=$B$3,B422&\"_\"&COUNTIF($B$6:$B422,$B$3),\"\")","v":""},""]
[{"$f":"IF(B423=$B$3,B423&\"_\"&COUNTIF($B$6:$B423,$B$3),\"\")","v":""},""]
[{"$f":"IF(B424=$B$3,B424&\"_\"&COUNTIF($B$6:$B424,$B$3),\"\")","v":""},""]
[{"$f":"IF(B425=$B$3,B425&\"_\"&COUNTIF($B$6:$B425,$B$3),\"\")","v":""},""]
[{"$f":"IF(B426=$B$3,B426&\"_\"&COUNTIF($B$6:$B426,$B$3),\"\")","v":""},""]
[{"$f":"IF(B427=$B$3,B427&\"_\"&COUNTIF($B$6:$B427,$B$3),\"\")","v":""},""]
[{"$f":"IF(B428=$B$3,B428&\"_\"&COUNTIF($B$6:$B428,$B$3),\"\")","v":""},""]
[{"$f":"IF(B429=$B$3,B429&\"_\"&COUNTIF($B$6:$B429,$B$3),\"\")","v":""},""]
[{"$f":"IF(B430=$B$3,B430&\"_\"&COUNTIF($B$6:$B430,$B$3),\"\")","v":""},""]
[{"$f":"IF(B431=$B$3,B431&\"_\"&COUNTIF($B$6:$B431,$B$3),\"\")","v":""},""]
[{"$f":"IF(B432=$B$3,B432&\"_\"&COUNTIF($B$6:$B432,$B$3),\"\")","v":""},""]
[{"$f":"IF(B433=$B$3,B433&\"_\"&COUNTIF($B$6:$B433,$B$3),\"\")","v":""},""]
[{"$f":"IF(B434=$B$3,B434&\"_\"&COUNTIF($B$6:$B434,$B$3),\"\")","v":""},""]
[{"$f":"IF(B435=$B$3,B435&\"_\"&COUNTIF($B$6:$B435,$B$3),\"\")","v":""},""]
[{"$f":"IF(B436=$B$3,B436&\"_\"&COUNTIF($B$6:$B436,$B$3),\"\")","v":""},""]
[{"$f":"IF(B437=$B$3,B437&\"_\"&COUNTIF($B$6:$B437,$B$3),\"\")","v":""},""]
[{"$f":"IF(B438=$B$3,B438&\"_\"&COUNTIF($B$6:$B438,$B$3),\"\")","v":""},""]
[{"$f":"IF(B439=$B$3,B439&\"_\"&COUNTIF($B$6:$B439,$B$3),\"\")","v":""},""]
[{"$f":"IF(B440=$B$3,B440&\"_\"&COUNTIF($B$6:$B440,$B$3),\"\")","v":""},""]
[{"$f":"IF(B441=$B$3,B441&\"_\"&COUNTIF($B$6:$B441,$B$3),\"\")","v":""},""]
[{"$f":"IF(B442=$B$3,B442&\"_\"&COUNTIF($B$6:$B442,$B$3),\"\")","v":""},""]
[{"$f":"IF(B443=$B$3,B443&\"_\"&COUNTIF($B$6:$B443,$B$3),\"\")","v":""},""]
[{"$f":"IF(B444=$B$3,B444&\"_\"&COUNTIF($B$6:$B444,$B$3),\"\")","v":""},""]
[{"$f":"IF(B445=$B$3,B445&\"_\"&COUNTIF($B$6:$B445,$B$3),\"\")","v":""},""]
[{"$f":"IF(B446=$B$3,B446&\"_\"&COUNTIF($B$6:$B446,$B$3),\"\")","v":""},""]
[{"$f":"IF(B447=$B$3,B447&\"_\"&COUNTIF($B$6:$B447,$B$3),\"\")","v":""},""]
[{"$f":"IF(B448=$B$3,B448&\"_\"&COUNTIF($B$6:$B448,$B$3),\"\")","v":""},""]
[{"$f":"IF(B449=$B$3,B449&\"_\"&COUNTIF($B$6:$B449,$B$3),\"\")","v":""},""]
[{"$f":"IF(B450=$B$3,B450&\"_\"&COUNTIF($B$6:$B450,$B$3),\"\")","v":""},""]
[{"$f":"IF(B451=$B$3,B451&\"_\"&COUNTIF($B$6:$B451,$B$3),\"\")","v":""},""]
[{"$f":"IF(B452=$B$3,B452&\"_\"&COUNTIF($B$6:$B452,$B$3),\"\")","v":""},""]
[{"$f":"IF(B453=$B$3,B453&\"_\"&COUNTIF($B$6:$B453,$B$3),\"\")","v":""},""]
[{"$f":"IF(B454=$B$3,B454&\"_\"&COUNTIF($B$6:$B454,$B$3),\"\")","v":""},""]
[{"$f":"IF(B455=$B$3,B455&\"_\"&COUNTIF($B$6:$B455,$B$3),\"\")","v":""},{"$f":"IF(C455=\"\",\"\",\"A porter seul\")","v":""}]
[{"$f":"IF(B456=$B$3,B456&\"_\"&COUNTIF($B$6:$B456,$B$3),\"\")","v":""},""]
[{"$f":"IF(B457=$B$3,B457&\"_\"&COUNTIF($B$6:$B457,$B$3),\"\")","v":""},""]
[{"$f":"IF(B458=$B$3,B458&\"_\"&COUNTIF($B$6:$B458,$B$3),\"\")","v":""},""]
[{"$f":"IF(B459=$B$3,B459&\"_\"&COUNTIF($B$6:$B459,$B$3),\"\")","v":""},""]
[{"$f":"IF(B460=$B$3,B460&\"_\"&COUNTIF($B$6:$B460,$B$3),\"\")","v":""},""]
[{"$f":"IF(B461=$B$3,B461&\"_\"&COUNTIF($B$6:$B461,$B$3),\"\")","v":""},""]
[{"$f":"IF(B462=$B$3,B462&\"_\"&COUNTIF($B$6:$B462,$B$3),\"\")","v":""},""]
[{"$f":"IF(B463=$B$3,B463&\"_\"&COUNTIF($B$6:$B463,$B$3),\"\")","v":""},""]
[{"$f":"IF(B464=$B$3,B464&\"_\"&COUNTIF($B$6:$B464,$B$3),\"\")","v":""},""]
[{"$f":"IF(B465=$B$3,B465&\"_\"&COUNTIF($B$6:$B465,$B$3),\"\")","v":""},""]
[{"$f":"IF(B466=$B$3,B466&\"_\"&COUNTIF($B$6:$B466,$B$3),\"\")","v":""},""]
[{"$f":"IF(B467=$B$3,B467&\"_\"&COUNTIF($B$6:$B467,$B$3),\"\")","v":""},""]
[{"$f":"IF(B468=$B$3,B468&\"_\"&COUNTIF($B$6:$B468,$B$3),\"\")","v":""},""]
[{"$f":"IF(B469=$B$3,B469&\"_\"&COUNTIF($B$6:$B469,$B$3),\"\")","v":""},""]
[{"$f":"IF(B470=$B$3,B470&\"_\"&COUNTIF($B$6:$B470,$B$3),\"\")","v":""},""]
[{"$f":"IF(B471=$B$3,B471&\"_\"&COUNTIF($B$6:$B471,$B$3),\"\")","v":""},""]
[{"$f":"IF(B472=$B$3,B472&\"_\"&COUNTIF($B$6:$B472,$B$3),\"\")","v":""},""]
[{"$f":"IF(B473=$B$3,B473&\"_\"&COUNTIF($B$6:$B473,$B$3),\"\")","v":""},""]
[{"$f":"IF(B474=$B$3,B474&\"_\"&COUNTIF($B$6:$B474,$B$3),\"\")","v":""},""]
[{"$f":"IF(B475=$B$3,B475&\"_\"&COUNTIF($B$6:$B475,$B$3),\"\")","v":""},""]
[{"$f":"IF(B476=$B$3,B476&\"_\"&COUNTIF($B$6:$B476,$B$3),\"\")","v":""},""]
[{"$f":"IF(B477=$B$3,B477&\"_\"&COUNTIF($B$6:$B477,$B$3),\"\")","v":""},""]
[{"$f":"IF(B478=$B$3,B478&\"_\"&COUNTIF($B$6:$B478,$B$3),\"\")","v":""},""]
[{"$f":"IF(B479=$B$3,B479&\"_\"&COUNTIF($B$6:$B479,$B$3),\"\")","v":""},""]
[{"$f":"IF(B480=$B$3,B480&\"_\"&COUNTIF($B$6:$B480,$B$3),\"\")","v":""},""]
[{"$f":"IF(B481=$B$3,B481&\"_\"&COUNTIF($B$6:$B481,$B$3),\"\")","v":""},""]
[{"$f":"IF(B482=$B$3,B482&\"_\"&COUNTIF($B$6:$B482,$B$3),\"\")","v":""},""]
[{"$f":"IF(B483=$B$3,B483&\"_\"&COUNTIF($B$6:$B483,$B$3),\"\")","v":""},""]
[{"$f":"IF(B484=$B$3,B484&\"_\"&COUNTIF($B$6:$B484,$B$3),\"\")","v":""},""]
[{"$f":"IF(B485=$B$3,B485&\"_\"&COUNTIF($B$6:$B485,$B$3),\"\")","v":""},""]
[{"$f":"IF(B486=$B$3,B486&\"_\"&COUNTIF($B$6:$B486,$B$3),\"\")","v":""},""]
[{"$f":"IF(B487=$B$3,B487&\"_\"&COUNTIF($B$6:$B487,$B$3),\"\")","v":""},""]
[{"$f":"IF(B488=$B$3,B488&\"_\"&COUNTIF($B$6:$B488,$B$3),\"\")","v":""},""]
[{"$f":"IF(B489=$B$3,B489&\"_\"&COUNTIF($B$6:$B489,$B$3),\"\")","v":""},""]
[{"$f":"IF(B490=$B$3,B490&\"_\"&COUNTIF($B$6:$B490,$B$3),\"\")","v":""},""]
[{"$f":"IF(B491=$B$3,B491&\"_\"&COUNTIF($B$6:$B491,$B$3),\"\")","v":""},""]
[{"$f":"IF(B492=$B$3,B492&\"_\"&COUNTIF($B$6:$B492,$B$3),\"\")","v":""},""]
[{"$f":"IF(B493=$B$3,B493&\"_\"&COUNTIF($B$6:$B493,$B$3),\"\")","v":""},""]
[{"$f":"IF(B494=$B$3,B494&\"_\"&COUNTIF($B$6:$B494,$B$3),\"\")","v":""},""]
[{"$f":"IF(B495=$B$3,B495&\"_\"&COUNTIF($B$6:$B495,$B$3),\"\")","v":""},""]
[{"$f":"IF(B496=$B$3,B496&\"_\"&COUNTIF($B$6:$B496,$B$3),\"\")","v":""},""]
[{"$f":"IF(B497=$B$3,B497&\"_\"&COUNTIF($B$6:$B497,$B$3),\"\")","v":""},""]
[{"$f":"IF(B498=$B$3,B498&\"_\"&COUNTIF($B$6:$B498,$B$3),\"\")","v":""},""]
[{"$f":"IF(B499=$B$3,B499&\"_\"&COUNTIF($B$6:$B499,$B$3),\"\")","v":""},""]
[{"$f":"IF(B500=$B$3,B500&\"_\"&COUNTIF($B$6:$B500,$B$3),\"\")","v":""},""]
[{"$f":"IF(B501=$B$3,B501&\"_\"&COUNTIF($B$6:$B501,$B$3),\"\")","v":""},""]
[{"$f":"IF(B502=$B$3,B502&\"_\"&COUNTIF($B$6:$B502,$B$3),\"\")","v":""},""]
[{"$f":"IF(B503=$B$3,B503&\"_\"&COUNTIF($B$6:$B503,$B$3),\"\")","v":""},""]
[{"$f":"IF(B504=$B$3,B504&\"_\"&COUNTIF($B$6:$B504,$B$3),\"\")","v":""},""]
[{"$f":"IF(B505=$B$3,B505&\"_\"&COUNTIF($B$6:$B505,$B$3),\"\")","v":""},""]
[{"$f":"IF(B506=$B$3,B506&\"_\"&COUNTIF($B$6:$B506,$B$3),\"\")","v":""},""]
[{"$f":"IF(B507=$B$3,B507&\"_\"&COUNTIF($B$6:$B507,$B$3),\"\")","v":""},""]
[{"$f":"IF(B508=$B$3,B508&\"_\"&COUNTIF($B$6:$B508,$B$3),\"\")","v":""},""]
[{"$f":"IF(B509=$B$3,B509&\"_\"&COUNTIF($B$6:$B509,$B$3),\"\")","v":""},""]
[{"$f":"IF(B510=$B$3,B510&\"_\"&COUNTIF($B$6:$B510,$B$3),\"\")","v":""},""]
[{"$f":"IF(B511=$B$3,B511&\"_\"&COUNTIF($B$6:$B511,$B$3),\"\")","v":""},""]
[{"$f":"IF(B512=$B$3,B512&\"_\"&COUNTIF($B$6:$B512,$B$3),\"\")","v":""},""]
[{"$f":"IF(B513=$B$3,B513&\"_\"&COUNTIF($B$6:$B513,$B$3),\"\")","v":""},""]
[{"$f":"IF(B514=$B$3,B514&\"_\"&COUNTIF($B$6:$B514,$B$3),\"\")","v":""},""]
[{"$f":"IF(B515=$B$3,B515&\"_\"&COUNTIF($B$6:$B515,$B$3),\"\")","v":""},""]
[{"$f":"IF(B516=$B$3,B516&\"_\"&COUNTIF($B$6:$B516,$B$3),\"\")","v":""},""]
[{"$f":"IF(B517=$B$3,B517&\"_\"&COUNTIF($B$6:$B517,$B$3),\"\")","v":""},""]
[{"$f":"IF(B518=$B$3,B518&\"_\"&COUNTIF($B$6:$B518,$B$3),\"\")","v":""},""]
[{"$f":"IF(B519=$B$3,B519&\"_\"&COUNTIF($B$6:$B519,$B$3),\"\")","v":""},{"$f":"IF(C519=\"\",\"\",\"A porter seul\")","v":""}]
[{"$f":"IF(B520=$B$3,B520&\"_\"&COUNTIF($B$6:$B520,$B$3),\"\")","v":""},""]
[{"$f":"IF(B521=$B$3,B521&\"_\"&COUNTIF($B$6:$B521,$B$3),\"\")","v":""},""]
[{"$f":"IF(B522=$B$3,B522&\"_\"&COUNTIF($B$6:$B522,$B$3),\"\")","v":""},""]
[{"$f":"IF(B523=$B$3,B523&\"_\"&COUNTIF($B$6:$B523,$B$3),\"\")","v":""},""]
[{"$f":"IF(B524=$B$3,B524&\"_\"&COUNTIF($B$6:$B524,$B$3),\"\")","v":""},""]
[{"$f":"IF(B525=$B$3,B525&\"_\"&COUNTIF($B$6:$B525,$B$3),\"\")","v":""},""]
[{"$f":"IF(B526=$B$3,B526&\"_\"&COUNTIF($B$6:$B526,$B$3),\"\")","v":""},""]
[{"$f":"IF(B527=$B$3,B527&\"_\"&COUNTIF($B$6:$B527,$B$3),\"\")","v":""},""]
[{"$f":"IF(B528=$B$3,B528&\"_\"&COUNTIF($B$6:$B528,$B$3),\"\")","v":""},""]
[{"$f":"IF(B529=$B$3,B529&\"_\"&COUNTIF($B$6:$B529,$B$3),\"\")","v":""},""]
[{"$f":"IF(B530=$B$3,B530&\"_\"&COUNTIF($B$6:$B530,$B$3),\"\")","v":""},""]
[{"$f":"IF(B531=$B$3,B531&\"_\"&COUNTIF($B$6:$B531,$B$3),\"\")","v":""},""]
[{"$f":"IF(B532=$B$3,B532&\"_\"&COUNTIF($B$6:$B532,$B$3),\"\")","v":""},""]
[{"$f":"IF(B533=$B$3,B533&\"_\"&COUNTIF($B$6:$B533,$B$3),\"\")","v":""},""]
[{"$f":"IF(B534=$B$3,B534&\"_\"&COUNTIF($B$6:$B534,$B$3),\"\")","v":""},""]
[{"$f":"IF(B535=$B$3,B535&\"_\"&COUNTIF($B$6:$B535,$B$3),\"\")","v":""},""]
[{"$f":"IF(B536=$B$3,B536&\"_\"&COUNTIF($B$6:$B536,$B$3),\"\")","v":""},""]
[{"$f":"IF(B537=$B$3,B537&\"_\"&COUNTIF($B$6:$B537,$B$3),\"\")","v":""},""]
[{"$f":"IF(B538=$B$3,B538&\"_\"&COUNTIF($B$6:$B538,$B$3),\"\")","v":""},""]
[{"$f":"IF(B539=$B$3,B539&\"_\"&COUNTIF($B$6:$B539,$B$3),\"\")","v":""},""]
[{"$f":"IF(B540=$B$3,B540&\"_\"&COUNTIF($B$6:$B540,$B$3),\"\")","v":""},""]
[{"$f":"IF(B541=$B$3,B541&\"_\"&COUNTIF($B$6:$B541,$B$3),\"\")","v":""},""]
[{"$f":"IF(B542=$B$3,B542&\"_\"&COUNTIF($B$6:$B542,$B$3),\"\")","v":""},""]
[{"$f":"IF(B543=$B$3,B543&\"_\"&COUNTIF($B$6:$B543,$B$3),\"\")","v":""},""]
[{"$f":"IF(B544=$B$3,B544&\"_\"&COUNTIF($B$6:$B544,$B$3),\"\")","v":""},""]
[{"$f":"IF(B545=$B$3,B545&\"_\"&COUNTIF($B$6:$B545,$B$3),\"\")","v":""},""]
[{"$f":"IF(B546=$B$3,B546&\"_\"&COUNTIF($B$6:$B546,$B$3),\"\")","v":""},""]
[{"$f":"IF(B547=$B$3,B547&\"_\"&COUNTIF($B$6:$B547,$B$3),\"\")","v":""},""]
[{"$f":"IF(B548=$B$3,B548&\"_\"&COUNTIF($B$6:$B548,$B$3),\"\")","v":""},""]
[{"$f":"IF(B549=$B$3,B549&\"_\"&COUNTIF($B$6:$B549,$B$3),\"\")","v":""},""]
[{"$f":"IF(B550=$B$3,B550&\"_\"&COUNTIF($B$6:$B550,$B$3),\"\")","v":""},""]
[{"$f":"IF(B551=$B$3,B551&\"_\"&COUNTIF($B$6:$B551,$B$3),\"\")","v":""},""]
[{"$f":"IF(B552=$B$3,B552&\"_\"&COUNTIF($B$6:$B552,$B$3),\"\")","v":""},""]
[{"$f":"IF(B553=$B$3,B553&\"_\"&COUNTIF($B$6:$B553,$B$3),\"\")","v":""},""]
[{"$f":"IF(B554=$B$3,B554&\"_\"&COUNTIF($B$6:$B554,$B$3),\"\")","v":""},""]
[{"$f":"IF(B555=$B$3,B555&\"_\"&COUNTIF($B$6:$B555,$B$3),\"\")","v":""},""]
[{"$f":"IF(B556=$B$3,B556&\"_\"&COUNTIF($B$6:$B556,$B$3),\"\")","v":""},""]
[{"$f":"IF(B557=$B$3,B557&\"_\"&COUNTIF($B$6:$B557,$B$3),\"\")","v":""},""]
[{"$f":"IF(B558=$B$3,B558&\"_\"&COUNTIF($B$6:$B558,$B$3),\"\")","v":""},""]
[{"$f":"IF(B559=$B$3,B559&\"_\"&COUNTIF($B$6:$B559,$B$3),\"\")","v":""},""]
[{"$f":"IF(B560=$B$3,B560&\"_\"&COUNTIF($B$6:$B560,$B$3),\"\")","v":""},""]
[{"$f":"IF(B561=$B$3,B561&\"_\"&COUNTIF($B$6:$B561,$B$3),\"\")","v":""},""]
[{"$f":"IF(B562=$B$3,B562&\"_\"&COUNTIF($B$6:$B562,$B$3),\"\")","v":""},""]
[{"$f":"IF(B563=$B$3,B563&\"_\"&COUNTIF($B$6:$B563,$B$3),\"\")","v":""},""]
[{"$f":"IF(B564=$B$3,B564&\"_\"&COUNTIF($B$6:$B564,$B$3),\"\")","v":""},""]
[{"$f":"IF(B565=$B$3,B565&\"_\"&COUNTIF($B$6:$B565,$B$3),\"\")","v":""},""]
[{"$f":"IF(B566=$B$3,B566&\"_\"&COUNTIF($B$6:$B566,$B$3),\"\")","v":""},""]
[{"$f":"IF(B567=$B$3,B567&\"_\"&COUNTIF($B$6:$B567,$B$3),\"\")","v":""},""]
[{"$f":"IF(B568=$B$3,B568&\"_\"&COUNTIF($B$6:$B568,$B$3),\"\")","v":""},""]
[{"$f":"IF(B569=$B$3,B569&\"_\"&COUNTIF($B$6:$B569,$B$3),\"\")","v":""},""]
[{"$f":"IF(B570=$B$3,B570&\"_\"&COUNTIF($B$6:$B570,$B$3),\"\")","v":""},""]
[{"$f":"IF(B571=$B$3,B571&\"_\"&COUNTIF($B$6:$B571,$B$3),\"\")","v":""},""]
[{"$f":"IF(B572=$B$3,B572&\"_\"&COUNTIF($B$6:$B572,$B$3),\"\")","v":""},""]
[{"$f":"IF(B573=$B$3,B573&\"_\"&COUNTIF($B$6:$B573,$B$3),\"\")","v":""},""]
[{"$f":"IF(B574=$B$3,B574&\"_\"&COUNTIF($B$6:$B574,$B$3),\"\")","v":""},""]
[{"$f":"IF(B575=$B$3,B575&\"_\"&COUNTIF($B$6:$B575,$B$3),\"\")","v":""},""]
[{"$f":"IF(B576=$B$3,B576&\"_\"&COUNTIF($B$6:$B576,$B$3),\"\")","v":""},""]
[{"$f":"IF(B577=$B$3,B577&\"_\"&COUNTIF($B$6:$B577,$B$3),\"\")","v":""},""]
[{"$f":"IF(B578=$B$3,B578&\"_\"&COUNTIF($B$6:$B578,$B$3),\"\")","v":""},""]
[{"$f":"IF(B579=$B$3,B579&\"_\"&COUNTIF($B$6:$B579,$B$3),\"\")","v":""},""]
[{"$f":"IF(B580=$B$3,B580&\"_\"&COUNTIF($B$6:$B580,$B$3),\"\")","v":""},""]
[{"$f":"IF(B581=$B$3,B581&\"_\"&COUNTIF($B$6:$B581,$B$3),\"\")","v":""},""]
[{"$f":"IF(B582=$B$3,B582&\"_\"&COUNTIF($B$6:$B582,$B$3),\"\")","v":""},""]
[{"$f":"IF(B583=$B$3,B583&\"_\"&COUNTIF($B$6:$B583,$B$3),\"\")","v":""},{"$f":"IF(C583=\"\",\"\",\"A porter seul\")","v":""}]
[{"$f":"IF(B584=$B$3,B584&\"_\"&COUNTIF($B$6:$B584,$B$3),\"\")","v":""},""]
[{"$f":"IF(B585=$B$3,B585&\"_\"&COUNTIF($B$6:$B585,$B$3),\"\")","v":""},""]
[{"$f":"IF(B586=$B$3,B586&\"_\"&COUNTIF($B$6:$B586,$B$3),\"\")","v":""},""]
[{"$f":"IF(B587=$B$3,B587&\"_\"&COUNTIF($B$6:$B587,$B$3),\"\")","v":""},""]
[{"$f":"IF(B588=$B$3,B588&\"_\"&COUNTIF($B$6:$B588,$B$3),\"\")","v":""},""]
[{"$f":"IF(B589=$B$3,B589&\"_\"&COUNTIF($B$6:$B589,$B$3),\"\")","v":""},""]
[{"$f":"IF(B590=$B$3,B590&\"_\"&COUNTIF($B$6:$B590,$B$3),\"\")","v":""},""]
[{"$f":"IF(B591=$B$3,B591&\"_\"&COUNTIF($B$6:$B591,$B$3),\"\")","v":""},""]
[{"$f":"IF(B592=$B$3,B592&\"_\"&COUNTIF($B$6:$B592,$B$3),\"\")","v":""},""]
[{"$f":"IF(B593=$B$3,B593&\"_\"&COUNTIF($B$6:$B593,$B$3),\"\")","v":""},""]
[{"$f":"IF(B594=$B$3,B594&\"_\"&COUNTIF($B$6:$B594,$B$3),\"\")","v":""},""]
[{"$f":"IF(B595=$B$3,B595&\"_\"&COUNTIF($B$6:$B595,$B$3),\"\")","v":""},""]
[{"$f":"IF(B596=$B$3,B596&\"_\"&COUNTIF($B$6:$B596,$B$3),\"\")","v":""},""]
[{"$f":"IF(B597=$B$3,B597&\"_\"&COUNTIF($B$6:$B597,$B$3),\"\")","v":""},""]
[{"$f":"IF(B598=$B$3,B598&\"_\"&COUNTIF($B$6:$B598,$B$3),\"\")","v":""},""]
[{"$f":"IF(B599=$B$3,B599&\"_\"&COUNTIF($B$6:$B599,$B$3),\"\")","v":""},""]
[{"$f":"IF(B600=$B$3,B600&\"_\"&COUNTIF($B$6:$B600,$B$3),\"\")","v":""},""]
[{"$f":"IF(B601=$B$3,B601&\"_\"&COUNTIF($B$6:$B601,$B$3),\"\")","v":""},""]
[{"$f":"IF(B602=$B$3,B602&\"_\"&COUNTIF($B$6:$B602,$B$3),\"\")","v":""},""]
[{"$f":"IF(B603=$B$3,B603&\"_\"&COUNTIF($B$6:$B603,$B$3),\"\")","v":""},""]
[{"$f":"IF(B604=$B$3,B604&\"_\"&COUNTIF($B$6:$B604,$B$3),\"\")","v":""},""]
[{"$f":"IF(B605=$B$3,B605&\"_\"&COUNTIF($B$6:$B605,$B$3),\"\")","v":""},""]
[{"$f":"IF(B606=$B$3,B606&\"_\"&COUNTIF($B$6:$B606,$B$3),\"\")","v":""},""]
[{"$f":"IF(B607=$B$3,B607&\"_\"&COUNTIF($B$6:$B607,$B$3),\"\")","v":""},""]
[{"$f":"IF(B608=$B$3,B608&\"_\"&COUNTIF($B$6:$B608,$B$3),\"\")","v":""},""]
[{"$f":"IF(B609=$B$3,B609&\"_\"&COUNTIF($B$6:$B609,$B$3),\"\")","v":""},""]
[{"$f":"IF(B610=$B$3,B610&\"_\"&COUNTIF($B$6:$B610,$B$3),\"\")","v":""},""]
[{"$f":"IF(B611=$B$3,B611&\"_\"&COUNTIF($B$6:$B611,$B$3),\"\")","v":""},""]
[{"$f":"IF(B612=$B$3,B612&\"_\"&COUNTIF($B$6:$B612,$B$3),\"\")","v":""},""]
[{"$f":"IF(B613=$B$3,B613&\"_\"&COUNTIF($B$6:$B613,$B$3),\"\")","v":""},""]
[{"$f":"IF(B614=$B$3,B614&\"_\"&COUNTIF($B$6:$B614,$B$3),\"\")","v":""},""]
[{"$f":"IF(B615=$B$3,B615&\"_\"&COUNTIF($B$6:$B615,$B$3),\"\")","v":""},""]
[{"$f":"IF(B616=$B$3,B616&\"_\"&COUNTIF($B$6:$B616,$B$3),\"\")","v":""},""]
[{"$f":"IF(B617=$B$3,B617&\"_\"&COUNTIF($B$6:$B617,$B$3),\"\")","v":""},""]
[{"$f":"IF(B618=$B$3,B618&\"_\"&COUNTIF($B$6:$B618,$B$3),\"\")","v":""},""]
[{"$f":"IF(B619=$B$3,B619&\"_\"&COUNTIF($B$6:$B619,$B$3),\"\")","v":""},""]
[{"$f":"IF(B620=$B$3,B620&\"_\"&COUNTIF($B$6:$B620,$B$3),\"\")","v":""},""]
[{"$f":"IF(B621=$B$3,B621&\"_\"&COUNTIF($B$6:$B621,$B$3),\"\")","v":""},""]
[{"$f":"IF(B622=$B$3,B622&\"_\"&COUNTIF($B$6:$B622,$B$3),\"\")","v":""},""]
[{"$f":"IF(B623=$B$3,B623&\"_\"&COUNTIF($B$6:$B623,$B$3),\"\")","v":""},""]
[{"$f":"IF(B624=$B$3,B624&\"_\"&COUNTIF($B$6:$B624,$B$3),\"\")","v":""},""]
[{"$f":"IF(B625=$B$3,B625&\"_\"&COUNTIF($B$6:$B625,$B$3),\"\")","v":""},""]
[{"$f":"IF(B626=$B$3,B626&\"_\"&COUNTIF($B$6:$B626,$B$3),\"\")","v":""},""]
[{"$f":"IF(B627=$B$3,B627&\"_\"&COUNTIF($B$6:$B627,$B$3),\"\")","v":""},""]
[{"$f":"IF(B628=$B$3,B628&\"_\"&COUNTIF($B$6:$B628,$B$3),\"\")","v":""},""]
[{"$f":"IF(B629=$B$3,B629&\"_\"&COUNTIF($B$6:$B629,$B$3),\"\")","v":""},""]
[{"$f":"IF(B630=$B$3,B630&\"_\"&COUNTIF($B$6:$B630,$B$3),\"\")","v":""},""]
[{"$f":"IF(B631=$B$3,B631&\"_\"&COUNTIF($B$6:$B631,$B$3),\"\")","v":""},""]
[{"$f":"IF(B632=$B$3,B632&\"_\"&COUNTIF($B$6:$B632,$B$3),\"\")","v":""},""]
[{"$f":"IF(B633=$B$3,B633&\"_\"&COUNTIF($B$6:$B633,$B$3),\"\")","v":""},""]
[{"$f":"IF(B634=$B$3,B634&\"_\"&COUNTIF($B$6:$B634,$B$3),\"\")","v":""},""]
[{"$f":"IF(B635=$B$3,B635&\"_\"&COUNTIF($B$6:$B635,$B$3),\"\")","v":""},""]
[{"$f":"IF(B636=$B$3,B636&\"_\"&COUNTIF($B$6:$B636,$B$3),\"\")","v":""},""]
[{"$f":"IF(B637=$B$3,B637&\"_\"&COUNTIF($B$6:$B637,$B$3),\"\")","v":""},""]
[{"$f":"IF(B638=$B$3,B638&\"_\"&COUNTIF($B$6:$B638,$B$3),\"\")","v":""},""]
[{"$f":"IF(B639=$B$3,B639&\"_\"&COUNTIF($B$6:$B639,$B$3),\"\")","v":""},""]
[{"$f":"IF(B640=$B$3,B640&\"_\"&COUNTIF($B$6:$B640,$B$3),\"\")","v":""},""]
[{"$f":"IF(B641=$B$3,B641&\"_\"&COUNTIF($B$6:$B641,$B$3),\"\")","v":""},""]
[{"$f":"IF(B642=$B$3,B642&\"_\"&COUNTIF($B$6:$B642,$B$3),\"\")","v":""},""]
[{"$f":"IF(B643=$B$3,B643&\"_\"&COUNTIF($B$6:$B643,$B$3),\"\")","v":""},""]
[{"$f":"IF(B644=$B$3,B644&\"_\"&COUNTIF($B$6:$B644,$B$3),\"\")","v":""},""]
[{"$f":"IF(B645=$B$3,B645&\"_\"&COUNTIF($B$6:$B645,$B$3),\"\")","v":""},""]
[{"$f":"IF(B646=$B$3,B646&\"_\"&COUNTIF($B$6:$B646,$B$3),\"\")","v":""},""]
[{"$f":"IF(B647=$B$3,B647&\"_\"&COUNTIF($B$6:$B647,$B$3),\"\")","v":""},{"$f":"IF(C647=\"\",\"\",\"A porter seul\")","v":""}]
[{"$f":"IF(B648=$B$3,B648&\"_\"&COUNTIF($B$6:$B648,$B$3),\"\")","v":""},""]
[{"$f":"IF(B649=$B$3,B649&\"_\"&COUNTIF($B$6:$B649,$B$3),\"\")","v":""},""]
[{"$f":"IF(B650=$B$3,B650&\"_\"&COUNTIF($B$6:$B650,$B$3),\"\")","v":""},""]
[{"$f":"IF(B651=$B$3,B651&\"_\"&COUNTIF($B$6:$B651,$B$3),\"\")","v":""},""]
[{"$f":"IF(B652=$B$3,B652&\"_\"&COUNTIF($B$6:$B652,$B$3),\"\")","v":""},""]
[{"$f":"IF(B653=$B$3,B653&\"_\"&COUNTIF($B$6:$B653,$B$3),\"\")","v":""},""]
[{"$f":"IF(B654=$B$3,B654&\"_\"&COUNTIF($B$6:$B654,$B$3),\"\")","v":""},""]
[{"$f":"IF(B655=$B$3,B655&\"_\"&COUNTIF($B$6:$B655,$B$3),\"\")","v":""},""]
[{"$f":"IF(B656=$B$3,B656&\"_\"&COUNTIF($B$6:$B656,$B$3),\"\")","v":""},""]
[{"$f":"IF(B657=$B$3,B657&\"_\"&COUNTIF($B$6:$B657,$B$3),\"\")","v":""},""]
[{"$f":"IF(B658=$B$3,B658&\"_\"&COUNTIF($B$6:$B658,$B$3),\"\")","v":""},""]
[{"$f":"IF(B659=$B$3,B659&\"_\"&COUNTIF($B$6:$B659,$B$3),\"\")","v":""},""]
[{"$f":"IF(B660=$B$3,B660&\"_\"&COUNTIF($B$6:$B660,$B$3),\"\")","v":""},""]
[{"$f":"IF(B661=$B$3,B661&\"_\"&COUNTIF($B$6:$B661,$B$3),\"\")","v":""},""]
[{"$f":"IF(B662=$B$3,B662&\"_\"&COUNTIF($B$6:$B662,$B$3),\"\")","v":""},""]
[{"$f":"IF(B663=$B$3,B663&\"_\"&COUNTIF($B$6:$B663,$B$3),\"\")","v":""},""]
[{"$f":"IF(B664=$B$3,B664&\"_\"&COUNTIF($B$6:$B664,$B$3),\"\")","v":""},""]
[{"$f":"IF(B665=$B$3,B665&\"_\"&COUNTIF($B$6:$B665,$B$3),\"\")","v":""},""]
[{"$f":"IF(B666=$B$3,B666&\"_\"&COUNTIF($B$6:$B666,$B$3),\"\")","v":""},""]
[{"$f":"IF(B667=$B$3,B667&\"_\"&COUNTIF($B$6:$B667,$B$3),\"\")","v":""},""]
[{"$f":"IF(B668=$B$3,B668&\"_\"&COUNTIF($B$6:$B668,$B$3),\"\")","v":""},""]
[{"$f":"IF(B669=$B$3,B669&\"_\"&COUNTIF($B$6:$B669,$B$3),\"\")","v":""},""]
[{"$f":"IF(B670=$B$3,B670&\"_\"&COUNTIF($B$6:$B670,$B$3),\"\")","v":""},""]
[{"$f":"IF(B671=$B$3,B671&\"_\"&COUNTIF($B$6:$B671,$B$3),\"\")","v":""},""]
[{"$f":"IF(B672=$B$3,B672&\"_\"&COUNTIF($B$6:$B672,$B$3),\"\")","v":""},""]
[{"$f":"IF(B673=$B$3,B673&\"_\"&COUNTIF($B$6:$B673,$B$3),\"\")","v":""},""]
[{"$f":"IF(B674=$B$3,B674&\"_\"&COUNTIF($B$6:$B674,$B$3),\"\")","v":""},""]
[{"$f":"IF(B675=$B$3,B675&\"_\"&COUNTIF($B$6:$B675,$B$3),\"\")","v":""},""]
[{"$f":"IF(B676=$B$3,B676&\"_\"&COUNTIF($B$6:$B676,$B$3),\"\")","v":""},""]
[{"$f":"IF(B677=$B$3,B677&\"_\"&COUNTIF($B$6:$B677,$B$3),\"\")","v":""},""]
[{"$f":"IF(B678=$B$3,B678&\"_\"&COUNTIF($B$6:$B678,$B$3),\"\")","v":""},""]
[{"$f":"IF(B679=$B$3,B679&\"_\"&COUNTIF($B$6:$B679,$B$3),\"\")","v":""},""]

{"sheet":"A partager","index":9,"n_rows":738,"n_cols":19,"rows_kept":738,"cut":false,"hidden":false,"merged":[[2,2,2,3],[2,4,2,8]]}
[null,null,"Tableau 2 = synthèse de sous-actions à partager :"]
[]
[null,null,"Rappel de votre objectif :",null,{"$f":"+'Objectif SMARTER'!$A$6","v":"Je veux…"}]
[null,"A partager",null,null,null,null,null,null,null,null,null,null,"cf. onglet \"Etapes vers objectif\""]
["Pour formules :","Pour formules :","Costume n°","Nom du rôle-costume","Actions","Sous-actions","Pourquoi réaliser seul cette sous-action ?","Pourquoi partager (scinder) cette sous-action en plusieurs sous-sous-actions ?\nPourquoi déléguer une partie de cette sous-action ?","Pourquoi cette sous-action est-elle utile/ objectif ?\nQuels sont ses bénéfices / objectif ?","Avec qui vous devez partager cette sous-action ? (Membres de votre famille, amis, collègues, supérieurs, etc.)\nEt que doit(vent) faire précisément cette/ces personne(s) ?","Quelle sous-sous-action précise vous devez réaliser seul ?","Critère de réalisation cette sous-action.\n(rendu final visible et mesurable / objectif)","Au cours de quelle(s) étape(s) / votre objectif devez-vous réaliser cette sous-action ?","Quand devez-vous réaliser cette sous-action ?\n(contextes, horaires précis, régularité ou pas, moments de la journée, période(s) de l'année, etc.)","Où devez-vous réaliser cette sous-action ?\n(lieux précis)","Avec qui devez-vous réaliser cette sous-action ?\n(personnes précises)","Comment devez-vous réaliser cette sous-action ? \n(niveau d'énergie requis, humeur, qualité(s), force(s), ou talent(s) requis, etc.)","Combien d’heures min./ max. consacrer à cette sous-action par jour/ semaine/ mois/ année ?","Suite à donner à cette sous-action ?\n(durée prévue d’utilisation, date limite de réalisation, conséquences long terme, etc.)"]
[{"$f":"IF(B6=$B$4,B6&\"_\"&COUNTIF($B$6:$B6,$B$4),\"\")","v":"A partager_1"},{"$f":"IF(C6=\"\",\"\",\"A partager\")","v":"A partager"},1,"Leader","Répondre aux mails & aux appels importants","Répondre aux clients internes",null,"Car c'est la meilleure manière de…","Car il faut…","Je dois partager cette sous-action avec Mme J et M. K.","Je dois faire…","Avoir obtenu x fois…","Les étapes 1 et 4","De 8h00 à 9h00.","Au bureau à VILLE, ou dans mon bureau chez moi.","Avec M. O et M. Z.","Niveau d'énergie minimum = 6/10, qualités requises = , humeur = 7/10 min.","Min. 2h/semaine.","A revoir après l'étape 4 si elle sera toujours utile."]
[{"$f":"IF(B7=$B$4,B7&\"_\"&COUNTIF($B$6:$B7,$B$4),\"\")","v":"A partager_2"},{"$f":"IF(C7=\"\",\"\",\"A partager\")","v":"A partager"},1,"Leader","Répondre aux mails & aux appels importants","Répondre à la Presse",null,null,"Parce que…","Je dois partager cette sous-action avec Mme O.","Je dois réaliser…","Quand le résultat X est atteint.","L'étape 4","Le matin, avant 12h00,","Au bureau à VILLE, ou dans mon bureau chez moi.","Avec l'ensemble de l'équipe X",null,"Max. 4h/jour.","Prévoir une autre solution éventuellement quand je serai à l'étape 5."]
[{"$f":"IF(B8=$B$4,B8&\"_\"&COUNTIF($B$6:$B8,$B$4),\"\")","v":"A partager_3"},"A partager",1,"Leader","Présenter les résultats de l'entreprise","Anticiper le travail à produire par les équipes",null,null,"Car c'est important de…",null,null,null,"L'étape 2","Le soir à partir de 18h00, et avant 21h00.","Chez moi ou chez M. F.",null,"Humeur = peu importe, qualités =, forces = , niveau d'énergie min. 4/10","Min. 1h/jour.","Sans fin = toujours utile même quand j'aurai 80 ans !"]
[{"$f":"IF(B9=$B$4,B9&\"_\"&COUNTIF($B$6:$B9,$B$4),\"\")","v":"A partager_4"},"A partager",1,"Leader","Présenter les résultats de l'entreprise","A compléter costume 1 Action 2 Sous-action 3",null,null,null,null,null,null,"Toutes les 5 étapes.",null,"Au bureau à VILLE, ou dans mon bureau chez moi.","Avec Mme R, Mme T et M. F",null,"Max. 20h/an"]
[{"$f":"IF(B10=$B$4,B10&\"_\"&COUNTIF($B$6:$B10,$B$4),\"\")","v":"A partager_5"},"A partager",1,"Leader","Présenter les résultats de l'entreprise","A compléter costume 1 Action 2 Sous-action 5"]
[{"$f":"IF(B11=$B$4,B11&\"_\"&COUNTIF($B$6:$B11,$B$4),\"\")","v":"A partager_6"},"A partager",1,"Leader","Définir et valider la vision/stratégie à moyen et à long terme pour l'entreprise. Réflexions et discusssions stratégiques","A compléter costume 1 Action 3 Sous-action 1"]
[{"$f":"IF(B12=$B$4,B12&\"_\"&COUNTIF($B$6:$B12,$B$4),\"\")","v":"A partager_7"},"A partager",1,"Leader","Définir et valider la vision/stratégie à moyen et à long terme pour l'entreprise. Réflexions et discusssions stratégiques","A compléter costume 1 Action 3 Sous-action 2"]
[{"$f":"IF(B13=$B$4,B13&\"_\"&COUNTIF($B$6:$B13,$B$4),\"\")","v":"A partager_8"},"A partager",1,"Leader","Définir et valider la vision/stratégie à moyen et à long terme pour l'entreprise. Réflexions et discusssions stratégiques","A compléter costume 1 Action 3 Sous-action 5"]
[{"$f":"IF(B14=$B$4,B14&\"_\"&COUNTIF($B$6:$B14,$B$4),\"\")","v":"A partager_9"},"A partager",1,"Leader","Gérer des rdv et appeler les clients/partenaires/fournisseurs/ etc.","A compléter costume 1 Action 4 Sous-action 1"]
[{"$f":"IF(B15=$B$4,B15&\"_\"&COUNTIF($B$6:$B15,$B$4),\"\")","v":"A partager_10"},"A partager",1,"Leader","Gérer des rdv et appeler les clients/partenaires/fournisseurs/ etc.","A compléter costume 1 Action 4 Sous-action 4"]
[{"$f":"IF(B16=$B$4,B16&\"_\"&COUNTIF($B$6:$B16,$B$4),\"\")","v":"A partager_11"},"A partager",1,"Leader","M'informer des tendances actuelles et futures qui pourraient impacter l'entreprise + Me former : min. 1 formation /an","A compléter costume 1 Action 5 Sous-action 2"]
[{"$f":"IF(B17=$B$4,B17&\"_\"&COUNTIF($B$6:$B17,$B$4),\"\")","v":"A partager_12"},"A partager",1,"Leader","M'informer des tendances actuelles et futures qui pourraient impacter l'entreprise + Me former : min. 1 formation /an","A compléter costume 1 Action 5 Sous-action 4"]
[{"$f":"IF(B18=$B$4,B18&\"_\"&COUNTIF($B$6:$B18,$B$4),\"\")","v":"A partager_13"},"A partager",2,"Manager (en interne)","Communiquer les actions prioritaires à mes équipes directes.","A compléter costume 2 Action 1 Sous-action 1"]
[{"$f":"IF(B19=$B$4,B19&\"_\"&COUNTIF($B$6:$B19,$B$4),\"\")","v":"A partager_14"},"A partager",2,"Manager (en interne)","Communiquer les actions prioritaires à mes équipes directes.","A compléter costume 2 Action 1 Sous-action 3"]
[{"$f":"IF(B20=$B$4,B20&\"_\"&COUNTIF($B$6:$B20,$B$4),\"\")","v":"A partager_15"},"A partager",2,"Manager (en interne)","Communiquer les actions prioritaires à mes équipes directes.","A compléter costume 2 Action 1 Sous-action 4"]
[{"$f":"IF(B21=$B$4,B21&\"_\"&COUNTIF($B$6:$B21,$B$4),\"\")","v":"A partager_16"},"A partager",2,"Manager (en interne)","Encourager et motiver toutes les personnes que je manage.","A compléter costume 2 Action 2 Sous-action 4"]
[{"$f":"IF(B22=$B$4,B22&\"_\"&COUNTIF($B$6:$B22,$B$4),\"\")","v":"A partager_17"},"A partager",2,"Manager (en interne)","Informer Mme J, M. O, et l'équipe X, des actions à entreprendre cette semaine","A compléter costume 2 Action 3 Sous-action 2"]
[{"$f":"IF(B23=$B$4,B23&\"_\"&COUNTIF($B$6:$B23,$B$4),\"\")","v":"A partager_18"},"A partager",2,"Manager (en interne)","Communiquer les objectifs à atteindre aux directeurs des différents services/ unités/ départements.","A compléter costume 2 Action 4 Sous-action 5"]
[{"$f":"IF(B24=$B$4,B24&\"_\"&COUNTIF($B$6:$B24,$B$4),\"\")","v":"A partager_19"},"A partager",2,"Manager (en interne)","Déléguer le travail 1 et 2 à Mme O.","A compléter costume 2 Action 5 Sous-action 4"]
[{"$f":"IF(B25=$B$4,B25&\"_\"&COUNTIF($B$6:$B25,$B$4),\"\")","v":"A partager_20"},"A partager",3,"Partenaire commercial (à l'externe)","Gérer la relation avec les fournisseurs","A compléter costume 3 Action 2 Sous-action 5"]
[{"$f":"IF(B26=$B$4,B26&\"_\"&COUNTIF($B$6:$B26,$B$4),\"\")","v":"A partager_21"},"A partager",3,"Partenaire commercial (à l'externe)","Gérer la relation avec les clients","A compléter costume 3 Action 3 Sous-action 1"]
[{"$f":"IF(B27=$B$4,B27&\"_\"&COUNTIF($B$6:$B27,$B$4),\"\")","v":"A partager_22"},"A partager",3,"Partenaire commercial (à l'externe)","Gérer la relation avec les clients","A compléter costume 3 Action 3 Sous-action 4"]
[{"$f":"IF(B28=$B$4,B28&\"_\"&COUNTIF($B$6:$B28,$B$4),\"\")","v":"A partager_23"},"A partager",3,"Partenaire commercial (à l'externe)","Gérer la relation avec la presse","A compléter costume 3 Action 4 Sous-action 1"]
[{"$f":"IF(B29=$B$4,B29&\"_\"&COUNTIF($B$6:$B29,$B$4),\"\")","v":"A partager_24"},"A partager",3,"Partenaire commercial (à l'externe)","Gérer la relation avec la presse","A compléter costume 3 Action 4 Sous-action 3"]
[{"$f":"IF(B30=$B$4,B30&\"_\"&COUNTIF($B$6:$B30,$B$4),\"\")","v":"A partager_25"},"A partager",3,"Partenaire commercial (à l'externe)","Gérer la relation avec la presse","A compléter costume 3 Action 4 Sous-action 4"]
[{"$f":"IF(B31=$B$4,B31&\"_\"&COUNTIF($B$6:$B31,$B$4),\"\")","v":"A partager_26"},"A partager",3,"Partenaire commercial (à l'externe)","Gérer la relation avec la presse","A compléter costume 3 Action 4 Sous-action 5"]
[{"$f":"IF(B32=$B$4,B32&\"_\"&COUNTIF($B$6:$B32,$B$4),\"\")","v":"A partager_27"},"A partager",3,"Partenaire commercial (à l'externe)","Gérer la relation avec les partenaires financiers","A compléter costume 3 Action 5 Sous-action 2"]
[{"$f":"IF(B33=$B$4,B33&\"_\"&COUNTIF($B$6:$B33,$B$4),\"\")","v":"A partager_28"},"A partager",3,"Partenaire commercial (à l'externe)","Gérer la relation avec les partenaires financiers","A compléter costume 3 Action 5 Sous-action 4"]
[{"$f":"IF(B34=$B$4,B34&\"_\"&COUNTIF($B$6:$B34,$B$4),\"\")","v":"A partager_29"},"A partager",4,"Mari / Amant","Communiquer régulièrement avec elle/lui","A compléter costume 4 Action 1 Sous-action 5"]
[{"$f":"IF(B35=$B$4,B35&\"_\"&COUNTIF($B$6:$B35,$B$4),\"\")","v":"A partager_30"},"A partager",4,"Mari / Amant","Accorder x heures par jour/semaine à elle/lui","A compléter costume 4 Action 2 Sous-action 1"]
[{"$f":"IF(B36=$B$4,B36&\"_\"&COUNTIF($B$6:$B36,$B$4),\"\")","v":"A partager_31"},"A partager",4,"Mari / Amant","Accorder x heures par jour/semaine à elle/lui","A compléter costume 4 Action 2 Sous-action 4"]
[{"$f":"IF(B37=$B$4,B37&\"_\"&COUNTIF($B$6:$B37,$B$4),\"\")","v":"A partager_32"},"A partager",4,"Mari / Amant","Répondre à ses demandes/messages/sollicitations","A compléter costume 4 Action 3 Sous-action 1"]
[{"$f":"IF(B38=$B$4,B38&\"_\"&COUNTIF($B$6:$B38,$B$4),\"\")","v":"A partager_33"},"A partager",4,"Mari / Amant","Répondre à ses demandes/messages/sollicitations","A compléter costume 4 Action 3 Sous-action 3"]
[{"$f":"IF(B39=$B$4,B39&\"_\"&COUNTIF($B$6:$B39,$B$4),\"\")","v":"A partager_34"},"A partager",4,"Mari / Amant","Répondre à ses demandes/messages/sollicitations","A compléter costume 4 Action 3 Sous-action 5"]
[{"$f":"IF(B40=$B$4,B40&\"_\"&COUNTIF($B$6:$B40,$B$4),\"\")","v":"A partager_35"},"A partager",4,"Mari / Amant","Emmener ma femme/mon mari au restaurant en tête à tête au moins 1 fois/semaine.","A compléter costume 4 Action 4 Sous-action 4"]
[{"$f":"IF(B41=$B$4,B41&\"_\"&COUNTIF($B$6:$B41,$B$4),\"\")","v":"A partager_36"},"A partager",4,"Mari / Amant","Programmer au moins 1 we entre amoureux/mois.","A compléter costume 4 Action 5 Sous-action 1"]
[{"$f":"IF(B42=$B$4,B42&\"_\"&COUNTIF($B$6:$B42,$B$4),\"\")","v":"A partager_37"},"A partager",4,"Mari / Amant","Programmer au moins 1 we entre amoureux/mois.","A compléter costume 4 Action 5 Sous-action 2"]
[{"$f":"IF(B43=$B$4,B43&\"_\"&COUNTIF($B$6:$B43,$B$4),\"\")","v":"A partager_38"},"A partager",4,"Mari / Amant","Programmer au moins 1 we entre amoureux/mois.","A compléter costume 4 Action 5 Sous-action 5"]
[{"$f":"IF(B44=$B$4,B44&\"_\"&COUNTIF($B$6:$B44,$B$4),\"\")","v":"A partager_39"},"A partager",5,"Père","Apporter de l'amour à mon enfant selon son langage de l'amour (= cadeaux, moments de qualité, services rendus, toucher physique, paroles valorisantes)","Aller chercher mon enfant à l'école chaque lundi et mardi soir."]
[{"$f":"IF(B45=$B$4,B45&\"_\"&COUNTIF($B$6:$B45,$B$4),\"\")","v":"A partager_40"},"A partager",5,"Père","Apporter de l'amour à mon enfant selon son langage de l'amour (= cadeaux, moments de qualité, services rendus, toucher physique, paroles valorisantes)","A compléter costume 5 Action 1 Sous-action 2"]
[{"$f":"IF(B46=$B$4,B46&\"_\"&COUNTIF($B$6:$B46,$B$4),\"\")","v":"A partager_41"},"A partager",5,"Père","Apporter de l'amour à mon enfant selon son langage de l'amour (= cadeaux, moments de qualité, services rendus, toucher physique, paroles valorisantes)","A compléter costume 5 Action 1 Sous-action 3"]
[{"$f":"IF(B47=$B$4,B47&\"_\"&COUNTIF($B$6:$B47,$B$4),\"\")","v":"A partager_42"},"A partager",5,"Père","M'assurer que mon/mes enfant(s) à des vêtements propres à mettre chaque jour.","A compléter costume 5 Action 2 Sous-action 1"]
[{"$f":"IF(B48=$B$4,B48&\"_\"&COUNTIF($B$6:$B48,$B$4),\"\")","v":"A partager_43"},"A partager",5,"Père","M'assurer que mon/mes enfant(s) à des vêtements propres à mettre chaque jour.","A compléter costume 5 Action 2 Sous-action 2"]
[{"$f":"IF(B49=$B$4,B49&\"_\"&COUNTIF($B$6:$B49,$B$4),\"\")","v":"A partager_44"},"A partager",5,"Père","M'assurer que mon/mes enfant(s) à des vêtements propres à mettre chaque jour.","A compléter costume 5 Action 2 Sous-action 3"]
[{"$f":"IF(B50=$B$4,B50&\"_\"&COUNTIF($B$6:$B50,$B$4),\"\")","v":"A partager_45"},"A partager",5,"Père","M'assurer que mon/mes enfant(s) à des vêtements propres à mettre chaque jour.","A compléter costume 5 Action 2 Sous-action 4"]
[{"$f":"IF(B51=$B$4,B51&\"_\"&COUNTIF($B$6:$B51,$B$4),\"\")","v":"A partager_46"},"A partager",5,"Père","Accompagner mon/mes enfant(s) à ses activités extra-scolaires. Assurer les déplacements de mon/mes enfant(s)","A compléter costume 5 Action 3 Sous-action 1"]
[{"$f":"IF(B52=$B$4,B52&\"_\"&COUNTIF($B$6:$B52,$B$4),\"\")","v":"A partager_47"},"A partager",5,"Père","Accompagner mon/mes enfant(s) à ses activités extra-scolaires. Assurer les déplacements de mon/mes enfant(s)","A compléter costume 5 Action 3 Sous-action 2"]
[{"$f":"IF(B53=$B$4,B53&\"_\"&COUNTIF($B$6:$B53,$B$4),\"\")","v":"A partager_48"},"A partager",5,"Père","Accompagner mon/mes enfant(s) à ses activités extra-scolaires. Assurer les déplacements de mon/mes enfant(s)","A compléter costume 5 Action 3 Sous-action 4"]
[{"$f":"IF(B54=$B$4,B54&\"_\"&COUNTIF($B$6:$B54,$B$4),\"\")","v":"A partager_49"},"A partager",5,"Père","Accompagner mon/mes enfant(s) à ses activités extra-scolaires. Assurer les déplacements de mon/mes enfant(s)","A compléter costume 5 Action 3 Sous-action 5"]
[{"$f":"IF(B55=$B$4,B55&\"_\"&COUNTIF($B$6:$B55,$B$4),\"\")","v":"A partager_50"},"A partager",5,"Père","Assurer l'éducation de mon enfant et aider mon/mes enfant(s) dans ses apprentissages.","A compléter costume 5 Action 4 Sous-action 1"]
[{"$f":"IF(B56=$B$4,B56&\"_\"&COUNTIF($B$6:$B56,$B$4),\"\")","v":"A partager_51"},"A partager",5,"Père","Assurer l'éducation de mon enfant et aider mon/mes enfant(s) dans ses apprentissages.","A compléter costume 5 Action 4 Sous-action 2"]
[{"$f":"IF(B57=$B$4,B57&\"_\"&COUNTIF($B$6:$B57,$B$4),\"\")","v":"A partager_52"},"A partager",5,"Père","Assurer l'éducation de mon enfant et aider mon/mes enfant(s) dans ses apprentissages.","A compléter costume 5 Action 4 Sous-action 4"]
[{"$f":"IF(B58=$B$4,B58&\"_\"&COUNTIF($B$6:$B58,$B$4),\"\")","v":"A partager_53"},"A partager",5,"Père","Assurer un environnement sain, propre et sécurisé pour mon/mes enfant(s)","A compléter costume 5 Action 5 Sous-action 1"]
[{"$f":"IF(B59=$B$4,B59&\"_\"&COUNTIF($B$6:$B59,$B$4),\"\")","v":"A partager_54"},"A partager",5,"Père","Assurer un environnement sain, propre et sécurisé pour mon/mes enfant(s)","A compléter costume 5 Action 5 Sous-action 2"]
[{"$f":"IF(B60=$B$4,B60&\"_\"&COUNTIF($B$6:$B60,$B$4),\"\")","v":"A partager_55"},"A partager",5,"Père","Assurer un environnement sain, propre et sécurisé pour mon/mes enfant(s)","A compléter costume 5 Action 5 Sous-action 3"]
[{"$f":"IF(B61=$B$4,B61&\"_\"&COUNTIF($B$6:$B61,$B$4),\"\")","v":"A partager_56"},"A partager",5,"Père","Assurer un environnement sain, propre et sécurisé pour mon/mes enfant(s)","A compléter costume 5 Action 5 Sous-action 4"]
[{"$f":"IF(B62=$B$4,B62&\"_\"&COUNTIF($B$6:$B62,$B$4),\"\")","v":"A partager_57"},"A partager",5,"Père","Assurer un environnement sain, propre et sécurisé pour mon/mes enfant(s)","A compléter costume 5 Action 5 Sous-action 5"]
[{"$f":"IF(B63=$B$4,B63&\"_\"&COUNTIF($B$6:$B63,$B$4),\"\")","v":"A partager_58"},"A partager",6,"Oncle, fils, etc. (vie familiale)","Appeler les membres X, Y, et R de ma famille 1 fois/mois.","A compléter costume 6 Action 1 Sous-action 2"]
[{"$f":"IF(B64=$B$4,B64&\"_\"&COUNTIF($B$6:$B64,$B$4),\"\")","v":"A partager_59"},"A partager",6,"Oncle, fils, etc. (vie familiale)","Appeler les membres X, Y, et R de ma famille 1 fois/mois.","A compléter costume 6 Action 1 Sous-action 5"]
[{"$f":"IF(B65=$B$4,B65&\"_\"&COUNTIF($B$6:$B65,$B$4),\"\")","v":"A partager_60"},"A partager",6,"Oncle, fils, etc. (vie familiale)","Répondre aux appels de mon père.","A compléter costume 6 Action 2 Sous-action 1"]
[{"$f":"IF(B66=$B$4,B66&\"_\"&COUNTIF($B$6:$B66,$B$4),\"\")","v":"A partager_61"},"A partager",6,"Oncle, fils, etc. (vie familiale)","Répondre aux appels de mon père.","A compléter costume 6 Action 2 Sous-action 4"]
[{"$f":"IF(B67=$B$4,B67&\"_\"&COUNTIF($B$6:$B67,$B$4),\"\")","v":"A partager_62"},"A partager",6,"Oncle, fils, etc. (vie familiale)","Soutenir Mme X dans les x prochains mois.","A compléter costume 6 Action 3 Sous-action 3"]
[{"$f":"IF(B68=$B$4,B68&\"_\"&COUNTIF($B$6:$B68,$B$4),\"\")","v":"A partager_63"},"A partager",6,"Oncle, fils, etc. (vie familiale)","Organiser un weekend avec X et Y au moins 2 fois/an.","A compléter costume 6 Action 4 Sous-action 2"]
[{"$f":"IF(B69=$B$4,B69&\"_\"&COUNTIF($B$6:$B69,$B$4),\"\")","v":"A partager_64"},"A partager",6,"Oncle, fils, etc. (vie familiale)","Organiser un weekend avec X et Y au moins 2 fois/an.","A compléter costume 6 Action 4 Sous-action 5"]
[{"$f":"IF(B70=$B$4,B70&\"_\"&COUNTIF($B$6:$B70,$B$4),\"\")","v":"A partager_65"},"A partager",6,"Oncle, fils, etc. (vie familiale)","Me rendre disponible pour les anniversaires de P, S, et J chaque année.","A compléter costume 6 Action 5 Sous-action 1"]
[{"$f":"IF(B71=$B$4,B71&\"_\"&COUNTIF($B$6:$B71,$B$4),\"\")","v":"A partager_66"},{"$f":"IF(C71=\"\",\"\",\"A partager\")","v":"A partager"},6,"Oncle, fils, etc. (vie familiale)","Me rendre disponible pour les anniversaires de P, S, et J chaque année.","A compléter costume 6 Action 5 Sous-action 4"]
[{"$f":"IF(B72=$B$4,B72&\"_\"&COUNTIF($B$6:$B72,$B$4),\"\")","v":"A partager_67"},"A partager",7,"Ami / copain (vie sociale)","Passer du temps avec mes ami(e)s","A compléter costume 7 Action 1 Sous-action 1"]
[{"$f":"IF(B73=$B$4,B73&\"_\"&COUNTIF($B$6:$B73,$B$4),\"\")","v":"A partager_68"},"A partager",7,"Ami / copain (vie sociale)","Passer du temps avec mes ami(e)s","A compléter costume 7 Action 1 Sous-action 3"]
[{"$f":"IF(B74=$B$4,B74&\"_\"&COUNTIF($B$6:$B74,$B$4),\"\")","v":"A partager_69"},"A partager",7,"Ami / copain (vie sociale)","Passer du temps avec mes ami(e)s","A compléter costume 7 Action 1 Sous-action 4"]
[{"$f":"IF(B75=$B$4,B75&\"_\"&COUNTIF($B$6:$B75,$B$4),\"\")","v":"A partager_70"},"A partager",7,"Ami / copain (vie sociale)","Rencontrer de nouvelles personnes","A compléter costume 7 Action 2 Sous-action 3"]
[{"$f":"IF(B76=$B$4,B76&\"_\"&COUNTIF($B$6:$B76,$B$4),\"\")","v":"A partager_71"},"A partager",7,"Ami / copain (vie sociale)","Rencontrer de nouvelles personnes","A compléter costume 7 Action 2 Sous-action 4"]
[{"$f":"IF(B77=$B$4,B77&\"_\"&COUNTIF($B$6:$B77,$B$4),\"\")","v":"A partager_72"},"A partager",7,"Ami / copain (vie sociale)","Rencontrer de nouvelles personnes","A compléter costume 7 Action 2 Sous-action 5"]
[{"$f":"IF(B78=$B$4,B78&\"_\"&COUNTIF($B$6:$B78,$B$4),\"\")","v":"A partager_73"},"A partager",7,"Ami / copain (vie sociale)","Appeler/écrire à mes ami(e)s X, Z, et A au moins 1 fois/mois.","A compléter costume 7 Action 3 Sous-action 1"]
[{"$f":"IF(B79=$B$4,B79&\"_\"&COUNTIF($B$6:$B79,$B$4),\"\")","v":"A partager_74"},"A partager",7,"Ami / copain (vie sociale)","Appeler/écrire à mes ami(e)s X, Z, et A au moins 1 fois/mois.","A compléter costume 7 Action 3 Sous-action 2"]
[{"$f":"IF(B80=$B$4,B80&\"_\"&COUNTIF($B$6:$B80,$B$4),\"\")","v":"A partager_75"},"A partager",7,"Ami / copain (vie sociale)","Appeler/écrire à mes ami(e)s X, Z, et A au moins 1 fois/mois.","A compléter costume 7 Action 3 Sous-action 3"]
[{"$f":"IF(B81=$B$4,B81&\"_\"&COUNTIF($B$6:$B81,$B$4),\"\")","v":"A partager_76"},"A partager",7,"Ami / copain (vie sociale)","Appeler/écrire à mes ami(e)s X, Z, et A au moins 1 fois/mois.","A compléter costume 7 Action 3 Sous-action 4"]
[{"$f":"IF(B82=$B$4,B82&\"_\"&COUNTIF($B$6:$B82,$B$4),\"\")","v":"A partager_77"},"A partager",7,"Ami / copain (vie sociale)","Répondre à mes ami(e)s dans les 3 jours.","A compléter costume 7 Action 4 Sous-action 1"]
[{"$f":"IF(B83=$B$4,B83&\"_\"&COUNTIF($B$6:$B83,$B$4),\"\")","v":"A partager_78"},"A partager",7,"Ami / copain (vie sociale)","Répondre à mes ami(e)s dans les 3 jours.","A compléter costume 7 Action 4 Sous-action 2"]
[{"$f":"IF(B84=$B$4,B84&\"_\"&COUNTIF($B$6:$B84,$B$4),\"\")","v":"A partager_79"},"A partager",7,"Ami / copain (vie sociale)","Répondre à mes ami(e)s dans les 3 jours.","A compléter costume 7 Action 4 Sous-action 3"]
[{"$f":"IF(B85=$B$4,B85&\"_\"&COUNTIF($B$6:$B85,$B$4),\"\")","v":"A partager_80"},"A partager",7,"Ami / copain (vie sociale)","Répondre à mes ami(e)s dans les 3 jours.","A compléter costume 7 Action 4 Sous-action 4"]
[{"$f":"IF(B86=$B$4,B86&\"_\"&COUNTIF($B$6:$B86,$B$4),\"\")","v":"A partager_81"},"A partager",7,"Ami / copain (vie sociale)","Programmer au moins 1 sortie avec mes amis W, R, et U /mois.","A compléter costume 7 Action 5 Sous-action 1"]
[{"$f":"IF(B87=$B$4,B87&\"_\"&COUNTIF($B$6:$B87,$B$4),\"\")","v":"A partager_82"},"A partager",7,"Ami / copain (vie sociale)","Programmer au moins 1 sortie avec mes amis W, R, et U /mois.","A compléter costume 7 Action 5 Sous-action 4"]
[{"$f":"IF(B88=$B$4,B88&\"_\"&COUNTIF($B$6:$B88,$B$4),\"\")","v":"A partager_83"},"A partager",8,"Loisirs (activités, clubs, etc.)","Lire 30 minutes/semaine un livre \"plaisir\".","A compléter costume 8 Action 1 Sous-action 5"]
[{"$f":"IF(B89=$B$4,B89&\"_\"&COUNTIF($B$6:$B89,$B$4),\"\")","v":"A partager_84"},"A partager",8,"Loisirs (activités, clubs, etc.)","Participer au carnaval de ma ville avec mon enfant.","A compléter costume 8 Action 2 Sous-action 1"]
[{"$f":"IF(B90=$B$4,B90&\"_\"&COUNTIF($B$6:$B90,$B$4),\"\")","v":"A partager_85"},"A partager",8,"Loisirs (activités, clubs, etc.)","Participer au carnaval de ma ville avec mon enfant.","A compléter costume 8 Action 2 Sous-action 3"]
[{"$f":"IF(B91=$B$4,B91&\"_\"&COUNTIF($B$6:$B91,$B$4),\"\")","v":"A partager_86"},"A partager",8,"Loisirs (activités, clubs, etc.)","Prendre 7 jours de vacances tous les 3 mois.","A compléter costume 8 Action 3 Sous-action 1"]
[{"$f":"IF(B92=$B$4,B92&\"_\"&COUNTIF($B$6:$B92,$B$4),\"\")","v":"A partager_87"},"A partager",8,"Loisirs (activités, clubs, etc.)","Prendre 7 jours de vacances tous les 3 mois.","A compléter costume 8 Action 3 Sous-action 4"]
[{"$f":"IF(B93=$B$4,B93&\"_\"&COUNTIF($B$6:$B93,$B$4),\"\")","v":"A partager_88"},"A partager",8,"Loisirs (activités, clubs, etc.)","Prendre 7 jours de vacances tous les 3 mois.","A compléter costume 8 Action 3 Sous-action 5"]
[{"$f":"IF(B94=$B$4,B94&\"_\"&COUNTIF($B$6:$B94,$B$4),\"\")","v":"A partager_89"},"A partager",8,"Loisirs (activités, clubs, etc.)","Pratiquer une activité qui me plaît chaque semaine, pendant x heures minimum.","A compléter costume 8 Action 4 Sous-action 2"]
[{"$f":"IF(B95=$B$4,B95&\"_\"&COUNTIF($B$6:$B95,$B$4),\"\")","v":"A partager_90"},"A partager",8,"Loisirs (activités, clubs, etc.)","Pratiquer une activité qui me plaît chaque semaine, pendant x heures minimum.","A compléter costume 8 Action 4 Sous-action 3"]
[{"$f":"IF(B96=$B$4,B96&\"_\"&COUNTIF($B$6:$B96,$B$4),\"\")","v":"A partager_91"},"A partager",8,"Loisirs (activités, clubs, etc.)","Pratiquer une activité qui me plaît chaque semaine, pendant x heures minimum.","A compléter costume 8 Action 4 Sous-action 5"]
[{"$f":"IF(B97=$B$4,B97&\"_\"&COUNTIF($B$6:$B97,$B$4),\"\")","v":"A partager_92"},"A partager",8,"Loisirs (activités, clubs, etc.)","Visiter des expositions/lieux/musées","A compléter costume 8 Action 5 Sous-action 5"]
[{"$f":"IF(B98=$B$4,B98&\"_\"&COUNTIF($B$6:$B98,$B$4),\"\")","v":"A partager_93"},"A partager",9,"Dormeur","Suivre un rituel du coucher identique tous les soirs.","A compléter costume 9 Action 1 Sous-action 5"]
[{"$f":"IF(B99=$B$4,B99&\"_\"&COUNTIF($B$6:$B99,$B$4),\"\")","v":"A partager_94"},"A partager",9,"Dormeur","Ne pas regarder d'écrans au moins 1h avant de me coucher.","A compléter costume 9 Action 2 Sous-action 1"]
[{"$f":"IF(B100=$B$4,B100&\"_\"&COUNTIF($B$6:$B100,$B$4),\"\")","v":"A partager_95"},"A partager",9,"Dormeur","Ne pas regarder d'écrans au moins 1h avant de me coucher.","A compléter costume 9 Action 2 Sous-action 5"]
[{"$f":"IF(B101=$B$4,B101&\"_\"&COUNTIF($B$6:$B101,$B$4),\"\")","v":"A partager_96"},"A partager",9,"Dormeur","Me lever chaque matin à une heure fixe.","A compléter costume 9 Action 3 Sous-action 1"]
[{"$f":"IF(B102=$B$4,B102&\"_\"&COUNTIF($B$6:$B102,$B$4),\"\")","v":"A partager_97"},"A partager",9,"Dormeur","Méditer, visualiser, ou prendre un temps calme chaque jour de 10 minutes au réveil / à 13h00 / au coucher.","A compléter costume 9 Action 4 Sous-action 1"]
[{"$f":"IF(B103=$B$4,B103&\"_\"&COUNTIF($B$6:$B103,$B$4),\"\")","v":"A partager_98"},"A partager",9,"Dormeur","Méditer, visualiser, ou prendre un temps calme chaque jour de 10 minutes au réveil / à 13h00 / au coucher.","A compléter costume 9 Action 4 Sous-action 5"]
[{"$f":"IF(B104=$B$4,B104&\"_\"&COUNTIF($B$6:$B104,$B$4),\"\")","v":"A partager_99"},"A partager",9,"Dormeur","Manger léger tous les soirs du lundi au vendredi, sans sucre ni café.","A compléter costume 9 Action 5 Sous-action 4"]
[{"$f":"IF(B105=$B$4,B105&\"_\"&COUNTIF($B$6:$B105,$B$4),\"\")","v":"A partager_100"},"A partager",9,"Dormeur","Manger léger tous les soirs du lundi au vendredi, sans sucre ni café.","A compléter costume 9 Action 5 Sous-action 5"]
[{"$f":"IF(B106=$B$4,B106&\"_\"&COUNTIF($B$6:$B106,$B$4),\"\")","v":"A partager_101"},"A partager",10,"Sportif","Acheter mes tenues et mon matériel de sport.","A compléter costume 10 Action 1 Sous-action 1"]
[{"$f":"IF(B107=$B$4,B107&\"_\"&COUNTIF($B$6:$B107,$B$4),\"\")","v":"A partager_102"},"A partager",10,"Sportif","Acheter mes tenues et mon matériel de sport.","A compléter costume 10 Action 1 Sous-action 3"]
[{"$f":"IF(B108=$B$4,B108&\"_\"&COUNTIF($B$6:$B108,$B$4),\"\")","v":"A partager_103"},"A partager",10,"Sportif","Acheter mes tenues et mon matériel de sport.","A compléter costume 10 Action 1 Sous-action 5"]
[{"$f":"IF(B109=$B$4,B109&\"_\"&COUNTIF($B$6:$B109,$B$4),\"\")","v":"A partager_104"},"A partager",10,"Sportif","Courir 2 fois / semaine pendant 30 minutes minimum.","A compléter costume 10 Action 2 Sous-action 1"]
[{"$f":"IF(B110=$B$4,B110&\"_\"&COUNTIF($B$6:$B110,$B$4),\"\")","v":"A partager_105"},"A partager",10,"Sportif","Courir 2 fois / semaine pendant 30 minutes minimum.","A compléter costume 10 Action 2 Sous-action 2"]
[{"$f":"IF(B111=$B$4,B111&\"_\"&COUNTIF($B$6:$B111,$B$4),\"\")","v":"A partager_106"},"A partager",10,"Sportif","Courir 2 fois / semaine pendant 30 minutes minimum.","A compléter costume 10 Action 2 Sous-action 3"]
[{"$f":"IF(B112=$B$4,B112&\"_\"&COUNTIF($B$6:$B112,$B$4),\"\")","v":"A partager_107"},"A partager",10,"Sportif","M'étirer 10 minutes tous les soirs à 21h00.","A compléter costume 10 Action 3 Sous-action 1"]
[{"$f":"IF(B113=$B$4,B113&\"_\"&COUNTIF($B$6:$B113,$B$4),\"\")","v":"A partager_108"},"A partager",10,"Sportif","M'étirer 10 minutes tous les soirs à 21h00.","A compléter costume 10 Action 3 Sous-action 3"]
[{"$f":"IF(B114=$B$4,B114&\"_\"&COUNTIF($B$6:$B114,$B$4),\"\")","v":"A partager_109"},"A partager",10,"Sportif","M'étirer 10 minutes tous les soirs à 21h00.","A compléter costume 10 Action 3 Sous-action 4"]
[{"$f":"IF(B115=$B$4,B115&\"_\"&COUNTIF($B$6:$B115,$B$4),\"\")","v":"A partager_110"},"A partager",10,"Sportif","M'étirer 10 minutes tous les soirs à 21h00.","A compléter costume 10 Action 3 Sous-action 5"]
[{"$f":"IF(B116=$B$4,B116&\"_\"&COUNTIF($B$6:$B116,$B$4),\"\")","v":"A partager_111"},"A partager",10,"Sportif","Boire au moins 1,5 litres d'eau par jour.","A compléter costume 10 Action 4 Sous-action 1"]
[{"$f":"IF(B117=$B$4,B117&\"_\"&COUNTIF($B$6:$B117,$B$4),\"\")","v":"A partager_112"},"A partager",10,"Sportif","Boire au moins 1,5 litres d'eau par jour.","A compléter costume 10 Action 4 Sous-action 2"]
[{"$f":"IF(B118=$B$4,B118&\"_\"&COUNTIF($B$6:$B118,$B$4),\"\")","v":"A partager_113"},"A partager",10,"Sportif","Boire au moins 1,5 litres d'eau par jour.","A compléter costume 10 Action 4 Sous-action 4"]
[{"$f":"IF(B119=$B$4,B119&\"_\"&COUNTIF($B$6:$B119,$B$4),\"\")","v":"A partager_114"},"A partager",10,"Sportif","Boire au moins 1,5 litres d'eau par jour.","A compléter costume 10 Action 4 Sous-action 5"]
[{"$f":"IF(B120=$B$4,B120&\"_\"&COUNTIF($B$6:$B120,$B$4),\"\")","v":""},""]
[{"$f":"IF(B121=$B$4,B121&\"_\"&COUNTIF($B$6:$B121,$B$4),\"\")","v":""},""]
[{"$f":"IF(B122=$B$4,B122&\"_\"&COUNTIF($B$6:$B122,$B$4),\"\")","v":""},""]
[{"$f":"IF(B123=$B$4,B123&\"_\"&COUNTIF($B$6:$B123,$B$4),\"\")","v":""},""]
[{"$f":"IF(B124=$B$4,B124&\"_\"&COUNTIF($B$6:$B124,$B$4),\"\")","v":""},""]
[{"$f":"IF(B125=$B$4,B125&\"_\"&COUNTIF($B$6:$B125,$B$4),\"\")","v":""},""]
[{"$f":"IF(B126=$B$4,B126&\"_\"&COUNTIF($B$6:$B126,$B$4),\"\")","v":""},""]
[{"$f":"IF(B127=$B$4,B127&\"_\"&COUNTIF($B$6:$B127,$B$4),\"\")","v":""},""]
[{"$f":"IF(B128=$B$4,B128&\"_\"&COUNTIF($B$6:$B128,$B$4),\"\")","v":""},""]
[{"$f":"IF(B129=$B$4,B129&\"_\"&COUNTIF($B$6:$B129,$B$4),\"\")","v":""},""]
[{"$f":"IF(B130=$B$4,B130&\"_\"&COUNTIF($B$6:$B130,$B$4),\"\")","v":""},""]
[{"$f":"IF(B131=$B$4,B131&\"_\"&COUNTIF($B$6:$B131,$B$4),\"\")","v":""},""]
[{"$f":"IF(B132=$B$4,B132&\"_\"&COUNTIF($B$6:$B132,$B$4),\"\")","v":""},""]
[{"$f":"IF(B133=$B$4,B133&\"_\"&COUNTIF($B$6:$B133,$B$4),\"\")","v":""},""]
[{"$f":"IF(B134=$B$4,B134&\"_\"&COUNTIF($B$6:$B134,$B$4),\"\")","v":""},""]
[{"$f":"IF(B135=$B$4,B135&\"_\"&COUNTIF($B$6:$B135,$B$4),\"\")","v":""},{"$f":"IF(C135=\"\",\"\",\"A partager\")","v":""}]
[{"$f":"IF(B136=$B$4,B136&\"_\"&COUNTIF($B$6:$B136,$B$4),\"\")","v":""},""]
[{"$f":"IF(B137=$B$4,B137&\"_\"&COUNTIF($B$6:$B137,$B$4),\"\")","v":""},""]
[{"$f":"IF(B138=$B$4,B138&\"_\"&COUNTIF($B$6:$B138,$B$4),\"\")","v":""},""]
[{"$f":"IF(B139=$B$4,B139&\"_\"&COUNTIF($B$6:$B139,$B$4),\"\")","v":""},""]
[{"$f":"IF(B140=$B$4,B140&\"_\"&COUNTIF($B$6:$B140,$B$4),\"\")","v":""},""]
[{"$f":"IF(B141=$B$4,B141&\"_\"&COUNTIF($B$6:$B141,$B$4),\"\")","v":""},""]
[{"$f":"IF(B142=$B$4,B142&\"_\"&COUNTIF($B$6:$B142,$B$4),\"\")","v":""},""]
[{"$f":"IF(B143=$B$4,B143&\"_\"&COUNTIF($B$6:$B143,$B$4),\"\")","v":""},""]
[{"$f":"IF(B144=$B$4,B144&\"_\"&COUNTIF($B$6:$B144,$B$4),\"\")","v":""},""]
[{"$f":"IF(B145=$B$4,B145&\"_\"&COUNTIF($B$6:$B145,$B$4),\"\")","v":""},""]
[{"$f":"IF(B146=$B$4,B146&\"_\"&COUNTIF($B$6:$B146,$B$4),\"\")","v":""},""]
[{"$f":"IF(B147=$B$4,B147&\"_\"&COUNTIF($B$6:$B147,$B$4),\"\")","v":""},""]
[{"$f":"IF(B148=$B$4,B148&\"_\"&COUNTIF($B$6:$B148,$B$4),\"\")","v":""},""]
[{"$f":"IF(B149=$B$4,B149&\"_\"&COUNTIF($B$6:$B149,$B$4),\"\")","v":""},""]
[{"$f":"IF(B150=$B$4,B150&\"_\"&COUNTIF($B$6:$B150,$B$4),\"\")","v":""},""]
[{"$f":"IF(B151=$B$4,B151&\"_\"&COUNTIF($B$6:$B151,$B$4),\"\")","v":""},""]
[{"$f":"IF(B152=$B$4,B152&\"_\"&COUNTIF($B$6:$B152,$B$4),\"\")","v":""},""]
[{"$f":"IF(B153=$B$4,B153&\"_\"&COUNTIF($B$6:$B153,$B$4),\"\")","v":""},""]
[{"$f":"IF(B154=$B$4,B154&\"_\"&COUNTIF($B$6:$B154,$B$4),\"\")","v":""},""]
[{"$f":"IF(B155=$B$4,B155&\"_\"&COUNTIF($B$6:$B155,$B$4),\"\")","v":""},""]
[{"$f":"IF(B156=$B$4,B156&\"_\"&COUNTIF($B$6:$B156,$B$4),\"\")","v":""},""]
[{"$f":"IF(B157=$B$4,B157&\"_\"&COUNTIF($B$6:$B157,$B$4),\"\")","v":""},""]
[{"$f":"IF(B158=$B$4,B158&\"_\"&COUNTIF($B$6:$B158,$B$4),\"\")","v":""},""]
[{"$f":"IF(B159=$B$4,B159&\"_\"&COUNTIF($B$6:$B159,$B$4),\"\")","v":""},""]
[{"$f":"IF(B160=$B$4,B160&\"_\"&COUNTIF($B$6:$B160,$B$4),\"\")","v":""},""]
[{"$f":"IF(B161=$B$4,B161&\"_\"&COUNTIF($B$6:$B161,$B$4),\"\")","v":""},""]
[{"$f":"IF(B162=$B$4,B162&\"_\"&COUNTIF($B$6:$B162,$B$4),\"\")","v":""},""]
[{"$f":"IF(B163=$B$4,B163&\"_\"&COUNTIF($B$6:$B163,$B$4),\"\")","v":""},""]
[{"$f":"IF(B164=$B$4,B164&\"_\"&COUNTIF($B$6:$B164,$B$4),\"\")","v":""},""]
[{"$f":"IF(B165=$B$4,B165&\"_\"&COUNTIF($B$6:$B165,$B$4),\"\")","v":""},""]
[{"$f":"IF(B166=$B$4,B166&\"_\"&COUNTIF($B$6:$B166,$B$4),\"\")","v":""},""]
[{"$f":"IF(B167=$B$4,B167&\"_\"&COUNTIF($B$6:$B167,$B$4),\"\")","v":""},""]
[{"$f":"IF(B168=$B$4,B168&\"_\"&COUNTIF($B$6:$B168,$B$4),\"\")","v":""},""]
[{"$f":"IF(B169=$B$4,B169&\"_\"&COUNTIF($B$6:$B169,$B$4),\"\")","v":""},""]
[{"$f":"IF(B170=$B$4,B170&\"_\"&COUNTIF($B$6:$B170,$B$4),\"\")","v":""},""]
[{"$f":"IF(B171=$B$4,B171&\"_\"&COUNTIF($B$6:$B171,$B$4),\"\")","v":""},""]
[{"$f":"IF(B172=$B$4,B172&\"_\"&COUNTIF($B$6:$B172,$B$4),\"\")","v":""},""]
[{"$f":"IF(B173=$B$4,B173&\"_\"&COUNTIF($B$6:$B173,$B$4),\"\")","v":""},""]
[{"$f":"IF(B174=$B$4,B174&\"_\"&COUNTIF($B$6:$B174,$B$4),\"\")","v":""},""]
[{"$f":"IF(B175=$B$4,B175&\"_\"&COUNTIF($B$6:$B175,$B$4),\"\")","v":""},""]
[{"$f":"IF(B176=$B$4,B176&\"_\"&COUNTIF($B$6:$B176,$B$4),\"\")","v":""},""]
[{"$f":"IF(B177=$B$4,B177&\"_\"&COUNTIF($B$6:$B177,$B$4),\"\")","v":""},""]
[{"$f":"IF(B178=$B$4,B178&\"_\"&COUNTIF($B$6:$B178,$B$4),\"\")","v":""},""]
[{"$f":"IF(B179=$B$4,B179&\"_\"&COUNTIF($B$6:$B179,$B$4),\"\")","v":""},""]
[{"$f":"IF(B180=$B$4,B180&\"_\"&COUNTIF($B$6:$B180,$B$4),\"\")","v":""},""]
[{"$f":"IF(B181=$B$4,B181&\"_\"&COUNTIF($B$6:$B181,$B$4),\"\")","v":""},""]
[{"$f":"IF(B182=$B$4,B182&\"_\"&COUNTIF($B$6:$B182,$B$4),\"\")","v":""},""]
[{"$f":"IF(B183=$B$4,B183&\"_\"&COUNTIF($B$6:$B183,$B$4),\"\")","v":""},""]
[{"$f":"IF(B184=$B$4,B184&\"_\"&COUNTIF($B$6:$B184,$B$4),\"\")","v":""},""]
[{"$f":"IF(B185=$B$4,B185&\"_\"&COUNTIF($B$6:$B185,$B$4),\"\")","v":""},""]
[{"$f":"IF(B186=$B$4,B186&\"_\"&COUNTIF($B$6:$B186,$B$4),\"\")","v":""},""]
[{"$f":"IF(B187=$B$4,B187&\"_\"&COUNTIF($B$6:$B187,$B$4),\"\")","v":""},""]
[{"$f":"IF(B188=$B$4,B188&\"_\"&COUNTIF($B$6:$B188,$B$4),\"\")","v":""},""]
[{"$f":"IF(B189=$B$4,B189&\"_\"&COUNTIF($B$6:$B189,$B$4),\"\")","v":""},""]
[{"$f":"IF(B190=$B$4,B190&\"_\"&COUNTIF($B$6:$B190,$B$4),\"\")","v":""},""]
[{"$f":"IF(B191=$B$4,B191&\"_\"&COUNTIF($B$6:$B191,$B$4),\"\")","v":""},""]
[{"$f":"IF(B192=$B$4,B192&\"_\"&COUNTIF($B$6:$B192,$B$4),\"\")","v":""},""]
[{"$f":"IF(B193=$B$4,B193&\"_\"&COUNTIF($B$6:$B193,$B$4),\"\")","v":""},""]
[{"$f":"IF(B194=$B$4,B194&\"_\"&COUNTIF($B$6:$B194,$B$4),\"\")","v":""},""]
[{"$f":"IF(B195=$B$4,B195&\"_\"&COUNTIF($B$6:$B195,$B$4),\"\")","v":""},""]
[{"$f":"IF(B196=$B$4,B196&\"_\"&COUNTIF($B$6:$B196,$B$4),\"\")","v":""},""]
[{"$f":"IF(B197=$B$4,B197&\"_\"&COUNTIF($B$6:$B197,$B$4),\"\")","v":""},""]
[{"$f":"IF(B198=$B$4,B198&\"_\"&COUNTIF($B$6:$B198,$B$4),\"\")","v":""},""]
[{"$f":"IF(B199=$B$4,B199&\"_\"&COUNTIF($B$6:$B199,$B$4),\"\")","v":""},{"$f":"IF(C199=\"\",\"\",\"A partager\")","v":""}]
[{"$f":"IF(B200=$B$4,B200&\"_\"&COUNTIF($B$6:$B200,$B$4),\"\")","v":""},""]
[{"$f":"IF(B201=$B$4,B201&\"_\"&COUNTIF($B$6:$B201,$B$4),\"\")","v":""},""]
[{"$f":"IF(B202=$B$4,B202&\"_\"&COUNTIF($B$6:$B202,$B$4),\"\")","v":""},""]
[{"$f":"IF(B203=$B$4,B203&\"_\"&COUNTIF($B$6:$B203,$B$4),\"\")","v":""},""]
[{"$f":"IF(B204=$B$4,B204&\"_\"&COUNTIF($B$6:$B204,$B$4),\"\")","v":""},""]
[{"$f":"IF(B205=$B$4,B205&\"_\"&COUNTIF($B$6:$B205,$B$4),\"\")","v":""},""]
[{"$f":"IF(B206=$B$4,B206&\"_\"&COUNTIF($B$6:$B206,$B$4),\"\")","v":""},""]
[{"$f":"IF(B207=$B$4,B207&\"_\"&COUNTIF($B$6:$B207,$B$4),\"\")","v":""},""]
[{"$f":"IF(B208=$B$4,B208&\"_\"&COUNTIF($B$6:$B208,$B$4),\"\")","v":""},""]
[{"$f":"IF(B209=$B$4,B209&\"_\"&COUNTIF($B$6:$B209,$B$4),\"\")","v":""},""]
[{"$f":"IF(B210=$B$4,B210&\"_\"&COUNTIF($B$6:$B210,$B$4),\"\")","v":""},""]
[{"$f":"IF(B211=$B$4,B211&\"_\"&COUNTIF($B$6:$B211,$B$4),\"\")","v":""},""]
[{"$f":"IF(B212=$B$4,B212&\"_\"&COUNTIF($B$6:$B212,$B$4),\"\")","v":""},""]
[{"$f":"IF(B213=$B$4,B213&\"_\"&COUNTIF($B$6:$B213,$B$4),\"\")","v":""},""]
[{"$f":"IF(B214=$B$4,B214&\"_\"&COUNTIF($B$6:$B214,$B$4),\"\")","v":""},""]
[{"$f":"IF(B215=$B$4,B215&\"_\"&COUNTIF($B$6:$B215,$B$4),\"\")","v":""},""]
[{"$f":"IF(B216=$B$4,B216&\"_\"&COUNTIF($B$6:$B216,$B$4),\"\")","v":""},""]
[{"$f":"IF(B217=$B$4,B217&\"_\"&COUNTIF($B$6:$B217,$B$4),\"\")","v":""},""]
[{"$f":"IF(B218=$B$4,B218&\"_\"&COUNTIF($B$6:$B218,$B$4),\"\")","v":""},""]
[{"$f":"IF(B219=$B$4,B219&\"_\"&COUNTIF($B$6:$B219,$B$4),\"\")","v":""},""]
[{"$f":"IF(B220=$B$4,B220&\"_\"&COUNTIF($B$6:$B220,$B$4),\"\")","v":""},""]
[{"$f":"IF(B221=$B$4,B221&\"_\"&COUNTIF($B$6:$B221,$B$4),\"\")","v":""},""]
[{"$f":"IF(B222=$B$4,B222&\"_\"&COUNTIF($B$6:$B222,$B$4),\"\")","v":""},""]
[{"$f":"IF(B223=$B$4,B223&\"_\"&COUNTIF($B$6:$B223,$B$4),\"\")","v":""},""]
[{"$f":"IF(B224=$B$4,B224&\"_\"&COUNTIF($B$6:$B224,$B$4),\"\")","v":""},""]
[{"$f":"IF(B225=$B$4,B225&\"_\"&COUNTIF($B$6:$B225,$B$4),\"\")","v":""},""]
[{"$f":"IF(B226=$B$4,B226&\"_\"&COUNTIF($B$6:$B226,$B$4),\"\")","v":""},""]
[{"$f":"IF(B227=$B$4,B227&\"_\"&COUNTIF($B$6:$B227,$B$4),\"\")","v":""},""]
[{"$f":"IF(B228=$B$4,B228&\"_\"&COUNTIF($B$6:$B228,$B$4),\"\")","v":""},""]
[{"$f":"IF(B229=$B$4,B229&\"_\"&COUNTIF($B$6:$B229,$B$4),\"\")","v":""},""]
[{"$f":"IF(B230=$B$4,B230&\"_\"&COUNTIF($B$6:$B230,$B$4),\"\")","v":""},""]
[{"$f":"IF(B231=$B$4,B231&\"_\"&COUNTIF($B$6:$B231,$B$4),\"\")","v":""},""]
[{"$f":"IF(B232=$B$4,B232&\"_\"&COUNTIF($B$6:$B232,$B$4),\"\")","v":""},""]
[{"$f":"IF(B233=$B$4,B233&\"_\"&COUNTIF($B$6:$B233,$B$4),\"\")","v":""},""]
[{"$f":"IF(B234=$B$4,B234&\"_\"&COUNTIF($B$6:$B234,$B$4),\"\")","v":""},""]
[{"$f":"IF(B235=$B$4,B235&\"_\"&COUNTIF($B$6:$B235,$B$4),\"\")","v":""},""]
[{"$f":"IF(B236=$B$4,B236&\"_\"&COUNTIF($B$6:$B236,$B$4),\"\")","v":""},""]
[{"$f":"IF(B237=$B$4,B237&\"_\"&COUNTIF($B$6:$B237,$B$4),\"\")","v":""},""]
[{"$f":"IF(B238=$B$4,B238&\"_\"&COUNTIF($B$6:$B238,$B$4),\"\")","v":""},""]
[{"$f":"IF(B239=$B$4,B239&\"_\"&COUNTIF($B$6:$B239,$B$4),\"\")","v":""},""]
[{"$f":"IF(B240=$B$4,B240&\"_\"&COUNTIF($B$6:$B240,$B$4),\"\")","v":""},""]
[{"$f":"IF(B241=$B$4,B241&\"_\"&COUNTIF($B$6:$B241,$B$4),\"\")","v":""},""]
[{"$f":"IF(B242=$B$4,B242&\"_\"&COUNTIF($B$6:$B242,$B$4),\"\")","v":""},""]
[{"$f":"IF(B243=$B$4,B243&\"_\"&COUNTIF($B$6:$B243,$B$4),\"\")","v":""},""]
[{"$f":"IF(B244=$B$4,B244&\"_\"&COUNTIF($B$6:$B244,$B$4),\"\")","v":""},""]
[{"$f":"IF(B245=$B$4,B245&\"_\"&COUNTIF($B$6:$B245,$B$4),\"\")","v":""},""]
[{"$f":"IF(B246=$B$4,B246&\"_\"&COUNTIF($B$6:$B246,$B$4),\"\")","v":""},""]
[{"$f":"IF(B247=$B$4,B247&\"_\"&COUNTIF($B$6:$B247,$B$4),\"\")","v":""},""]
[{"$f":"IF(B248=$B$4,B248&\"_\"&COUNTIF($B$6:$B248,$B$4),\"\")","v":""},""]
[{"$f":"IF(B249=$B$4,B249&\"_\"&COUNTIF($B$6:$B249,$B$4),\"\")","v":""},""]
[{"$f":"IF(B250=$B$4,B250&\"_\"&COUNTIF($B$6:$B250,$B$4),\"\")","v":""},""]
[{"$f":"IF(B251=$B$4,B251&\"_\"&COUNTIF($B$6:$B251,$B$4),\"\")","v":""},""]
[{"$f":"IF(B252=$B$4,B252&\"_\"&COUNTIF($B$6:$B252,$B$4),\"\")","v":""},""]
[{"$f":"IF(B253=$B$4,B253&\"_\"&COUNTIF($B$6:$B253,$B$4),\"\")","v":""},""]
[{"$f":"IF(B254=$B$4,B254&\"_\"&COUNTIF($B$6:$B254,$B$4),\"\")","v":""},""]
[{"$f":"IF(B255=$B$4,B255&\"_\"&COUNTIF($B$6:$B255,$B$4),\"\")","v":""},""]
[{"$f":"IF(B256=$B$4,B256&\"_\"&COUNTIF($B$6:$B256,$B$4),\"\")","v":""},""]
[{"$f":"IF(B257=$B$4,B257&\"_\"&COUNTIF($B$6:$B257,$B$4),\"\")","v":""},""]
[{"$f":"IF(B258=$B$4,B258&\"_\"&COUNTIF($B$6:$B258,$B$4),\"\")","v":""},""]
[{"$f":"IF(B259=$B$4,B259&\"_\"&COUNTIF($B$6:$B259,$B$4),\"\")","v":""},""]
[{"$f":"IF(B260=$B$4,B260&\"_\"&COUNTIF($B$6:$B260,$B$4),\"\")","v":""},""]
[{"$f":"IF(B261=$B$4,B261&\"_\"&COUNTIF($B$6:$B261,$B$4),\"\")","v":""},""]
[{"$f":"IF(B262=$B$4,B262&\"_\"&COUNTIF($B$6:$B262,$B$4),\"\")","v":""},""]
[{"$f":"IF(B263=$B$4,B263&\"_\"&COUNTIF($B$6:$B263,$B$4),\"\")","v":""},{"$f":"IF(C263=\"\",\"\",\"A partager\")","v":""}]
[{"$f":"IF(B264=$B$4,B264&\"_\"&COUNTIF($B$6:$B264,$B$4),\"\")","v":""},""]
[{"$f":"IF(B265=$B$4,B265&\"_\"&COUNTIF($B$6:$B265,$B$4),\"\")","v":""},""]
[{"$f":"IF(B266=$B$4,B266&\"_\"&COUNTIF($B$6:$B266,$B$4),\"\")","v":""},""]
[{"$f":"IF(B267=$B$4,B267&\"_\"&COUNTIF($B$6:$B267,$B$4),\"\")","v":""},""]
[{"$f":"IF(B268=$B$4,B268&\"_\"&COUNTIF($B$6:$B268,$B$4),\"\")","v":""},""]
[{"$f":"IF(B269=$B$4,B269&\"_\"&COUNTIF($B$6:$B269,$B$4),\"\")","v":""},""]
[{"$f":"IF(B270=$B$4,B270&\"_\"&COUNTIF($B$6:$B270,$B$4),\"\")","v":""},""]
[{"$f":"IF(B271=$B$4,B271&\"_\"&COUNTIF($B$6:$B271,$B$4),\"\")","v":""},""]
[{"$f":"IF(B272=$B$4,B272&\"_\"&COUNTIF($B$6:$B272,$B$4),\"\")","v":""},""]
[{"$f":"IF(B273=$B$4,B273&\"_\"&COUNTIF($B$6:$B273,$B$4),\"\")","v":""},""]
[{"$f":"IF(B274=$B$4,B274&\"_\"&COUNTIF($B$6:$B274,$B$4),\"\")","v":""},""]
[{"$f":"IF(B275=$B$4,B275&\"_\"&COUNTIF($B$6:$B275,$B$4),\"\")","v":""},""]
[{"$f":"IF(B276=$B$4,B276&\"_\"&COUNTIF($B$6:$B276,$B$4),\"\")","v":""},""]
[{"$f":"IF(B277=$B$4,B277&\"_\"&COUNTIF($B$6:$B277,$B$4),\"\")","v":""},""]
[{"$f":"IF(B278=$B$4,B278&\"_\"&COUNTIF($B$6:$B278,$B$4),\"\")","v":""},""]
[{"$f":"IF(B279=$B$4,B279&\"_\"&COUNTIF($B$6:$B279,$B$4),\"\")","v":""},""]
[{"$f":"IF(B280=$B$4,B280&\"_\"&COUNTIF($B$6:$B280,$B$4),\"\")","v":""},""]
[{"$f":"IF(B281=$B$4,B281&\"_\"&COUNTIF($B$6:$B281,$B$4),\"\")","v":""},""]
[{"$f":"IF(B282=$B$4,B282&\"_\"&COUNTIF($B$6:$B282,$B$4),\"\")","v":""},""]
[{"$f":"IF(B283=$B$4,B283&\"_\"&COUNTIF($B$6:$B283,$B$4),\"\")","v":""},""]
[{"$f":"IF(B284=$B$4,B284&\"_\"&COUNTIF($B$6:$B284,$B$4),\"\")","v":""},""]
[{"$f":"IF(B285=$B$4,B285&\"_\"&COUNTIF($B$6:$B285,$B$4),\"\")","v":""},""]
[{"$f":"IF(B286=$B$4,B286&\"_\"&COUNTIF($B$6:$B286,$B$4),\"\")","v":""},""]
[{"$f":"IF(B287=$B$4,B287&\"_\"&COUNTIF($B$6:$B287,$B$4),\"\")","v":""},""]
[{"$f":"IF(B288=$B$4,B288&\"_\"&COUNTIF($B$6:$B288,$B$4),\"\")","v":""},""]
[{"$f":"IF(B289=$B$4,B289&\"_\"&COUNTIF($B$6:$B289,$B$4),\"\")","v":""},""]
[{"$f":"IF(B290=$B$4,B290&\"_\"&COUNTIF($B$6:$B290,$B$4),\"\")","v":""},""]
[{"$f":"IF(B291=$B$4,B291&\"_\"&COUNTIF($B$6:$B291,$B$4),\"\")","v":""},""]
[{"$f":"IF(B292=$B$4,B292&\"_\"&COUNTIF($B$6:$B292,$B$4),\"\")","v":""},""]
[{"$f":"IF(B293=$B$4,B293&\"_\"&COUNTIF($B$6:$B293,$B$4),\"\")","v":""},""]
[{"$f":"IF(B294=$B$4,B294&\"_\"&COUNTIF($B$6:$B294,$B$4),\"\")","v":""},""]
[{"$f":"IF(B295=$B$4,B295&\"_\"&COUNTIF($B$6:$B295,$B$4),\"\")","v":""},""]
[{"$f":"IF(B296=$B$4,B296&\"_\"&COUNTIF($B$6:$B296,$B$4),\"\")","v":""},""]
[{"$f":"IF(B297=$B$4,B297&\"_\"&COUNTIF($B$6:$B297,$B$4),\"\")","v":""},""]
[{"$f":"IF(B298=$B$4,B298&\"_\"&COUNTIF($B$6:$B298,$B$4),\"\")","v":""},""]
[{"$f":"IF(B299=$B$4,B299&\"_\"&COUNTIF($B$6:$B299,$B$4),\"\")","v":""},""]
[{"$f":"IF(B300=$B$4,B300&\"_\"&COUNTIF($B$6:$B300,$B$4),\"\")","v":""},""]
[{"$f":"IF(B301=$B$4,B301&\"_\"&COUNTIF($B$6:$B301,$B$4),\"\")","v":""},""]
[{"$f":"IF(B302=$B$4,B302&\"_\"&COUNTIF($B$6:$B302,$B$4),\"\")","v":""},""]
[{"$f":"IF(B303=$B$4,B303&\"_\"&COUNTIF($B$6:$B303,$B$4),\"\")","v":""},""]
[{"$f":"IF(B304=$B$4,B304&\"_\"&COUNTIF($B$6:$B304,$B$4),\"\")","v":""},""]
[{"$f":"IF(B305=$B$4,B305&\"_\"&COUNTIF($B$6:$B305,$B$4),\"\")","v":""},""]
[{"$f":"IF(B306=$B$4,B306&\"_\"&COUNTIF($B$6:$B306,$B$4),\"\")","v":""},""]
[{"$f":"IF(B307=$B$4,B307&\"_\"&COUNTIF($B$6:$B307,$B$4),\"\")","v":""},""]
[{"$f":"IF(B308=$B$4,B308&\"_\"&COUNTIF($B$6:$B308,$B$4),\"\")","v":""},""]
[{"$f":"IF(B309=$B$4,B309&\"_\"&COUNTIF($B$6:$B309,$B$4),\"\")","v":""},""]
[{"$f":"IF(B310=$B$4,B310&\"_\"&COUNTIF($B$6:$B310,$B$4),\"\")","v":""},""]
[{"$f":"IF(B311=$B$4,B311&\"_\"&COUNTIF($B$6:$B311,$B$4),\"\")","v":""},""]
[{"$f":"IF(B312=$B$4,B312&\"_\"&COUNTIF($B$6:$B312,$B$4),\"\")","v":""},""]
[{"$f":"IF(B313=$B$4,B313&\"_\"&COUNTIF($B$6:$B313,$B$4),\"\")","v":""},""]
[{"$f":"IF(B314=$B$4,B314&\"_\"&COUNTIF($B$6:$B314,$B$4),\"\")","v":""},""]
[{"$f":"IF(B315=$B$4,B315&\"_\"&COUNTIF($B$6:$B315,$B$4),\"\")","v":""},""]
[{"$f":"IF(B316=$B$4,B316&\"_\"&COUNTIF($B$6:$B316,$B$4),\"\")","v":""},""]
[{"$f":"IF(B317=$B$4,B317&\"_\"&COUNTIF($B$6:$B317,$B$4),\"\")","v":""},""]
[{"$f":"IF(B318=$B$4,B318&\"_\"&COUNTIF($B$6:$B318,$B$4),\"\")","v":""},""]
[{"$f":"IF(B319=$B$4,B319&\"_\"&COUNTIF($B$6:$B319,$B$4),\"\")","v":""},""]
[{"$f":"IF(B320=$B$4,B320&\"_\"&COUNTIF($B$6:$B320,$B$4),\"\")","v":""},""]
[{"$f":"IF(B321=$B$4,B321&\"_\"&COUNTIF($B$6:$B321,$B$4),\"\")","v":""},""]
[{"$f":"IF(B322=$B$4,B322&\"_\"&COUNTIF($B$6:$B322,$B$4),\"\")","v":""},""]
[{"$f":"IF(B323=$B$4,B323&\"_\"&COUNTIF($B$6:$B323,$B$4),\"\")","v":""},""]
[{"$f":"IF(B324=$B$4,B324&\"_\"&COUNTIF($B$6:$B324,$B$4),\"\")","v":""},""]
[{"$f":"IF(B325=$B$4,B325&\"_\"&COUNTIF($B$6:$B325,$B$4),\"\")","v":""},""]
[{"$f":"IF(B326=$B$4,B326&\"_\"&COUNTIF($B$6:$B326,$B$4),\"\")","v":""},""]
[{"$f":"IF(B327=$B$4,B327&\"_\"&COUNTIF($B$6:$B327,$B$4),\"\")","v":""},{"$f":"IF(C327=\"\",\"\",\"A partager\")","v":""}]
[{"$f":"IF(B328=$B$4,B328&\"_\"&COUNTIF($B$6:$B328,$B$4),\"\")","v":""},""]
[{"$f":"IF(B329=$B$4,B329&\"_\"&COUNTIF($B$6:$B329,$B$4),\"\")","v":""},""]
[{"$f":"IF(B330=$B$4,B330&\"_\"&COUNTIF($B$6:$B330,$B$4),\"\")","v":""},""]
[{"$f":"IF(B331=$B$4,B331&\"_\"&COUNTIF($B$6:$B331,$B$4),\"\")","v":""},""]
[{"$f":"IF(B332=$B$4,B332&\"_\"&COUNTIF($B$6:$B332,$B$4),\"\")","v":""},""]
[{"$f":"IF(B333=$B$4,B333&\"_\"&COUNTIF($B$6:$B333,$B$4),\"\")","v":""},""]
[{"$f":"IF(B334=$B$4,B334&\"_\"&COUNTIF($B$6:$B334,$B$4),\"\")","v":""},""]
[{"$f":"IF(B335=$B$4,B335&\"_\"&COUNTIF($B$6:$B335,$B$4),\"\")","v":""},""]
[{"$f":"IF(B336=$B$4,B336&\"_\"&COUNTIF($B$6:$B336,$B$4),\"\")","v":""},""]
[{"$f":"IF(B337=$B$4,B337&\"_\"&COUNTIF($B$6:$B337,$B$4),\"\")","v":""},""]
[{"$f":"IF(B338=$B$4,B338&\"_\"&COUNTIF($B$6:$B338,$B$4),\"\")","v":""},""]
[{"$f":"IF(B339=$B$4,B339&\"_\"&COUNTIF($B$6:$B339,$B$4),\"\")","v":""},""]
[{"$f":"IF(B340=$B$4,B340&\"_\"&COUNTIF($B$6:$B340,$B$4),\"\")","v":""},""]
[{"$f":"IF(B341=$B$4,B341&\"_\"&COUNTIF($B$6:$B341,$B$4),\"\")","v":""},""]
[{"$f":"IF(B342=$B$4,B342&\"_\"&COUNTIF($B$6:$B342,$B$4),\"\")","v":""},""]
[{"$f":"IF(B343=$B$4,B343&\"_\"&COUNTIF($B$6:$B343,$B$4),\"\")","v":""},""]
[{"$f":"IF(B344=$B$4,B344&\"_\"&COUNTIF($B$6:$B344,$B$4),\"\")","v":""},""]
[{"$f":"IF(B345=$B$4,B345&\"_\"&COUNTIF($B$6:$B345,$B$4),\"\")","v":""},""]
[{"$f":"IF(B346=$B$4,B346&\"_\"&COUNTIF($B$6:$B346,$B$4),\"\")","v":""},""]
[{"$f":"IF(B347=$B$4,B347&\"_\"&COUNTIF($B$6:$B347,$B$4),\"\")","v":""},""]
[{"$f":"IF(B348=$B$4,B348&\"_\"&COUNTIF($B$6:$B348,$B$4),\"\")","v":""},""]
[{"$f":"IF(B349=$B$4,B349&\"_\"&COUNTIF($B$6:$B349,$B$4),\"\")","v":""},""]
[{"$f":"IF(B350=$B$4,B350&\"_\"&COUNTIF($B$6:$B350,$B$4),\"\")","v":""},""]
[{"$f":"IF(B351=$B$4,B351&\"_\"&COUNTIF($B$6:$B351,$B$4),\"\")","v":""},""]
[{"$f":"IF(B352=$B$4,B352&\"_\"&COUNTIF($B$6:$B352,$B$4),\"\")","v":""},""]
[{"$f":"IF(B353=$B$4,B353&\"_\"&COUNTIF($B$6:$B353,$B$4),\"\")","v":""},""]
[{"$f":"IF(B354=$B$4,B354&\"_\"&COUNTIF($B$6:$B354,$B$4),\"\")","v":""},""]
[{"$f":"IF(B355=$B$4,B355&\"_\"&COUNTIF($B$6:$B355,$B$4),\"\")","v":""},""]
[{"$f":"IF(B356=$B$4,B356&\"_\"&COUNTIF($B$6:$B356,$B$4),\"\")","v":""},""]
[{"$f":"IF(B357=$B$4,B357&\"_\"&COUNTIF($B$6:$B357,$B$4),\"\")","v":""},""]
[{"$f":"IF(B358=$B$4,B358&\"_\"&COUNTIF($B$6:$B358,$B$4),\"\")","v":""},""]
[{"$f":"IF(B359=$B$4,B359&\"_\"&COUNTIF($B$6:$B359,$B$4),\"\")","v":""},""]
[{"$f":"IF(B360=$B$4,B360&\"_\"&COUNTIF($B$6:$B360,$B$4),\"\")","v":""},""]
[{"$f":"IF(B361=$B$4,B361&\"_\"&COUNTIF($B$6:$B361,$B$4),\"\")","v":""},""]
[{"$f":"IF(B362=$B$4,B362&\"_\"&COUNTIF($B$6:$B362,$B$4),\"\")","v":""},""]
[{"$f":"IF(B363=$B$4,B363&\"_\"&COUNTIF($B$6:$B363,$B$4),\"\")","v":""},""]
[{"$f":"IF(B364=$B$4,B364&\"_\"&COUNTIF($B$6:$B364,$B$4),\"\")","v":""},""]
[{"$f":"IF(B365=$B$4,B365&\"_\"&COUNTIF($B$6:$B365,$B$4),\"\")","v":""},""]
[{"$f":"IF(B366=$B$4,B366&\"_\"&COUNTIF($B$6:$B366,$B$4),\"\")","v":""},""]
[{"$f":"IF(B367=$B$4,B367&\"_\"&COUNTIF($B$6:$B367,$B$4),\"\")","v":""},""]
[{"$f":"IF(B368=$B$4,B368&\"_\"&COUNTIF($B$6:$B368,$B$4),\"\")","v":""},""]
[{"$f":"IF(B369=$B$4,B369&\"_\"&COUNTIF($B$6:$B369,$B$4),\"\")","v":""},""]
[{"$f":"IF(B370=$B$4,B370&\"_\"&COUNTIF($B$6:$B370,$B$4),\"\")","v":""},""]
[{"$f":"IF(B371=$B$4,B371&\"_\"&COUNTIF($B$6:$B371,$B$4),\"\")","v":""},""]
[{"$f":"IF(B372=$B$4,B372&\"_\"&COUNTIF($B$6:$B372,$B$4),\"\")","v":""},""]
[{"$f":"IF(B373=$B$4,B373&\"_\"&COUNTIF($B$6:$B373,$B$4),\"\")","v":""},""]
[{"$f":"IF(B374=$B$4,B374&\"_\"&COUNTIF($B$6:$B374,$B$4),\"\")","v":""},""]
[{"$f":"IF(B375=$B$4,B375&\"_\"&COUNTIF($B$6:$B375,$B$4),\"\")","v":""},""]
[{"$f":"IF(B376=$B$4,B376&\"_\"&COUNTIF($B$6:$B376,$B$4),\"\")","v":""},""]
[{"$f":"IF(B377=$B$4,B377&\"_\"&COUNTIF($B$6:$B377,$B$4),\"\")","v":""},""]
[{"$f":"IF(B378=$B$4,B378&\"_\"&COUNTIF($B$6:$B378,$B$4),\"\")","v":""},""]
[{"$f":"IF(B379=$B$4,B379&\"_\"&COUNTIF($B$6:$B379,$B$4),\"\")","v":""},""]
[{"$f":"IF(B380=$B$4,B380&\"_\"&COUNTIF($B$6:$B380,$B$4),\"\")","v":""},""]
[{"$f":"IF(B381=$B$4,B381&\"_\"&COUNTIF($B$6:$B381,$B$4),\"\")","v":""},""]
[{"$f":"IF(B382=$B$4,B382&\"_\"&COUNTIF($B$6:$B382,$B$4),\"\")","v":""},""]
[{"$f":"IF(B383=$B$4,B383&\"_\"&COUNTIF($B$6:$B383,$B$4),\"\")","v":""},""]
[{"$f":"IF(B384=$B$4,B384&\"_\"&COUNTIF($B$6:$B384,$B$4),\"\")","v":""},""]
[{"$f":"IF(B385=$B$4,B385&\"_\"&COUNTIF($B$6:$B385,$B$4),\"\")","v":""},""]
[{"$f":"IF(B386=$B$4,B386&\"_\"&COUNTIF($B$6:$B386,$B$4),\"\")","v":""},""]
[{"$f":"IF(B387=$B$4,B387&\"_\"&COUNTIF($B$6:$B387,$B$4),\"\")","v":""},""]
[{"$f":"IF(B388=$B$4,B388&\"_\"&COUNTIF($B$6:$B388,$B$4),\"\")","v":""},""]
[{"$f":"IF(B389=$B$4,B389&\"_\"&COUNTIF($B$6:$B389,$B$4),\"\")","v":""},""]
[{"$f":"IF(B390=$B$4,B390&\"_\"&COUNTIF($B$6:$B390,$B$4),\"\")","v":""},""]
[{"$f":"IF(B391=$B$4,B391&\"_\"&COUNTIF($B$6:$B391,$B$4),\"\")","v":""},{"$f":"IF(C391=\"\",\"\",\"A partager\")","v":""}]
[{"$f":"IF(B392=$B$4,B392&\"_\"&COUNTIF($B$6:$B392,$B$4),\"\")","v":""},""]
[{"$f":"IF(B393=$B$4,B393&\"_\"&COUNTIF($B$6:$B393,$B$4),\"\")","v":""},""]
[{"$f":"IF(B394=$B$4,B394&\"_\"&COUNTIF($B$6:$B394,$B$4),\"\")","v":""},""]
[{"$f":"IF(B395=$B$4,B395&\"_\"&COUNTIF($B$6:$B395,$B$4),\"\")","v":""},""]
[{"$f":"IF(B396=$B$4,B396&\"_\"&COUNTIF($B$6:$B396,$B$4),\"\")","v":""},""]
[{"$f":"IF(B397=$B$4,B397&\"_\"&COUNTIF($B$6:$B397,$B$4),\"\")","v":""},""]
[{"$f":"IF(B398=$B$4,B398&\"_\"&COUNTIF($B$6:$B398,$B$4),\"\")","v":""},""]
[{"$f":"IF(B399=$B$4,B399&\"_\"&COUNTIF($B$6:$B399,$B$4),\"\")","v":""},""]
[{"$f":"IF(B400=$B$4,B400&\"_\"&COUNTIF($B$6:$B400,$B$4),\"\")","v":""},""]
[{"$f":"IF(B401=$B$4,B401&\"_\"&COUNTIF($B$6:$B401,$B$4),\"\")","v":""},""]
[{"$f":"IF(B402=$B$4,B402&\"_\"&COUNTIF($B$6:$B402,$B$4),\"\")","v":""},""]
[{"$f":"IF(B403=$B$4,B403&\"_\"&COUNTIF($B$6:$B403,$B$4),\"\")","v":""},""]
[{"$f":"IF(B404=$B$4,B404&\"_\"&COUNTIF($B$6:$B404,$B$4),\"\")","v":""},""]
[{"$f":"IF(B405=$B$4,B405&\"_\"&COUNTIF($B$6:$B405,$B$4),\"\")","v":""},""]
[{"$f":"IF(B406=$B$4,B406&\"_\"&COUNTIF($B$6:$B406,$B$4),\"\")","v":""},""]
[{"$f":"IF(B407=$B$4,B407&\"_\"&COUNTIF($B$6:$B407,$B$4),\"\")","v":""},""]
[{"$f":"IF(B408=$B$4,B408&\"_\"&COUNTIF($B$6:$B408,$B$4),\"\")","v":""},""]
[{"$f":"IF(B409=$B$4,B409&\"_\"&COUNTIF($B$6:$B409,$B$4),\"\")","v":""},""]
[{"$f":"IF(B410=$B$4,B410&\"_\"&COUNTIF($B$6:$B410,$B$4),\"\")","v":""},""]
[{"$f":"IF(B411=$B$4,B411&\"_\"&COUNTIF($B$6:$B411,$B$4),\"\")","v":""},""]
[{"$f":"IF(B412=$B$4,B412&\"_\"&COUNTIF($B$6:$B412,$B$4),\"\")","v":""},""]
[{"$f":"IF(B413=$B$4,B413&\"_\"&COUNTIF($B$6:$B413,$B$4),\"\")","v":""},""]
[{"$f":"IF(B414=$B$4,B414&\"_\"&COUNTIF($B$6:$B414,$B$4),\"\")","v":""},""]
[{"$f":"IF(B415=$B$4,B415&\"_\"&COUNTIF($B$6:$B415,$B$4),\"\")","v":""},""]
[{"$f":"IF(B416=$B$4,B416&\"_\"&COUNTIF($B$6:$B416,$B$4),\"\")","v":""},""]
[{"$f":"IF(B417=$B$4,B417&\"_\"&COUNTIF($B$6:$B417,$B$4),\"\")","v":""},""]
[{"$f":"IF(B418=$B$4,B418&\"_\"&COUNTIF($B$6:$B418,$B$4),\"\")","v":""},""]
[{"$f":"IF(B419=$B$4,B419&\"_\"&COUNTIF($B$6:$B419,$B$4),\"\")","v":""},""]
[{"$f":"IF(B420=$B$4,B420&\"_\"&COUNTIF($B$6:$B420,$B$4),\"\")","v":""},""]
[{"$f":"IF(B421=$B$4,B421&\"_\"&COUNTIF($B$6:$B421,$B$4),\"\")","v":""},""]
[{"$f":"IF(B422=$B$4,B422&\"_\"&COUNTIF($B$6:$B422,$B$4),\"\")","v":""},""]
[{"$f":"IF(B423=$B$4,B423&\"_\"&COUNTIF($B$6:$B423,$B$4),\"\")","v":""},""]
[{"$f":"IF(B424=$B$4,B424&\"_\"&COUNTIF($B$6:$B424,$B$4),\"\")","v":""},""]
[{"$f":"IF(B425=$B$4,B425&\"_\"&COUNTIF($B$6:$B425,$B$4),\"\")","v":""},""]
[{"$f":"IF(B426=$B$4,B426&\"_\"&COUNTIF($B$6:$B426,$B$4),\"\")","v":""},""]
[{"$f":"IF(B427=$B$4,B427&\"_\"&COUNTIF($B$6:$B427,$B$4),\"\")","v":""},""]
[{"$f":"IF(B428=$B$4,B428&\"_\"&COUNTIF($B$6:$B428,$B$4),\"\")","v":""},""]
[{"$f":"IF(B429=$B$4,B429&\"_\"&COUNTIF($B$6:$B429,$B$4),\"\")","v":""},""]
[{"$f":"IF(B430=$B$4,B430&\"_\"&COUNTIF($B$6:$B430,$B$4),\"\")","v":""},""]
[{"$f":"IF(B431=$B$4,B431&\"_\"&COUNTIF($B$6:$B431,$B$4),\"\")","v":""},""]
[{"$f":"IF(B432=$B$4,B432&\"_\"&COUNTIF($B$6:$B432,$B$4),\"\")","v":""},""]
[{"$f":"IF(B433=$B$4,B433&\"_\"&COUNTIF($B$6:$B433,$B$4),\"\")","v":""},""]
[{"$f":"IF(B434=$B$4,B434&\"_\"&COUNTIF($B$6:$B434,$B$4),\"\")","v":""},""]
[{"$f":"IF(B435=$B$4,B435&\"_\"&COUNTIF($B$6:$B435,$B$4),\"\")","v":""},""]
[{"$f":"IF(B436=$B$4,B436&\"_\"&COUNTIF($B$6:$B436,$B$4),\"\")","v":""},""]
[{"$f":"IF(B437=$B$4,B437&\"_\"&COUNTIF($B$6:$B437,$B$4),\"\")","v":""},""]
[{"$f":"IF(B438=$B$4,B438&\"_\"&COUNTIF($B$6:$B438,$B$4),\"\")","v":""},""]
[{"$f":"IF(B439=$B$4,B439&\"_\"&COUNTIF($B$6:$B439,$B$4),\"\")","v":""},""]
[{"$f":"IF(B440=$B$4,B440&\"_\"&COUNTIF($B$6:$B440,$B$4),\"\")","v":""},""]
[{"$f":"IF(B441=$B$4,B441&\"_\"&COUNTIF($B$6:$B441,$B$4),\"\")","v":""},""]
[{"$f":"IF(B442=$B$4,B442&\"_\"&COUNTIF($B$6:$B442,$B$4),\"\")","v":""},""]
[{"$f":"IF(B443=$B$4,B443&\"_\"&COUNTIF($B$6:$B443,$B$4),\"\")","v":""},""]
[{"$f":"IF(B444=$B$4,B444&\"_\"&COUNTIF($B$6:$B444,$B$4),\"\")","v":""},""]
[{"$f":"IF(B445=$B$4,B445&\"_\"&COUNTIF($B$6:$B445,$B$4),\"\")","v":""},""]
[{"$f":"IF(B446=$B$4,B446&\"_\"&COUNTIF($B$6:$B446,$B$4),\"\")","v":""},""]
[{"$f":"IF(B447=$B$4,B447&\"_\"&COUNTIF($B$6:$B447,$B$4),\"\")","v":""},""]
[{"$f":"IF(B448=$B$4,B448&\"_\"&COUNTIF($B$6:$B448,$B$4),\"\")","v":""},""]
[{"$f":"IF(B449=$B$4,B449&\"_\"&COUNTIF($B$6:$B449,$B$4),\"\")","v":""},""]
[{"$f":"IF(B450=$B$4,B450&\"_\"&COUNTIF($B$6:$B450,$B$4),\"\")","v":""},""]
[{"$f":"IF(B451=$B$4,B451&\"_\"&COUNTIF($B$6:$B451,$B$4),\"\")","v":""},""]
[{"$f":"IF(B452=$B$4,B452&\"_\"&COUNTIF($B$6:$B452,$B$4),\"\")","v":""},""]
[{"$f":"IF(B453=$B$4,B453&\"_\"&COUNTIF($B$6:$B453,$B$4),\"\")","v":""},""]
[{"$f":"IF(B454=$B$4,B454&\"_\"&COUNTIF($B$6:$B454,$B$4),\"\")","v":""},""]
[{"$f":"IF(B455=$B$4,B455&\"_\"&COUNTIF($B$6:$B455,$B$4),\"\")","v":""},{"$f":"IF(C455=\"\",\"\",\"A partager\")","v":""}]
[{"$f":"IF(B456=$B$4,B456&\"_\"&COUNTIF($B$6:$B456,$B$4),\"\")","v":""},""]
[{"$f":"IF(B457=$B$4,B457&\"_\"&COUNTIF($B$6:$B457,$B$4),\"\")","v":""},""]
[{"$f":"IF(B458=$B$4,B458&\"_\"&COUNTIF($B$6:$B458,$B$4),\"\")","v":""},""]
[{"$f":"IF(B459=$B$4,B459&\"_\"&COUNTIF($B$6:$B459,$B$4),\"\")","v":""},""]
[{"$f":"IF(B460=$B$4,B460&\"_\"&COUNTIF($B$6:$B460,$B$4),\"\")","v":""},""]
[{"$f":"IF(B461=$B$4,B461&\"_\"&COUNTIF($B$6:$B461,$B$4),\"\")","v":""},""]
[{"$f":"IF(B462=$B$4,B462&\"_\"&COUNTIF($B$6:$B462,$B$4),\"\")","v":""},""]
[{"$f":"IF(B463=$B$4,B463&\"_\"&COUNTIF($B$6:$B463,$B$4),\"\")","v":""},""]
[{"$f":"IF(B464=$B$4,B464&\"_\"&COUNTIF($B$6:$B464,$B$4),\"\")","v":""},""]
[{"$f":"IF(B465=$B$4,B465&\"_\"&COUNTIF($B$6:$B465,$B$4),\"\")","v":""},""]
[{"$f":"IF(B466=$B$4,B466&\"_\"&COUNTIF($B$6:$B466,$B$4),\"\")","v":""},""]
[{"$f":"IF(B467=$B$4,B467&\"_\"&COUNTIF($B$6:$B467,$B$4),\"\")","v":""},""]
[{"$f":"IF(B468=$B$4,B468&\"_\"&COUNTIF($B$6:$B468,$B$4),\"\")","v":""},""]
[{"$f":"IF(B469=$B$4,B469&\"_\"&COUNTIF($B$6:$B469,$B$4),\"\")","v":""},""]
[{"$f":"IF(B470=$B$4,B470&\"_\"&COUNTIF($B$6:$B470,$B$4),\"\")","v":""},""]
[{"$f":"IF(B471=$B$4,B471&\"_\"&COUNTIF($B$6:$B471,$B$4),\"\")","v":""},""]
[{"$f":"IF(B472=$B$4,B472&\"_\"&COUNTIF($B$6:$B472,$B$4),\"\")","v":""},""]
[{"$f":"IF(B473=$B$4,B473&\"_\"&COUNTIF($B$6:$B473,$B$4),\"\")","v":""},""]
[{"$f":"IF(B474=$B$4,B474&\"_\"&COUNTIF($B$6:$B474,$B$4),\"\")","v":""},""]
[{"$f":"IF(B475=$B$4,B475&\"_\"&COUNTIF($B$6:$B475,$B$4),\"\")","v":""},""]
[{"$f":"IF(B476=$B$4,B476&\"_\"&COUNTIF($B$6:$B476,$B$4),\"\")","v":""},""]
[{"$f":"IF(B477=$B$4,B477&\"_\"&COUNTIF($B$6:$B477,$B$4),\"\")","v":""},""]
[{"$f":"IF(B478=$B$4,B478&\"_\"&COUNTIF($B$6:$B478,$B$4),\"\")","v":""},""]
[{"$f":"IF(B479=$B$4,B479&\"_\"&COUNTIF($B$6:$B479,$B$4),\"\")","v":""},""]
[{"$f":"IF(B480=$B$4,B480&\"_\"&COUNTIF($B$6:$B480,$B$4),\"\")","v":""},""]
[{"$f":"IF(B481=$B$4,B481&\"_\"&COUNTIF($B$6:$B481,$B$4),\"\")","v":""},""]
[{"$f":"IF(B482=$B$4,B482&\"_\"&COUNTIF($B$6:$B482,$B$4),\"\")","v":""},""]
[{"$f":"IF(B483=$B$4,B483&\"_\"&COUNTIF($B$6:$B483,$B$4),\"\")","v":""},""]
[{"$f":"IF(B484=$B$4,B484&\"_\"&COUNTIF($B$6:$B484,$B$4),\"\")","v":""},""]
[{"$f":"IF(B485=$B$4,B485&\"_\"&COUNTIF($B$6:$B485,$B$4),\"\")","v":""},""]
[{"$f":"IF(B486=$B$4,B486&\"_\"&COUNTIF($B$6:$B486,$B$4),\"\")","v":""},""]
[{"$f":"IF(B487=$B$4,B487&\"_\"&COUNTIF($B$6:$B487,$B$4),\"\")","v":""},""]
[{"$f":"IF(B488=$B$4,B488&\"_\"&COUNTIF($B$6:$B488,$B$4),\"\")","v":""},""]
[{"$f":"IF(B489=$B$4,B489&\"_\"&COUNTIF($B$6:$B489,$B$4),\"\")","v":""},""]
[{"$f":"IF(B490=$B$4,B490&\"_\"&COUNTIF($B$6:$B490,$B$4),\"\")","v":""},""]
[{"$f":"IF(B491=$B$4,B491&\"_\"&COUNTIF($B$6:$B491,$B$4),\"\")","v":""},""]
[{"$f":"IF(B492=$B$4,B492&\"_\"&COUNTIF($B$6:$B492,$B$4),\"\")","v":""},""]
[{"$f":"IF(B493=$B$4,B493&\"_\"&COUNTIF($B$6:$B493,$B$4),\"\")","v":""},""]
[{"$f":"IF(B494=$B$4,B494&\"_\"&COUNTIF($B$6:$B494,$B$4),\"\")","v":""},""]
[{"$f":"IF(B495=$B$4,B495&\"_\"&COUNTIF($B$6:$B495,$B$4),\"\")","v":""},""]
[{"$f":"IF(B496=$B$4,B496&\"_\"&COUNTIF($B$6:$B496,$B$4),\"\")","v":""},""]
[{"$f":"IF(B497=$B$4,B497&\"_\"&COUNTIF($B$6:$B497,$B$4),\"\")","v":""},""]
[{"$f":"IF(B498=$B$4,B498&\"_\"&COUNTIF($B$6:$B498,$B$4),\"\")","v":""},""]
[{"$f":"IF(B499=$B$4,B499&\"_\"&COUNTIF($B$6:$B499,$B$4),\"\")","v":""},""]
[{"$f":"IF(B500=$B$4,B500&\"_\"&COUNTIF($B$6:$B500,$B$4),\"\")","v":""},""]
[{"$f":"IF(B501=$B$4,B501&\"_\"&COUNTIF($B$6:$B501,$B$4),\"\")","v":""},""]
[{"$f":"IF(B502=$B$4,B502&\"_\"&COUNTIF($B$6:$B502,$B$4),\"\")","v":""},""]
[{"$f":"IF(B503=$B$4,B503&\"_\"&COUNTIF($B$6:$B503,$B$4),\"\")","v":""},""]
[{"$f":"IF(B504=$B$4,B504&\"_\"&COUNTIF($B$6:$B504,$B$4),\"\")","v":""},""]
[{"$f":"IF(B505=$B$4,B505&\"_\"&COUNTIF($B$6:$B505,$B$4),\"\")","v":""},""]
[{"$f":"IF(B506=$B$4,B506&\"_\"&COUNTIF($B$6:$B506,$B$4),\"\")","v":""},""]
[{"$f":"IF(B507=$B$4,B507&\"_\"&COUNTIF($B$6:$B507,$B$4),\"\")","v":""},""]
[{"$f":"IF(B508=$B$4,B508&\"_\"&COUNTIF($B$6:$B508,$B$4),\"\")","v":""},""]
[{"$f":"IF(B509=$B$4,B509&\"_\"&COUNTIF($B$6:$B509,$B$4),\"\")","v":""},""]
[{"$f":"IF(B510=$B$4,B510&\"_\"&COUNTIF($B$6:$B510,$B$4),\"\")","v":""},""]
[{"$f":"IF(B511=$B$4,B511&\"_\"&COUNTIF($B$6:$B511,$B$4),\"\")","v":""},""]
[{"$f":"IF(B512=$B$4,B512&\"_\"&COUNTIF($B$6:$B512,$B$4),\"\")","v":""},""]
[{"$f":"IF(B513=$B$4,B513&\"_\"&COUNTIF($B$6:$B513,$B$4),\"\")","v":""},""]
[{"$f":"IF(B514=$B$4,B514&\"_\"&COUNTIF($B$6:$B514,$B$4),\"\")","v":""},""]
[{"$f":"IF(B515=$B$4,B515&\"_\"&COUNTIF($B$6:$B515,$B$4),\"\")","v":""},""]
[{"$f":"IF(B516=$B$4,B516&\"_\"&COUNTIF($B$6:$B516,$B$4),\"\")","v":""},""]
[{"$f":"IF(B517=$B$4,B517&\"_\"&COUNTIF($B$6:$B517,$B$4),\"\")","v":""},""]
[{"$f":"IF(B518=$B$4,B518&\"_\"&COUNTIF($B$6:$B518,$B$4),\"\")","v":""},""]
[{"$f":"IF(B519=$B$4,B519&\"_\"&COUNTIF($B$6:$B519,$B$4),\"\")","v":""},{"$f":"IF(C519=\"\",\"\",\"A partager\")","v":""}]
[{"$f":"IF(B520=$B$4,B520&\"_\"&COUNTIF($B$6:$B520,$B$4),\"\")","v":""},""]
[{"$f":"IF(B521=$B$4,B521&\"_\"&COUNTIF($B$6:$B521,$B$4),\"\")","v":""},""]
[{"$f":"IF(B522=$B$4,B522&\"_\"&COUNTIF($B$6:$B522,$B$4),\"\")","v":""},""]
[{"$f":"IF(B523=$B$4,B523&\"_\"&COUNTIF($B$6:$B523,$B$4),\"\")","v":""},""]
[{"$f":"IF(B524=$B$4,B524&\"_\"&COUNTIF($B$6:$B524,$B$4),\"\")","v":""},""]
[{"$f":"IF(B525=$B$4,B525&\"_\"&COUNTIF($B$6:$B525,$B$4),\"\")","v":""},""]
[{"$f":"IF(B526=$B$4,B526&\"_\"&COUNTIF($B$6:$B526,$B$4),\"\")","v":""},""]
[{"$f":"IF(B527=$B$4,B527&\"_\"&COUNTIF($B$6:$B527,$B$4),\"\")","v":""},""]
[{"$f":"IF(B528=$B$4,B528&\"_\"&COUNTIF($B$6:$B528,$B$4),\"\")","v":""},""]
[{"$f":"IF(B529=$B$4,B529&\"_\"&COUNTIF($B$6:$B529,$B$4),\"\")","v":""},""]
[{"$f":"IF(B530=$B$4,B530&\"_\"&COUNTIF($B$6:$B530,$B$4),\"\")","v":""},""]
[{"$f":"IF(B531=$B$4,B531&\"_\"&COUNTIF($B$6:$B531,$B$4),\"\")","v":""},""]
[{"$f":"IF(B532=$B$4,B532&\"_\"&COUNTIF($B$6:$B532,$B$4),\"\")","v":""},""]
[{"$f":"IF(B533=$B$4,B533&\"_\"&COUNTIF($B$6:$B533,$B$4),\"\")","v":""},""]
[{"$f":"IF(B534=$B$4,B534&\"_\"&COUNTIF($B$6:$B534,$B$4),\"\")","v":""},""]
[{"$f":"IF(B535=$B$4,B535&\"_\"&COUNTIF($B$6:$B535,$B$4),\"\")","v":""},""]
[{"$f":"IF(B536=$B$4,B536&\"_\"&COUNTIF($B$6:$B536,$B$4),\"\")","v":""},""]
[{"$f":"IF(B537=$B$4,B537&\"_\"&COUNTIF($B$6:$B537,$B$4),\"\")","v":""},""]
[{"$f":"IF(B538=$B$4,B538&\"_\"&COUNTIF($B$6:$B538,$B$4),\"\")","v":""},""]
[{"$f":"IF(B539=$B$4,B539&\"_\"&COUNTIF($B$6:$B539,$B$4),\"\")","v":""},""]
[{"$f":"IF(B540=$B$4,B540&\"_\"&COUNTIF($B$6:$B540,$B$4),\"\")","v":""},""]
[{"$f":"IF(B541=$B$4,B541&\"_\"&COUNTIF($B$6:$B541,$B$4),\"\")","v":""},""]
[{"$f":"IF(B542=$B$4,B542&\"_\"&COUNTIF($B$6:$B542,$B$4),\"\")","v":""},""]
[{"$f":"IF(B543=$B$4,B543&\"_\"&COUNTIF($B$6:$B543,$B$4),\"\")","v":""},""]
[{"$f":"IF(B544=$B$4,B544&\"_\"&COUNTIF($B$6:$B544,$B$4),\"\")","v":""},""]
[{"$f":"IF(B545=$B$4,B545&\"_\"&COUNTIF($B$6:$B545,$B$4),\"\")","v":""},""]
[{"$f":"IF(B546=$B$4,B546&\"_\"&COUNTIF($B$6:$B546,$B$4),\"\")","v":""},""]
[{"$f":"IF(B547=$B$4,B547&\"_\"&COUNTIF($B$6:$B547,$B$4),\"\")","v":""},""]
[{"$f":"IF(B548=$B$4,B548&\"_\"&COUNTIF($B$6:$B548,$B$4),\"\")","v":""},""]
[{"$f":"IF(B549=$B$4,B549&\"_\"&COUNTIF($B$6:$B549,$B$4),\"\")","v":""},""]
[{"$f":"IF(B550=$B$4,B550&\"_\"&COUNTIF($B$6:$B550,$B$4),\"\")","v":""},""]
[{"$f":"IF(B551=$B$4,B551&\"_\"&COUNTIF($B$6:$B551,$B$4),\"\")","v":""},""]
[{"$f":"IF(B552=$B$4,B552&\"_\"&COUNTIF($B$6:$B552,$B$4),\"\")","v":""},""]
[{"$f":"IF(B553=$B$4,B553&\"_\"&COUNTIF($B$6:$B553,$B$4),\"\")","v":""},""]
[{"$f":"IF(B554=$B$4,B554&\"_\"&COUNTIF($B$6:$B554,$B$4),\"\")","v":""},""]
[{"$f":"IF(B555=$B$4,B555&\"_\"&COUNTIF($B$6:$B555,$B$4),\"\")","v":""},""]
[{"$f":"IF(B556=$B$4,B556&\"_\"&COUNTIF($B$6:$B556,$B$4),\"\")","v":""},""]
[{"$f":"IF(B557=$B$4,B557&\"_\"&COUNTIF($B$6:$B557,$B$4),\"\")","v":""},""]
[{"$f":"IF(B558=$B$4,B558&\"_\"&COUNTIF($B$6:$B558,$B$4),\"\")","v":""},""]
[{"$f":"IF(B559=$B$4,B559&\"_\"&COUNTIF($B$6:$B559,$B$4),\"\")","v":""},""]
[{"$f":"IF(B560=$B$4,B560&\"_\"&COUNTIF($B$6:$B560,$B$4),\"\")","v":""},""]
[{"$f":"IF(B561=$B$4,B561&\"_\"&COUNTIF($B$6:$B561,$B$4),\"\")","v":""},""]
[{"$f":"IF(B562=$B$4,B562&\"_\"&COUNTIF($B$6:$B562,$B$4),\"\")","v":""},""]
[{"$f":"IF(B563=$B$4,B563&\"_\"&COUNTIF($B$6:$B563,$B$4),\"\")","v":""},""]
[{"$f":"IF(B564=$B$4,B564&\"_\"&COUNTIF($B$6:$B564,$B$4),\"\")","v":""},""]
[{"$f":"IF(B565=$B$4,B565&\"_\"&COUNTIF($B$6:$B565,$B$4),\"\")","v":""},""]
[{"$f":"IF(B566=$B$4,B566&\"_\"&COUNTIF($B$6:$B566,$B$4),\"\")","v":""},""]
[{"$f":"IF(B567=$B$4,B567&\"_\"&COUNTIF($B$6:$B567,$B$4),\"\")","v":""},""]
[{"$f":"IF(B568=$B$4,B568&\"_\"&COUNTIF($B$6:$B568,$B$4),\"\")","v":""},""]
[{"$f":"IF(B569=$B$4,B569&\"_\"&COUNTIF($B$6:$B569,$B$4),\"\")","v":""},""]
[{"$f":"IF(B570=$B$4,B570&\"_\"&COUNTIF($B$6:$B570,$B$4),\"\")","v":""},""]
[{"$f":"IF(B571=$B$4,B571&\"_\"&COUNTIF($B$6:$B571,$B$4),\"\")","v":""},""]
[{"$f":"IF(B572=$B$4,B572&\"_\"&COUNTIF($B$6:$B572,$B$4),\"\")","v":""},""]
[{"$f":"IF(B573=$B$4,B573&\"_\"&COUNTIF($B$6:$B573,$B$4),\"\")","v":""},""]
[{"$f":"IF(B574=$B$4,B574&\"_\"&COUNTIF($B$6:$B574,$B$4),\"\")","v":""},""]
[{"$f":"IF(B575=$B$4,B575&\"_\"&COUNTIF($B$6:$B575,$B$4),\"\")","v":""},""]
[{"$f":"IF(B576=$B$4,B576&\"_\"&COUNTIF($B$6:$B576,$B$4),\"\")","v":""},""]
[{"$f":"IF(B577=$B$4,B577&\"_\"&COUNTIF($B$6:$B577,$B$4),\"\")","v":""},""]
[{"$f":"IF(B578=$B$4,B578&\"_\"&COUNTIF($B$6:$B578,$B$4),\"\")","v":""},""]
[{"$f":"IF(B579=$B$4,B579&\"_\"&COUNTIF($B$6:$B579,$B$4),\"\")","v":""},""]
[{"$f":"IF(B580=$B$4,B580&\"_\"&COUNTIF($B$6:$B580,$B$4),\"\")","v":""},""]
[{"$f":"IF(B581=$B$4,B581&\"_\"&COUNTIF($B$6:$B581,$B$4),\"\")","v":""},""]
[{"$f":"IF(B582=$B$4,B582&\"_\"&COUNTIF($B$6:$B582,$B$4),\"\")","v":""},""]
[{"$f":"IF(B583=$B$4,B583&\"_\"&COUNTIF($B$6:$B583,$B$4),\"\")","v":""},{"$f":"IF(C583=\"\",\"\",\"A partager\")","v":""}]
[{"$f":"IF(B584=$B$4,B584&\"_\"&COUNTIF($B$6:$B584,$B$4),\"\")","v":""},""]
[{"$f":"IF(B585=$B$4,B585&\"_\"&COUNTIF($B$6:$B585,$B$4),\"\")","v":""},""]
[{"$f":"IF(B586=$B$4,B586&\"_\"&COUNTIF($B$6:$B586,$B$4),\"\")","v":""},""]
[{"$f":"IF(B587=$B$4,B587&\"_\"&COUNTIF($B$6:$B587,$B$4),\"\")","v":""},""]
[{"$f":"IF(B588=$B$4,B588&\"_\"&COUNTIF($B$6:$B588,$B$4),\"\")","v":""},""]
[{"$f":"IF(B589=$B$4,B589&\"_\"&COUNTIF($B$6:$B589,$B$4),\"\")","v":""},""]
[{"$f":"IF(B590=$B$4,B590&\"_\"&COUNTIF($B$6:$B590,$B$4),\"\")","v":""},""]
[{"$f":"IF(B591=$B$4,B591&\"_\"&COUNTIF($B$6:$B591,$B$4),\"\")","v":""},""]
[{"$f":"IF(B592=$B$4,B592&\"_\"&COUNTIF($B$6:$B592,$B$4),\"\")","v":""},""]
[{"$f":"IF(B593=$B$4,B593&\"_\"&COUNTIF($B$6:$B593,$B$4),\"\")","v":""},""]
[{"$f":"IF(B594=$B$4,B594&\"_\"&COUNTIF($B$6:$B594,$B$4),\"\")","v":""},""]
[{"$f":"IF(B595=$B$4,B595&\"_\"&COUNTIF($B$6:$B595,$B$4),\"\")","v":""},""]
[{"$f":"IF(B596=$B$4,B596&\"_\"&COUNTIF($B$6:$B596,$B$4),\"\")","v":""},""]
[{"$f":"IF(B597=$B$4,B597&\"_\"&COUNTIF($B$6:$B597,$B$4),\"\")","v":""},""]
[{"$f":"IF(B598=$B$4,B598&\"_\"&COUNTIF($B$6:$B598,$B$4),\"\")","v":""},""]
[{"$f":"IF(B599=$B$4,B599&\"_\"&COUNTIF($B$6:$B599,$B$4),\"\")","v":""},""]
[{"$f":"IF(B600=$B$4,B600&\"_\"&COUNTIF($B$6:$B600,$B$4),\"\")","v":""},""]
[{"$f":"IF(B601=$B$4,B601&\"_\"&COUNTIF($B$6:$B601,$B$4),\"\")","v":""},""]
[{"$f":"IF(B602=$B$4,B602&\"_\"&COUNTIF($B$6:$B602,$B$4),\"\")","v":""},""]
[{"$f":"IF(B603=$B$4,B603&\"_\"&COUNTIF($B$6:$B603,$B$4),\"\")","v":""},""]
[{"$f":"IF(B604=$B$4,B604&\"_\"&COUNTIF($B$6:$B604,$B$4),\"\")","v":""},""]
[{"$f":"IF(B605=$B$4,B605&\"_\"&COUNTIF($B$6:$B605,$B$4),\"\")","v":""},""]
[{"$f":"IF(B606=$B$4,B606&\"_\"&COUNTIF($B$6:$B606,$B$4),\"\")","v":""},""]
[{"$f":"IF(B607=$B$4,B607&\"_\"&COUNTIF($B$6:$B607,$B$4),\"\")","v":""},""]
[{"$f":"IF(B608=$B$4,B608&\"_\"&COUNTIF($B$6:$B608,$B$4),\"\")","v":""},""]
[{"$f":"IF(B609=$B$4,B609&\"_\"&COUNTIF($B$6:$B609,$B$4),\"\")","v":""},""]
[{"$f":"IF(B610=$B$4,B610&\"_\"&COUNTIF($B$6:$B610,$B$4),\"\")","v":""},""]
[{"$f":"IF(B611=$B$4,B611&\"_\"&COUNTIF($B$6:$B611,$B$4),\"\")","v":""},""]
[{"$f":"IF(B612=$B$4,B612&\"_\"&COUNTIF($B$6:$B612,$B$4),\"\")","v":""},""]
[{"$f":"IF(B613=$B$4,B613&\"_\"&COUNTIF($B$6:$B613,$B$4),\"\")","v":""},""]
[{"$f":"IF(B614=$B$4,B614&\"_\"&COUNTIF($B$6:$B614,$B$4),\"\")","v":""},""]
[{"$f":"IF(B615=$B$4,B615&\"_\"&COUNTIF($B$6:$B615,$B$4),\"\")","v":""},""]
[{"$f":"IF(B616=$B$4,B616&\"_\"&COUNTIF($B$6:$B616,$B$4),\"\")","v":""},""]
[{"$f":"IF(B617=$B$4,B617&\"_\"&COUNTIF($B$6:$B617,$B$4),\"\")","v":""},""]
[{"$f":"IF(B618=$B$4,B618&\"_\"&COUNTIF($B$6:$B618,$B$4),\"\")","v":""},""]
[{"$f":"IF(B619=$B$4,B619&\"_\"&COUNTIF($B$6:$B619,$B$4),\"\")","v":""},""]
[{"$f":"IF(B620=$B$4,B620&\"_\"&COUNTIF($B$6:$B620,$B$4),\"\")","v":""},""]
[{"$f":"IF(B621=$B$4,B621&\"_\"&COUNTIF($B$6:$B621,$B$4),\"\")","v":""},""]
[{"$f":"IF(B622=$B$4,B622&\"_\"&COUNTIF($B$6:$B622,$B$4),\"\")","v":""},""]
[{"$f":"IF(B623=$B$4,B623&\"_\"&COUNTIF($B$6:$B623,$B$4),\"\")","v":""},""]
[{"$f":"IF(B624=$B$4,B624&\"_\"&COUNTIF($B$6:$B624,$B$4),\"\")","v":""},""]
[{"$f":"IF(B625=$B$4,B625&\"_\"&COUNTIF($B$6:$B625,$B$4),\"\")","v":""},""]
[{"$f":"IF(B626=$B$4,B626&\"_\"&COUNTIF($B$6:$B626,$B$4),\"\")","v":""},""]
[{"$f":"IF(B627=$B$4,B627&\"_\"&COUNTIF($B$6:$B627,$B$4),\"\")","v":""},""]
[{"$f":"IF(B628=$B$4,B628&\"_\"&COUNTIF($B$6:$B628,$B$4),\"\")","v":""},""]
[{"$f":"IF(B629=$B$4,B629&\"_\"&COUNTIF($B$6:$B629,$B$4),\"\")","v":""},""]
[{"$f":"IF(B630=$B$4,B630&\"_\"&COUNTIF($B$6:$B630,$B$4),\"\")","v":""},""]
[{"$f":"IF(B631=$B$4,B631&\"_\"&COUNTIF($B$6:$B631,$B$4),\"\")","v":""},""]
[{"$f":"IF(B632=$B$4,B632&\"_\"&COUNTIF($B$6:$B632,$B$4),\"\")","v":""},""]
[{"$f":"IF(B633=$B$4,B633&\"_\"&COUNTIF($B$6:$B633,$B$4),\"\")","v":""},""]
[{"$f":"IF(B634=$B$4,B634&\"_\"&COUNTIF($B$6:$B634,$B$4),\"\")","v":""},""]
[{"$f":"IF(B635=$B$4,B635&\"_\"&COUNTIF($B$6:$B635,$B$4),\"\")","v":""},""]
[{"$f":"IF(B636=$B$4,B636&\"_\"&COUNTIF($B$6:$B636,$B$4),\"\")","v":""},""]
[{"$f":"IF(B637=$B$4,B637&\"_\"&COUNTIF($B$6:$B637,$B$4),\"\")","v":""},""]
[{"$f":"IF(B638=$B$4,B638&\"_\"&COUNTIF($B$6:$B638,$B$4),\"\")","v":""},""]
[{"$f":"IF(B639=$B$4,B639&\"_\"&COUNTIF($B$6:$B639,$B$4),\"\")","v":""},""]
[{"$f":"IF(B640=$B$4,B640&\"_\"&COUNTIF($B$6:$B640,$B$4),\"\")","v":""},""]
[{"$f":"IF(B641=$B$4,B641&\"_\"&COUNTIF($B$6:$B641,$B$4),\"\")","v":""},""]
[{"$f":"IF(B642=$B$4,B642&\"_\"&COUNTIF($B$6:$B642,$B$4),\"\")","v":""},""]
[{"$f":"IF(B643=$B$4,B643&\"_\"&COUNTIF($B$6:$B643,$B$4),\"\")","v":""},""]
[{"$f":"IF(B644=$B$4,B644&\"_\"&COUNTIF($B$6:$B644,$B$4),\"\")","v":""},""]
[{"$f":"IF(B645=$B$4,B645&\"_\"&COUNTIF($B$6:$B645,$B$4),\"\")","v":""},""]
[{"$f":"IF(B646=$B$4,B646&\"_\"&COUNTIF($B$6:$B646,$B$4),\"\")","v":""},""]
[{"$f":"IF(B647=$B$4,B647&\"_\"&COUNTIF($B$6:$B647,$B$4),\"\")","v":""},{"$f":"IF(C647=\"\",\"\",\"A partager\")","v":""}]
[{"$f":"IF(B648=$B$4,B648&\"_\"&COUNTIF($B$6:$B648,$B$4),\"\")","v":""},""]
[{"$f":"IF(B649=$B$4,B649&\"_\"&COUNTIF($B$6:$B649,$B$4),\"\")","v":""},""]
[{"$f":"IF(B650=$B$4,B650&\"_\"&COUNTIF($B$6:$B650,$B$4),\"\")","v":""},""]
[{"$f":"IF(B651=$B$4,B651&\"_\"&COUNTIF($B$6:$B651,$B$4),\"\")","v":""},""]
[{"$f":"IF(B652=$B$4,B652&\"_\"&COUNTIF($B$6:$B652,$B$4),\"\")","v":""},""]
[{"$f":"IF(B653=$B$4,B653&\"_\"&COUNTIF($B$6:$B653,$B$4),\"\")","v":""},""]
[{"$f":"IF(B654=$B$4,B654&\"_\"&COUNTIF($B$6:$B654,$B$4),\"\")","v":""},""]
[{"$f":"IF(B655=$B$4,B655&\"_\"&COUNTIF($B$6:$B655,$B$4),\"\")","v":""},""]
[{"$f":"IF(B656=$B$4,B656&\"_\"&COUNTIF($B$6:$B656,$B$4),\"\")","v":""},""]
[{"$f":"IF(B657=$B$4,B657&\"_\"&COUNTIF($B$6:$B657,$B$4),\"\")","v":""},""]
[{"$f":"IF(B658=$B$4,B658&\"_\"&COUNTIF($B$6:$B658,$B$4),\"\")","v":""},""]
[{"$f":"IF(B659=$B$4,B659&\"_\"&COUNTIF($B$6:$B659,$B$4),\"\")","v":""},""]
[{"$f":"IF(B660=$B$4,B660&\"_\"&COUNTIF($B$6:$B660,$B$4),\"\")","v":""},""]
[{"$f":"IF(B661=$B$4,B661&\"_\"&COUNTIF($B$6:$B661,$B$4),\"\")","v":""},""]
[{"$f":"IF(B662=$B$4,B662&\"_\"&COUNTIF($B$6:$B662,$B$4),\"\")","v":""},""]
[{"$f":"IF(B663=$B$4,B663&\"_\"&COUNTIF($B$6:$B663,$B$4),\"\")","v":""},""]
[{"$f":"IF(B664=$B$4,B664&\"_\"&COUNTIF($B$6:$B664,$B$4),\"\")","v":""},""]
[{"$f":"IF(B665=$B$4,B665&\"_\"&COUNTIF($B$6:$B665,$B$4),\"\")","v":""},""]
[{"$f":"IF(B666=$B$4,B666&\"_\"&COUNTIF($B$6:$B666,$B$4),\"\")","v":""},""]
[{"$f":"IF(B667=$B$4,B667&\"_\"&COUNTIF($B$6:$B667,$B$4),\"\")","v":""},""]
[{"$f":"IF(B668=$B$4,B668&\"_\"&COUNTIF($B$6:$B668,$B$4),\"\")","v":""},""]
[{"$f":"IF(B669=$B$4,B669&\"_\"&COUNTIF($B$6:$B669,$B$4),\"\")","v":""},""]
[{"$f":"IF(B670=$B$4,B670&\"_\"&COUNTIF($B$6:$B670,$B$4),\"\")","v":""},""]
[{"$f":"IF(B671=$B$4,B671&\"_\"&COUNTIF($B$6:$B671,$B$4),\"\")","v":""},""]
[{"$f":"IF(B672=$B$4,B672&\"_\"&COUNTIF($B$6:$B672,$B$4),\"\")","v":""},""]
[{"$f":"IF(B673=$B$4,B673&\"_\"&COUNTIF($B$6:$B673,$B$4),\"\")","v":""},""]
[{"$f":"IF(B674=$B$4,B674&\"_\"&COUNTIF($B$6:$B674,$B$4),\"\")","v":""},""]
[{"$f":"IF(B675=$B$4,B675&\"_\"&COUNTIF($B$6:$B675,$B$4),\"\")","v":""},""]
[{"$f":"IF(B676=$B$4,B676&\"_\"&COUNTIF($B$6:$B676,$B$4),\"\")","v":""},""]
[{"$f":"IF(B677=$B$4,B677&\"_\"&COUNTIF($B$6:$B677,$B$4),\"\")","v":""},""]
[{"$f":"IF(B678=$B$4,B678&\"_\"&COUNTIF($B$6:$B678,$B$4),\"\")","v":""},""]
[{"$f":"IF(B679=$B$4,B679&\"_\"&COUNTIF($B$6:$B679,$B$4),\"\")","v":""},""]
[{"$f":"IF(B680=$B$4,B680&\"_\"&COUNTIF($B$6:$B680,$B$4),\"\")","v":""},""]
[{"$f":"IF(B681=$B$4,B681&\"_\"&COUNTIF($B$6:$B681,$B$4),\"\")","v":""},""]
[{"$f":"IF(B682=$B$4,B682&\"_\"&COUNTIF($B$6:$B682,$B$4),\"\")","v":""},""]
[{"$f":"IF(B683=$B$4,B683&\"_\"&COUNTIF($B$6:$B683,$B$4),\"\")","v":""},""]
[{"$f":"IF(B684=$B$4,B684&\"_\"&COUNTIF($B$6:$B684,$B$4),\"\")","v":""},""]
[{"$f":"IF(B685=$B$4,B685&\"_\"&COUNTIF($B$6:$B685,$B$4),\"\")","v":""},""]
[{"$f":"IF(B686=$B$4,B686&\"_\"&COUNTIF($B$6:$B686,$B$4),\"\")","v":""},""]
[{"$f":"IF(B687=$B$4,B687&\"_\"&COUNTIF($B$6:$B687,$B$4),\"\")","v":""},""]
[{"$f":"IF(B688=$B$4,B688&\"_\"&COUNTIF($B$6:$B688,$B$4),\"\")","v":""},""]
[{"$f":"IF(B689=$B$4,B689&\"_\"&COUNTIF($B$6:$B689,$B$4),\"\")","v":""},""]
[{"$f":"IF(B690=$B$4,B690&\"_\"&COUNTIF($B$6:$B690,$B$4),\"\")","v":""},""]
[{"$f":"IF(B691=$B$4,B691&\"_\"&COUNTIF($B$6:$B691,$B$4),\"\")","v":""},""]
[{"$f":"IF(B692=$B$4,B692&\"_\"&COUNTIF($B$6:$B692,$B$4),\"\")","v":""},""]
[{"$f":"IF(B693=$B$4,B693&\"_\"&COUNTIF($B$6:$B693,$B$4),\"\")","v":""},""]
[{"$f":"IF(B694=$B$4,B694&\"_\"&COUNTIF($B$6:$B694,$B$4),\"\")","v":""},""]
[{"$f":"IF(B695=$B$4,B695&\"_\"&COUNTIF($B$6:$B695,$B$4),\"\")","v":""},""]
[{"$f":"IF(B696=$B$4,B696&\"_\"&COUNTIF($B$6:$B696,$B$4),\"\")","v":""},""]
[{"$f":"IF(B697=$B$4,B697&\"_\"&COUNTIF($B$6:$B697,$B$4),\"\")","v":""},""]
[{"$f":"IF(B698=$B$4,B698&\"_\"&COUNTIF($B$6:$B698,$B$4),\"\")","v":""},""]
[{"$f":"IF(B699=$B$4,B699&\"_\"&COUNTIF($B$6:$B699,$B$4),\"\")","v":""},""]
[{"$f":"IF(B700=$B$4,B700&\"_\"&COUNTIF($B$6:$B700,$B$4),\"\")","v":""},""]
[{"$f":"IF(B701=$B$4,B701&\"_\"&COUNTIF($B$6:$B701,$B$4),\"\")","v":""},""]
[{"$f":"IF(B702=$B$4,B702&\"_\"&COUNTIF($B$6:$B702,$B$4),\"\")","v":""},""]
[{"$f":"IF(B703=$B$4,B703&\"_\"&COUNTIF($B$6:$B703,$B$4),\"\")","v":""},""]
[{"$f":"IF(B704=$B$4,B704&\"_\"&COUNTIF($B$6:$B704,$B$4),\"\")","v":""},""]
[{"$f":"IF(B705=$B$4,B705&\"_\"&COUNTIF($B$6:$B705,$B$4),\"\")","v":""},""]
[{"$f":"IF(B706=$B$4,B706&\"_\"&COUNTIF($B$6:$B706,$B$4),\"\")","v":""},""]
[{"$f":"IF(B707=$B$4,B707&\"_\"&COUNTIF($B$6:$B707,$B$4),\"\")","v":""},""]
[{"$f":"IF(B708=$B$4,B708&\"_\"&COUNTIF($B$6:$B708,$B$4),\"\")","v":""},""]
[{"$f":"IF(B709=$B$4,B709&\"_\"&COUNTIF($B$6:$B709,$B$4),\"\")","v":""},""]
[{"$f":"IF(B710=$B$4,B710&\"_\"&COUNTIF($B$6:$B710,$B$4),\"\")","v":""},""]
[{"$f":"IF(B711=$B$4,B711&\"_\"&COUNTIF($B$6:$B711,$B$4),\"\")","v":""},{"$f":"IF(C711=\"\",\"\",\"A partager\")","v":""}]
[{"$f":"IF(B712=$B$4,B712&\"_\"&COUNTIF($B$6:$B712,$B$4),\"\")","v":""},""]
[{"$f":"IF(B713=$B$4,B713&\"_\"&COUNTIF($B$6:$B713,$B$4),\"\")","v":""},""]
[{"$f":"IF(B714=$B$4,B714&\"_\"&COUNTIF($B$6:$B714,$B$4),\"\")","v":""},""]
[{"$f":"IF(B715=$B$4,B715&\"_\"&COUNTIF($B$6:$B715,$B$4),\"\")","v":""},""]
[{"$f":"IF(B716=$B$4,B716&\"_\"&COUNTIF($B$6:$B716,$B$4),\"\")","v":""},""]
[{"$f":"IF(B717=$B$4,B717&\"_\"&COUNTIF($B$6:$B717,$B$4),\"\")","v":""},""]
[{"$f":"IF(B718=$B$4,B718&\"_\"&COUNTIF($B$6:$B718,$B$4),\"\")","v":""},""]
[{"$f":"IF(B719=$B$4,B719&\"_\"&COUNTIF($B$6:$B719,$B$4),\"\")","v":""},""]
[{"$f":"IF(B720=$B$4,B720&\"_\"&COUNTIF($B$6:$B720,$B$4),\"\")","v":""},""]
[{"$f":"IF(B721=$B$4,B721&\"_\"&COUNTIF($B$6:$B721,$B$4),\"\")","v":""},""]
[{"$f":"IF(B722=$B$4,B722&\"_\"&COUNTIF($B$6:$B722,$B$4),\"\")","v":""},""]
[{"$f":"IF(B723=$B$4,B723&\"_\"&COUNTIF($B$6:$B723,$B$4),\"\")","v":""},""]
[{"$f":"IF(B724=$B$4,B724&\"_\"&COUNTIF($B$6:$B724,$B$4),\"\")","v":""},""]
[{"$f":"IF(B725=$B$4,B725&\"_\"&COUNTIF($B$6:$B725,$B$4),\"\")","v":""},""]
[{"$f":"IF(B726=$B$4,B726&\"_\"&COUNTIF($B$6:$B726,$B$4),\"\")","v":""},""]
[{"$f":"IF(B727=$B$4,B727&\"_\"&COUNTIF($B$6:$B727,$B$4),\"\")","v":""},""]
[{"$f":"IF(B728=$B$4,B728&\"_\"&COUNTIF($B$6:$B728,$B$4),\"\")","v":""},""]
[{"$f":"IF(B729=$B$4,B729&\"_\"&COUNTIF($B$6:$B729,$B$4),\"\")","v":""},""]
[{"$f":"IF(B730=$B$4,B730&\"_\"&COUNTIF($B$6:$B730,$B$4),\"\")","v":""},""]
[{"$f":"IF(B731=$B$4,B731&\"_\"&COUNTIF($B$6:$B731,$B$4),\"\")","v":""},""]
[{"$f":"IF(B732=$B$4,B732&\"_\"&COUNTIF($B$6:$B732,$B$4),\"\")","v":""},""]
[{"$f":"IF(B733=$B$4,B733&\"_\"&COUNTIF($B$6:$B733,$B$4),\"\")","v":""},""]
[{"$f":"IF(B734=$B$4,B734&\"_\"&COUNTIF($B$6:$B734,$B$4),\"\")","v":""},""]
[{"$f":"IF(B735=$B$4,B735&\"_\"&COUNTIF($B$6:$B735,$B$4),\"\")","v":""},""]
[{"$f":"IF(B736=$B$4,B736&\"_\"&COUNTIF($B$6:$B736,$B$4),\"\")","v":""},""]
[{"$f":"IF(B737=$B$4,B737&\"_\"&COUNTIF($B$6:$B737,$B$4),\"\")","v":""},""]
[{"$f":"IF(B738=$B$4,B738&\"_\"&COUNTIF($B$6:$B738,$B$4),\"\")","v":""},""]

{"sheet":"A donner","index":10,"n_rows":50,"n_cols":11,"rows_kept":50,"cut":false,"hidden":false,"merged":[[2,1,2,2],[2,3,2,4]]}
[null,"Tableau 3 = synthèse de sous-actions à donner :"]
[]
[null,"Rappel de votre objectif :",null,{"$f":"+'Objectif SMARTER'!$A$6","v":"Je veux…"}]
[{"$f":"IF(B4<>\"\",\"A donner\",\"\")","v":""}]
[null,"Costume n°","Nom du rôle-costume","Action","Sous-actions à donner à d'autres personnes","Pourquoi cette sous-action est-elle utile/ objectif ?\nQuels sont ses bénéfices / objectif ?","A qui devez-vous donner cette sous-action ? \n(Membres de votre famille, amis, collègues, supérieurs, etc.)\nEt que doit(vent) faire précisément cette/ces personne(s) ?","Critère de réalisation cette sous-action.\n(Rendu final visible et mesurable / objectif)","Quand, à qui, et comment devez-vous déléguer/donner cette sous-action ? \n(à quelle(s) étape(s)/objectif, situations, personnes, contextes, lieux, horaires précis, moments dans la journée, niveau d'énergie requis, période(s) de l'année, etc.)","Combien d’heures min./ max. consacrer à cette sous-action par jour/ semaine/ mois/ année ?","Suite à donner à cette sous-action pour la/les personnes qui la réaliseront ?\nDurée prévue d’utilisation (date limite d’utilisation, conséquences long terme, etc.)"]
[null,1,"Leader","Répondre aux mails & aux appels importants","Répondre aux fournisseurs"]
[null,1,"Leader","Définir et valider la vision/stratégie à moyen et à long terme pour l'entreprise. Réflexions et discusssions stratégiques","A compléter costume 1 Action 3 Sous-action 3"]
[null,1,"Leader","Gérer des rdv et appeler les clients/partenaires/fournisseurs/ etc.","A compléter costume 1 Action 4 Sous-action 3"]
[null,1,"Leader","Gérer des rdv et appeler les clients/partenaires/fournisseurs/ etc.","A compléter costume 1 Action 4 Sous-action 5"]
[null,2,"Manager (en interne)","Communiquer les actions prioritaires à mes équipes directes.","A compléter costume 2 Action 1 Sous-action 5"]
[null,2,"Manager (en interne)","Encourager et motiver toutes les personnes que je manage.","A compléter costume 2 Action 2 Sous-action 2"]
[null,2,"Manager (en interne)","Informer Mme J, M. O, et l'équipe X, des actions à entreprendre cette semaine","A compléter costume 2 Action 3 Sous-action 4"]
[null,2,"Manager (en interne)","Communiquer les objectifs à atteindre aux directeurs des différents services/ unités/ départements.","A compléter costume 2 Action 4 Sous-action 1"]
[null,3,"Partenaire commercial (à l'externe)","Répondre aux principaux partenaires externes de l'entreprise","A compléter costume 3 Action 1 Sous-action 1"]
[null,3,"Partenaire commercial (à l'externe)","Répondre aux principaux partenaires externes de l'entreprise","A compléter costume 3 Action 1 Sous-action 2"]
[null,3,"Partenaire commercial (à l'externe)","Répondre aux principaux partenaires externes de l'entreprise","A compléter costume 3 Action 1 Sous-action 5"]
[null,3,"Partenaire commercial (à l'externe)","Gérer la relation avec les clients","A compléter costume 3 Action 3 Sous-action 3"]
[null,3,"Partenaire commercial (à l'externe)","Gérer la relation avec les partenaires financiers","A compléter costume 3 Action 5 Sous-action 1"]
[null,4,"Mari / Amant","Communiquer régulièrement avec elle/lui","A compléter costume 4 Action 1 Sous-action 1"]
[null,4,"Mari / Amant","Communiquer régulièrement avec elle/lui","A compléter costume 4 Action 1 Sous-action 4"]
[null,4,"Mari / Amant","Accorder x heures par jour/semaine à elle/lui","A compléter costume 4 Action 2 Sous-action 5"]
[null,4,"Mari / Amant","Répondre à ses demandes/messages/sollicitations","A compléter costume 4 Action 3 Sous-action 4"]
[null,4,"Mari / Amant","Programmer au moins 1 we entre amoureux/mois.","A compléter costume 4 Action 5 Sous-action 4"]
[null,5,"Père","Accompagner mon/mes enfant(s) à ses activités extra-scolaires. Assurer les déplacements de mon/mes enfant(s)","A compléter costume 5 Action 3 Sous-action 3"]
[null,5,"Père","Assurer l'éducation de mon enfant et aider mon/mes enfant(s) dans ses apprentissages.","A compléter costume 5 Action 4 Sous-action 3"]
[null,6,"Oncle, fils, etc. (vie familiale)","Appeler les membres X, Y, et R de ma famille 1 fois/mois.","A compléter costume 6 Action 1 Sous-action 3"]
[null,6,"Oncle, fils, etc. (vie familiale)","Répondre aux appels de mon père.","A compléter costume 6 Action 2 Sous-action 2"]
[null,6,"Oncle, fils, etc. (vie familiale)","Répondre aux appels de mon père.","A compléter costume 6 Action 2 Sous-action 5"]
[null,6,"Oncle, fils, etc. (vie familiale)","Soutenir Mme X dans les x prochains mois.","A compléter costume 6 Action 3 Sous-action 1"]
[null,6,"Oncle, fils, etc. (vie familiale)","Soutenir Mme X dans les x prochains mois.","A compléter costume 6 Action 3 Sous-action 4"]
[null,6,"Oncle, fils, etc. (vie familiale)","Organiser un weekend avec X et Y au moins 2 fois/an.","A compléter costume 6 Action 4 Sous-action 3"]
[null,6,"Oncle, fils, etc. (vie familiale)","Me rendre disponible pour les anniversaires de P, S, et J chaque année.","A compléter costume 6 Action 5 Sous-action 2"]
[null,6,"Oncle, fils, etc. (vie familiale)","Me rendre disponible pour les anniversaires de P, S, et J chaque année.","A compléter costume 6 Action 5 Sous-action 5"]
[null,7,"Ami / copain (vie sociale)","Passer du temps avec mes ami(e)s","A compléter costume 7 Action 1 Sous-action 5"]
[null,7,"Ami / copain (vie sociale)","Répondre à mes ami(e)s dans les 3 jours.","A compléter costume 7 Action 4 Sous-action 5"]
[null,7,"Ami / copain (vie sociale)","Programmer au moins 1 sortie avec mes amis W, R, et U /mois.","A compléter costume 7 Action 5 Sous-action 3"]
[null,8,"Loisirs (activités, clubs, etc.)","Lire 30 minutes/semaine un livre \"plaisir\".","A compléter costume 8 Action 1 Sous-action 3"]
[null,8,"Loisirs (activités, clubs, etc.)","Participer au carnaval de ma ville avec mon enfant.","A compléter costume 8 Action 2 Sous-action 5"]
[null,8,"Loisirs (activités, clubs, etc.)","Prendre 7 jours de vacances tous les 3 mois.","A compléter costume 8 Action 3 Sous-action 3"]
[null,8,"Loisirs (activités, clubs, etc.)","Pratiquer une activité qui me plaît chaque semaine, pendant x heures minimum.","A compléter costume 8 Action 4 Sous-action 1"]
[null,9,"Dormeur","Suivre un rituel du coucher identique tous les soirs.","A compléter costume 9 Action 1 Sous-action 2"]
[null,9,"Dormeur","Suivre un rituel du coucher identique tous les soirs.","A compléter costume 9 Action 1 Sous-action 3"]
[null,10,"Sportif","Acheter mes tenues et mon matériel de sport.","A compléter costume 10 Action 1 Sous-action 2"]
[null,10,"Sportif","Acheter mes tenues et mon matériel de sport.","A compléter costume 10 Action 1 Sous-action 4"]
[null,10,"Sportif","Courir 2 fois / semaine pendant 30 minutes minimum.","A compléter costume 10 Action 2 Sous-action 4"]
[null,10,"Sportif","Courir 2 fois / semaine pendant 30 minutes minimum.","A compléter costume 10 Action 2 Sous-action 5"]
[null,10,"Sportif","M'étirer 10 minutes tous les soirs à 21h00.","A compléter costume 10 Action 3 Sous-action 2"]
[null,10,"Sportif","Boire au moins 1,5 litres d'eau par jour.","A compléter costume 10 Action 4 Sous-action 3"]
[null,10,"Sportif","Manger des légumes midi et soir, et des protéines matin et midi.","A compléter costume 10 Action 5 Sous-action 1"]
[null,10,"Sportif","Manger des légumes midi et soir, et des protéines matin et midi.","A compléter costume 10 Action 5 Sous-action 2"]

{"sheet":"Aporterseul","index":11,"n_rows":92,"n_cols":17,"rows_kept":92,"cut":false,"hidden":false,"merged":[]}
["Costume n°","Nom du rôle-costume","Actions","Sous-actions","Pourquoi réaliser seul cette sous-action ?","Pourquoi partager (scinder) cette sous-action en plusieurs sous-sous-actions ?\nPourquoi déléguer une partie de cette sous-action ?","Pourquoi cette sous-action est-elle utile/ objectif ?\nQuels sont ses bénéfices / objectif ?","Avec qui vous devez partager cette sous-action ? (Membres de votre famille, amis, collègues, supérieurs, etc.)\nEt que doit(vent) faire précisément cette/ces personne(s) ?","Quelle sous-sous-action précise vous devez réaliser seul ?","Critère de réalisation cette sous-action.\n(rendu final visible et mesurable / objectif)","Au cours de quelle(s) étape(s) / votre objectif devez-vous réaliser cette sous-action ?","Quand devez-vous réaliser cette sous-action ?\n(contextes, horaires précis, régularité ou pas, moments de la journée, période(s) de l'année, etc.)","Où devez-vous réaliser cette sous-action ?\n(lieux précis)","Avec qui devez-vous réaliser cette sous-action ?\n(personnes précises)","Comment devez-vous réaliser cette sous-action ? \n(niveau d'énergie requis, humeur, qualité(s), force(s), ou talent(s) requis, etc.)","Combien d’heures min./ max. consacrer à cette sous-action par jour/ semaine/ mois/ année ?","Suite à donner à cette sous-action ?\n(durée prévue d’utilisation, date limite de réalisation, conséquences long terme, etc.)"]
[1,"Leader","Répondre aux mails & aux appels importants","Répondre aux clients externes","Parce que ggg",null,null,null,"Je dois faire HHH"]
[1,"Leader","Répondre aux mails & aux appels importants","Répondre aux demandes nouvelles venant de l'externe","Car hhh"]
[1,"Leader","Présenter les résultats de l'entreprise","S'assurer que les résultats sont corrects","Parce que oooo"]
[1,"Leader","Présenter les résultats de l'entreprise","A compléter costume 1 Action 2 Sous-action 4","Car kkk"]
[1,"Leader","Définir et valider la vision/stratégie à moyen et à long terme pour l'entreprise. Réflexions et discusssions stratégiques","A compléter costume 1 Action 3 Sous-action 4"]
[1,"Leader","Gérer des rdv et appeler les clients/partenaires/fournisseurs/ etc.","A compléter costume 1 Action 4 Sous-action 2"]
[1,"Leader","M'informer des tendances actuelles et futures qui pourraient impacter l'entreprise + Me former : min. 1 formation /an","A compléter costume 1 Action 5 Sous-action 1"]
[1,"Leader","M'informer des tendances actuelles et futures qui pourraient impacter l'entreprise + Me former : min. 1 formation /an","A compléter costume 1 Action 5 Sous-action 3"]
[1,"Leader","M'informer des tendances actuelles et futures qui pourraient impacter l'entreprise + Me former : min. 1 formation /an","A compléter costume 1 Action 5 Sous-action 5"]
[2,"Manager (en interne)","Communiquer les actions prioritaires à mes équipes directes.","A compléter costume 2 Action 1 Sous-action 2"]
[2,"Manager (en interne)","Encourager et motiver toutes les personnes que je manage.","A compléter costume 2 Action 2 Sous-action 1"]
[2,"Manager (en interne)","Encourager et motiver toutes les personnes que je manage.","A compléter costume 2 Action 2 Sous-action 3"]
[2,"Manager (en interne)","Encourager et motiver toutes les personnes que je manage.","A compléter costume 2 Action 2 Sous-action 5"]
[2,"Manager (en interne)","Informer Mme J, M. O, et l'équipe X, des actions à entreprendre cette semaine","A compléter costume 2 Action 3 Sous-action 1"]
[2,"Manager (en interne)","Informer Mme J, M. O, et l'équipe X, des actions à entreprendre cette semaine","A compléter costume 2 Action 3 Sous-action 3"]
[2,"Manager (en interne)","Informer Mme J, M. O, et l'équipe X, des actions à entreprendre cette semaine","A compléter costume 2 Action 3 Sous-action 5"]
[2,"Manager (en interne)","Communiquer les objectifs à atteindre aux directeurs des différents services/ unités/ départements.","A compléter costume 2 Action 4 Sous-action 2"]
[2,"Manager (en interne)","Communiquer les objectifs à atteindre aux directeurs des différents services/ unités/ départements.","A compléter costume 2 Action 4 Sous-action 3"]
[2,"Manager (en interne)","Communiquer les objectifs à atteindre aux directeurs des différents services/ unités/ départements.","A compléter costume 2 Action 4 Sous-action 4"]
[2,"Manager (en interne)","Déléguer le travail 1 et 2 à Mme O.","A compléter costume 2 Action 5 Sous-action 1"]
[2,"Manager (en interne)","Déléguer le travail 1 et 2 à Mme O.","A compléter costume 2 Action 5 Sous-action 2"]
[2,"Manager (en interne)","Déléguer le travail 1 et 2 à Mme O.","A compléter costume 2 Action 5 Sous-action 3"]
[2,"Manager (en interne)","Déléguer le travail 1 et 2 à Mme O.","A compléter costume 2 Action 5 Sous-action 5"]
[3,"Partenaire commercial (à l'externe)","Répondre aux principaux partenaires externes de l'entreprise","A compléter costume 3 Action 1 Sous-action 3"]
[3,"Partenaire commercial (à l'externe)","Répondre aux principaux partenaires externes de l'entreprise","A compléter costume 3 Action 1 Sous-action 4"]
[3,"Partenaire commercial (à l'externe)","Gérer la relation avec les fournisseurs","A compléter costume 3 Action 2 Sous-action 1"]
[3,"Partenaire commercial (à l'externe)","Gérer la relation avec les fournisseurs","A compléter costume 3 Action 2 Sous-action 2"]
[3,"Partenaire commercial (à l'externe)","Gérer la relation avec les fournisseurs","A compléter costume 3 Action 2 Sous-action 3"]
[3,"Partenaire commercial (à l'externe)","Gérer la relation avec les fournisseurs","A compléter costume 3 Action 2 Sous-action 4"]
[3,"Partenaire commercial (à l'externe)","Gérer la relation avec les clients","A compléter costume 3 Action 3 Sous-action 2"]
[3,"Partenaire commercial (à l'externe)","Gérer la relation avec les clients","A compléter costume 3 Action 3 Sous-action 5"]
[3,"Partenaire commercial (à l'externe)","Gérer la relation avec la presse","A compléter costume 3 Action 4 Sous-action 2"]
[3,"Partenaire commercial (à l'externe)","Gérer la relation avec les partenaires financiers","A compléter costume 3 Action 5 Sous-action 3"]
[3,"Partenaire commercial (à l'externe)","Gérer la relation avec les partenaires financiers","A compléter costume 3 Action 5 Sous-action 5"]
[4,"Mari / Amant","Communiquer régulièrement avec elle/lui","A compléter costume 4 Action 1 Sous-action 2"]
[4,"Mari / Amant","Communiquer régulièrement avec elle/lui","A compléter costume 4 Action 1 Sous-action 3"]
[4,"Mari / Amant","Accorder x heures par jour/semaine à elle/lui","A compléter costume 4 Action 2 Sous-action 2"]
[4,"Mari / Amant","Accorder x heures par jour/semaine à elle/lui","A compléter costume 4 Action 2 Sous-action 3"]
[4,"Mari / Amant","Répondre à ses demandes/messages/sollicitations","A compléter costume 4 Action 3 Sous-action 2"]
[4,"Mari / Amant","Emmener ma femme/mon mari au restaurant en tête à tête au moins 1 fois/semaine.","A compléter costume 4 Action 4 Sous-action 1"]
[4,"Mari / Amant","Emmener ma femme/mon mari au restaurant en tête à tête au moins 1 fois/semaine.","A compléter costume 4 Action 4 Sous-action 2"]
[4,"Mari / Amant","Emmener ma femme/mon mari au restaurant en tête à tête au moins 1 fois/semaine.","A compléter costume 4 Action 4 Sous-action 3"]
[4,"Mari / Amant","Emmener ma femme/mon mari au restaurant en tête à tête au moins 1 fois/semaine.","A compléter costume 4 Action 4 Sous-action 5"]
[4,"Mari / Amant","Programmer au moins 1 we entre amoureux/mois.","A compléter costume 4 Action 5 Sous-action 3"]
[5,"Père","Apporter de l'amour à mon enfant selon son langage de l'amour (= cadeaux, moments de qualité, services rendus, toucher physique, paroles valorisantes)","A compléter costume 5 Action 1 Sous-action 4"]
[5,"Père","Apporter de l'amour à mon enfant selon son langage de l'amour (= cadeaux, moments de qualité, services rendus, toucher physique, paroles valorisantes)","A compléter costume 5 Action 1 Sous-action 5"]
[5,"Père","M'assurer que mon/mes enfant(s) à des vêtements propres à mettre chaque jour.","A compléter costume 5 Action 2 Sous-action 5"]
[5,"Père","Assurer l'éducation de mon enfant et aider mon/mes enfant(s) dans ses apprentissages.","A compléter costume 5 Action 4 Sous-action 5"]
[6,"Oncle, fils, etc. (vie familiale)","Appeler les membres X, Y, et R de ma famille 1 fois/mois.","A compléter costume 6 Action 1 Sous-action 1"]
[6,"Oncle, fils, etc. (vie familiale)","Appeler les membres X, Y, et R de ma famille 1 fois/mois.","A compléter costume 6 Action 1 Sous-action 4"]
[6,"Oncle, fils, etc. (vie familiale)","Répondre aux appels de mon père.","A compléter costume 6 Action 2 Sous-action 3"]
[6,"Oncle, fils, etc. (vie familiale)","Soutenir Mme X dans les x prochains mois.","A compléter costume 6 Action 3 Sous-action 2"]
[6,"Oncle, fils, etc. (vie familiale)","Soutenir Mme X dans les x prochains mois.","A compléter costume 6 Action 3 Sous-action 5"]
[6,"Oncle, fils, etc. (vie familiale)","Organiser un weekend avec X et Y au moins 2 fois/an.","A compléter costume 6 Action 4 Sous-action 1"]
[6,"Oncle, fils, etc. (vie familiale)","Organiser un weekend avec X et Y au moins 2 fois/an.","A compléter costume 6 Action 4 Sous-action 4"]
[6,"Oncle, fils, etc. (vie familiale)","Me rendre disponible pour les anniversaires de P, S, et J chaque année.","A compléter costume 6 Action 5 Sous-action 3"]
[7,"Ami / copain (vie sociale)","Passer du temps avec mes ami(e)s","A compléter costume 7 Action 1 Sous-action 2"]
[7,"Ami / copain (vie sociale)","Rencontrer de nouvelles personnes","A compléter costume 7 Action 2 Sous-action 1"]
[7,"Ami / copain (vie sociale)","Rencontrer de nouvelles personnes","A compléter costume 7 Action 2 Sous-action 2"]
[7,"Ami / copain (vie sociale)","Appeler/écrire à mes ami(e)s X, Z, et A au moins 1 fois/mois.","A compléter costume 7 Action 3 Sous-action 5"]
[7,"Ami / copain (vie sociale)","Programmer au moins 1 sortie avec mes amis W, R, et U /mois.","A compléter costume 7 Action 5 Sous-action 2"]
[7,"Ami / copain (vie sociale)","Programmer au moins 1 sortie avec mes amis W, R, et U /mois.","A compléter costume 7 Action 5 Sous-action 5"]
[8,"Loisirs (activités, clubs, etc.)","Lire 30 minutes/semaine un livre \"plaisir\".","A compléter costume 8 Action 1 Sous-action 1"]
[8,"Loisirs (activités, clubs, etc.)","Lire 30 minutes/semaine un livre \"plaisir\".","A compléter costume 8 Action 1 Sous-action 2"]
[8,"Loisirs (activités, clubs, etc.)","Lire 30 minutes/semaine un livre \"plaisir\".","A compléter costume 8 Action 1 Sous-action 4"]
[8,"Loisirs (activités, clubs, etc.)","Participer au carnaval de ma ville avec mon enfant.","A compléter costume 8 Action 2 Sous-action 2"]
[8,"Loisirs (activités, clubs, etc.)","Participer au carnaval de ma ville avec mon enfant.","A compléter costume 8 Action 2 Sous-action 4"]
[8,"Loisirs (activités, clubs, etc.)","Prendre 7 jours de vacances tous les 3 mois.","A compléter costume 8 Action 3 Sous-action 2"]
[8,"Loisirs (activités, clubs, etc.)","Pratiquer une activité qui me plaît chaque semaine, pendant x heures minimum.","A compléter costume 8 Action 4 Sous-action 4"]
[8,"Loisirs (activités, clubs, etc.)","Visiter des expositions/lieux/musées","A compléter costume 8 Action 5 Sous-action 1"]
[8,"Loisirs (activités, clubs, etc.)","Visiter des expositions/lieux/musées","A compléter costume 8 Action 5 Sous-action 2"]
[8,"Loisirs (activités, clubs, etc.)","Visiter des expositions/lieux/musées","A compléter costume 8 Action 5 Sous-action 3"]
[8,"Loisirs (activités, clubs, etc.)","Visiter des expositions/lieux/musées","A compléter costume 8 Action 5 Sous-action 4"]
[9,"Dormeur","Suivre un rituel du coucher identique tous les soirs.","Me coucher chaque soir à heure fixe."]
[9,"Dormeur","Suivre un rituel du coucher identique tous les soirs.","A compléter costume 9 Action 1 Sous-action 4"]
[9,"Dormeur","Ne pas regarder d'écrans au moins 1h avant de me coucher.","A compléter costume 9 Action 2 Sous-action 2"]
[9,"Dormeur","Ne pas regarder d'écrans au moins 1h avant de me coucher.","A compléter costume 9 Action 2 Sous-action 3"]
[9,"Dormeur","Ne pas regarder d'écrans au moins 1h avant de me coucher.","A compléter costume 9 Action 2 Sous-action 4"]
[9,"Dormeur","Me lever chaque matin à une heure fixe.","A compléter costume 9 Action 3 Sous-action 2"]
[9,"Dormeur","Me lever chaque matin à une heure fixe.","A compléter costume 9 Action 3 Sous-action 3"]
[9,"Dormeur","Me lever chaque matin à une heure fixe.","A compléter costume 9 Action 3 Sous-action 4"]
[9,"Dormeur","Me lever chaque matin à une heure fixe.","A compléter costume 9 Action 3 Sous-action 5"]
[9,"Dormeur","Méditer, visualiser, ou prendre un temps calme chaque jour de 10 minutes au réveil / à 13h00 / au coucher.","A compléter costume 9 Action 4 Sous-action 2"]
[9,"Dormeur","Méditer, visualiser, ou prendre un temps calme chaque jour de 10 minutes au réveil / à 13h00 / au coucher.","A compléter costume 9 Action 4 Sous-action 3"]
[9,"Dormeur","Méditer, visualiser, ou prendre un temps calme chaque jour de 10 minutes au réveil / à 13h00 / au coucher.","A compléter costume 9 Action 4 Sous-action 4"]
[9,"Dormeur","Manger léger tous les soirs du lundi au vendredi, sans sucre ni café.","A compléter costume 9 Action 5 Sous-action 1"]
[9,"Dormeur","Manger léger tous les soirs du lundi au vendredi, sans sucre ni café.","A compléter costume 9 Action 5 Sous-action 2"]
[9,"Dormeur","Manger léger tous les soirs du lundi au vendredi, sans sucre ni café.","A compléter costume 9 Action 5 Sous-action 3"]
[10,"Sportif","Manger des légumes midi et soir, et des protéines matin et midi.","A compléter costume 10 Action 5 Sous-action 3"]
[10,"Sportif","Manger des légumes midi et soir, et des protéines matin et midi.","A compléter costume 10 Action 5 Sous-action 4"]
[10,"Sportif","Manger des légumes midi et soir, et des protéines matin et midi.","A compléter costume 10 Action 5 Sous-action 5"]

{"sheet":"Apartager","index":12,"n_rows":115,"n_cols":17,"rows_kept":115,"cut":false,"hidden":false,"merged":[]}
["Costume n°","Nom du rôle-costume","Actions","Sous-actions","Pourquoi réaliser seul cette sous-action ?","Pourquoi partager (scinder) cette sous-action en plusieurs sous-sous-actions ?\nPourquoi déléguer une partie de cette sous-action ?","Pourquoi cette sous-action est-elle utile/ objectif ?\nQuels sont ses bénéfices / objectif ?","Avec qui vous devez partager cette sous-action ? (Membres de votre famille, amis, collègues, supérieurs, etc.)\nEt que doit(vent) faire précisément cette/ces personne(s) ?","Quelle sous-sous-action précise vous devez réaliser seul ?","Critère de réalisation cette sous-action.\n(rendu final visible et mesurable / objectif)","Au cours de quelle(s) étape(s) / votre objectif devez-vous réaliser cette sous-action ?","Quand devez-vous réaliser cette sous-action ?\n(contextes, horaires précis, régularité ou pas, moments de la journée, période(s) de l'année, etc.)","Où devez-vous réaliser cette sous-action ?\n(lieux précis)","Avec qui devez-vous réaliser cette sous-action ?\n(personnes précises)","Comment devez-vous réaliser cette sous-action ? \n(niveau d'énergie requis, humeur, qualité(s), force(s), ou talent(s) requis, etc.)","Combien d’heures min./ max. consacrer à cette sous-action par jour/ semaine/ mois/ année ?","Suite à donner à cette sous-action ?\n(durée prévue d’utilisation, date limite de réalisation, conséquences long terme, etc.)"]
[1,"Leader","Répondre aux mails & aux appels importants","Répondre aux clients internes"]
[1,"Leader","Répondre aux mails & aux appels importants","Répondre à la Presse"]
[1,"Leader","Présenter les résultats de l'entreprise","Anticiper le travail à produire par les équipes"]
[1,"Leader","Présenter les résultats de l'entreprise","A compléter costume 1 Action 2 Sous-action 3"]
[1,"Leader","Présenter les résultats de l'entreprise","A compléter costume 1 Action 2 Sous-action 5"]
[1,"Leader","Définir et valider la vision/stratégie à moyen et à long terme pour l'entreprise. Réflexions et discusssions stratégiques","A compléter costume 1 Action 3 Sous-action 1"]
[1,"Leader","Définir et valider la vision/stratégie à moyen et à long terme pour l'entreprise. Réflexions et discusssions stratégiques","A compléter costume 1 Action 3 Sous-action 2"]
[1,"Leader","Définir et valider la vision/stratégie à moyen et à long terme pour l'entreprise. Réflexions et discusssions stratégiques","A compléter costume 1 Action 3 Sous-action 5"]
[1,"Leader","Gérer des rdv et appeler les clients/partenaires/fournisseurs/ etc.","A compléter costume 1 Action 4 Sous-action 1"]
[1,"Leader","Gérer des rdv et appeler les clients/partenaires/fournisseurs/ etc.","A compléter costume 1 Action 4 Sous-action 4"]
[1,"Leader","M'informer des tendances actuelles et futures qui pourraient impacter l'entreprise + Me former : min. 1 formation /an","A compléter costume 1 Action 5 Sous-action 2"]
[1,"Leader","M'informer des tendances actuelles et futures qui pourraient impacter l'entreprise + Me former : min. 1 formation /an","A compléter costume 1 Action 5 Sous-action 4"]
[2,"Manager (en interne)","Communiquer les actions prioritaires à mes équipes directes.","A compléter costume 2 Action 1 Sous-action 1"]
[2,"Manager (en interne)","Communiquer les actions prioritaires à mes équipes directes.","A compléter costume 2 Action 1 Sous-action 3"]
[2,"Manager (en interne)","Communiquer les actions prioritaires à mes équipes directes.","A compléter costume 2 Action 1 Sous-action 4"]
[2,"Manager (en interne)","Encourager et motiver toutes les personnes que je manage.","A compléter costume 2 Action 2 Sous-action 4"]
[2,"Manager (en interne)","Informer Mme J, M. O, et l'équipe X, des actions à entreprendre cette semaine","A compléter costume 2 Action 3 Sous-action 2"]
[2,"Manager (en interne)","Communiquer les objectifs à atteindre aux directeurs des différents services/ unités/ départements.","A compléter costume 2 Action 4 Sous-action 5"]
[2,"Manager (en interne)","Déléguer le travail 1 et 2 à Mme O.","A compléter costume 2 Action 5 Sous-action 4"]
[3,"Partenaire commercial (à l'externe)","Gérer la relation avec les fournisseurs","A compléter costume 3 Action 2 Sous-action 5"]
[3,"Partenaire commercial (à l'externe)","Gérer la relation avec les clients","A compléter costume 3 Action 3 Sous-action 1"]
[3,"Partenaire commercial (à l'externe)","Gérer la relation avec les clients","A compléter costume 3 Action 3 Sous-action 4"]
[3,"Partenaire commercial (à l'externe)","Gérer la relation avec la presse","A compléter costume 3 Action 4 Sous-action 1"]
[3,"Partenaire commercial (à l'externe)","Gérer la relation avec la presse","A compléter costume 3 Action 4 Sous-action 3"]
[3,"Partenaire commercial (à l'externe)","Gérer la relation avec la presse","A compléter costume 3 Action 4 Sous-action 4"]
[3,"Partenaire commercial (à l'externe)","Gérer la relation avec la presse","A compléter costume 3 Action 4 Sous-action 5"]
[3,"Partenaire commercial (à l'externe)","Gérer la relation avec les partenaires financiers","A compléter costume 3 Action 5 Sous-action 2"]
[3,"Partenaire commercial (à l'externe)","Gérer la relation avec les partenaires financiers","A compléter costume 3 Action 5 Sous-action 4"]
[4,"Mari / Amant","Communiquer régulièrement avec elle/lui","A compléter costume 4 Action 1 Sous-action 5"]
[4,"Mari / Amant","Accorder x heures par jour/semaine à elle/lui","A compléter costume 4 Action 2 Sous-action 1"]
[4,"Mari / Amant","Accorder x heures par jour/semaine à elle/lui","A compléter costume 4 Action 2 Sous-action 4"]
[4,"Mari / Amant","Répondre à ses demandes/messages/sollicitations","A compléter costume 4 Action 3 Sous-action 1"]
[4,"Mari / Amant","Répondre à ses demandes/messages/sollicitations","A compléter costume 4 Action 3 Sous-action 3"]
[4,"Mari / Amant","Répondre à ses demandes/messages/sollicitations","A compléter costume 4 Action 3 Sous-action 5"]
[4,"Mari / Amant","Emmener ma femme/mon mari au restaurant en tête à tête au moins 1 fois/semaine.","A compléter costume 4 Action 4 Sous-action 4"]
[4,"Mari / Amant","Programmer au moins 1 we entre amoureux/mois.","A compléter costume 4 Action 5 Sous-action 1"]
[4,"Mari / Amant","Programmer au moins 1 we entre amoureux/mois.","A compléter costume 4 Action 5 Sous-action 2"]
[4,"Mari / Amant","Programmer au moins 1 we entre amoureux/mois.","A compléter costume 4 Action 5 Sous-action 5"]
[5,"Père","Apporter de l'amour à mon enfant selon son langage de l'amour (= cadeaux, moments de qualité, services rendus, toucher physique, paroles valorisantes)","Aller chercher mon enfant à l'école chaque lundi et mardi soir."]
[5,"Père","Apporter de l'amour à mon enfant selon son langage de l'amour (= cadeaux, moments de qualité, services rendus, toucher physique, paroles valorisantes)","A compléter costume 5 Action 1 Sous-action 2"]
[5,"Père","Apporter de l'amour à mon enfant selon son langage de l'amour (= cadeaux, moments de qualité, services rendus, toucher physique, paroles valorisantes)","A compléter costume 5 Action 1 Sous-action 3"]
[5,"Père","M'assurer que mon/mes enfant(s) à des vêtements propres à mettre chaque jour.","A compléter costume 5 Action 2 Sous-action 1"]
[5,"Père","M'assurer que mon/mes enfant(s) à des vêtements propres à mettre chaque jour.","A compléter costume 5 Action 2 Sous-action 2"]
[5,"Père","M'assurer que mon/mes enfant(s) à des vêtements propres à mettre chaque jour.","A compléter costume 5 Action 2 Sous-action 3"]
[5,"Père","M'assurer que mon/mes enfant(s) à des vêtements propres à mettre chaque jour.","A compléter costume 5 Action 2 Sous-action 4"]
[5,"Père","Accompagner mon/mes enfant(s) à ses activités extra-scolaires. Assurer les déplacements de mon/mes enfant(s)","A compléter costume 5 Action 3 Sous-action 1"]
[5,"Père","Accompagner mon/mes enfant(s) à ses activités extra-scolaires. Assurer les déplacements de mon/mes enfant(s)","A compléter costume 5 Action 3 Sous-action 2"]
[5,"Père","Accompagner mon/mes enfant(s) à ses activités extra-scolaires. Assurer les déplacements de mon/mes enfant(s)","A compléter costume 5 Action 3 Sous-action 4"]
[5,"Père","Accompagner mon/mes enfant(s) à ses activités extra-scolaires. Assurer les déplacements de mon/mes enfant(s)","A compléter costume 5 Action 3 Sous-action 5"]
[5,"Père","Assurer l'éducation de mon enfant et aider mon/mes enfant(s) dans ses apprentissages.","A compléter costume 5 Action 4 Sous-action 1"]
[5,"Père","Assurer l'éducation de mon enfant et aider mon/mes enfant(s) dans ses apprentissages.","A compléter costume 5 Action 4 Sous-action 2"]
[5,"Père","Assurer l'éducation de mon enfant et aider mon/mes enfant(s) dans ses apprentissages.","A compléter costume 5 Action 4 Sous-action 4"]
[5,"Père","Assurer un environnement sain, propre et sécurisé pour mon/mes enfant(s)","A compléter costume 5 Action 5 Sous-action 1"]
[5,"Père","Assurer un environnement sain, propre et sécurisé pour mon/mes enfant(s)","A compléter costume 5 Action 5 Sous-action 2"]
[5,"Père","Assurer un environnement sain, propre et sécurisé pour mon/mes enfant(s)","A compléter costume 5 Action 5 Sous-action 3"]
[5,"Père","Assurer un environnement sain, propre et sécurisé pour mon/mes enfant(s)","A compléter costume 5 Action 5 Sous-action 4"]
[5,"Père","Assurer un environnement sain, propre et sécurisé pour mon/mes enfant(s)","A compléter costume 5 Action 5 Sous-action 5"]
[6,"Oncle, fils, etc. (vie familiale)","Appeler les membres X, Y, et R de ma famille 1 fois/mois.","A compléter costume 6 Action 1 Sous-action 2"]
[6,"Oncle, fils, etc. (vie familiale)","Appeler les membres X, Y, et R de ma famille 1 fois/mois.","A compléter costume 6 Action 1 Sous-action 5"]
[6,"Oncle, fils, etc. (vie familiale)","Répondre aux appels de mon père.","A compléter costume 6 Action 2 Sous-action 1"]
[6,"Oncle, fils, etc. (vie familiale)","Répondre aux appels de mon père.","A compléter costume 6 Action 2 Sous-action 4"]
[6,"Oncle, fils, etc. (vie familiale)","Soutenir Mme X dans les x prochains mois.","A compléter costume 6 Action 3 Sous-action 3"]
[6,"Oncle, fils, etc. (vie familiale)","Organiser un weekend avec X et Y au moins 2 fois/an.","A compléter costume 6 Action 4 Sous-action 2"]
[6,"Oncle, fils, etc. (vie familiale)","Organiser un weekend avec X et Y au moins 2 fois/an.","A compléter costume 6 Action 4 Sous-action 5"]
[6,"Oncle, fils, etc. (vie familiale)","Me rendre disponible pour les anniversaires de P, S, et J chaque année.","A compléter costume 6 Action 5 Sous-action 1"]
[6,"Oncle, fils, etc. (vie familiale)","Me rendre disponible pour les anniversaires de P, S, et J chaque année.","A compléter costume 6 Action 5 Sous-action 4"]
[7,"Ami / copain (vie sociale)","Passer du temps avec mes ami(e)s","A compléter costume 7 Action 1 Sous-action 1"]
[7,"Ami / copain (vie sociale)","Passer du temps avec mes ami(e)s","A compléter costume 7 Action 1 Sous-action 3"]
[7,"Ami / copain (vie sociale)","Passer du temps avec mes ami(e)s","A compléter costume 7 Action 1 Sous-action 4"]
[7,"Ami / copain (vie sociale)","Rencontrer de nouvelles personnes","A compléter costume 7 Action 2 Sous-action 3"]
[7,"Ami / copain (vie sociale)","Rencontrer de nouvelles personnes","A compléter costume 7 Action 2 Sous-action 4"]
[7,"Ami / copain (vie sociale)","Rencontrer de nouvelles personnes","A compléter costume 7 Action 2 Sous-action 5"]
[7,"Ami / copain (vie sociale)","Appeler/écrire à mes ami(e)s X, Z, et A au moins 1 fois/mois.","A compléter costume 7 Action 3 Sous-action 1"]
[7,"Ami / copain (vie sociale)","Appeler/écrire à mes ami(e)s X, Z, et A au moins 1 fois/mois.","A compléter costume 7 Action 3 Sous-action 2"]
[7,"Ami / copain (vie sociale)","Appeler/écrire à mes ami(e)s X, Z, et A au moins 1 fois/mois.","A compléter costume 7 Action 3 Sous-action 3"]
[7,"Ami / copain (vie sociale)","Appeler/écrire à mes ami(e)s X, Z, et A au moins 1 fois/mois.","A compléter costume 7 Action 3 Sous-action 4"]
[7,"Ami / copain (vie sociale)","Répondre à mes ami(e)s dans les 3 jours.","A compléter costume 7 Action 4 Sous-action 1"]
[7,"Ami / copain (vie sociale)","Répondre à mes ami(e)s dans les 3 jours.","A compléter costume 7 Action 4 Sous-action 2"]
[7,"Ami / copain (vie sociale)","Répondre à mes ami(e)s dans les 3 jours.","A compléter costume 7 Action 4 Sous-action 3"]
[7,"Ami / copain (vie sociale)","Répondre à mes ami(e)s dans les 3 jours.","A compléter costume 7 Action 4 Sous-action 4"]
[7,"Ami / copain (vie sociale)","Programmer au moins 1 sortie avec mes amis W, R, et U /mois.","A compléter costume 7 Action 5 Sous-action 1"]
[7,"Ami / copain (vie sociale)","Programmer au moins 1 sortie avec mes amis W, R, et U /mois.","A compléter costume 7 Action 5 Sous-action 4"]
[8,"Loisirs (activités, clubs, etc.)","Lire 30 minutes/semaine un livre \"plaisir\".","A compléter costume 8 Action 1 Sous-action 5"]
[8,"Loisirs (activités, clubs, etc.)","Participer au carnaval de ma ville avec mon enfant.","A compléter costume 8 Action 2 Sous-action 1"]
[8,"Loisirs (activités, clubs, etc.)","Participer au carnaval de ma ville avec mon enfant.","A compléter costume 8 Action 2 Sous-action 3"]
[8,"Loisirs (activités, clubs, etc.)","Prendre 7 jours de vacances tous les 3 mois.","A compléter costume 8 Action 3 Sous-action 1"]
[8,"Loisirs (activités, clubs, etc.)","Prendre 7 jours de vacances tous les 3 mois.","A compléter costume 8 Action 3 Sous-action 4"]
[8,"Loisirs (activités, clubs, etc.)","Prendre 7 jours de vacances tous les 3 mois.","A compléter costume 8 Action 3 Sous-action 5"]
[8,"Loisirs (activités, clubs, etc.)","Pratiquer une activité qui me plaît chaque semaine, pendant x heures minimum.","A compléter costume 8 Action 4 Sous-action 2"]
[8,"Loisirs (activités, clubs, etc.)","Pratiquer une activité qui me plaît chaque semaine, pendant x heures minimum.","A compléter costume 8 Action 4 Sous-action 3"]
[8,"Loisirs (activités, clubs, etc.)","Pratiquer une activité qui me plaît chaque semaine, pendant x heures minimum.","A compléter costume 8 Action 4 Sous-action 5"]
[8,"Loisirs (activités, clubs, etc.)","Visiter des expositions/lieux/musées","A compléter costume 8 Action 5 Sous-action 5"]
[9,"Dormeur","Suivre un rituel du coucher identique tous les soirs.","A compléter costume 9 Action 1 Sous-action 5"]
[9,"Dormeur","Ne pas regarder d'écrans au moins 1h avant de me coucher.","A compléter costume 9 Action 2 Sous-action 1"]
[9,"Dormeur","Ne pas regarder d'écrans au moins 1h avant de me coucher.","A compléter costume 9 Action 2 Sous-action 5"]
[9,"Dormeur","Me lever chaque matin à une heure fixe.","A compléter costume 9 Action 3 Sous-action 1"]
[9,"Dormeur","Méditer, visualiser, ou prendre un temps calme chaque jour de 10 minutes au réveil / à 13h00 / au coucher.","A compléter costume 9 Action 4 Sous-action 1"]
[9,"Dormeur","Méditer, visualiser, ou prendre un temps calme chaque jour de 10 minutes au réveil / à 13h00 / au coucher.","A compléter costume 9 Action 4 Sous-action 5"]
[9,"Dormeur","Manger léger tous les soirs du lundi au vendredi, sans sucre ni café.","A compléter costume 9 Action 5 Sous-action 4"]
[9,"Dormeur","Manger léger tous les soirs du lundi au vendredi, sans sucre ni café.","A compléter costume 9 Action 5 Sous-action 5"]
[10,"Sportif","Acheter mes tenues et mon matériel de sport.","A compléter costume 10 Action 1 Sous-action 1"]
[10,"Sportif","Acheter mes tenues et mon matériel de sport.","A compléter costume 10 Action 1 Sous-action 3"]
[10,"Sportif","Acheter mes tenues et mon matériel de sport.","A compléter costume 10 Action 1 Sous-action 5"]
[10,"Sportif","Courir 2 fois / semaine pendant 30 minutes minimum.","A compléter costume 10 Action 2 Sous-action 1"]
[10,"Sportif","Courir 2 fois / semaine pendant 30 minutes minimum.","A compléter costume 10 Action 2 Sous-action 2"]
[10,"Sportif","Courir 2 fois / semaine pendant 30 minutes minimum.","A compléter costume 10 Action 2 Sous-action 3"]
[10,"Sportif","M'étirer 10 minutes tous les soirs à 21h00.","A compléter costume 10 Action 3 Sous-action 1"]
[10,"Sportif","M'étirer 10 minutes tous les soirs à 21h00.","A compléter costume 10 Action 3 Sous-action 3"]
[10,"Sportif","M'étirer 10 minutes tous les soirs à 21h00.","A compléter costume 10 Action 3 Sous-action 4"]
[10,"Sportif","M'étirer 10 minutes tous les soirs à 21h00.","A compléter costume 10 Action 3 Sous-action 5"]
[10,"Sportif","Boire au moins 1,5 litres d'eau par jour.","A compléter costume 10 Action 4 Sous-action 1"]
[10,"Sportif","Boire au moins 1,5 litres d'eau par jour.","A compléter costume 10 Action 4 Sous-action 2"]
[10,"Sportif","Boire au moins 1,5 litres d'eau par jour.","A compléter costume 10 Action 4 Sous-action 4"]
[10,"Sportif","Boire au moins 1,5 litres d'eau par jour.","A compléter costume 10 Action 4 Sous-action 5"]

{"sheet":"Synthèse 2","index":13,"n_rows":211,"n_cols":17,"rows_kept":211,"cut":false,"hidden":false,"merged":[[2,0,2,1],[2,2,2,3]]}
["Synthèse 2 des rôles-costumes à endosser (seul ou à plusieurs) :"]
[]
["Objectif rappel :",null,{"$f":"+'Objectif SMARTER'!$A$6","v":"Je veux…"}]
[]
[]
["Costume n°","Nom du rôle-costume","Actions","Sous-actions","Pourquoi réaliser seul cette sous-action ?","Pourquoi partager (scinder) cette sous-action en plusieurs sous-sous-actions ?\nPourquoi déléguer une partie de cette sous-action ?","Pourquoi cette sous-action est-elle utile/ objectif ?\nQuels sont ses bénéfices / objectif ?","Avec qui vous devez partager cette sous-action ? (Membres de votre famille, amis, collègues, supérieurs, etc.)\nEt que doit(vent) faire précisément cette/ces personne(s) ?","Quelle sous-sous-action précise vous devez réaliser seul ?","Critère de réalisation cette sous-action.\n(rendu final visible et mesurable / objectif)","Au cours de quelle(s) étape(s) / votre objectif devez-vous réaliser cette sous-action ?","Quand devez-vous réaliser cette sous-action ?\n(contextes, horaires précis, régularité ou pas, moments de la journée, période(s) de l'année, etc.)","Où devez-vous réaliser cette sous-action ?\n(lieux précis)","Avec qui devez-vous réaliser cette sous-action ?\n(personnes précises)","Comment devez-vous réaliser cette sous-action ? \n(niveau d'énergie requis, humeur, qualité(s), force(s), ou talent(s) requis, etc.)","Combien d’heures min./ max. consacrer à cette sous-action par jour/ semaine/ mois/ année ?","Suite à donner à cette sous-action ?\n(durée prévue d’utilisation, date limite de réalisation, conséquences long terme, etc.)"]
[1,"Leader","Répondre aux mails & aux appels importants","Répondre aux clients externes","Parce que ggg",null,"Car elle me permet de réaliser…",null,null,"Cette sous-action est réalisée si…","L'étape 1, et l'étape 4","Le matin entre 07h00 et 8h00.","Au bureau à VILLE, ou dans mon bureau chez moi.","Avec Mme J et M. K.","Je dois avoir un niveau d'énergie de min. 7/10 et être de bonne humeur. Qualités requises :…","1h/semaine max.","Pas de fin : cette action sera encore nécessaire dans 5 ans."]
[1,"Leader","Répondre aux mails & aux appels importants","Répondre aux demandes nouvelles venant de l'externe","Car hhh",null,"Parce qu'elle me permet de faire…",null,null,"Cette sous-action est réalisée quand…","L'étape 1 et 2.","Entre 14h00 et 14h30.","Au bureau à VILLE, ou dans mon bureau chez moi.","Avec Mme O.","Peu importe mon humeur. Niveau d'énergie min. 4/10. Qualité requise…","2h/mois max","Fin de cette action à prévoir quand j'aurai réalisé l'action ACTION."]
[1,"Leader","Présenter les résultats de l'entreprise","S'assurer que les résultats sont corrects","Parce que oooo",null,null,null,null,null,"Toutes les étapes.","Entre 13h00 et 13h10.","Au bureau à VILLE, ou dans mon bureau chez moi.",null,"Talent requis = ","5h/année max."]
[1,"Leader","Présenter les résultats de l'entreprise","A compléter costume 1 Action 2 Sous-action 4","Car kkk",null,null,null,null,null,"L'étape 3 et 5.",null,null,null,null,"30 minutes/jour minimum"]
[1,"Leader","Définir et valider la vision/stratégie à moyen et à long terme pour l'entreprise. Réflexions et discusssions stratégiques","A compléter costume 1 Action 3 Sous-action 4",null,null,null,null,null,null,"L'étape 5.",null,null,null,null,"2h/jour minimum"]
[1,"Leader","Gérer des rdv et appeler les clients/partenaires/fournisseurs/ etc.","A compléter costume 1 Action 4 Sous-action 2"]
[1,"Leader","M'informer des tendances actuelles et futures qui pourraient impacter l'entreprise + Me former : min. 1 formation /an","A compléter costume 1 Action 5 Sous-action 1"]
[1,"Leader","M'informer des tendances actuelles et futures qui pourraient impacter l'entreprise + Me former : min. 1 formation /an","A compléter costume 1 Action 5 Sous-action 3"]
[1,"Leader","M'informer des tendances actuelles et futures qui pourraient impacter l'entreprise + Me former : min. 1 formation /an","A compléter costume 1 Action 5 Sous-action 5"]
[2,"Manager (en interne)","Communiquer les actions prioritaires à mes équipes directes.","A compléter costume 2 Action 1 Sous-action 2"]
[2,"Manager (en interne)","Encourager et motiver toutes les personnes que je manage.","A compléter costume 2 Action 2 Sous-action 1"]
[2,"Manager (en interne)","Encourager et motiver toutes les personnes que je manage.","A compléter costume 2 Action 2 Sous-action 3"]
[2,"Manager (en interne)","Encourager et motiver toutes les personnes que je manage.","A compléter costume 2 Action 2 Sous-action 5"]
[2,"Manager (en interne)","Informer Mme J, M. O, et l'équipe X, des actions à entreprendre cette semaine","A compléter costume 2 Action 3 Sous-action 1"]
[2,"Manager (en interne)","Informer Mme J, M. O, et l'équipe X, des actions à entreprendre cette semaine","A compléter costume 2 Action 3 Sous-action 3"]
[2,"Manager (en interne)","Informer Mme J, M. O, et l'équipe X, des actions à entreprendre cette semaine","A compléter costume 2 Action 3 Sous-action 5"]
[2,"Manager (en interne)","Communiquer les objectifs à atteindre aux directeurs des différents services/ unités/ départements.","A compléter costume 2 Action 4 Sous-action 2"]
[2,"Manager (en interne)","Communiquer les objectifs à atteindre aux directeurs des différents services/ unités/ départements.","A compléter costume 2 Action 4 Sous-action 3"]
[2,"Manager (en interne)","Communiquer les objectifs à atteindre aux directeurs des différents services/ unités/ départements.","A compléter costume 2 Action 4 Sous-action 4"]
[2,"Manager (en interne)","Déléguer le travail 1 et 2 à Mme O.","A compléter costume 2 Action 5 Sous-action 1"]
[2,"Manager (en interne)","Déléguer le travail 1 et 2 à Mme O.","A compléter costume 2 Action 5 Sous-action 2"]
[2,"Manager (en interne)","Déléguer le travail 1 et 2 à Mme O.","A compléter costume 2 Action 5 Sous-action 3"]
[2,"Manager (en interne)","Déléguer le travail 1 et 2 à Mme O.","A compléter costume 2 Action 5 Sous-action 5"]
[3,"Partenaire commercial (à l'externe)","Répondre aux principaux partenaires externes de l'entreprise","A compléter costume 3 Action 1 Sous-action 3"]
[3,"Partenaire commercial (à l'externe)","Répondre aux principaux partenaires externes de l'entreprise","A compléter costume 3 Action 1 Sous-action 4"]
[3,"Partenaire commercial (à l'externe)","Gérer la relation avec les fournisseurs","A compléter costume 3 Action 2 Sous-action 1"]
[3,"Partenaire commercial (à l'externe)","Gérer la relation avec les fournisseurs","A compléter costume 3 Action 2 Sous-action 2"]
[3,"Partenaire commercial (à l'externe)","Gérer la relation avec les fournisseurs","A compléter costume 3 Action 2 Sous-action 3"]
[3,"Partenaire commercial (à l'externe)","Gérer la relation avec les fournisseurs","A compléter costume 3 Action 2 Sous-action 4"]
[3,"Partenaire commercial (à l'externe)","Gérer la relation avec les clients","A compléter costume 3 Action 3 Sous-action 2"]
[3,"Partenaire commercial (à l'externe)","Gérer la relation avec les clients","A compléter costume 3 Action 3 Sous-action 5"]
[3,"Partenaire commercial (à l'externe)","Gérer la relation avec la presse","A compléter costume 3 Action 4 Sous-action 2"]
[3,"Partenaire commercial (à l'externe)","Gérer la relation avec les partenaires financiers","A compléter costume 3 Action 5 Sous-action 3"]
[3,"Partenaire commercial (à l'externe)","Gérer la relation avec les partenaires financiers","A compléter costume 3 Action 5 Sous-action 5"]
[4,"Mari / Amant","Communiquer régulièrement avec elle/lui","A compléter costume 4 Action 1 Sous-action 2"]
[4,"Mari / Amant","Communiquer régulièrement avec elle/lui","A compléter costume 4 Action 1 Sous-action 3"]
[4,"Mari / Amant","Accorder x heures par jour/semaine à elle/lui","A compléter costume 4 Action 2 Sous-action 2"]
[4,"Mari / Amant","Accorder x heures par jour/semaine à elle/lui","A compléter costume 4 Action 2 Sous-action 3"]
[4,"Mari / Amant","Répondre à ses demandes/messages/sollicitations","A compléter costume 4 Action 3 Sous-action 2"]
[4,"Mari / Amant","Emmener ma femme/mon mari au restaurant en tête à tête au moins 1 fois/semaine.","A compléter costume 4 Action 4 Sous-action 1"]
[4,"Mari / Amant","Emmener ma femme/mon mari au restaurant en tête à tête au moins 1 fois/semaine.","A compléter costume 4 Action 4 Sous-action 2"]
[4,"Mari / Amant","Emmener ma femme/mon mari au restaurant en tête à tête au moins 1 fois/semaine.","A compléter costume 4 Action 4 Sous-action 3"]
[4,"Mari / Amant","Emmener ma femme/mon mari au restaurant en tête à tête au moins 1 fois/semaine.","A compléter costume 4 Action 4 Sous-action 5"]
[4,"Mari / Amant","Programmer au moins 1 we entre amoureux/mois.","A compléter costume 4 Action 5 Sous-action 3"]
[5,"Père","Apporter de l'amour à mon enfant selon son langage de l'amour (= cadeaux, moments de qualité, services rendus, toucher physique, paroles valorisantes)","A compléter costume 5 Action 1 Sous-action 4"]
[5,"Père","Apporter de l'amour à mon enfant selon son langage de l'amour (= cadeaux, moments de qualité, services rendus, toucher physique, paroles valorisantes)","A compléter costume 5 Action 1 Sous-action 5"]
[5,"Père","M'assurer que mon/mes enfant(s) à des vêtements propres à mettre chaque jour.","A compléter costume 5 Action 2 Sous-action 5"]
[5,"Père","Assurer l'éducation de mon enfant et aider mon/mes enfant(s) dans ses apprentissages.","A compléter costume 5 Action 4 Sous-action 5"]
[6,"Oncle, fils, etc. (vie familiale)","Appeler les membres X, Y, et R de ma famille 1 fois/mois.","A compléter costume 6 Action 1 Sous-action 1"]
[6,"Oncle, fils, etc. (vie familiale)","Appeler les membres X, Y, et R de ma famille 1 fois/mois.","A compléter costume 6 Action 1 Sous-action 4"]
[6,"Oncle, fils, etc. (vie familiale)","Répondre aux appels de mon père.","A compléter costume 6 Action 2 Sous-action 3"]
[6,"Oncle, fils, etc. (vie familiale)","Soutenir Mme X dans les x prochains mois.","A compléter costume 6 Action 3 Sous-action 2"]
[6,"Oncle, fils, etc. (vie familiale)","Soutenir Mme X dans les x prochains mois.","A compléter costume 6 Action 3 Sous-action 5"]
[6,"Oncle, fils, etc. (vie familiale)","Organiser un weekend avec X et Y au moins 2 fois/an.","A compléter costume 6 Action 4 Sous-action 1"]
[6,"Oncle, fils, etc. (vie familiale)","Organiser un weekend avec X et Y au moins 2 fois/an.","A compléter costume 6 Action 4 Sous-action 4"]
[6,"Oncle, fils, etc. (vie familiale)","Me rendre disponible pour les anniversaires de P, S, et J chaque année.","A compléter costume 6 Action 5 Sous-action 3"]
[7,"Ami / copain (vie sociale)","Passer du temps avec mes ami(e)s","A compléter costume 7 Action 1 Sous-action 2"]
[7,"Ami / copain (vie sociale)","Rencontrer de nouvelles personnes","A compléter costume 7 Action 2 Sous-action 1"]
[7,"Ami / copain (vie sociale)","Rencontrer de nouvelles personnes","A compléter costume 7 Action 2 Sous-action 2"]
[7,"Ami / copain (vie sociale)","Appeler/écrire à mes ami(e)s X, Z, et A au moins 1 fois/mois.","A compléter costume 7 Action 3 Sous-action 5"]
[7,"Ami / copain (vie sociale)","Programmer au moins 1 sortie avec mes amis W, R, et U /mois.","A compléter costume 7 Action 5 Sous-action 2"]
[7,"Ami / copain (vie sociale)","Programmer au moins 1 sortie avec mes amis W, R, et U /mois.","A compléter costume 7 Action 5 Sous-action 5"]
[8,"Loisirs (activités, clubs, etc.)","Lire 30 minutes/semaine un livre \"plaisir\".","A compléter costume 8 Action 1 Sous-action 1"]
[8,"Loisirs (activités, clubs, etc.)","Lire 30 minutes/semaine un livre \"plaisir\".","A compléter costume 8 Action 1 Sous-action 2"]
[8,"Loisirs (activités, clubs, etc.)","Lire 30 minutes/semaine un livre \"plaisir\".","A compléter costume 8 Action 1 Sous-action 4"]
[8,"Loisirs (activités, clubs, etc.)","Participer au carnaval de ma ville avec mon enfant.","A compléter costume 8 Action 2 Sous-action 2"]
[8,"Loisirs (activités, clubs, etc.)","Participer au carnaval de ma ville avec mon enfant.","A compléter costume 8 Action 2 Sous-action 4"]
[8,"Loisirs (activités, clubs, etc.)","Prendre 7 jours de vacances tous les 3 mois.","A compléter costume 8 Action 3 Sous-action 2"]
[8,"Loisirs (activités, clubs, etc.)","Pratiquer une activité qui me plaît chaque semaine, pendant x heures minimum.","A compléter costume 8 Action 4 Sous-action 4"]
[8,"Loisirs (activités, clubs, etc.)","Visiter des expositions/lieux/musées","A compléter costume 8 Action 5 Sous-action 1"]
[8,"Loisirs (activités, clubs, etc.)","Visiter des expositions/lieux/musées","A compléter costume 8 Action 5 Sous-action 2"]
[8,"Loisirs (activités, clubs, etc.)","Visiter des expositions/lieux/musées","A compléter costume 8 Action 5 Sous-action 3"]
[8,"Loisirs (activités, clubs, etc.)","Visiter des expositions/lieux/musées","A compléter costume 8 Action 5 Sous-action 4"]
[9,"Dormeur","Suivre un rituel du coucher identique tous les soirs.","Me coucher chaque soir à heure fixe."]
[9,"Dormeur","Suivre un rituel du coucher identique tous les soirs.","A compléter costume 9 Action 1 Sous-action 4"]
[9,"Dormeur","Ne pas regarder d'écrans au moins 1h avant de me coucher.","A compléter costume 9 Action 2 Sous-action 2"]
[9,"Dormeur","Ne pas regarder d'écrans au moins 1h avant de me coucher.","A compléter costume 9 Action 2 Sous-action 3"]
[9,"Dormeur","Ne pas regarder d'écrans au moins 1h avant de me coucher.","A compléter costume 9 Action 2 Sous-action 4"]
[9,"Dormeur","Me lever chaque matin à une heure fixe.","A compléter costume 9 Action 3 Sous-action 2"]
[9,"Dormeur","Me lever chaque matin à une heure fixe.","A compléter costume 9 Action 3 Sous-action 3"]
[9,"Dormeur","Me lever chaque matin à une heure fixe.","A compléter costume 9 Action 3 Sous-action 4"]
[9,"Dormeur","Me lever chaque matin à une heure fixe.","A compléter costume 9 Action 3 Sous-action 5"]
[9,"Dormeur","Méditer, visualiser, ou prendre un temps calme chaque jour de 10 minutes au réveil / à 13h00 / au coucher.","A compléter costume 9 Action 4 Sous-action 2"]
[9,"Dormeur","Méditer, visualiser, ou prendre un temps calme chaque jour de 10 minutes au réveil / à 13h00 / au coucher.","A compléter costume 9 Action 4 Sous-action 3"]
[9,"Dormeur","Méditer, visualiser, ou prendre un temps calme chaque jour de 10 minutes au réveil / à 13h00 / au coucher.","A compléter costume 9 Action 4 Sous-action 4"]
[9,"Dormeur","Manger léger tous les soirs du lundi au vendredi, sans sucre ni café.","A compléter costume 9 Action 5 Sous-action 1"]
[9,"Dormeur","Manger léger tous les soirs du lundi au vendredi, sans sucre ni café.","A compléter costume 9 Action 5 Sous-action 2"]
[9,"Dormeur","Manger léger tous les soirs du lundi au vendredi, sans sucre ni café.","A compléter costume 9 Action 5 Sous-action 3"]
[10,"Sportif","Manger des légumes midi et soir, et des protéines matin et midi.","A compléter costume 10 Action 5 Sous-action 3"]
[10,"Sportif","Manger des légumes midi et soir, et des protéines matin et midi.","A compléter costume 10 Action 5 Sous-action 4"]
[10,"Sportif","Manger des légumes midi et soir, et des protéines matin et midi.","A compléter costume 10 Action 5 Sous-action 5"]
[1,"Leader","Répondre aux mails & aux appels importants","Répondre aux clients internes",null,"Car c'est la meilleure manière de…","Car il faut…","Je dois partager cette sous-action avec Mme J et M. K.","Je dois faire…","Avoir obtenu x fois…","Les étapes 1 et 4","De 8h00 à 9h00.","Au bureau à VILLE, ou dans mon bureau chez moi.","Avec M. O et M. Z.","Niveau d'énergie minimum = 6/10, qualités requises = , humeur = 7/10 min.","Min. 2h/semaine.","A revoir après l'étape 4 si elle sera toujours utile."]
[1,"Leader","Répondre aux mails & aux appels importants","Répondre à la Presse",null,null,"Parce que…","Je dois partager cette sous-action avec Mme O.","Je dois réaliser…","Quand le résultat X est atteint.","L'étape 4","Le matin, avant 12h00,","Au bureau à VILLE, ou dans mon bureau chez moi.","Avec l'ensemble de l'équipe X",null,"Max. 4h/jour.","Prévoir une autre solution éventuellement quand je serai à l'étape 5."]
[1,"Leader","Présenter les résultats de l'entreprise","Anticiper le travail à produire par les équipes",null,null,"Car c'est important de…",null,null,null,"L'étape 2","Le soir à partir de 18h00, et avant 21h00.","Chez moi ou chez M. F.",null,"Humeur = peu importe, qualités =, forces = , niveau d'énergie min. 4/10","Min. 1h/jour.","Sans fin = toujours utile même quand j'aurai 80 ans !"]
[1,"Leader","Présenter les résultats de l'entreprise","A compléter costume 1 Action 2 Sous-action 3",null,null,null,null,null,null,"Toutes les 5 étapes.",null,"Au bureau à VILLE, ou dans mon bureau chez moi.","Avec Mme R, Mme T et M. F",null,"Max. 20h/an"]
[1,"Leader","Présenter les résultats de l'entreprise","A compléter costume 1 Action 2 Sous-action 5"]
[1,"Leader","Définir et valider la vision/stratégie à moyen et à long terme pour l'entreprise. Réflexions et discusssions stratégiques","A compléter costume 1 Action 3 Sous-action 1"]
[1,"Leader","Définir et valider la vision/stratégie à moyen et à long terme pour l'entreprise. Réflexions et discusssions stratégiques","A compléter costume 1 Action 3 Sous-action 2"]
[1,"Leader","Définir et valider la vision/stratégie à moyen et à long terme pour l'entreprise. Réflexions et discusssions stratégiques","A compléter costume 1 Action 3 Sous-action 5"]
[1,"Leader","Gérer des rdv et appeler les clients/partenaires/fournisseurs/ etc.","A compléter costume 1 Action 4 Sous-action 1"]
[1,"Leader","Gérer des rdv et appeler les clients/partenaires/fournisseurs/ etc.","A compléter costume 1 Action 4 Sous-action 4"]
[1,"Leader","M'informer des tendances actuelles et futures qui pourraient impacter l'entreprise + Me former : min. 1 formation /an","A compléter costume 1 Action 5 Sous-action 2"]
[1,"Leader","M'informer des tendances actuelles et futures qui pourraient impacter l'entreprise + Me former : min. 1 formation /an","A compléter costume 1 Action 5 Sous-action 4"]
[2,"Manager (en interne)","Communiquer les actions prioritaires à mes équipes directes.","A compléter costume 2 Action 1 Sous-action 1"]
[2,"Manager (en interne)","Communiquer les actions prioritaires à mes équipes directes.","A compléter costume 2 Action 1 Sous-action 3"]
[2,"Manager (en interne)","Communiquer les actions prioritaires à mes équipes directes.","A compléter costume 2 Action 1 Sous-action 4"]
[2,"Manager (en interne)","Encourager et motiver toutes les personnes que je manage.","A compléter costume 2 Action 2 Sous-action 4"]
[2,"Manager (en interne)","Informer Mme J, M. O, et l'équipe X, des actions à entreprendre cette semaine","A compléter costume 2 Action 3 Sous-action 2"]
[2,"Manager (en interne)","Communiquer les objectifs à atteindre aux directeurs des différents services/ unités/ départements.","A compléter costume 2 Action 4 Sous-action 5"]
[2,"Manager (en interne)","Déléguer le travail 1 et 2 à Mme O.","A compléter costume 2 Action 5 Sous-action 4"]
[3,"Partenaire commercial (à l'externe)","Gérer la relation avec les fournisseurs","A compléter costume 3 Action 2 Sous-action 5"]
[3,"Partenaire commercial (à l'externe)","Gérer la relation avec les clients","A compléter costume 3 Action 3 Sous-action 1"]
[3,"Partenaire commercial (à l'externe)","Gérer la relation avec les clients","A compléter costume 3 Action 3 Sous-action 4"]
[3,"Partenaire commercial (à l'externe)","Gérer la relation avec la presse","A compléter costume 3 Action 4 Sous-action 1"]
[3,"Partenaire commercial (à l'externe)","Gérer la relation avec la presse","A compléter costume 3 Action 4 Sous-action 3"]
[3,"Partenaire commercial (à l'externe)","Gérer la relation avec la presse","A compléter costume 3 Action 4 Sous-action 4"]
[3,"Partenaire commercial (à l'externe)","Gérer la relation avec la presse","A compléter costume 3 Action 4 Sous-action 5"]
[3,"Partenaire commercial (à l'externe)","Gérer la relation avec les partenaires financiers","A compléter costume 3 Action 5 Sous-action 2"]
[3,"Partenaire commercial (à l'externe)","Gérer la relation avec les partenaires financiers","A compléter costume 3 Action 5 Sous-action 4"]
[4,"Mari / Amant","Communiquer régulièrement avec elle/lui","A compléter costume 4 Action 1 Sous-action 5"]
[4,"Mari / Amant","Accorder x heures par jour/semaine à elle/lui","A compléter costume 4 Action 2 Sous-action 1"]
[4,"Mari / Amant","Accorder x heures par jour/semaine à elle/lui","A compléter costume 4 Action 2 Sous-action 4"]
[4,"Mari / Amant","Répondre à ses demandes/messages/sollicitations","A compléter costume 4 Action 3 Sous-action 1"]
[4,"Mari / Amant","Répondre à ses demandes/messages/sollicitations","A compléter costume 4 Action 3 Sous-action 3"]
[4,"Mari / Amant","Répondre à ses demandes/messages/sollicitations","A compléter costume 4 Action 3 Sous-action 5"]
[4,"Mari / Amant","Emmener ma femme/mon mari au restaurant en tête à tête au moins 1 fois/semaine.","A compléter costume 4 Action 4 Sous-action 4"]
[4,"Mari / Amant","Programmer au moins 1 we entre amoureux/mois.","A compléter costume 4 Action 5 Sous-action 1"]
[4,"Mari / Amant","Programmer au moins 1 we entre amoureux/mois.","A compléter costume 4 Action 5 Sous-action 2"]
[4,"Mari / Amant","Programmer au moins 1 we entre amoureux/mois.","A compléter costume 4 Action 5 Sous-action 5"]
[5,"Père","Apporter de l'amour à mon enfant selon son langage de l'amour (= cadeaux, moments de qualité, services rendus, toucher physique, paroles valorisantes)","Aller chercher mon enfant à l'école chaque lundi et mardi soir."]
[5,"Père","Apporter de l'amour à mon enfant selon son langage de l'amour (= cadeaux, moments de qualité, services rendus, toucher physique, paroles valorisantes)","A compléter costume 5 Action 1 Sous-action 2"]
[5,"Père","Apporter de l'amour à mon enfant selon son langage de l'amour (= cadeaux, moments de qualité, services rendus, toucher physique, paroles valorisantes)","A compléter costume 5 Action 1 Sous-action 3"]
[5,"Père","M'assurer que mon/mes enfant(s) à des vêtements propres à mettre chaque jour.","A compléter costume 5 Action 2 Sous-action 1"]
[5,"Père","M'assurer que mon/mes enfant(s) à des vêtements propres à mettre chaque jour.","A compléter costume 5 Action 2 Sous-action 2"]
[5,"Père","M'assurer que mon/mes enfant(s) à des vêtements propres à mettre chaque jour.","A compléter costume 5 Action 2 Sous-action 3"]
[5,"Père","M'assurer que mon/mes enfant(s) à des vêtements propres à mettre chaque jour.","A compléter costume 5 Action 2 Sous-action 4"]
[5,"Père","Accompagner mon/mes enfant(s) à ses activités extra-scolaires. Assurer les déplacements de mon/mes enfant(s)","A compléter costume 5 Action 3 Sous-action 1"]
[5,"Père","Accompagner mon/mes enfant(s) à ses activités extra-scolaires. Assurer les déplacements de mon/mes enfant(s)","A compléter costume 5 Action 3 Sous-action 2"]
[5,"Père","Accompagner mon/mes enfant(s) à ses activités extra-scolaires. Assurer les déplacements de mon/mes enfant(s)","A compléter costume 5 Action 3 Sous-action 4"]
[5,"Père","Accompagner mon/mes enfant(s) à ses activités extra-scolaires. Assurer les déplacements de mon/mes enfant(s)","A compléter costume 5 Action 3 Sous-action 5"]
[5,"Père","Assurer l'éducation de mon enfant et aider mon/mes enfant(s) dans ses apprentissages.","A compléter costume 5 Action 4 Sous-action 1"]
[5,"Père","Assurer l'éducation de mon enfant et aider mon/mes enfant(s) dans ses apprentissages.","A compléter costume 5 Action 4 Sous-action 2"]
[5,"Père","Assurer l'éducation de mon enfant et aider mon/mes enfant(s) dans ses apprentissages.","A compléter costume 5 Action 4 Sous-action 4"]
[5,"Père","Assurer un environnement sain, propre et sécurisé pour mon/mes enfant(s)","A compléter costume 5 Action 5 Sous-action 1"]
[5,"Père","Assurer un environnement sain, propre et sécurisé pour mon/mes enfant(s)","A compléter costume 5 Action 5 Sous-action 2"]
[5,"Père","Assurer un environnement sain, propre et sécurisé pour mon/mes enfant(s)","A compléter costume 5 Action 5 Sous-action 3"]
[5,"Père","Assurer un environnement sain, propre et sécurisé pour mon/mes enfant(s)","A compléter costume 5 Action 5 Sous-action 4"]
[5,"Père","Assurer un environnement sain, propre et sécurisé pour mon/mes enfant(s)","A compléter costume 5 Action 5 Sous-action 5"]
[6,"Oncle, fils, etc. (vie familiale)","Appeler les membres X, Y, et R de ma famille 1 fois/mois.","A compléter costume 6 Action 1 Sous-action 2"]
[6,"Oncle, fils, etc. (vie familiale)","Appeler les membres X, Y, et R de ma famille 1 fois/mois.","A compléter costume 6 Action 1 Sous-action 5"]
[6,"Oncle, fils, etc. (vie familiale)","Répondre aux appels de mon père.","A compléter costume 6 Action 2 Sous-action 1"]
[6,"Oncle, fils, etc. (vie familiale)","Répondre aux appels de mon père.","A compléter costume 6 Action 2 Sous-action 4"]
[6,"Oncle, fils, etc. (vie familiale)","Soutenir Mme X dans les x prochains mois.","A compléter costume 6 Action 3 Sous-action 3"]
[6,"Oncle, fils, etc. (vie familiale)","Organiser un weekend avec X et Y au moins 2 fois/an.","A compléter costume 6 Action 4 Sous-action 2"]
[6,"Oncle, fils, etc. (vie familiale)","Organiser un weekend avec X et Y au moins 2 fois/an.","A compléter costume 6 Action 4 Sous-action 5"]
[6,"Oncle, fils, etc. (vie familiale)","Me rendre disponible pour les anniversaires de P, S, et J chaque année.","A compléter costume 6 Action 5 Sous-action 1"]
[6,"Oncle, fils, etc. (vie familiale)","Me rendre disponible pour les anniversaires de P, S, et J chaque année.","A compléter costume 6 Action 5 Sous-action 4"]
[7,"Ami / copain (vie sociale)","Passer du temps avec mes ami(e)s","A compléter costume 7 Action 1 Sous-action 1"]
[7,"Ami / copain (vie sociale)","Passer du temps avec mes ami(e)s","A compléter costume 7 Action 1 Sous-action 3"]
[7,"Ami / copain (vie sociale)","Passer du temps avec mes ami(e)s","A compléter costume 7 Action 1 Sous-action 4"]
[7,"Ami / copain (vie sociale)","Rencontrer de nouvelles personnes","A compléter costume 7 Action 2 Sous-action 3"]
[7,"Ami / copain (vie sociale)","Rencontrer de nouvelles personnes","A compléter costume 7 Action 2 Sous-action 4"]
[7,"Ami / copain (vie sociale)","Rencontrer de nouvelles personnes","A compléter costume 7 Action 2 Sous-action 5"]
[7,"Ami / copain (vie sociale)","Appeler/écrire à mes ami(e)s X, Z, et A au moins 1 fois/mois.","A compléter costume 7 Action 3 Sous-action 1"]
[7,"Ami / copain (vie sociale)","Appeler/écrire à mes ami(e)s X, Z, et A au moins 1 fois/mois.","A compléter costume 7 Action 3 Sous-action 2"]
[7,"Ami / copain (vie sociale)","Appeler/écrire à mes ami(e)s X, Z, et A au moins 1 fois/mois.","A compléter costume 7 Action 3 Sous-action 3"]
[7,"Ami / copain (vie sociale)","Appeler/écrire à mes ami(e)s X, Z, et A au moins 1 fois/mois.","A compléter costume 7 Action 3 Sous-action 4"]
[7,"Ami / copain (vie sociale)","Répondre à mes ami(e)s dans les 3 jours.","A compléter costume 7 Action 4 Sous-action 1"]
[7,"Ami / copain (vie sociale)","Répondre à mes ami(e)s dans les 3 jours.","A compléter costume 7 Action 4 Sous-action 2"]
[7,"Ami / copain (vie sociale)","Répondre à mes ami(e)s dans les 3 jours.","A compléter costume 7 Action 4 Sous-action 3"]
[7,"Ami / copain (vie sociale)","Répondre à mes ami(e)s dans les 3 jours.","A compléter costume 7 Action 4 Sous-action 4"]
[7,"Ami / copain (vie sociale)","Programmer au moins 1 sortie avec mes amis W, R, et U /mois.","A compléter costume 7 Action 5 Sous-action 1"]
[7,"Ami / copain (vie sociale)","Programmer au moins 1 sortie avec mes amis W, R, et U /mois.","A compléter costume 7 Action 5 Sous-action 4"]
[8,"Loisirs (activités, clubs, etc.)","Lire 30 minutes/semaine un livre \"plaisir\".","A compléter costume 8 Action 1 Sous-action 5"]
[8,"Loisirs (activités, clubs, etc.)","Participer au carnaval de ma ville avec mon enfant.","A compléter costume 8 Action 2 Sous-action 1"]
[8,"Loisirs (activités, clubs, etc.)","Participer au carnaval de ma ville avec mon enfant.","A compléter costume 8 Action 2 Sous-action 3"]
[8,"Loisirs (activités, clubs, etc.)","Prendre 7 jours de vacances tous les 3 mois.","A compléter costume 8 Action 3 Sous-action 1"]
[8,"Loisirs (activités, clubs, etc.)","Prendre 7 jours de vacances tous les 3 mois.","A compléter costume 8 Action 3 Sous-action 4"]
[8,"Loisirs (activités, clubs, etc.)","Prendre 7 jours de vacances tous les 3 mois.","A compléter costume 8 Action 3 Sous-action 5"]
[8,"Loisirs (activités, clubs, etc.)","Pratiquer une activité qui me plaît chaque semaine, pendant x heures minimum.","A compléter costume 8 Action 4 Sous-action 2"]
[8,"Loisirs (activités, clubs, etc.)","Pratiquer une activité qui me plaît chaque semaine, pendant x heures minimum.","A compléter costume 8 Action 4 Sous-action 3"]
[8,"Loisirs (activités, clubs, etc.)","Pratiquer une activité qui me plaît chaque semaine, pendant x heures minimum.","A compléter costume 8 Action 4 Sous-action 5"]
[8,"Loisirs (activités, clubs, etc.)","Visiter des expositions/lieux/musées","A compléter costume 8 Action 5 Sous-action 5"]
[9,"Dormeur","Suivre un rituel du coucher identique tous les soirs.","A compléter costume 9 Action 1 Sous-action 5"]
[9,"Dormeur","Ne pas regarder d'écrans au moins 1h avant de me coucher.","A compléter costume 9 Action 2 Sous-action 1"]
[9,"Dormeur","Ne pas regarder d'écrans au moins 1h avant de me coucher.","A compléter costume 9 Action 2 Sous-action 5"]
[9,"Dormeur","Me lever chaque matin à une heure fixe.","A compléter costume 9 Action 3 Sous-action 1"]
[9,"Dormeur","Méditer, visualiser, ou prendre un temps calme chaque jour de 10 minutes au réveil / à 13h00 / au coucher.","A compléter costume 9 Action 4 Sous-action 1"]
[9,"Dormeur","Méditer, visualiser, ou prendre un temps calme chaque jour de 10 minutes au réveil / à 13h00 / au coucher.","A compléter costume 9 Action 4 Sous-action 5"]
[9,"Dormeur","Manger léger tous les soirs du lundi au vendredi, sans sucre ni café.","A compléter costume 9 Action 5 Sous-action 4"]
[9,"Dormeur","Manger léger tous les soirs du lundi au vendredi, sans sucre ni café.","A compléter costume 9 Action 5 Sous-action 5"]
[10,"Sportif","Acheter mes tenues et mon matériel de sport.","A compléter costume 10 Action 1 Sous-action 1"]
[10,"Sportif","Acheter mes tenues et mon matériel de sport.","A compléter costume 10 Action 1 Sous-action 3"]
[10,"Sportif","Acheter mes tenues et mon matériel de sport.","A compléter costume 10 Action 1 Sous-action 5"]
[10,"Sportif","Courir 2 fois / semaine pendant 30 minutes minimum.","A compléter costume 10 Action 2 Sous-action 1"]
[10,"Sportif","Courir 2 fois / semaine pendant 30 minutes minimum.","A compléter costume 10 Action 2 Sous-action 2"]
[10,"Sportif","Courir 2 fois / semaine pendant 30 minutes minimum.","A compléter costume 10 Action 2 Sous-action 3"]
[10,"Sportif","M'étirer 10 minutes tous les soirs à 21h00.","A compléter costume 10 Action 3 Sous-action 1"]
[10,"Sportif","M'étirer 10 minutes tous les soirs à 21h00.","A compléter costume 10 Action 3 Sous-action 3"]
[10,"Sportif","M'étirer 10 minutes tous les soirs à 21h00.","A compléter costume 10 Action 3 Sous-action 4"]
[10,"Sportif","M'étirer 10 minutes tous les soirs à 21h00.","A compléter costume 10 Action 3 Sous-action 5"]
[10,"Sportif","Boire au moins 1,5 litres d'eau par jour.","A compléter costume 10 Action 4 Sous-action 1"]
[10,"Sportif","Boire au moins 1,5 litres d'eau par jour.","A compléter costume 10 Action 4 Sous-action 2"]
[10,"Sportif","Boire au moins 1,5 litres d'eau par jour.","A compléter costume 10 Action 4 Sous-action 4"]
[10,"Sportif","Boire au moins 1,5 litres d'eau par jour.","A compléter costume 10 Action 4 Sous-action 5"]

{"sheet":"Synthèse 2 essai","index":14,"n_rows":632,"n_cols":16,"rows_kept":632,"cut":false,"hidden":false,"merged":[[2,6,2,11]]}
[null,null,null,null,null,"Synthèse 2 des rôles-costumes à endosser :"]
[]
[null,null,null,null,null,"Objectif rappel :",{"$f":"+'Objectif SMARTER'!$A$6","v":"Je veux…"}]
[]
[null,null,null,null,null,"Pour formules :"]
[null,null,null,null,null,"A porter seul"]
[null,null,null,null,null,"A partager"]
[]
[null,null,null,null,null,"Pour atteindre votre objectif :"]
[]
[null,null,null,null,null,"Costume n°","Nom du rôle-costume","Action","Sous-action à réaliser vous-même ou en partie (partagée)","Pourquoi cette sous-action est-elle utile/ objectif ?\nQuels sont ses bénéfices / objectif ?","Critère de réalisation cette sous-action.\n(Rendu final visible et mesurable / objectif)","Pour les sous-actions partagées : avec qui vous devez partager cette sous-action ? (Membres de votre famille, amis, collègues, supérieurs, etc.)\nEt que doit(vent) faire précisément cette/ces personne(s) ?","Pour les sous-actions partagées : quelle sous-sous-action précise vous devez réaliser seul ?","Quand, avec qui, et comment devez-vous réaliser cette sous-action ? \n(Situations, personnes, contextes, lieux, horaires précis, moments, niveau d'énergie requis, période(s) de l'année, etc.)","Combien d’heures min./ max. consacrer à cette sous-action par jour/ semaine/ mois/ année ?\n(pour atteindre l'objectif)","Suite à donner à cette sous-action ?\nDurée prévue d’utilisation (date limite d’utilisation, conséquences long terme, etc.)"]
[{"$f":"\"A porter seul_\"&C12","v":"A porter seul_1"},{"$f":"\"A partager_\"&C12","v":"A partager_1"},1,{"$f":"VLOOKUP(A12,'A porter seul'!$A$6:$A$679,1,0)","v":"A porter seul_1"},{"$f":"VLOOKUP(B12,'A partager'!$A$6:$A$738,1,0)","v":"A partager_1"},{"$f":"VLOOKUP(A12,'A porter seul'!$A$6:$C$679,3,0)","v":1},{"$f":"IF('A porter seul'!$B$6:$B$600=\"A porter seul\",'A porter seul'!$D$6:$D$600,'A partager'!$D$6:$D$600)","v":"Leader"}]
[{"$f":"\"A porter seul_\"&C13","v":"A porter seul_2"},{"$f":"\"A partager_\"&C13","v":"A partager_2"},2,{"$f":"VLOOKUP(A13,'A porter seul'!$A$6:$A$679,1,0)","v":"A porter seul_2"},{"$f":"VLOOKUP(B13,'A partager'!$A$6:$A$738,1,0)","v":"A partager_2"},{"$f":"VLOOKUP(A13,'A porter seul'!$A$6:$C$679,3,0)","v":1},{"$f":"IF('A porter seul'!$B$6:$B$600=\"A porter seul\",'A porter seul'!$D$6:$D$600,'A partager'!$D$6:$D$600)","v":"Leader"}]
["A porter seul_3","A partager_3",3,{"$f":"VLOOKUP(A14,'A porter seul'!$A$6:$A$679,1,0)","v":"A porter seul_3"},{"$f":"VLOOKUP(B14,'A partager'!$A$6:$A$738,1,0)","v":"A partager_3"},{"$f":"VLOOKUP(A14,'A porter seul'!$A$6:$C$679,3,0)","v":1},{"$f":"IF('A porter seul'!$B$6:$B$600=\"A porter seul\",'A porter seul'!$D$6:$D$600,'A partager'!$D$6:$D$600)","v":"Leader"}]
["A porter seul_4","A partager_4",4,{"$f":"VLOOKUP(A15,'A porter seul'!$A$6:$A$679,1,0)","v":"A porter seul_4"},{"$f":"VLOOKUP(B15,'A partager'!$A$6:$A$738,1,0)","v":"A partager_4"},{"$f":"VLOOKUP(A15,'A porter seul'!$A$6:$C$679,3,0)","v":1},{"$f":"IF('A porter seul'!$B$6:$B$600=\"A porter seul\",'A porter seul'!$D$6:$D$600,'A partager'!$D$6:$D$600)","v":"Manager (en interne)"}]
["A porter seul_5","A partager_5",5,{"$f":"VLOOKUP(A16,'A porter seul'!$A$6:$A$679,1,0)","v":"A porter seul_5"},{"$f":"VLOOKUP(B16,'A partager'!$A$6:$A$738,1,0)","v":"A partager_5"},{"$f":"VLOOKUP(A16,'A porter seul'!$A$6:$C$679,3,0)","v":1},{"$f":"IF('A porter seul'!$B$6:$B$600=\"A porter seul\",'A porter seul'!$D$6:$D$600,'A partager'!$D$6:$D$600)","v":"Manager (en interne)"}]
["A porter seul_6","A partager_6",6,{"$f":"VLOOKUP(A17,'A porter seul'!$A$6:$A$679,1,0)","v":"A porter seul_6"},{"$f":"VLOOKUP(B17,'A partager'!$A$6:$A$738,1,0)","v":"A partager_6"},{"$f":"VLOOKUP(A17,'A porter seul'!$A$6:$C$679,3,0)","v":1},{"$f":"IF('A porter seul'!$B$6:$B$600=\"A porter seul\",'A porter seul'!$D$6:$D$600,'A partager'!$D$6:$D$600)","v":"Manager (en interne)"}]
["A porter seul_7","A partager_7",7,{"$f":"VLOOKUP(A18,'A porter seul'!$A$6:$A$679,1,0)","v":"A porter seul_7"},{"$f":"VLOOKUP(B18,'A partager'!$A$6:$A$738,1,0)","v":"A partager_7"},{"$f":"VLOOKUP(A18,'A porter seul'!$A$6:$C$679,3,0)","v":1},{"$f":"IF('A porter seul'!$B$6:$B$600=\"A porter seul\",'A porter seul'!$D$6:$D$600,'A partager'!$D$6:$D$600)","v":"Manager (en interne)"}]
["A porter seul_8","A partager_8",8,{"$f":"VLOOKUP(A19,'A porter seul'!$A$6:$A$679,1,0)","v":"A porter seul_8"},{"$f":"VLOOKUP(B19,'A partager'!$A$6:$A$738,1,0)","v":"A partager_8"},{"$f":"VLOOKUP(A19,'A porter seul'!$A$6:$C$679,3,0)","v":1},{"$f":"IF('A porter seul'!$B$6:$B$600=\"A porter seul\",'A porter seul'!$D$6:$D$600,'A partager'!$D$6:$D$600)","v":"Manager (en interne)"}]
["A porter seul_9","A partager_9",9,{"$f":"VLOOKUP(A20,'A porter seul'!$A$6:$A$679,1,0)","v":"A porter seul_9"},{"$f":"VLOOKUP(B20,'A partager'!$A$6:$A$738,1,0)","v":"A partager_9"},{"$f":"VLOOKUP(A20,'A porter seul'!$A$6:$C$679,3,0)","v":1},{"$f":"IF('A porter seul'!$B$6:$B$600=\"A porter seul\",'A porter seul'!$D$6:$D$600,'A partager'!$D$6:$D$600)","v":"Manager (en interne)"}]
["A porter seul_10","A partager_10",10,{"$f":"VLOOKUP(A21,'A porter seul'!$A$6:$A$679,1,0)","v":"A porter seul_10"},{"$f":"VLOOKUP(B21,'A partager'!$A$6:$A$738,1,0)","v":"A partager_10"},{"$f":"VLOOKUP(A21,'A porter seul'!$A$6:$C$679,3,0)","v":2},{"$f":"IF('A porter seul'!$B$6:$B$600=\"A porter seul\",'A porter seul'!$D$6:$D$600,'A partager'!$D$6:$D$600)","v":"Manager (en interne)"}]
["A porter seul_11","A partager_11",11,{"$f":"VLOOKUP(A22,'A porter seul'!$A$6:$A$679,1,0)","v":"A porter seul_11"},{"$f":"VLOOKUP(B22,'A partager'!$A$6:$A$738,1,0)","v":"A partager_11"},{"$f":"VLOOKUP(A22,'A porter seul'!$A$6:$C$679,3,0)","v":2},{"$f":"IF('A porter seul'!$B$6:$B$600=\"A porter seul\",'A porter seul'!$D$6:$D$600,'A partager'!$D$6:$D$600)","v":"Manager (en interne)"}]
["A porter seul_12","A partager_12",12,{"$f":"VLOOKUP(A23,'A porter seul'!$A$6:$A$679,1,0)","v":"A porter seul_12"},{"$f":"VLOOKUP(B23,'A partager'!$A$6:$A$738,1,0)","v":"A partager_12"},{"$f":"VLOOKUP(A23,'A porter seul'!$A$6:$C$679,3,0)","v":2},{"$f":"IF('A porter seul'!$B$6:$B$600=\"A porter seul\",'A porter seul'!$D$6:$D$600,'A partager'!$D$6:$D$600)","v":"Manager (en interne)"}]
["A porter seul_13","A partager_13",13,{"$f":"VLOOKUP(A24,'A porter seul'!$A$6:$A$679,1,0)","v":"A porter seul_13"},{"$f":"VLOOKUP(B24,'A partager'!$A$6:$A$738,1,0)","v":"A partager_13"},{"$f":"VLOOKUP(A24,'A porter seul'!$A$6:$C$679,3,0)","v":2},{"$f":"IF('A porter seul'!$B$6:$B$600=\"A porter seul\",'A porter seul'!$D$6:$D$600,'A partager'!$D$6:$D$600)","v":"Manager (en interne)"}]
["A porter seul_14","A partager_14",14,{"$f":"VLOOKUP(A25,'A porter seul'!$A$6:$A$679,1,0)","v":"A porter seul_14"},{"$f":"VLOOKUP(B25,'A partager'!$A$6:$A$738,1,0)","v":"A partager_14"},{"$f":"VLOOKUP(A25,'A porter seul'!$A$6:$C$679,3,0)","v":2},{"$f":"IF('A porter seul'!$B$6:$B$600=\"A porter seul\",'A porter seul'!$D$6:$D$600,'A partager'!$D$6:$D$600)","v":"Manager (en interne)"}]
["A porter seul_15","A partager_15",15,{"$f":"VLOOKUP(A26,'A porter seul'!$A$6:$A$679,1,0)","v":"A porter seul_15"},{"$f":"VLOOKUP(B26,'A partager'!$A$6:$A$738,1,0)","v":"A partager_15"},{"$f":"VLOOKUP(A26,'A porter seul'!$A$6:$C$679,3,0)","v":2},{"$f":"IF('A porter seul'!$B$6:$B$600=\"A porter seul\",'A porter seul'!$D$6:$D$600,'A partager'!$D$6:$D$600)","v":"Manager (en interne)"}]
["A porter seul_16","A partager_16",16,{"$f":"VLOOKUP(A27,'A porter seul'!$A$6:$A$679,1,0)","v":"A porter seul_16"},{"$f":"VLOOKUP(B27,'A partager'!$A$6:$A$738,1,0)","v":"A partager_16"},{"$f":"VLOOKUP(A27,'A porter seul'!$A$6:$C$679,3,0)","v":2},{"$f":"IF('A porter seul'!$B$6:$B$600=\"A porter seul\",'A porter seul'!$D$6:$D$600,'A partager'!$D$6:$D$600)","v":"Manager (en interne)"}]
["A porter seul_17","A partager_17",17,{"$f":"VLOOKUP(A28,'A porter seul'!$A$6:$A$679,1,0)","v":"A porter seul_17"},{"$f":"VLOOKUP(B28,'A partager'!$A$6:$A$738,1,0)","v":"A partager_17"},{"$f":"VLOOKUP(A28,'A porter seul'!$A$6:$C$679,3,0)","v":2},{"$f":"IF('A porter seul'!$B$6:$B$600=\"A porter seul\",'A porter seul'!$D$6:$D$600,'A partager'!$D$6:$D$600)","v":"Manager (en interne)"}]
["A porter seul_18","A partager_18",18,{"$f":"VLOOKUP(A29,'A porter seul'!$A$6:$A$679,1,0)","v":"A porter seul_18"},{"$f":"VLOOKUP(B29,'A partager'!$A$6:$A$738,1,0)","v":"A partager_18"},{"$f":"VLOOKUP(A29,'A porter seul'!$A$6:$C$679,3,0)","v":2},{"$f":"IF('A porter seul'!$B$6:$B$600=\"A porter seul\",'A porter seul'!$D$6:$D$600,'A partager'!$D$6:$D$600)","v":"Partenaire commercial (à l'externe)"}]
["A porter seul_19","A partager_19",19,{"$f":"VLOOKUP(A30,'A porter seul'!$A$6:$A$679,1,0)","v":"A porter seul_19"},{"$f":"VLOOKUP(B30,'A partager'!$A$6:$A$738,1,0)","v":"A partager_19"},{"$f":"VLOOKUP(A30,'A porter seul'!$A$6:$C$679,3,0)","v":2},{"$f":"IF('A porter seul'!$B$6:$B$600=\"A porter seul\",'A porter seul'!$D$6:$D$600,'A partager'!$D$6:$D$600)","v":"Partenaire commercial (à l'externe)"}]
["A porter seul_20","A partager_20",20,{"$f":"VLOOKUP(A31,'A porter seul'!$A$6:$A$679,1,0)","v":"A porter seul_20"},{"$f":"VLOOKUP(B31,'A partager'!$A$6:$A$738,1,0)","v":"A partager_20"},{"$f":"VLOOKUP(A31,'A porter seul'!$A$6:$C$679,3,0)","v":2},{"$f":"IF('A porter seul'!$B$6:$B$600=\"A porter seul\",'A porter seul'!$D$6:$D$600,'A partager'!$D$6:$D$600)","v":"Partenaire commercial (à l'externe)"}]
["A porter seul_21","A partager_21",21,{"$f":"VLOOKUP(A32,'A porter seul'!$A$6:$A$679,1,0)","v":"A porter seul_21"},{"$f":"VLOOKUP(B32,'A partager'!$A$6:$A$738,1,0)","v":"A partager_21"},{"$f":"VLOOKUP(A32,'A porter seul'!$A$6:$C$679,3,0)","v":2},{"$f":"IF('A porter seul'!$B$6:$B$600=\"A porter seul\",'A porter seul'!$D$6:$D$600,'A partager'!$D$6:$D$600)","v":"Partenaire commercial (à l'externe)"}]
["A porter seul_22","A partager_22",22,{"$f":"VLOOKUP(A33,'A porter seul'!$A$6:$A$679,1,0)","v":"A porter seul_22"},{"$f":"VLOOKUP(B33,'A partager'!$A$6:$A$738,1,0)","v":"A partager_22"},{"$f":"VLOOKUP(A33,'A porter seul'!$A$6:$C$679,3,0)","v":2},{"$f":"IF('A porter seul'!$B$6:$B$600=\"A porter seul\",'A porter seul'!$D$6:$D$600,'A partager'!$D$6:$D$600)","v":"Partenaire commercial (à l'externe)"}]
["A porter seul_23","A partager_23",23,{"$f":"VLOOKUP(A34,'A porter seul'!$A$6:$A$679,1,0)","v":"A porter seul_23"},{"$f":"VLOOKUP(B34,'A partager'!$A$6:$A$738,1,0)","v":"A partager_23"},{"$f":"VLOOKUP(A34,'A porter seul'!$A$6:$C$679,3,0)","v":2},{"$f":"IF('A porter seul'!$B$6:$B$600=\"A porter seul\",'A porter seul'!$D$6:$D$600,'A partager'!$D$6:$D$600)","v":"Partenaire commercial (à l'externe)"}]
["A porter seul_24","A partager_24",24,{"$f":"VLOOKUP(A35,'A porter seul'!$A$6:$A$679,1,0)","v":"A porter seul_24"},{"$f":"VLOOKUP(B35,'A partager'!$A$6:$A$738,1,0)","v":"A partager_24"},{"$f":"VLOOKUP(A35,'A porter seul'!$A$6:$C$679,3,0)","v":3}]
["A porter seul_25","A partager_25",25,{"$f":"VLOOKUP(A36,'A porter seul'!$A$6:$A$679,1,0)","v":"A porter seul_25"},{"$f":"VLOOKUP(B36,'A partager'!$A$6:$A$738,1,0)","v":"A partager_25"},{"$f":"VLOOKUP(A36,'A porter seul'!$A$6:$C$679,3,0)","v":3}]
["A porter seul_26","A partager_26",26,{"$f":"VLOOKUP(A37,'A porter seul'!$A$6:$A$679,1,0)","v":"A porter seul_26"},{"$f":"VLOOKUP(B37,'A partager'!$A$6:$A$738,1,0)","v":"A partager_26"},{"$f":"VLOOKUP(A37,'A porter seul'!$A$6:$C$679,3,0)","v":3}]
["A porter seul_27","A partager_27",27,{"$f":"VLOOKUP(A38,'A porter seul'!$A$6:$A$679,1,0)","v":"A porter seul_27"},{"$f":"VLOOKUP(B38,'A partager'!$A$6:$A$738,1,0)","v":"A partager_27"},{"$f":"VLOOKUP(A38,'A porter seul'!$A$6:$C$679,3,0)","v":3}]
["A porter seul_28","A partager_28",28,{"$f":"VLOOKUP(A39,'A porter seul'!$A$6:$A$679,1,0)","v":"A porter seul_28"},{"$f":"VLOOKUP(B39,'A partager'!$A$6:$A$738,1,0)","v":"A partager_28"},{"$f":"VLOOKUP(A39,'A porter seul'!$A$6:$C$679,3,0)","v":3}]
["A porter seul_29","A partager_29",29,{"$f":"VLOOKUP(A40,'A porter seul'!$A$6:$A$679,1,0)","v":"A porter seul_29"},{"$f":"VLOOKUP(B40,'A partager'!$A$6:$A$738,1,0)","v":"A partager_29"},{"$f":"VLOOKUP(A40,'A porter seul'!$A$6:$C$679,3,0)","v":3}]
["A porter seul_30","A partager_30",30,{"$f":"VLOOKUP(A41,'A porter seul'!$A$6:$A$679,1,0)","v":"A porter seul_30"},{"$f":"VLOOKUP(B41,'A partager'!$A$6:$A$738,1,0)","v":"A partager_30"},{"$f":"VLOOKUP(A41,'A porter seul'!$A$6:$C$679,3,0)","v":3}]
["A porter seul_31","A partager_31",31,{"$f":"VLOOKUP(A42,'A porter seul'!$A$6:$A$679,1,0)","v":"A porter seul_31"},{"$f":"VLOOKUP(B42,'A partager'!$A$6:$A$738,1,0)","v":"A partager_31"},{"$f":"VLOOKUP(A42,'A porter seul'!$A$6:$C$679,3,0)","v":3}]
["A porter seul_32","A partager_32",32,{"$f":"VLOOKUP(A43,'A porter seul'!$A$6:$A$679,1,0)","v":"A porter seul_32"},{"$f":"VLOOKUP(B43,'A partager'!$A$6:$A$738,1,0)","v":"A partager_32"},{"$f":"VLOOKUP(A43,'A porter seul'!$A$6:$C$679,3,0)","v":3}]
["A porter seul_33","A partager_33",33,{"$f":"VLOOKUP(A44,'A porter seul'!$A$6:$A$679,1,0)","v":"A porter seul_33"},{"$f":"VLOOKUP(B44,'A partager'!$A$6:$A$738,1,0)","v":"A partager_33"},{"$f":"VLOOKUP(A44,'A porter seul'!$A$6:$C$679,3,0)","v":3}]
["A porter seul_34","A partager_34",34,{"$f":"VLOOKUP(A45,'A porter seul'!$A$6:$A$679,1,0)","v":"A porter seul_34"},{"$f":"VLOOKUP(B45,'A partager'!$A$6:$A$738,1,0)","v":"A partager_34"},{"$f":"VLOOKUP(A45,'A porter seul'!$A$6:$C$679,3,0)","v":3}]
["A porter seul_35","A partager_35",35,{"$f":"VLOOKUP(A46,'A porter seul'!$A$6:$A$679,1,0)","v":"A porter seul_35"},{"$f":"VLOOKUP(B46,'A partager'!$A$6:$A$738,1,0)","v":"A partager_35"},{"$f":"VLOOKUP(A46,'A porter seul'!$A$6:$C$679,3,0)","v":4}]
["A porter seul_36","A partager_36",36,{"$f":"VLOOKUP(A47,'A porter seul'!$A$6:$A$679,1,0)","v":"A porter seul_36"},{"$f":"VLOOKUP(B47,'A partager'!$A$6:$A$738,1,0)","v":"A partager_36"},{"$f":"VLOOKUP(A47,'A porter seul'!$A$6:$C$679,3,0)","v":4}]
["A porter seul_37","A partager_37",37,{"$f":"VLOOKUP(A48,'A porter seul'!$A$6:$A$679,1,0)","v":"A porter seul_37"},{"$f":"VLOOKUP(B48,'A partager'!$A$6:$A$738,1,0)","v":"A partager_37"},{"$f":"VLOOKUP(A48,'A porter seul'!$A$6:$C$679,3,0)","v":4}]
["A porter seul_38","A partager_38",38,{"$f":"VLOOKUP(A49,'A porter seul'!$A$6:$A$679,1,0)","v":"A porter seul_38"},{"$f":"VLOOKUP(B49,'A partager'!$A$6:$A$738,1,0)","v":"A partager_38"},{"$f":"VLOOKUP(A49,'A porter seul'!$A$6:$C$679,3,0)","v":4}]
["A porter seul_39","A partager_39",39,{"$f":"VLOOKUP(A50,'A porter seul'!$A$6:$A$679,1,0)","v":"A porter seul_39"},{"$f":"VLOOKUP(B50,'A partager'!$A$6:$A$738,1,0)","v":"A partager_39"},{"$f":"VLOOKUP(A50,'A porter seul'!$A$6:$C$679,3,0)","v":4}]
["A porter seul_40","A partager_40",40,{"$f":"VLOOKUP(A51,'A porter seul'!$A$6:$A$679,1,0)","v":"A porter seul_40"},{"$f":"VLOOKUP(B51,'A partager'!$A$6:$A$738,1,0)","v":"A partager_40"},{"$f":"VLOOKUP(A51,'A porter seul'!$A$6:$C$679,3,0)","v":4}]
["A porter seul_41","A partager_41",41,{"$f":"VLOOKUP(A52,'A porter seul'!$A$6:$A$679,1,0)","v":"A porter seul_41"},{"$f":"VLOOKUP(B52,'A partager'!$A$6:$A$738,1,0)","v":"A partager_41"},{"$f":"VLOOKUP(A52,'A porter seul'!$A$6:$C$679,3,0)","v":4}]
["A porter seul_42","A partager_42",42,{"$f":"VLOOKUP(A53,'A porter seul'!$A$6:$A$679,1,0)","v":"A porter seul_42"},{"$f":"VLOOKUP(B53,'A partager'!$A$6:$A$738,1,0)","v":"A partager_42"},{"$f":"VLOOKUP(A53,'A porter seul'!$A$6:$C$679,3,0)","v":4}]
["A porter seul_43","A partager_43",43,{"$f":"VLOOKUP(A54,'A porter seul'!$A$6:$A$679,1,0)","v":"A porter seul_43"},{"$f":"VLOOKUP(B54,'A partager'!$A$6:$A$738,1,0)","v":"A partager_43"},{"$f":"VLOOKUP(A54,'A porter seul'!$A$6:$C$679,3,0)","v":4}]
["A porter seul_44","A partager_44",44,{"$f":"VLOOKUP(A55,'A porter seul'!$A$6:$A$679,1,0)","v":"A porter seul_44"},{"$f":"VLOOKUP(B55,'A partager'!$A$6:$A$738,1,0)","v":"A partager_44"},{"$f":"VLOOKUP(A55,'A porter seul'!$A$6:$C$679,3,0)","v":4}]
["A porter seul_45","A partager_45",45,{"$f":"VLOOKUP(A56,'A porter seul'!$A$6:$A$679,1,0)","v":"A porter seul_45"},{"$f":"VLOOKUP(B56,'A partager'!$A$6:$A$738,1,0)","v":"A partager_45"},{"$f":"VLOOKUP(A56,'A porter seul'!$A$6:$C$679,3,0)","v":5}]
["A porter seul_46","A partager_46",46,{"$f":"VLOOKUP(A57,'A porter seul'!$A$6:$A$679,1,0)","v":"A porter seul_46"},{"$f":"VLOOKUP(B57,'A partager'!$A$6:$A$738,1,0)","v":"A partager_46"},{"$f":"VLOOKUP(A57,'A porter seul'!$A$6:$C$679,3,0)","v":5}]
["A porter seul_47","A partager_47",47,{"$f":"VLOOKUP(A58,'A porter seul'!$A$6:$A$679,1,0)","v":"A porter seul_47"},{"$f":"VLOOKUP(B58,'A partager'!$A$6:$A$738,1,0)","v":"A partager_47"},{"$f":"VLOOKUP(A58,'A porter seul'!$A$6:$C$679,3,0)","v":5}]
["A porter seul_48","A partager_48",48,{"$f":"VLOOKUP(A59,'A porter seul'!$A$6:$A$679,1,0)","v":"A porter seul_48"},{"$f":"VLOOKUP(B59,'A partager'!$A$6:$A$738,1,0)","v":"A partager_48"},{"$f":"VLOOKUP(A59,'A porter seul'!$A$6:$C$679,3,0)","v":5}]
["A porter seul_49","A partager_49",49,{"$f":"VLOOKUP(A60,'A porter seul'!$A$6:$A$679,1,0)","v":"A porter seul_49"},{"$f":"VLOOKUP(B60,'A partager'!$A$6:$A$738,1,0)","v":"A partager_49"},{"$f":"VLOOKUP(A60,'A porter seul'!$A$6:$C$679,3,0)","v":6}]
["A porter seul_50","A partager_50",50,{"$f":"VLOOKUP(A61,'A porter seul'!$A$6:$A$679,1,0)","v":"A porter seul_50"},{"$f":"VLOOKUP(B61,'A partager'!$A$6:$A$738,1,0)","v":"A partager_50"},{"$f":"VLOOKUP(A61,'A porter seul'!$A$6:$C$679,3,0)","v":6}]
["A porter seul_51","A partager_51",51,{"$f":"VLOOKUP(A62,'A porter seul'!$A$6:$A$679,1,0)","v":"A porter seul_51"},{"$f":"VLOOKUP(B62,'A partager'!$A$6:$A$738,1,0)","v":"A partager_51"},{"$f":"VLOOKUP(A62,'A porter seul'!$A$6:$C$679,3,0)","v":6}]
["A porter seul_52","A partager_52",52,{"$f":"VLOOKUP(A63,'A porter seul'!$A$6:$A$679,1,0)","v":"A porter seul_52"},{"$f":"VLOOKUP(B63,'A partager'!$A$6:$A$738,1,0)","v":"A partager_52"},{"$f":"VLOOKUP(A63,'A porter seul'!$A$6:$C$679,3,0)","v":6}]
["A porter seul_53","A partager_53",53,{"$f":"VLOOKUP(A64,'A porter seul'!$A$6:$A$679,1,0)","v":"A porter seul_53"},{"$f":"VLOOKUP(B64,'A partager'!$A$6:$A$738,1,0)","v":"A partager_53"},{"$f":"VLOOKUP(A64,'A porter seul'!$A$6:$C$679,3,0)","v":6}]
["A porter seul_54","A partager_54",54,{"$f":"VLOOKUP(A65,'A porter seul'!$A$6:$A$679,1,0)","v":"A porter seul_54"},{"$f":"VLOOKUP(B65,'A partager'!$A$6:$A$738,1,0)","v":"A partager_54"},{"$f":"VLOOKUP(A65,'A porter seul'!$A$6:$C$679,3,0)","v":6}]
["A porter seul_55","A partager_55",55,{"$f":"VLOOKUP(A66,'A porter seul'!$A$6:$A$679,1,0)","v":"A porter seul_55"},{"$f":"VLOOKUP(B66,'A partager'!$A$6:$A$738,1,0)","v":"A partager_55"},{"$f":"VLOOKUP(A66,'A porter seul'!$A$6:$C$679,3,0)","v":6}]
["A porter seul_56","A partager_56",56,{"$f":"VLOOKUP(A67,'A porter seul'!$A$6:$A$679,1,0)","v":"A porter seul_56"},{"$f":"VLOOKUP(B67,'A partager'!$A$6:$A$738,1,0)","v":"A partager_56"},{"$f":"VLOOKUP(A67,'A porter seul'!$A$6:$C$679,3,0)","v":6}]
["A porter seul_57","A partager_57",57,{"$f":"VLOOKUP(A68,'A porter seul'!$A$6:$A$679,1,0)","v":"A porter seul_57"},{"$f":"VLOOKUP(B68,'A partager'!$A$6:$A$738,1,0)","v":"A partager_57"},{"$f":"VLOOKUP(A68,'A porter seul'!$A$6:$C$679,3,0)","v":7}]
["A porter seul_58","A partager_58",58,{"$f":"VLOOKUP(A69,'A porter seul'!$A$6:$A$679,1,0)","v":"A porter seul_58"},{"$f":"VLOOKUP(B69,'A partager'!$A$6:$A$738,1,0)","v":"A partager_58"},{"$f":"VLOOKUP(A69,'A porter seul'!$A$6:$C$679,3,0)","v":7}]
["A porter seul_59","A partager_59",59,{"$f":"VLOOKUP(A70,'A porter seul'!$A$6:$A$679,1,0)","v":"A porter seul_59"},{"$f":"VLOOKUP(B70,'A partager'!$A$6:$A$738,1,0)","v":"A partager_59"},{"$f":"VLOOKUP(A70,'A porter seul'!$A$6:$C$679,3,0)","v":7}]
["A porter seul_60","A partager_60",60,{"$f":"VLOOKUP(A71,'A porter seul'!$A$6:$A$679,1,0)","v":"A porter seul_60"},{"$f":"VLOOKUP(B71,'A partager'!$A$6:$A$738,1,0)","v":"A partager_60"},{"$f":"VLOOKUP(A71,'A porter seul'!$A$6:$C$679,3,0)","v":7}]
["A porter seul_61","A partager_61",61,{"$f":"VLOOKUP(A72,'A porter seul'!$A$6:$A$679,1,0)","v":"A porter seul_61"},{"$f":"VLOOKUP(B72,'A partager'!$A$6:$A$738,1,0)","v":"A partager_61"},{"$f":"VLOOKUP(A72,'A porter seul'!$A$6:$C$679,3,0)","v":7}]
["A porter seul_62","A partager_62",62,{"$f":"VLOOKUP(A73,'A porter seul'!$A$6:$A$679,1,0)","v":"A porter seul_62"},{"$f":"VLOOKUP(B73,'A partager'!$A$6:$A$738,1,0)","v":"A partager_62"},{"$f":"VLOOKUP(A73,'A porter seul'!$A$6:$C$679,3,0)","v":7}]
["A porter seul_63","A partager_63",63,{"$f":"VLOOKUP(A74,'A porter seul'!$A$6:$A$679,1,0)","v":"A porter seul_63"},{"$f":"VLOOKUP(B74,'A partager'!$A$6:$A$738,1,0)","v":"A partager_63"},{"$f":"VLOOKUP(A74,'A porter seul'!$A$6:$C$679,3,0)","v":8}]
["A porter seul_64","A partager_64",64,{"$f":"VLOOKUP(A75,'A porter seul'!$A$6:$A$679,1,0)","v":"A porter seul_64"},{"$f":"VLOOKUP(B75,'A partager'!$A$6:$A$738,1,0)","v":"A partager_64"},{"$f":"VLOOKUP(A75,'A porter seul'!$A$6:$C$679,3,0)","v":8}]
["A porter seul_65","A partager_65",65,{"$f":"VLOOKUP(A76,'A porter seul'!$A$6:$A$679,1,0)","v":"A porter seul_65"},{"$f":"VLOOKUP(B76,'A partager'!$A$6:$A$738,1,0)","v":"A partager_65"},{"$f":"VLOOKUP(A76,'A porter seul'!$A$6:$C$679,3,0)","v":8}]
[{"$f":"\"A porter seul_\"&C77","v":"A porter seul_66"},{"$f":"\"A partager_\"&C77","v":"A partager_66"},66,{"$f":"VLOOKUP(A77,'A porter seul'!$A$6:$A$679,1,0)","v":"A porter seul_66"},{"$f":"VLOOKUP(B77,'A partager'!$A$6:$A$738,1,0)","v":"A partager_66"},{"$f":"VLOOKUP(A77,'A porter seul'!$A$6:$C$679,3,0)","v":8}]
["A porter seul_67","A partager_67",67,{"$f":"VLOOKUP(A78,'A porter seul'!$A$6:$A$679,1,0)","v":"A porter seul_67"},{"$f":"VLOOKUP(B78,'A partager'!$A$6:$A$738,1,0)","v":"A partager_67"},{"$f":"VLOOKUP(A78,'A porter seul'!$A$6:$C$679,3,0)","v":8}]
["A porter seul_68","A partager_68",68,{"$f":"VLOOKUP(A79,'A porter seul'!$A$6:$A$679,1,0)","v":"A porter seul_68"},{"$f":"VLOOKUP(B79,'A partager'!$A$6:$A$738,1,0)","v":"A partager_68"},{"$f":"VLOOKUP(A79,'A porter seul'!$A$6:$C$679,3,0)","v":8}]
["A porter seul_69","A partager_69",69,{"$f":"VLOOKUP(A80,'A porter seul'!$A$6:$A$679,1,0)","v":"A porter seul_69"},{"$f":"VLOOKUP(B80,'A partager'!$A$6:$A$738,1,0)","v":"A partager_69"},{"$f":"VLOOKUP(A80,'A porter seul'!$A$6:$C$679,3,0)","v":8}]
["A porter seul_70","A partager_70",70,{"$f":"VLOOKUP(A81,'A porter seul'!$A$6:$A$679,1,0)","v":"A porter seul_70"},{"$f":"VLOOKUP(B81,'A partager'!$A$6:$A$738,1,0)","v":"A partager_70"},{"$f":"VLOOKUP(A81,'A porter seul'!$A$6:$C$679,3,0)","v":8}]
["A porter seul_71","A partager_71",71,{"$f":"VLOOKUP(A82,'A porter seul'!$A$6:$A$679,1,0)","v":"A porter seul_71"},{"$f":"VLOOKUP(B82,'A partager'!$A$6:$A$738,1,0)","v":"A partager_71"},{"$f":"VLOOKUP(A82,'A porter seul'!$A$6:$C$679,3,0)","v":8}]
["A porter seul_72","A partager_72",72,{"$f":"VLOOKUP(A83,'A porter seul'!$A$6:$A$679,1,0)","v":"A porter seul_72"},{"$f":"VLOOKUP(B83,'A partager'!$A$6:$A$738,1,0)","v":"A partager_72"},{"$f":"VLOOKUP(A83,'A porter seul'!$A$6:$C$679,3,0)","v":8}]
["A porter seul_73","A partager_73",73,{"$f":"VLOOKUP(A84,'A porter seul'!$A$6:$A$679,1,0)","v":"A porter seul_73"},{"$f":"VLOOKUP(B84,'A partager'!$A$6:$A$738,1,0)","v":"A partager_73"},{"$f":"VLOOKUP(A84,'A porter seul'!$A$6:$C$679,3,0)","v":8}]
["A porter seul_74","A partager_74",74,{"$f":"VLOOKUP(A85,'A porter seul'!$A$6:$A$679,1,0)","v":"A porter seul_74"},{"$f":"VLOOKUP(B85,'A partager'!$A$6:$A$738,1,0)","v":"A partager_74"},{"$f":"VLOOKUP(A85,'A porter seul'!$A$6:$C$679,3,0)","v":9}]
["A porter seul_75","A partager_75",75,{"$f":"VLOOKUP(A86,'A porter seul'!$A$6:$A$679,1,0)","v":"A porter seul_75"},{"$f":"VLOOKUP(B86,'A partager'!$A$6:$A$738,1,0)","v":"A partager_75"},{"$f":"VLOOKUP(A86,'A porter seul'!$A$6:$C$679,3,0)","v":9}]
["A porter seul_76","A partager_76",76,{"$f":"VLOOKUP(A87,'A porter seul'!$A$6:$A$679,1,0)","v":"A porter seul_76"},{"$f":"VLOOKUP(B87,'A partager'!$A$6:$A$738,1,0)","v":"A partager_76"},{"$f":"VLOOKUP(A87,'A porter seul'!$A$6:$C$679,3,0)","v":9}]
["A porter seul_77","A partager_77",77,{"$f":"VLOOKUP(A88,'A porter seul'!$A$6:$A$679,1,0)","v":"A porter seul_77"},{"$f":"VLOOKUP(B88,'A partager'!$A$6:$A$738,1,0)","v":"A partager_77"},{"$f":"VLOOKUP(A88,'A porter seul'!$A$6:$C$679,3,0)","v":9}]
["A porter seul_78","A partager_78",78,{"$f":"VLOOKUP(A89,'A porter seul'!$A$6:$A$679,1,0)","v":"A porter seul_78"},{"$f":"VLOOKUP(B89,'A partager'!$A$6:$A$738,1,0)","v":"A partager_78"},{"$f":"VLOOKUP(A89,'A porter seul'!$A$6:$C$679,3,0)","v":9}]
["A porter seul_79","A partager_79",79,{"$f":"VLOOKUP(A90,'A porter seul'!$A$6:$A$679,1,0)","v":"A porter seul_79"},{"$f":"VLOOKUP(B90,'A partager'!$A$6:$A$738,1,0)","v":"A partager_79"},{"$f":"VLOOKUP(A90,'A porter seul'!$A$6:$C$679,3,0)","v":9}]
["A porter seul_80","A partager_80",80,{"$f":"VLOOKUP(A91,'A porter seul'!$A$6:$A$679,1,0)","v":"A porter seul_80"},{"$f":"VLOOKUP(B91,'A partager'!$A$6:$A$738,1,0)","v":"A partager_80"},{"$f":"VLOOKUP(A91,'A porter seul'!$A$6:$C$679,3,0)","v":9}]
["A porter seul_81","A partager_81",81,{"$f":"VLOOKUP(A92,'A porter seul'!$A$6:$A$679,1,0)","v":"A porter seul_81"},{"$f":"VLOOKUP(B92,'A partager'!$A$6:$A$738,1,0)","v":"A partager_81"},{"$f":"VLOOKUP(A92,'A porter seul'!$A$6:$C$679,3,0)","v":9}]
["A porter seul_82","A partager_82",82,{"$f":"VLOOKUP(A93,'A porter seul'!$A$6:$A$679,1,0)","v":"A porter seul_82"},{"$f":"VLOOKUP(B93,'A partager'!$A$6:$A$738,1,0)","v":"A partager_82"},{"$f":"VLOOKUP(A93,'A porter seul'!$A$6:$C$679,3,0)","v":9}]
["A porter seul_83","A partager_83",83,{"$f":"VLOOKUP(A94,'A porter seul'!$A$6:$A$679,1,0)","v":"A porter seul_83"},{"$f":"VLOOKUP(B94,'A partager'!$A$6:$A$738,1,0)","v":"A partager_83"},{"$f":"VLOOKUP(A94,'A porter seul'!$A$6:$C$679,3,0)","v":9}]
["A porter seul_84","A partager_84",84,{"$f":"VLOOKUP(A95,'A porter seul'!$A$6:$A$679,1,0)","v":"A porter seul_84"},{"$f":"VLOOKUP(B95,'A partager'!$A$6:$A$738,1,0)","v":"A partager_84"},{"$f":"VLOOKUP(A95,'A porter seul'!$A$6:$C$679,3,0)","v":9}]
["A porter seul_85","A partager_85",85,{"$f":"VLOOKUP(A96,'A porter seul'!$A$6:$A$679,1,0)","v":"A porter seul_85"},{"$f":"VLOOKUP(B96,'A partager'!$A$6:$A$738,1,0)","v":"A partager_85"},{"$f":"VLOOKUP(A96,'A porter seul'!$A$6:$C$679,3,0)","v":9}]
["A porter seul_86","A partager_86",86,{"$f":"VLOOKUP(A97,'A porter seul'!$A$6:$A$679,1,0)","v":"A porter seul_86"},{"$f":"VLOOKUP(B97,'A partager'!$A$6:$A$738,1,0)","v":"A partager_86"},{"$f":"VLOOKUP(A97,'A porter seul'!$A$6:$C$679,3,0)","v":9}]
["A porter seul_87","A partager_87",87,{"$f":"VLOOKUP(A98,'A porter seul'!$A$6:$A$679,1,0)","v":"A porter seul_87"},{"$f":"VLOOKUP(B98,'A partager'!$A$6:$A$738,1,0)","v":"A partager_87"},{"$f":"VLOOKUP(A98,'A porter seul'!$A$6:$C$679,3,0)","v":9}]
["A porter seul_88","A partager_88",88,{"$f":"VLOOKUP(A99,'A porter seul'!$A$6:$A$679,1,0)","v":"A porter seul_88"},{"$f":"VLOOKUP(B99,'A partager'!$A$6:$A$738,1,0)","v":"A partager_88"},{"$f":"VLOOKUP(A99,'A porter seul'!$A$6:$C$679,3,0)","v":9}]
["A porter seul_89","A partager_89",89,{"$f":"VLOOKUP(A100,'A porter seul'!$A$6:$A$679,1,0)","v":"A porter seul_89"},{"$f":"VLOOKUP(B100,'A partager'!$A$6:$A$738,1,0)","v":"A partager_89"},{"$f":"VLOOKUP(A100,'A porter seul'!$A$6:$C$679,3,0)","v":10}]
["A porter seul_90","A partager_90",90,{"$f":"VLOOKUP(A101,'A porter seul'!$A$6:$A$679,1,0)","v":"A porter seul_90"},{"$f":"VLOOKUP(B101,'A partager'!$A$6:$A$738,1,0)","v":"A partager_90"},{"$f":"VLOOKUP(A101,'A porter seul'!$A$6:$C$679,3,0)","v":10}]
["A porter seul_91","A partager_91",91,{"$f":"VLOOKUP(A102,'A porter seul'!$A$6:$A$679,1,0)","v":"A porter seul_91"},{"$f":"VLOOKUP(B102,'A partager'!$A$6:$A$738,1,0)","v":"A partager_91"},{"$f":"VLOOKUP(A102,'A porter seul'!$A$6:$C$679,3,0)","v":10}]
["A porter seul_92","A partager_92",92,{"$f":"VLOOKUP(A103,'A porter seul'!$A$6:$A$679,1,0)","v":{"$error":"#N/A"}},{"$f":"VLOOKUP(B103,'A partager'!$A$6:$A$738,1,0)","v":"A partager_92"},{"$f":"VLOOKUP(A103,'A porter seul'!$A$6:$C$679,3,0)","v":{"$error":"#N/A"}}]
["A porter seul_93","A partager_93",93,{"$f":"VLOOKUP(A104,'A porter seul'!$A$6:$A$679,1,0)","v":{"$error":"#N/A"}},{"$f":"VLOOKUP(B104,'A partager'!$A$6:$A$738,1,0)","v":"A partager_93"},{"$f":"VLOOKUP(A104,'A porter seul'!$A$6:$C$679,3,0)","v":{"$error":"#N/A"}}]
["A porter seul_94","A partager_94",94,{"$f":"VLOOKUP(A105,'A porter seul'!$A$6:$A$679,1,0)","v":{"$error":"#N/A"}},{"$f":"VLOOKUP(B105,'A partager'!$A$6:$A$738,1,0)","v":"A partager_94"},{"$f":"VLOOKUP(A105,'A porter seul'!$A$6:$C$679,3,0)","v":{"$error":"#N/A"}}]
["A porter seul_95","A partager_95",95,{"$f":"VLOOKUP(A106,'A porter seul'!$A$6:$A$679,1,0)","v":{"$error":"#N/A"}},{"$f":"VLOOKUP(B106,'A partager'!$A$6:$A$738,1,0)","v":"A partager_95"},{"$f":"VLOOKUP(A106,'A porter seul'!$A$6:$C$679,3,0)","v":{"$error":"#N/A"}}]
["A porter seul_96","A partager_96",96,{"$f":"VLOOKUP(A107,'A porter seul'!$A$6:$A$679,1,0)","v":{"$error":"#N/A"}},{"$f":"VLOOKUP(B107,'A partager'!$A$6:$A$738,1,0)","v":"A partager_96"},{"$f":"VLOOKUP(A107,'A porter seul'!$A$6:$C$679,3,0)","v":{"$error":"#N/A"}}]
["A porter seul_97","A partager_97",97,{"$f":"VLOOKUP(A108,'A porter seul'!$A$6:$A$679,1,0)","v":{"$error":"#N/A"}},{"$f":"VLOOKUP(B108,'A partager'!$A$6:$A$738,1,0)","v":"A partager_97"},{"$f":"VLOOKUP(A108,'A porter seul'!$A$6:$C$679,3,0)","v":{"$error":"#N/A"}}]
["A porter seul_98","A partager_98",98,{"$f":"VLOOKUP(A109,'A porter seul'!$A$6:$A$679,1,0)","v":{"$error":"#N/A"}},{"$f":"VLOOKUP(B109,'A partager'!$A$6:$A$738,1,0)","v":"A partager_98"},{"$f":"VLOOKUP(A109,'A porter seul'!$A$6:$C$679,3,0)","v":{"$error":"#N/A"}}]
["A porter seul_99","A partager_99",99,{"$f":"VLOOKUP(A110,'A porter seul'!$A$6:$A$679,1,0)","v":{"$error":"#N/A"}},{"$f":"VLOOKUP(B110,'A partager'!$A$6:$A$738,1,0)","v":"A partager_99"},{"$f":"VLOOKUP(A110,'A porter seul'!$A$6:$C$679,3,0)","v":{"$error":"#N/A"}}]
["A porter seul_100","A partager_100",100,{"$f":"VLOOKUP(A111,'A porter seul'!$A$6:$A$679,1,0)","v":{"$error":"#N/A"}},{"$f":"VLOOKUP(B111,'A partager'!$A$6:$A$738,1,0)","v":"A partager_100"},{"$f":"VLOOKUP(A111,'A porter seul'!$A$6:$C$679,3,0)","v":{"$error":"#N/A"}}]
["A porter seul_101","A partager_101",101,{"$f":"VLOOKUP(A112,'A porter seul'!$A$6:$A$679,1,0)","v":{"$error":"#N/A"}},{"$f":"VLOOKUP(B112,'A partager'!$A$6:$A$738,1,0)","v":"A partager_101"},{"$f":"VLOOKUP(A112,'A porter seul'!$A$6:$C$679,3,0)","v":{"$error":"#N/A"}}]
["A porter seul_102","A partager_102",102,{"$f":"VLOOKUP(A113,'A porter seul'!$A$6:$A$679,1,0)","v":{"$error":"#N/A"}},{"$f":"VLOOKUP(B113,'A partager'!$A$6:$A$738,1,0)","v":"A partager_102"},{"$f":"VLOOKUP(A113,'A porter seul'!$A$6:$C$679,3,0)","v":{"$error":"#N/A"}}]
["A porter seul_103","A partager_103",103,{"$f":"VLOOKUP(A114,'A porter seul'!$A$6:$A$679,1,0)","v":{"$error":"#N/A"}},{"$f":"VLOOKUP(B114,'A partager'!$A$6:$A$738,1,0)","v":"A partager_103"},{"$f":"VLOOKUP(A114,'A porter seul'!$A$6:$C$679,3,0)","v":{"$error":"#N/A"}}]
["A porter seul_104","A partager_104",104,{"$f":"VLOOKUP(A115,'A porter seul'!$A$6:$A$679,1,0)","v":{"$error":"#N/A"}},{"$f":"VLOOKUP(B115,'A partager'!$A$6:$A$738,1,0)","v":"A partager_104"},{"$f":"VLOOKUP(A115,'A porter seul'!$A$6:$C$679,3,0)","v":{"$error":"#N/A"}}]
["A porter seul_105","A partager_105",105,{"$f":"VLOOKUP(A116,'A porter seul'!$A$6:$A$679,1,0)","v":{"$error":"#N/A"}},{"$f":"VLOOKUP(B116,'A partager'!$A$6:$A$738,1,0)","v":"A partager_105"},{"$f":"VLOOKUP(A116,'A porter seul'!$A$6:$C$679,3,0)","v":{"$error":"#N/A"}}]
["A porter seul_106","A partager_106",106,{"$f":"VLOOKUP(A117,'A porter seul'!$A$6:$A$679,1,0)","v":{"$error":"#N/A"}},{"$f":"VLOOKUP(B117,'A partager'!$A$6:$A$738,1,0)","v":"A partager_106"},{"$f":"VLOOKUP(A117,'A porter seul'!$A$6:$C$679,3,0)","v":{"$error":"#N/A"}}]
["A porter seul_107","A partager_107",107,{"$f":"VLOOKUP(A118,'A porter seul'!$A$6:$A$679,1,0)","v":{"$error":"#N/A"}},{"$f":"VLOOKUP(B118,'A partager'!$A$6:$A$738,1,0)","v":"A partager_107"},{"$f":"VLOOKUP(A118,'A porter seul'!$A$6:$C$679,3,0)","v":{"$error":"#N/A"}}]
["A porter seul_108","A partager_108",108,{"$f":"VLOOKUP(A119,'A porter seul'!$A$6:$A$679,1,0)","v":{"$error":"#N/A"}},{"$f":"VLOOKUP(B119,'A partager'!$A$6:$A$738,1,0)","v":"A partager_108"},{"$f":"VLOOKUP(A119,'A porter seul'!$A$6:$C$679,3,0)","v":{"$error":"#N/A"}}]
["A porter seul_109","A partager_109",109,{"$f":"VLOOKUP(A120,'A porter seul'!$A$6:$A$679,1,0)","v":{"$error":"#N/A"}},{"$f":"VLOOKUP(B120,'A partager'!$A$6:$A$738,1,0)","v":"A partager_109"},{"$f":"VLOOKUP(A120,'A porter seul'!$A$6:$C$679,3,0)","v":{"$error":"#N/A"}}]
["A porter seul_110","A partager_110",110,{"$f":"VLOOKUP(A121,'A porter seul'!$A$6:$A$679,1,0)","v":{"$error":"#N/A"}},{"$f":"VLOOKUP(B121,'A partager'!$A$6:$A$738,1,0)","v":"A partager_110"},{"$f":"VLOOKUP(A121,'A porter seul'!$A$6:$C$679,3,0)","v":{"$error":"#N/A"}}]
["A porter seul_111","A partager_111",111,{"$f":"VLOOKUP(A122,'A porter seul'!$A$6:$A$679,1,0)","v":{"$error":"#N/A"}},{"$f":"VLOOKUP(B122,'A partager'!$A$6:$A$738,1,0)","v":"A partager_111"},{"$f":"VLOOKUP(A122,'A porter seul'!$A$6:$C$679,3,0)","v":{"$error":"#N/A"}}]
["A porter seul_112","A partager_112",112,{"$f":"VLOOKUP(A123,'A porter seul'!$A$6:$A$679,1,0)","v":{"$error":"#N/A"}},{"$f":"VLOOKUP(B123,'A partager'!$A$6:$A$738,1,0)","v":"A partager_112"},{"$f":"VLOOKUP(A123,'A porter seul'!$A$6:$C$679,3,0)","v":{"$error":"#N/A"}}]
["A porter seul_113","A partager_113",113,{"$f":"VLOOKUP(A124,'A porter seul'!$A$6:$A$679,1,0)","v":{"$error":"#N/A"}},{"$f":"VLOOKUP(B124,'A partager'!$A$6:$A$738,1,0)","v":"A partager_113"},{"$f":"VLOOKUP(A124,'A porter seul'!$A$6:$C$679,3,0)","v":{"$error":"#N/A"}}]
["A porter seul_114","A partager_114",114,{"$f":"VLOOKUP(A125,'A porter seul'!$A$6:$A$679,1,0)","v":{"$error":"#N/A"}},{"$f":"VLOOKUP(B125,'A partager'!$A$6:$A$738,1,0)","v":"A partager_114"},{"$f":"VLOOKUP(A125,'A porter seul'!$A$6:$C$679,3,0)","v":{"$error":"#N/A"}}]
["A porter seul_115","A partager_115",115,{"$f":"VLOOKUP(A126,'A porter seul'!$A$6:$A$679,1,0)","v":{"$error":"#N/A"}},{"$f":"VLOOKUP(B126,'A partager'!$A$6:$A$738,1,0)","v":{"$error":"#N/A"}},{"$f":"VLOOKUP(A126,'A porter seul'!$A$6:$C$679,3,0)","v":{"$error":"#N/A"}}]
["A porter seul_116","A partager_116",116,{"$f":"VLOOKUP(A127,'A porter seul'!$A$6:$A$679,1,0)","v":{"$error":"#N/A"}},{"$f":"VLOOKUP(B127,'A partager'!$A$6:$A$738,1,0)","v":{"$error":"#N/A"}},{"$f":"VLOOKUP(A127,'A porter seul'!$A$6:$C$679,3,0)","v":{"$error":"#N/A"}}]
["A porter seul_117","A partager_117",117,{"$f":"VLOOKUP(A128,'A porter seul'!$A$6:$A$679,1,0)","v":{"$error":"#N/A"}},{"$f":"VLOOKUP(B128,'A partager'!$A$6:$A$738,1,0)","v":{"$error":"#N/A"}},{"$f":"VLOOKUP(A128,'A porter seul'!$A$6:$C$679,3,0)","v":{"$error":"#N/A"}}]
["A porter seul_118","A partager_118",118,{"$f":"VLOOKUP(A129,'A porter seul'!$A$6:$A$679,1,0)","v":{"$error":"#N/A"}},{"$f":"VLOOKUP(B129,'A partager'!$A$6:$A$738,1,0)","v":{"$error":"#N/A"}},{"$f":"VLOOKUP(A129,'A porter seul'!$A$6:$C$679,3,0)","v":{"$error":"#N/A"}}]
["A porter seul_119","A partager_119",119,{"$f":"VLOOKUP(A130,'A porter seul'!$A$6:$A$679,1,0)","v":{"$error":"#N/A"}},{"$f":"VLOOKUP(B130,'A partager'!$A$6:$A$738,1,0)","v":{"$error":"#N/A"}},{"$f":"VLOOKUP(A130,'A porter seul'!$A$6:$C$679,3,0)","v":{"$error":"#N/A"}}]
["A porter seul_120","A partager_120",120,{"$f":"VLOOKUP(A131,'A porter seul'!$A$6:$A$679,1,0)","v":{"$error":"#N/A"}},{"$f":"VLOOKUP(B131,'A partager'!$A$6:$A$738,1,0)","v":{"$error":"#N/A"}},{"$f":"VLOOKUP(A131,'A porter seul'!$A$6:$C$679,3,0)","v":{"$error":"#N/A"}}]
["A porter seul_121","A partager_121",121,{"$f":"VLOOKUP(A132,'A porter seul'!$A$6:$A$679,1,0)","v":{"$error":"#N/A"}},{"$f":"VLOOKUP(B132,'A partager'!$A$6:$A$738,1,0)","v":{"$error":"#N/A"}},{"$f":"VLOOKUP(A132,'A porter seul'!$A$6:$C$679,3,0)","v":{"$error":"#N/A"}}]
["A porter seul_122","A partager_122",122,{"$f":"VLOOKUP(A133,'A porter seul'!$A$6:$A$679,1,0)","v":{"$error":"#N/A"}},{"$f":"VLOOKUP(B133,'A partager'!$A$6:$A$738,1,0)","v":{"$error":"#N/A"}},{"$f":"VLOOKUP(A133,'A porter seul'!$A$6:$C$679,3,0)","v":{"$error":"#N/A"}}]
["A porter seul_123","A partager_123",123,{"$f":"VLOOKUP(A134,'A porter seul'!$A$6:$A$679,1,0)","v":{"$error":"#N/A"}},{"$f":"VLOOKUP(B134,'A partager'!$A$6:$A$738,1,0)","v":{"$error":"#N/A"}},{"$f":"VLOOKUP(A134,'A porter seul'!$A$6:$C$679,3,0)","v":{"$error":"#N/A"}}]
["A porter seul_124","A partager_124",124,{"$f":"VLOOKUP(A135,'A porter seul'!$A$6:$A$679,1,0)","v":{"$error":"#N/A"}},{"$f":"VLOOKUP(B135,'A partager'!$A$6:$A$738,1,0)","v":{"$error":"#N/A"}},{"$f":"VLOOKUP(A135,'A porter seul'!$A$6:$C$679,3,0)","v":{"$error":"#N/A"}}]
["A porter seul_125","A partager_125",125,{"$f":"VLOOKUP(A136,'A porter seul'!$A$6:$A$679,1,0)","v":{"$error":"#N/A"}},{"$f":"VLOOKUP(B136,'A partager'!$A$6:$A$738,1,0)","v":{"$error":"#N/A"}},{"$f":"VLOOKUP(A136,'A porter seul'!$A$6:$C$679,3,0)","v":{"$error":"#N/A"}}]
["A porter seul_126","A partager_126",126,{"$f":"VLOOKUP(A137,'A porter seul'!$A$6:$A$679,1,0)","v":{"$error":"#N/A"}},{"$f":"VLOOKUP(B137,'A partager'!$A$6:$A$738,1,0)","v":{"$error":"#N/A"}},{"$f":"VLOOKUP(A137,'A porter seul'!$A$6:$C$679,3,0)","v":{"$error":"#N/A"}}]
["A porter seul_127","A partager_127",127,{"$f":"VLOOKUP(A138,'A porter seul'!$A$6:$A$679,1,0)","v":{"$error":"#N/A"}},{"$f":"VLOOKUP(B138,'A partager'!$A$6:$A$738,1,0)","v":{"$error":"#N/A"}},{"$f":"VLOOKUP(A138,'A porter seul'!$A$6:$C$679,3,0)","v":{"$error":"#N/A"}}]
["A porter seul_128","A partager_128",128,{"$f":"VLOOKUP(A139,'A porter seul'!$A$6:$A$679,1,0)","v":{"$error":"#N/A"}},{"$f":"VLOOKUP(B139,'A partager'!$A$6:$A$738,1,0)","v":{"$error":"#N/A"}},{"$f":"VLOOKUP(A139,'A porter seul'!$A$6:$C$679,3,0)","v":{"$error":"#N/A"}}]
["A porter seul_129","A partager_129",129,{"$f":"VLOOKUP(A140,'A porter seul'!$A$6:$A$679,1,0)","v":{"$error":"#N/A"}},{"$f":"VLOOKUP(B140,'A partager'!$A$6:$A$738,1,0)","v":{"$error":"#N/A"}},{"$f":"VLOOKUP(A140,'A porter seul'!$A$6:$C$679,3,0)","v":{"$error":"#N/A"}}]
[{"$f":"\"A porter seul_\"&C141","v":"A porter seul_130"},{"$f":"\"A partager_\"&C141","v":"A partager_130"},130,{"$f":"VLOOKUP(A141,'A porter seul'!$A$6:$A$679,1,0)","v":{"$error":"#N/A"}},{"$f":"VLOOKUP(B141,'A partager'!$A$6:$A$738,1,0)","v":{"$error":"#N/A"}},{"$f":"VLOOKUP(A141,'A porter seul'!$A$6:$C$679,3,0)","v":{"$error":"#N/A"}}]
["A porter seul_131","A partager_131",131,{"$f":"VLOOKUP(A142,'A porter seul'!$A$6:$A$679,1,0)","v":{"$error":"#N/A"}},{"$f":"VLOOKUP(B142,'A partager'!$A$6:$A$738,1,0)","v":{"$error":"#N/A"}},{"$f":"VLOOKUP(A142,'A porter seul'!$A$6:$C$679,3,0)","v":{"$error":"#N/A"}}]
["A porter seul_132","A partager_132",132,{"$f":"VLOOKUP(A143,'A porter seul'!$A$6:$A$679,1,0)","v":{"$error":"#N/A"}},{"$f":"VLOOKUP(B143,'A partager'!$A$6:$A$738,1,0)","v":{"$error":"#N/A"}},{"$f":"VLOOKUP(A143,'A porter seul'!$A$6:$C$679,3,0)","v":{"$error":"#N/A"}}]
["A porter seul_133","A partager_133",133,{"$f":"VLOOKUP(A144,'A porter seul'!$A$6:$A$679,1,0)","v":{"$error":"#N/A"}},{"$f":"VLOOKUP(B144,'A partager'!$A$6:$A$738,1,0)","v":{"$error":"#N/A"}},{"$f":"VLOOKUP(A144,'A porter seul'!$A$6:$C$679,3,0)","v":{"$error":"#N/A"}}]
["A porter seul_134","A partager_134",134,{"$f":"VLOOKUP(A145,'A porter seul'!$A$6:$A$679,1,0)","v":{"$error":"#N/A"}},{"$f":"VLOOKUP(B145,'A partager'!$A$6:$A$738,1,0)","v":{"$error":"#N/A"}},{"$f":"VLOOKUP(A145,'A porter seul'!$A$6:$C$679,3,0)","v":{"$error":"#N/A"}}]
["A porter seul_135","A partager_135",135,{"$f":"VLOOKUP(A146,'A porter seul'!$A$6:$A$679,1,0)","v":{"$error":"#N/A"}},{"$f":"VLOOKUP(B146,'A partager'!$A$6:$A$738,1,0)","v":{"$error":"#N/A"}},{"$f":"VLOOKUP(A146,'A porter seul'!$A$6:$C$679,3,0)","v":{"$error":"#N/A"}}]
["A porter seul_136","A partager_136",136,{"$f":"VLOOKUP(A147,'A porter seul'!$A$6:$A$679,1,0)","v":{"$error":"#N/A"}},{"$f":"VLOOKUP(B147,'A partager'!$A$6:$A$738,1,0)","v":{"$error":"#N/A"}},{"$f":"VLOOKUP(A147,'A porter seul'!$A$6:$C$679,3,0)","v":{"$error":"#N/A"}}]
["A porter seul_137","A partager_137",137,{"$f":"VLOOKUP(A148,'A porter seul'!$A$6:$A$679,1,0)","v":{"$error":"#N/A"}},{"$f":"VLOOKUP(B148,'A partager'!$A$6:$A$738,1,0)","v":{"$error":"#N/A"}},{"$f":"VLOOKUP(A148,'A porter seul'!$A$6:$C$679,3,0)","v":{"$error":"#N/A"}}]
["A porter seul_138","A partager_138",138,{"$f":"VLOOKUP(A149,'A porter seul'!$A$6:$A$679,1,0)","v":{"$error":"#N/A"}},{"$f":"VLOOKUP(B149,'A partager'!$A$6:$A$738,1,0)","v":{"$error":"#N/A"}},{"$f":"VLOOKUP(A149,'A porter seul'!$A$6:$C$679,3,0)","v":{"$error":"#N/A"}}]
["A porter seul_139","A partager_139",139,{"$f":"VLOOKUP(A150,'A porter seul'!$A$6:$A$679,1,0)","v":{"$error":"#N/A"}},{"$f":"VLOOKUP(B150,'A partager'!$A$6:$A$738,1,0)","v":{"$error":"#N/A"}},{"$f":"VLOOKUP(A150,'A porter seul'!$A$6:$C$679,3,0)","v":{"$error":"#N/A"}}]
["A porter seul_140","A partager_140",140,{"$f":"VLOOKUP(A151,'A porter seul'!$A$6:$A$679,1,0)","v":{"$error":"#N/A"}},{"$f":"VLOOKUP(B151,'A partager'!$A$6:$A$738,1,0)","v":{"$error":"#N/A"}},{"$f":"VLOOKUP(A151,'A porter seul'!$A$6:$C$679,3,0)","v":{"$error":"#N/A"}}]
["A porter seul_141","A partager_141",141,{"$f":"VLOOKUP(A152,'A porter seul'!$A$6:$A$679,1,0)","v":{"$error":"#N/A"}},{"$f":"VLOOKUP(B152,'A partager'!$A$6:$A$738,1,0)","v":{"$error":"#N/A"}},{"$f":"VLOOKUP(A152,'A porter seul'!$A$6:$C$679,3,0)","v":{"$error":"#N/A"}}]
["A porter seul_142","A partager_142",142,{"$f":"VLOOKUP(A153,'A porter seul'!$A$6:$A$679,1,0)","v":{"$error":"#N/A"}},{"$f":"VLOOKUP(B153,'A partager'!$A$6:$A$738,1,0)","v":{"$error":"#N/A"}},{"$f":"VLOOKUP(A153,'A porter seul'!$A$6:$C$679,3,0)","v":{"$error":"#N/A"}}]
["A porter seul_143","A partager_143",143,{"$f":"VLOOKUP(A154,'A porter seul'!$A$6:$A$679,1,0)","v":{"$error":"#N/A"}},{"$f":"VLOOKUP(B154,'A partager'!$A$6:$A$738,1,0)","v":{"$error":"#N/A"}},{"$f":"VLOOKUP(A154,'A porter seul'!$A$6:$C$679,3,0)","v":{"$error":"#N/A"}}]
["A porter seul_144","A partager_144",144,{"$f":"VLOOKUP(A155,'A porter seul'!$A$6:$A$679,1,0)","v":{"$error":"#N/A"}},{"$f":"VLOOKUP(B155,'A partager'!$A$6:$A$738,1,0)","v":{"$error":"#N/A"}},{"$f":"VLOOKUP(A155,'A porter seul'!$A$6:$C$679,3,0)","v":{"$error":"#N/A"}}]
["A porter seul_145","A partager_145",145,{"$f":"VLOOKUP(A156,'A porter seul'!$A$6:$A$679,1,0)","v":{"$error":"#N/A"}},{"$f":"VLOOKUP(B156,'A partager'!$A$6:$A$738,1,0)","v":{"$error":"#N/A"}},{"$f":"VLOOKUP(A156,'A porter seul'!$A$6:$C$679,3,0)","v":{"$error":"#N/A"}}]
["A porter seul_146","A partager_146",146,{"$f":"VLOOKUP(A157,'A porter seul'!$A$6:$A$679,1,0)","v":{"$error":"#N/A"}},{"$f":"VLOOKUP(B157,'A partager'!$A$6:$A$738,1,0)","v":{"$error":"#N/A"}},{"$f":"VLOOKUP(A157,'A porter seul'!$A$6:$C$679,3,0)","v":{"$error":"#N/A"}}]
["A porter seul_147","A partager_147",147,{"$f":"VLOOKUP(A158,'A porter seul'!$A$6:$A$679,1,0)","v":{"$error":"#N/A"}},{"$f":"VLOOKUP(B158,'A partager'!$A$6:$A$738,1,0)","v":{"$error":"#N/A"}},{"$f":"VLOOKUP(A158,'A porter seul'!$A$6:$C$679,3,0)","v":{"$error":"#N/A"}}]
["A porter seul_148","A partager_148",148,{"$f":"VLOOKUP(A159,'A porter seul'!$A$6:$A$679,1,0)","v":{"$error":"#N/A"}},{"$f":"VLOOKUP(B159,'A partager'!$A$6:$A$738,1,0)","v":{"$error":"#N/A"}},{"$f":"VLOOKUP(A159,'A porter seul'!$A$6:$C$679,3,0)","v":{"$error":"#N/A"}}]
["A porter seul_149","A partager_149",149,{"$f":"VLOOKUP(A160,'A porter seul'!$A$6:$A$679,1,0)","v":{"$error":"#N/A"}},{"$f":"VLOOKUP(B160,'A partager'!$A$6:$A$738,1,0)","v":{"$error":"#N/A"}},{"$f":"VLOOKUP(A160,'A porter seul'!$A$6:$C$679,3,0)","v":{"$error":"#N/A"}}]
["A porter seul_150","A partager_150",150,{"$f":"VLOOKUP(A161,'A porter seul'!$A$6:$A$679,1,0)","v":{"$error":"#N/A"}},{"$f":"VLOOKUP(B161,'A partager'!$A$6:$A$738,1,0)","v":{"$error":"#N/A"}},{"$f":"VLOOKUP(A161,'A porter seul'!$A$6:$C$679,3,0)","v":{"$error":"#N/A"}}]
["A porter seul_151","A partager_151",151,{"$f":"VLOOKUP(A162,'A porter seul'!$A$6:$A$679,1,0)","v":{"$error":"#N/A"}},{"$f":"VLOOKUP(B162,'A partager'!$A$6:$A$738,1,0)","v":{"$error":"#N/A"}},{"$f":"VLOOKUP(A162,'A porter seul'!$A$6:$C$679,3,0)","v":{"$error":"#N/A"}}]
["A porter seul_152","A partager_152",152,{"$f":"VLOOKUP(A163,'A porter seul'!$A$6:$A$679,1,0)","v":{"$error":"#N/A"}},{"$f":"VLOOKUP(B163,'A partager'!$A$6:$A$738,1,0)","v":{"$error":"#N/A"}},{"$f":"VLOOKUP(A163,'A porter seul'!$A$6:$C$679,3,0)","v":{"$error":"#N/A"}}]
["A porter seul_153","A partager_153",153,{"$f":"VLOOKUP(A164,'A porter seul'!$A$6:$A$679,1,0)","v":{"$error":"#N/A"}},{"$f":"VLOOKUP(B164,'A partager'!$A$6:$A$738,1,0)","v":{"$error":"#N/A"}},{"$f":"VLOOKUP(A164,'A porter seul'!$A$6:$C$679,3,0)","v":{"$error":"#N/A"}}]
["A porter seul_154","A partager_154",154,{"$f":"VLOOKUP(A165,'A porter seul'!$A$6:$A$679,1,0)","v":{"$error":"#N/A"}},{"$f":"VLOOKUP(B165,'A partager'!$A$6:$A$738,1,0)","v":{"$error":"#N/A"}},{"$f":"VLOOKUP(A165,'A porter seul'!$A$6:$C$679,3,0)","v":{"$error":"#N/A"}}]
["A porter seul_155","A partager_155",155,{"$f":"VLOOKUP(A166,'A porter seul'!$A$6:$A$679,1,0)","v":{"$error":"#N/A"}},{"$f":"VLOOKUP(B166,'A partager'!$A$6:$A$738,1,0)","v":{"$error":"#N/A"}},{"$f":"VLOOKUP(A166,'A porter seul'!$A$6:$C$679,3,0)","v":{"$error":"#N/A"}}]
["A porter seul_156","A partager_156",156,{"$f":"VLOOKUP(A167,'A porter seul'!$A$6:$A$679,1,0)","v":{"$error":"#N/A"}},{"$f":"VLOOKUP(B167,'A partager'!$A$6:$A$738,1,0)","v":{"$error":"#N/A"}},{"$f":"VLOOKUP(A167,'A porter seul'!$A$6:$C$679,3,0)","v":{"$error":"#N/A"}}]
["A porter seul_157","A partager_157",157,{"$f":"VLOOKUP(A168,'A porter seul'!$A$6:$A$679,1,0)","v":{"$error":"#N/A"}},{"$f":"VLOOKUP(B168,'A partager'!$A$6:$A$738,1,0)","v":{"$error":"#N/A"}},{"$f":"VLOOKUP(A168,'A porter seul'!$A$6:$C$679,3,0)","v":{"$error":"#N/A"}}]
["A porter seul_158","A partager_158",158,{"$f":"VLOOKUP(A169,'A porter seul'!$A$6:$A$679,1,0)","v":{"$error":"#N/A"}},{"$f":"VLOOKUP(B169,'A partager'!$A$6:$A$738,1,0)","v":{"$error":"#N/A"}},{"$f":"VLOOKUP(A169,'A porter seul'!$A$6:$C$679,3,0)","v":{"$error":"#N/A"}}]
["A porter seul_159","A partager_159",159,{"$f":"VLOOKUP(A170,'A porter seul'!$A$6:$A$679,1,0)","v":{"$error":"#N/A"}},{"$f":"VLOOKUP(B170,'A partager'!$A$6:$A$738,1,0)","v":{"$error":"#N/A"}},{"$f":"VLOOKUP(A170,'A porter seul'!$A$6:$C$679,3,0)","v":{"$error":"#N/A"}}]
["A porter seul_160","A partager_160",160,{"$f":"VLOOKUP(A171,'A porter seul'!$A$6:$A$679,1,0)","v":{"$error":"#N/A"}},{"$f":"VLOOKUP(B171,'A partager'!$A$6:$A$738,1,0)","v":{"$error":"#N/A"}},{"$f":"VLOOKUP(A171,'A porter seul'!$A$6:$C$679,3,0)","v":{"$error":"#N/A"}}]
["A porter seul_161","A partager_161",161,{"$f":"VLOOKUP(A172,'A porter seul'!$A$6:$A$679,1,0)","v":{"$error":"#N/A"}},{"$f":"VLOOKUP(B172,'A partager'!$A$6:$A$738,1,0)","v":{"$error":"#N/A"}},{"$f":"VLOOKUP(A172,'A porter seul'!$A$6:$C$679,3,0)","v":{"$error":"#N/A"}}]
["A porter seul_162","A partager_162",162,{"$f":"VLOOKUP(A173,'A porter seul'!$A$6:$A$679,1,0)","v":{"$error":"#N/A"}},{"$f":"VLOOKUP(B173,'A partager'!$A$6:$A$738,1,0)","v":{"$error":"#N/A"}},{"$f":"VLOOKUP(A173,'A porter seul'!$A$6:$C$679,3,0)","v":{"$error":"#N/A"}}]
["A porter seul_163","A partager_163",163,{"$f":"VLOOKUP(A174,'A porter seul'!$A$6:$A$679,1,0)","v":{"$error":"#N/A"}},{"$f":"VLOOKUP(B174,'A partager'!$A$6:$A$738,1,0)","v":{"$error":"#N/A"}},{"$f":"VLOOKUP(A174,'A porter seul'!$A$6:$C$679,3,0)","v":{"$error":"#N/A"}}]
["A porter seul_164","A partager_164",164,{"$f":"VLOOKUP(A175,'A porter seul'!$A$6:$A$679,1,0)","v":{"$error":"#N/A"}},{"$f":"VLOOKUP(B175,'A partager'!$A$6:$A$738,1,0)","v":{"$error":"#N/A"}},{"$f":"VLOOKUP(A175,'A porter seul'!$A$6:$C$679,3,0)","v":{"$error":"#N/A"}}]
["A porter seul_165","A partager_165",165,{"$f":"VLOOKUP(A176,'A porter seul'!$A$6:$A$679,1,0)","v":{"$error":"#N/A"}},{"$f":"VLOOKUP(B176,'A partager'!$A$6:$A$738,1,0)","v":{"$error":"#N/A"}},{"$f":"VLOOKUP(A176,'A porter seul'!$A$6:$C$679,3,0)","v":{"$error":"#N/A"}}]
["A porter seul_166","A partager_166",166,{"$f":"VLOOKUP(A177,'A porter seul'!$A$6:$A$679,1,0)","v":{"$error":"#N/A"}},{"$f":"VLOOKUP(B177,'A partager'!$A$6:$A$738,1,0)","v":{"$error":"#N/A"}},{"$f":"VLOOKUP(A177,'A porter seul'!$A$6:$C$679,3,0)","v":{"$error":"#N/A"}}]
["A porter seul_167","A partager_167",167,{"$f":"VLOOKUP(A178,'A porter seul'!$A$6:$A$679,1,0)","v":{"$error":"#N/A"}},{"$f":"VLOOKUP(B178,'A partager'!$A$6:$A$738,1,0)","v":{"$error":"#N/A"}},{"$f":"VLOOKUP(A178,'A porter seul'!$A$6:$C$679,3,0)","v":{"$error":"#N/A"}}]
["A porter seul_168","A partager_168",168,{"$f":"VLOOKUP(A179,'A porter seul'!$A$6:$A$679,1,0)","v":{"$error":"#N/A"}},{"$f":"VLOOKUP(B179,'A partager'!$A$6:$A$738,1,0)","v":{"$error":"#N/A"}},{"$f":"VLOOKUP(A179,'A porter seul'!$A$6:$C$679,3,0)","v":{"$error":"#N/A"}}]
["A porter seul_169","A partager_169",169,{"$f":"VLOOKUP(A180,'A porter seul'!$A$6:$A$679,1,0)","v":{"$error":"#N/A"}},{"$f":"VLOOKUP(B180,'A partager'!$A$6:$A$738,1,0)","v":{"$error":"#N/A"}},{"$f":"VLOOKUP(A180,'A porter seul'!$A$6:$C$679,3,0)","v":{"$error":"#N/A"}}]
["A porter seul_170","A partager_170",170,{"$f":"VLOOKUP(A181,'A porter seul'!$A$6:$A$679,1,0)","v":{"$error":"#N/A"}},{"$f":"VLOOKUP(B181,'A partager'!$A$6:$A$738,1,0)","v":{"$error":"#N/A"}},{"$f":"VLOOKUP(A181,'A porter seul'!$A$6:$C$679,3,0)","v":{"$error":"#N/A"}}]
["A porter seul_171","A partager_171",171,{"$f":"VLOOKUP(A182,'A porter seul'!$A$6:$A$679,1,0)","v":{"$error":"#N/A"}},{"$f":"VLOOKUP(B182,'A partager'!$A$6:$A$738,1,0)","v":{"$error":"#N/A"}},{"$f":"VLOOKUP(A182,'A porter seul'!$A$6:$C$679,3,0)","v":{"$error":"#N/A"}}]
["A porter seul_172","A partager_172",172,{"$f":"VLOOKUP(A183,'A porter seul'!$A$6:$A$679,1,0)","v":{"$error":"#N/A"}},{"$f":"VLOOKUP(B183,'A partager'!$A$6:$A$738,1,0)","v":{"$error":"#N/A"}},{"$f":"VLOOKUP(A183,'A porter seul'!$A$6:$C$679,3,0)","v":{"$error":"#N/A"}}]
["A porter seul_173","A partager_173",173,{"$f":"VLOOKUP(A184,'A porter seul'!$A$6:$A$679,1,0)","v":{"$error":"#N/A"}},{"$f":"VLOOKUP(B184,'A partager'!$A$6:$A$738,1,0)","v":{"$error":"#N/A"}},{"$f":"VLOOKUP(A184,'A porter seul'!$A$6:$C$679,3,0)","v":{"$error":"#N/A"}}]
["A porter seul_174","A partager_174",174,{"$f":"VLOOKUP(A185,'A porter seul'!$A$6:$A$679,1,0)","v":{"$error":"#N/A"}},{"$f":"VLOOKUP(B185,'A partager'!$A$6:$A$738,1,0)","v":{"$error":"#N/A"}},{"$f":"VLOOKUP(A185,'A porter seul'!$A$6:$C$679,3,0)","v":{"$error":"#N/A"}}]
["A porter seul_175","A partager_175",175,{"$f":"VLOOKUP(A186,'A porter seul'!$A$6:$A$679,1,0)","v":{"$error":"#N/A"}},{"$f":"VLOOKUP(B186,'A partager'!$A$6:$A$738,1,0)","v":{"$error":"#N/A"}},{"$f":"VLOOKUP(A186,'A porter seul'!$A$6:$C$679,3,0)","v":{"$error":"#N/A"}}]
["A porter seul_176","A partager_176",176,{"$f":"VLOOKUP(A187,'A porter seul'!$A$6:$A$679,1,0)","v":{"$error":"#N/A"}},{"$f":"VLOOKUP(B187,'A partager'!$A$6:$A$738,1,0)","v":{"$error":"#N/A"}},{"$f":"VLOOKUP(A187,'A porter seul'!$A$6:$C$679,3,0)","v":{"$error":"#N/A"}}]
["A porter seul_177","A partager_177",177,{"$f":"VLOOKUP(A188,'A porter seul'!$A$6:$A$679,1,0)","v":{"$error":"#N/A"}},{"$f":"VLOOKUP(B188,'A partager'!$A$6:$A$738,1,0)","v":{"$error":"#N/A"}},{"$f":"VLOOKUP(A188,'A porter seul'!$A$6:$C$679,3,0)","v":{"$error":"#N/A"}}]
["A porter seul_178","A partager_178",178,{"$f":"VLOOKUP(A189,'A porter seul'!$A$6:$A$679,1,0)","v":{"$error":"#N/A"}},{"$f":"VLOOKUP(B189,'A partager'!$A$6:$A$738,1,0)","v":{"$error":"#N/A"}},{"$f":"VLOOKUP(A189,'A porter seul'!$A$6:$C$679,3,0)","v":{"$error":"#N/A"}}]
["A porter seul_179","A partager_179",179,{"$f":"VLOOKUP(A190,'A porter seul'!$A$6:$A$679,1,0)","v":{"$error":"#N/A"}},{"$f":"VLOOKUP(B190,'A partager'!$A$6:$A$738,1,0)","v":{"$error":"#N/A"}},{"$f":"VLOOKUP(A190,'A porter seul'!$A$6:$C$679,3,0)","v":{"$error":"#N/A"}}]
["A porter seul_180","A partager_180",180,{"$f":"VLOOKUP(A191,'A porter seul'!$A$6:$A$679,1,0)","v":{"$error":"#N/A"}},{"$f":"VLOOKUP(B191,'A partager'!$A$6:$A$738,1,0)","v":{"$error":"#N/A"}},{"$f":"VLOOKUP(A191,'A porter seul'!$A$6:$C$679,3,0)","v":{"$error":"#N/A"}}]
["A porter seul_181","A partager_181",181,{"$f":"VLOOKUP(A192,'A porter seul'!$A$6:$A$679,1,0)","v":{"$error":"#N/A"}},{"$f":"VLOOKUP(B192,'A partager'!$A$6:$A$738,1,0)","v":{"$error":"#N/A"}},{"$f":"VLOOKUP(A192,'A porter seul'!$A$6:$C$679,3,0)","v":{"$error":"#N/A"}}]
["A porter seul_182","A partager_182",182,{"$f":"VLOOKUP(A193,'A porter seul'!$A$6:$A$679,1,0)","v":{"$error":"#N/A"}},{"$f":"VLOOKUP(B193,'A partager'!$A$6:$A$738,1,0)","v":{"$error":"#N/A"}},{"$f":"VLOOKUP(A193,'A porter seul'!$A$6:$C$679,3,0)","v":{"$error":"#N/A"}}]
["A porter seul_183","A partager_183",183,{"$f":"VLOOKUP(A194,'A porter seul'!$A$6:$A$679,1,0)","v":{"$error":"#N/A"}},{"$f":"VLOOKUP(B194,'A partager'!$A$6:$A$738,1,0)","v":{"$error":"#N/A"}},{"$f":"VLOOKUP(A194,'A porter seul'!$A$6:$C$679,3,0)","v":{"$error":"#N/A"}}]
["A porter seul_184","A partager_184",184,{"$f":"VLOOKUP(A195,'A porter seul'!$A$6:$A$679,1,0)","v":{"$error":"#N/A"}},{"$f":"VLOOKUP(B195,'A partager'!$A$6:$A$738,1,0)","v":{"$error":"#N/A"}},{"$f":"VLOOKUP(A195,'A porter seul'!$A$6:$C$679,3,0)","v":{"$error":"#N/A"}}]
["A porter seul_185","A partager_185",185,{"$f":"VLOOKUP(A196,'A porter seul'!$A$6:$A$679,1,0)","v":{"$error":"#N/A"}},{"$f":"VLOOKUP(B196,'A partager'!$A$6:$A$738,1,0)","v":{"$error":"#N/A"}},{"$f":"VLOOKUP(A196,'A porter seul'!$A$6:$C$679,3,0)","v":{"$error":"#N/A"}}]
["A porter seul_186","A partager_186",186,{"$f":"VLOOKUP(A197,'A porter seul'!$A$6:$A$679,1,0)","v":{"$error":"#N/A"}},{"$f":"VLOOKUP(B197,'A partager'!$A$6:$A$738,1,0)","v":{"$error":"#N/A"}},{"$f":"VLOOKUP(A197,'A porter seul'!$A$6:$C$679,3,0)","v":{"$error":"#N/A"}}]
["A porter seul_187","A partager_187",187,{"$f":"VLOOKUP(A198,'A porter seul'!$A$6:$A$679,1,0)","v":{"$error":"#N/A"}},{"$f":"VLOOKUP(B198,'A partager'!$A$6:$A$738,1,0)","v":{"$error":"#N/A"}},{"$f":"VLOOKUP(A198,'A porter seul'!$A$6:$C$679,3,0)","v":{"$error":"#N/A"}}]
["A porter seul_188","A partager_188",188,{"$f":"VLOOKUP(A199,'A porter seul'!$A$6:$A$679,1,0)","v":{"$error":"#N/A"}},{"$f":"VLOOKUP(B199,'A partager'!$A$6:$A$738,1,0)","v":{"$error":"#N/A"}},{"$f":"VLOOKUP(A199,'A porter seul'!$A$6:$C$679,3,0)","v":{"$error":"#N/A"}}]
["A porter seul_189","A partager_189",189,{"$f":"VLOOKUP(A200,'A porter seul'!$A$6:$A$679,1,0)","v":{"$error":"#N/A"}},{"$f":"VLOOKUP(B200,'A partager'!$A$6:$A$738,1,0)","v":{"$error":"#N/A"}},{"$f":"VLOOKUP(A200,'A porter seul'!$A$6:$C$679,3,0)","v":{"$error":"#N/A"}}]
["A porter seul_190","A partager_190",190,{"$f":"VLOOKUP(A201,'A porter seul'!$A$6:$A$679,1,0)","v":{"$error":"#N/A"}},{"$f":"VLOOKUP(B201,'A partager'!$A$6:$A$738,1,0)","v":{"$error":"#N/A"}},{"$f":"VLOOKUP(A201,'A porter seul'!$A$6:$C$679,3,0)","v":{"$error":"#N/A"}}]
["A porter seul_191","A partager_191",191,{"$f":"VLOOKUP(A202,'A porter seul'!$A$6:$A$679,1,0)","v":{"$error":"#N/A"}},{"$f":"VLOOKUP(B202,'A partager'!$A$6:$A$738,1,0)","v":{"$error":"#N/A"}},{"$f":"VLOOKUP(A202,'A porter seul'!$A$6:$C$679,3,0)","v":{"$error":"#N/A"}}]
["A porter seul_192","A partager_192",192,{"$f":"VLOOKUP(A203,'A porter seul'!$A$6:$A$679,1,0)","v":{"$error":"#N/A"}},{"$f":"VLOOKUP(B203,'A partager'!$A$6:$A$738,1,0)","v":{"$error":"#N/A"}},{"$f":"VLOOKUP(A203,'A porter seul'!$A$6:$C$679,3,0)","v":{"$error":"#N/A"}}]
["A porter seul_193","A partager_193",193,{"$f":"VLOOKUP(A204,'A porter seul'!$A$6:$A$679,1,0)","v":{"$error":"#N/A"}},{"$f":"VLOOKUP(B204,'A partager'!$A$6:$A$738,1,0)","v":{"$error":"#N/A"}},{"$f":"VLOOKUP(A204,'A porter seul'!$A$6:$C$679,3,0)","v":{"$error":"#N/A"}}]
[{"$f":"\"A porter seul_\"&C205","v":"A porter seul_194"},{"$f":"\"A partager_\"&C205","v":"A partager_194"},194,{"$f":"VLOOKUP(A205,'A porter seul'!$A$6:$A$679,1,0)","v":{"$error":"#N/A"}},{"$f":"VLOOKUP(B205,'A partager'!$A$6:$A$738,1,0)","v":{"$error":"#N/A"}},{"$f":"VLOOKUP(A205,'A porter seul'!$A$6:$C$679,3,0)","v":{"$error":"#N/A"}}]
["A porter seul_195","A partager_195",195,{"$f":"VLOOKUP(A206,'A porter seul'!$A$6:$A$679,1,0)","v":{"$error":"#N/A"}},{"$f":"VLOOKUP(B206,'A partager'!$A$6:$A$738,1,0)","v":{"$error":"#N/A"}},{"$f":"VLOOKUP(A206,'A porter seul'!$A$6:$C$679,3,0)","v":{"$error":"#N/A"}}]
["A porter seul_196","A partager_196",196,{"$f":"VLOOKUP(A207,'A porter seul'!$A$6:$A$679,1,0)","v":{"$error":"#N/A"}},{"$f":"VLOOKUP(B207,'A partager'!$A$6:$A$738,1,0)","v":{"$error":"#N/A"}},{"$f":"VLOOKUP(A207,'A porter seul'!$A$6:$C$679,3,0)","v":{"$error":"#N/A"}}]
["A porter seul_197","A partager_197",197,{"$f":"VLOOKUP(A208,'A porter seul'!$A$6:$A$679,1,0)","v":{"$error":"#N/A"}},{"$f":"VLOOKUP(B208,'A partager'!$A$6:$A$738,1,0)","v":{"$error":"#N/A"}},{"$f":"VLOOKUP(A208,'A porter seul'!$A$6:$C$679,3,0)","v":{"$error":"#N/A"}}]
["A porter seul_198","A partager_198",198,{"$f":"VLOOKUP(A209,'A porter seul'!$A$6:$A$679,1,0)","v":{"$error":"#N/A"}},{"$f":"VLOOKUP(B209,'A partager'!$A$6:$A$738,1,0)","v":{"$error":"#N/A"}},{"$f":"VLOOKUP(A209,'A porter seul'!$A$6:$C$679,3,0)","v":{"$error":"#N/A"}}]
["A porter seul_199","A partager_199",199,{"$f":"VLOOKUP(A210,'A porter seul'!$A$6:$A$679,1,0)","v":{"$error":"#N/A"}},{"$f":"VLOOKUP(B210,'A partager'!$A$6:$A$738,1,0)","v":{"$error":"#N/A"}},{"$f":"VLOOKUP(A210,'A porter seul'!$A$6:$C$679,3,0)","v":{"$error":"#N/A"}}]
["A porter seul_200","A partager_200",200,{"$f":"VLOOKUP(A211,'A porter seul'!$A$6:$A$679,1,0)","v":{"$error":"#N/A"}},{"$f":"VLOOKUP(B211,'A partager'!$A$6:$A$738,1,0)","v":{"$error":"#N/A"}},{"$f":"VLOOKUP(A211,'A porter seul'!$A$6:$C$679,3,0)","v":{"$error":"#N/A"}}]
["A porter seul_201","A partager_201",201,{"$f":"VLOOKUP(A212,'A porter seul'!$A$6:$A$679,1,0)","v":{"$error":"#N/A"}},{"$f":"VLOOKUP(B212,'A partager'!$A$6:$A$738,1,0)","v":{"$error":"#N/A"}},{"$f":"VLOOKUP(A212,'A porter seul'!$A$6:$C$679,3,0)","v":{"$error":"#N/A"}}]
["A porter seul_202","A partager_202",202,{"$f":"VLOOKUP(A213,'A porter seul'!$A$6:$A$679,1,0)","v":{"$error":"#N/A"}},{"$f":"VLOOKUP(B213,'A partager'!$A$6:$A$738,1,0)","v":{"$error":"#N/A"}},{"$f":"VLOOKUP(A213,'A porter seul'!$A$6:$C$679,3,0)","v":{"$error":"#N/A"}}]
["A porter seul_203","A partager_203",203,{"$f":"VLOOKUP(A214,'A porter seul'!$A$6:$A$679,1,0)","v":{"$error":"#N/A"}},{"$f":"VLOOKUP(B214,'A partager'!$A$6:$A$738,1,0)","v":{"$error":"#N/A"}},{"$f":"VLOOKUP(A214,'A porter seul'!$A$6:$C$679,3,0)","v":{"$error":"#N/A"}}]
["A porter seul_204","A partager_204",204,{"$f":"VLOOKUP(A215,'A porter seul'!$A$6:$A$679,1,0)","v":{"$error":"#N/A"}},{"$f":"VLOOKUP(B215,'A partager'!$A$6:$A$738,1,0)","v":{"$error":"#N/A"}},{"$f":"VLOOKUP(A215,'A porter seul'!$A$6:$C$679,3,0)","v":{"$error":"#N/A"}}]
["A porter seul_205","A partager_205",205,{"$f":"VLOOKUP(A216,'A porter seul'!$A$6:$A$679,1,0)","v":{"$error":"#N/A"}},{"$f":"VLOOKUP(B216,'A partager'!$A$6:$A$738,1,0)","v":{"$error":"#N/A"}},{"$f":"VLOOKUP(A216,'A porter seul'!$A$6:$C$679,3,0)","v":{"$error":"#N/A"}}]
["A porter seul_206","A partager_206",206,{"$f":"VLOOKUP(A217,'A porter seul'!$A$6:$A$679,1,0)","v":{"$error":"#N/A"}},{"$f":"VLOOKUP(B217,'A partager'!$A$6:$A$738,1,0)","v":{"$error":"#N/A"}},{"$f":"VLOOKUP(A217,'A porter seul'!$A$6:$C$679,3,0)","v":{"$error":"#N/A"}}]
["A porter seul_207","A partager_207",207,{"$f":"VLOOKUP(A218,'A porter seul'!$A$6:$A$679,1,0)","v":{"$error":"#N/A"}},{"$f":"VLOOKUP(B218,'A partager'!$A$6:$A$738,1,0)","v":{"$error":"#N/A"}},{"$f":"VLOOKUP(A218,'A porter seul'!$A$6:$C$679,3,0)","v":{"$error":"#N/A"}}]
["A porter seul_208","A partager_208",208,{"$f":"VLOOKUP(A219,'A porter seul'!$A$6:$A$679,1,0)","v":{"$error":"#N/A"}},{"$f":"VLOOKUP(B219,'A partager'!$A$6:$A$738,1,0)","v":{"$error":"#N/A"}},{"$f":"VLOOKUP(A219,'A porter seul'!$A$6:$C$679,3,0)","v":{"$error":"#N/A"}}]
["A porter seul_209","A partager_209",209,{"$f":"VLOOKUP(A220,'A porter seul'!$A$6:$A$679,1,0)","v":{"$error":"#N/A"}},{"$f":"VLOOKUP(B220,'A partager'!$A$6:$A$738,1,0)","v":{"$error":"#N/A"}},{"$f":"VLOOKUP(A220,'A porter seul'!$A$6:$C$679,3,0)","v":{"$error":"#N/A"}}]
["A porter seul_210","A partager_210",210,{"$f":"VLOOKUP(A221,'A porter seul'!$A$6:$A$679,1,0)","v":{"$error":"#N/A"}},{"$f":"VLOOKUP(B221,'A partager'!$A$6:$A$738,1,0)","v":{"$error":"#N/A"}},{"$f":"VLOOKUP(A221,'A porter seul'!$A$6:$C$679,3,0)","v":{"$error":"#N/A"}}]
["A porter seul_211","A partager_211",211,{"$f":"VLOOKUP(A222,'A porter seul'!$A$6:$A$679,1,0)","v":{"$error":"#N/A"}},{"$f":"VLOOKUP(B222,'A partager'!$A$6:$A$738,1,0)","v":{"$error":"#N/A"}},{"$f":"VLOOKUP(A222,'A porter seul'!$A$6:$C$679,3,0)","v":{"$error":"#N/A"}}]
["A porter seul_212","A partager_212",212,{"$f":"VLOOKUP(A223,'A porter seul'!$A$6:$A$679,1,0)","v":{"$error":"#N/A"}},{"$f":"VLOOKUP(B223,'A partager'!$A$6:$A$738,1,0)","v":{"$error":"#N/A"}},{"$f":"VLOOKUP(A223,'A porter seul'!$A$6:$C$679,3,0)","v":{"$error":"#N/A"}}]
["A porter seul_213","A partager_213",213,{"$f":"VLOOKUP(A224,'A porter seul'!$A$6:$A$679,1,0)","v":{"$error":"#N/A"}},{"$f":"VLOOKUP(B224,'A partager'!$A$6:$A$738,1,0)","v":{"$error":"#N/A"}},{"$f":"VLOOKUP(A224,'A porter seul'!$A$6:$C$679,3,0)","v":{"$error":"#N/A"}}]
["A porter seul_214","A partager_214",214,{"$f":"VLOOKUP(A225,'A porter seul'!$A$6:$A$679,1,0)","v":{"$error":"#N/A"}},{"$f":"VLOOKUP(B225,'A partager'!$A$6:$A$738,1,0)","v":{"$error":"#N/A"}},{"$f":"VLOOKUP(A225,'A porter seul'!$A$6:$C$679,3,0)","v":{"$error":"#N/A"}}]
["A porter seul_215","A partager_215",215,{"$f":"VLOOKUP(A226,'A porter seul'!$A$6:$A$679,1,0)","v":{"$error":"#N/A"}},{"$f":"VLOOKUP(B226,'A partager'!$A$6:$A$738,1,0)","v":{"$error":"#N/A"}},{"$f":"VLOOKUP(A226,'A porter seul'!$A$6:$C$679,3,0)","v":{"$error":"#N/A"}}]
["A porter seul_216","A partager_216",216,{"$f":"VLOOKUP(A227,'A porter seul'!$A$6:$A$679,1,0)","v":{"$error":"#N/A"}},{"$f":"VLOOKUP(B227,'A partager'!$A$6:$A$738,1,0)","v":{"$error":"#N/A"}},{"$f":"VLOOKUP(A227,'A porter seul'!$A$6:$C$679,3,0)","v":{"$error":"#N/A"}}]
["A porter seul_217","A partager_217",217,{"$f":"VLOOKUP(A228,'A porter seul'!$A$6:$A$679,1,0)","v":{"$error":"#N/A"}},{"$f":"VLOOKUP(B228,'A partager'!$A$6:$A$738,1,0)","v":{"$error":"#N/A"}},{"$f":"VLOOKUP(A228,'A porter seul'!$A$6:$C$679,3,0)","v":{"$error":"#N/A"}}]
["A porter seul_218","A partager_218",218,{"$f":"VLOOKUP(A229,'A porter seul'!$A$6:$A$679,1,0)","v":{"$error":"#N/A"}},{"$f":"VLOOKUP(B229,'A partager'!$A$6:$A$738,1,0)","v":{"$error":"#N/A"}},{"$f":"VLOOKUP(A229,'A porter seul'!$A$6:$C$679,3,0)","v":{"$error":"#N/A"}}]
["A porter seul_219","A partager_219",219,{"$f":"VLOOKUP(A230,'A porter seul'!$A$6:$A$679,1,0)","v":{"$error":"#N/A"}},{"$f":"VLOOKUP(B230,'A partager'!$A$6:$A$738,1,0)","v":{"$error":"#N/A"}},{"$f":"VLOOKUP(A230,'A porter seul'!$A$6:$C$679,3,0)","v":{"$error":"#N/A"}}]
["A porter seul_220","A partager_220",220,{"$f":"VLOOKUP(A231,'A porter seul'!$A$6:$A$679,1,0)","v":{"$error":"#N/A"}},{"$f":"VLOOKUP(B231,'A partager'!$A$6:$A$738,1,0)","v":{"$error":"#N/A"}},{"$f":"VLOOKUP(A231,'A porter seul'!$A$6:$C$679,3,0)","v":{"$error":"#N/A"}}]
["A porter seul_221","A partager_221",221,{"$f":"VLOOKUP(A232,'A porter seul'!$A$6:$A$679,1,0)","v":{"$error":"#N/A"}},{"$f":"VLOOKUP(B232,'A partager'!$A$6:$A$738,1,0)","v":{"$error":"#N/A"}},{"$f":"VLOOKUP(A232,'A porter seul'!$A$6:$C$679,3,0)","v":{"$error":"#N/A"}}]
["A porter seul_222","A partager_222",222,{"$f":"VLOOKUP(A233,'A porter seul'!$A$6:$A$679,1,0)","v":{"$error":"#N/A"}},{"$f":"VLOOKUP(B233,'A partager'!$A$6:$A$738,1,0)","v":{"$error":"#N/A"}},{"$f":"VLOOKUP(A233,'A porter seul'!$A$6:$C$679,3,0)","v":{"$error":"#N/A"}}]
["A porter seul_223","A partager_223",223,{"$f":"VLOOKUP(A234,'A porter seul'!$A$6:$A$679,1,0)","v":{"$error":"#N/A"}},{"$f":"VLOOKUP(B234,'A partager'!$A$6:$A$738,1,0)","v":{"$error":"#N/A"}},{"$f":"VLOOKUP(A234,'A porter seul'!$A$6:$C$679,3,0)","v":{"$error":"#N/A"}}]
["A porter seul_224","A partager_224",224,{"$f":"VLOOKUP(A235,'A porter seul'!$A$6:$A$679,1,0)","v":{"$error":"#N/A"}},{"$f":"VLOOKUP(B235,'A partager'!$A$6:$A$738,1,0)","v":{"$error":"#N/A"}},{"$f":"VLOOKUP(A235,'A porter seul'!$A$6:$C$679,3,0)","v":{"$error":"#N/A"}}]
["A porter seul_225","A partager_225",225,{"$f":"VLOOKUP(A236,'A porter seul'!$A$6:$A$679,1,0)","v":{"$error":"#N/A"}},{"$f":"VLOOKUP(B236,'A partager'!$A$6:$A$738,1,0)","v":{"$error":"#N/A"}},{"$f":"VLOOKUP(A236,'A porter seul'!$A$6:$C$679,3,0)","v":{"$error":"#N/A"}}]
["A porter seul_226","A partager_226",226,{"$f":"VLOOKUP(A237,'A porter seul'!$A$6:$A$679,1,0)","v":{"$error":"#N/A"}},{"$f":"VLOOKUP(B237,'A partager'!$A$6:$A$738,1,0)","v":{"$error":"#N/A"}},{"$f":"VLOOKUP(A237,'A porter seul'!$A$6:$C$679,3,0)","v":{"$error":"#N/A"}}]
["A porter seul_227","A partager_227",227,{"$f":"VLOOKUP(A238,'A porter seul'!$A$6:$A$679,1,0)","v":{"$error":"#N/A"}},{"$f":"VLOOKUP(B238,'A partager'!$A$6:$A$738,1,0)","v":{"$error":"#N/A"}},{"$f":"VLOOKUP(A238,'A porter seul'!$A$6:$C$679,3,0)","v":{"$error":"#N/A"}}]
["A porter seul_228","A partager_228",228,{"$f":"VLOOKUP(A239,'A porter seul'!$A$6:$A$679,1,0)","v":{"$error":"#N/A"}},{"$f":"VLOOKUP(B239,'A partager'!$A$6:$A$738,1,0)","v":{"$error":"#N/A"}},{"$f":"VLOOKUP(A239,'A porter seul'!$A$6:$C$679,3,0)","v":{"$error":"#N/A"}}]
["A porter seul_229","A partager_229",229,{"$f":"VLOOKUP(A240,'A porter seul'!$A$6:$A$679,1,0)","v":{"$error":"#N/A"}},{"$f":"VLOOKUP(B240,'A partager'!$A$6:$A$738,1,0)","v":{"$error":"#N/A"}},{"$f":"VLOOKUP(A240,'A porter seul'!$A$6:$C$679,3,0)","v":{"$error":"#N/A"}}]
["A porter seul_230","A partager_230",230,{"$f":"VLOOKUP(A241,'A porter seul'!$A$6:$A$679,1,0)","v":{"$error":"#N/A"}},{"$f":"VLOOKUP(B241,'A partager'!$A$6:$A$738,1,0)","v":{"$error":"#N/A"}},{"$f":"VLOOKUP(A241,'A porter seul'!$A$6:$C$679,3,0)","v":{"$error":"#N/A"}}]
["A porter seul_231","A partager_231",231,{"$f":"VLOOKUP(A242,'A porter seul'!$A$6:$A$679,1,0)","v":{"$error":"#N/A"}},{"$f":"VLOOKUP(B242,'A partager'!$A$6:$A$738,1,0)","v":{"$error":"#N/A"}},{"$f":"VLOOKUP(A242,'A porter seul'!$A$6:$C$679,3,0)","v":{"$error":"#N/A"}}]
["A porter seul_232","A partager_232",232,{"$f":"VLOOKUP(A243,'A porter seul'!$A$6:$A$679,1,0)","v":{"$error":"#N/A"}},{"$f":"VLOOKUP(B243,'A partager'!$A$6:$A$738,1,0)","v":{"$error":"#N/A"}},{"$f":"VLOOKUP(A243,'A porter seul'!$A$6:$C$679,3,0)","v":{"$error":"#N/A"}}]
["A porter seul_233","A partager_233",233,{"$f":"VLOOKUP(A244,'A porter seul'!$A$6:$A$679,1,0)","v":{"$error":"#N/A"}},{"$f":"VLOOKUP(B244,'A partager'!$A$6:$A$738,1,0)","v":{"$error":"#N/A"}},{"$f":"VLOOKUP(A244,'A porter seul'!$A$6:$C$679,3,0)","v":{"$error":"#N/A"}}]
["A porter seul_234","A partager_234",234,{"$f":"VLOOKUP(A245,'A porter seul'!$A$6:$A$679,1,0)","v":{"$error":"#N/A"}},{"$f":"VLOOKUP(B245,'A partager'!$A$6:$A$738,1,0)","v":{"$error":"#N/A"}},{"$f":"VLOOKUP(A245,'A porter seul'!$A$6:$C$679,3,0)","v":{"$error":"#N/A"}}]
["A porter seul_235","A partager_235",235,{"$f":"VLOOKUP(A246,'A porter seul'!$A$6:$A$679,1,0)","v":{"$error":"#N/A"}},{"$f":"VLOOKUP(B246,'A partager'!$A$6:$A$738,1,0)","v":{"$error":"#N/A"}},{"$f":"VLOOKUP(A246,'A porter seul'!$A$6:$C$679,3,0)","v":{"$error":"#N/A"}}]
["A porter seul_236","A partager_236",236,{"$f":"VLOOKUP(A247,'A porter seul'!$A$6:$A$679,1,0)","v":{"$error":"#N/A"}},{"$f":"VLOOKUP(B247,'A partager'!$A$6:$A$738,1,0)","v":{"$error":"#N/A"}},{"$f":"VLOOKUP(A247,'A porter seul'!$A$6:$C$679,3,0)","v":{"$error":"#N/A"}}]
["A porter seul_237","A partager_237",237,{"$f":"VLOOKUP(A248,'A porter seul'!$A$6:$A$679,1,0)","v":{"$error":"#N/A"}},{"$f":"VLOOKUP(B248,'A partager'!$A$6:$A$738,1,0)","v":{"$error":"#N/A"}},{"$f":"VLOOKUP(A248,'A porter seul'!$A$6:$C$679,3,0)","v":{"$error":"#N/A"}}]
["A porter seul_238","A partager_238",238,{"$f":"VLOOKUP(A249,'A porter seul'!$A$6:$A$679,1,0)","v":{"$error":"#N/A"}},{"$f":"VLOOKUP(B249,'A partager'!$A$6:$A$738,1,0)","v":{"$error":"#N/A"}},{"$f":"VLOOKUP(A249,'A porter seul'!$A$6:$C$679,3,0)","v":{"$error":"#N/A"}}]
["A porter seul_239","A partager_239",239,{"$f":"VLOOKUP(A250,'A porter seul'!$A$6:$A$679,1,0)","v":{"$error":"#N/A"}},{"$f":"VLOOKUP(B250,'A partager'!$A$6:$A$738,1,0)","v":{"$error":"#N/A"}},{"$f":"VLOOKUP(A250,'A porter seul'!$A$6:$C$679,3,0)","v":{"$error":"#N/A"}}]
["A porter seul_240","A partager_240",240,{"$f":"VLOOKUP(A251,'A porter seul'!$A$6:$A$679,1,0)","v":{"$error":"#N/A"}},{"$f":"VLOOKUP(B251,'A partager'!$A$6:$A$738,1,0)","v":{"$error":"#N/A"}},{"$f":"VLOOKUP(A251,'A porter seul'!$A$6:$C$679,3,0)","v":{"$error":"#N/A"}}]
["A porter seul_241","A partager_241",241,{"$f":"VLOOKUP(A252,'A porter seul'!$A$6:$A$679,1,0)","v":{"$error":"#N/A"}},{"$f":"VLOOKUP(B252,'A partager'!$A$6:$A$738,1,0)","v":{"$error":"#N/A"}},{"$f":"VLOOKUP(A252,'A porter seul'!$A$6:$C$679,3,0)","v":{"$error":"#N/A"}}]
["A porter seul_242","A partager_242",242,{"$f":"VLOOKUP(A253,'A porter seul'!$A$6:$A$679,1,0)","v":{"$error":"#N/A"}},{"$f":"VLOOKUP(B253,'A partager'!$A$6:$A$738,1,0)","v":{"$error":"#N/A"}},{"$f":"VLOOKUP(A253,'A porter seul'!$A$6:$C$679,3,0)","v":{"$error":"#N/A"}}]
["A porter seul_243","A partager_243",243,{"$f":"VLOOKUP(A254,'A porter seul'!$A$6:$A$679,1,0)","v":{"$error":"#N/A"}},{"$f":"VLOOKUP(B254,'A partager'!$A$6:$A$738,1,0)","v":{"$error":"#N/A"}},{"$f":"VLOOKUP(A254,'A porter seul'!$A$6:$C$679,3,0)","v":{"$error":"#N/A"}}]
["A porter seul_244","A partager_244",244,{"$f":"VLOOKUP(A255,'A porter seul'!$A$6:$A$679,1,0)","v":{"$error":"#N/A"}},{"$f":"VLOOKUP(B255,'A partager'!$A$6:$A$738,1,0)","v":{"$error":"#N/A"}},{"$f":"VLOOKUP(A255,'A porter seul'!$A$6:$C$679,3,0)","v":{"$error":"#N/A"}}]
["A porter seul_245","A partager_245",245,{"$f":"VLOOKUP(A256,'A porter seul'!$A$6:$A$679,1,0)","v":{"$error":"#N/A"}},{"$f":"VLOOKUP(B256,'A partager'!$A$6:$A$738,1,0)","v":{"$error":"#N/A"}},{"$f":"VLOOKUP(A256,'A porter seul'!$A$6:$C$679,3,0)","v":{"$error":"#N/A"}}]
["A porter seul_246","A partager_246",246,{"$f":"VLOOKUP(A257,'A porter seul'!$A$6:$A$679,1,0)","v":{"$error":"#N/A"}},{"$f":"VLOOKUP(B257,'A partager'!$A$6:$A$738,1,0)","v":{"$error":"#N/A"}},{"$f":"VLOOKUP(A257,'A porter seul'!$A$6:$C$679,3,0)","v":{"$error":"#N/A"}}]
["A porter seul_247","A partager_247",247,{"$f":"VLOOKUP(A258,'A porter seul'!$A$6:$A$679,1,0)","v":{"$error":"#N/A"}},{"$f":"VLOOKUP(B258,'A partager'!$A$6:$A$738,1,0)","v":{"$error":"#N/A"}},{"$f":"VLOOKUP(A258,'A porter seul'!$A$6:$C$679,3,0)","v":{"$error":"#N/A"}}]
["A porter seul_248","A partager_248",248,{"$f":"VLOOKUP(A259,'A porter seul'!$A$6:$A$679,1,0)","v":{"$error":"#N/A"}},{"$f":"VLOOKUP(B259,'A partager'!$A$6:$A$738,1,0)","v":{"$error":"#N/A"}},{"$f":"VLOOKUP(A259,'A porter seul'!$A$6:$C$679,3,0)","v":{"$error":"#N/A"}}]
["A porter seul_249","A partager_249",249,{"$f":"VLOOKUP(A260,'A porter seul'!$A$6:$A$679,1,0)","v":{"$error":"#N/A"}},{"$f":"VLOOKUP(B260,'A partager'!$A$6:$A$738,1,0)","v":{"$error":"#N/A"}},{"$f":"VLOOKUP(A260,'A porter seul'!$A$6:$C$679,3,0)","v":{"$error":"#N/A"}}]
["A porter seul_250","A partager_250",250,{"$f":"VLOOKUP(A261,'A porter seul'!$A$6:$A$679,1,0)","v":{"$error":"#N/A"}},{"$f":"VLOOKUP(B261,'A partager'!$A$6:$A$738,1,0)","v":{"$error":"#N/A"}},{"$f":"VLOOKUP(A261,'A porter seul'!$A$6:$C$679,3,0)","v":{"$error":"#N/A"}}]
["A porter seul_251","A partager_251",251,{"$f":"VLOOKUP(A262,'A porter seul'!$A$6:$A$679,1,0)","v":{"$error":"#N/A"}},{"$f":"VLOOKUP(B262,'A partager'!$A$6:$A$738,1,0)","v":{"$error":"#N/A"}},{"$f":"VLOOKUP(A262,'A porter seul'!$A$6:$C$679,3,0)","v":{"$error":"#N/A"}}]
["A porter seul_252","A partager_252",252,{"$f":"VLOOKUP(A263,'A porter seul'!$A$6:$A$679,1,0)","v":{"$error":"#N/A"}},{"$f":"VLOOKUP(B263,'A partager'!$A$6:$A$738,1,0)","v":{"$error":"#N/A"}},{"$f":"VLOOKUP(A263,'A porter seul'!$A$6:$C$679,3,0)","v":{"$error":"#N/A"}}]
["A porter seul_253","A partager_253",253,{"$f":"VLOOKUP(A264,'A porter seul'!$A$6:$A$679,1,0)","v":{"$error":"#N/A"}},{"$f":"VLOOKUP(B264,'A partager'!$A$6:$A$738,1,0)","v":{"$error":"#N/A"}},{"$f":"VLOOKUP(A264,'A porter seul'!$A$6:$C$679,3,0)","v":{"$error":"#N/A"}}]
["A porter seul_254","A partager_254",254,{"$f":"VLOOKUP(A265,'A porter seul'!$A$6:$A$679,1,0)","v":{"$error":"#N/A"}},{"$f":"VLOOKUP(B265,'A partager'!$A$6:$A$738,1,0)","v":{"$error":"#N/A"}},{"$f":"VLOOKUP(A265,'A porter seul'!$A$6:$C$679,3,0)","v":{"$error":"#N/A"}}]
["A porter seul_255","A partager_255",255,{"$f":"VLOOKUP(A266,'A porter seul'!$A$6:$A$679,1,0)","v":{"$error":"#N/A"}},{"$f":"VLOOKUP(B266,'A partager'!$A$6:$A$738,1,0)","v":{"$error":"#N/A"}},{"$f":"VLOOKUP(A266,'A porter seul'!$A$6:$C$679,3,0)","v":{"$error":"#N/A"}}]
["A porter seul_256","A partager_256",256,{"$f":"VLOOKUP(A267,'A porter seul'!$A$6:$A$679,1,0)","v":{"$error":"#N/A"}},{"$f":"VLOOKUP(B267,'A partager'!$A$6:$A$738,1,0)","v":{"$error":"#N/A"}},{"$f":"VLOOKUP(A267,'A porter seul'!$A$6:$C$679,3,0)","v":{"$error":"#N/A"}}]
["A porter seul_257","A partager_257",257,{"$f":"VLOOKUP(A268,'A porter seul'!$A$6:$A$679,1,0)","v":{"$error":"#N/A"}},{"$f":"VLOOKUP(B268,'A partager'!$A$6:$A$738,1,0)","v":{"$error":"#N/A"}},{"$f":"VLOOKUP(A268,'A porter seul'!$A$6:$C$679,3,0)","v":{"$error":"#N/A"}}]
[{"$f":"\"A porter seul_\"&C269","v":"A porter seul_258"},{"$f":"\"A partager_\"&C269","v":"A partager_258"},258,{"$f":"VLOOKUP(A269,'A porter seul'!$A$6:$A$679,1,0)","v":{"$error":"#N/A"}},{"$f":"VLOOKUP(B269,'A partager'!$A$6:$A$738,1,0)","v":{"$error":"#N/A"}},{"$f":"VLOOKUP(A269,'A porter seul'!$A$6:$C$679,3,0)","v":{"$error":"#N/A"}}]
["A porter seul_259","A partager_259",259,{"$f":"VLOOKUP(A270,'A porter seul'!$A$6:$A$679,1,0)","v":{"$error":"#N/A"}},{"$f":"VLOOKUP(B270,'A partager'!$A$6:$A$738,1,0)","v":{"$error":"#N/A"}},{"$f":"VLOOKUP(A270,'A porter seul'!$A$6:$C$679,3,0)","v":{"$error":"#N/A"}}]
["A porter seul_260","A partager_260",260,{"$f":"VLOOKUP(A271,'A porter seul'!$A$6:$A$679,1,0)","v":{"$error":"#N/A"}},{"$f":"VLOOKUP(B271,'A partager'!$A$6:$A$738,1,0)","v":{"$error":"#N/A"}},{"$f":"VLOOKUP(A271,'A porter seul'!$A$6:$C$679,3,0)","v":{"$error":"#N/A"}}]
["A porter seul_261","A partager_261",261,{"$f":"VLOOKUP(A272,'A porter seul'!$A$6:$A$679,1,0)","v":{"$error":"#N/A"}},{"$f":"VLOOKUP(B272,'A partager'!$A$6:$A$738,1,0)","v":{"$error":"#N/A"}},{"$f":"VLOOKUP(A272,'A porter seul'!$A$6:$C$679,3,0)","v":{"$error":"#N/A"}}]
["A porter seul_262","A partager_262",262,{"$f":"VLOOKUP(A273,'A porter seul'!$A$6:$A$679,1,0)","v":{"$error":"#N/A"}},{"$f":"VLOOKUP(B273,'A partager'!$A$6:$A$738,1,0)","v":{"$error":"#N/A"}},{"$f":"VLOOKUP(A273,'A porter seul'!$A$6:$C$679,3,0)","v":{"$error":"#N/A"}}]
["A porter seul_263","A partager_263",263,{"$f":"VLOOKUP(A274,'A porter seul'!$A$6:$A$679,1,0)","v":{"$error":"#N/A"}},{"$f":"VLOOKUP(B274,'A partager'!$A$6:$A$738,1,0)","v":{"$error":"#N/A"}},{"$f":"VLOOKUP(A274,'A porter seul'!$A$6:$C$679,3,0)","v":{"$error":"#N/A"}}]
["A porter seul_264","A partager_264",264,{"$f":"VLOOKUP(A275,'A porter seul'!$A$6:$A$679,1,0)","v":{"$error":"#N/A"}},{"$f":"VLOOKUP(B275,'A partager'!$A$6:$A$738,1,0)","v":{"$error":"#N/A"}},{"$f":"VLOOKUP(A275,'A porter seul'!$A$6:$C$679,3,0)","v":{"$error":"#N/A"}}]
["A porter seul_265","A partager_265",265,{"$f":"VLOOKUP(A276,'A porter seul'!$A$6:$A$679,1,0)","v":{"$error":"#N/A"}},{"$f":"VLOOKUP(B276,'A partager'!$A$6:$A$738,1,0)","v":{"$error":"#N/A"}},{"$f":"VLOOKUP(A276,'A porter seul'!$A$6:$C$679,3,0)","v":{"$error":"#N/A"}}]
["A porter seul_266","A partager_266",266,{"$f":"VLOOKUP(A277,'A porter seul'!$A$6:$A$679,1,0)","v":{"$error":"#N/A"}},{"$f":"VLOOKUP(B277,'A partager'!$A$6:$A$738,1,0)","v":{"$error":"#N/A"}},{"$f":"VLOOKUP(A277,'A porter seul'!$A$6:$C$679,3,0)","v":{"$error":"#N/A"}}]
["A porter seul_267","A partager_267",267,{"$f":"VLOOKUP(A278,'A porter seul'!$A$6:$A$679,1,0)","v":{"$error":"#N/A"}},{"$f":"VLOOKUP(B278,'A partager'!$A$6:$A$738,1,0)","v":{"$error":"#N/A"}},{"$f":"VLOOKUP(A278,'A porter seul'!$A$6:$C$679,3,0)","v":{"$error":"#N/A"}}]
["A porter seul_268","A partager_268",268,{"$f":"VLOOKUP(A279,'A porter seul'!$A$6:$A$679,1,0)","v":{"$error":"#N/A"}},{"$f":"VLOOKUP(B279,'A partager'!$A$6:$A$738,1,0)","v":{"$error":"#N/A"}},{"$f":"VLOOKUP(A279,'A porter seul'!$A$6:$C$679,3,0)","v":{"$error":"#N/A"}}]
["A porter seul_269","A partager_269",269,{"$f":"VLOOKUP(A280,'A porter seul'!$A$6:$A$679,1,0)","v":{"$error":"#N/A"}},{"$f":"VLOOKUP(B280,'A partager'!$A$6:$A$738,1,0)","v":{"$error":"#N/A"}},{"$f":"VLOOKUP(A280,'A porter seul'!$A$6:$C$679,3,0)","v":{"$error":"#N/A"}}]
["A porter seul_270","A partager_270",270,{"$f":"VLOOKUP(A281,'A porter seul'!$A$6:$A$679,1,0)","v":{"$error":"#N/A"}},{"$f":"VLOOKUP(B281,'A partager'!$A$6:$A$738,1,0)","v":{"$error":"#N/A"}},{"$f":"VLOOKUP(A281,'A porter seul'!$A$6:$C$679,3,0)","v":{"$error":"#N/A"}}]
["A porter seul_271","A partager_271",271,{"$f":"VLOOKUP(A282,'A porter seul'!$A$6:$A$679,1,0)","v":{"$error":"#N/A"}},{"$f":"VLOOKUP(B282,'A partager'!$A$6:$A$738,1,0)","v":{"$error":"#N/A"}},{"$f":"VLOOKUP(A282,'A porter seul'!$A$6:$C$679,3,0)","v":{"$error":"#N/A"}}]
["A porter seul_272","A partager_272",272,{"$f":"VLOOKUP(A283,'A porter seul'!$A$6:$A$679,1,0)","v":{"$error":"#N/A"}},{"$f":"VLOOKUP(B283,'A partager'!$A$6:$A$738,1,0)","v":{"$error":"#N/A"}},{"$f":"VLOOKUP(A283,'A porter seul'!$A$6:$C$679,3,0)","v":{"$error":"#N/A"}}]
["A porter seul_273","A partager_273",273,{"$f":"VLOOKUP(A284,'A porter seul'!$A$6:$A$679,1,0)","v":{"$error":"#N/A"}},{"$f":"VLOOKUP(B284,'A partager'!$A$6:$A$738,1,0)","v":{"$error":"#N/A"}},{"$f":"VLOOKUP(A284,'A porter seul'!$A$6:$C$679,3,0)","v":{"$error":"#N/A"}}]
["A porter seul_274","A partager_274",274,{"$f":"VLOOKUP(A285,'A porter seul'!$A$6:$A$679,1,0)","v":{"$error":"#N/A"}},{"$f":"VLOOKUP(B285,'A partager'!$A$6:$A$738,1,0)","v":{"$error":"#N/A"}},{"$f":"VLOOKUP(A285,'A porter seul'!$A$6:$C$679,3,0)","v":{"$error":"#N/A"}}]
["A porter seul_275","A partager_275",275,{"$f":"VLOOKUP(A286,'A porter seul'!$A$6:$A$679,1,0)","v":{"$error":"#N/A"}},{"$f":"VLOOKUP(B286,'A partager'!$A$6:$A$738,1,0)","v":{"$error":"#N/A"}},{"$f":"VLOOKUP(A286,'A porter seul'!$A$6:$C$679,3,0)","v":{"$error":"#N/A"}}]
["A porter seul_276","A partager_276",276,{"$f":"VLOOKUP(A287,'A porter seul'!$A$6:$A$679,1,0)","v":{"$error":"#N/A"}},{"$f":"VLOOKUP(B287,'A partager'!$A$6:$A$738,1,0)","v":{"$error":"#N/A"}},{"$f":"VLOOKUP(A287,'A porter seul'!$A$6:$C$679,3,0)","v":{"$error":"#N/A"}}]
["A porter seul_277","A partager_277",277,{"$f":"VLOOKUP(A288,'A porter seul'!$A$6:$A$679,1,0)","v":{"$error":"#N/A"}},{"$f":"VLOOKUP(B288,'A partager'!$A$6:$A$738,1,0)","v":{"$error":"#N/A"}},{"$f":"VLOOKUP(A288,'A porter seul'!$A$6:$C$679,3,0)","v":{"$error":"#N/A"}}]
["A porter seul_278","A partager_278",278,{"$f":"VLOOKUP(A289,'A porter seul'!$A$6:$A$679,1,0)","v":{"$error":"#N/A"}},{"$f":"VLOOKUP(B289,'A partager'!$A$6:$A$738,1,0)","v":{"$error":"#N/A"}},{"$f":"VLOOKUP(A289,'A porter seul'!$A$6:$C$679,3,0)","v":{"$error":"#N/A"}}]
["A porter seul_279","A partager_279",279,{"$f":"VLOOKUP(A290,'A porter seul'!$A$6:$A$679,1,0)","v":{"$error":"#N/A"}},{"$f":"VLOOKUP(B290,'A partager'!$A$6:$A$738,1,0)","v":{"$error":"#N/A"}},{"$f":"VLOOKUP(A290,'A porter seul'!$A$6:$C$679,3,0)","v":{"$error":"#N/A"}}]
["A porter seul_280","A partager_280",280,{"$f":"VLOOKUP(A291,'A porter seul'!$A$6:$A$679,1,0)","v":{"$error":"#N/A"}},{"$f":"VLOOKUP(B291,'A partager'!$A$6:$A$738,1,0)","v":{"$error":"#N/A"}},{"$f":"VLOOKUP(A291,'A porter seul'!$A$6:$C$679,3,0)","v":{"$error":"#N/A"}}]
["A porter seul_281","A partager_281",281,{"$f":"VLOOKUP(A292,'A porter seul'!$A$6:$A$679,1,0)","v":{"$error":"#N/A"}},{"$f":"VLOOKUP(B292,'A partager'!$A$6:$A$738,1,0)","v":{"$error":"#N/A"}},{"$f":"VLOOKUP(A292,'A porter seul'!$A$6:$C$679,3,0)","v":{"$error":"#N/A"}}]
["A porter seul_282","A partager_282",282,{"$f":"VLOOKUP(A293,'A porter seul'!$A$6:$A$679,1,0)","v":{"$error":"#N/A"}},{"$f":"VLOOKUP(B293,'A partager'!$A$6:$A$738,1,0)","v":{"$error":"#N/A"}},{"$f":"VLOOKUP(A293,'A porter seul'!$A$6:$C$679,3,0)","v":{"$error":"#N/A"}}]
["A porter seul_283","A partager_283",283,{"$f":"VLOOKUP(A294,'A porter seul'!$A$6:$A$679,1,0)","v":{"$error":"#N/A"}},{"$f":"VLOOKUP(B294,'A partager'!$A$6:$A$738,1,0)","v":{"$error":"#N/A"}},{"$f":"VLOOKUP(A294,'A porter seul'!$A$6:$C$679,3,0)","v":{"$error":"#N/A"}}]
["A porter seul_284","A partager_284",284,{"$f":"VLOOKUP(A295,'A porter seul'!$A$6:$A$679,1,0)","v":{"$error":"#N/A"}},{"$f":"VLOOKUP(B295,'A partager'!$A$6:$A$738,1,0)","v":{"$error":"#N/A"}},{"$f":"VLOOKUP(A295,'A porter seul'!$A$6:$C$679,3,0)","v":{"$error":"#N/A"}}]
["A porter seul_285","A partager_285",285,{"$f":"VLOOKUP(A296,'A porter seul'!$A$6:$A$679,1,0)","v":{"$error":"#N/A"}},{"$f":"VLOOKUP(B296,'A partager'!$A$6:$A$738,1,0)","v":{"$error":"#N/A"}},{"$f":"VLOOKUP(A296,'A porter seul'!$A$6:$C$679,3,0)","v":{"$error":"#N/A"}}]
["A porter seul_286","A partager_286",286,{"$f":"VLOOKUP(A297,'A porter seul'!$A$6:$A$679,1,0)","v":{"$error":"#N/A"}},{"$f":"VLOOKUP(B297,'A partager'!$A$6:$A$738,1,0)","v":{"$error":"#N/A"}},{"$f":"VLOOKUP(A297,'A porter seul'!$A$6:$C$679,3,0)","v":{"$error":"#N/A"}}]
["A porter seul_287","A partager_287",287,{"$f":"VLOOKUP(A298,'A porter seul'!$A$6:$A$679,1,0)","v":{"$error":"#N/A"}},{"$f":"VLOOKUP(B298,'A partager'!$A$6:$A$738,1,0)","v":{"$error":"#N/A"}},{"$f":"VLOOKUP(A298,'A porter seul'!$A$6:$C$679,3,0)","v":{"$error":"#N/A"}}]
["A porter seul_288","A partager_288",288,{"$f":"VLOOKUP(A299,'A porter seul'!$A$6:$A$679,1,0)","v":{"$error":"#N/A"}},{"$f":"VLOOKUP(B299,'A partager'!$A$6:$A$738,1,0)","v":{"$error":"#N/A"}},{"$f":"VLOOKUP(A299,'A porter seul'!$A$6:$C$679,3,0)","v":{"$error":"#N/A"}}]
["A porter seul_289","A partager_289",289,{"$f":"VLOOKUP(A300,'A porter seul'!$A$6:$A$679,1,0)","v":{"$error":"#N/A"}},{"$f":"VLOOKUP(B300,'A partager'!$A$6:$A$738,1,0)","v":{"$error":"#N/A"}},{"$f":"VLOOKUP(A300,'A porter seul'!$A$6:$C$679,3,0)","v":{"$error":"#N/A"}}]
["A porter seul_290","A partager_290",290,{"$f":"VLOOKUP(A301,'A porter seul'!$A$6:$A$679,1,0)","v":{"$error":"#N/A"}},{"$f":"VLOOKUP(B301,'A partager'!$A$6:$A$738,1,0)","v":{"$error":"#N/A"}},{"$f":"VLOOKUP(A301,'A porter seul'!$A$6:$C$679,3,0)","v":{"$error":"#N/A"}}]
["A porter seul_291","A partager_291",291,{"$f":"VLOOKUP(A302,'A porter seul'!$A$6:$A$679,1,0)","v":{"$error":"#N/A"}},{"$f":"VLOOKUP(B302,'A partager'!$A$6:$A$738,1,0)","v":{"$error":"#N/A"}},{"$f":"VLOOKUP(A302,'A porter seul'!$A$6:$C$679,3,0)","v":{"$error":"#N/A"}}]
["A porter seul_292","A partager_292",292,{"$f":"VLOOKUP(A303,'A porter seul'!$A$6:$A$679,1,0)","v":{"$error":"#N/A"}},{"$f":"VLOOKUP(B303,'A partager'!$A$6:$A$738,1,0)","v":{"$error":"#N/A"}},{"$f":"VLOOKUP(A303,'A porter seul'!$A$6:$C$679,3,0)","v":{"$error":"#N/A"}}]
["A porter seul_293","A partager_293",293,{"$f":"VLOOKUP(A304,'A porter seul'!$A$6:$A$679,1,0)","v":{"$error":"#N/A"}},{"$f":"VLOOKUP(B304,'A partager'!$A$6:$A$738,1,0)","v":{"$error":"#N/A"}},{"$f":"VLOOKUP(A304,'A porter seul'!$A$6:$C$679,3,0)","v":{"$error":"#N/A"}}]
["A porter seul_294","A partager_294",294,{"$f":"VLOOKUP(A305,'A porter seul'!$A$6:$A$679,1,0)","v":{"$error":"#N/A"}},{"$f":"VLOOKUP(B305,'A partager'!$A$6:$A$738,1,0)","v":{"$error":"#N/A"}},{"$f":"VLOOKUP(A305,'A porter seul'!$A$6:$C$679,3,0)","v":{"$error":"#N/A"}}]
["A porter seul_295","A partager_295",295,{"$f":"VLOOKUP(A306,'A porter seul'!$A$6:$A$679,1,0)","v":{"$error":"#N/A"}},{"$f":"VLOOKUP(B306,'A partager'!$A$6:$A$738,1,0)","v":{"$error":"#N/A"}},{"$f":"VLOOKUP(A306,'A porter seul'!$A$6:$C$679,3,0)","v":{"$error":"#N/A"}}]
["A porter seul_296","A partager_296",296,{"$f":"VLOOKUP(A307,'A porter seul'!$A$6:$A$679,1,0)","v":{"$error":"#N/A"}},{"$f":"VLOOKUP(B307,'A partager'!$A$6:$A$738,1,0)","v":{"$error":"#N/A"}},{"$f":"VLOOKUP(A307,'A porter seul'!$A$6:$C$679,3,0)","v":{"$error":"#N/A"}}]
["A porter seul_297","A partager_297",297,{"$f":"VLOOKUP(A308,'A porter seul'!$A$6:$A$679,1,0)","v":{"$error":"#N/A"}},{"$f":"VLOOKUP(B308,'A partager'!$A$6:$A$738,1,0)","v":{"$error":"#N/A"}},{"$f":"VLOOKUP(A308,'A porter seul'!$A$6:$C$679,3,0)","v":{"$error":"#N/A"}}]
["A porter seul_298","A partager_298",298,{"$f":"VLOOKUP(A309,'A porter seul'!$A$6:$A$679,1,0)","v":{"$error":"#N/A"}},{"$f":"VLOOKUP(B309,'A partager'!$A$6:$A$738,1,0)","v":{"$error":"#N/A"}},{"$f":"VLOOKUP(A309,'A porter seul'!$A$6:$C$679,3,0)","v":{"$error":"#N/A"}}]
["A porter seul_299","A partager_299",299,{"$f":"VLOOKUP(A310,'A porter seul'!$A$6:$A$679,1,0)","v":{"$error":"#N/A"}},{"$f":"VLOOKUP(B310,'A partager'!$A$6:$A$738,1,0)","v":{"$error":"#N/A"}},{"$f":"VLOOKUP(A310,'A porter seul'!$A$6:$C$679,3,0)","v":{"$error":"#N/A"}}]
["A porter seul_300","A partager_300",300,{"$f":"VLOOKUP(A311,'A porter seul'!$A$6:$A$679,1,0)","v":{"$error":"#N/A"}},{"$f":"VLOOKUP(B311,'A partager'!$A$6:$A$738,1,0)","v":{"$error":"#N/A"}},{"$f":"VLOOKUP(A311,'A porter seul'!$A$6:$C$679,3,0)","v":{"$error":"#N/A"}}]
["A porter seul_301","A partager_301",301,{"$f":"VLOOKUP(A312,'A porter seul'!$A$6:$A$679,1,0)","v":{"$error":"#N/A"}},{"$f":"VLOOKUP(B312,'A partager'!$A$6:$A$738,1,0)","v":{"$error":"#N/A"}},{"$f":"VLOOKUP(A312,'A porter seul'!$A$6:$C$679,3,0)","v":{"$error":"#N/A"}}]
["A porter seul_302","A partager_302",302,{"$f":"VLOOKUP(A313,'A porter seul'!$A$6:$A$679,1,0)","v":{"$error":"#N/A"}},{"$f":"VLOOKUP(B313,'A partager'!$A$6:$A$738,1,0)","v":{"$error":"#N/A"}},{"$f":"VLOOKUP(A313,'A porter seul'!$A$6:$C$679,3,0)","v":{"$error":"#N/A"}}]
["A porter seul_303","A partager_303",303,{"$f":"VLOOKUP(A314,'A porter seul'!$A$6:$A$679,1,0)","v":{"$error":"#N/A"}},{"$f":"VLOOKUP(B314,'A partager'!$A$6:$A$738,1,0)","v":{"$error":"#N/A"}},{"$f":"VLOOKUP(A314,'A porter seul'!$A$6:$C$679,3,0)","v":{"$error":"#N/A"}}]
["A porter seul_304","A partager_304",304,{"$f":"VLOOKUP(A315,'A porter seul'!$A$6:$A$679,1,0)","v":{"$error":"#N/A"}},{"$f":"VLOOKUP(B315,'A partager'!$A$6:$A$738,1,0)","v":{"$error":"#N/A"}},{"$f":"VLOOKUP(A315,'A porter seul'!$A$6:$C$679,3,0)","v":{"$error":"#N/A"}}]
["A porter seul_305","A partager_305",305,{"$f":"VLOOKUP(A316,'A porter seul'!$A$6:$A$679,1,0)","v":{"$error":"#N/A"}},{"$f":"VLOOKUP(B316,'A partager'!$A$6:$A$738,1,0)","v":{"$error":"#N/A"}},{"$f":"VLOOKUP(A316,'A porter seul'!$A$6:$C$679,3,0)","v":{"$error":"#N/A"}}]
["A porter seul_306","A partager_306",306,{"$f":"VLOOKUP(A317,'A porter seul'!$A$6:$A$679,1,0)","v":{"$error":"#N/A"}},{"$f":"VLOOKUP(B317,'A partager'!$A$6:$A$738,1,0)","v":{"$error":"#N/A"}},{"$f":"VLOOKUP(A317,'A porter seul'!$A$6:$C$679,3,0)","v":{"$error":"#N/A"}}]
["A porter seul_307","A partager_307",307,{"$f":"VLOOKUP(A318,'A porter seul'!$A$6:$A$679,1,0)","v":{"$error":"#N/A"}},{"$f":"VLOOKUP(B318,'A partager'!$A$6:$A$738,1,0)","v":{"$error":"#N/A"}},{"$f":"VLOOKUP(A318,'A porter seul'!$A$6:$C$679,3,0)","v":{"$error":"#N/A"}}]
["A porter seul_308","A partager_308",308,{"$f":"VLOOKUP(A319,'A porter seul'!$A$6:$A$679,1,0)","v":{"$error":"#N/A"}},{"$f":"VLOOKUP(B319,'A partager'!$A$6:$A$738,1,0)","v":{"$error":"#N/A"}},{"$f":"VLOOKUP(A319,'A porter seul'!$A$6:$C$679,3,0)","v":{"$error":"#N/A"}}]
["A porter seul_309","A partager_309",309,{"$f":"VLOOKUP(A320,'A porter seul'!$A$6:$A$679,1,0)","v":{"$error":"#N/A"}},{"$f":"VLOOKUP(B320,'A partager'!$A$6:$A$738,1,0)","v":{"$error":"#N/A"}},{"$f":"VLOOKUP(A320,'A porter seul'!$A$6:$C$679,3,0)","v":{"$error":"#N/A"}}]
["A porter seul_310","A partager_310",310,{"$f":"VLOOKUP(A321,'A porter seul'!$A$6:$A$679,1,0)","v":{"$error":"#N/A"}},{"$f":"VLOOKUP(B321,'A partager'!$A$6:$A$738,1,0)","v":{"$error":"#N/A"}},{"$f":"VLOOKUP(A321,'A porter seul'!$A$6:$C$679,3,0)","v":{"$error":"#N/A"}}]
["A porter seul_311","A partager_311",311,{"$f":"VLOOKUP(A322,'A porter seul'!$A$6:$A$679,1,0)","v":{"$error":"#N/A"}},{"$f":"VLOOKUP(B322,'A partager'!$A$6:$A$738,1,0)","v":{"$error":"#N/A"}},{"$f":"VLOOKUP(A322,'A porter seul'!$A$6:$C$679,3,0)","v":{"$error":"#N/A"}}]
["A porter seul_312","A partager_312",312,{"$f":"VLOOKUP(A323,'A porter seul'!$A$6:$A$679,1,0)","v":{"$error":"#N/A"}},{"$f":"VLOOKUP(B323,'A partager'!$A$6:$A$738,1,0)","v":{"$error":"#N/A"}},{"$f":"VLOOKUP(A323,'A porter seul'!$A$6:$C$679,3,0)","v":{"$error":"#N/A"}}]
["A porter seul_313","A partager_313",313,{"$f":"VLOOKUP(A324,'A porter seul'!$A$6:$A$679,1,0)","v":{"$error":"#N/A"}},{"$f":"VLOOKUP(B324,'A partager'!$A$6:$A$738,1,0)","v":{"$error":"#N/A"}},{"$f":"VLOOKUP(A324,'A porter seul'!$A$6:$C$679,3,0)","v":{"$error":"#N/A"}}]
["A porter seul_314","A partager_314",314,{"$f":"VLOOKUP(A325,'A porter seul'!$A$6:$A$679,1,0)","v":{"$error":"#N/A"}},{"$f":"VLOOKUP(B325,'A partager'!$A$6:$A$738,1,0)","v":{"$error":"#N/A"}},{"$f":"VLOOKUP(A325,'A porter seul'!$A$6:$C$679,3,0)","v":{"$error":"#N/A"}}]
["A porter seul_315","A partager_315",315,{"$f":"VLOOKUP(A326,'A porter seul'!$A$6:$A$679,1,0)","v":{"$error":"#N/A"}},{"$f":"VLOOKUP(B326,'A partager'!$A$6:$A$738,1,0)","v":{"$error":"#N/A"}},{"$f":"VLOOKUP(A326,'A porter seul'!$A$6:$C$679,3,0)","v":{"$error":"#N/A"}}]
["A porter seul_316","A partager_316",316,{"$f":"VLOOKUP(A327,'A porter seul'!$A$6:$A$679,1,0)","v":{"$error":"#N/A"}},{"$f":"VLOOKUP(B327,'A partager'!$A$6:$A$738,1,0)","v":{"$error":"#N/A"}},{"$f":"VLOOKUP(A327,'A porter seul'!$A$6:$C$679,3,0)","v":{"$error":"#N/A"}}]
["A porter seul_317","A partager_317",317,{"$f":"VLOOKUP(A328,'A porter seul'!$A$6:$A$679,1,0)","v":{"$error":"#N/A"}},{"$f":"VLOOKUP(B328,'A partager'!$A$6:$A$738,1,0)","v":{"$error":"#N/A"}}]
["A porter seul_318","A partager_318",318,{"$f":"VLOOKUP(A329,'A porter seul'!$A$6:$A$679,1,0)","v":{"$error":"#N/A"}},{"$f":"VLOOKUP(B329,'A partager'!$A$6:$A$738,1,0)","v":{"$error":"#N/A"}}]
["A porter seul_319","A partager_319",319,{"$f":"VLOOKUP(A330,'A porter seul'!$A$6:$A$679,1,0)","v":{"$error":"#N/A"}},{"$f":"VLOOKUP(B330,'A partager'!$A$6:$A$738,1,0)","v":{"$error":"#N/A"}}]
["A porter seul_320","A partager_320",320,{"$f":"VLOOKUP(A331,'A porter seul'!$A$6:$A$679,1,0)","v":{"$error":"#N/A"}},{"$f":"VLOOKUP(B331,'A partager'!$A$6:$A$738,1,0)","v":{"$error":"#N/A"}}]
["A porter seul_321","A partager_321",321,{"$f":"VLOOKUP(A332,'A porter seul'!$A$6:$A$679,1,0)","v":{"$error":"#N/A"}},{"$f":"VLOOKUP(B332,'A partager'!$A$6:$A$738,1,0)","v":{"$error":"#N/A"}}]
[{"$f":"\"A porter seul_\"&C333","v":"A porter seul_322"},{"$f":"\"A partager_\"&C333","v":"A partager_322"},322,{"$f":"VLOOKUP(A333,'A porter seul'!$A$6:$A$679,1,0)","v":{"$error":"#N/A"}},{"$f":"VLOOKUP(B333,'A partager'!$A$6:$A$738,1,0)","v":{"$error":"#N/A"}}]
["A porter seul_323","A partager_323",323,{"$f":"VLOOKUP(A334,'A porter seul'!$A$6:$A$679,1,0)","v":{"$error":"#N/A"}},{"$f":"VLOOKUP(B334,'A partager'!$A$6:$A$738,1,0)","v":{"$error":"#N/A"}}]
["A porter seul_324","A partager_324",324,{"$f":"VLOOKUP(A335,'A porter seul'!$A$6:$A$679,1,0)","v":{"$error":"#N/A"}},{"$f":"VLOOKUP(B335,'A partager'!$A$6:$A$738,1,0)","v":{"$error":"#N/A"}}]
["A porter seul_325","A partager_325",325,{"$f":"VLOOKUP(A336,'A porter seul'!$A$6:$A$679,1,0)","v":{"$error":"#N/A"}},{"$f":"VLOOKUP(B336,'A partager'!$A$6:$A$738,1,0)","v":{"$error":"#N/A"}}]
["A porter seul_326","A partager_326",326,{"$f":"VLOOKUP(A337,'A porter seul'!$A$6:$A$679,1,0)","v":{"$error":"#N/A"}},{"$f":"VLOOKUP(B337,'A partager'!$A$6:$A$738,1,0)","v":{"$error":"#N/A"}}]
["A porter seul_327","A partager_327",327,{"$f":"VLOOKUP(A338,'A porter seul'!$A$6:$A$679,1,0)","v":{"$error":"#N/A"}},{"$f":"VLOOKUP(B338,'A partager'!$A$6:$A$738,1,0)","v":{"$error":"#N/A"}}]
["A porter seul_328","A partager_328",328,{"$f":"VLOOKUP(A339,'A porter seul'!$A$6:$A$679,1,0)","v":{"$error":"#N/A"}},{"$f":"VLOOKUP(B339,'A partager'!$A$6:$A$738,1,0)","v":{"$error":"#N/A"}}]
["A porter seul_329","A partager_329",329,{"$f":"VLOOKUP(A340,'A porter seul'!$A$6:$A$679,1,0)","v":{"$error":"#N/A"}},{"$f":"VLOOKUP(B340,'A partager'!$A$6:$A$738,1,0)","v":{"$error":"#N/A"}}]
["A porter seul_330","A partager_330",330,{"$f":"VLOOKUP(A341,'A porter seul'!$A$6:$A$679,1,0)","v":{"$error":"#N/A"}},{"$f":"VLOOKUP(B341,'A partager'!$A$6:$A$738,1,0)","v":{"$error":"#N/A"}}]
["A porter seul_331","A partager_331",331,{"$f":"VLOOKUP(A342,'A porter seul'!$A$6:$A$679,1,0)","v":{"$error":"#N/A"}},{"$f":"VLOOKUP(B342,'A partager'!$A$6:$A$738,1,0)","v":{"$error":"#N/A"}}]
["A porter seul_332","A partager_332",332,{"$f":"VLOOKUP(A343,'A porter seul'!$A$6:$A$679,1,0)","v":{"$error":"#N/A"}},{"$f":"VLOOKUP(B343,'A partager'!$A$6:$A$738,1,0)","v":{"$error":"#N/A"}}]
["A porter seul_333","A partager_333",333,{"$f":"VLOOKUP(A344,'A porter seul'!$A$6:$A$679,1,0)","v":{"$error":"#N/A"}},{"$f":"VLOOKUP(B344,'A partager'!$A$6:$A$738,1,0)","v":{"$error":"#N/A"}}]
["A porter seul_334","A partager_334",334,{"$f":"VLOOKUP(A345,'A porter seul'!$A$6:$A$679,1,0)","v":{"$error":"#N/A"}},{"$f":"VLOOKUP(B345,'A partager'!$A$6:$A$738,1,0)","v":{"$error":"#N/A"}}]
["A porter seul_335","A partager_335",335,{"$f":"VLOOKUP(A346,'A porter seul'!$A$6:$A$679,1,0)","v":{"$error":"#N/A"}},{"$f":"VLOOKUP(B346,'A partager'!$A$6:$A$738,1,0)","v":{"$error":"#N/A"}}]
["A porter seul_336","A partager_336",336,{"$f":"VLOOKUP(A347,'A porter seul'!$A$6:$A$679,1,0)","v":{"$error":"#N/A"}},{"$f":"VLOOKUP(B347,'A partager'!$A$6:$A$738,1,0)","v":{"$error":"#N/A"}}]
["A porter seul_337","A partager_337",337,{"$f":"VLOOKUP(A348,'A porter seul'!$A$6:$A$679,1,0)","v":{"$error":"#N/A"}},{"$f":"VLOOKUP(B348,'A partager'!$A$6:$A$738,1,0)","v":{"$error":"#N/A"}}]
["A porter seul_338","A partager_338",338,{"$f":"VLOOKUP(A349,'A porter seul'!$A$6:$A$679,1,0)","v":{"$error":"#N/A"}},{"$f":"VLOOKUP(B349,'A partager'!$A$6:$A$738,1,0)","v":{"$error":"#N/A"}}]
["A porter seul_339","A partager_339",339,{"$f":"VLOOKUP(A350,'A porter seul'!$A$6:$A$679,1,0)","v":{"$error":"#N/A"}},{"$f":"VLOOKUP(B350,'A partager'!$A$6:$A$738,1,0)","v":{"$error":"#N/A"}}]
["A porter seul_340","A partager_340",340,{"$f":"VLOOKUP(A351,'A porter seul'!$A$6:$A$679,1,0)","v":{"$error":"#N/A"}},{"$f":"VLOOKUP(B351,'A partager'!$A$6:$A$738,1,0)","v":{"$error":"#N/A"}}]
["A porter seul_341","A partager_341",341,{"$f":"VLOOKUP(A352,'A porter seul'!$A$6:$A$679,1,0)","v":{"$error":"#N/A"}},{"$f":"VLOOKUP(B352,'A partager'!$A$6:$A$738,1,0)","v":{"$error":"#N/A"}}]
["A porter seul_342","A partager_342",342,{"$f":"VLOOKUP(A353,'A porter seul'!$A$6:$A$679,1,0)","v":{"$error":"#N/A"}},{"$f":"VLOOKUP(B353,'A partager'!$A$6:$A$738,1,0)","v":{"$error":"#N/A"}}]
["A porter seul_343","A partager_343",343,{"$f":"VLOOKUP(A354,'A porter seul'!$A$6:$A$679,1,0)","v":{"$error":"#N/A"}},{"$f":"VLOOKUP(B354,'A partager'!$A$6:$A$738,1,0)","v":{"$error":"#N/A"}}]
["A porter seul_344","A partager_344",344,{"$f":"VLOOKUP(A355,'A porter seul'!$A$6:$A$679,1,0)","v":{"$error":"#N/A"}},{"$f":"VLOOKUP(B355,'A partager'!$A$6:$A$738,1,0)","v":{"$error":"#N/A"}}]
["A porter seul_345","A partager_345",345,{"$f":"VLOOKUP(A356,'A porter seul'!$A$6:$A$679,1,0)","v":{"$error":"#N/A"}},{"$f":"VLOOKUP(B356,'A partager'!$A$6:$A$738,1,0)","v":{"$error":"#N/A"}}]
["A porter seul_346","A partager_346",346,{"$f":"VLOOKUP(A357,'A porter seul'!$A$6:$A$679,1,0)","v":{"$error":"#N/A"}},{"$f":"VLOOKUP(B357,'A partager'!$A$6:$A$738,1,0)","v":{"$error":"#N/A"}}]
["A porter seul_347","A partager_347",347,{"$f":"VLOOKUP(A358,'A porter seul'!$A$6:$A$679,1,0)","v":{"$error":"#N/A"}},{"$f":"VLOOKUP(B358,'A partager'!$A$6:$A$738,1,0)","v":{"$error":"#N/A"}}]
["A porter seul_348","A partager_348",348,{"$f":"VLOOKUP(A359,'A porter seul'!$A$6:$A$679,1,0)","v":{"$error":"#N/A"}},{"$f":"VLOOKUP(B359,'A partager'!$A$6:$A$738,1,0)","v":{"$error":"#N/A"}}]
["A porter seul_349","A partager_349",349,{"$f":"VLOOKUP(A360,'A porter seul'!$A$6:$A$679,1,0)","v":{"$error":"#N/A"}},{"$f":"VLOOKUP(B360,'A partager'!$A$6:$A$738,1,0)","v":{"$error":"#N/A"}}]
["A porter seul_350","A partager_350",350,{"$f":"VLOOKUP(A361,'A porter seul'!$A$6:$A$679,1,0)","v":{"$error":"#N/A"}},{"$f":"VLOOKUP(B361,'A partager'!$A$6:$A$738,1,0)","v":{"$error":"#N/A"}}]
["A porter seul_351","A partager_351",351,{"$f":"VLOOKUP(A362,'A porter seul'!$A$6:$A$679,1,0)","v":{"$error":"#N/A"}},{"$f":"VLOOKUP(B362,'A partager'!$A$6:$A$738,1,0)","v":{"$error":"#N/A"}}]
["A porter seul_352","A partager_352",352,{"$f":"VLOOKUP(A363,'A porter seul'!$A$6:$A$679,1,0)","v":{"$error":"#N/A"}},{"$f":"VLOOKUP(B363,'A partager'!$A$6:$A$738,1,0)","v":{"$error":"#N/A"}}]
["A porter seul_353","A partager_353",353,{"$f":"VLOOKUP(A364,'A porter seul'!$A$6:$A$679,1,0)","v":{"$error":"#N/A"}},{"$f":"VLOOKUP(B364,'A partager'!$A$6:$A$738,1,0)","v":{"$error":"#N/A"}}]
["A porter seul_354","A partager_354",354,{"$f":"VLOOKUP(A365,'A porter seul'!$A$6:$A$679,1,0)","v":{"$error":"#N/A"}},{"$f":"VLOOKUP(B365,'A partager'!$A$6:$A$738,1,0)","v":{"$error":"#N/A"}}]
["A porter seul_355","A partager_355",355,{"$f":"VLOOKUP(A366,'A porter seul'!$A$6:$A$679,1,0)","v":{"$error":"#N/A"}},{"$f":"VLOOKUP(B366,'A partager'!$A$6:$A$738,1,0)","v":{"$error":"#N/A"}}]
["A porter seul_356","A partager_356",356,{"$f":"VLOOKUP(A367,'A porter seul'!$A$6:$A$679,1,0)","v":{"$error":"#N/A"}},{"$f":"VLOOKUP(B367,'A partager'!$A$6:$A$738,1,0)","v":{"$error":"#N/A"}}]
["A porter seul_357","A partager_357",357,{"$f":"VLOOKUP(A368,'A porter seul'!$A$6:$A$679,1,0)","v":{"$error":"#N/A"}},{"$f":"VLOOKUP(B368,'A partager'!$A$6:$A$738,1,0)","v":{"$error":"#N/A"}}]
["A porter seul_358","A partager_358",358,{"$f":"VLOOKUP(A369,'A porter seul'!$A$6:$A$679,1,0)","v":{"$error":"#N/A"}},{"$f":"VLOOKUP(B369,'A partager'!$A$6:$A$738,1,0)","v":{"$error":"#N/A"}}]
["A porter seul_359","A partager_359",359,{"$f":"VLOOKUP(A370,'A porter seul'!$A$6:$A$679,1,0)","v":{"$error":"#N/A"}},{"$f":"VLOOKUP(B370,'A partager'!$A$6:$A$738,1,0)","v":{"$error":"#N/A"}}]
["A porter seul_360","A partager_360",360,{"$f":"VLOOKUP(A371,'A porter seul'!$A$6:$A$679,1,0)","v":{"$error":"#N/A"}},{"$f":"VLOOKUP(B371,'A partager'!$A$6:$A$738,1,0)","v":{"$error":"#N/A"}}]
["A porter seul_361","A partager_361",361,{"$f":"VLOOKUP(A372,'A porter seul'!$A$6:$A$679,1,0)","v":{"$error":"#N/A"}},{"$f":"VLOOKUP(B372,'A partager'!$A$6:$A$738,1,0)","v":{"$error":"#N/A"}}]
["A porter seul_362","A partager_362",362,{"$f":"VLOOKUP(A373,'A porter seul'!$A$6:$A$679,1,0)","v":{"$error":"#N/A"}},{"$f":"VLOOKUP(B373,'A partager'!$A$6:$A$738,1,0)","v":{"$error":"#N/A"}}]
["A porter seul_363","A partager_363",363,{"$f":"VLOOKUP(A374,'A porter seul'!$A$6:$A$679,1,0)","v":{"$error":"#N/A"}},{"$f":"VLOOKUP(B374,'A partager'!$A$6:$A$738,1,0)","v":{"$error":"#N/A"}}]
["A porter seul_364","A partager_364",364,{"$f":"VLOOKUP(A375,'A porter seul'!$A$6:$A$679,1,0)","v":{"$error":"#N/A"}},{"$f":"VLOOKUP(B375,'A partager'!$A$6:$A$738,1,0)","v":{"$error":"#N/A"}}]
["A porter seul_365","A partager_365",365,{"$f":"VLOOKUP(A376,'A porter seul'!$A$6:$A$679,1,0)","v":{"$error":"#N/A"}},{"$f":"VLOOKUP(B376,'A partager'!$A$6:$A$738,1,0)","v":{"$error":"#N/A"}}]
["A porter seul_366","A partager_366",366,{"$f":"VLOOKUP(A377,'A porter seul'!$A$6:$A$679,1,0)","v":{"$error":"#N/A"}},{"$f":"VLOOKUP(B377,'A partager'!$A$6:$A$738,1,0)","v":{"$error":"#N/A"}}]
["A porter seul_367","A partager_367",367,{"$f":"VLOOKUP(A378,'A porter seul'!$A$6:$A$679,1,0)","v":{"$error":"#N/A"}},{"$f":"VLOOKUP(B378,'A partager'!$A$6:$A$738,1,0)","v":{"$error":"#N/A"}}]
["A porter seul_368","A partager_368",368,{"$f":"VLOOKUP(A379,'A porter seul'!$A$6:$A$679,1,0)","v":{"$error":"#N/A"}},{"$f":"VLOOKUP(B379,'A partager'!$A$6:$A$738,1,0)","v":{"$error":"#N/A"}}]
["A porter seul_369","A partager_369",369,{"$f":"VLOOKUP(A380,'A porter seul'!$A$6:$A$679,1,0)","v":{"$error":"#N/A"}},{"$f":"VLOOKUP(B380,'A partager'!$A$6:$A$738,1,0)","v":{"$error":"#N/A"}}]
["A porter seul_370","A partager_370",370,{"$f":"VLOOKUP(A381,'A porter seul'!$A$6:$A$679,1,0)","v":{"$error":"#N/A"}},{"$f":"VLOOKUP(B381,'A partager'!$A$6:$A$738,1,0)","v":{"$error":"#N/A"}}]
["A porter seul_371","A partager_371",371,{"$f":"VLOOKUP(A382,'A porter seul'!$A$6:$A$679,1,0)","v":{"$error":"#N/A"}},{"$f":"VLOOKUP(B382,'A partager'!$A$6:$A$738,1,0)","v":{"$error":"#N/A"}}]
["A porter seul_372","A partager_372",372,{"$f":"VLOOKUP(A383,'A porter seul'!$A$6:$A$679,1,0)","v":{"$error":"#N/A"}},{"$f":"VLOOKUP(B383,'A partager'!$A$6:$A$738,1,0)","v":{"$error":"#N/A"}}]
["A porter seul_373","A partager_373",373,{"$f":"VLOOKUP(A384,'A porter seul'!$A$6:$A$679,1,0)","v":{"$error":"#N/A"}},{"$f":"VLOOKUP(B384,'A partager'!$A$6:$A$738,1,0)","v":{"$error":"#N/A"}}]
["A porter seul_374","A partager_374",374,{"$f":"VLOOKUP(A385,'A porter seul'!$A$6:$A$679,1,0)","v":{"$error":"#N/A"}},{"$f":"VLOOKUP(B385,'A partager'!$A$6:$A$738,1,0)","v":{"$error":"#N/A"}}]
["A porter seul_375","A partager_375",375,{"$f":"VLOOKUP(A386,'A porter seul'!$A$6:$A$679,1,0)","v":{"$error":"#N/A"}},{"$f":"VLOOKUP(B386,'A partager'!$A$6:$A$738,1,0)","v":{"$error":"#N/A"}}]
["A porter seul_376","A partager_376",376,{"$f":"VLOOKUP(A387,'A porter seul'!$A$6:$A$679,1,0)","v":{"$error":"#N/A"}},{"$f":"VLOOKUP(B387,'A partager'!$A$6:$A$738,1,0)","v":{"$error":"#N/A"}}]
["A porter seul_377","A partager_377",377,{"$f":"VLOOKUP(A388,'A porter seul'!$A$6:$A$679,1,0)","v":{"$error":"#N/A"}},{"$f":"VLOOKUP(B388,'A partager'!$A$6:$A$738,1,0)","v":{"$error":"#N/A"}}]
["A porter seul_378","A partager_378",378,{"$f":"VLOOKUP(A389,'A porter seul'!$A$6:$A$679,1,0)","v":{"$error":"#N/A"}},{"$f":"VLOOKUP(B389,'A partager'!$A$6:$A$738,1,0)","v":{"$error":"#N/A"}}]
["A porter seul_379","A partager_379",379,{"$f":"VLOOKUP(A390,'A porter seul'!$A$6:$A$679,1,0)","v":{"$error":"#N/A"}},{"$f":"VLOOKUP(B390,'A partager'!$A$6:$A$738,1,0)","v":{"$error":"#N/A"}}]
["A porter seul_380","A partager_380",380,{"$f":"VLOOKUP(A391,'A porter seul'!$A$6:$A$679,1,0)","v":{"$error":"#N/A"}},{"$f":"VLOOKUP(B391,'A partager'!$A$6:$A$738,1,0)","v":{"$error":"#N/A"}}]
["A porter seul_381","A partager_381",381,{"$f":"VLOOKUP(A392,'A porter seul'!$A$6:$A$679,1,0)","v":{"$error":"#N/A"}},{"$f":"VLOOKUP(B392,'A partager'!$A$6:$A$738,1,0)","v":{"$error":"#N/A"}}]
["A porter seul_382","A partager_382",382,{"$f":"VLOOKUP(A393,'A porter seul'!$A$6:$A$679,1,0)","v":{"$error":"#N/A"}},{"$f":"VLOOKUP(B393,'A partager'!$A$6:$A$738,1,0)","v":{"$error":"#N/A"}}]
["A porter seul_383","A partager_383",383,{"$f":"VLOOKUP(A394,'A porter seul'!$A$6:$A$679,1,0)","v":{"$error":"#N/A"}},{"$f":"VLOOKUP(B394,'A partager'!$A$6:$A$738,1,0)","v":{"$error":"#N/A"}}]
["A porter seul_384","A partager_384",384,{"$f":"VLOOKUP(A395,'A porter seul'!$A$6:$A$679,1,0)","v":{"$error":"#N/A"}},{"$f":"VLOOKUP(B395,'A partager'!$A$6:$A$738,1,0)","v":{"$error":"#N/A"}}]
["A porter seul_385","A partager_385",385,{"$f":"VLOOKUP(A396,'A porter seul'!$A$6:$A$679,1,0)","v":{"$error":"#N/A"}},{"$f":"VLOOKUP(B396,'A partager'!$A$6:$A$738,1,0)","v":{"$error":"#N/A"}}]
[{"$f":"\"A porter seul_\"&C397","v":"A porter seul_386"},{"$f":"\"A partager_\"&C397","v":"A partager_386"},386,{"$f":"VLOOKUP(A397,'A porter seul'!$A$6:$A$679,1,0)","v":{"$error":"#N/A"}},{"$f":"VLOOKUP(B397,'A partager'!$A$6:$A$738,1,0)","v":{"$error":"#N/A"}}]
["A porter seul_387","A partager_387",387,{"$f":"VLOOKUP(A398,'A porter seul'!$A$6:$A$679,1,0)","v":{"$error":"#N/A"}},{"$f":"VLOOKUP(B398,'A partager'!$A$6:$A$738,1,0)","v":{"$error":"#N/A"}}]
["A porter seul_388","A partager_388",388,{"$f":"VLOOKUP(A399,'A porter seul'!$A$6:$A$679,1,0)","v":{"$error":"#N/A"}},{"$f":"VLOOKUP(B399,'A partager'!$A$6:$A$738,1,0)","v":{"$error":"#N/A"}}]
["A porter seul_389","A partager_389",389,{"$f":"VLOOKUP(A400,'A porter seul'!$A$6:$A$679,1,0)","v":{"$error":"#N/A"}},{"$f":"VLOOKUP(B400,'A partager'!$A$6:$A$738,1,0)","v":{"$error":"#N/A"}}]
["A porter seul_390","A partager_390",390,{"$f":"VLOOKUP(A401,'A porter seul'!$A$6:$A$679,1,0)","v":{"$error":"#N/A"}},{"$f":"VLOOKUP(B401,'A partager'!$A$6:$A$738,1,0)","v":{"$error":"#N/A"}}]
["A porter seul_391","A partager_391",391,{"$f":"VLOOKUP(A402,'A porter seul'!$A$6:$A$679,1,0)","v":{"$error":"#N/A"}},{"$f":"VLOOKUP(B402,'A partager'!$A$6:$A$738,1,0)","v":{"$error":"#N/A"}}]
["A porter seul_392","A partager_392",392,{"$f":"VLOOKUP(A403,'A porter seul'!$A$6:$A$679,1,0)","v":{"$error":"#N/A"}},{"$f":"VLOOKUP(B403,'A partager'!$A$6:$A$738,1,0)","v":{"$error":"#N/A"}}]
["A porter seul_393","A partager_393",393,{"$f":"VLOOKUP(A404,'A porter seul'!$A$6:$A$679,1,0)","v":{"$error":"#N/A"}},{"$f":"VLOOKUP(B404,'A partager'!$A$6:$A$738,1,0)","v":{"$error":"#N/A"}}]
["A porter seul_394","A partager_394",394,{"$f":"VLOOKUP(A405,'A porter seul'!$A$6:$A$679,1,0)","v":{"$error":"#N/A"}},{"$f":"VLOOKUP(B405,'A partager'!$A$6:$A$738,1,0)","v":{"$error":"#N/A"}}]
["A porter seul_395","A partager_395",395,{"$f":"VLOOKUP(A406,'A porter seul'!$A$6:$A$679,1,0)","v":{"$error":"#N/A"}},{"$f":"VLOOKUP(B406,'A partager'!$A$6:$A$738,1,0)","v":{"$error":"#N/A"}}]
["A porter seul_396","A partager_396",396,{"$f":"VLOOKUP(A407,'A porter seul'!$A$6:$A$679,1,0)","v":{"$error":"#N/A"}},{"$f":"VLOOKUP(B407,'A partager'!$A$6:$A$738,1,0)","v":{"$error":"#N/A"}}]
["A porter seul_397","A partager_397",397,{"$f":"VLOOKUP(A408,'A porter seul'!$A$6:$A$679,1,0)","v":{"$error":"#N/A"}},{"$f":"VLOOKUP(B408,'A partager'!$A$6:$A$738,1,0)","v":{"$error":"#N/A"}}]
["A porter seul_398","A partager_398",398,{"$f":"VLOOKUP(A409,'A porter seul'!$A$6:$A$679,1,0)","v":{"$error":"#N/A"}},{"$f":"VLOOKUP(B409,'A partager'!$A$6:$A$738,1,0)","v":{"$error":"#N/A"}}]
["A porter seul_399","A partager_399",399,{"$f":"VLOOKUP(A410,'A porter seul'!$A$6:$A$679,1,0)","v":{"$error":"#N/A"}},{"$f":"VLOOKUP(B410,'A partager'!$A$6:$A$738,1,0)","v":{"$error":"#N/A"}}]
["A porter seul_400","A partager_400",400,{"$f":"VLOOKUP(A411,'A porter seul'!$A$6:$A$679,1,0)","v":{"$error":"#N/A"}},{"$f":"VLOOKUP(B411,'A partager'!$A$6:$A$738,1,0)","v":{"$error":"#N/A"}}]
["A porter seul_401","A partager_401",401,{"$f":"VLOOKUP(A412,'A porter seul'!$A$6:$A$679,1,0)","v":{"$error":"#N/A"}},{"$f":"VLOOKUP(B412,'A partager'!$A$6:$A$738,1,0)","v":{"$error":"#N/A"}}]
["A porter seul_402","A partager_402",402,{"$f":"VLOOKUP(A413,'A porter seul'!$A$6:$A$679,1,0)","v":{"$error":"#N/A"}},{"$f":"VLOOKUP(B413,'A partager'!$A$6:$A$738,1,0)","v":{"$error":"#N/A"}}]
["A porter seul_403","A partager_403",403,{"$f":"VLOOKUP(A414,'A porter seul'!$A$6:$A$679,1,0)","v":{"$error":"#N/A"}},{"$f":"VLOOKUP(B414,'A partager'!$A$6:$A$738,1,0)","v":{"$error":"#N/A"}}]
["A porter seul_404","A partager_404",404,{"$f":"VLOOKUP(A415,'A porter seul'!$A$6:$A$679,1,0)","v":{"$error":"#N/A"}},{"$f":"VLOOKUP(B415,'A partager'!$A$6:$A$738,1,0)","v":{"$error":"#N/A"}}]
["A porter seul_405","A partager_405",405,{"$f":"VLOOKUP(A416,'A porter seul'!$A$6:$A$679,1,0)","v":{"$error":"#N/A"}},{"$f":"VLOOKUP(B416,'A partager'!$A$6:$A$738,1,0)","v":{"$error":"#N/A"}}]
["A porter seul_406","A partager_406",406,{"$f":"VLOOKUP(A417,'A porter seul'!$A$6:$A$679,1,0)","v":{"$error":"#N/A"}},{"$f":"VLOOKUP(B417,'A partager'!$A$6:$A$738,1,0)","v":{"$error":"#N/A"}}]
["A porter seul_407","A partager_407",407,{"$f":"VLOOKUP(A418,'A porter seul'!$A$6:$A$679,1,0)","v":{"$error":"#N/A"}},{"$f":"VLOOKUP(B418,'A partager'!$A$6:$A$738,1,0)","v":{"$error":"#N/A"}}]
["A porter seul_408","A partager_408",408,{"$f":"VLOOKUP(A419,'A porter seul'!$A$6:$A$679,1,0)","v":{"$error":"#N/A"}},{"$f":"VLOOKUP(B419,'A partager'!$A$6:$A$738,1,0)","v":{"$error":"#N/A"}}]
["A porter seul_409","A partager_409",409,{"$f":"VLOOKUP(A420,'A porter seul'!$A$6:$A$679,1,0)","v":{"$error":"#N/A"}},{"$f":"VLOOKUP(B420,'A partager'!$A$6:$A$738,1,0)","v":{"$error":"#N/A"}}]
["A porter seul_410","A partager_410",410,{"$f":"VLOOKUP(A421,'A porter seul'!$A$6:$A$679,1,0)","v":{"$error":"#N/A"}},{"$f":"VLOOKUP(B421,'A partager'!$A$6:$A$738,1,0)","v":{"$error":"#N/A"}}]
["A porter seul_411","A partager_411",411,{"$f":"VLOOKUP(A422,'A porter seul'!$A$6:$A$679,1,0)","v":{"$error":"#N/A"}},{"$f":"VLOOKUP(B422,'A partager'!$A$6:$A$738,1,0)","v":{"$error":"#N/A"}}]
["A porter seul_412","A partager_412",412,{"$f":"VLOOKUP(A423,'A porter seul'!$A$6:$A$679,1,0)","v":{"$error":"#N/A"}},{"$f":"VLOOKUP(B423,'A partager'!$A$6:$A$738,1,0)","v":{"$error":"#N/A"}}]
["A porter seul_413","A partager_413",413,{"$f":"VLOOKUP(A424,'A porter seul'!$A$6:$A$679,1,0)","v":{"$error":"#N/A"}},{"$f":"VLOOKUP(B424,'A partager'!$A$6:$A$738,1,0)","v":{"$error":"#N/A"}}]
["A porter seul_414","A partager_414",414,{"$f":"VLOOKUP(A425,'A porter seul'!$A$6:$A$679,1,0)","v":{"$error":"#N/A"}},{"$f":"VLOOKUP(B425,'A partager'!$A$6:$A$738,1,0)","v":{"$error":"#N/A"}}]
["A porter seul_415","A partager_415",415,{"$f":"VLOOKUP(A426,'A porter seul'!$A$6:$A$679,1,0)","v":{"$error":"#N/A"}},{"$f":"VLOOKUP(B426,'A partager'!$A$6:$A$738,1,0)","v":{"$error":"#N/A"}}]
["A porter seul_416","A partager_416",416,{"$f":"VLOOKUP(A427,'A porter seul'!$A$6:$A$679,1,0)","v":{"$error":"#N/A"}},{"$f":"VLOOKUP(B427,'A partager'!$A$6:$A$738,1,0)","v":{"$error":"#N/A"}}]
["A porter seul_417","A partager_417",417,{"$f":"VLOOKUP(A428,'A porter seul'!$A$6:$A$679,1,0)","v":{"$error":"#N/A"}},{"$f":"VLOOKUP(B428,'A partager'!$A$6:$A$738,1,0)","v":{"$error":"#N/A"}}]
["A porter seul_418","A partager_418",418,{"$f":"VLOOKUP(A429,'A porter seul'!$A$6:$A$679,1,0)","v":{"$error":"#N/A"}},{"$f":"VLOOKUP(B429,'A partager'!$A$6:$A$738,1,0)","v":{"$error":"#N/A"}}]
["A porter seul_419","A partager_419",419,{"$f":"VLOOKUP(A430,'A porter seul'!$A$6:$A$679,1,0)","v":{"$error":"#N/A"}},{"$f":"VLOOKUP(B430,'A partager'!$A$6:$A$738,1,0)","v":{"$error":"#N/A"}}]
["A porter seul_420","A partager_420",420,{"$f":"VLOOKUP(A431,'A porter seul'!$A$6:$A$679,1,0)","v":{"$error":"#N/A"}},{"$f":"VLOOKUP(B431,'A partager'!$A$6:$A$738,1,0)","v":{"$error":"#N/A"}}]
["A porter seul_421","A partager_421",421,{"$f":"VLOOKUP(A432,'A porter seul'!$A$6:$A$679,1,0)","v":{"$error":"#N/A"}},{"$f":"VLOOKUP(B432,'A partager'!$A$6:$A$738,1,0)","v":{"$error":"#N/A"}}]
["A porter seul_422","A partager_422",422,{"$f":"VLOOKUP(A433,'A porter seul'!$A$6:$A$679,1,0)","v":{"$error":"#N/A"}},{"$f":"VLOOKUP(B433,'A partager'!$A$6:$A$738,1,0)","v":{"$error":"#N/A"}}]
["A porter seul_423","A partager_423",423,{"$f":"VLOOKUP(A434,'A porter seul'!$A$6:$A$679,1,0)","v":{"$error":"#N/A"}},{"$f":"VLOOKUP(B434,'A partager'!$A$6:$A$738,1,0)","v":{"$error":"#N/A"}}]
["A porter seul_424","A partager_424",424,{"$f":"VLOOKUP(A435,'A porter seul'!$A$6:$A$679,1,0)","v":{"$error":"#N/A"}},{"$f":"VLOOKUP(B435,'A partager'!$A$6:$A$738,1,0)","v":{"$error":"#N/A"}}]
["A porter seul_425","A partager_425",425,{"$f":"VLOOKUP(A436,'A porter seul'!$A$6:$A$679,1,0)","v":{"$error":"#N/A"}},{"$f":"VLOOKUP(B436,'A partager'!$A$6:$A$738,1,0)","v":{"$error":"#N/A"}}]
["A porter seul_426","A partager_426",426,{"$f":"VLOOKUP(A437,'A porter seul'!$A$6:$A$679,1,0)","v":{"$error":"#N/A"}},{"$f":"VLOOKUP(B437,'A partager'!$A$6:$A$738,1,0)","v":{"$error":"#N/A"}}]
["A porter seul_427","A partager_427",427,{"$f":"VLOOKUP(A438,'A porter seul'!$A$6:$A$679,1,0)","v":{"$error":"#N/A"}},{"$f":"VLOOKUP(B438,'A partager'!$A$6:$A$738,1,0)","v":{"$error":"#N/A"}}]
["A porter seul_428","A partager_428",428,{"$f":"VLOOKUP(A439,'A porter seul'!$A$6:$A$679,1,0)","v":{"$error":"#N/A"}},{"$f":"VLOOKUP(B439,'A partager'!$A$6:$A$738,1,0)","v":{"$error":"#N/A"}}]
["A porter seul_429","A partager_429",429,{"$f":"VLOOKUP(A440,'A porter seul'!$A$6:$A$679,1,0)","v":{"$error":"#N/A"}},{"$f":"VLOOKUP(B440,'A partager'!$A$6:$A$738,1,0)","v":{"$error":"#N/A"}}]
["A porter seul_430","A partager_430",430,{"$f":"VLOOKUP(A441,'A porter seul'!$A$6:$A$679,1,0)","v":{"$error":"#N/A"}},{"$f":"VLOOKUP(B441,'A partager'!$A$6:$A$738,1,0)","v":{"$error":"#N/A"}}]
["A porter seul_431","A partager_431",431,{"$f":"VLOOKUP(A442,'A porter seul'!$A$6:$A$679,1,0)","v":{"$error":"#N/A"}},{"$f":"VLOOKUP(B442,'A partager'!$A$6:$A$738,1,0)","v":{"$error":"#N/A"}}]
["A porter seul_432","A partager_432",432,{"$f":"VLOOKUP(A443,'A porter seul'!$A$6:$A$679,1,0)","v":{"$error":"#N/A"}},{"$f":"VLOOKUP(B443,'A partager'!$A$6:$A$738,1,0)","v":{"$error":"#N/A"}}]
["A porter seul_433","A partager_433",433,{"$f":"VLOOKUP(A444,'A porter seul'!$A$6:$A$679,1,0)","v":{"$error":"#N/A"}},{"$f":"VLOOKUP(B444,'A partager'!$A$6:$A$738,1,0)","v":{"$error":"#N/A"}}]
["A porter seul_434","A partager_434",434,{"$f":"VLOOKUP(A445,'A porter seul'!$A$6:$A$679,1,0)","v":{"$error":"#N/A"}},{"$f":"VLOOKUP(B445,'A partager'!$A$6:$A$738,1,0)","v":{"$error":"#N/A"}}]
["A porter seul_435","A partager_435",435,{"$f":"VLOOKUP(A446,'A porter seul'!$A$6:$A$679,1,0)","v":{"$error":"#N/A"}},{"$f":"VLOOKUP(B446,'A partager'!$A$6:$A$738,1,0)","v":{"$error":"#N/A"}}]
["A porter seul_436","A partager_436",436,{"$f":"VLOOKUP(A447,'A porter seul'!$A$6:$A$679,1,0)","v":{"$error":"#N/A"}},{"$f":"VLOOKUP(B447,'A partager'!$A$6:$A$738,1,0)","v":{"$error":"#N/A"}}]
["A porter seul_437","A partager_437",437,{"$f":"VLOOKUP(A448,'A porter seul'!$A$6:$A$679,1,0)","v":{"$error":"#N/A"}},{"$f":"VLOOKUP(B448,'A partager'!$A$6:$A$738,1,0)","v":{"$error":"#N/A"}}]
["A porter seul_438","A partager_438",438,{"$f":"VLOOKUP(A449,'A porter seul'!$A$6:$A$679,1,0)","v":{"$error":"#N/A"}},{"$f":"VLOOKUP(B449,'A partager'!$A$6:$A$738,1,0)","v":{"$error":"#N/A"}}]
["A porter seul_439","A partager_439",439,{"$f":"VLOOKUP(A450,'A porter seul'!$A$6:$A$679,1,0)","v":{"$error":"#N/A"}},{"$f":"VLOOKUP(B450,'A partager'!$A$6:$A$738,1,0)","v":{"$error":"#N/A"}}]
["A porter seul_440","A partager_440",440,{"$f":"VLOOKUP(A451,'A porter seul'!$A$6:$A$679,1,0)","v":{"$error":"#N/A"}},{"$f":"VLOOKUP(B451,'A partager'!$A$6:$A$738,1,0)","v":{"$error":"#N/A"}}]
["A porter seul_441","A partager_441",441,{"$f":"VLOOKUP(A452,'A porter seul'!$A$6:$A$679,1,0)","v":{"$error":"#N/A"}},{"$f":"VLOOKUP(B452,'A partager'!$A$6:$A$738,1,0)","v":{"$error":"#N/A"}}]
["A porter seul_442","A partager_442",442,{"$f":"VLOOKUP(A453,'A porter seul'!$A$6:$A$679,1,0)","v":{"$error":"#N/A"}},{"$f":"VLOOKUP(B453,'A partager'!$A$6:$A$738,1,0)","v":{"$error":"#N/A"}}]
["A porter seul_443","A partager_443",443,{"$f":"VLOOKUP(A454,'A porter seul'!$A$6:$A$679,1,0)","v":{"$error":"#N/A"}},{"$f":"VLOOKUP(B454,'A partager'!$A$6:$A$738,1,0)","v":{"$error":"#N/A"}}]
["A porter seul_444","A partager_444",444,{"$f":"VLOOKUP(A455,'A porter seul'!$A$6:$A$679,1,0)","v":{"$error":"#N/A"}},{"$f":"VLOOKUP(B455,'A partager'!$A$6:$A$738,1,0)","v":{"$error":"#N/A"}}]
["A porter seul_445","A partager_445",445,{"$f":"VLOOKUP(A456,'A porter seul'!$A$6:$A$679,1,0)","v":{"$error":"#N/A"}},{"$f":"VLOOKUP(B456,'A partager'!$A$6:$A$738,1,0)","v":{"$error":"#N/A"}}]
["A porter seul_446","A partager_446",446,{"$f":"VLOOKUP(A457,'A porter seul'!$A$6:$A$679,1,0)","v":{"$error":"#N/A"}},{"$f":"VLOOKUP(B457,'A partager'!$A$6:$A$738,1,0)","v":{"$error":"#N/A"}}]
["A porter seul_447","A partager_447",447,{"$f":"VLOOKUP(A458,'A porter seul'!$A$6:$A$679,1,0)","v":{"$error":"#N/A"}},{"$f":"VLOOKUP(B458,'A partager'!$A$6:$A$738,1,0)","v":{"$error":"#N/A"}}]
["A porter seul_448","A partager_448",448,{"$f":"VLOOKUP(A459,'A porter seul'!$A$6:$A$679,1,0)","v":{"$error":"#N/A"}},{"$f":"VLOOKUP(B459,'A partager'!$A$6:$A$738,1,0)","v":{"$error":"#N/A"}}]
["A porter seul_449","A partager_449",449,{"$f":"VLOOKUP(A460,'A porter seul'!$A$6:$A$679,1,0)","v":{"$error":"#N/A"}},{"$f":"VLOOKUP(B460,'A partager'!$A$6:$A$738,1,0)","v":{"$error":"#N/A"}}]
[{"$f":"\"A porter seul_\"&C461","v":"A porter seul_450"},{"$f":"\"A partager_\"&C461","v":"A partager_450"},450,{"$f":"VLOOKUP(A461,'A porter seul'!$A$6:$A$679,1,0)","v":{"$error":"#N/A"}},{"$f":"VLOOKUP(B461,'A partager'!$A$6:$A$738,1,0)","v":{"$error":"#N/A"}}]
["A porter seul_451","A partager_451",451,{"$f":"VLOOKUP(A462,'A porter seul'!$A$6:$A$679,1,0)","v":{"$error":"#N/A"}},{"$f":"VLOOKUP(B462,'A partager'!$A$6:$A$738,1,0)","v":{"$error":"#N/A"}}]
["A porter seul_452","A partager_452",452,{"$f":"VLOOKUP(A463,'A porter seul'!$A$6:$A$679,1,0)","v":{"$error":"#N/A"}},{"$f":"VLOOKUP(B463,'A partager'!$A$6:$A$738,1,0)","v":{"$error":"#N/A"}}]
["A porter seul_453","A partager_453",453,{"$f":"VLOOKUP(A464,'A porter seul'!$A$6:$A$679,1,0)","v":{"$error":"#N/A"}},{"$f":"VLOOKUP(B464,'A partager'!$A$6:$A$738,1,0)","v":{"$error":"#N/A"}}]
["A porter seul_454","A partager_454",454,{"$f":"VLOOKUP(A465,'A porter seul'!$A$6:$A$679,1,0)","v":{"$error":"#N/A"}},{"$f":"VLOOKUP(B465,'A partager'!$A$6:$A$738,1,0)","v":{"$error":"#N/A"}}]
["A porter seul_455","A partager_455",455,{"$f":"VLOOKUP(A466,'A porter seul'!$A$6:$A$679,1,0)","v":{"$error":"#N/A"}},{"$f":"VLOOKUP(B466,'A partager'!$A$6:$A$738,1,0)","v":{"$error":"#N/A"}}]
["A porter seul_456","A partager_456",456,{"$f":"VLOOKUP(A467,'A porter seul'!$A$6:$A$679,1,0)","v":{"$error":"#N/A"}},{"$f":"VLOOKUP(B467,'A partager'!$A$6:$A$738,1,0)","v":{"$error":"#N/A"}}]
["A porter seul_457","A partager_457",457,{"$f":"VLOOKUP(A468,'A porter seul'!$A$6:$A$679,1,0)","v":{"$error":"#N/A"}},{"$f":"VLOOKUP(B468,'A partager'!$A$6:$A$738,1,0)","v":{"$error":"#N/A"}}]
["A porter seul_458","A partager_458",458,{"$f":"VLOOKUP(A469,'A porter seul'!$A$6:$A$679,1,0)","v":{"$error":"#N/A"}},{"$f":"VLOOKUP(B469,'A partager'!$A$6:$A$738,1,0)","v":{"$error":"#N/A"}}]
["A porter seul_459","A partager_459",459,{"$f":"VLOOKUP(A470,'A porter seul'!$A$6:$A$679,1,0)","v":{"$error":"#N/A"}},{"$f":"VLOOKUP(B470,'A partager'!$A$6:$A$738,1,0)","v":{"$error":"#N/A"}}]
["A porter seul_460","A partager_460",460,{"$f":"VLOOKUP(A471,'A porter seul'!$A$6:$A$679,1,0)","v":{"$error":"#N/A"}},{"$f":"VLOOKUP(B471,'A partager'!$A$6:$A$738,1,0)","v":{"$error":"#N/A"}}]
["A porter seul_461","A partager_461",461,{"$f":"VLOOKUP(A472,'A porter seul'!$A$6:$A$679,1,0)","v":{"$error":"#N/A"}},{"$f":"VLOOKUP(B472,'A partager'!$A$6:$A$738,1,0)","v":{"$error":"#N/A"}}]
["A porter seul_462","A partager_462",462,{"$f":"VLOOKUP(A473,'A porter seul'!$A$6:$A$679,1,0)","v":{"$error":"#N/A"}},{"$f":"VLOOKUP(B473,'A partager'!$A$6:$A$738,1,0)","v":{"$error":"#N/A"}}]
["A porter seul_463","A partager_463",463,{"$f":"VLOOKUP(A474,'A porter seul'!$A$6:$A$679,1,0)","v":{"$error":"#N/A"}},{"$f":"VLOOKUP(B474,'A partager'!$A$6:$A$738,1,0)","v":{"$error":"#N/A"}}]
["A porter seul_464","A partager_464",464,{"$f":"VLOOKUP(A475,'A porter seul'!$A$6:$A$679,1,0)","v":{"$error":"#N/A"}},{"$f":"VLOOKUP(B475,'A partager'!$A$6:$A$738,1,0)","v":{"$error":"#N/A"}}]
["A porter seul_465","A partager_465",465,{"$f":"VLOOKUP(A476,'A porter seul'!$A$6:$A$679,1,0)","v":{"$error":"#N/A"}},{"$f":"VLOOKUP(B476,'A partager'!$A$6:$A$738,1,0)","v":{"$error":"#N/A"}}]
["A porter seul_466","A partager_466",466,{"$f":"VLOOKUP(A477,'A porter seul'!$A$6:$A$679,1,0)","v":{"$error":"#N/A"}},{"$f":"VLOOKUP(B477,'A partager'!$A$6:$A$738,1,0)","v":{"$error":"#N/A"}}]
["A porter seul_467","A partager_467",467,{"$f":"VLOOKUP(A478,'A porter seul'!$A$6:$A$679,1,0)","v":{"$error":"#N/A"}},{"$f":"VLOOKUP(B478,'A partager'!$A$6:$A$738,1,0)","v":{"$error":"#N/A"}}]
["A porter seul_468","A partager_468",468,{"$f":"VLOOKUP(A479,'A porter seul'!$A$6:$A$679,1,0)","v":{"$error":"#N/A"}},{"$f":"VLOOKUP(B479,'A partager'!$A$6:$A$738,1,0)","v":{"$error":"#N/A"}}]
["A porter seul_469","A partager_469",469,{"$f":"VLOOKUP(A480,'A porter seul'!$A$6:$A$679,1,0)","v":{"$error":"#N/A"}},{"$f":"VLOOKUP(B480,'A partager'!$A$6:$A$738,1,0)","v":{"$error":"#N/A"}}]
["A porter seul_470","A partager_470",470,{"$f":"VLOOKUP(A481,'A porter seul'!$A$6:$A$679,1,0)","v":{"$error":"#N/A"}},{"$f":"VLOOKUP(B481,'A partager'!$A$6:$A$738,1,0)","v":{"$error":"#N/A"}}]
["A porter seul_471","A partager_471",471,{"$f":"VLOOKUP(A482,'A porter seul'!$A$6:$A$679,1,0)","v":{"$error":"#N/A"}},{"$f":"VLOOKUP(B482,'A partager'!$A$6:$A$738,1,0)","v":{"$error":"#N/A"}}]
["A porter seul_472","A partager_472",472,{"$f":"VLOOKUP(A483,'A porter seul'!$A$6:$A$679,1,0)","v":{"$error":"#N/A"}},{"$f":"VLOOKUP(B483,'A partager'!$A$6:$A$738,1,0)","v":{"$error":"#N/A"}}]
["A porter seul_473","A partager_473",473,{"$f":"VLOOKUP(A484,'A porter seul'!$A$6:$A$679,1,0)","v":{"$error":"#N/A"}},{"$f":"VLOOKUP(B484,'A partager'!$A$6:$A$738,1,0)","v":{"$error":"#N/A"}}]
["A porter seul_474","A partager_474",474,{"$f":"VLOOKUP(A485,'A porter seul'!$A$6:$A$679,1,0)","v":{"$error":"#N/A"}},{"$f":"VLOOKUP(B485,'A partager'!$A$6:$A$738,1,0)","v":{"$error":"#N/A"}}]
["A porter seul_475","A partager_475",475,{"$f":"VLOOKUP(A486,'A porter seul'!$A$6:$A$679,1,0)","v":{"$error":"#N/A"}},{"$f":"VLOOKUP(B486,'A partager'!$A$6:$A$738,1,0)","v":{"$error":"#N/A"}}]
["A porter seul_476","A partager_476",476,{"$f":"VLOOKUP(A487,'A porter seul'!$A$6:$A$679,1,0)","v":{"$error":"#N/A"}},{"$f":"VLOOKUP(B487,'A partager'!$A$6:$A$738,1,0)","v":{"$error":"#N/A"}}]
["A porter seul_477","A partager_477",477,{"$f":"VLOOKUP(A488,'A porter seul'!$A$6:$A$679,1,0)","v":{"$error":"#N/A"}},{"$f":"VLOOKUP(B488,'A partager'!$A$6:$A$738,1,0)","v":{"$error":"#N/A"}}]
["A porter seul_478","A partager_478",478,{"$f":"VLOOKUP(A489,'A porter seul'!$A$6:$A$679,1,0)","v":{"$error":"#N/A"}},{"$f":"VLOOKUP(B489,'A partager'!$A$6:$A$738,1,0)","v":{"$error":"#N/A"}}]
["A porter seul_479","A partager_479",479,{"$f":"VLOOKUP(A490,'A porter seul'!$A$6:$A$679,1,0)","v":{"$error":"#N/A"}},{"$f":"VLOOKUP(B490,'A partager'!$A$6:$A$738,1,0)","v":{"$error":"#N/A"}}]
["A porter seul_480","A partager_480",480,{"$f":"VLOOKUP(A491,'A porter seul'!$A$6:$A$679,1,0)","v":{"$error":"#N/A"}},{"$f":"VLOOKUP(B491,'A partager'!$A$6:$A$738,1,0)","v":{"$error":"#N/A"}}]
["A porter seul_481","A partager_481",481,{"$f":"VLOOKUP(A492,'A porter seul'!$A$6:$A$679,1,0)","v":{"$error":"#N/A"}},{"$f":"VLOOKUP(B492,'A partager'!$A$6:$A$738,1,0)","v":{"$error":"#N/A"}}]
["A porter seul_482","A partager_482",482,{"$f":"VLOOKUP(A493,'A porter seul'!$A$6:$A$679,1,0)","v":{"$error":"#N/A"}},{"$f":"VLOOKUP(B493,'A partager'!$A$6:$A$738,1,0)","v":{"$error":"#N/A"}}]
["A porter seul_483","A partager_483",483,{"$f":"VLOOKUP(A494,'A porter seul'!$A$6:$A$679,1,0)","v":{"$error":"#N/A"}},{"$f":"VLOOKUP(B494,'A partager'!$A$6:$A$738,1,0)","v":{"$error":"#N/A"}}]
["A porter seul_484","A partager_484",484,{"$f":"VLOOKUP(A495,'A porter seul'!$A$6:$A$679,1,0)","v":{"$error":"#N/A"}},{"$f":"VLOOKUP(B495,'A partager'!$A$6:$A$738,1,0)","v":{"$error":"#N/A"}}]
["A porter seul_485","A partager_485",485,{"$f":"VLOOKUP(A496,'A porter seul'!$A$6:$A$679,1,0)","v":{"$error":"#N/A"}},{"$f":"VLOOKUP(B496,'A partager'!$A$6:$A$738,1,0)","v":{"$error":"#N/A"}}]
["A porter seul_486","A partager_486",486,{"$f":"VLOOKUP(A497,'A porter seul'!$A$6:$A$679,1,0)","v":{"$error":"#N/A"}},{"$f":"VLOOKUP(B497,'A partager'!$A$6:$A$738,1,0)","v":{"$error":"#N/A"}}]
["A porter seul_487","A partager_487",487,{"$f":"VLOOKUP(A498,'A porter seul'!$A$6:$A$679,1,0)","v":{"$error":"#N/A"}},{"$f":"VLOOKUP(B498,'A partager'!$A$6:$A$738,1,0)","v":{"$error":"#N/A"}}]
["A porter seul_488","A partager_488",488,{"$f":"VLOOKUP(A499,'A porter seul'!$A$6:$A$679,1,0)","v":{"$error":"#N/A"}},{"$f":"VLOOKUP(B499,'A partager'!$A$6:$A$738,1,0)","v":{"$error":"#N/A"}}]
["A porter seul_489","A partager_489",489,{"$f":"VLOOKUP(A500,'A porter seul'!$A$6:$A$679,1,0)","v":{"$error":"#N/A"}},{"$f":"VLOOKUP(B500,'A partager'!$A$6:$A$738,1,0)","v":{"$error":"#N/A"}}]
["A porter seul_490","A partager_490",490,{"$f":"VLOOKUP(A501,'A porter seul'!$A$6:$A$679,1,0)","v":{"$error":"#N/A"}},{"$f":"VLOOKUP(B501,'A partager'!$A$6:$A$738,1,0)","v":{"$error":"#N/A"}}]
["A porter seul_491","A partager_491",491,{"$f":"VLOOKUP(A502,'A porter seul'!$A$6:$A$679,1,0)","v":{"$error":"#N/A"}},{"$f":"VLOOKUP(B502,'A partager'!$A$6:$A$738,1,0)","v":{"$error":"#N/A"}}]
["A porter seul_492","A partager_492",492,{"$f":"VLOOKUP(A503,'A porter seul'!$A$6:$A$679,1,0)","v":{"$error":"#N/A"}},{"$f":"VLOOKUP(B503,'A partager'!$A$6:$A$738,1,0)","v":{"$error":"#N/A"}}]
["A porter seul_493","A partager_493",493,{"$f":"VLOOKUP(A504,'A porter seul'!$A$6:$A$679,1,0)","v":{"$error":"#N/A"}},{"$f":"VLOOKUP(B504,'A partager'!$A$6:$A$738,1,0)","v":{"$error":"#N/A"}}]
["A porter seul_494","A partager_494",494,{"$f":"VLOOKUP(A505,'A porter seul'!$A$6:$A$679,1,0)","v":{"$error":"#N/A"}},{"$f":"VLOOKUP(B505,'A partager'!$A$6:$A$738,1,0)","v":{"$error":"#N/A"}}]
["A porter seul_495","A partager_495",495,{"$f":"VLOOKUP(A506,'A porter seul'!$A$6:$A$679,1,0)","v":{"$error":"#N/A"}},{"$f":"VLOOKUP(B506,'A partager'!$A$6:$A$738,1,0)","v":{"$error":"#N/A"}}]
["A porter seul_496","A partager_496",496,{"$f":"VLOOKUP(A507,'A porter seul'!$A$6:$A$679,1,0)","v":{"$error":"#N/A"}},{"$f":"VLOOKUP(B507,'A partager'!$A$6:$A$738,1,0)","v":{"$error":"#N/A"}}]
["A porter seul_497","A partager_497",497,{"$f":"VLOOKUP(A508,'A porter seul'!$A$6:$A$679,1,0)","v":{"$error":"#N/A"}},{"$f":"VLOOKUP(B508,'A partager'!$A$6:$A$738,1,0)","v":{"$error":"#N/A"}}]
["A porter seul_498","A partager_498",498,{"$f":"VLOOKUP(A509,'A porter seul'!$A$6:$A$679,1,0)","v":{"$error":"#N/A"}},{"$f":"VLOOKUP(B509,'A partager'!$A$6:$A$738,1,0)","v":{"$error":"#N/A"}}]
["A porter seul_499","A partager_499",499,{"$f":"VLOOKUP(A510,'A porter seul'!$A$6:$A$679,1,0)","v":{"$error":"#N/A"}},{"$f":"VLOOKUP(B510,'A partager'!$A$6:$A$738,1,0)","v":{"$error":"#N/A"}}]
["A porter seul_500","A partager_500",500,{"$f":"VLOOKUP(A511,'A porter seul'!$A$6:$A$679,1,0)","v":{"$error":"#N/A"}},{"$f":"VLOOKUP(B511,'A partager'!$A$6:$A$738,1,0)","v":{"$error":"#N/A"}}]
["A porter seul_501","A partager_501",501,{"$f":"VLOOKUP(A512,'A porter seul'!$A$6:$A$679,1,0)","v":{"$error":"#N/A"}},{"$f":"VLOOKUP(B512,'A partager'!$A$6:$A$738,1,0)","v":{"$error":"#N/A"}}]
["A porter seul_502","A partager_502",502,{"$f":"VLOOKUP(A513,'A porter seul'!$A$6:$A$679,1,0)","v":{"$error":"#N/A"}},{"$f":"VLOOKUP(B513,'A partager'!$A$6:$A$738,1,0)","v":{"$error":"#N/A"}}]
["A porter seul_503","A partager_503",503,{"$f":"VLOOKUP(A514,'A porter seul'!$A$6:$A$679,1,0)","v":{"$error":"#N/A"}},{"$f":"VLOOKUP(B514,'A partager'!$A$6:$A$738,1,0)","v":{"$error":"#N/A"}}]
["A porter seul_504","A partager_504",504,{"$f":"VLOOKUP(A515,'A porter seul'!$A$6:$A$679,1,0)","v":{"$error":"#N/A"}},{"$f":"VLOOKUP(B515,'A partager'!$A$6:$A$738,1,0)","v":{"$error":"#N/A"}}]
["A porter seul_505","A partager_505",505,{"$f":"VLOOKUP(A516,'A porter seul'!$A$6:$A$679,1,0)","v":{"$error":"#N/A"}},{"$f":"VLOOKUP(B516,'A partager'!$A$6:$A$738,1,0)","v":{"$error":"#N/A"}}]
["A porter seul_506","A partager_506",506,{"$f":"VLOOKUP(A517,'A porter seul'!$A$6:$A$679,1,0)","v":{"$error":"#N/A"}},{"$f":"VLOOKUP(B517,'A partager'!$A$6:$A$738,1,0)","v":{"$error":"#N/A"}}]
["A porter seul_507","A partager_507",507,{"$f":"VLOOKUP(A518,'A porter seul'!$A$6:$A$679,1,0)","v":{"$error":"#N/A"}},{"$f":"VLOOKUP(B518,'A partager'!$A$6:$A$738,1,0)","v":{"$error":"#N/A"}}]
["A porter seul_508","A partager_508",508,{"$f":"VLOOKUP(A519,'A porter seul'!$A$6:$A$679,1,0)","v":{"$error":"#N/A"}},{"$f":"VLOOKUP(B519,'A partager'!$A$6:$A$738,1,0)","v":{"$error":"#N/A"}}]
["A porter seul_509","A partager_509",509,{"$f":"VLOOKUP(A520,'A porter seul'!$A$6:$A$679,1,0)","v":{"$error":"#N/A"}},{"$f":"VLOOKUP(B520,'A partager'!$A$6:$A$738,1,0)","v":{"$error":"#N/A"}}]
["A porter seul_510","A partager_510",510,{"$f":"VLOOKUP(A521,'A porter seul'!$A$6:$A$679,1,0)","v":{"$error":"#N/A"}},{"$f":"VLOOKUP(B521,'A partager'!$A$6:$A$738,1,0)","v":{"$error":"#N/A"}}]
["A porter seul_511","A partager_511",511,{"$f":"VLOOKUP(A522,'A porter seul'!$A$6:$A$679,1,0)","v":{"$error":"#N/A"}},{"$f":"VLOOKUP(B522,'A partager'!$A$6:$A$738,1,0)","v":{"$error":"#N/A"}}]
["A porter seul_512","A partager_512",512,{"$f":"VLOOKUP(A523,'A porter seul'!$A$6:$A$679,1,0)","v":{"$error":"#N/A"}},{"$f":"VLOOKUP(B523,'A partager'!$A$6:$A$738,1,0)","v":{"$error":"#N/A"}}]
["A porter seul_513","A partager_513",513,{"$f":"VLOOKUP(A524,'A porter seul'!$A$6:$A$679,1,0)","v":{"$error":"#N/A"}},{"$f":"VLOOKUP(B524,'A partager'!$A$6:$A$738,1,0)","v":{"$error":"#N/A"}}]
[{"$f":"\"A porter seul_\"&C525","v":"A porter seul_514"},{"$f":"\"A partager_\"&C525","v":"A partager_514"},514,{"$f":"VLOOKUP(A525,'A porter seul'!$A$6:$A$679,1,0)","v":{"$error":"#N/A"}},{"$f":"VLOOKUP(B525,'A partager'!$A$6:$A$738,1,0)","v":{"$error":"#N/A"}}]
["A porter seul_515","A partager_515",515,{"$f":"VLOOKUP(A526,'A porter seul'!$A$6:$A$679,1,0)","v":{"$error":"#N/A"}},{"$f":"VLOOKUP(B526,'A partager'!$A$6:$A$738,1,0)","v":{"$error":"#N/A"}}]
["A porter seul_516","A partager_516",516,{"$f":"VLOOKUP(A527,'A porter seul'!$A$6:$A$679,1,0)","v":{"$error":"#N/A"}},{"$f":"VLOOKUP(B527,'A partager'!$A$6:$A$738,1,0)","v":{"$error":"#N/A"}}]
["A porter seul_517","A partager_517",517,{"$f":"VLOOKUP(A528,'A porter seul'!$A$6:$A$679,1,0)","v":{"$error":"#N/A"}},{"$f":"VLOOKUP(B528,'A partager'!$A$6:$A$738,1,0)","v":{"$error":"#N/A"}}]
["A porter seul_518","A partager_518",518,{"$f":"VLOOKUP(A529,'A porter seul'!$A$6:$A$679,1,0)","v":{"$error":"#N/A"}},{"$f":"VLOOKUP(B529,'A partager'!$A$6:$A$738,1,0)","v":{"$error":"#N/A"}}]
["A porter seul_519","A partager_519",519,{"$f":"VLOOKUP(A530,'A porter seul'!$A$6:$A$679,1,0)","v":{"$error":"#N/A"}},{"$f":"VLOOKUP(B530,'A partager'!$A$6:$A$738,1,0)","v":{"$error":"#N/A"}}]
["A porter seul_520","A partager_520",520,{"$f":"VLOOKUP(A531,'A porter seul'!$A$6:$A$679,1,0)","v":{"$error":"#N/A"}},{"$f":"VLOOKUP(B531,'A partager'!$A$6:$A$738,1,0)","v":{"$error":"#N/A"}}]
["A porter seul_521","A partager_521",521,{"$f":"VLOOKUP(A532,'A porter seul'!$A$6:$A$679,1,0)","v":{"$error":"#N/A"}},{"$f":"VLOOKUP(B532,'A partager'!$A$6:$A$738,1,0)","v":{"$error":"#N/A"}}]
["A porter seul_522","A partager_522",522,{"$f":"VLOOKUP(A533,'A porter seul'!$A$6:$A$679,1,0)","v":{"$error":"#N/A"}},{"$f":"VLOOKUP(B533,'A partager'!$A$6:$A$738,1,0)","v":{"$error":"#N/A"}}]
["A porter seul_523","A partager_523",523,{"$f":"VLOOKUP(A534,'A porter seul'!$A$6:$A$679,1,0)","v":{"$error":"#N/A"}},{"$f":"VLOOKUP(B534,'A partager'!$A$6:$A$738,1,0)","v":{"$error":"#N/A"}}]
["A porter seul_524","A partager_524",524,{"$f":"VLOOKUP(A535,'A porter seul'!$A$6:$A$679,1,0)","v":{"$error":"#N/A"}},{"$f":"VLOOKUP(B535,'A partager'!$A$6:$A$738,1,0)","v":{"$error":"#N/A"}}]
["A porter seul_525","A partager_525",525,{"$f":"VLOOKUP(A536,'A porter seul'!$A$6:$A$679,1,0)","v":{"$error":"#N/A"}},{"$f":"VLOOKUP(B536,'A partager'!$A$6:$A$738,1,0)","v":{"$error":"#N/A"}}]
["A porter seul_526","A partager_526",526,{"$f":"VLOOKUP(A537,'A porter seul'!$A$6:$A$679,1,0)","v":{"$error":"#N/A"}},{"$f":"VLOOKUP(B537,'A partager'!$A$6:$A$738,1,0)","v":{"$error":"#N/A"}}]
["A porter seul_527","A partager_527",527,{"$f":"VLOOKUP(A538,'A porter seul'!$A$6:$A$679,1,0)","v":{"$error":"#N/A"}},{"$f":"VLOOKUP(B538,'A partager'!$A$6:$A$738,1,0)","v":{"$error":"#N/A"}}]
["A porter seul_528","A partager_528",528,{"$f":"VLOOKUP(A539,'A porter seul'!$A$6:$A$679,1,0)","v":{"$error":"#N/A"}},{"$f":"VLOOKUP(B539,'A partager'!$A$6:$A$738,1,0)","v":{"$error":"#N/A"}}]
["A porter seul_529","A partager_529",529,{"$f":"VLOOKUP(A540,'A porter seul'!$A$6:$A$679,1,0)","v":{"$error":"#N/A"}},{"$f":"VLOOKUP(B540,'A partager'!$A$6:$A$738,1,0)","v":{"$error":"#N/A"}}]
["A porter seul_530","A partager_530",530,{"$f":"VLOOKUP(A541,'A porter seul'!$A$6:$A$679,1,0)","v":{"$error":"#N/A"}},{"$f":"VLOOKUP(B541,'A partager'!$A$6:$A$738,1,0)","v":{"$error":"#N/A"}}]
["A porter seul_531","A partager_531",531,{"$f":"VLOOKUP(A542,'A porter seul'!$A$6:$A$679,1,0)","v":{"$error":"#N/A"}},{"$f":"VLOOKUP(B542,'A partager'!$A$6:$A$738,1,0)","v":{"$error":"#N/A"}}]
["A porter seul_532","A partager_532",532,{"$f":"VLOOKUP(A543,'A porter seul'!$A$6:$A$679,1,0)","v":{"$error":"#N/A"}},{"$f":"VLOOKUP(B543,'A partager'!$A$6:$A$738,1,0)","v":{"$error":"#N/A"}}]
["A porter seul_533","A partager_533",533,{"$f":"VLOOKUP(A544,'A porter seul'!$A$6:$A$679,1,0)","v":{"$error":"#N/A"}},{"$f":"VLOOKUP(B544,'A partager'!$A$6:$A$738,1,0)","v":{"$error":"#N/A"}}]
["A porter seul_534","A partager_534",534,{"$f":"VLOOKUP(A545,'A porter seul'!$A$6:$A$679,1,0)","v":{"$error":"#N/A"}},{"$f":"VLOOKUP(B545,'A partager'!$A$6:$A$738,1,0)","v":{"$error":"#N/A"}}]
["A porter seul_535","A partager_535",535,{"$f":"VLOOKUP(A546,'A porter seul'!$A$6:$A$679,1,0)","v":{"$error":"#N/A"}},{"$f":"VLOOKUP(B546,'A partager'!$A$6:$A$738,1,0)","v":{"$error":"#N/A"}}]
["A porter seul_536","A partager_536",536,{"$f":"VLOOKUP(A547,'A porter seul'!$A$6:$A$679,1,0)","v":{"$error":"#N/A"}},{"$f":"VLOOKUP(B547,'A partager'!$A$6:$A$738,1,0)","v":{"$error":"#N/A"}}]
["A porter seul_537","A partager_537",537,{"$f":"VLOOKUP(A548,'A porter seul'!$A$6:$A$679,1,0)","v":{"$error":"#N/A"}},{"$f":"VLOOKUP(B548,'A partager'!$A$6:$A$738,1,0)","v":{"$error":"#N/A"}}]
["A porter seul_538","A partager_538",538,{"$f":"VLOOKUP(A549,'A porter seul'!$A$6:$A$679,1,0)","v":{"$error":"#N/A"}},{"$f":"VLOOKUP(B549,'A partager'!$A$6:$A$738,1,0)","v":{"$error":"#N/A"}}]
["A porter seul_539","A partager_539",539,{"$f":"VLOOKUP(A550,'A porter seul'!$A$6:$A$679,1,0)","v":{"$error":"#N/A"}},{"$f":"VLOOKUP(B550,'A partager'!$A$6:$A$738,1,0)","v":{"$error":"#N/A"}}]
["A porter seul_540","A partager_540",540,{"$f":"VLOOKUP(A551,'A porter seul'!$A$6:$A$679,1,0)","v":{"$error":"#N/A"}},{"$f":"VLOOKUP(B551,'A partager'!$A$6:$A$738,1,0)","v":{"$error":"#N/A"}}]
["A porter seul_541","A partager_541",541,{"$f":"VLOOKUP(A552,'A porter seul'!$A$6:$A$679,1,0)","v":{"$error":"#N/A"}},{"$f":"VLOOKUP(B552,'A partager'!$A$6:$A$738,1,0)","v":{"$error":"#N/A"}}]
["A porter seul_542","A partager_542",542,{"$f":"VLOOKUP(A553,'A porter seul'!$A$6:$A$679,1,0)","v":{"$error":"#N/A"}},{"$f":"VLOOKUP(B553,'A partager'!$A$6:$A$738,1,0)","v":{"$error":"#N/A"}}]
["A porter seul_543","A partager_543",543,{"$f":"VLOOKUP(A554,'A porter seul'!$A$6:$A$679,1,0)","v":{"$error":"#N/A"}},{"$f":"VLOOKUP(B554,'A partager'!$A$6:$A$738,1,0)","v":{"$error":"#N/A"}}]
["A porter seul_544","A partager_544",544,{"$f":"VLOOKUP(A555,'A porter seul'!$A$6:$A$679,1,0)","v":{"$error":"#N/A"}},{"$f":"VLOOKUP(B555,'A partager'!$A$6:$A$738,1,0)","v":{"$error":"#N/A"}}]
["A porter seul_545","A partager_545",545,{"$f":"VLOOKUP(A556,'A porter seul'!$A$6:$A$679,1,0)","v":{"$error":"#N/A"}},{"$f":"VLOOKUP(B556,'A partager'!$A$6:$A$738,1,0)","v":{"$error":"#N/A"}}]
["A porter seul_546","A partager_546",546,{"$f":"VLOOKUP(A557,'A porter seul'!$A$6:$A$679,1,0)","v":{"$error":"#N/A"}},{"$f":"VLOOKUP(B557,'A partager'!$A$6:$A$738,1,0)","v":{"$error":"#N/A"}}]
["A porter seul_547","A partager_547",547,{"$f":"VLOOKUP(A558,'A porter seul'!$A$6:$A$679,1,0)","v":{"$error":"#N/A"}},{"$f":"VLOOKUP(B558,'A partager'!$A$6:$A$738,1,0)","v":{"$error":"#N/A"}}]
["A porter seul_548","A partager_548",548,{"$f":"VLOOKUP(A559,'A porter seul'!$A$6:$A$679,1,0)","v":{"$error":"#N/A"}},{"$f":"VLOOKUP(B559,'A partager'!$A$6:$A$738,1,0)","v":{"$error":"#N/A"}}]
["A porter seul_549","A partager_549",549,{"$f":"VLOOKUP(A560,'A porter seul'!$A$6:$A$679,1,0)","v":{"$error":"#N/A"}},{"$f":"VLOOKUP(B560,'A partager'!$A$6:$A$738,1,0)","v":{"$error":"#N/A"}}]
["A porter seul_550","A partager_550",550,{"$f":"VLOOKUP(A561,'A porter seul'!$A$6:$A$679,1,0)","v":{"$error":"#N/A"}},{"$f":"VLOOKUP(B561,'A partager'!$A$6:$A$738,1,0)","v":{"$error":"#N/A"}}]
["A porter seul_551","A partager_551",551,{"$f":"VLOOKUP(A562,'A porter seul'!$A$6:$A$679,1,0)","v":{"$error":"#N/A"}},{"$f":"VLOOKUP(B562,'A partager'!$A$6:$A$738,1,0)","v":{"$error":"#N/A"}}]
["A porter seul_552","A partager_552",552,{"$f":"VLOOKUP(A563,'A porter seul'!$A$6:$A$679,1,0)","v":{"$error":"#N/A"}},{"$f":"VLOOKUP(B563,'A partager'!$A$6:$A$738,1,0)","v":{"$error":"#N/A"}}]
["A porter seul_553","A partager_553",553,{"$f":"VLOOKUP(A564,'A porter seul'!$A$6:$A$679,1,0)","v":{"$error":"#N/A"}},{"$f":"VLOOKUP(B564,'A partager'!$A$6:$A$738,1,0)","v":{"$error":"#N/A"}}]
["A porter seul_554","A partager_554",554,{"$f":"VLOOKUP(A565,'A porter seul'!$A$6:$A$679,1,0)","v":{"$error":"#N/A"}},{"$f":"VLOOKUP(B565,'A partager'!$A$6:$A$738,1,0)","v":{"$error":"#N/A"}}]
["A porter seul_555","A partager_555",555,{"$f":"VLOOKUP(A566,'A porter seul'!$A$6:$A$679,1,0)","v":{"$error":"#N/A"}},{"$f":"VLOOKUP(B566,'A partager'!$A$6:$A$738,1,0)","v":{"$error":"#N/A"}}]
["A porter seul_556","A partager_556",556,{"$f":"VLOOKUP(A567,'A porter seul'!$A$6:$A$679,1,0)","v":{"$error":"#N/A"}},{"$f":"VLOOKUP(B567,'A partager'!$A$6:$A$738,1,0)","v":{"$error":"#N/A"}}]
["A porter seul_557","A partager_557",557,{"$f":"VLOOKUP(A568,'A porter seul'!$A$6:$A$679,1,0)","v":{"$error":"#N/A"}},{"$f":"VLOOKUP(B568,'A partager'!$A$6:$A$738,1,0)","v":{"$error":"#N/A"}}]
["A porter seul_558","A partager_558",558,{"$f":"VLOOKUP(A569,'A porter seul'!$A$6:$A$679,1,0)","v":{"$error":"#N/A"}},{"$f":"VLOOKUP(B569,'A partager'!$A$6:$A$738,1,0)","v":{"$error":"#N/A"}}]
["A porter seul_559","A partager_559",559,{"$f":"VLOOKUP(A570,'A porter seul'!$A$6:$A$679,1,0)","v":{"$error":"#N/A"}},{"$f":"VLOOKUP(B570,'A partager'!$A$6:$A$738,1,0)","v":{"$error":"#N/A"}}]
["A porter seul_560","A partager_560",560,{"$f":"VLOOKUP(A571,'A porter seul'!$A$6:$A$679,1,0)","v":{"$error":"#N/A"}},{"$f":"VLOOKUP(B571,'A partager'!$A$6:$A$738,1,0)","v":{"$error":"#N/A"}}]
["A porter seul_561","A partager_561",561,{"$f":"VLOOKUP(A572,'A porter seul'!$A$6:$A$679,1,0)","v":{"$error":"#N/A"}},{"$f":"VLOOKUP(B572,'A partager'!$A$6:$A$738,1,0)","v":{"$error":"#N/A"}}]
["A porter seul_562","A partager_562",562,{"$f":"VLOOKUP(A573,'A porter seul'!$A$6:$A$679,1,0)","v":{"$error":"#N/A"}},{"$f":"VLOOKUP(B573,'A partager'!$A$6:$A$738,1,0)","v":{"$error":"#N/A"}}]
["A porter seul_563","A partager_563",563,{"$f":"VLOOKUP(A574,'A porter seul'!$A$6:$A$679,1,0)","v":{"$error":"#N/A"}},{"$f":"VLOOKUP(B574,'A partager'!$A$6:$A$738,1,0)","v":{"$error":"#N/A"}}]
["A porter seul_564","A partager_564",564,{"$f":"VLOOKUP(A575,'A porter seul'!$A$6:$A$679,1,0)","v":{"$error":"#N/A"}},{"$f":"VLOOKUP(B575,'A partager'!$A$6:$A$738,1,0)","v":{"$error":"#N/A"}}]
["A porter seul_565","A partager_565",565,{"$f":"VLOOKUP(A576,'A porter seul'!$A$6:$A$679,1,0)","v":{"$error":"#N/A"}},{"$f":"VLOOKUP(B576,'A partager'!$A$6:$A$738,1,0)","v":{"$error":"#N/A"}}]
["A porter seul_566","A partager_566",566,{"$f":"VLOOKUP(A577,'A porter seul'!$A$6:$A$679,1,0)","v":{"$error":"#N/A"}},{"$f":"VLOOKUP(B577,'A partager'!$A$6:$A$738,1,0)","v":{"$error":"#N/A"}}]
["A porter seul_567","A partager_567",567,{"$f":"VLOOKUP(A578,'A porter seul'!$A$6:$A$679,1,0)","v":{"$error":"#N/A"}},{"$f":"VLOOKUP(B578,'A partager'!$A$6:$A$738,1,0)","v":{"$error":"#N/A"}}]
["A porter seul_568","A partager_568",568,{"$f":"VLOOKUP(A579,'A porter seul'!$A$6:$A$679,1,0)","v":{"$error":"#N/A"}},{"$f":"VLOOKUP(B579,'A partager'!$A$6:$A$738,1,0)","v":{"$error":"#N/A"}}]
["A porter seul_569","A partager_569",569,{"$f":"VLOOKUP(A580,'A porter seul'!$A$6:$A$679,1,0)","v":{"$error":"#N/A"}},{"$f":"VLOOKUP(B580,'A partager'!$A$6:$A$738,1,0)","v":{"$error":"#N/A"}}]
["A porter seul_570","A partager_570",570,{"$f":"VLOOKUP(A581,'A porter seul'!$A$6:$A$679,1,0)","v":{"$error":"#N/A"}},{"$f":"VLOOKUP(B581,'A partager'!$A$6:$A$738,1,0)","v":{"$error":"#N/A"}}]
["A porter seul_571","A partager_571",571,{"$f":"VLOOKUP(A582,'A porter seul'!$A$6:$A$679,1,0)","v":{"$error":"#N/A"}},{"$f":"VLOOKUP(B582,'A partager'!$A$6:$A$738,1,0)","v":{"$error":"#N/A"}}]
["A porter seul_572","A partager_572",572,{"$f":"VLOOKUP(A583,'A porter seul'!$A$6:$A$679,1,0)","v":{"$error":"#N/A"}},{"$f":"VLOOKUP(B583,'A partager'!$A$6:$A$738,1,0)","v":{"$error":"#N/A"}}]
["A porter seul_573","A partager_573",573,{"$f":"VLOOKUP(A584,'A porter seul'!$A$6:$A$679,1,0)","v":{"$error":"#N/A"}},{"$f":"VLOOKUP(B584,'A partager'!$A$6:$A$738,1,0)","v":{"$error":"#N/A"}}]
["A porter seul_574","A partager_574",574,{"$f":"VLOOKUP(A585,'A porter seul'!$A$6:$A$679,1,0)","v":{"$error":"#N/A"}},{"$f":"VLOOKUP(B585,'A partager'!$A$6:$A$738,1,0)","v":{"$error":"#N/A"}}]
["A porter seul_575","A partager_575",575,{"$f":"VLOOKUP(A586,'A porter seul'!$A$6:$A$679,1,0)","v":{"$error":"#N/A"}},{"$f":"VLOOKUP(B586,'A partager'!$A$6:$A$738,1,0)","v":{"$error":"#N/A"}}]
["A porter seul_576","A partager_576",576,{"$f":"VLOOKUP(A587,'A porter seul'!$A$6:$A$679,1,0)","v":{"$error":"#N/A"}},{"$f":"VLOOKUP(B587,'A partager'!$A$6:$A$738,1,0)","v":{"$error":"#N/A"}}]
["A porter seul_577","A partager_577",577,{"$f":"VLOOKUP(A588,'A porter seul'!$A$6:$A$679,1,0)","v":{"$error":"#N/A"}},{"$f":"VLOOKUP(B588,'A partager'!$A$6:$A$738,1,0)","v":{"$error":"#N/A"}}]
[{"$f":"\"A porter seul_\"&C589","v":"A porter seul_578"},{"$f":"\"A partager_\"&C589","v":"A partager_578"},578,{"$f":"VLOOKUP(A589,'A porter seul'!$A$6:$A$679,1,0)","v":{"$error":"#N/A"}},{"$f":"VLOOKUP(B589,'A partager'!$A$6:$A$738,1,0)","v":{"$error":"#N/A"}}]
["A porter seul_579","A partager_579",579,{"$f":"VLOOKUP(A590,'A porter seul'!$A$6:$A$679,1,0)","v":{"$error":"#N/A"}},{"$f":"VLOOKUP(B590,'A partager'!$A$6:$A$738,1,0)","v":{"$error":"#N/A"}}]
["A porter seul_580","A partager_580",580,{"$f":"VLOOKUP(A591,'A porter seul'!$A$6:$A$679,1,0)","v":{"$error":"#N/A"}},{"$f":"VLOOKUP(B591,'A partager'!$A$6:$A$738,1,0)","v":{"$error":"#N/A"}}]
["A porter seul_581","A partager_581",581,{"$f":"VLOOKUP(A592,'A porter seul'!$A$6:$A$679,1,0)","v":{"$error":"#N/A"}},{"$f":"VLOOKUP(B592,'A partager'!$A$6:$A$738,1,0)","v":{"$error":"#N/A"}}]
["A porter seul_582","A partager_582",582,{"$f":"VLOOKUP(A593,'A porter seul'!$A$6:$A$679,1,0)","v":{"$error":"#N/A"}},{"$f":"VLOOKUP(B593,'A partager'!$A$6:$A$738,1,0)","v":{"$error":"#N/A"}}]
["A porter seul_583","A partager_583",583,{"$f":"VLOOKUP(A594,'A porter seul'!$A$6:$A$679,1,0)","v":{"$error":"#N/A"}},{"$f":"VLOOKUP(B594,'A partager'!$A$6:$A$738,1,0)","v":{"$error":"#N/A"}}]
["A porter seul_584","A partager_584",584,{"$f":"VLOOKUP(A595,'A porter seul'!$A$6:$A$679,1,0)","v":{"$error":"#N/A"}},{"$f":"VLOOKUP(B595,'A partager'!$A$6:$A$738,1,0)","v":{"$error":"#N/A"}}]
["A porter seul_585","A partager_585",585,{"$f":"VLOOKUP(A596,'A porter seul'!$A$6:$A$679,1,0)","v":{"$error":"#N/A"}},{"$f":"VLOOKUP(B596,'A partager'!$A$6:$A$738,1,0)","v":{"$error":"#N/A"}}]
["A porter seul_586","A partager_586",586,{"$f":"VLOOKUP(A597,'A porter seul'!$A$6:$A$679,1,0)","v":{"$error":"#N/A"}},{"$f":"VLOOKUP(B597,'A partager'!$A$6:$A$738,1,0)","v":{"$error":"#N/A"}}]
["A porter seul_587","A partager_587",587,{"$f":"VLOOKUP(A598,'A porter seul'!$A$6:$A$679,1,0)","v":{"$error":"#N/A"}},{"$f":"VLOOKUP(B598,'A partager'!$A$6:$A$738,1,0)","v":{"$error":"#N/A"}}]
["A porter seul_588","A partager_588",588,{"$f":"VLOOKUP(A599,'A porter seul'!$A$6:$A$679,1,0)","v":{"$error":"#N/A"}},{"$f":"VLOOKUP(B599,'A partager'!$A$6:$A$738,1,0)","v":{"$error":"#N/A"}}]
["A porter seul_589","A partager_589",589,{"$f":"VLOOKUP(A600,'A porter seul'!$A$6:$A$679,1,0)","v":{"$error":"#N/A"}},{"$f":"VLOOKUP(B600,'A partager'!$A$6:$A$738,1,0)","v":{"$error":"#N/A"}}]
["A porter seul_590","A partager_590",590,{"$f":"VLOOKUP(A601,'A porter seul'!$A$6:$A$679,1,0)","v":{"$error":"#N/A"}},{"$f":"VLOOKUP(B601,'A partager'!$A$6:$A$738,1,0)","v":{"$error":"#N/A"}}]
["A porter seul_591","A partager_591",591,{"$f":"VLOOKUP(A602,'A porter seul'!$A$6:$A$679,1,0)","v":{"$error":"#N/A"}},{"$f":"VLOOKUP(B602,'A partager'!$A$6:$A$738,1,0)","v":{"$error":"#N/A"}}]
["A porter seul_592","A partager_592",592,{"$f":"VLOOKUP(A603,'A porter seul'!$A$6:$A$679,1,0)","v":{"$error":"#N/A"}},{"$f":"VLOOKUP(B603,'A partager'!$A$6:$A$738,1,0)","v":{"$error":"#N/A"}}]
["A porter seul_593","A partager_593",593,{"$f":"VLOOKUP(A604,'A porter seul'!$A$6:$A$679,1,0)","v":{"$error":"#N/A"}},{"$f":"VLOOKUP(B604,'A partager'!$A$6:$A$738,1,0)","v":{"$error":"#N/A"}}]
["A porter seul_594","A partager_594",594,{"$f":"VLOOKUP(A605,'A porter seul'!$A$6:$A$679,1,0)","v":{"$error":"#N/A"}},{"$f":"VLOOKUP(B605,'A partager'!$A$6:$A$738,1,0)","v":{"$error":"#N/A"}}]
["A porter seul_595","A partager_595",595,{"$f":"VLOOKUP(A606,'A porter seul'!$A$6:$A$679,1,0)","v":{"$error":"#N/A"}},{"$f":"VLOOKUP(B606,'A partager'!$A$6:$A$738,1,0)","v":{"$error":"#N/A"}}]
["A porter seul_596","A partager_596",596,{"$f":"VLOOKUP(A607,'A porter seul'!$A$6:$A$679,1,0)","v":{"$error":"#N/A"}},{"$f":"VLOOKUP(B607,'A partager'!$A$6:$A$738,1,0)","v":{"$error":"#N/A"}}]
["A porter seul_597","A partager_597",597,{"$f":"VLOOKUP(A608,'A porter seul'!$A$6:$A$679,1,0)","v":{"$error":"#N/A"}},{"$f":"VLOOKUP(B608,'A partager'!$A$6:$A$738,1,0)","v":{"$error":"#N/A"}}]
["A porter seul_598","A partager_598",598,{"$f":"VLOOKUP(A609,'A porter seul'!$A$6:$A$679,1,0)","v":{"$error":"#N/A"}},{"$f":"VLOOKUP(B609,'A partager'!$A$6:$A$738,1,0)","v":{"$error":"#N/A"}}]
["A porter seul_599","A partager_599",599,{"$f":"VLOOKUP(A610,'A porter seul'!$A$6:$A$679,1,0)","v":{"$error":"#N/A"}},{"$f":"VLOOKUP(B610,'A partager'!$A$6:$A$738,1,0)","v":{"$error":"#N/A"}}]
["A porter seul_600","A partager_600",600,{"$f":"VLOOKUP(A611,'A porter seul'!$A$6:$A$679,1,0)","v":{"$error":"#N/A"}},{"$f":"VLOOKUP(B611,'A partager'!$A$6:$A$738,1,0)","v":{"$error":"#N/A"}}]
["A porter seul_601","A partager_601",601,{"$f":"VLOOKUP(A612,'A porter seul'!$A$6:$A$679,1,0)","v":{"$error":"#N/A"}},{"$f":"VLOOKUP(B612,'A partager'!$A$6:$A$738,1,0)","v":{"$error":"#N/A"}}]
["A porter seul_602","A partager_602",602,{"$f":"VLOOKUP(A613,'A porter seul'!$A$6:$A$679,1,0)","v":{"$error":"#N/A"}},{"$f":"VLOOKUP(B613,'A partager'!$A$6:$A$738,1,0)","v":{"$error":"#N/A"}}]
["A porter seul_603","A partager_603",603,{"$f":"VLOOKUP(A614,'A porter seul'!$A$6:$A$679,1,0)","v":{"$error":"#N/A"}},{"$f":"VLOOKUP(B614,'A partager'!$A$6:$A$738,1,0)","v":{"$error":"#N/A"}}]
["A porter seul_604","A partager_604",604,{"$f":"VLOOKUP(A615,'A porter seul'!$A$6:$A$679,1,0)","v":{"$error":"#N/A"}},{"$f":"VLOOKUP(B615,'A partager'!$A$6:$A$738,1,0)","v":{"$error":"#N/A"}}]
["A porter seul_605","A partager_605",605,{"$f":"VLOOKUP(A616,'A porter seul'!$A$6:$A$679,1,0)","v":{"$error":"#N/A"}},{"$f":"VLOOKUP(B616,'A partager'!$A$6:$A$738,1,0)","v":{"$error":"#N/A"}}]
["A porter seul_606","A partager_606",606,{"$f":"VLOOKUP(A617,'A porter seul'!$A$6:$A$679,1,0)","v":{"$error":"#N/A"}},{"$f":"VLOOKUP(B617,'A partager'!$A$6:$A$738,1,0)","v":{"$error":"#N/A"}}]
["A porter seul_607","A partager_607",607,{"$f":"VLOOKUP(A618,'A porter seul'!$A$6:$A$679,1,0)","v":{"$error":"#N/A"}},{"$f":"VLOOKUP(B618,'A partager'!$A$6:$A$738,1,0)","v":{"$error":"#N/A"}}]
["A porter seul_608","A partager_608",608,{"$f":"VLOOKUP(A619,'A porter seul'!$A$6:$A$679,1,0)","v":{"$error":"#N/A"}},{"$f":"VLOOKUP(B619,'A partager'!$A$6:$A$738,1,0)","v":{"$error":"#N/A"}}]
["A porter seul_609","A partager_609",609,{"$f":"VLOOKUP(A620,'A porter seul'!$A$6:$A$679,1,0)","v":{"$error":"#N/A"}},{"$f":"VLOOKUP(B620,'A partager'!$A$6:$A$738,1,0)","v":{"$error":"#N/A"}}]
["A porter seul_610","A partager_610",610,{"$f":"VLOOKUP(A621,'A porter seul'!$A$6:$A$679,1,0)","v":{"$error":"#N/A"}},{"$f":"VLOOKUP(B621,'A partager'!$A$6:$A$738,1,0)","v":{"$error":"#N/A"}}]
["A porter seul_611","A partager_611",611,{"$f":"VLOOKUP(A622,'A porter seul'!$A$6:$A$679,1,0)","v":{"$error":"#N/A"}},{"$f":"VLOOKUP(B622,'A partager'!$A$6:$A$738,1,0)","v":{"$error":"#N/A"}}]
["A porter seul_612","A partager_612",612,{"$f":"VLOOKUP(A623,'A porter seul'!$A$6:$A$679,1,0)","v":{"$error":"#N/A"}},{"$f":"VLOOKUP(B623,'A partager'!$A$6:$A$738,1,0)","v":{"$error":"#N/A"}}]
["A porter seul_613","A partager_613",613,{"$f":"VLOOKUP(A624,'A porter seul'!$A$6:$A$679,1,0)","v":{"$error":"#N/A"}},{"$f":"VLOOKUP(B624,'A partager'!$A$6:$A$738,1,0)","v":{"$error":"#N/A"}}]
["A porter seul_614","A partager_614",614,{"$f":"VLOOKUP(A625,'A porter seul'!$A$6:$A$679,1,0)","v":{"$error":"#N/A"}},{"$f":"VLOOKUP(B625,'A partager'!$A$6:$A$738,1,0)","v":{"$error":"#N/A"}}]
["A porter seul_615","A partager_615",615,{"$f":"VLOOKUP(A626,'A porter seul'!$A$6:$A$679,1,0)","v":{"$error":"#N/A"}},{"$f":"VLOOKUP(B626,'A partager'!$A$6:$A$738,1,0)","v":{"$error":"#N/A"}}]
["A porter seul_616","A partager_616",616,{"$f":"VLOOKUP(A627,'A porter seul'!$A$6:$A$679,1,0)","v":{"$error":"#N/A"}},{"$f":"VLOOKUP(B627,'A partager'!$A$6:$A$738,1,0)","v":{"$error":"#N/A"}}]
["A porter seul_617","A partager_617",617,{"$f":"VLOOKUP(A628,'A porter seul'!$A$6:$A$679,1,0)","v":{"$error":"#N/A"}},{"$f":"VLOOKUP(B628,'A partager'!$A$6:$A$738,1,0)","v":{"$error":"#N/A"}}]
["A porter seul_618","A partager_618",618,{"$f":"VLOOKUP(A629,'A porter seul'!$A$6:$A$679,1,0)","v":{"$error":"#N/A"}},{"$f":"VLOOKUP(B629,'A partager'!$A$6:$A$738,1,0)","v":{"$error":"#N/A"}}]
["A porter seul_619","A partager_619",619,{"$f":"VLOOKUP(A630,'A porter seul'!$A$6:$A$679,1,0)","v":{"$error":"#N/A"}},{"$f":"VLOOKUP(B630,'A partager'!$A$6:$A$738,1,0)","v":{"$error":"#N/A"}}]
["A porter seul_620","A partager_620",620,{"$f":"VLOOKUP(A631,'A porter seul'!$A$6:$A$679,1,0)","v":{"$error":"#N/A"}},{"$f":"VLOOKUP(B631,'A partager'!$A$6:$A$738,1,0)","v":{"$error":"#N/A"}}]
["A porter seul_621","A partager_621",621,{"$f":"VLOOKUP(A632,'A porter seul'!$A$6:$A$679,1,0)","v":{"$error":"#N/A"}},{"$f":"VLOOKUP(B632,'A partager'!$A$6:$A$738,1,0)","v":{"$error":"#N/A"}}]

{"sheet":"24 forces de caractère","index":15,"n_rows":25,"n_cols":4,"rows_kept":25,"cut":false,"hidden":false,"merged":[]}
["Les 24 forces de caractère :","Vertu associée","Comportement associé","Définition"]
["Honnêteté, intégrité, et sincérité","COURAGE","Agir de façon sincère, authentique et responsable, dire la vérité.","Vous êtes quelqu’un d’honnête. Non seulement vous dites la vérité, mais vous vivez votre vie d’une façon sincère et authentique. Vous savez garder les pieds sur terre, et cela sans prétention ; vous êtes quelqu’un de « vrai »."]
["Courage et vaillance","COURAGE","Agir selon ses convictions malgré la peur, la douleur ou la difficulté.","Vous êtes une personne courageuse qui ne recule pas devant la menace, les défis, les difficultés ou la douleur. Vous prenez la parole en faveur de ce qui est juste même s’il y a de la résistance. Vous agissez selon vos convictions."]
["Joie de vivre, enthousiasme, vigueur et énergie","COURAGE","Se lancer dans quelque chose avec joie, dynamisme et admiration.","Quelle que soit la tâche qui vous est confiée, vous l’abordez avec passion et énergie. Vous ne faites pas les choses à moitié et vous ne faites rien sans enthousiasme. Pour vous, la vie est une aventure."]
["Assiduité, application, et persévérance","COURAGE","Chercher à poursuivre son action jusqu’à son terme malgré les obstacles.","Quel que soit le projet, vous « abattez le travail » dans les plus brefs délais. Vous ne vous laissez pas distraire lorsque vous travaillez, et vous tirez de la satisfaction de l’accomplissement des tâches."]
["Créativité, ingéniosité, et originalité","SAGESSE","Trouver de nouvelles façons (constructives) de penser et d’agir","Penser à de nouvelles manières de faire les choses fait partie intégrante de votre personnalité. Vous ne vous contentez jamais de faire les choses de façon conventionnelle si une meilleure manière est possible."]
["Discernement, pensée critique, et ouverture d’esprit","SAGESSE","Analyser de façon rationnelle et savoir se remettre en question","Bien réfléchir aux choses et en examiner tous les aspects sont des points importants de votre personnalité. Vous ne tirez pas de conclusions hâtives et vous ne vous appuyez que sur des indications sûres pour prendre vos décisions."]
["Curiosité et intérêt accordé au monde","SAGESSE","Trouver du plaisir dans la découverte de nouvelles choses","Vous vous intéressez à tout. Vous posez toujours des questions, et vous trouvez tous les sujets et toutes les matières fascinantes. Vous aimez l’exploration et les découvertes."]
["Perspective","SAGESSE"," Sagacité : Avoir une vision perspicace du monde et donner des conseils judicieux","Bien que vous ne vous considériez pas comme un sage, vos amis vous considèrent ainsi. Ils ont de l’estime pour votre capacité à considérer les choses avec du recul et se tournent vers vous lorsqu’ils ont besoin de conseils. Vous avez une manière de voir les choses qui semble aussi logique aux autres qu’à vous-même."]
["Amour de l’étude, de l’apprentissage","SAGESSE","Soif de connaissance\nChercher à apprendre et acquérir de nouvelles compétences","Vous adorez apprendre de nouvelles choses, que ce soit dans une classe ou par vous-même. Vous avez toujours aimé l’école, la lecture, les musées. Où que vous soyez vous trouvez l’opportunité d’apprendre."]
["Gratitude","TRANSCENDANCE","Se montrer reconnaissant pour les bonnes choses qui se produisent, remercier","Vous êtes conscient des bonnes choses qui vous arrivent et vous ne considérez jamais qu’elles vous sont dues. Vos amis et les membres de votre famille savent que vous êtes une personne reconnaissante parce que vous prenez toujours le temps d’exprimer vos remerciements."]
["Espoir, optimisme, et anticipation du futur","TRANSCENDANCE","Agir de manière à ce que les événement positifs attendus dans l’avenir surviennent","Vous vous attendez au mieux dans les temps à venir et vous travaillez pour arriver à cela. Vous croyez dans le fait que l’avenir est quelque chose que vous pouvez contrôler."]
["Reconnaissance de la beauté","TRANSCENDANCE","Emerveillement = Remarquer et apprécier la beauté, l’excellence et la performance","Vous remarquez et appréciez la beauté, l’excellence, et/ou les performances habiles dans tous les domaines de la vie, allant de la nature aux arts, aux mathématiques, aux sciences et à la vie quotidienne."]
["Spiritualité, religiosité, but dans la vie, et foi","TRANSCENDANCE","Trouver un sens cohérent et positif à son existence, à ses actions ou celles des autres","Vous avez des croyances fortes et cohérentes en ce qui concerne la raison d’être de l’univers et la puissance supérieure qui le régit. Vous connaissez votre place au sein du plus grand dessein. Vos croyances sont à l’origine de vos actions et sont une source de bien-être/réconfort pour vous."]
["Humour et enjouement","TRANSCENDANCE","Rire, faire rire, taquiner, faire des blagues, souligner ce qui est amusant dans une situation","Vous aimez rire et taquiner. Il vous est important d’apporter la joie et la bonne humeur. Vous essayer de voir le bon côté de chaque situation."]
["Impartialité, équité, et justice","JUSTICE","Équité : Agir en respectant ce qui est dû à chacun malgré ses sentiments personnels","Traiter les gens équitablement est l’un de vos principes permanents. Vous ne laissez pas vos sentiments personnels influencer vos décisions à propos des autres, vous donnez à chacun sa chance."]
["Citoyenneté, travail d’équipe et fidélité","JUSTICE","Loyauté : Rester fidèle à ses engagements et respecter les droits d’autrui","Vous excellez en tant que membre d’un groupe. Vous êtes un camarade fidèle et dédié. Vous faites toujours votre part du travail et travaillez dur pour le succès du groupe."]
["Leadership (capacité à diriger)","JUSTICE","Influence : Encourager un groupe à agir de façon constructive en y maintenant de bonnes relations","Vous excellez lorsqu’il s’agit de diriger : encourager un groupe à faire ce qu’il a à faire et maintenir l’harmonie au sein de ce groupe en faisant en sorte que chacun se sente inclus. Vous êtes doué pour organiser des activités et veiller à leur bon déroulement."]
["Le Pardon","TEMPERANCE","Indulgence : Pardonner à ceux qui ont mal agi, accepter leurs insuffisances, donner d’autres chances","Vous pardonnez à ceux qui vous ont fait du tort. Vous donnez toujours une seconde chance aux gens. Votre principe directeur est le pardon et non la vengeance."]
["Maîtrise de soi et autorégulation","TEMPERANCE","Autodiscipline : Garder le contrôle de ses comportements malgré les pressions émotionnelles ou externes","Vous maîtrisez consciemment ce que vous ressentez et ce que vous faites. Vous êtes discipliné. C’est vous qui contrôlez vos appétits et vos émotions, et pas l’inverse."]
["Précaution, prudence, et discrétion","TEMPERANCE","Prudence : Ne pas prendre de risques excessifs ou agir d’une façon qui pourrait devenir regrettable","Vous êtes quelqu’un de prudent et vos choix sont par conséquent des choix prudents. Vous ne faites ni ne dites de choses que vous risqueriez de regretter par la suite."]
["Modestie et humilité","TEMPERANCE","Humilité : S’abaisser volontairement à ses actes et ne pas faire preuve d’orgueil ou d’arrogance","Vous ne cherchez pas à être sur le devant de la scène et vous préférez laisser vos actes parler d’eux-mêmes. Vous ne vous considérez pas comme étant quelqu’un de spécial et les autres reconnaissent et ont de l’estime pour votre modestie."]
["Gentillesse et générosité","HUMANITE","Générosité : Offrir et agir de façon positive pour les autres, prendre soin d’eux","Vous êtes bon et généreux envers les autres et vous n’êtes jamais trop occupé pour rendre un service. Vous aimez faire de bonnes actions pour les gens, même lorsque vous ne les connaissez pas bien."]
["Intelligence sociale","HUMANITE","Prévenance : Agir en fonction des sentiments des autres, sans oublier les siens","Vous êtes conscient des sentiments des autres et de ce qui les motive, vous savez comment vous insérer dans différents cadres sociaux et vous savez comment mettre les autres à leur aise."]
["Capacité d’aimer et d’être aimé(e) ","HUMANITE","Amour : Chercher à rendre les relations positives plus intenses et profondes","Vous accordez de l’importance aux relations intimes avec les autres, en particulier celles dans lesquelles la confiance et l’attention sont réciproques. Les personnes desquelles vous vous sentez les plus proches sont celles qui se sentent proches de vous."]

{"sheet":"Forces","index":16,"n_rows":85,"n_cols":33,"rows_kept":85,"cut":false,"hidden":false,"merged":[[22,15,22,23],[22,6,22,14],[22,24,22,32],[4,3,4,14],[4,1,4,2]]}
[null,"Etape 5 : J’identifie les nouveaux ingrédients qui manquent dans mes rôles-costumes "]
[]
[null,"Site où réaliser le gratuitement le test des forces de caractère : https://www.viacharacter.org/"]
[]
[null,"Rappel de votre objectif :",null,{"$f":"+'Objectif SMARTER'!$A$6","v":"Je veux…"}]
[]
[null,"Pour liste déroulante :","Pour liste déroulante :"]
[]
[null,"Force n°1",1]
[null,"Force n°2",2]
[null,"Force n°3",3]
[null,"Force n°4",4]
[null,"Force n°5",5]
[null,null,6]
[null,null,7]
[null,null,8]
[null,null,9]
[null,null,10]
[]
[]
[null,"Complétez le tableau selon les résultats obtenus à votre test des forces de caractère :"]
[]
[null,null,null,null,null,null,"Pour les 5 forces principales / votre objectif, indiquez votre niveau actuel entre 1 et 10 / rôle-costume actuel (Selon votre ressenti /derniers mois).",null,null,null,null,null,null,null,null,"Pour les 5 forces principales/votre objectif, indiquez la note à atteindre sur 10/ rôle-costume /objectif visé ?\n(tous les rôles-costumes ne sont pas forcément concernés)",null,null,null,null,null,null,null,null,"Ecarts de notes = forces à développer davantage :"]
["Pour formules (à garder) :","N° de la force de caractère\n(1 = la plus forte, 24 = la moins développée)","Nom de la force de caractère (de la + développée à la - développée selon résultats du test)","Comportement associé","Utilité de cette force de caractère entre 1 (peu utile) et 10 (essentielle) pour atteindre mon objectif actuel ?","Parmi les forces de caractère utiles (>5/10), choisissez les 5 forces les plus importantes /votre objectif.\nForce 1 = la + importante.",{"$f":"'Synthèse 1'!B10","v":"Leader"},{"$f":"'Synthèse 1'!C10","v":"Manager (en interne)"},{"$f":"'Synthèse 1'!D10","v":"Partenaire commercial (à l'externe)"},{"$f":"'Synthèse 1'!E10","v":"Mari / Amant"},{"$f":"'Synthèse 1'!F10","v":"Père"},{"$f":"'Synthèse 1'!G10","v":"Oncle, fils, etc. (vie familiale)"},{"$f":"'Synthèse 1'!H10","v":"Ami / copain (vie sociale)"},{"$f":"'Synthèse 1'!I10","v":"Loisirs (activités, clubs, etc.)"},{"$f":"'Synthèse 1'!J10","v":"Dormeur"},{"$f":"'Synthèse 1'!B10","v":"Leader"},{"$f":"'Synthèse 1'!C10","v":"Manager (en interne)"},{"$f":"'Synthèse 1'!D10","v":"Partenaire commercial (à l'externe)"},{"$f":"'Synthèse 1'!E10","v":"Mari / Amant"},{"$f":"'Synthèse 1'!F10","v":"Père"},{"$f":"'Synthèse 1'!G10","v":"Oncle, fils, etc. (vie familiale)"},{"$f":"'Synthèse 1'!H10","v":"Ami / copain (vie sociale)"},{"$f":"'Synthèse 1'!I10","v":"Loisirs (activités, clubs, etc.)"},{"$f":"'Synthèse 1'!J10","v":"Dormeur"},{"$f":"'Synthèse 1'!B10","v":"Leader"},{"$f":"'Synthèse 1'!C10","v":"Manager (en interne)"},{"$f":"'Synthèse 1'!D10","v":"Partenaire commercial (à l'externe)"},{"$f":"'Synthèse 1'!E10","v":"Mari / Amant"},{"$f":"'Synthèse 1'!F10","v":"Père"},{"$f":"'Synthèse 1'!G10","v":"Oncle, fils, etc. (vie familiale)"},{"$f":"'Synthèse 1'!H10","v":"Ami / copain (vie sociale)"},{"$f":"'Synthèse 1'!I10","v":"Loisirs (activités, clubs, etc.)"},{"$f":"'Synthèse 1'!J10","v":"Dormeur"}]
[{"$f":"+F25","v":"Force n°1"},1,"Courage et vaillance",{"$f":"VLOOKUP(C25,'24 forces de caractère'!$A$1:$C$25,3,0)","v":"Agir selon ses convictions malgré la peur, la douleur ou la difficulté."},10,"Force n°1",7,5,6,5,6,5,6,4,4,9,7,8,6,7,null,5,null,7,{"$f":"IF(P25>G25,P25-G25,0)","v":2},{"$f":"IF(Q25>H25,Q25-H25,0)","v":2},2,1,1,0,0,0,3]
[{"$f":"+F26","v":"Force n°3"},2,"Perspective",{"$f":"VLOOKUP(C26,'24 forces de caractère'!$A$1:$C$25,3,0)","v":" Sagacité : Avoir une vision perspicace du monde et donner des conseils judicieux"},8,"Force n°3",6,5,7,6,6,7,4,7,3,7,8,7,7,8,null,7,null,null,{"$f":"IF(P26>G26,P26-G26,0)","v":1},3,{"$f":"IF(R26>I26,R26-I26,0)","v":0},1,2,0,3,0,0]
["Force n°4",3,"Discernement, pensée critique, et ouverture d’esprit",{"$f":"VLOOKUP(C27,'24 forces de caractère'!$A$1:$C$25,3,0)","v":"Analyser de façon rationnelle et savoir se remettre en question"},7,"Force n°4",6,6,5,4,4,4,5,4,6,9,8,10,null,6,null,null,null,null,3,2,5,0,2,0,0,0,0]
[0,4,"Créativité, ingéniosité, et originalité",{"$f":"VLOOKUP(C28,'24 forces de caractère'!$A$1:$C$25,3,0)","v":"Trouver de nouvelles façons (constructives) de penser et d’agir"},4,null,null,null,null,null,null,null,null,null,null,null,null,null,null,null,null,null,null,null,0,0,0,0,0,0,0,0,0]
["Force n°2",5,"Assiduité, application, et persévérance",{"$f":"VLOOKUP(C29,'24 forces de caractère'!$A$1:$C$25,3,0)","v":"Chercher à poursuivre son action jusqu’à son terme malgré les obstacles."},9,"Force n°2",5,6,7,5,5,6,4,5,5,9,9,10,8,7,7,5,6,6,4,3,3,3,2,1,1,1,1]
[0,6,"Le Pardon",{"$f":"VLOOKUP(C30,'24 forces de caractère'!$A$1:$C$25,3,0)","v":"Indulgence : Pardonner à ceux qui ont mal agi, accepter leurs insuffisances, donner d’autres chances"},5,null,null,null,null,null,null,null,null,null,null,null,null,null,null,null,null,null,null,null,0,0,0,0,0,0,0,0,0]
["Force n°5",7,"Leadership (capacité à diriger)",{"$f":"VLOOKUP(C31,'24 forces de caractère'!$A$1:$C$25,3,0)","v":"Influence : Encourager un groupe à agir de façon constructive en y maintenant de bonnes relations"},6,"Force n°5",6,6,5,6,5,4,5,6,6,9,8,7,7,7,6,5,null,null,3,2,2,1,{"$f":"IF(T31>K31,T31-K31,0)","v":2},2,0,0,0]
[0,8,null,{"$f":"VLOOKUP(C32,'24 forces de caractère'!$A$1:$C$25,3,0)","v":{"$error":"#N/A"}},null,null,null,null,null,null,null,null,null,null,null,null,null,null,null,null,null,null,null,null,0,0,0,0,0,0,0,0,0]
[0,9,null,{"$f":"VLOOKUP(C33,'24 forces de caractère'!$A$1:$C$25,3,0)","v":{"$error":"#N/A"}},null,null,null,null,null,null,null,null,null,null,null,null,null,null,null,null,null,null,null,null,0,0,0,0,0,0,0,0,0]
[0,10,null,{"$f":"VLOOKUP(C34,'24 forces de caractère'!$A$1:$C$25,3,0)","v":{"$error":"#N/A"}},null,null,null,null,null,null,null,null,null,null,null,null,null,null,null,null,null,null,null,null,0,0,0,0,0,0,0,0,0]
[0,11,null,{"$f":"VLOOKUP(C35,'24 forces de caractère'!$A$1:$C$25,3,0)","v":{"$error":"#N/A"}},null,null,null,null,null,null,null,null,null,null,null,null,null,null,null,null,null,null,null,null,0,0,0,0,0,0,0,0,0]
[0,12,null,{"$f":"VLOOKUP(C36,'24 forces de caractère'!$A$1:$C$25,3,0)","v":{"$error":"#N/A"}},null,null,null,null,null,null,null,null,null,null,null,null,null,null,null,null,null,null,null,null,0,0,0,0,0,0,0,0,0]
[0,13,null,{"$f":"VLOOKUP(C37,'24 forces de caractère'!$A$1:$C$25,3,0)","v":{"$error":"#N/A"}},null,null,null,null,null,null,null,null,null,null,null,null,null,null,null,null,null,null,null,null,0,0,0,0,0,0,0,0,0]
[0,14,null,{"$f":"VLOOKUP(C38,'24 forces de caractère'!$A$1:$C$25,3,0)","v":{"$error":"#N/A"}},null,null,null,null,null,null,null,null,null,null,null,null,null,null,null,null,null,null,null,null,0,0,0,0,0,0,0,0,0]
[0,15,null,{"$f":"VLOOKUP(C39,'24 forces de caractère'!$A$1:$C$25,3,0)","v":{"$error":"#N/A"}},null,null,null,null,null,null,null,null,null,null,null,null,null,null,null,null,null,null,null,null,0,0,0,0,0,0,0,0,0]
[0,16,null,{"$f":"VLOOKUP(C40,'24 forces de caractère'!$A$1:$C$25,3,0)","v":{"$error":"#N/A"}},null,null,null,null,null,null,null,null,null,null,null,null,null,null,null,null,null,null,null,null,0,0,0,0,0,0,0,0,0]
[0,17,null,{"$f":"VLOOKUP(C41,'24 forces de caractère'!$A$1:$C$25,3,0)","v":{"$error":"#N/A"}},null,null,null,null,null,null,null,null,null,null,null,null,null,null,null,null,null,null,null,null,0,{"$f":"IF(Q41>H41,Q41-H41,0)","v":0},{"$f":"IF(R41>I41,R41-I41,0)","v":0},{"$f":"IF(S41>J41,S41-J41,0)","v":0},{"$f":"IF(T41>K41,T41-K41,0)","v":0},{"$f":"IF(U41>L41,U41-L41,0)","v":0},{"$f":"IF(V41>M41,V41-M41,0)","v":0},{"$f":"IF(W41>N41,W41-N41,0)","v":0},{"$f":"IF(X41>O41,X41-O41,0)","v":0}]
[0,18,null,{"$f":"VLOOKUP(C42,'24 forces de caractère'!$A$1:$C$25,3,0)","v":{"$error":"#N/A"}},null,null,null,null,null,null,null,null,null,null,null,null,null,null,null,null,null,null,null,null,0,0,0,0,0,0,0,0,0]
[0,19,null,{"$f":"VLOOKUP(C43,'24 forces de caractère'!$A$1:$C$25,3,0)","v":{"$error":"#N/A"}},null,null,null,null,null,null,null,null,null,null,null,null,null,null,null,null,null,null,null,null,0,0,0,0,0,0,0,0,0]
[0,20,null,{"$f":"VLOOKUP(C44,'24 forces de caractère'!$A$1:$C$25,3,0)","v":{"$error":"#N/A"}},null,null,null,null,null,null,null,null,null,null,null,null,null,null,null,null,null,null,null,null,0,0,0,0,0,0,0,0,0]
[0,21,null,{"$f":"VLOOKUP(C45,'24 forces de caractère'!$A$1:$C$25,3,0)","v":{"$error":"#N/A"}},null,null,null,null,null,null,null,null,null,null,null,null,null,null,null,null,null,null,null,null,0,0,0,0,0,0,0,0,0]
[0,22,null,{"$f":"VLOOKUP(C46,'24 forces de caractère'!$A$1:$C$25,3,0)","v":{"$error":"#N/A"}},null,null,null,null,null,null,null,null,null,null,null,null,null,null,null,null,null,null,null,null,0,0,0,0,0,0,0,0,0]
[0,23,null,{"$f":"VLOOKUP(C47,'24 forces de caractère'!$A$1:$C$25,3,0)","v":{"$error":"#N/A"}},null,null,null,null,null,null,null,null,null,null,null,null,null,null,null,null,null,null,null,null,0,0,0,0,0,0,0,0,0]
[0,24,null,{"$f":"VLOOKUP(C48,'24 forces de caractère'!$A$1:$C$25,3,0)","v":{"$error":"#N/A"}},null,null,null,null,null,null,null,null,null,null,null,null,null,null,null,null,null,null,null,null,0,0,0,0,0,0,0,0,0]
[]
[]
[]
[]
[null,"TRANSPOSE tableau automatique :"]
[null,{"$f":"TRANSPOSE(B24:AG48)","v":"N° de la force de caractère\n(1 = la plus forte, 24 = la moins développée)"},1,2,3,4,5,6,7,8,9,10,11,12,13,14,15,16,17,18,19,20,21,22,23,24]
[null,"Nom de la force de caractère (de la + développée à la - développée selon résultats du test)","Courage et vaillance","Perspective","Discernement, pensée critique, et ouverture d’esprit","Créativité, ingéniosité, et originalité","Assiduité, application, et persévérance","Le Pardon","Leadership (capacité à diriger)",0,0,0,0,0,0,0,0,0,0,0,0,0,0,0,0,0]
[null,"Comportement associé","Agir selon ses convictions malgré la peur, la douleur ou la difficulté."," Sagacité : Avoir une vision perspicace du monde et donner des conseils judicieux","Analyser de façon rationnelle et savoir se remettre en question","Trouver de nouvelles façons (constructives) de penser et d’agir","Chercher à poursuivre son action jusqu’à son terme malgré les obstacles.","Indulgence : Pardonner à ceux qui ont mal agi, accepter leurs insuffisances, donner d’autres chances","Influence : Encourager un groupe à agir de façon constructive en y maintenant de bonnes relations",{"$error":"#N/A"},{"$error":"#N/A"},{"$error":"#N/A"},{"$error":"#N/A"},{"$error":"#N/A"},{"$error":"#N/A"},{"$error":"#N/A"},{"$error":"#N/A"},{"$error":"#N/A"},{"$error":"#N/A"},{"$error":"#N/A"},{"$error":"#N/A"},{"$error":"#N/A"},{"$error":"#N/A"},{"$error":"#N/A"},{"$error":"#N/A"},{"$error":"#N/A"}]
[null,"Utilité de cette force de caractère entre 1 (peu utile) et 10 (essentielle) pour atteindre mon objectif actuel ?",10,8,7,4,9,5,6,0,0,0,0,0,0,0,0,0,0,0,0,0,0,0,0,0]
[null,"Parmi les forces de caractère utiles (>5/10), choisissez les 5 forces les plus importantes /votre objectif.\nForce 1 = la + importante.","Force n°1","Force n°3","Force n°4",0,"Force n°2",0,"Force n°5",0,0,0,0,0,0,0,0,0,0,0,0,0,0,0,0,0]
[null,"Leader",7,6,6,0,5,0,6,0,0,0,0,0,0,0,0,0,0,0,0,0,0,0,0,0]
[null,"Manager (en interne)",5,5,6,0,6,0,6,0,0,0,0,0,0,0,0,0,0,0,0,0,0,0,0,0]
[null,"Partenaire commercial (à l'externe)",6,7,5,0,7,0,5,0,0,0,0,0,0,0,0,0,0,0,0,0,0,0,0,0]
[null,"Mari / Amant",5,6,4,0,5,0,6,0,0,0,0,0,0,0,0,0,0,0,0,0,0,0,0,0]
[null,"Père",6,6,4,0,5,0,5,0,0,0,0,0,0,0,0,0,0,0,0,0,0,0,0,0]
[null,"Oncle, fils, etc. (vie familiale)",5,7,4,0,6,0,4,0,0,0,0,0,0,0,0,0,0,0,0,0,0,0,0,0]
[null,"Ami / copain (vie sociale)",6,4,5,0,4,0,5,0,0,0,0,0,0,0,0,0,0,0,0,0,0,0,0,0]
[null,"Loisirs (activités, clubs, etc.)",4,7,4,0,5,0,6,0,0,0,0,0,0,0,0,0,0,0,0,0,0,0,0,0]
[null,"Dormeur",4,3,6,0,5,0,6,0,0,0,0,0,0,0,0,0,0,0,0,0,0,0,0,0]
[null,"Leader",9,7,9,0,9,0,9,0,0,0,0,0,0,0,0,0,0,0,0,0,0,0,0,0]
[null,"Manager (en interne)",7,8,8,0,9,0,8,0,0,0,0,0,0,0,0,0,0,0,0,0,0,0,0,0]
[null,"Partenaire commercial (à l'externe)",8,7,10,0,10,0,7,0,0,0,0,0,0,0,0,0,0,0,0,0,0,0,0,0]
[null,"Mari / Amant",6,7,0,0,8,0,7,0,0,0,0,0,0,0,0,0,0,0,0,0,0,0,0,0]
[null,"Père",7,8,6,0,7,0,7,0,0,0,0,0,0,0,0,0,0,0,0,0,0,0,0,0]
[null,"Oncle, fils, etc. (vie familiale)",0,0,0,0,7,0,6,0,0,0,0,0,0,0,0,0,0,0,0,0,0,0,0,0]
[null,"Ami / copain (vie sociale)",5,7,0,0,5,0,5,0,0,0,0,0,0,0,0,0,0,0,0,0,0,0,0,0]
[null,"Loisirs (activités, clubs, etc.)",0,0,0,0,6,0,0,0,0,0,0,0,0,0,0,0,0,0,0,0,0,0,0,0]
[null,"Dormeur",7,0,0,0,6,0,0,0,0,0,0,0,0,0,0,0,0,0,0,0,0,0,0,0]
[null,"Leader",2,1,3,0,4,0,3,0,0,0,0,0,0,0,0,0,0,0,0,0,0,0,0,0]
[null,"Manager (en interne)",2,3,2,0,3,0,2,0,0,0,0,0,0,0,0,0,0,0,0,0,0,0,0,0]
[null,"Partenaire commercial (à l'externe)",2,0,5,0,3,0,2,0,0,0,0,0,0,0,0,0,0,0,0,0,0,0,0,0]
[null,"Mari / Amant",1,1,0,0,3,0,1,0,0,0,0,0,0,0,0,0,0,0,0,0,0,0,0,0]
[null,"Père",1,2,2,0,2,0,2,0,0,0,0,0,0,0,0,0,0,0,0,0,0,0,0,0]
[null,"Oncle, fils, etc. (vie familiale)",0,0,0,0,1,0,2,0,0,0,0,0,0,0,0,0,0,0,0,0,0,0,0,0]
[null,"Ami / copain (vie sociale)",0,3,0,0,1,0,0,0,0,0,0,0,0,0,0,0,0,0,0,0,0,0,0,0]
[null,"Loisirs (activités, clubs, etc.)",0,0,0,0,1,0,0,0,0,0,0,0,0,0,0,0,0,0,0,0,0,0,0,0]
[null,"Dormeur",3,0,0,0,1,0,0,0,0,0,0,0,0,0,0,0,0,0,0,0,0,0,0,0]

{"sheet":"Talents","index":17,"n_rows":56,"n_cols":33,"rows_kept":56,"cut":false,"hidden":false,"merged":[[2,1,2,2],[2,3,2,13],[21,6,21,14],[21,15,21,23],[21,24,21,32]]}
[null,"Etape 5 : J’identifie les nouveaux ingrédients qui manquent dans mes rôles-costumes "]
[]
[null,"Rappel de votre objectif :",null,{"$f":"+'Objectif SMARTER'!$A$6","v":"Je veux…"}]
[]
[null,"Pour liste déroulante :","Pour liste déroulante :"]
[]
[null,"Talent n°1",1]
[null,"Talent n°2",2]
[null,"Talent n°3",3]
[null,"Talent n°4",4]
[null,"Talent n°5",5]
[null,null,6]
[null,null,7]
[null,null,8]
[null,null,9]
[null,null,10]
[]
[]
[]
[null,"Complétez le tableau selon l'objectif que vous voulez atteindre :"]
[]
[null,null,null,null,null,null,"Pour les 5 talents les + importants pour atteindre votre objectif, indiquez votre niveau actuel entre 1 et 10 / rôle-costume actuel (Selon votre ressenti /derniers mois).",null,null,null,null,null,null,null,null,"Pour les 5 talents les + importants pour atteindre votre objectif, indiquez la note à atteindre sur 10/ rôle-costume /objectif visé ?\n(tous vos rôles-costumes peuvent ne pas être concernés)",null,null,null,null,null,null,null,null,"Ecarts de notes = talents à développer davantage :"]
["Pour formules (à garder) :","Type de talent","Talent","Définition","Utilité de ce talent entre 1 (peu utile) et 10 (essentielle) pour atteindre mon objectif actuel ?","Parmi les talents utiles (>5/10), choisissez les 5 talents les plus importants /votre objectif.\nTalent n°1 = le + important.",{"$f":"'Synthèse 1'!B10","v":"Leader"},{"$f":"'Synthèse 1'!C10","v":"Manager (en interne)"},{"$f":"'Synthèse 1'!D10","v":"Partenaire commercial (à l'externe)"},{"$f":"'Synthèse 1'!E10","v":"Mari / Amant"},{"$f":"'Synthèse 1'!F10","v":"Père"},{"$f":"'Synthèse 1'!G10","v":"Oncle, fils, etc. (vie familiale)"},{"$f":"'Synthèse 1'!H10","v":"Ami / copain (vie sociale)"},{"$f":"'Synthèse 1'!I10","v":"Loisirs (activités, clubs, etc.)"},{"$f":"'Synthèse 1'!J10","v":"Dormeur"},{"$f":"'Synthèse 1'!B10","v":"Leader"},{"$f":"'Synthèse 1'!C10","v":"Manager (en interne)"},{"$f":"'Synthèse 1'!D10","v":"Partenaire commercial (à l'externe)"},{"$f":"'Synthèse 1'!E10","v":"Mari / Amant"},{"$f":"'Synthèse 1'!F10","v":"Père"},{"$f":"'Synthèse 1'!G10","v":"Oncle, fils, etc. (vie familiale)"},{"$f":"'Synthèse 1'!H10","v":"Ami / copain (vie sociale)"},{"$f":"'Synthèse 1'!I10","v":"Loisirs (activités, clubs, etc.)"},{"$f":"'Synthèse 1'!J10","v":"Dormeur"},{"$f":"'Synthèse 1'!B10","v":"Leader"},{"$f":"'Synthèse 1'!C10","v":"Manager (en interne)"},{"$f":"'Synthèse 1'!D10","v":"Partenaire commercial (à l'externe)"},{"$f":"'Synthèse 1'!E10","v":"Mari / Amant"},{"$f":"'Synthèse 1'!F10","v":"Père"},{"$f":"'Synthèse 1'!G10","v":"Oncle, fils, etc. (vie familiale)"},{"$f":"'Synthèse 1'!H10","v":"Ami / copain (vie sociale)"},{"$f":"'Synthèse 1'!I10","v":"Loisirs (activités, clubs, etc.)"},{"$f":"'Synthèse 1'!J10","v":"Dormeur"}]
[{"$f":"+F24","v":0},"Talents relatifs aux efforts","Réalisateur","Vous n’êtes satisfait que quand vous réalisez quelque chose. Vous êtes très productif et aimez les « to-do list » terminées.",5,null,null,null,null,null,null,null,null,null,null,null,null,null,null,null,null,null,null,null,{"$f":"IF(P24>G24,P24-G24,0)","v":0},{"$f":"IF(Q24>H24,Q24-H24,0)","v":0},0,0,0,0,0,0,0]
[{"$f":"+F25","v":0},"Talents relatifs aux efforts","Activateur","Seule l’action compte pour vous. L’expérience est la meilleure école de la vie. Vous décidez et agissez tout en tirant enseignement des conséquences.",8,null,null,null,null,null,null,null,null,null,null,null,null,null,null,null,null,null,null,null,{"$f":"IF(P25>G25,P25-G25,0)","v":0},0,0,0,0,0,0,0,0]
["Talent n°4","Talents relatifs aux efforts","Convaincu","vous accordez une grande priorité à la responsabilité et à la morale, des valeurs que vous appréciez également chez les autres.",10,"Talent n°4",6,5,6,6,5,4,6,5,5,9,7,7,7,8,6,5,6,6,3,2,1,1,3,2,0,1,1]
[0,"Talents relatifs aux efforts","Importance","vous voulez être reconnu, être entendu et apprécié pour les forces uniques qui vous caractérisent.",4,null,null,null,null,null,null,null,null,null,null,null,null,null,null,null,null,null,null,null,0,0,0,0,0,0,0,0,0]
[0,"Talents relatifs aux efforts","Discipliné","votre univers doit être sans surprise, prévisible, ordonné est planifié.",1,null,null,null,null,null,null,null,null,null,null,null,null,null,null,null,null,null,null,null,0,0,0,0,0,0,0,0,0]
["Talent n°2","Talents relatifs aux efforts","Assurance","vous savez que vous êtes capable : capable de prendre des risques, de relever de nouveaux défis, D’accomplir ce que vous désirez.",7,"Talent n°2",6,5,6,5,4,6,4,5,4,10,8,9,7,9,6,5,6,6,4,3,3,2,5,0,1,1,2]
["Talent n°1","Talents relatifs aux efforts","Adaptabilité","vous vivez le moment présent. Vous vous adaptez aux évènements comme ils se présentent. Vous êtes agile, souple et réagissez vite.",9,"Talent n°1",4,8,5,4,5,6,4,5,5,9,7,9,8,7,6,5,6,6,5,0,4,4,2,0,1,1,1]
["Talent n°3","Talents relatifs aux efforts","Focalisation","vous avez besoin d’une destination précise sinon vous trouvez votre vie frustrante.",7,"Talent n°3",6,5,6,6,6,5,5,6,5,7,8,7,7,9,6,6,6,6,1,3,1,1,3,1,1,0,1]
[0,"Talents relatifs aux efforts","Restaurer","vous aimez résoudre les problèmes. Vous adorez la difficulté.",5,null,null,null,null,null,null,null,null,null,null,null,null,null,null,null,null,null,null,null,0,0,0,0,0,0,0,0,0]
[0,"Talents relatifs à la réflexion","Analyste","vous êtes sans cesse en quête de preuves. Vous voulez que les affirmations soient appuyées par une logique et des arguments solides. Vous êtes rigoureux",5,null,null,null,null,null,null,null,null,null,null,null,null,null,null,null,null,null,null,null,0,0,0,0,0,0,0,0,0]
[0,"Talents relatifs à la réflexion","Arrangeur","vous aimez jongler entre différents facteurs en quête d’une configuration idéale. Vous êtes doué pour l’organisation.",6,null,null,null,null,null,null,null,null,null,null,null,null,null,null,null,null,null,null,null,0,0,0,0,0,0,0,0,0]
[0,"Talents relatifs à la réflexion","Prudent","vous êtes vigilant, réservé. Vous savez que le monde est imprévisible. Vous n’agissez qu’après réflexion.",4,null,null,null,null,null,null,null,null,null,null,null,null,null,null,null,null,null,null,null,0,0,0,0,0,0,0,0,0]
[0,"Talents relatifs à la réflexion","Connexion","vous êtes persuadés que tout ce qui arrive à une cause, que nous sommes tous connectés les uns aux autres.",4,null,null,null,null,null,null,null,null,null,null,null,null,null,null,null,null,null,null,null,0,0,0,0,0,0,0,0,0]
[0,"Talents relatifs à la réflexion","Équité","vous croyez en équilibre. Vous êtes persuadé qu’il faut traiter tout le monde sur le même pied d’égalité.",6,null,null,null,null,null,null,null,null,null,null,null,null,null,null,null,null,null,null,null,0,0,0,0,0,0,0,0,0]
[0,"Talents relatifs à la réflexion","Futuriste","vous êtes visionnaire, Le futur vous fascine.",7,null,null,null,null,null,null,null,null,null,null,null,null,null,null,null,null,null,null,null,0,0,0,0,0,0,0,0,0]
[0,"Talents relatifs à la réflexion","Studieux","vous aimez apprendre. Vous êtes attiré par le processus d’apprentissage.",5,null,null,null,null,null,null,null,null,null,null,null,null,null,null,null,null,null,null,null,0,0,0,0,0,0,0,0,0]
[0,"Talents relatifs à la réflexion","Input","vous êtes curieux et collectionneur. Vous collectez et stockez même les informations.",2,null,null,null,null,null,null,null,null,null,null,null,null,null,null,null,null,null,null,null,0,{"$f":"IF(Q40>H40,Q40-H40,0)","v":0},{"$f":"IF(R40>I40,R40-I40,0)","v":0},{"$f":"IF(S40>J40,S40-J40,0)","v":0},{"$f":"IF(T40>K40,T40-K40,0)","v":0},{"$f":"IF(U40>L40,U40-L40,0)","v":0},{"$f":"IF(V40>M40,V40-M40,0)","v":0},{"$f":"IF(W40>N40,W40-N40,0)","v":0},{"$f":"IF(X40>O40,X40-O40,0)","v":0}]
[0,"Talents relatifs à la réflexion","Intellectualisme","vous adorez réfléchir et faire travailler votre cerveau.",5,null,null,null,null,null,null,null,null,null,null,null,null,null,null,null,null,null,null,null,0,0,0,0,0,0,0,0,0]
[0,"Talents relatifs à la réflexion","Contexte","vous revenez sur le passé pour comprendre le présent et aussi pour prédire l’avenir.",5,null,null,null,null,null,null,null,null,null,null,null,null,null,null,null,null,null,null,null,0,0,0,0,0,0,0,0,0]
[0,"Talents relatifs à la réflexion","Stratégique","vous triez dans le désordre pour trouver la meilleure voix, la meilleure tendance. Vous aimez les schémas.",6,null,null,null,null,null,null,null,null,null,null,null,null,null,null,null,null,null,null,null,0,0,0,0,0,0,0,0,0]
[0,"Talents relatifs à la réflexion","Idéation","vous êtes fasciné par les idées. Vous cherchez et trouvez des liens entre les événements et les phénomènes.",4,null,null,null,null,null,null,null,null,null,null,null,null,null,null,null,null,null,null,null,0,0,0,0,0,0,0,0,0]
[0,"Talents relatifs aux rapports aux autres","Communication","vous aimez expliquer, décrire, accueillir les autres, parler en public et écrire. Vous savez parfaitement exprimer vos idées et êtes à l’aise dans les conversations.",7,null,null,null,null,null,null,null,null,null,null,null,null,null,null,null,null,null,null,null,0,0,0,0,0,0,0,0,0]
[0,"Talents relatifs aux rapports aux autres","Empathie","vous ressentez les émotions de ceux qui vous entourent comme si elles étaient les vôtres. Vous partagez la vision d’autrui.",6,null,null,null,null,null,null,null,null,null,null,null,null,null,null,null,null,null,null,null,0,0,0,0,0,0,0,0,0]
[0,"Talents relatifs aux rapports aux autres","Englober","vous n’aimez pas l’exclusion. Vous voulez inclure les gens et leur donner un sentiment d’appartenance à un groupe.",7,null,null,null,null,null,null,null,null,null,null,null,null,null,null,null,null,null,null,null,0,0,0,0,0,0,0,0,0]
[0,"Talents relatifs aux rapports aux autres","Individualisation","vous êtes intéressé par les qualités individuelles de chacun. Les généralisations ne vous plaisent pas.",5,null,null,null,null,null,null,null,null,null,null,null,null,null,null,null,null,null,null,null,0,0,0,0,0,0,0,0,0]
[0,"Talents relatifs aux rapports aux autres","Relationnel","vous êtes poussé vers les gens que vous connaissez déjà sans pour autant éviter de vous faire de nouveaux amis.",6,null,null,null,null,null,null,null,null,null,null,null,null,null,null,null,null,null,null,null,0,0,0,0,0,0,0,0,0]
[0,"Talents relatifs aux rapports aux autres","Responsabilité","dès que vous avez pris un engagement, vous vous sentez moralement tenu de le respecter.",7,null,null,null,null,null,null,null,null,null,null,null,null,null,null,null,null,null,null,null,0,0,0,0,0,0,0,0,0]
[0,"Talents relatifs à l’influence","Compétition","la compétition nait de la comparaison. Vous voulez être le meilleur, gagner.",6,null,null,null,null,null,null,null,null,null,null,null,null,null,null,null,null,null,null,null,0,0,0,0,0,0,0,0,0]
[0,"Talents relatifs à l’influence","Commandement","vous êtes doté d’une autorité naturelle et vous prenez les choses en mains. Vous vous comportez en leader.",9,null,null,null,null,null,null,null,null,null,null,null,null,null,null,null,null,null,null,null,0,0,0,0,0,0,0,0,0]
[0,"Talents relatifs à l’influence","Développeur","vous entrevoyez le potentiel caché chez les autres. Votre objectif est d’aider les gens à réussir.",7,null,null,null,null,null,null,null,null,null,null,null,null,null,null,null,null,null,null,null,0,0,0,0,0,0,0,0,0]
["Talent n°5","Talents relatifs à l’influence","Positivité","vous êtes optimiste, souriant, plein d’humour, énergique. Vous voyez sans cesse le bon côté des choses.",10,"Talent n°5",5,6,4,4,5,5,4,4,4,9,8,8,7,8,6,7,6,6,4,2,4,3,3,1,3,2,2]
[0,"Talents relatifs à l’influence","Maximisation","vos forces et celles des autres vous fascinent. Vous êtes en quête d’excellence et vous aimez travailler pour l’atteindre.",7,null,null,null,null,null,null,null,null,null,null,null,null,null,null,null,null,null,null,null,0,0,0,0,0,0,0,0,0]
[0,"Talents relatifs à l’influence","Charisme","vous aimez être apprécié. Vous partez à la rencontre de nouvelles personnes pour gagner leur amitié. Vous n’êtes absolument pas timide.",5,null,null,null,null,null,null,null,null,null,null,null,null,null,null,null,null,null,null,null,0,0,0,0,0,0,0,0,0]

{"sheet":"Qualités","index":18,"n_rows":36,"n_cols":33,"rows_kept":36,"cut":false,"hidden":false,"merged":[[4,1,4,2],[4,3,4,13],[24,6,24,14],[24,15,24,23],[24,24,24,32]]}
[null,"Etape 5 : J’identifie les nouveaux ingrédients qui manquent dans mes rôles-costumes "]
[]
[null,"Le top 10 des compétences et principales qualités d’un leader selon une étude publiée dans la Harvard Business Review :\nhttps://start.lesechos.fr/travailler-mieux/classements/les-qualites-qui-font-un-bon-leader-selon-200-leaders-dans-le-monde-1178450"]
[]
[null,"Rappel de votre objectif :",null,{"$f":"+'Objectif SMARTER'!$A$6","v":"Je veux…"}]
[]
[]
[null,"Pour liste déroulante :",null,null,"Pour liste déroulante :"]
[]
[null,"Qualité n°1",null,null,1]
[null,"Qualité n°2",null,null,2]
[null,"Qualité n°3",null,null,3]
[null,"Qualité n°4",null,null,4]
[null,"Qualité n°5",null,null,5]
[null,null,null,null,6]
[null,null,null,null,7]
[null,null,null,null,8]
[null,null,null,null,9]
[null,null,null,null,10]
[]
[]
[]
[null,"Complétez le tableau selon l'objectif que vous voulez atteindre :"]
[]
[null,null,null,null,null,null,"Pour les 5 qualités les + importantes / votre objectif, indiquez votre niveau actuel entre 1 et 10 / rôle-costume actuel (Selon votre ressenti /derniers mois).",null,null,null,null,null,null,null,null,"Pour les 5 qualités les + importantes / votre objectif, indiquez la note à atteindre sur 10/ rôle-costume /objectif visé ?\n(tous vos rôles-costumes peuvent ne pas être concernés)",null,null,null,null,null,null,null,null,"Ecarts de notes = qualités à développer davantage :"]
["Pour formules (à garder) :","Qualité",{"$f":"+B26","v":"Qualité"},"Définition","Utilité de cette qualité entre 1 (peu utile) et 10 (essentielle) pour atteindre mon objectif ?","Parmi les qualités utiles (>5/10), choisissez les 5 qualités les plus importantes /votre objectif.\nQualité n°1 = la + importante.",{"$f":"'Synthèse 1'!B10","v":"Leader"},{"$f":"'Synthèse 1'!C10","v":"Manager (en interne)"},{"$f":"'Synthèse 1'!D10","v":"Partenaire commercial (à l'externe)"},{"$f":"'Synthèse 1'!E10","v":"Mari / Amant"},{"$f":"'Synthèse 1'!F10","v":"Père"},{"$f":"'Synthèse 1'!G10","v":"Oncle, fils, etc. (vie familiale)"},{"$f":"'Synthèse 1'!H10","v":"Ami / copain (vie sociale)"},{"$f":"'Synthèse 1'!I10","v":"Loisirs (activités, clubs, etc.)"},{"$f":"'Synthèse 1'!J10","v":"Dormeur"},{"$f":"'Synthèse 1'!B10","v":"Leader"},{"$f":"'Synthèse 1'!C10","v":"Manager (en interne)"},{"$f":"'Synthèse 1'!D10","v":"Partenaire commercial (à l'externe)"},{"$f":"'Synthèse 1'!E10","v":"Mari / Amant"},{"$f":"'Synthèse 1'!F10","v":"Père"},{"$f":"'Synthèse 1'!G10","v":"Oncle, fils, etc. (vie familiale)"},{"$f":"'Synthèse 1'!H10","v":"Ami / copain (vie sociale)"},{"$f":"'Synthèse 1'!I10","v":"Loisirs (activités, clubs, etc.)"},{"$f":"'Synthèse 1'!J10","v":"Dormeur"},{"$f":"'Synthèse 1'!B10","v":"Leader"},{"$f":"'Synthèse 1'!C10","v":"Manager (en interne)"},{"$f":"'Synthèse 1'!D10","v":"Partenaire commercial (à l'externe)"},{"$f":"'Synthèse 1'!E10","v":"Mari / Amant"},{"$f":"'Synthèse 1'!F10","v":"Père"},{"$f":"'Synthèse 1'!G10","v":"Oncle, fils, etc. (vie familiale)"},{"$f":"'Synthèse 1'!H10","v":"Ami / copain (vie sociale)"},{"$f":"'Synthèse 1'!I10","v":"Loisirs (activités, clubs, etc.)"},{"$f":"'Synthèse 1'!J10","v":"Dormeur"}]
[{"$f":"+F27","v":"Qualité n°1"},"Savoir faire confiance (et se faire confiance)",{"$f":"+B27","v":"Savoir faire confiance (et se faire confiance)"},null,10,"Qualité n°1",6,7,6,7,7,6,8,9,4,9,9,9,8,8,6,5,6,null,{"$f":"IF(P27>G27,P27-G27,0)","v":3},{"$f":"IF(Q27>H27,Q27-H27,0)","v":2},{"$f":"IF(R27>I27,R27-I27,0)","v":3},1,1,0,0,0,0]
[{"$f":"+F28","v":"Qualité n°5"},"Fixer des objectifs clairs","Fixer des objectifs clairs",null,8,"Qualité n°5",6,6,5,5,6,5,5,4,6,10,10,9,9,9,8,7,6,7,{"$f":"IF(P28>G28,P28-G28,0)","v":4},4,4,4,3,3,2,2,1]
[0,"Personnifier les valeurs de l’entreprise","Personnifier les valeurs de l’entreprise",null,6,null,null,null,null,null,null,null,null,null,null,null,null,null,null,null,null,null,null,null,0,0,0,0,0,0,0,0,0]
[0,"Permettre l’échange et la transmission du savoir","Permettre l’échange et la transmission du savoir",null,7,null,null,null,null,null,null,null,null,null,null,null,null,null,null,null,null,null,null,null,0,0,0,0,0,0,0,0,0]
[0,"Récompenser les bonnes initiatives","Récompenser les bonnes initiatives",null,6,null,null,null,null,null,null,null,null,null,null,null,null,null,null,null,null,null,null,null,0,0,0,0,0,0,0,0,0]
[0,"Encourager le changement","Encourager le changement",null,6,null,null,null,null,null,null,null,null,null,null,null,null,null,null,null,null,null,null,null,0,0,0,0,0,0,0,0,0]
["Qualité n°2","Savoir prendre soin de soi","Savoir prendre soin de soi",null,9,"Qualité n°2",6,6,7,6,5,6,5,5,3,9,9,8,9,9,8,7,7,7,3,3,1,3,4,2,2,2,4]
["Qualité n°4","Communiquer en toute transparence","Communiquer en toute transparence",null,8,"Qualité n°4",5,6,5,5,7,6,5,6,4,8,9,8,8,8,6,7,6,8,3,3,3,3,1,0,2,0,4]
["Qualité n°3","Savoir écouter","Savoir écouter",null,9,"Qualité n°3",6,8,6,6,6,5,5,5,4,10,10,9,10,10,7,7,5,4,4,2,3,4,4,2,2,0,0]
[0,"Avoir des convictions","Avoir des convictions",null,7,null,null,null,null,null,null,null,null,null,null,null,null,null,null,null,null,null,null,null,0,0,0,0,0,0,0,0,0]

{"sheet":"Synthèse 3","index":19,"n_rows":56,"n_cols":10,"rows_kept":56,"cut":false,"hidden":false,"merged":[[3,1,3,2],[3,3,3,6]]}
[]
[null,"Etape 5 : J’identifie les nouveaux ingrédients qui manquent dans mes rôles-costumes "]
[]
[null,"Rappel de votre objectif :",null,{"$f":"+'Objectif SMARTER'!$A$6","v":"Je veux…"}]
[]
[null,"Tableau automatique à partir des onglets : \"Vos forces\", \"Talents\", \"Qualités\" :"]
[null,null,null,null,null,null,null,"Colonne à conserver avec cette formule"]
["Pour formule = à supprimer",{"$f":"+'Liste costumes actuels'!A4","v":"Costume n°"},{"$f":"+'Liste costumes actuels'!A5","v":"Nom du rôle-costume endossé"},"5 forces de caractère, 5 talents, et 5 qualités essentiels à conserver ou développer / objectif visé","Niveau actuel sur 10","Note à obtenir sur 10 pour atteindre votre objectif\n(si 0 = pas de lien avec l'objectif pour ce rôle)","Points à gagner \n(si vide = conserver le niveau actuel)","Force, Talent, ou Qualité à utiliser en priorité :",null,"Check erreur"]
["Force n°1",{"$f":"+'Synthèse 2'!$A$7","v":1},{"$f":"+Forces!$Y$24","v":"Leader"},{"$f":"+Forces!$C$25","v":"Courage et vaillance"},{"$f":"+Forces!G25","v":7},{"$f":"+Forces!P25","v":9},{"$f":"+Forces!Y25","v":2},{"$f":"IF(G9>3,\"A utiliser en priorité\",\"\")","v":""},null,{"$f":"IF(OR(F9=0,F9-E9=G9),\"OK\",\"FAUX\")","v":"OK"}]
["Force n°2",{"$f":"+'Synthèse 2'!$A$7","v":1},{"$f":"+Forces!$Y$24","v":"Leader"},{"$f":"+Forces!$C$29","v":"Assiduité, application, et persévérance"},{"$f":"+Forces!G26","v":6},{"$f":"+Forces!P26","v":7},{"$f":"+Forces!Y26","v":1},{"$f":"IF(G10>3,\"A utiliser en priorité\",\"\")","v":""},null,{"$f":"IF(OR(F10=0,F10-E10=G10),\"OK\",\"FAUX\")","v":"OK"}]
["Force n°3",{"$f":"+'Synthèse 2'!$A$7","v":1},{"$f":"+Forces!$Y$24","v":"Leader"},{"$f":"+Forces!$C$26","v":"Perspective"},{"$f":"+Forces!G27","v":6},{"$f":"+Forces!P27","v":9},{"$f":"+Forces!Y27","v":3},"",null,"OK"]
["Force n°4",{"$f":"+'Synthèse 2'!$A$7","v":1},{"$f":"+Forces!$Y$24","v":"Leader"},{"$f":"+Forces!$C$27","v":"Discernement, pensée critique, et ouverture d’esprit"},{"$f":"+Forces!G29","v":5},{"$f":"+Forces!P29","v":9},{"$f":"+Forces!Y29","v":4},{"$f":"IF(G12>3,\"A utiliser en priorité\",\"\")","v":"A utiliser en priorité"},null,"OK"]
["Force n°5",{"$f":"+'Synthèse 2'!$A$7","v":1},{"$f":"+Forces!$Y$24","v":"Leader"},{"$f":"+Forces!$C$31","v":"Leadership (capacité à diriger)"},{"$f":"+Forces!G31","v":6},{"$f":"+Forces!P31","v":9},{"$f":"+Forces!Y31","v":3},"",null,"OK"]
["Force n°1",{"$f":"+'Synthèse 2'!$A$16","v":2},{"$f":"+Forces!$Z$24","v":"Manager (en interne)"},{"$f":"+Forces!$C$25","v":"Courage et vaillance"},{"$f":"+Forces!H25","v":5},{"$f":"+Forces!Q25","v":7},{"$f":"+Forces!Z25","v":2},"",null,"OK"]
["Force n°2",{"$f":"+'Synthèse 2'!$A$16","v":2},{"$f":"+Forces!$Z$24","v":"Manager (en interne)"},{"$f":"+Forces!$C$29","v":"Assiduité, application, et persévérance"},{"$f":"+Forces!H26","v":5},{"$f":"+Forces!Q26","v":8},{"$f":"+Forces!Z26","v":3},"",null,"OK"]
["Force n°3",{"$f":"+'Synthèse 2'!$A$16","v":2},{"$f":"+Forces!$Z$24","v":"Manager (en interne)"},{"$f":"+Forces!$C$26","v":"Perspective"},{"$f":"+Forces!H27","v":6},{"$f":"+Forces!Q27","v":8},{"$f":"+Forces!Z27","v":2},"",null,"OK"]
["Force n°4",{"$f":"+'Synthèse 2'!$A$16","v":2},{"$f":"+Forces!$Z$24","v":"Manager (en interne)"},{"$f":"+Forces!$C$27","v":"Discernement, pensée critique, et ouverture d’esprit"},{"$f":"+Forces!H29","v":6},{"$f":"+Forces!Q29","v":9},{"$f":"+Forces!Z29","v":3},"",null,"OK"]
["Force n°5",{"$f":"+'Synthèse 2'!$A$16","v":2},{"$f":"+Forces!$Z$24","v":"Manager (en interne)"},{"$f":"+Forces!$C$31","v":"Leadership (capacité à diriger)"},{"$f":"+Forces!H31","v":6},{"$f":"+Forces!Q31","v":8},{"$f":"+Forces!Z31","v":2},"",null,"OK"]
["Force n°1",{"$f":"+'Synthèse 2'!$A$30","v":3},{"$f":"+Forces!$AA$24","v":"Partenaire commercial (à l'externe)"},{"$f":"+Forces!$C$25","v":"Courage et vaillance"},{"$f":"+Forces!I25","v":6},{"$f":"+Forces!R25","v":8},{"$f":"+Forces!AA25","v":2},"",null,"OK"]
["Force n°2",{"$f":"+'Synthèse 2'!$A$30","v":3},{"$f":"+Forces!$AA$24","v":"Partenaire commercial (à l'externe)"},{"$f":"+Forces!$C$29","v":"Assiduité, application, et persévérance"},{"$f":"+Forces!I26","v":7},{"$f":"+Forces!R26","v":7},{"$f":"+Forces!AA26","v":0},{"$f":"IF(G20>3,\"A utiliser en priorité\",\"\")","v":""},null,"OK"]
["Force n°3",{"$f":"+'Synthèse 2'!$A$30","v":3},{"$f":"+Forces!$AA$24","v":"Partenaire commercial (à l'externe)"},{"$f":"+Forces!$C$26","v":"Perspective"},{"$f":"+Forces!I27","v":5},{"$f":"+Forces!R27","v":10},{"$f":"+Forces!AA27","v":5},"A utiliser en priorité",null,"OK"]
["Force n°4",{"$f":"+'Synthèse 2'!$A$30","v":3},{"$f":"+Forces!$AA$24","v":"Partenaire commercial (à l'externe)"},{"$f":"+Forces!$C$27","v":"Discernement, pensée critique, et ouverture d’esprit"},{"$f":"+Forces!I29","v":7},{"$f":"+Forces!R29","v":10},{"$f":"+Forces!AA29","v":3},"",null,"OK"]
["Force n°5",{"$f":"+'Synthèse 2'!$A$30","v":3},{"$f":"+Forces!$AA$24","v":"Partenaire commercial (à l'externe)"},{"$f":"+Forces!$C$31","v":"Leadership (capacité à diriger)"},{"$f":"+Forces!I31","v":5},{"$f":"+Forces!R31","v":7},{"$f":"+Forces!AA31","v":2},"",null,"OK"]
["Force n°1",4,{"$f":"+Forces!$AB$24","v":"Mari / Amant"},{"$f":"+Forces!$C$25","v":"Courage et vaillance"},{"$f":"+Forces!J25","v":5},{"$f":"+Forces!S25","v":6},{"$f":"+Forces!AB25","v":1},"",null,"OK"]
["Force n°2",4,{"$f":"+Forces!$AB$24","v":"Mari / Amant"},{"$f":"+Forces!$C$29","v":"Assiduité, application, et persévérance"},{"$f":"+Forces!J26","v":6},{"$f":"+Forces!S26","v":7},{"$f":"+Forces!AB26","v":1},"",null,"OK"]
["Force n°3",4,{"$f":"+Forces!$AB$24","v":"Mari / Amant"},{"$f":"+Forces!$C$26","v":"Perspective"},{"$f":"+Forces!J27","v":4},{"$f":"+Forces!S27","v":0},{"$f":"+Forces!AB27","v":0},"",null,"OK"]
["Force n°4",4,{"$f":"+Forces!$AB$24","v":"Mari / Amant"},{"$f":"+Forces!$C$27","v":"Discernement, pensée critique, et ouverture d’esprit"},{"$f":"+Forces!J29","v":5},{"$f":"+Forces!S29","v":8},{"$f":"+Forces!AB29","v":3},"",null,"OK"]
["Force n°5",4,{"$f":"+Forces!$AB$24","v":"Mari / Amant"},{"$f":"+Forces!$C$31","v":"Leadership (capacité à diriger)"},{"$f":"+Forces!J31","v":6},{"$f":"+Forces!S31","v":7},{"$f":"+Forces!AB31","v":1},"",null,"OK"]
["Force n°1",5,{"$f":"+Forces!$AC$24","v":"Père"},{"$f":"+Forces!$C$25","v":"Courage et vaillance"},{"$f":"+Forces!K25","v":6},{"$f":"+Forces!T25","v":7},{"$f":"+Forces!AC25","v":1},"",null,"OK"]
["Force n°2",5,{"$f":"+Forces!$AC$24","v":"Père"},{"$f":"+Forces!$C$29","v":"Assiduité, application, et persévérance"},{"$f":"+Forces!K26","v":6},{"$f":"+Forces!T26","v":8},{"$f":"+Forces!AC26","v":2},"",null,"OK"]
["Force n°3",5,{"$f":"+Forces!$AC$24","v":"Père"},{"$f":"+Forces!$C$26","v":"Perspective"},{"$f":"+Forces!K27","v":4},{"$f":"+Forces!T27","v":6},{"$f":"+Forces!AC27","v":2},"",null,"OK"]
["Force n°4",5,{"$f":"+Forces!$AC$24","v":"Père"},{"$f":"+Forces!$C$27","v":"Discernement, pensée critique, et ouverture d’esprit"},{"$f":"+Forces!K29","v":5},{"$f":"+Forces!T29","v":7},{"$f":"+Forces!AC29","v":2},"",null,"OK"]
["Force n°5",5,{"$f":"+Forces!$AC$24","v":"Père"},{"$f":"+Forces!$C$31","v":"Leadership (capacité à diriger)"},{"$f":"+Forces!K31","v":5},{"$f":"+Forces!T31","v":7},{"$f":"+Forces!AC31","v":2},"",null,"OK"]
[null,"Etc."]
[]
[]
[]
[]
[]
["Talent n°1",1,"Leader",{"$f":"+Talents!$C$30","v":"Adaptabilité"},{"$f":"+Talents!G30","v":4},{"$f":"+Talents!P30","v":9},{"$f":"+Talents!Y30","v":5},{"$f":"IF(G40>3,\"A utiliser en priorité\",\"\")","v":"A utiliser en priorité"},null,{"$f":"IF(OR(F40-E40=G40,G40=\"\"),\"OK\",\"FAUX\")","v":"OK"}]
["Talent n°2",1,"Leader",{"$f":"+Talents!C29","v":"Assurance"},{"$f":"+Talents!G29","v":6},{"$f":"+Talents!P29","v":10},{"$f":"+Talents!Y29","v":4},"A utiliser en priorité",null,{"$f":"IF(OR(F41-E41=G41,G41=\"\"),\"OK\",\"FAUX\")","v":"OK"}]
["Talent n°3",1,"Leader",{"$f":"+Talents!$C$31","v":"Focalisation"},{"$f":"+Talents!G31","v":6},{"$f":"+Talents!P31","v":7},{"$f":"+Talents!Y31","v":1},"",null,{"$f":"IF(OR(F42-E42=G42,G42=\"\"),\"OK\",\"FAUX\")","v":"OK"}]
["Talent n°4",1,"Leader",{"$f":"+Talents!$C$26","v":"Convaincu"},{"$f":"+Talents!G26","v":6},{"$f":"+Talents!P26","v":9},{"$f":"+Talents!Y26","v":3},"",null,{"$f":"IF(OR(F43-E43=G43,G43=\"\"),\"OK\",\"FAUX\")","v":"OK"}]
["Talent n°5",1,"Leader",{"$f":"+Talents!$C$54","v":"Positivité"},{"$f":"+Talents!G54","v":5},{"$f":"+Talents!P54","v":9},{"$f":"+Talents!Y54","v":4},"A utiliser en priorité",null,{"$f":"IF(OR(F44-E44=G44,G44=\"\"),\"OK\",\"FAUX\")","v":"OK"}]
[null,"Etc."]
[]
[]
[]
[]
[]
["Qualité n°1",1,"Leader",{"$f":"+Qualités!B27","v":"Savoir faire confiance (et se faire confiance)"},{"$f":"+Qualités!G27","v":6},{"$f":"+Qualités!P27","v":9},{"$f":"+Qualités!Y27","v":3},{"$f":"IF(G51>3,\"A utiliser en priorité\",\"\")","v":""},null,{"$f":"IF(OR(F51-E51=G51,G51=\"\"),\"OK\",\"FAUX\")","v":"OK"}]
["Qualité n°2",1,"Leader",{"$f":"+Qualités!B33","v":"Savoir prendre soin de soi"},{"$f":"+Qualités!G33","v":6},{"$f":"+Qualités!P33","v":9},{"$f":"+Qualités!Y33","v":3},"",null,{"$f":"IF(OR(F52-E52=G52,G52=\"\"),\"OK\",\"FAUX\")","v":"OK"}]
["Qualité n°3",1,"Leader",{"$f":"+Qualités!B35","v":"Savoir écouter"},{"$f":"+Qualités!G35","v":6},{"$f":"+Qualités!P35","v":10},{"$f":"+Qualités!Y35","v":4},"A utiliser en priorité",null,{"$f":"IF(OR(F53-E53=G53,G53=\"\"),\"OK\",\"FAUX\")","v":"OK"}]
["Qualité n°4",1,"Leader",{"$f":"+Qualités!B34","v":"Communiquer en toute transparence"},{"$f":"+Qualités!G34","v":5},{"$f":"+Qualités!P34","v":8},{"$f":"+Qualités!Y34","v":3},"",null,{"$f":"IF(OR(F54-E54=G54,G54=\"\"),\"OK\",\"FAUX\")","v":"OK"}]
["Qualité n°5",1,"Leader",{"$f":"+Qualités!B28","v":"Fixer des objectifs clairs"},{"$f":"+Qualités!G28","v":6},{"$f":"+Qualités!P28","v":10},{"$f":"+Qualités!Y28","v":4},"A utiliser en priorité",null,{"$f":"IF(OR(F55-E55=G55,G55=\"\"),\"OK\",\"FAUX\")","v":"OK"}]
[null,"Etc."]

{"sheet":"Synthèse finale","index":20,"n_rows":224,"n_cols":17,"rows_kept":224,"cut":false,"hidden":false,"merged":[[3,1,3,2],[3,3,3,5]]}
[]
[null,"Etape 6 : Je sais comment, quand, et avec qui endosser tous les rôles-costumes nécessaires pour atteindre mon objectif"]
[]
[null,"Rappel de votre objectif :",null,{"$f":"+'Objectif SMARTER'!$A$6","v":"Je veux…"}]
[]
[]
[null,null,"Vos accessoires à utiliser et à développer pour réussir = forces de caractère, talents, qualités :"]
[]
[null,null,"5 forces de caractère à utiliser","5 talents principaux à utiliser","5 qualités principales à utiliser"]
[null,null,{"$f":"VLOOKUP(\"Force n°1\",Forces!$A$25:$C$48,3,0)","v":"Courage et vaillance"},{"$f":"VLOOKUP(\"Talent n°1\",Talents!$A$24:$C$56,3,0)","v":"Adaptabilité"},{"$f":"VLOOKUP(\"Qualité n°1\",Qualités!$A$27:$B$36,2,0)","v":"Savoir faire confiance (et se faire confiance)"}]
[null,null,{"$f":"VLOOKUP(\"Force n°2\",Forces!$A$25:$C$48,3,0)","v":"Assiduité, application, et persévérance"},{"$f":"VLOOKUP(\"Talent n°2\",Talents!$A$24:$C$56,3,0)","v":"Assurance"},{"$f":"VLOOKUP(\"Qualité n°2\",Qualités!$A$27:$B$36,2,0)","v":"Savoir prendre soin de soi"}]
[null,null,{"$f":"VLOOKUP(\"Force n°3\",Forces!$A$25:$C$48,3,0)","v":"Perspective"},{"$f":"VLOOKUP(\"Talent n°3\",Talents!$A$24:$C$56,3,0)","v":"Focalisation"},{"$f":"VLOOKUP(\"Qualité n°3\",Qualités!$A$27:$B$36,2,0)","v":"Savoir écouter"}]
[null,null,{"$f":"VLOOKUP(\"Force n°4\",Forces!$A$25:$C$48,3,0)","v":"Discernement, pensée critique, et ouverture d’esprit"},{"$f":"VLOOKUP(\"Talent n°4\",Talents!$A$24:$C$56,3,0)","v":"Convaincu"},{"$f":"VLOOKUP(\"Qualité n°4\",Qualités!$A$27:$B$36,2,0)","v":"Communiquer en toute transparence"}]
[null,null,{"$f":"VLOOKUP(\"Force n°5\",Forces!$A$25:$C$48,3,0)","v":"Leadership (capacité à diriger)"},{"$f":"VLOOKUP(\"Talent n°5\",Talents!$A$24:$C$56,3,0)","v":"Positivité"},{"$f":"VLOOKUP(\"Qualité n°5\",Qualités!$A$27:$B$36,2,0)","v":"Fixer des objectifs clairs"}]
[]
[null,"Extraires des données des onglets \"Synthèse 1\", \"Synthèse 2\" et \"Synthèse 3\" : tableau de synthèse automatique"]
[null,"Tableau récapitulatif de toutes les actions et sous-actions que vous devez réaliser pour atteindre votre objectif :"]
[null,"Depuis Synthèse 2","Depuis Synthèse 2","Depuis Synthèse 1","Depuis Synthèse 2","Depuis Synthèse 2","Depuis Synthèse 2","Depuis Synthèse 2","Depuis Synthèse 2","Depuis Synthèse 2","Depuis Synthèse 2","Depuis Synthèse 2","Depuis Synthèse 2","Depuis Synthèse 2","Depuis Synthèse 2","Depuis Synthèse 2","Depuis Synthèse 2"]
[null,"Costume n°","Nom du rôle-costume","Symbole qui représente ce rôle-costume (figurine, vêtements, objet distinctif)","Actions","Sous-actions","Pourquoi cette sous-action est-elle utile/ objectif ?\nQuels sont ses bénéfices / objectif ?","Avec qui vous devez partager cette sous-action ? (Membres de votre famille, amis, collègues, supérieurs, etc.)\nEt que doit(vent) faire précisément cette/ces personne(s) ?","Quelle sous-sous-action précise vous devez réaliser seul ?","Critère de réalisation cette sous-action.\n(Rendu final visible et mesurable / objectif)","Au cours de quelle(s) étape(s) / votre objectif devez-vous réaliser cette sous-action ?","Quand devez-vous réaliser cette sous-action ?\n(contextes, horaires précis, régularité ou pas, moments de la journée, période(s) de l'année, etc.)","Où devez-vous réaliser cette sous-action ?\n(lieux précis)","Avec qui devez-vous réaliser cette sous-action ?\n(personnes précises)","Comment devez-vous réaliser cette sous-action ? \n(niveau d'énergie requis, humeur, qualité(s), force(s), ou talent(s) requis, etc.)","Combien d’heures min./ max. consacrer à cette sous-action par jour/ semaine/ mois/ année ?","Suite à donner à cette sous-action ?\n(durée prévue d’utilisation, date limite de réalisation, conséquences long terme, etc.)"]
[null,1,"Leader",{"$f":"+'Synthèse 1'!$B$11","v":"Cravate"},"Répondre aux mails & aux appels importants","Répondre aux clients externes","Car elle me permet de réaliser…",null,null,"Cette sous-action est réalisée si…","L'étape 1, et l'étape 4","Le matin entre 07h00 et 8h00.","Au bureau à VILLE, ou dans mon bureau chez moi.","Avec Mme J et M. K.","Je dois avoir un niveau d'énergie de min. 7/10 et être de bonne humeur. Qualités requises :…","1h/semaine max.","Pas de fin : cette action sera encore nécessaire dans 5 ans."]
[null,1,"Leader",{"$f":"+'Synthèse 1'!$B$11","v":"Cravate"},"Répondre aux mails & aux appels importants","Répondre aux demandes nouvelles venant de l'externe","Parce qu'elle me permet de faire…",null,null,"Cette sous-action est réalisée quand…","L'étape 1 et 2.","Entre 14h00 et 14h30.","Au bureau à VILLE, ou dans mon bureau chez moi.","Avec Mme O.","Peu importe mon humeur. Niveau d'énergie min. 4/10. Qualité requise…","2h/mois max","Fin de cette action à prévoir quand j'aurai réalisé l'action ACTION."]
[null,1,"Leader",{"$f":"+'Synthèse 1'!$B$11","v":"Cravate"},"Présenter les résultats de l'entreprise","S'assurer que les résultats sont corrects",null,null,null,null,"Toutes les étapes.","Entre 13h00 et 13h10.","Au bureau à VILLE, ou dans mon bureau chez moi.",null,"Talent requis = ","5h/année max."]
[null,1,"Leader",{"$f":"+'Synthèse 1'!$B$11","v":"Cravate"},"Présenter les résultats de l'entreprise","A compléter costume 1 Action 2 Sous-action 4",null,null,null,null,"L'étape 3 et 5.",null,null,null,null,"30 minutes/jour minimum"]
[null,1,"Leader",{"$f":"+'Synthèse 1'!$B$11","v":"Cravate"},"Définir et valider la vision/stratégie à moyen et à long terme pour l'entreprise. Réflexions et discusssions stratégiques","A compléter costume 1 Action 3 Sous-action 4",null,null,null,null,"L'étape 5.",null,null,null,null,"2h/jour minimum"]
[null,1,"Leader",{"$f":"+'Synthèse 1'!$B$11","v":"Cravate"},"Gérer des rdv et appeler les clients/partenaires/fournisseurs/ etc.","A compléter costume 1 Action 4 Sous-action 2"]
[null,1,"Leader",{"$f":"+'Synthèse 1'!$B$11","v":"Cravate"},"M'informer des tendances actuelles et futures qui pourraient impacter l'entreprise + Me former : min. 1 formation /an","A compléter costume 1 Action 5 Sous-action 1"]
[null,1,"Leader",{"$f":"+'Synthèse 1'!$B$11","v":"Cravate"},"M'informer des tendances actuelles et futures qui pourraient impacter l'entreprise + Me former : min. 1 formation /an","A compléter costume 1 Action 5 Sous-action 3"]
[null,1,"Leader",{"$f":"+'Synthèse 1'!$B$11","v":"Cravate"},"M'informer des tendances actuelles et futures qui pourraient impacter l'entreprise + Me former : min. 1 formation /an","A compléter costume 1 Action 5 Sous-action 5"]
[null,2,"Manager (en interne)",{"$f":"+'Synthèse 1'!$C$11","v":"Casquette spécifique"},"Communiquer les actions prioritaires à mes équipes directes.","A compléter costume 2 Action 1 Sous-action 2"]
[null,2,"Manager (en interne)",{"$f":"+'Synthèse 1'!$C$11","v":"Casquette spécifique"},"Encourager et motiver toutes les personnes que je manage.","A compléter costume 2 Action 2 Sous-action 1"]
[null,2,"Manager (en interne)",{"$f":"+'Synthèse 1'!$C$11","v":"Casquette spécifique"},"Encourager et motiver toutes les personnes que je manage.","A compléter costume 2 Action 2 Sous-action 3"]
[null,2,"Manager (en interne)",{"$f":"+'Synthèse 1'!$C$11","v":"Casquette spécifique"},"Encourager et motiver toutes les personnes que je manage.","A compléter costume 2 Action 2 Sous-action 5"]
[null,2,"Manager (en interne)",{"$f":"+'Synthèse 1'!$C$11","v":"Casquette spécifique"},"Informer Mme J, M. O, et l'équipe X, des actions à entreprendre cette semaine","A compléter costume 2 Action 3 Sous-action 1"]
[null,2,"Manager (en interne)",{"$f":"+'Synthèse 1'!$C$11","v":"Casquette spécifique"},"Informer Mme J, M. O, et l'équipe X, des actions à entreprendre cette semaine","A compléter costume 2 Action 3 Sous-action 3"]
[null,2,"Manager (en interne)",{"$f":"+'Synthèse 1'!$C$11","v":"Casquette spécifique"},"Informer Mme J, M. O, et l'équipe X, des actions à entreprendre cette semaine","A compléter costume 2 Action 3 Sous-action 5"]
[null,2,"Manager (en interne)",{"$f":"+'Synthèse 1'!$C$11","v":"Casquette spécifique"},"Communiquer les objectifs à atteindre aux directeurs des différents services/ unités/ départements.","A compléter costume 2 Action 4 Sous-action 2"]
[null,2,"Manager (en interne)",{"$f":"+'Synthèse 1'!$C$11","v":"Casquette spécifique"},"Communiquer les objectifs à atteindre aux directeurs des différents services/ unités/ départements.","A compléter costume 2 Action 4 Sous-action 3"]
[null,2,"Manager (en interne)",{"$f":"+'Synthèse 1'!$C$11","v":"Casquette spécifique"},"Communiquer les objectifs à atteindre aux directeurs des différents services/ unités/ départements.","A compléter costume 2 Action 4 Sous-action 4"]
[null,2,"Manager (en interne)",{"$f":"+'Synthèse 1'!$C$11","v":"Casquette spécifique"},"Déléguer le travail 1 et 2 à Mme O.","A compléter costume 2 Action 5 Sous-action 1"]
[null,2,"Manager (en interne)",{"$f":"+'Synthèse 1'!$C$11","v":"Casquette spécifique"},"Déléguer le travail 1 et 2 à Mme O.","A compléter costume 2 Action 5 Sous-action 2"]
[null,2,"Manager (en interne)",{"$f":"+'Synthèse 1'!$C$11","v":"Casquette spécifique"},"Déléguer le travail 1 et 2 à Mme O.","A compléter costume 2 Action 5 Sous-action 3"]
[null,2,"Manager (en interne)",{"$f":"+'Synthèse 1'!$C$11","v":"Casquette spécifique"},"Déléguer le travail 1 et 2 à Mme O.","A compléter costume 2 Action 5 Sous-action 5"]
[null,3,"Partenaire commercial (à l'externe)",{"$f":"+'Synthèse 1'!$D$11","v":"Bracelet, amulette"},"Répondre aux principaux partenaires externes de l'entreprise","A compléter costume 3 Action 1 Sous-action 3"]
[null,3,"Partenaire commercial (à l'externe)",{"$f":"+'Synthèse 1'!$D$11","v":"Bracelet, amulette"},"Répondre aux principaux partenaires externes de l'entreprise","A compléter costume 3 Action 1 Sous-action 4"]
[null,3,"Partenaire commercial (à l'externe)",{"$f":"+'Synthèse 1'!$D$11","v":"Bracelet, amulette"},"Gérer la relation avec les fournisseurs","A compléter costume 3 Action 2 Sous-action 1"]
[null,3,"Partenaire commercial (à l'externe)",{"$f":"+'Synthèse 1'!$D$11","v":"Bracelet, amulette"},"Gérer la relation avec les fournisseurs","A compléter costume 3 Action 2 Sous-action 2"]
[null,3,"Partenaire commercial (à l'externe)",{"$f":"+'Synthèse 1'!$D$11","v":"Bracelet, amulette"},"Gérer la relation avec les fournisseurs","A compléter costume 3 Action 2 Sous-action 3"]
[null,3,"Partenaire commercial (à l'externe)",{"$f":"+'Synthèse 1'!$D$11","v":"Bracelet, amulette"},"Gérer la relation avec les fournisseurs","A compléter costume 3 Action 2 Sous-action 4"]
[null,3,"Partenaire commercial (à l'externe)",{"$f":"+'Synthèse 1'!$D$11","v":"Bracelet, amulette"},"Gérer la relation avec les clients","A compléter costume 3 Action 3 Sous-action 2"]
[null,3,"Partenaire commercial (à l'externe)",{"$f":"+'Synthèse 1'!$D$11","v":"Bracelet, amulette"},"Gérer la relation avec les clients","A compléter costume 3 Action 3 Sous-action 5"]
[null,3,"Partenaire commercial (à l'externe)",{"$f":"+'Synthèse 1'!$D$11","v":"Bracelet, amulette"},"Gérer la relation avec la presse","A compléter costume 3 Action 4 Sous-action 2"]
[null,3,"Partenaire commercial (à l'externe)",{"$f":"+'Synthèse 1'!$D$11","v":"Bracelet, amulette"},"Gérer la relation avec les partenaires financiers","A compléter costume 3 Action 5 Sous-action 3"]
[null,3,"Partenaire commercial (à l'externe)",{"$f":"+'Synthèse 1'!$D$11","v":"Bracelet, amulette"},"Gérer la relation avec les partenaires financiers","A compléter costume 3 Action 5 Sous-action 5"]
[null,4,"Mari / Amant",{"$f":"+'Synthèse 1'!$E$11","v":"Anneau, bracelet, amulette, paire de lunettes, style de vêtement"},"Communiquer régulièrement avec elle/lui","A compléter costume 4 Action 1 Sous-action 2"]
[null,4,"Mari / Amant",{"$f":"+'Synthèse 1'!$E$11","v":"Anneau, bracelet, amulette, paire de lunettes, style de vêtement"},"Communiquer régulièrement avec elle/lui","A compléter costume 4 Action 1 Sous-action 3"]
[null,4,"Mari / Amant",{"$f":"+'Synthèse 1'!$E$11","v":"Anneau, bracelet, amulette, paire de lunettes, style de vêtement"},"Accorder x heures par jour/semaine à elle/lui","A compléter costume 4 Action 2 Sous-action 2"]
[null,4,"Mari / Amant",{"$f":"+'Synthèse 1'!$E$11","v":"Anneau, bracelet, amulette, paire de lunettes, style de vêtement"},"Accorder x heures par jour/semaine à elle/lui","A compléter costume 4 Action 2 Sous-action 3"]
[null,4,"Mari / Amant",{"$f":"+'Synthèse 1'!$E$11","v":"Anneau, bracelet, amulette, paire de lunettes, style de vêtement"},"Répondre à ses demandes/messages/sollicitations","A compléter costume 4 Action 3 Sous-action 2"]
[null,4,"Mari / Amant",{"$f":"+'Synthèse 1'!$E$11","v":"Anneau, bracelet, amulette, paire de lunettes, style de vêtement"},"Emmener ma femme/mon mari au restaurant en tête à tête au moins 1 fois/semaine.","A compléter costume 4 Action 4 Sous-action 1"]
[null,4,"Mari / Amant",{"$f":"+'Synthèse 1'!$E$11","v":"Anneau, bracelet, amulette, paire de lunettes, style de vêtement"},"Emmener ma femme/mon mari au restaurant en tête à tête au moins 1 fois/semaine.","A compléter costume 4 Action 4 Sous-action 2"]
[null,4,"Mari / Amant",{"$f":"+'Synthèse 1'!$E$11","v":"Anneau, bracelet, amulette, paire de lunettes, style de vêtement"},"Emmener ma femme/mon mari au restaurant en tête à tête au moins 1 fois/semaine.","A compléter costume 4 Action 4 Sous-action 3"]
[null,4,"Mari / Amant",{"$f":"+'Synthèse 1'!$E$11","v":"Anneau, bracelet, amulette, paire de lunettes, style de vêtement"},"Emmener ma femme/mon mari au restaurant en tête à tête au moins 1 fois/semaine.","A compléter costume 4 Action 4 Sous-action 5"]
[null,4,"Mari / Amant",{"$f":"+'Synthèse 1'!$E$11","v":"Anneau, bracelet, amulette, paire de lunettes, style de vêtement"},"Programmer au moins 1 we entre amoureux/mois.","A compléter costume 4 Action 5 Sous-action 3"]
[null,5,"Père",null,"Apporter de l'amour à mon enfant selon son langage de l'amour (= cadeaux, moments de qualité, services rendus, toucher physique, paroles valorisantes)","A compléter costume 5 Action 1 Sous-action 4"]
[null,5,"Père",null,"Apporter de l'amour à mon enfant selon son langage de l'amour (= cadeaux, moments de qualité, services rendus, toucher physique, paroles valorisantes)","A compléter costume 5 Action 1 Sous-action 5"]
[null,5,"Père",null,"M'assurer que mon/mes enfant(s) à des vêtements propres à mettre chaque jour.","A compléter costume 5 Action 2 Sous-action 5"]
[null,5,"Père",null,"Assurer l'éducation de mon enfant et aider mon/mes enfant(s) dans ses apprentissages.","A compléter costume 5 Action 4 Sous-action 5"]
[null,6,"Oncle, fils, etc. (vie familiale)",null,"Appeler les membres X, Y, et R de ma famille 1 fois/mois.","A compléter costume 6 Action 1 Sous-action 1"]
[null,6,"Oncle, fils, etc. (vie familiale)",null,"Appeler les membres X, Y, et R de ma famille 1 fois/mois.","A compléter costume 6 Action 1 Sous-action 4"]
[null,6,"Oncle, fils, etc. (vie familiale)",null,"Répondre aux appels de mon père.","A compléter costume 6 Action 2 Sous-action 3"]
[null,6,"Oncle, fils, etc. (vie familiale)",null,"Soutenir Mme X dans les x prochains mois.","A compléter costume 6 Action 3 Sous-action 2"]
[null,6,"Oncle, fils, etc. (vie familiale)",null,"Soutenir Mme X dans les x prochains mois.","A compléter costume 6 Action 3 Sous-action 5"]
[null,6,"Oncle, fils, etc. (vie familiale)",null,"Organiser un weekend avec X et Y au moins 2 fois/an.","A compléter costume 6 Action 4 Sous-action 1"]
[null,6,"Oncle, fils, etc. (vie familiale)",null,"Organiser un weekend avec X et Y au moins 2 fois/an.","A compléter costume 6 Action 4 Sous-action 4"]
[null,6,"Oncle, fils, etc. (vie familiale)",null,"Me rendre disponible pour les anniversaires de P, S, et J chaque année.","A compléter costume 6 Action 5 Sous-action 3"]
[null,7,"Ami / copain (vie sociale)",null,"Passer du temps avec mes ami(e)s","A compléter costume 7 Action 1 Sous-action 2"]
[null,7,"Ami / copain (vie sociale)",null,"Rencontrer de nouvelles personnes","A compléter costume 7 Action 2 Sous-action 1"]
[null,7,"Ami / copain (vie sociale)",null,"Rencontrer de nouvelles personnes","A compléter costume 7 Action 2 Sous-action 2"]
[null,7,"Ami / copain (vie sociale)",null,"Appeler/écrire à mes ami(e)s X, Z, et A au moins 1 fois/mois.","A compléter costume 7 Action 3 Sous-action 5"]
[null,7,"Ami / copain (vie sociale)",null,"Programmer au moins 1 sortie avec mes amis W, R, et U /mois.","A compléter costume 7 Action 5 Sous-action 2"]
[null,7,"Ami / copain (vie sociale)",null,"Programmer au moins 1 sortie avec mes amis W, R, et U /mois.","A compléter costume 7 Action 5 Sous-action 5"]
[null,8,"Loisirs (activités, clubs, etc.)",null,"Lire 30 minutes/semaine un livre \"plaisir\".","A compléter costume 8 Action 1 Sous-action 1"]
[null,8,"Loisirs (activités, clubs, etc.)",null,"Lire 30 minutes/semaine un livre \"plaisir\".","A compléter costume 8 Action 1 Sous-action 2"]
[null,8,"Loisirs (activités, clubs, etc.)",null,"Lire 30 minutes/semaine un livre \"plaisir\".","A compléter costume 8 Action 1 Sous-action 4"]
[null,8,"Loisirs (activités, clubs, etc.)",null,"Participer au carnaval de ma ville avec mon enfant.","A compléter costume 8 Action 2 Sous-action 2"]
[null,8,"Loisirs (activités, clubs, etc.)",null,"Participer au carnaval de ma ville avec mon enfant.","A compléter costume 8 Action 2 Sous-action 4"]
[null,8,"Loisirs (activités, clubs, etc.)",null,"Prendre 7 jours de vacances tous les 3 mois.","A compléter costume 8 Action 3 Sous-action 2"]
[null,8,"Loisirs (activités, clubs, etc.)",null,"Pratiquer une activité qui me plaît chaque semaine, pendant x heures minimum.","A compléter costume 8 Action 4 Sous-action 4"]
[null,8,"Loisirs (activités, clubs, etc.)",null,"Visiter des expositions/lieux/musées","A compléter costume 8 Action 5 Sous-action 1"]
[null,8,"Loisirs (activités, clubs, etc.)",null,"Visiter des expositions/lieux/musées","A compléter costume 8 Action 5 Sous-action 2"]
[null,8,"Loisirs (activités, clubs, etc.)",null,"Visiter des expositions/lieux/musées","A compléter costume 8 Action 5 Sous-action 3"]
[null,8,"Loisirs (activités, clubs, etc.)",null,"Visiter des expositions/lieux/musées","A compléter costume 8 Action 5 Sous-action 4"]
[null,9,"Dormeur",null,"Suivre un rituel du coucher identique tous les soirs.","Me coucher chaque soir à heure fixe."]
[null,9,"Dormeur",null,"Suivre un rituel du coucher identique tous les soirs.","A compléter costume 9 Action 1 Sous-action 4"]
[null,9,"Dormeur",null,"Ne pas regarder d'écrans au moins 1h avant de me coucher.","A compléter costume 9 Action 2 Sous-action 2"]
[null,9,"Dormeur",null,"Ne pas regarder d'écrans au moins 1h avant de me coucher.","A compléter costume 9 Action 2 Sous-action 3"]
[null,9,"Dormeur",null,"Ne pas regarder d'écrans au moins 1h avant de me coucher.","A compléter costume 9 Action 2 Sous-action 4"]
[null,9,"Dormeur",null,"Me lever chaque matin à une heure fixe.","A compléter costume 9 Action 3 Sous-action 2"]
[null,9,"Dormeur",null,"Me lever chaque matin à une heure fixe.","A compléter costume 9 Action 3 Sous-action 3"]
[null,9,"Dormeur",null,"Me lever chaque matin à une heure fixe.","A compléter costume 9 Action 3 Sous-action 4"]
[null,9,"Dormeur",null,"Me lever chaque matin à une heure fixe.","A compléter costume 9 Action 3 Sous-action 5"]
[null,9,"Dormeur",null,"Méditer, visualiser, ou prendre un temps calme chaque jour de 10 minutes au réveil / à 13h00 / au coucher.","A compléter costume 9 Action 4 Sous-action 2"]
[null,9,"Dormeur",null,"Méditer, visualiser, ou prendre un temps calme chaque jour de 10 minutes au réveil / à 13h00 / au coucher.","A compléter costume 9 Action 4 Sous-action 3"]
[null,9,"Dormeur",null,"Méditer, visualiser, ou prendre un temps calme chaque jour de 10 minutes au réveil / à 13h00 / au coucher.","A compléter costume 9 Action 4 Sous-action 4"]
[null,9,"Dormeur",null,"Manger léger tous les soirs du lundi au vendredi, sans sucre ni café.","A compléter costume 9 Action 5 Sous-action 1"]
[null,9,"Dormeur",null,"Manger léger tous les soirs du lundi au vendredi, sans sucre ni café.","A compléter costume 9 Action 5 Sous-action 2"]
[null,9,"Dormeur",null,"Manger léger tous les soirs du lundi au vendredi, sans sucre ni café.","A compléter costume 9 Action 5 Sous-action 3"]
[null,10,"Sportif",null,"Manger des légumes midi et soir, et des protéines matin et midi.","A compléter costume 10 Action 5 Sous-action 3"]
[null,10,"Sportif",null,"Manger des légumes midi et soir, et des protéines matin et midi.","A compléter costume 10 Action 5 Sous-action 4"]
[null,10,"Sportif",null,"Manger des légumes midi et soir, et des protéines matin et midi.","A compléter costume 10 Action 5 Sous-action 5"]
[null,1,"Leader",null,"Répondre aux mails & aux appels importants","Répondre aux clients internes","Car il faut…","Je dois partager cette sous-action avec Mme J et M. K.","Je dois faire…","Avoir obtenu x fois…","Les étapes 1 et 4","De 8h00 à 9h00.","Au bureau à VILLE, ou dans mon bureau chez moi.","Avec M. O et M. Z.","Niveau d'énergie minimum = 6/10, qualités requises = , humeur = 7/10 min.","Min. 2h/semaine.","A revoir après l'étape 4 si elle sera toujours utile."]
[null,1,"Leader",null,"Répondre aux mails & aux appels importants","Répondre à la Presse","Parce que…","Je dois partager cette sous-action avec Mme O.","Je dois réaliser…","Quand le résultat X est atteint.","L'étape 4","Le matin, avant 12h00,","Au bureau à VILLE, ou dans mon bureau chez moi.","Avec l'ensemble de l'équipe X",null,"Max. 4h/jour.","Prévoir une autre solution éventuellement quand je serai à l'étape 5."]
[null,1,"Leader",null,"Présenter les résultats de l'entreprise","Anticiper le travail à produire par les équipes","Car c'est important de…",null,null,null,"L'étape 2","Le soir à partir de 18h00, et avant 21h00.","Chez moi ou chez M. F.",null,"Humeur = peu importe, qualités =, forces = , niveau d'énergie min. 4/10","Min. 1h/jour.","Sans fin = toujours utile même quand j'aurai 80 ans !"]
[null,1,"Leader",null,"Présenter les résultats de l'entreprise","A compléter costume 1 Action 2 Sous-action 3",null,null,null,null,"Toutes les 5 étapes.",null,"Au bureau à VILLE, ou dans mon bureau chez moi.","Avec Mme R, Mme T et M. F",null,"Max. 20h/an"]
[null,1,"Leader",null,"Présenter les résultats de l'entreprise","A compléter costume 1 Action 2 Sous-action 5"]
[null,1,"Leader",null,"Définir et valider la vision/stratégie à moyen et à long terme pour l'entreprise. Réflexions et discusssions stratégiques","A compléter costume 1 Action 3 Sous-action 1"]
[null,1,"Leader",null,"Définir et valider la vision/stratégie à moyen et à long terme pour l'entreprise. Réflexions et discusssions stratégiques","A compléter costume 1 Action 3 Sous-action 2"]
[null,1,"Leader",null,"Définir et valider la vision/stratégie à moyen et à long terme pour l'entreprise. Réflexions et discusssions stratégiques","A compléter costume 1 Action 3 Sous-action 5"]
[null,1,"Leader",null,"Gérer des rdv et appeler les clients/partenaires/fournisseurs/ etc.","A compléter costume 1 Action 4 Sous-action 1"]
[null,1,"Leader",null,"Gérer des rdv et appeler les clients/partenaires/fournisseurs/ etc.","A compléter costume 1 Action 4 Sous-action 4"]
[null,1,"Leader",null,"M'informer des tendances actuelles et futures qui pourraient impacter l'entreprise + Me former : min. 1 formation /an","A compléter costume 1 Action 5 Sous-action 2"]
[null,1,"Leader",null,"M'informer des tendances actuelles et futures qui pourraient impacter l'entreprise + Me former : min. 1 formation /an","A compléter costume 1 Action 5 Sous-action 4"]
[null,2,"Manager (en interne)",null,"Communiquer les actions prioritaires à mes équipes directes.","A compléter costume 2 Action 1 Sous-action 1"]
[null,2,"Manager (en interne)",null,"Communiquer les actions prioritaires à mes équipes directes.","A compléter costume 2 Action 1 Sous-action 3"]
[null,2,"Manager (en interne)",null,"Communiquer les actions prioritaires à mes équipes directes.","A compléter costume 2 Action 1 Sous-action 4"]
[null,2,"Manager (en interne)",null,"Encourager et motiver toutes les personnes que je manage.","A compléter costume 2 Action 2 Sous-action 4"]
[null,2,"Manager (en interne)",null,"Informer Mme J, M. O, et l'équipe X, des actions à entreprendre cette semaine","A compléter costume 2 Action 3 Sous-action 2"]
[null,2,"Manager (en interne)",null,"Communiquer les objectifs à atteindre aux directeurs des différents services/ unités/ départements.","A compléter costume 2 Action 4 Sous-action 5"]
[null,2,"Manager (en interne)",null,"Déléguer le travail 1 et 2 à Mme O.","A compléter costume 2 Action 5 Sous-action 4"]
[null,3,"Partenaire commercial (à l'externe)",null,"Gérer la relation avec les fournisseurs","A compléter costume 3 Action 2 Sous-action 5"]
[null,3,"Partenaire commercial (à l'externe)",null,"Gérer la relation avec les clients","A compléter costume 3 Action 3 Sous-action 1"]
[null,3,"Partenaire commercial (à l'externe)",null,"Gérer la relation avec les clients","A compléter costume 3 Action 3 Sous-action 4"]
[null,3,"Partenaire commercial (à l'externe)",null,"Gérer la relation avec la presse","A compléter costume 3 Action 4 Sous-action 1"]
[null,3,"Partenaire commercial (à l'externe)",null,"Gérer la relation avec la presse","A compléter costume 3 Action 4 Sous-action 3"]
[null,3,"Partenaire commercial (à l'externe)",null,"Gérer la relation avec la presse","A compléter costume 3 Action 4 Sous-action 4"]
[null,3,"Partenaire commercial (à l'externe)",null,"Gérer la relation avec la presse","A compléter costume 3 Action 4 Sous-action 5"]
[null,3,"Partenaire commercial (à l'externe)",null,"Gérer la relation avec les partenaires financiers","A compléter costume 3 Action 5 Sous-action 2"]
[null,3,"Partenaire commercial (à l'externe)",null,"Gérer la relation avec les partenaires financiers","A compléter costume 3 Action 5 Sous-action 4"]
[null,4,"Mari / Amant",null,"Communiquer régulièrement avec elle/lui","A compléter costume 4 Action 1 Sous-action 5"]
[null,4,"Mari / Amant",null,"Accorder x heures par jour/semaine à elle/lui","A compléter costume 4 Action 2 Sous-action 1"]
[null,4,"Mari / Amant",null,"Accorder x heures par jour/semaine à elle/lui","A compléter costume 4 Action 2 Sous-action 4"]
[null,4,"Mari / Amant",null,"Répondre à ses demandes/messages/sollicitations","A compléter costume 4 Action 3 Sous-action 1"]
[null,4,"Mari / Amant",null,"Répondre à ses demandes/messages/sollicitations","A compléter costume 4 Action 3 Sous-action 3"]
[null,4,"Mari / Amant",null,"Répondre à ses demandes/messages/sollicitations","A compléter costume 4 Action 3 Sous-action 5"]
[null,4,"Mari / Amant",null,"Emmener ma femme/mon mari au restaurant en tête à tête au moins 1 fois/semaine.","A compléter costume 4 Action 4 Sous-action 4"]
[null,4,"Mari / Amant",null,"Programmer au moins 1 we entre amoureux/mois.","A compléter costume 4 Action 5 Sous-action 1"]
[null,4,"Mari / Amant",null,"Programmer au moins 1 we entre amoureux/mois.","A compléter costume 4 Action 5 Sous-action 2"]
[null,4,"Mari / Amant",null,"Programmer au moins 1 we entre amoureux/mois.","A compléter costume 4 Action 5 Sous-action 5"]
[null,5,"Père",null,"Apporter de l'amour à mon enfant selon son langage de l'amour (= cadeaux, moments de qualité, services rendus, toucher physique, paroles valorisantes)","Aller chercher mon enfant à l'école chaque lundi et mardi soir."]
[null,5,"Père",null,"Apporter de l'amour à mon enfant selon son langage de l'amour (= cadeaux, moments de qualité, services rendus, toucher physique, paroles valorisantes)","A compléter costume 5 Action 1 Sous-action 2"]
[null,5,"Père",null,"Apporter de l'amour à mon enfant selon son langage de l'amour (= cadeaux, moments de qualité, services rendus, toucher physique, paroles valorisantes)","A compléter costume 5 Action 1 Sous-action 3"]
[null,5,"Père",null,"M'assurer que mon/mes enfant(s) à des vêtements propres à mettre chaque jour.","A compléter costume 5 Action 2 Sous-action 1"]
[null,5,"Père",null,"M'assurer que mon/mes enfant(s) à des vêtements propres à mettre chaque jour.","A compléter costume 5 Action 2 Sous-action 2"]
[null,5,"Père",null,"M'assurer que mon/mes enfant(s) à des vêtements propres à mettre chaque jour.","A compléter costume 5 Action 2 Sous-action 3"]
[null,5,"Père",null,"M'assurer que mon/mes enfant(s) à des vêtements propres à mettre chaque jour.","A compléter costume 5 Action 2 Sous-action 4"]
[null,5,"Père",null,"Accompagner mon/mes enfant(s) à ses activités extra-scolaires. Assurer les déplacements de mon/mes enfant(s)","A compléter costume 5 Action 3 Sous-action 1"]
[null,5,"Père",null,"Accompagner mon/mes enfant(s) à ses activités extra-scolaires. Assurer les déplacements de mon/mes enfant(s)","A compléter costume 5 Action 3 Sous-action 2"]
[null,5,"Père",null,"Accompagner mon/mes enfant(s) à ses activités extra-scolaires. Assurer les déplacements de mon/mes enfant(s)","A compléter costume 5 Action 3 Sous-action 4"]
[null,5,"Père",null,"Accompagner mon/mes enfant(s) à ses activités extra-scolaires. Assurer les déplacements de mon/mes enfant(s)","A compléter costume 5 Action 3 Sous-action 5"]
[null,5,"Père",null,"Assurer l'éducation de mon enfant et aider mon/mes enfant(s) dans ses apprentissages.","A compléter costume 5 Action 4 Sous-action 1"]
[null,5,"Père",null,"Assurer l'éducation de mon enfant et aider mon/mes enfant(s) dans ses apprentissages.","A compléter costume 5 Action 4 Sous-action 2"]
[null,5,"Père",null,"Assurer l'éducation de mon enfant et aider mon/mes enfant(s) dans ses apprentissages.","A compléter costume 5 Action 4 Sous-action 4"]
[null,5,"Père",null,"Assurer un environnement sain, propre et sécurisé pour mon/mes enfant(s)","A compléter costume 5 Action 5 Sous-action 1"]
[null,5,"Père",null,"Assurer un environnement sain, propre et sécurisé pour mon/mes enfant(s)","A compléter costume 5 Action 5 Sous-action 2"]
[null,5,"Père",null,"Assurer un environnement sain, propre et sécurisé pour mon/mes enfant(s)","A compléter costume 5 Action 5 Sous-action 3"]
[null,5,"Père",null,"Assurer un environnement sain, propre et sécurisé pour mon/mes enfant(s)","A compléter costume 5 Action 5 Sous-action 4"]
[null,5,"Père",null,"Assurer un environnement sain, propre et sécurisé pour mon/mes enfant(s)","A compléter costume 5 Action 5 Sous-action 5"]
[null,6,"Oncle, fils, etc. (vie familiale)",null,"Appeler les membres X, Y, et R de ma famille 1 fois/mois.","A compléter costume 6 Action 1 Sous-action 2"]
[null,6,"Oncle, fils, etc. (vie familiale)",null,"Appeler les membres X, Y, et R de ma famille 1 fois/mois.","A compléter costume 6 Action 1 Sous-action 5"]
[null,6,"Oncle, fils, etc. (vie familiale)",null,"Répondre aux appels de mon père.","A compléter costume 6 Action 2 Sous-action 1"]
[null,6,"Oncle, fils, etc. (vie familiale)",null,"Répondre aux appels de mon père.","A compléter costume 6 Action 2 Sous-action 4"]
[null,6,"Oncle, fils, etc. (vie familiale)",null,"Soutenir Mme X dans les x prochains mois.","A compléter costume 6 Action 3 Sous-action 3"]
[null,6,"Oncle, fils, etc. (vie familiale)",null,"Organiser un weekend avec X et Y au moins 2 fois/an.","A compléter costume 6 Action 4 Sous-action 2"]
[null,6,"Oncle, fils, etc. (vie familiale)",null,"Organiser un weekend avec X et Y au moins 2 fois/an.","A compléter costume 6 Action 4 Sous-action 5"]
[null,6,"Oncle, fils, etc. (vie familiale)",null,"Me rendre disponible pour les anniversaires de P, S, et J chaque année.","A compléter costume 6 Action 5 Sous-action 1"]
[null,6,"Oncle, fils, etc. (vie familiale)",null,"Me rendre disponible pour les anniversaires de P, S, et J chaque année.","A compléter costume 6 Action 5 Sous-action 4"]
[null,7,"Ami / copain (vie sociale)",null,"Passer du temps avec mes ami(e)s","A compléter costume 7 Action 1 Sous-action 1"]
[null,7,"Ami / copain (vie sociale)",null,"Passer du temps avec mes ami(e)s","A compléter costume 7 Action 1 Sous-action 3"]
[null,7,"Ami / copain (vie sociale)",null,"Passer du temps avec mes ami(e)s","A compléter costume 7 Action 1 Sous-action 4"]
[null,7,"Ami / copain (vie sociale)",null,"Rencontrer de nouvelles personnes","A compléter costume 7 Action 2 Sous-action 3"]
[null,7,"Ami / copain (vie sociale)",null,"Rencontrer de nouvelles personnes","A compléter costume 7 Action 2 Sous-action 4"]
[null,7,"Ami / copain (vie sociale)",null,"Rencontrer de nouvelles personnes","A compléter costume 7 Action 2 Sous-action 5"]
[null,7,"Ami / copain (vie sociale)",null,"Appeler/écrire à mes ami(e)s X, Z, et A au moins 1 fois/mois.","A compléter costume 7 Action 3 Sous-action 1"]
[null,7,"Ami / copain (vie sociale)",null,"Appeler/écrire à mes ami(e)s X, Z, et A au moins 1 fois/mois.","A compléter costume 7 Action 3 Sous-action 2"]
[null,7,"Ami / copain (vie sociale)",null,"Appeler/écrire à mes ami(e)s X, Z, et A au moins 1 fois/mois.","A compléter costume 7 Action 3 Sous-action 3"]
[null,7,"Ami / copain (vie sociale)",null,"Appeler/écrire à mes ami(e)s X, Z, et A au moins 1 fois/mois.","A compléter costume 7 Action 3 Sous-action 4"]
[null,7,"Ami / copain (vie sociale)",null,"Répondre à mes ami(e)s dans les 3 jours.","A compléter costume 7 Action 4 Sous-action 1"]
[null,7,"Ami / copain (vie sociale)",null,"Répondre à mes ami(e)s dans les 3 jours.","A compléter costume 7 Action 4 Sous-action 2"]
[null,7,"Ami / copain (vie sociale)",null,"Répondre à mes ami(e)s dans les 3 jours.","A compléter costume 7 Action 4 Sous-action 3"]
[null,7,"Ami / copain (vie sociale)",null,"Répondre à mes ami(e)s dans les 3 jours.","A compléter costume 7 Action 4 Sous-action 4"]
[null,7,"Ami / copain (vie sociale)",null,"Programmer au moins 1 sortie avec mes amis W, R, et U /mois.","A compléter costume 7 Action 5 Sous-action 1"]
[null,7,"Ami / copain (vie sociale)",null,"Programmer au moins 1 sortie avec mes amis W, R, et U /mois.","A compléter costume 7 Action 5 Sous-action 4"]
[null,8,"Loisirs (activités, clubs, etc.)",null,"Lire 30 minutes/semaine un livre \"plaisir\".","A compléter costume 8 Action 1 Sous-action 5"]
[null,8,"Loisirs (activités, clubs, etc.)",null,"Participer au carnaval de ma ville avec mon enfant.","A compléter costume 8 Action 2 Sous-action 1"]
[null,8,"Loisirs (activités, clubs, etc.)",null,"Participer au carnaval de ma ville avec mon enfant.","A compléter costume 8 Action 2 Sous-action 3"]
[null,8,"Loisirs (activités, clubs, etc.)",null,"Prendre 7 jours de vacances tous les 3 mois.","A compléter costume 8 Action 3 Sous-action 1"]
[null,8,"Loisirs (activités, clubs, etc.)",null,"Prendre 7 jours de vacances tous les 3 mois.","A compléter costume 8 Action 3 Sous-action 4"]
[null,8,"Loisirs (activités, clubs, etc.)",null,"Prendre 7 jours de vacances tous les 3 mois.","A compléter costume 8 Action 3 Sous-action 5"]
[null,8,"Loisirs (activités, clubs, etc.)",null,"Pratiquer une activité qui me plaît chaque semaine, pendant x heures minimum.","A compléter costume 8 Action 4 Sous-action 2"]
[null,8,"Loisirs (activités, clubs, etc.)",null,"Pratiquer une activité qui me plaît chaque semaine, pendant x heures minimum.","A compléter costume 8 Action 4 Sous-action 3"]
[null,8,"Loisirs (activités, clubs, etc.)",null,"Pratiquer une activité qui me plaît chaque semaine, pendant x heures minimum.","A compléter costume 8 Action 4 Sous-action 5"]
[null,8,"Loisirs (activités, clubs, etc.)",null,"Visiter des expositions/lieux/musées","A compléter costume 8 Action 5 Sous-action 5"]
[null,9,"Dormeur",null,"Suivre un rituel du coucher identique tous les soirs.","A compléter costume 9 Action 1 Sous-action 5"]
[null,9,"Dormeur",null,"Ne pas regarder d'écrans au moins 1h avant de me coucher.","A compléter costume 9 Action 2 Sous-action 1"]
[null,9,"Dormeur",null,"Ne pas regarder d'écrans au moins 1h avant de me coucher.","A compléter costume 9 Action 2 Sous-action 5"]
[null,9,"Dormeur",null,"Me lever chaque matin à une heure fixe.","A compléter costume 9 Action 3 Sous-action 1"]
[null,9,"Dormeur",null,"Méditer, visualiser, ou prendre un temps calme chaque jour de 10 minutes au réveil / à 13h00 / au coucher.","A compléter costume 9 Action 4 Sous-action 1"]
[null,9,"Dormeur",null,"Méditer, visualiser, ou prendre un temps calme chaque jour de 10 minutes au réveil / à 13h00 / au coucher.","A compléter costume 9 Action 4 Sous-action 5"]
[null,9,"Dormeur",null,"Manger léger tous les soirs du lundi au vendredi, sans sucre ni café.","A compléter costume 9 Action 5 Sous-action 4"]
[null,9,"Dormeur",null,"Manger léger tous les soirs du lundi au vendredi, sans sucre ni café.","A compléter costume 9 Action 5 Sous-action 5"]
[null,10,"Sportif",null,"Acheter mes tenues et mon matériel de sport.","A compléter costume 10 Action 1 Sous-action 1"]
[null,10,"Sportif",null,"Acheter mes tenues et mon matériel de sport.","A compléter costume 10 Action 1 Sous-action 3"]
[null,10,"Sportif",null,"Acheter mes tenues et mon matériel de sport.","A compléter costume 10 Action 1 Sous-action 5"]
[null,10,"Sportif",null,"Courir 2 fois / semaine pendant 30 minutes minimum.","A compléter costume 10 Action 2 Sous-action 1"]
[null,10,"Sportif",null,"Courir 2 fois / semaine pendant 30 minutes minimum.","A compléter costume 10 Action 2 Sous-action 2"]
[null,10,"Sportif",null,"Courir 2 fois / semaine pendant 30 minutes minimum.","A compléter costume 10 Action 2 Sous-action 3"]
[null,10,"Sportif",null,"M'étirer 10 minutes tous les soirs à 21h00.","A compléter costume 10 Action 3 Sous-action 1"]
[null,10,"Sportif",null,"M'étirer 10 minutes tous les soirs à 21h00.","A compléter costume 10 Action 3 Sous-action 3"]
[null,10,"Sportif",null,"M'étirer 10 minutes tous les soirs à 21h00.","A compléter costume 10 Action 3 Sous-action 4"]
[null,10,"Sportif",null,"M'étirer 10 minutes tous les soirs à 21h00.","A compléter costume 10 Action 3 Sous-action 5"]
[null,10,"Sportif",null,"Boire au moins 1,5 litres d'eau par jour.","A compléter costume 10 Action 4 Sous-action 1"]
[null,10,"Sportif",null,"Boire au moins 1,5 litres d'eau par jour.","A compléter costume 10 Action 4 Sous-action 2"]
[null,10,"Sportif",null,"Boire au moins 1,5 litres d'eau par jour.","A compléter costume 10 Action 4 Sous-action 4"]
[null,10,"Sportif",null,"Boire au moins 1,5 litres d'eau par jour.","A compléter costume 10 Action 4 Sous-action 5"]