{"text_format":"1","workbook":"xlsx","n_sheets":4,"sheets":["Feuil1","Eleve1","Eleve2","Eleve3"],"not_rendered":{"charts":0,"images":0,"macros":0,"external_links":0,"defined_names":2,"comments":0,"pivot_tables":0},"unopened":[],"bounds":{"document_bytes":16777216,"sheet_cells":100000,"rows_first":2000,"rows_last":500,"rows_between":2000,"halvings":0,"cell_chars":16384,"cell_head_chars":4096},"cells_cut":0,"cells_raw":0,"read":"whole","date_system":"1900"}

{"sheet":"Feuil1","index":0,"n_rows":16,"n_cols":6,"rows_kept":16,"cut":false,"hidden":false,"merged":[]}
["NOM2"]
[{"$f":"INDEX(A5:A12,MATCH(A1,_xlfn.BYROW(A5:A7,_xlfn.LAMBDA(_xlpm.x,INDIRECT(\"'\"&_xlpm.x&\"'!B42\"))),0))","v":"Eleve1"}]
[null,null,null,null,"Note1",{"$f":"_xlfn.LET(_xlpm.result,_xlfn.XLOOKUP(E3,INDIRECT(\"'\"&$A$2&\"'!A1:G1\"),INDIRECT(\"'\"&$A$2&\"'!A2:G2\"),\"\",0),IF(ISBLANK(_xlpm.result),\"\",_xlpm.result))","v":""}]
["Feuilles",null,null,null,"Note2",{"$f":"_xlfn.LET(_xlpm.result,_xlfn.XLOOKUP(E4,INDIRECT(\"'\"&$A$2&\"'!A1:G1\"),INDIRECT(\"'\"&$A$2&\"'!A2:G2\"),\"\",0),IF(ISBLANK(_xlpm.result),\"\",_xlpm.result))","v":19}]
["Eleve1",null,null,null,"Note3",{"$f":"_xlfn.LET(_xlpm.result,_xlfn.XLOOKUP(E5,INDIRECT(\"'\"&$A$2&\"'!A1:G1\"),INDIRECT(\"'\"&$A$2&\"'!A2:G2\"),\"\",0),IF(ISBLANK(_xlpm.result),\"\",_xlpm.result))","v":""}]
["Eleve2",null,null,null,"Note4",{"$f":"_xlfn.LET(_xlpm.result,_xlfn.XLOOKUP(E6,INDIRECT(\"'\"&$A$2&\"'!A1:G1\"),INDIRECT(\"'\"&$A$2&\"'!A2:G2\"),\"\",0),IF(ISBLANK(_xlpm.result),\"\",_xlpm.result))","v":""}]
["Eleve3",null,null,null,"Note5",{"$f":"_xlfn.LET(_xlpm.result,_xlfn.XLOOKUP(E7,INDIRECT(\"'\"&$A$2&\"'!A1:G1\"),INDIRECT(\"'\"&$A$2&\"'!A2:G2\"),\"\",0),IF(ISBLANK(_xlpm.result),\"\",_xlpm.result))","v":""}]
[null,null,null,null,"Note6",{"$f":"_xlfn.LET(_xlpm.result,_xlfn.XLOOKUP(E8,INDIRECT(\"'\"&$A$2&\"'!A1:G1\"),INDIRECT(\"'\"&$A$2&\"'!A2:G2\"),\"\",0),IF(ISBLANK(_xlpm.result),\"\",_xlpm.result))","v":""}]
[null,null,null,null,"Note7",{"$f":"_xlfn.LET(_xlpm.result,_xlfn.XLOOKUP(E9,INDIRECT(\"'\"&$A$2&\"'!A1:G1\"),INDIRECT(\"'\"&$A$2&\"'!A2:G2\"),\"\",0),IF(ISBLANK(_xlpm.result),\"\",_xlpm.result))","v":""}]
[]
[]
[]
["Elèves"]
["NOM1"]
["NOM2"]
["NOM3"]

{"sheet":"Eleve1","index":1,"n_rows":42,"n_cols":7,"rows_kept":42,"cut":false,"hidden":false,"merged":[]}
["Note1","Note2","Note3","Note4","Note5","Note6","Note7"]
[null,19]
[]
[]
[]
[]
[]
[]
[]
[]
[]
[]
[]
[]
[]
[]
[]
[]
[]
[]
[]
[]
[]
[]
[]
[]
[]
[]
[]
[]
[]
[]
[]
[]
[]
[]
[]
[]
[]
[]
[]
[null,"NOM2"]

{"sheet":"Eleve2","index":2,"n_rows":42,"n_cols":7,"rows_kept":42,"cut":false,"hidden":false,"merged":[]}
["Note1","Note2","Note3","Note4","Note5","Note6","Note7"]
[null,7,null,null,11,null,13]
[]
[]
[]
[]
[]
[]
[]
[]
[]
[]
[]
[]
[]
[]
[]
[]
[]
[]
[]
[]
[]
[]
[]
[]
[]
[]
[]
[]
[]
[]
[]
[]
[]
[]
[]
[]
[]
[]
[]
[null,"NOM1"]

{"sheet":"Eleve3","index":3,"n_rows":42,"n_cols":7,"rows_kept":42,"cut":false,"hidden":false,"merged":[]}
["Note1","Note2","Note3","Note4","Note5","Note6","Note7"]
[null,null,8,12]
[]
[]
[]
[]
[]
[]
[]
[]
[]
[]
[]
[]
[]
[]
[]
[]
[]
[]
[]
[]
[]
[]
[]
[]
[]
[]
[]
[]
[]
[]
[]
[]
[]
[]
[]
[]
[]
[]
[]
[null,"NOM3"]