{"text_format":"1","workbook":"xlsx","n_sheets":4,"sheets":["flash ","Archive","Filtrage","2023"],"not_rendered":{"charts":0,"images":5,"macros":1,"external_links":0,"defined_names":3,"comments":0,"pivot_tables":0},"unopened":[],"bounds":{"document_bytes":16777216,"sheet_cells":100000,"rows_first":2000,"rows_last":500,"rows_between":2000,"halvings":0,"cell_chars":16384,"cell_head_chars":4096},"cells_cut":0,"cells_raw":0,"read":"whole","date_system":"1900"}

{"sheet":"flash ","index":0,"n_rows":30,"n_cols":17,"rows_kept":30,"cut":false,"hidden":false,"merged":[[0,4,3,11],[5,6,5,7],[5,9,5,10],[15,13,16,14],[15,16,16,17]]}
[null,null,null,null,"Bordereau du matin / Retour lettres recommandées"]
[]
[]
[]
[]
[null,null,null,null,null,null,null,null,null,"DATE",null,{"$f":"TODAY()","v":"2023-07-31"}]
[]
[null,null,null,null,"Nombre de lettres Recommandées",null,null,null,{"$f":"COUNTA(C15:C30,F15:F30,I15:I30,L15:L30)","v":0}]
[null,null,null,null,"Nombre de lettres Suivis"]
[]
[null,null,null,null,null,null,"Total",null,{"$f":"I8+I9","v":0}]
[]
[]
[]
[null,1,null,null,17,null,null,33,null,null,49]
[null,2,null,null,18,null,null,34,null,null,50,null,null,1,null,null,2]
[null,3,null,null,19,null,null,35,null,null,51]
[null,4,null,null,20,null,null,36,null,null,52]
[null,5,null,null,21,null,null,37,null,null,53]
[null,6,null,null,22,null,null,38,null,null,54]
[null,7,null,null,23,null,null,39,null,null,55]
[null,8,null,null,24,null,null,40,null,null,56]
[null,9,null,null,25,null,null,41,null,null,57]
[null,10,null,null,26,null,null,42,null,null,58]
[null,11,null,null,27,null,null,43,null,null,59]
[null,12,null,null,28,null,null,44,null,null,60]
[null,13,null,null,29,null,null,45,null,null,61]
[null,14,null,null,30,null,null,46,null,null,62]
[null,15,null,null,31,null,null,47,null,null,63]
[null,16,null,null,32,null,null,48,null,null,64]

{"sheet":"Archive","index":1,"n_rows":1030,"n_cols":4,"rows_kept":1030,"cut":false,"hidden":false,"merged":[]}
["Date","N° de Recommandé"]
["2023-05-11","%004400086301655476063604250F03^"]
["2023-05-22","%004400086301655511731604250F03^"]
["2023-07-17","%004400086301655686054604250F03^"]
["2023-07-17","%004400086301655689674604250F03^"]
["2023-05-04","%004400087000758585765601250F03^"]
["2023-05-12","%004400087000760361345601250F03^"]
["2023-06-14","%004400087000765742467604250F03^",null,""]
["2023-07-24","%004400087000798110400604250F03^"]
["2023-05-22","%004400087500082461939604250F03^"]
["2023-07-21","%004400087500088587037604250F03^"]
["2023-07-20","%0044032116C1634842096802250"]
["2023-05-11","%004403286301128116397601250F03^                                        "]
["2023-06-08","%004403286301731020587601250F03^                                        "]
["2023-06-08","%004403286301731020588601250F03^                                        "]
["2023-05-05","%004403287000759465521601250F03^"]
["2023-05-12","%004403287000760510706601250F03^"]
["2023-05-15","%004403287000760890571601250F03^"]
["2023-05-15","%004403287000761191198601250F03^"]
["2023-06-07","%004403287000764218834604250F03^"]
["2023-06-12","%004403287000764871497604250F03^"]
["2023-07-13","%004403287000796616255604250F03^"]
["2023-07-13","%004403287000797017944604250F03^"]
["2023-07-20","%004403287000798012057604250F03^"]
["2023-06-27","(004403286301731818569601250F03-                                        "]
["2023-06-26","(004403287500084265124604250F03-"]
["2023-05-09","1A01335083720"]
["2023-05-09","1A04720897162"]
["2023-06-29","1A05333282710"]
["2023-06-30","1A05407793852"]
["2023-07-25","1A06709316947"]
["2023-06-29","1A06795089206"]
["2023-07-20","1A07680986334"]
["2023-06-05","1A10226093748"]
["2023-07-05","1A10763724341"]
["2023-06-12","1A11113518863"]
["2023-05-31","1A11516859501"]
["2023-07-25","1A12868082067"]
["2023-07-26","1A12868082074"]
["2023-05-15","1A13974728146"]
["2023-07-10","1A13977376764"]
["2023-07-17","1A14105209244"]
["2023-06-09","1A14312365092"]
["2023-07-19","1A14543371398"]
["2023-07-03","1A14838456175"]
["2023-07-03","1A15072673953"]
["2023-07-06","1A15482823689"]
["2023-05-22","1A15651852038"]
["2023-05-17","1A15732868309"]
["2023-07-20","1A15778894508"]
["2023-07-20","1A16079293236"]
["2023-06-29","1A16157706023"]
["2023-07-13","1A16372666997"]
["2023-07-17","1A16756043987"]
["2023-07-25","1A16756044021"]
["2023-07-06","1A16825172532"]
["2023-05-31","1A16825172587"]
["2023-06-09","1A16986049889"]
["2023-05-09","1A17045244986"]
["2023-05-15","1A17133637669"]
["2023-07-19","1A17172465735"]
["2023-05-30","1A17180493553"]
["2023-05-02","1A17196449124"]
["2023-05-04","1A17231564799"]
["2023-05-30","1A17231564805"]
["2023-05-24","1A17236251502"]
["2023-06-09","1A17281868885"]
["2023-06-22","1A17327424556"]
["2023-07-17","1A17363674892"]
["2023-07-10","1A17411118354"]
["2023-07-13","1A17416878338"]
["2023-07-24","1A17495268587"]
["2023-07-06","1A17506772409"]
["2023-06-28","1A17508398119"]
["2023-07-06","1A17511627534"]
["2023-07-03","1A17534278348"]
["2023-07-17","1A17534278362"]
["2023-06-01","1A17546598038"]
["2023-07-03","1A17581885780"]
["2023-07-13","1A17588676145"]
["2023-06-29","1A17623660122"]
["2023-06-02","1A17632973220"]
["2023-07-24","1A17702458909"]
["2023-05-22","1A17729865094"]
["2023-07-10","1A17729865179"]
["2023-05-03","1A17894599978"]
["2023-07-03","1A17969671929"]
["2023-07-11","1A18018104306"]
["2023-07-12","1A18116005611"]
["2023-06-12","1A18388983266"]
["2023-05-17","1A18472190020"]
["2023-07-10","1A18478044785"]
["2023-05-23","1A18513917104"]
["2023-07-20","1A18559927976"]
["2023-05-15","1A18637639906"]
["2023-05-22","1A18655599404"]
["2023-05-05","1A18701502501"]
["2023-05-22","1A18740014669"]
["2023-05-22","1A18740542636"]
["2023-05-16","1A18766344108"]
["2023-07-04","1A18774269196"]
["2023-06-08","1A18798252488"]
["2023-07-03","1A18826382217"]
["2023-07-06","1A18878747941"]
["2023-05-22","1A18918895380"]
["2023-06-30","1A18952975406"]
["2023-07-03","1A18983797923"]
["2023-07-19","1A18983797930"]
["2023-05-04","1A18998650336"]
["2023-05-02","1A19108682445"]
["2023-05-22","1A19194990721"]
["2023-05-26","1A19249888980"]
["2023-07-24","1A19280556183"]
["2023-07-25","1A19284027191"]
["2023-07-24","1A19287786743"]
["2023-07-26","1A19287877779"]
["2023-07-24","1A19294885507"]
["2023-07-19","1A19407741782"]
["2023-06-05","1A19409980882"]
["2023-06-05","1A19414134553"]
{"$rows_left_out":911}
{"sheet":"Filtrage","index":2,"n_rows":102,"n_cols":9,"rows_kept":102,"cut":false,"hidden":false,"merged":[]}
[]
[null,null,"Entrer un n° ","1A15072673953",null,null,"ou une date","2023-06-05",{"$f":"COUNTIF(Archive!A:A,Filtrage!H2)","v":27}]
[]
[null,null,"Date :",{"$f":"IFERROR(INDEX(Archive!A:A,MATCH(D2,Archive!B:B,0)),\"Le n° n'existe pas\")","v":"2023-07-03"},null,null,null,{"$f":"IF(ROWS($G$4:G4)>$I$2,\"\",INDEX(Archive!B:B,MATCH($H$2,Archive!A:A,0)+G4-1))","v":"1A07680986334"}]
[null,null,null,null,null,null,null,{"$f":"IF(ROWS($G$4:G5)>$I$2,\"\",INDEX(Archive!B:B,MATCH($H$2,Archive!A:A,0)+G5-1))","v":"1A07680986334"}]
[null,null,null,null,null,null,null,{"$f":"IF(ROWS($G$4:G6)>$I$2,\"\",INDEX(Archive!B:B,MATCH($H$2,Archive!A:A,0)+G6-1))","v":"1A07680986334"}]
[null,null,null,null,null,null,null,{"$f":"IF(ROWS($G$4:G7)>$I$2,\"\",INDEX(Archive!B:B,MATCH($H$2,Archive!A:A,0)+G7-1))","v":"1A07680986334"}]
[null,null,null,null,null,null,null,{"$f":"IF(ROWS($G$4:G8)>$I$2,\"\",INDEX(Archive!B:B,MATCH($H$2,Archive!A:A,0)+G8-1))","v":"1A07680986334"}]
[null,null,null,null,null,null,null,{"$f":"IF(ROWS($G$4:G9)>$I$2,\"\",INDEX(Archive!B:B,MATCH($H$2,Archive!A:A,0)+G9-1))","v":"1A07680986334"}]
[null,null,null,null,null,null,null,{"$f":"IF(ROWS($G$4:G10)>$I$2,\"\",INDEX(Archive!B:B,MATCH($H$2,Archive!A:A,0)+G10-1))","v":"1A07680986334"}]
[null,null,null,null,null,null,null,{"$f":"IF(ROWS($G$4:G11)>$I$2,\"\",INDEX(Archive!B:B,MATCH($H$2,Archive!A:A,0)+G11-1))","v":"1A07680986334"}]
[null,null,null,null,null,null,null,{"$f":"IF(ROWS($G$4:G12)>$I$2,\"\",INDEX(Archive!B:B,MATCH($H$2,Archive!A:A,0)+G12-1))","v":"1A07680986334"}]
[null,null,null,null,null,null,null,{"$f":"IF(ROWS($G$4:G13)>$I$2,\"\",INDEX(Archive!B:B,MATCH($H$2,Archive!A:A,0)+G13-1))","v":"1A07680986334"}]
[null,null,null,null,null,null,null,{"$f":"IF(ROWS($G$4:G14)>$I$2,\"\",INDEX(Archive!B:B,MATCH($H$2,Archive!A:A,0)+G14-1))","v":"1A07680986334"}]
[null,null,null,null,null,null,null,{"$f":"IF(ROWS($G$4:G15)>$I$2,\"\",INDEX(Archive!B:B,MATCH($H$2,Archive!A:A,0)+G15-1))","v":"1A07680986334"}]
[null,null,null,null,null,null,null,{"$f":"IF(ROWS($G$4:G16)>$I$2,\"\",INDEX(Archive!B:B,MATCH($H$2,Archive!A:A,0)+G16-1))","v":"1A07680986334"}]
[null,null,null,null,null,null,null,{"$f":"IF(ROWS($G$4:G17)>$I$2,\"\",INDEX(Archive!B:B,MATCH($H$2,Archive!A:A,0)+G17-1))","v":"1A07680986334"}]
[null,null,null,null,null,null,null,{"$f":"IF(ROWS($G$4:G18)>$I$2,\"\",INDEX(Archive!B:B,MATCH($H$2,Archive!A:A,0)+G18-1))","v":"1A07680986334"}]
[null,null,null,null,null,null,null,{"$f":"IF(ROWS($G$4:G19)>$I$2,\"\",INDEX(Archive!B:B,MATCH($H$2,Archive!A:A,0)+G19-1))","v":"1A07680986334"}]
[null,null,null,null,null,null,null,{"$f":"IF(ROWS($G$4:G20)>$I$2,\"\",INDEX(Archive!B:B,MATCH($H$2,Archive!A:A,0)+G20-1))","v":"1A07680986334"}]
[null,null,null,null,null,null,null,{"$f":"IF(ROWS($G$4:G21)>$I$2,\"\",INDEX(Archive!B:B,MATCH($H$2,Archive!A:A,0)+G21-1))","v":"1A07680986334"}]
[null,null,null,null,null,null,null,{"$f":"IF(ROWS($G$4:G22)>$I$2,\"\",INDEX(Archive!B:B,MATCH($H$2,Archive!A:A,0)+G22-1))","v":"1A07680986334"}]
[null,null,null,null,null,null,null,{"$f":"IF(ROWS($G$4:G23)>$I$2,\"\",INDEX(Archive!B:B,MATCH($H$2,Archive!A:A,0)+G23-1))","v":"1A07680986334"}]
[null,null,null,null,null,null,null,{"$f":"IF(ROWS($G$4:G24)>$I$2,\"\",INDEX(Archive!B:B,MATCH($H$2,Archive!A:A,0)+G24-1))","v":"1A07680986334"}]
[null,null,null,null,null,null,null,{"$f":"IF(ROWS($G$4:G25)>$I$2,\"\",INDEX(Archive!B:B,MATCH($H$2,Archive!A:A,0)+G25-1))","v":"1A07680986334"}]
[null,null,null,null,null,null,null,{"$f":"IF(ROWS($G$4:G26)>$I$2,\"\",INDEX(Archive!B:B,MATCH($H$2,Archive!A:A,0)+G26-1))","v":"1A07680986334"}]
[null,null,null,null,null,null,null,{"$f":"IF(ROWS($G$4:G27)>$I$2,\"\",INDEX(Archive!B:B,MATCH($H$2,Archive!A:A,0)+G27-1))","v":"1A07680986334"}]
[null,null,null,null,null,null,null,{"$f":"IF(ROWS($G$4:G28)>$I$2,\"\",INDEX(Archive!B:B,MATCH($H$2,Archive!A:A,0)+G28-1))","v":"1A07680986334"}]
[null,null,null,null,null,null,null,{"$f":"IF(ROWS($G$4:G29)>$I$2,\"\",INDEX(Archive!B:B,MATCH($H$2,Archive!A:A,0)+G29-1))","v":"1A07680986334"}]
[null,null,null,null,null,null,null,{"$f":"IF(ROWS($G$4:G30)>$I$2,\"\",INDEX(Archive!B:B,MATCH($H$2,Archive!A:A,0)+G30-1))","v":"1A07680986334"}]
[null,null,null,null,null,null,null,{"$f":"IF(ROWS($G$4:G31)>$I$2,\"\",INDEX(Archive!B:B,MATCH($H$2,Archive!A:A,0)+G31-1))","v":""}]
[null,null,null,null,null,null,null,{"$f":"IF(ROWS($G$4:G32)>$I$2,\"\",INDEX(Archive!B:B,MATCH($H$2,Archive!A:A,0)+G32-1))","v":""}]
[null,null,null,null,null,null,null,{"$f":"IF(ROWS($G$4:G33)>$I$2,\"\",INDEX(Archive!B:B,MATCH($H$2,Archive!A:A,0)+G33-1))","v":""}]
[null,null,null,null,null,null,null,{"$f":"IF(ROWS($G$4:G34)>$I$2,\"\",INDEX(Archive!B:B,MATCH($H$2,Archive!A:A,0)+G34-1))","v":""}]
[null,null,null,null,null,null,null,{"$f":"IF(ROWS($G$4:G35)>$I$2,\"\",INDEX(Archive!B:B,MATCH($H$2,Archive!A:A,0)+G35-1))","v":""}]
[null,null,null,null,null,null,null,{"$f":"IF(ROWS($G$4:G36)>$I$2,\"\",INDEX(Archive!B:B,MATCH($H$2,Archive!A:A,0)+G36-1))","v":""}]
[null,null,null,null,null,null,null,{"$f":"IF(ROWS($G$4:G37)>$I$2,\"\",INDEX(Archive!B:B,MATCH($H$2,Archive!A:A,0)+G37-1))","v":""}]
[null,null,null,null,null,null,null,{"$f":"IF(ROWS($G$4:G38)>$I$2,\"\",INDEX(Archive!B:B,MATCH($H$2,Archive!A:A,0)+G38-1))","v":""}]
[null,null,null,null,null,null,null,{"$f":"IF(ROWS($G$4:G39)>$I$2,\"\",INDEX(Archive!B:B,MATCH($H$2,Archive!A:A,0)+G39-1))","v":""}]
[null,null,null,null,null,null,null,{"$f":"IF(ROWS($G$4:G40)>$I$2,\"\",INDEX(Archive!B:B,MATCH($H$2,Archive!A:A,0)+G40-1))","v":""}]
[null,null,null,null,null,null,null,{"$f":"IF(ROWS($G$4:G41)>$I$2,\"\",INDEX(Archive!B:B,MATCH($H$2,Archive!A:A,0)+G41-1))","v":""}]
[null,null,null,null,null,null,null,{"$f":"IF(ROWS($G$4:G42)>$I$2,\"\",INDEX(Archive!B:B,MATCH($H$2,Archive!A:A,0)+G42-1))","v":""}]
[null,null,null,null,null,null,null,{"$f":"IF(ROWS($G$4:G43)>$I$2,\"\",INDEX(Archive!B:B,MATCH($H$2,Archive!A:A,0)+G43-1))","v":""}]
[null,null,null,null,null,null,null,{"$f":"IF(ROWS($G$4:G44)>$I$2,\"\",INDEX(Archive!B:B,MATCH($H$2,Archive!A:A,0)+G44-1))","v":""}]
[null,null,null,null,null,null,null,{"$f":"IF(ROWS($G$4:G45)>$I$2,\"\",INDEX(Archive!B:B,MATCH($H$2,Archive!A:A,0)+G45-1))","v":""}]
[null,null,null,null,null,null,null,{"$f":"IF(ROWS($G$4:G46)>$I$2,\"\",INDEX(Archive!B:B,MATCH($H$2,Archive!A:A,0)+G46-1))","v":""}]
[null,null,null,null,null,null,null,{"$f":"IF(ROWS($G$4:G47)>$I$2,\"\",INDEX(Archive!B:B,MATCH($H$2,Archive!A:A,0)+G47-1))","v":""}]
[null,null,null,null,null,null,null,{"$f":"IF(ROWS($G$4:G48)>$I$2,\"\",INDEX(Archive!B:B,MATCH($H$2,Archive!A:A,0)+G48-1))","v":""}]
[null,null,null,null,null,null,null,{"$f":"IF(ROWS($G$4:G49)>$I$2,\"\",INDEX(Archive!B:B,MATCH($H$2,Archive!A:A,0)+G49-1))","v":""}]
[null,null,null,null,null,null,null,{"$f":"IF(ROWS($G$4:G50)>$I$2,\"\",INDEX(Archive!B:B,MATCH($H$2,Archive!A:A,0)+G50-1))","v":""}]
[null,null,null,null,null,null,null,{"$f":"IF(ROWS($G$4:G51)>$I$2,\"\",INDEX(Archive!B:B,MATCH($H$2,Archive!A:A,0)+G51-1))","v":""}]
[null,null,null,null,null,null,null,{"$f":"IF(ROWS($G$4:G52)>$I$2,\"\",INDEX(Archive!B:B,MATCH($H$2,Archive!A:A,0)+G52-1))","v":""}]
[null,null,null,null,null,null,null,{"$f":"IF(ROWS($G$4:G53)>$I$2,\"\",INDEX(Archive!B:B,MATCH($H$2,Archive!A:A,0)+G53-1))","v":""}]
[null,null,null,null,null,null,null,{"$f":"IF(ROWS($G$4:G54)>$I$2,\"\",INDEX(Archive!B:B,MATCH($H$2,Archive!A:A,0)+G54-1))","v":""}]
[null,null,null,null,null,null,null,{"$f":"IF(ROWS($G$4:G55)>$I$2,\"\",INDEX(Archive!B:B,MATCH($H$2,Archive!A:A,0)+G55-1))","v":""}]
[null,null,null,null,null,null,null,{"$f":"IF(ROWS($G$4:G56)>$I$2,\"\",INDEX(Archive!B:B,MATCH($H$2,Archive!A:A,0)+G56-1))","v":""}]
[null,null,null,null,null,null,null,{"$f":"IF(ROWS($G$4:G57)>$I$2,\"\",INDEX(Archive!B:B,MATCH($H$2,Archive!A:A,0)+G57-1))","v":""}]
[null,null,null,null,null,null,null,{"$f":"IF(ROWS($G$4:G58)>$I$2,\"\",INDEX(Archive!B:B,MATCH($H$2,Archive!A:A,0)+G58-1))","v":""}]
[null,null,null,null,null,null,null,{"$f":"IF(ROWS($G$4:G59)>$I$2,\"\",INDEX(Archive!B:B,MATCH($H$2,Archive!A:A,0)+G59-1))","v":""}]
[null,null,null,null,null,null,null,{"$f":"IF(ROWS($G$4:G60)>$I$2,\"\",INDEX(Archive!B:B,MATCH($H$2,Archive!A:A,0)+G60-1))","v":""}]
[null,null,null,null,null,null,null,{"$f":"IF(ROWS($G$4:G61)>$I$2,\"\",INDEX(Archive!B:B,MATCH($H$2,Archive!A:A,0)+G61-1))","v":""}]
[null,null,null,null,null,null,null,{"$f":"IF(ROWS($G$4:G62)>$I$2,\"\",INDEX(Archive!B:B,MATCH($H$2,Archive!A:A,0)+G62-1))","v":""}]
[null,null,null,null,null,null,null,{"$f":"IF(ROWS($G$4:G63)>$I$2,\"\",INDEX(Archive!B:B,MATCH($H$2,Archive!A:A,0)+G63-1))","v":""}]
[null,null,null,null,null,null,null,{"$f":"IF(ROWS($G$4:G64)>$I$2,\"\",INDEX(Archive!B:B,MATCH($H$2,Archive!A:A,0)+G64-1))","v":""}]
[null,null,null,null,null,null,null,{"$f":"IF(ROWS($G$4:G65)>$I$2,\"\",INDEX(Archive!B:B,MATCH($H$2,Archive!A:A,0)+G65-1))","v":""}]
[null,null,null,null,null,null,null,{"$f":"IF(ROWS($G$4:G66)>$I$2,\"\",INDEX(Archive!B:B,MATCH($H$2,Archive!A:A,0)+G66-1))","v":""}]
[null,null,null,null,null,null,null,{"$f":"IF(ROWS($G$4:G67)>$I$2,\"\",INDEX(Archive!B:B,MATCH($H$2,Archive!A:A,0)+G67-1))","v":""}]
[null,null,null,null,null,null,null,{"$f":"IF(ROWS($G$4:G68)>$I$2,\"\",INDEX(Archive!B:B,MATCH($H$2,Archive!A:A,0)+G68-1))","v":""}]
[null,null,null,null,null,null,null,{"$f":"IF(ROWS($G$4:G69)>$I$2,\"\",INDEX(Archive!B:B,MATCH($H$2,Archive!A:A,0)+G69-1))","v":""}]
[null,null,null,null,null,null,null,{"$f":"IF(ROWS($G$4:G70)>$I$2,\"\",INDEX(Archive!B:B,MATCH($H$2,Archive!A:A,0)+G70-1))","v":""}]
[null,null,null,null,null,null,null,{"$f":"IF(ROWS($G$4:G71)>$I$2,\"\",INDEX(Archive!B:B,MATCH($H$2,Archive!A:A,0)+G71-1))","v":""}]
[null,null,null,null,null,null,null,{"$f":"IF(ROWS($G$4:G72)>$I$2,\"\",INDEX(Archive!B:B,MATCH($H$2,Archive!A:A,0)+G72-1))","v":""}]
[null,null,null,null,null,null,null,{"$f":"IF(ROWS($G$4:G73)>$I$2,\"\",INDEX(Archive!B:B,MATCH($H$2,Archive!A:A,0)+G73-1))","v":""}]
[null,null,null,null,null,null,null,{"$f":"IF(ROWS($G$4:G74)>$I$2,\"\",INDEX(Archive!B:B,MATCH($H$2,Archive!A:A,0)+G74-1))","v":""}]
[null,null,null,null,null,null,null,{"$f":"IF(ROWS($G$4:G75)>$I$2,\"\",INDEX(Archive!B:B,MATCH($H$2,Archive!A:A,0)+G75-1))","v":""}]
[null,null,null,null,null,null,null,{"$f":"IF(ROWS($G$4:G76)>$I$2,\"\",INDEX(Archive!B:B,MATCH($H$2,Archive!A:A,0)+G76-1))","v":""}]
[null,null,null,null,null,null,null,{"$f":"IF(ROWS($G$4:G77)>$I$2,\"\",INDEX(Archive!B:B,MATCH($H$2,Archive!A:A,0)+G77-1))","v":""}]
[null,null,null,null,null,null,null,{"$f":"IF(ROWS($G$4:G78)>$I$2,\"\",INDEX(Archive!B:B,MATCH($H$2,Archive!A:A,0)+G78-1))","v":""}]
[null,null,null,null,null,null,null,{"$f":"IF(ROWS($G$4:G79)>$I$2,\"\",INDEX(Archive!B:B,MATCH($H$2,Archive!A:A,0)+G79-1))","v":""}]
[null,null,null,null,null,null,null,{"$f":"IF(ROWS($G$4:G80)>$I$2,\"\",INDEX(Archive!B:B,MATCH($H$2,Archive!A:A,0)+G80-1))","v":""}]
[null,null,null,null,null,null,null,{"$f":"IF(ROWS($G$4:G81)>$I$2,\"\",INDEX(Archive!B:B,MATCH($H$2,Archive!A:A,0)+G81-1))","v":""}]
[null,null,null,null,null,null,null,{"$f":"IF(ROWS($G$4:G82)>$I$2,\"\",INDEX(Archive!B:B,MATCH($H$2,Archive!A:A,0)+G82-1))","v":""}]
[null,null,null,null,null,null,null,{"$f":"IF(ROWS($G$4:G83)>$I$2,\"\",INDEX(Archive!B:B,MATCH($H$2,Archive!A:A,0)+G83-1))","v":""}]
[null,null,null,null,null,null,null,{"$f":"IF(ROWS($G$4:G84)>$I$2,\"\",INDEX(Archive!B:B,MATCH($H$2,Archive!A:A,0)+G84-1))","v":""}]
[null,null,null,null,null,null,null,{"$f":"IF(ROWS($G$4:G85)>$I$2,\"\",INDEX(Archive!B:B,MATCH($H$2,Archive!A:A,0)+G85-1))","v":""}]
[null,null,null,null,null,null,null,{"$f":"IF(ROWS($G$4:G86)>$I$2,\"\",INDEX(Archive!B:B,MATCH($H$2,Archive!A:A,0)+G86-1))","v":""}]
[null,null,null,null,null,null,null,{"$f":"IF(ROWS($G$4:G87)>$I$2,\"\",INDEX(Archive!B:B,MATCH($H$2,Archive!A:A,0)+G87-1))","v":""}]
[null,null,null,null,null,null,null,{"$f":"IF(ROWS($G$4:G88)>$I$2,\"\",INDEX(Archive!B:B,MATCH($H$2,Archive!A:A,0)+G88-1))","v":""}]
[null,null,null,null,null,null,null,{"$f":"IF(ROWS($G$4:G89)>$I$2,\"\",INDEX(Archive!B:B,MATCH($H$2,Archive!A:A,0)+G89-1))","v":""}]
[null,null,null,null,null,null,null,{"$f":"IF(ROWS($G$4:G90)>$I$2,\"\",INDEX(Archive!B:B,MATCH($H$2,Archive!A:A,0)+G90-1))","v":""}]
[null,null,null,null,null,null,null,{"$f":"IF(ROWS($G$4:G91)>$I$2,\"\",INDEX(Archive!B:B,MATCH($H$2,Archive!A:A,0)+G91-1))","v":""}]
[null,null,null,null,null,null,null,{"$f":"IF(ROWS($G$4:G92)>$I$2,\"\",INDEX(Archive!B:B,MATCH($H$2,Archive!A:A,0)+G92-1))","v":""}]
[null,null,null,null,null,null,null,{"$f":"IF(ROWS($G$4:G93)>$I$2,\"\",INDEX(Archive!B:B,MATCH($H$2,Archive!A:A,0)+G93-1))","v":""}]
[null,null,null,null,null,null,null,{"$f":"IF(ROWS($G$4:G94)>$I$2,\"\",INDEX(Archive!B:B,MATCH($H$2,Archive!A:A,0)+G94-1))","v":""}]
[null,null,null,null,null,null,null,{"$f":"IF(ROWS($G$4:G95)>$I$2,\"\",INDEX(Archive!B:B,MATCH($H$2,Archive!A:A,0)+G95-1))","v":""}]
[null,null,null,null,null,null,null,{"$f":"IF(ROWS($G$4:G96)>$I$2,\"\",INDEX(Archive!B:B,MATCH($H$2,Archive!A:A,0)+G96-1))","v":""}]
[null,null,null,null,null,null,null,{"$f":"IF(ROWS($G$4:G97)>$I$2,\"\",INDEX(Archive!B:B,MATCH($H$2,Archive!A:A,0)+G97-1))","v":""}]
[null,null,null,null,null,null,null,{"$f":"IF(ROWS($G$4:G98)>$I$2,\"\",INDEX(Archive!B:B,MATCH($H$2,Archive!A:A,0)+G98-1))","v":""}]
[null,null,null,null,null,null,null,{"$f":"IF(ROWS($G$4:G99)>$I$2,\"\",INDEX(Archive!B:B,MATCH($H$2,Archive!A:A,0)+G99-1))","v":""}]
[null,null,null,null,null,null,null,{"$f":"IF(ROWS($G$4:G100)>$I$2,\"\",INDEX(Archive!B:B,MATCH($H$2,Archive!A:A,0)+G100-1))","v":""}]
[null,null,null,null,null,null,null,{"$f":"IF(ROWS($G$4:G101)>$I$2,\"\",INDEX(Archive!B:B,MATCH($H$2,Archive!A:A,0)+G101-1))","v":""}]
[null,null,null,null,null,null,null,{"$f":"IF(ROWS($G$4:G102)>$I$2,\"\",INDEX(Archive!B:B,MATCH($H$2,Archive!A:A,0)+G102-1))","v":""}]

{"sheet":"2023","index":3,"n_rows":433,"n_cols":2,"rows_kept":433,"cut":false,"hidden":false,"merged":[[1,0,1,1],[99,0,99,1]]}
["Date","N° de Recommandé"]
["AVRIL"]
["2023-04-20","AR1A20426298195"]
["2023-04-20","AR1A13818870413"]
["2023-04-20","AR1A20220764643"]
["2023-04-20","AR1A19487697337"]
["2023-04-20","AR1A20146822489"]
["2023-04-20","AR1A19581969446"]
["2023-04-20","AR1A20630639098"]
["2023-04-20","AR1A20404734509"]
["2023-04-20","AR1A20225773381"]
["2023-04-20","AR1A18731565965"]
["2023-04-20","AR1A19383887375"]
["2023-04-20","2C17865181829"]
["2023-04-20","2C17797951224"]
["2023-04-20","2C18326757119"]
["2023-04-21","1A20628574615"]
["2023-04-21","3A00101672793"]
["2023-04-21","1A17560971428"]
["2023-04-21","1A20701199094"]
["2023-04-21","1A20108926200"]
["2023-04-21","1A19572358440"]
["2023-04-21","1A20628574585"]
["2023-04-21","1A16914516452"]
["2023-04-21","RR160080613LU"]
["2023-04-21","AR958371322MA"]
["2023-04-21","2C18398578827"]
["2023-04-21","1A19614600933"]
["2023-04-21","1A20656229082"]
["2023-04-24","%004400086301655431320604250F03^"]
["2023-04-24","1A20631651310"]
["2023-04-24","1B01488904569"]
["2023-04-24","1A20695805902"]
["2023-04-24","1A19610272059"]
["2023-04-24","1A20183823340"]
["2023-04-24","1A20692502958"]
["2023-04-24","2C18411314302"]
["2023-04-24","1A17844806811"]
["2023-04-24","1A18112227635"]
["2023-04-24","1A18112227642"]
["2023-04-24","1A20415534730"]
["2023-04-24","1A16830250805"]
["2023-04-24","1A19596027452"]
["2023-04-24","3C00952666538"]
["2023-04-24","RR005007155MG"]
["2023-04-24","1A20422477242"]
["2023-04-24","1A20371272561"]
["2023-04-24","1A19815782001"]
["2023-04-24","1A19894162336"]
["2023-04-24","1A19603588969"]
["2023-04-24","1A20227552335"]
["2023-04-24","2C18327190809"]
["2023-04-24","1A20694279698"]
["2023-04-25","1A20621550289"]
["2023-04-25","1A19618487103"]
["2023-04-25","1A17596857444"]
["2023-04-25","1A20413311562"]
["2023-04-25","1A19570820413"]
["2023-04-26","1A14113428279"]
["2023-04-26","1A20701729130"]
["2023-04-26","1A20701729147"]
["2023-04-26","1A19600999515"]
["2023-04-26","1A19535584008"]
["2023-04-26","2C17252742824"]
["2023-04-26","3A00101993034"]
["2023-04-26","1A20191481358"]
["2023-04-26","1A20647222955"]
["2023-04-26","1A19372474715"]
["2023-04-26","1A20233209629"]
["2023-04-26","1A18998650114"]
["2023-04-26","1A18813583214"]
["2023-04-26","1A20231623045"]
["2023-04-26","2C17252742817"]
["2023-04-27","2C15792139616"]
["2023-04-27","1A20637080541"]
["2023-04-27","1A20335532779"]
["2023-04-27","1A20413642055"]
["2023-04-27","1A17684157821"]
["2023-04-27","2C16073266595"]
["2023-04-27","1A20422604013"]
["2023-04-27","2C17865255872"]
["2023-04-28","1A19562834688"]
["2023-04-28","1A18765774982"]
["2023-04-28","3A00102179239"]
["2023-04-28","1A20211525659"]
["2023-04-28","1A20221275766"]
["2023-04-28","1A19584799392"]
["2023-04-28","1A20071742043"]
["2023-04-28","1A20618684041"]
["2023-04-28","1A20345043159"]
["2023-04-28","2C16341211494"]
["2023-04-28","1A20156186892"]
["2023-04-28","1A20647478925"]
["2023-04-28","2C16341211487"]
["2023-04-28","1A20409976478"]
["2023-04-28","2C18398638101"]
["2023-04-28","3C00760267675"]
["2023-04-28","1A20362695577"]
["2023-04-28","1A17997426751"]
["MAI"]
["2023-05-02","RO132105455TH"]
["2023-05-02","1A19463386873"]
["2023-05-02","1A19108682445"]
["2023-05-02","1A20639464882"]
["2023-05-02","1A19483346208"]
["2023-05-02","2C17252635195"]
["2023-05-02","3C00952871956"]
["2023-05-02","1A20349051471"]
["2023-05-02","1A19559145445"]
["2023-05-02","2C17252741926"]
["2023-05-02","1A20146026474"]
["2023-05-02","2C14127553974"]
["2023-05-02","1A19605714076"]
["2023-05-02","1A20409438587"]
["2023-05-02","1A20234542275"]
["2023-05-02","1A20273275264"]
["2023-05-02","1A19581973627"]
["2023-05-02","1A19419655824"]
["2023-05-02","1A19419655794"]
["2023-05-02","1A20363908089"]
{"$rows_left_out":313}