{"text_format":"1","workbook":"xlsx","n_sheets":2,"sheets":["Carte","DATA"],"not_rendered":{"charts":0,"images":0,"macros":1,"external_links":0,"defined_names":5,"comments":0,"pivot_tables":0},"unopened":[],"bounds":{"document_bytes":16777216,"sheet_cells":100000,"rows_first":2000,"rows_last":500,"rows_between":2000,"halvings":0,"cell_chars":16384,"cell_head_chars":4096},"cells_cut":0,"cells_raw":0,"read":"whole","date_system":"1900"}

{"sheet":"Carte","index":0,"n_rows":102,"n_cols":17,"rows_kept":102,"cut":false,"hidden":false,"merged":[[3,2,3,3],[4,2,4,4],[2,1,2,3]]}
[]
[null,"Choix département"]
[null,"Rhône "]
[null,"Chef-lieu",{"$f":"VLOOKUP(B3,DATA!B2:E97,4,0)","v":"Lyon "}]
[null,"Région",{"$f":"VLOOKUP(B3,DATA!B2:E97,3,0)","v":"Auvergne-Rhône-Alpes"}]
[]
[]
[]
[]
[]
[]
[]
[]
[]
[]
[]
[]
[]
[]
[]
[]
[]
[]
[]
[]
[]
[]
[]
[]
[]
[]
[]
[]
[]
[]
[]
[]
[]
[]
[]
[]
[]
[]
[]
[]
[]
[]
[]
[]
[]
[]
[]
[]
[]
[]
[]
[]
[]
[]
[]
[]
[]
[]
[]
[]
[]
[]
[]
[]
[]
[]
[]
[]
[]
[]
[]
[]
[]
[]
[]
[]
[]
[]
[]
[]
[]
[]
[]
[]
[]
[]
[]
[]
[]
[]
[]
[]
[]
[]
[]
[]
[null,null,null,null,null,null,null,null,null,null,null,null,null,null,null,null,"Button 12455"]

{"sheet":"DATA","index":1,"n_rows":97,"n_cols":5,"rows_kept":97,"cut":false,"hidden":false,"merged":[]}
["Départ"]
[null,"Ain ","01","Auvergne-Rhône-Alpes","Bourg-en-Bresse"]
[null,"Aisne ","02","Hauts-de-France","Laon "]
[null,"Allier ","03","Auvergne-Rhône-Alpes","Moulins "]
[null,"Alpes de Haute-Provence ","04","Provence-Alpes-Côte d'Azur","Digne-les-Bains"]
[null,"Hautes-Alpes ","05","Provence-Alpes-Côte d'Azur","Gap "]
[null,"Alpes-Maritimes ","06","Provence-Alpes-Côte d'Azur","Nice "]
[null,"Ardèche ","07","Auvergne-Rhône-Alpes","Privas "]
[null,"Ardennes ","08","Grand Est","Charleville-Mézières "]
[null,"Ariège ","09","Occitanie","Foix "]
[null,"Aube ","10","Grand Est","Troyes "]
[null,"Aude ","11","Occitanie","Carcassonne "]
[null,"Aveyron ","12","Occitanie","Rodez "]
[null,"Bouches-du-Rhône ","13","Provence-Alpes-Côte d'Azur","Marseille "]
[null,"Calvados ","14","Normandie","Caen "]
[null,"Cantal ","15","Auvergne-Rhône-Alpes","Aurillac "]
[null,"Charente ","16","Nouvelle-Aquitaine","Angoulême "]
[null,"Charente-Maritime ","17","Nouvelle-Aquitaine","La Rochelle "]
[null,"Cher ","18","Centre-Val de Loire","Bourges "]
[null,"Corrèze ","19","Nouvelle-Aquitaine","Tulle "]
[null,"Corse-du-Sud","2A","Corse","Ajaccio "]
[null,"Haute-Corse","2B","Corse","Bastia "]
[null,"Côte-d'Or ","21","Bourgogne-Franche-Comté","Dijon "]
[null,"Côtes d'Armor ","22","Bretagne","St-Brieuc "]
[null,"Creuse ","23","Nouvelle-Aquitaine","Guéret "]
[null,"Dordogne ","24","Nouvelle-Aquitaine","Périgueux "]
[null,"Doubs ","25","Bourgogne-Franche-Comté","Besançon "]
[null,"Drôme ","26","Auvergne-Rhône-Alpes","Valence "]
[null,"Eure ","27","Normandie","Évreux "]
[null,"Eure-et-Loir ","28","Centre-Val de Loire","Chartres "]
[null,"Finistère ","29","Bretagne","Quimper "]
[null,"Gard ","30","Occitanie","Nîmes "]
[null,"Haute-Garonne ","31","Occitanie","Toulouse "]
[null,"Gers ","32","Occitanie","Auch "]
[null,"Gironde ","33","Nouvelle-Aquitaine","Bordeaux "]
[null,"Hérault ","34","Occitanie","Montpellier "]
[null,"Île-et-Vilaine ","35","Bretagne","Rennes "]
[null,"Indre ","36","Centre-Val de Loire","Châteauroux "]
[null,"Indre-et-Loire ","37","Centre-Val de Loire","Tours "]
[null,"Isère ","38","Auvergne-Rhône-Alpes","Grenoble "]
[null,"Jura ","39","Bourgogne-Franche-Comté","Lons-le-Saunier "]
[null,"Landes ","40","Nouvelle-Aquitaine","Mont-de-Marsan "]
[null,"Loir-et-Cher ","41","Centre-Val de Loire","Blois "]
[null,"Loire ","42","Auvergne-Rhône-Alpes","Saint-Étienne "]
[null,"Haute-Loire ","43","Auvergne-Rhône-Alpes","Le Puy-en-Velay"]
[null,"Loire-Atlantique ","44","Pays de la Loire","Nantes "]
[null,"Loiret ","45","Centre-Val de Loire","Orléans "]
[null,"Lot ","46","Occitanie","Cahors "]
[null,"Lot-et-Garonne ","47","Nouvelle-Aquitaine","Agen "]
[null,"Lozère ","48","Occitanie","Mende "]
[null,"Maine-et-Loire ","49","Pays de la Loire","Angers "]
[null,"Manche ","50","Normandie","Saint-Lô "]
[null,"Marne ","51","Grand Est","Châlons-en-Champagne"]
[null,"Haute-Marne ","52","Grand Est","Chaumont "]
[null,"Mayenne ","53","Pays de la Loire","Laval "]
[null,"Meurthe-et-Moselle ","54","Grand Est","Nancy "]
[null,"Meuse ","55","Grand Est","Bar-le-Duc "]
[null,"Morbihan ","56","Bretagne","Vannes "]
[null,"Moselle ","57","Grand Est","Metz "]
[null,"Nièvre ","58","Bourgogne-Franche-Comté","Nevers "]
[null,"Nord ","59","Hauts-de-France","Lille "]
[null,"Oise ","60","Hauts-de-France","Beauvais "]
[null,"Orne ","61","Normandie","Alençon "]
[null,"Pas-de-Calais ","62","Hauts-de-France","Arras "]
[null,"Puy-de-Dôme ","63","Auvergne-Rhône-Alpes","Clermont-Ferrand "]
[null,"Pyrénées-Atlantiques ","64","Nouvelle-Aquitaine","Pau "]
[null,"Hautes-Pyrénées ","65","Occitanie","Tarbes "]
[null,"Pyrénées-Orientales ","66","Occitanie","Perpignan "]
[null,"Bas-Rhin ","67","Grand Est","Strasbourg "]
[null,"Haut-Rhin ","68","Grand Est","Colmar "]
[null,"Rhône ","69","Auvergne-Rhône-Alpes","Lyon "]
[null,"Haute-Saône ","70","Bourgogne-Franche-Comté","Vesoul "]
[null,"Saône-et-Loire ","71","Bourgogne-Franche-Comté","Mâcon "]
[null,"Sarthe ","72","Pays de la Loire","Le Mans "]
[null,"Savoie ","73","Auvergne-Rhône-Alpes","Chambéry "]
[null,"Haute-Savoie ","74","Auvergne-Rhône-Alpes","Annecy "]
[null,"Seine-Maritime ","76","Normandie","Rouen "]
[null,"Seine-et-Marne ","77","Île-de-France","Melun "]
[null,"Yvelines ","78","Île-de-France","Versailles "]
[null,"Deux-Sèvres ","79","Nouvelle-Aquitaine","Niort "]
[null,"Somme ","80","Hauts-de-France","Amiens "]
[null,"Tarn ","81","Occitanie","Albi "]
[null,"Tarn-et-Garonne ","82","Occitanie","Montauban "]
[null,"Var ","83","Provence-Alpes-Côte d'Azur","Toulon "]
[null,"Vaucluse ","84","Provence-Alpes-Côte d'Azur","Avignon "]
[null,"Vendée ","85","Pays de la Loire","La Roche-sur-Yon "]
[null,"Vienne ","86","Nouvelle-Aquitaine","Poitiers "]
[null,"Haute-Vienne ","87","Nouvelle-Aquitaine","Limoges "]
[null,"Vosges ","88","Grand Est","Épinal "]
[null,"Yonne ","89","Bourgogne-Franche-Comté","Auxerre "]
[null,"Territoire-de-Belfort ","90","Bourgogne-Franche-Comté","Belfort "]
[null,"Essonne ","91","Île-de-France","Évry "]
[null,"Val d'Oise","95","Île-de-France","Pontoise "]
[null,"Paris ","175","Île-de-France","Paris "]
[null,"Hauts-de-Seine ","192","Île-de-France","Nanterre "]
[null,"Seine-Saint-Denis","193","Île-de-France","Bobigny "]
[null,"Val-de-Marne",194,"Île-de-France","Créteil "]