{"text_format":"1","workbook":"xlsx","n_sheets":3,"sheets":["pic","cadence","Capacité"],"not_rendered":{"charts":0,"images":1,"macros":1,"external_links":1,"defined_names":3,"comments":0,"pivot_tables":0},"unopened":[],"bounds":{"document_bytes":16777216,"sheet_cells":100000,"rows_first":2000,"rows_last":500,"rows_between":2000,"halvings":0,"cell_chars":16384,"cell_head_chars":4096},"cells_cut":0,"cells_raw":0,"read":"whole","date_system":"1900"}

{"sheet":"pic","index":0,"n_rows":23,"n_cols":58,"rows_kept":23,"cut":false,"hidden":false,"merged":[]}
[null,null,"Code",null,null,null,null,null,null,null,null,null,null,null,null,null,null,null,null,null,null,null,null,null,null,null,null,null,null,null,null,null,null,null,null,null,null,null,null,null,"Mars","Avril","Mai","Juin","Juillet","Août","Septembre","Octobre","Novembre","Décembre","Janvier","Février","Mars","Avril","Mai","Juin","Juillet","Août"]
[null,null,"P02825",null,null,null,null,null,null,null,null,null,null,null,null,null,null,null,null,null,null,null,null,null,null,null,null,null,null,null,null,null,null,null,null,null,null,null,null,null,20,20,20,20,20,20,20,20,20,20,20,20,20,20,20,20,20,20]
[null,null,"P09064",null,null,null,null,null,null,null,null,null,null,null,null,null,null,null,null,null,null,null,null,null,null,null,null,null,null,null,null,null,null,null,null,null,null,null,null,null,30,30,30,30,30,30,30,30,30,30,30,30,30,30,30,30,30,30]
[null,null,"P77854",null,null,null,null,null,null,null,null,null,null,null,null,null,null,null,null,null,null,null,null,null,null,null,null,null,null,null,null,null,null,null,null,null,null,null,null,null,40,40,40,40,40,40,40,40,40,40,40,40,40,40,40,40,40,40]
[null,null,"P09066",null,null,null,null,null,null,null,null,null,null,null,null,null,null,null,null,null,null,null,null,null,null,null,null,null,null,null,null,null,null,null,null,null,null,null,null,null,50,50,50,50,50,50,50,50,50,50,50,50,50,50,50,50,50,50]
[null,null,"PE0027",null,null,null,null,null,null,null,null,null,null,null,null,null,null,null,null,null,null,null,null,null,null,null,null,null,null,null,null,null,null,null,null,null,null,null,null,null,60,60,60,60,60,60,60,60,60,60,60,60,60,60,60,60,60,60]
[null,null,"PE0116",null,null,null,null,null,null,null,null,null,null,null,null,null,null,null,null,null,null,null,null,null,null,null,null,null,null,null,null,null,null,null,null,null,null,null,null,null,70,70,70,70,70,70,70,70,70,70,70,70,70,70,70,70,70,70]
[null,null,"P09975",null,null,null,null,null,null,null,null,null,null,null,null,null,null,null,null,null,null,null,null,null,null,null,null,null,null,null,null,null,null,null,null,null,null,null,null,null,80,80,80,80,80,80,80,80,80,80,80,80,80,80,80,80,80,80]
[null,null,"P74747",null,null,null,null,null,null,null,null,null,null,null,null,null,null,null,null,null,null,null,null,null,null,null,null,null,null,null,null,null,null,null,null,null,null,null,null,null,90,90,90,90,90,90,90,90,90,90,90,90,90,90,90,90,90,90]
[null,null,"P01062",null,null,null,null,null,null,null,null,null,null,null,null,null,null,null,null,null,null,null,null,null,null,null,null,null,null,null,null,null,null,null,null,null,null,null,null,null,100,100,100,100,100,100,100,100,100,100,100,100,100,100,100,100,100,100]
[null,null,"PE0214",null,null,null,null,null,null,null,null,null,null,null,null,null,null,null,null,null,null,null,null,null,null,null,null,null,null,null,null,null,null,null,null,null,null,null,null,null,110,110,110,110,110,110,110,110,110,110,110,110,110,110,110,110,110,110]
[null,null,"PE0320",null,null,null,null,null,null,null,null,null,null,null,null,null,null,null,null,null,null,null,null,null,null,null,null,null,null,null,null,null,null,null,null,null,null,null,null,null,120,120,120,120,120,120,120,120,120,120,120,120,120,120,120,120,120,120]
[null,null,"P03480",null,null,null,null,null,null,null,null,null,null,null,null,null,null,null,null,null,null,null,null,null,null,null,null,null,null,null,null,null,null,null,null,null,null,null,null,null,130,130,130,130,130,130,130,130,130,130,130,130,130,130,130,130,130,130]
[null,null,"PE0034",null,null,null,null,null,null,null,null,null,null,null,null,null,null,null,null,null,null,null,null,null,null,null,null,null,null,null,null,null,null,null,null,null,null,null,null,null,140,140,140,140,140,140,140,140,140,140,140,140,140,140,140,140,140,140]
[null,null,"P03073",null,null,null,null,null,null,null,null,null,null,null,null,null,null,null,null,null,null,null,null,null,null,null,null,null,null,null,null,null,null,null,null,null,null,null,null,null,150,150,150,150,150,150,150,150,150,150,150,150,150,150,150,150,150,150]
[null,null,"P98994",null,null,null,null,null,null,null,null,null,null,null,null,null,null,null,null,null,null,null,null,null,null,null,null,null,null,null,null,null,null,null,null,null,null,null,null,null,160,160,160,160,160,160,160,160,160,160,160,160,160,160,160,160,160,160]
[null,null,"P64152",null,null,null,null,null,null,null,null,null,null,null,null,null,null,null,null,null,null,null,null,null,null,null,null,null,null,null,null,null,null,null,null,null,null,null,null,null,170,170,170,170,170,170,170,170,170,170,170,170,170,170,170,170,170,170]
[null,null,"P03321",null,null,null,null,null,null,null,null,null,null,null,null,null,null,null,null,null,null,null,null,null,null,null,null,null,null,null,null,null,null,null,null,null,null,null,null,null,180,180,180,180,180,180,180,180,180,180,180,180,180,180,180,180,180,180]
[null,null,"P03500",null,null,null,null,null,null,null,null,null,null,null,null,null,null,null,null,null,null,null,null,null,null,null,null,null,null,null,null,null,null,null,null,null,null,null,null,null,190,190,190,190,190,190,190,190,190,190,190,190,190,190,190,190,190,190]
[null,null,"P03505",null,null,null,null,null,null,null,null,null,null,null,null,null,null,null,null,null,null,null,null,null,null,null,null,null,null,null,null,null,null,null,null,null,null,null,null,null,200,200,200,200,200,200,200,200,200,200,200,200,200,200,200,200,200,200]
[null,null,"PE0710",null,null,null,null,null,null,null,null,null,null,null,null,null,null,null,null,null,null,null,null,null,null,null,null,null,null,null,null,null,null,null,null,null,null,null,null,null,210,210,210,210,210,210,210,210,210,210,210,210,210,210,210,210,210,210]
[null,null,"PE0720",null,null,null,null,null,null,null,null,null,null,null,null,null,null,null,null,null,null,null,null,null,null,null,null,null,null,null,null,null,null,null,null,null,null,null,null,null,220,220,220,220,220,220,220,220,220,220,220,220,220,220,220,220,220,220]
[null,null,"P01638",null,null,null,null,null,null,null,null,null,null,null,null,null,null,null,null,null,null,null,null,null,null,null,null,null,null,null,null,null,null,null,null,null,null,null,null,null,230,230,230,230,230,230,230,230,230,230,230,230,230,230,230,230,230,230]

{"sheet":"cadence","index":1,"n_rows":170,"n_cols":11,"rows_kept":170,"cut":false,"hidden":false,"merged":[]}
["Code","Produit","Ligne de production","Modèle","Cadence unité/h"]
["P02807","BAITANET D 120 ML","LEXT","MV",45]
["P03001","BAITANET D BID X 5 L","LEXT","MV",89746]
["P02805","BAITANET D FL 550 ML","LEXT","MV",51]
["P02808","BAITANET G 120 ML","LEXT","MV",894]
["P02814","BAITANET G BID X 5 L","LEXT","MV",531]
["P02806","BAITANET G FL 550 ML","LEXT","MV",684]
["P06340","BAITANET D BID X 5 L MSP","LEXT","MH",51]
["P06201","BAITANET D FL 120  ML MSP","LEXT","MH",684]
["P06126","BAITANET D FL 550 ML MSP","LEXT","MH",651]
["P06014","BAITANET G FL 120 ML MSP","LEXT","MH",684]
["P06720","BAITANET SCRUB 4% FL 125","LEXT","MH",654]
["P02825","BAITANET SCRUB","LEXT","MV",684]
["P09064","BAITANET D FL/120 ML AR/ANG","LEXT","MV",654]
["P09066","BAITANET G FL/120 ML AR/ANG","LEXT","MV",684]
["PE0027","BAITANET G 120 ML EMG","LEXT","EMG",654]
["PE0116","BAITANET D120ML EMG","LEXT","EMG",64]
["P09975","BAITANET D120ML EXP","LEXT","MV",6984]
["P01062","ALGOFENE 150 ML","LGV1","MV",88]
["PE0214","ALGOFENE FL 150 ML EMG","LGV1","EMG",6514]
["PE0320","ARGO SIROP FL 250ML  EMG","LGV1","EMG",654]
["P03480","ARGO SIROP PV FL 250 ML","LGV1","MV",684]
["PE0034","CLARTEC SIROP FL 60 ML  EMG","LGV1","EMG",64]
["P03073","CLARTEC SIROP FL X 60 ML","LGV1","MV",84]
["P03321","CLARTEC SIROP X 120ML         ","LGV1","MV",64]
["P03500","DOLOSTOP PEDIATRIQ2.4G/100 F60","LGV1","MV",994]
["P03505","DOLOSTOP PEDIATRIQ2.4G/100 F90","LGV1","MV",215]
["PE0710","DOLOSTOP PEDIATRIQUE 2.4% FL60","LGV1","EMG",211]
["PE0720","DOLOSTOP PEDIATRIQUE 2.4% FL90","LGV1","EMG",100]
["P01638","EUMOXOL 0,3 % X 125 ML","LGV1","MV",545]
["PE0102","EUMOXOL 0,3 % X 125 ML  EMG","LGV1","EMG",946]
["P01639","EUMOXOL 0,3 % X 250 ML","LGV1","MV",684]
["PE0500","EUMOXOL 0,3 % X 250 ML EMG","LGV1","EMG",68]
["P04022","NAUSELIUM 1MG/ML FL 200ML","LGV1","MV",511]
["PE0119","NAUSELIUM 1MG/ML FL 200ML EMG","LGV1","EMG",5]
["P09580","ALGOFENE 20MG/ML SB FL/150 ML","LGV1","MV",88]
["P09104","CLARTEC 5MG/5ML SP F/120ML","LGV1","MV",468]
["P09090","NAUSELIUM 1MG/1ML SP F/200ML","LGV1","MV",45]
["PE1270","ALGOFENE SIROP FL 150 EMG EXP","LGV1","EMG",18]
["P06385","ALGOFENE 20MG/ML FL 150 ML MSP","LGV1","MH",5]
["P06018","CLARTEC SIROP FL X 60 ML","LGV1","MH",51]
["P06530","EUMOXOL 0,3 % X 250 ML   MSP","LGV1","MH",9]
["P06041","MUCOSTEINE 125ML SIROP","LGV1","MH",42]
["P06229","NAUSELIUM 1MG/ML FL 200 ML MSP","LGV1","MH",69]
["P06335","NIFUROXAZIDE 220MG/5ML 90ML","LGV1","MH",8]
["P06055","RIFAMPICINE PHARMA 2% FL 120 M","LGV1","MH",1]
["P06118","VALPAKINE SIROP 40ML 200ML/ML","LGV1","MH",6]
["P06116","VALPAKINE SIROPFL 150","LGV1","MH",8]
["P02039","MUCOSTEINE 125ML SIROP","LGV1","MV",46]
["P02040","MUCOSTEINE 250ML SIROP","LGV1","MV",9]
["P02202","VOMISTOP 0.1% FL 130 ML","LGV1","MV",8]
["P09054","NAUSELIUM 1 MG/1 ML SP F/200ML","LGV1","MV",55]
["P09089","ALGOFENE20MG/ML FL150ML EXP AR","LGV1","MV",2]
["P09165","ARGO SUS BUV FL/250ML AR/ANG","LGV1","MV",1]
["P09220","CLARTEC 5 MG/ 5 ML FL/60 ML AR/ANG","LGV1","MV",884]
["P09369","DOLOSTOP PEDIATRIQUE 90ML ANG/","LGV1","MV",1539]
["P09373","RIFAMPICINE PHARMA 2% FL 120 M","LGV1","MV",55]
["P09415","MUCOSTEINE 5% SIROP NPSP 125ML EXP","LGV1","MV",4]
["PE0350","ARGO  SUSP BUV. 1.25 MG 1 250 ML","LGV1","EMG",4]
["PE0390","CLARTEC 5 MG/ 5 ML FL/60 ML ECH FR/ANG","LGV1","EMG",58]
["PE0395","NAUSELIUM 1MG/ML FL200 ECH FR","LGV1","EMG",988]
["PE1140","CLARTEC SP  FL 120ML ECH FR","LGV1","EMG",4]
["P03730","NAUREUS 0.5 mg/ml solution buvable flacon de 60 ml","LGV1","MV",5]
["PE3730","NAUREUS 0.5 mg/ml solution buvable flacon de 60 ml EMG","LGV1","EMG",2]
["P09286","VALPAKINE 200MG/ML FL 40ML ANG/AR","LGV1","MV",5]
["P03059","NURAVIT FL 125 ML","LGV2","MV",58]
["PE0230","NURAVIT SP FL/125  ML  EMG","LGV2","EMG",8]
["P03041","NURABOL 2 MG /5ML FL 125 ML","LGV2","MV",4]
["P03043","NURABOL 4 MG/5ML  FL 125 ML","LGV2","MV",5]
["P09022","NURABOL 2MG SP F/125ML","LGV2","MV",5]
["P09037","NURABOL 4MG SP F/125ML","LGV2","MV",8]
["P09027","NURAVIT SP F/125ML","LGV2","MV",84]
["PE0385","NURAVIT SP F/125 ML ECH FR/ANG","LGV2","EMG",1]
["P09074","NURAVIT SP FL 125ML EXP AR","LGV2","MV",5]
["P09370","NURABOL 2 MG SP F/125 ML AR/ANG","LGV2","MV",1]
["PE0380","NURABOL 2 MG SP FL125ML ECH FR","LGV2","EMG",1]
["P04021","BETASTENE 0.05 % FL 30 ML","LPV","MV",1139,null,null,null,null,null,{"$f":"19*60","v":1140}]
["PE0117","BETASTENE 0.05% FL 30ML EMG","LPV","EMG",5]
["P03093","SKINOSALIC LOTION FL 30 G","LPV","MV",5]
["PE0081","SKINOSALIC LOTION FL 30 G EMG","LPV","EMG",5]
["P01706","HALOPERIDOL 2% GOUTTES","LPV","MV",4]
["P09200","BETASTENE 0,05 % SB F/30 ML","LPV","MV",1139]
["PE0850","BETASTENE 0,05 % SB F/30 ML ECH FR/ANG","LPV","EMG",45]
["P06078","HALOPERIDOL 2% GOUTTE BT 1 FL","LPV","MH",5]
["P09083","SKINOSALIC LOTION 30ML AR/ANG","LPV","MV",5]
["P03071","DICLO PHARMA 5 100 MG X 10 SUP","LSUP","MV",8]
["PE0228","DICLO PHARMA5 100MGX5 SUP EMG","LSUP","EMG",8]
["PE0670","DOLOSTOP 100MG BT 10 SUPPOS","LSUP","EMG",41]
["P03150","DOLOSTOP 100MG X 10SUPPOS","LSUP","MV",1]
["PE0680","DOLOSTOP 150MG BT 10 SUPPOS","LSUP","EMG",2]
["P03160","DOLOSTOP 150MG X 10SUPPOS","LSUP","MV",5]
["PE0690","DOLOSTOP 200MG BT 10 SUPPOS","LSUP","EMG",8]
["P03170","DOLOSTOP 200MG X 10SUPPOS","LSUP","MV",88]
["PE0700","DOLOSTOP 300MG BT 10 SUPPOS","LSUP","EMG",4]
["P03180","DOLOSTOP 300MG X 10SUPPOS","LSUP","MV",5]
["P01786","INDOPHARM 100MG X10 SUPPO","LSUP","MV",5]
["P01789","INDOPHARM 50MG X10 SUPPO","LSUP","MV",1417]
["P03115","MEGASFON 150 mg X 8 suppo","LSUP","MV",52]
["PE0105","MEGASFON X 8 SUP EMG","LSUP","EMG",2]
["PE0070","PEVAGINE 150MG BT 3 OVU EMG","LSUP","EMG",1]
["P02134","PEVAGINE 150MG X3 OVULES","LSUP","MV",1]
["PE0440","SUPPOSEDAL PARA NOUR12 SE EMG","LSUP","EMG",1]
["P03360","SUPPOSEDAL PARAC ADULT T 12 S","LSUP","MV",5]
["P03470","SUPPOSEDAL PARAC ENFANT X12 SE","LSUP","MV",4]
["PE0442","SUPPOSEDAL PARAC ENFAX6  EMG","LSUP","EMG",4]
["P03475","SUPPOSEDAL PARAC NOUR X12 SE","LSUP","MV",1]
["P01660","FLEXEN X10 SUPPOSITOIRES","LSUP","MV",1]
["P02601","NIDAZOL 500MG X10 OVULES","LSUP","MV",25]
["P02378","SPASMOPAN 10MG X6 SUPPO","LSUP","MV",5]
["PE0950","KETOFLEX 100 MG X 10 SUP   EMG","LSUP","EMG",44]
["P03100","KETOFLEX 100MG X10 SUPP.","LSUP","MV",1]
["P09242","DICLO PHARMA5 100 MG SUPP B/10","LSUP","MV",654]
["P09630","KETOFLEX 100 MG Suppo B/10","LSUP","MV",68421]
["P09116","NIDAZOL 500MG OV B/10","LSUP","MV",1311]
["P09108","PEVAGINE 150MG OVULE B/3","LSUP","MV",652]
["P06020","DICLO PHARMA5 100 MG BTE 10 SU","LSUP","MH",62165]
["P06127","DICLO PHARMA5 25MG BT 100 SUPP","LSUP","MH",62]
["P06260","DOLOSTOP 100MG X 10 SUPPOS MSP","LSUP","MH",62]
["P06305","DOLOSTOP 100MG X 100 SUPPOS MS","LSUP","MH",59]
["P06270","DOLOSTOP 150MG X 10 SUPPOS MSP","LSUP","MH",6]
["P06275","DOLOSTOP 150MG X 100 SUPPOS MH","LSUP","MH",2]
["P06310","DOLOSTOP 200MG X 100 SUPPOS MS","LSUP","MH",6]
["P06300","DOLOSTOP 300MG X 100 SUPPOS MS","LSUP","MH",9]
["P06231","INDOPHARM 100 MG BT 10 SUP  MS","LSUP","MH",6]
["P06112","NIDAZOL 500 MG BT 10 OVU  MSP","LSUP","MH",164]
["P06050","PEVAGINE 150 MG BT  3 OVU MSP","LSUP","MH",9]
["P06061","SPASMOPAN 10MG BT 6 SUP MSP","LSUP","MH",6]
["P06094","VOMISTOP 20 MG X 10 SUPP  MSP","LSUP","MH",61]
["P09240","DICLOPHARMA5 100MG X10 SUPP FR avec logo","LSUP","MH",14]
["P03251","VOMISTOP 20 MG  BT 10 SUPP","LSUP","MV",6]
["P09014","NIDAZOL 500 MG OVU B/10 ","LSUP","MV",61]
["P09086","INDOPHARM 100 MG SUPP B/10 AR/","LSUP","MV",1]
["P09103","PEVAGINE 150 MG OVU B/3 EXP AR","LSUP","MV",6]
["P09366","DOLOSTOP 150MG SUPPO X10 ANG/A","LSUP","MV",61]
["P09367","DOLOSTOP 300MG SUPPO X10 ANG/AR","LSUP","MV",1]
["P09440","DOLOSTOP 100MG SUPPO B/10 NPSP FR/ANG","LSUP","MV",1]
["P09470","DOLOSTOP 100 MG Suppo B/10 AR/ANG","LSUP","MV",46]
["P09480","DOLOSTOP 200 MG Suppo B/10 AR/ANG","LSUP","MV",64]
["PE0047","FLEXEN X10 SUPPOSITOIRES EMG","LSUP","EMG",1]
["PE0049","INDOPHARM SUPP 100 MG 10","LSUP","EMG",1]
["PE0288","DICLO  SUP AD 100 MG 5","LSUP","EMG",616]
["PE0303","SUPPOSEDAL PARAC ADULT EMG","LSUP","EMG",4]
["PE0375","PEVAGINE 150MG OV B/3 ECH FR","LSUP","EMG",49]
["PE0505","NIDAZOL 500 MG X10 OVULES EM","LSUP","EMG",416]
["PE0870","DICLOPHARMA5 100MG X10 SUPP ECH FR","LSUP","EMG",16]
["P04110","GYCONAZOLE.GYNECOLOGIQ.","LSUP","MV",2600]
["PE4110","GYCONAZOLE.GYNECOLOGIQ. EMG","LSUP","EMG",49]
["P02133","PEVAGINE 1% CREME DERMIQUE","LTUBE","MV",4]
["PE0315","PEVAGINE 1% TUB 30 G  EMG","LTUBE","EMG",6]
["PE0124","SKINOSALIC POMMADE TUB 30G EMG","LTUBE","EMG",164]
["P03108","SKINOSALIC POMMADE TUBE X 30 G","LTUBE","MV",64]
["PE0122","SKINOSONE CREME TUB 15GR EMG","LTUBE","EMG",9]
["P03109","SKINOSONE CREME TUBE 15G","LTUBE","MV",494]
["PE0232","SKINOSONE POMMADE TUB15 GR EMG","LTUBE","EMG",6]
["P03112","SKINOSONE POMMADE TUBE X 15G","LTUBE","MV",65]
["P03102","KETOFLEX TUBE DE 20G","LTUBE","MV",6]
["PE0209","NAPROGEL 10% GEL DERM 50G EMG","LTUBE","EMG",65]
["P03132","NAPROGEL 10% GEL DERMIQUE 50 G","LTUBE","MV",225]
["P09610","KETOFLEX 2,5 % Gel T/20 g ","LTUBE","MV",200]
["P09106","PEVAGINE 1% CR T/30G","LTUBE","MV",6]
["PE0305","PEVAGINE 1% CREME T/30 G ECH FR/ANG","LTUBE","EMG",64]
["P06657","FLEXEN GEL DERMIQUE TUBE 20GR ","LTUBE","MH",64]
["P06233","PEVAGINE 1% CREME TUBE 30 G","LTUBE","MH",6]
["P06202","SKINOSALIC POMMADE TU  30 G MH","LTUBE","MH",64]
["P06130","SKINOSONE CREME TUBE 15G MH","LTUBE","MH",945]
["P06135","SKINOSONE POMMADE TUBE 15G MH","LTUBE","MH",46]
["P09068","KETOFLEX  GEL TUBE 20GR","LTUBE","MV",6]
["P09081","SKINOSALIC POMMADE T/30G AR/AN","LTUBE","MV",6]
["P04100","GYCONAZOLE V.LOCALE","LTUBE","MV",5]
["PE4100","GYCONAZOLE V.LOCALE EMG","LTUBE","EMG",59]

{"sheet":"Capacité","index":2,"n_rows":13,"n_cols":58,"rows_kept":13,"cut":false,"hidden":false,"merged":[[10,12,10,15]]}
[null,null,"Code",null,5,6,7,8,9,10,11,12,13,14,15,16,17,18,19,20,21,22,23,24,25,26,27,28,29,30,31,32,33,34,35,36,37,38,39,40,41,42,43,44,45,46,47,48,49,50,51,52,53,54,55,56,57,58]
[]
[]
[]
[]
[]
[]
[]
[]
[]
[null,null,null,null,null,null,null,null,null,null,null,null,"CONTRÔLE"]
[null,null,"CHOIX",null,null,null,null,null,null,null,"QUOTIENT",null,"SOMME",null,"CADENCE","DIVISION"]
[null,null,"PE0034",null,null,null,null,null,null,null,{"$f":"IFERROR(SUM(INDIRECT(ADDRESS(MATCH(C13,pic!$C$2:$C$23,0)+1,41,,,\"pic\")):INDIRECT(ADDRESS(MATCH(C13,pic!$C$2:$C$23,0)+1,58,,,\"pic\")))/VLOOKUP(C13,cadence!A2:E170,5,FALSE),\"cadence inconnue !\")","v":39.375},null,{"$f":"SUM(INDIRECT(ADDRESS(MATCH(C13,pic!$C$2:$C$23,0)+1,41,,,\"pic\")):INDIRECT(ADDRESS(MATCH(C13,pic!$C$2:$C$23,0)+1,58,,,\"pic\")))","v":2520},null,{"$f":"VLOOKUP(C13,cadence!A2:E170,5,FALSE)","v":64},{"$f":"M13/O13","v":39.375}]