{"text_format":"1","workbook":"xlsx","n_sheets":3,"sheets":["Supply plan","DATA","Recap"],"not_rendered":{"charts":0,"images":0,"macros":1,"external_links":1,"defined_names":0,"comments":2,"pivot_tables":0},"unopened":[],"bounds":{"document_bytes":16777216,"sheet_cells":100000,"rows_first":2000,"rows_last":500,"rows_between":2000,"halvings":0,"cell_chars":16384,"cell_head_chars":4096},"cells_cut":0,"cells_raw":0,"read":"whole","date_system":"1900"}

{"sheet":"Supply plan","index":0,"n_rows":486,"n_cols":78,"rows_kept":486,"cut":false,"hidden":false,"merged":[]}
[null,null,null,null,null,null,null,null,null,null,null,null,null,null,null,null,null,null,null,null,null,null,null,null,null,null,null,null,null,null,null,null,null,null,null,null,null,null,null,null,null,null,null,null,null,null,null,"1-2023","2-2023","3-2023","4-2023","5-2023","6-2023","7-2023","8-2023","9-2023","10-2023","11-2023","12-2023","13-2023","14-2023","15-2023","16-2023","17-2023","18-2023","19-2023","20-2023","21-2023","22-2023","23-2023","24-2023","25-2023","26-2023","27-2023","28-2023","29-2023","30-2023","31-2023"]
[null,null,null,null,null,null,null,null,"2022-04-04","2022-04-11","2022-04-18","2022-04-25","2022-05-02","2022-05-09","2022-05-16","2022-05-23","2022-05-30","2022-06-06","2022-06-13","2022-06-20","2022-06-27","2022-07-04","2022-07-11","2022-07-18","2022-07-25","2022-08-01","2022-08-08","2022-08-15","2022-08-22","2022-08-29","2022-09-05","2022-09-12","2022-09-19","2022-09-26","2022-10-03","2022-10-10","2022-10-17","2022-10-24","2022-10-31","2022-11-07","2022-11-14","2022-11-21","2022-11-28","2022-12-05","2022-12-12","2022-12-19","2022-12-26","2023-01-02","2023-01-09","2023-01-16","2023-01-23","2023-01-30","2023-02-06","2023-02-13","2023-02-20","2023-02-27","2023-03-06","2023-03-13","2023-03-20","2023-03-27","2023-04-03"]
[null,null,null,null,null,null,null,null,"2022-04-04",{"$f":"I3+7","v":"2022-04-11"},{"$f":"J3+7","v":"2022-04-18"},"2022-04-25","2022-05-02","2022-05-09","2022-05-16","2022-05-23","2022-05-30","2022-06-06","2022-06-13","2022-06-20","2022-06-27","2022-07-04",{"$f":"V3+7","v":"2022-07-11"},{"$f":"W3+7","v":"2022-07-18"},{"$f":"X3+7","v":"2022-07-25"},"2022-08-01","2022-08-08","2022-08-15","2022-08-22","2022-08-29","2022-09-05","2022-09-12","2022-09-19","2022-09-26","2022-10-03","2022-10-10","2022-10-17","2022-10-24","2022-10-31","2022-11-07","2022-11-14","2022-11-21","2022-11-28","2022-12-05","2022-12-12","2022-12-19","2022-12-26","2023-01-02","2023-01-09","2023-01-16","2023-01-23","2023-01-30","2023-02-06","2023-02-13","2023-02-20","2023-02-27","2023-03-06","2023-03-13","2023-03-20","2023-03-27","2023-04-03","2023-04-10","2023-04-17","2023-04-24","2023-05-01","2023-05-08","2023-05-15","2023-05-22","2023-05-29","2023-06-05","2023-06-12","2023-06-19","2023-06-26","2023-07-03",{"$f":"BV3+7","v":"2023-07-10"},"2023-07-17","2023-07-24","2023-07-31"]
["P/N","Description",null,null,"LT (weeks)","Exp date (months)",null,null,"S14","S15","S16","S17","S18","S19","S20","S21","S22","S23","S24","S25","S26","S27","S28","S29","S30","S31","S32","S33","S34","S35","S36","S37","S38","S39","S40","S41","S42","S43","S44","S45","S46","S47","S48","S49","S50","S51","S52","S01","S02","S03","S04","S05","S06","S07","S08","S09","S10","S11","S12","S13","S14","S15","S16","S17","S18","S19","S20","S21","S22","S23","S24","S25","S26","S27","S28","S29","S30","S31"]
["CHP001035","A",1.5063,null,16,6,"Need SR",{"$f":"SUM(I7:BZ8)","v":430000},{"$f":"$C$5*'[1]Production plan'!C12/34.5","v":0},{"$f":"$C$5*'[1]Production plan'!D12/34.5","v":0},{"$f":"$C$5*'[1]Production plan'!E12/34.5","v":6040.3939826086944},{"$f":"$C$5*'[1]Production plan'!F12/34.5","v":0},{"$f":"$C$5*'[1]Production plan'!G12/34.5","v":0},{"$f":"$C$5*'[1]Production plan'!H12/34.5","v":6264.1122782608682},{"$f":"$C$5*'[1]Production plan'!I12/34.5","v":0},{"$f":"$C$5*'[1]Production plan'!J12/34.5","v":3579.4927304347821},{"$f":"$C$5*'[1]Production plan'!K12/34.5","v":0},{"$f":"$C$5*'[1]Production plan'!L12/34.5","v":3579.4927304347821},{"$f":"$C$5*'[1]Production plan'!M12/34.5","v":10738.478191304344},{"$f":"$C$5*'[1]Production plan'!N12/34.5","v":8053.8586434782601},{"$f":"$C$5*'[1]Production plan'!O12/34.5","v":8053.8586434782601},{"$f":"$C$5*'[1]Production plan'!P12/34.5","v":13423.097739130433},{"$f":"$C$5*'[1]Production plan'!Q12/34.5","v":0},{"$f":"$C$5*'[1]Production plan'!R12/34.5","v":8053.8586434782601},{"$f":"$C$5*'[1]Production plan'!S12/34.5","v":0},{"$f":"$C$5*'[1]Production plan'!T12/34.5","v":0},{"$f":"$C$5*'[1]Production plan'!U12/34.5","v":0},{"$f":"$C$5*'[1]Production plan'!V12/34.5","v":0},{"$f":"$C$5*'[1]Production plan'!W12/34.5","v":2684.6195478260861},{"$f":"$C$5*'[1]Production plan'!X12/34.5","v":16107.71728695652},{"$f":"$C$5*'[1]Production plan'!Y12/34.5","v":0},{"$f":"$C$5*'[1]Production plan'!Z12/34.5","v":0},{"$f":"$C$5*'[1]Production plan'!AA12/34.5","v":0},{"$f":"$C$5*'[1]Production plan'!AB12/34.5","v":8053.8586434782601},{"$f":"$C$5*'[1]Production plan'!AC12/34.5","v":0},{"$f":"$C$5*'[1]Production plan'!AD12/34.5","v":0},{"$f":"$C$5*'[1]Production plan'!AE12/34.5","v":0},{"$f":"$C$5*'[1]Production plan'!AF12/34.5","v":0},{"$f":"$C$5*'[1]Production plan'!AG12/34.5","v":0},{"$f":"$C$5*'[1]Production plan'!AH12/34.5","v":0},{"$f":"$C$5*'[1]Production plan'!AI12/34.5","v":0},{"$f":"$C$5*'[1]Production plan'!AJ12/34.5","v":0},{"$f":"$C$5*'[1]Production plan'!AK12/34.5","v":0},{"$f":"$C$5*'[1]Production plan'!AL12/34.5","v":0},{"$f":"$C$5*'[1]Production plan'!AM12/34.5","v":0},{"$f":"$C$5*'[1]Production plan'!AN12/34.5","v":21476.956382608689},{"$f":"$C$5*'[1]Production plan'!AO12/34.5","v":0},{"$f":"$C$5*'[1]Production plan'!AP12/34.5","v":25056.449113043473},{"$f":"$C$5*'[1]Production plan'!AQ12/34.5","v":0},{"$f":"$C$5*'[1]Production plan'!AR12/34.5","v":25056.449113043473},{"$f":"$C$5*'[1]Production plan'!AS12/34.5","v":0},{"$f":"$C$5*'[1]Production plan'!AT12/34.5","v":25056.449113043473},{"$f":"$C$5*'[1]Production plan'!AU12/34.5","v":0},{"$f":"$C$5*'[1]Production plan'!AV12/34.5","v":0},{"$f":"$C$5*'[1]Production plan'!AW12/34.5","v":0},{"$f":"$C$5*'[1]Production plan'!AX12/34.5","v":0},{"$f":"$C$5*'[1]Production plan'!AY12/34.5","v":0},{"$f":"$C$5*'[1]Production plan'!AZ12/34.5","v":0},{"$f":"$C$5*'[1]Production plan'!BA12/34.5","v":0},{"$f":"$C$5*'[1]Production plan'!BB12/34.5","v":0},{"$f":"$C$5*'[1]Production plan'!BC12/34.5","v":0},{"$f":"$C$5*'[1]Production plan'!BD12/34.5","v":35794.927304347832},{"$f":"$C$5*'[1]Production plan'!BE12/34.5","v":0},{"$f":"$C$5*'[1]Production plan'!BF12/34.5","v":0},{"$f":"$C$5*'[1]Production plan'!BG12/34.5","v":28635.941843478256},{"$f":"$C$5*'[1]Production plan'!BH12/34.5","v":0},{"$f":"$C$5*'[1]Production plan'!BI12/34.5","v":32215.43457391304},{"$f":"$C$5*'[1]Production plan'!BJ12/34.5","v":0},{"$f":"$C$5*'[1]Production plan'!BK12/34.5","v":0},{"$f":"$C$5*'[1]Production plan'!BL12/34.5","v":0},{"$f":"$C$5*'[1]Production plan'!BM12/34.5","v":0},{"$f":"$C$5*'[1]Production plan'!BN12/34.5","v":0},{"$f":"$C$5*'[1]Production plan'!BO12/34.5","v":0},{"$f":"$C$5*'[1]Production plan'!BP12/34.5","v":32215.43457391304},{"$f":"$C$5*'[1]Production plan'!BQ12/34.5","v":0},{"$f":"$C$5*'[1]Production plan'!BR12/34.5","v":32215.43457391304},{"$f":"$C$5*'[1]Production plan'!BS12/34.5","v":0},{"$f":"$C$5*'[1]Production plan'!BT12/34.5","v":0}]
[null,null,null,0.67439400000000005,null,null,"Need HR",null,{"$f":"$D$6*'[1]Production plan'!C15/17","v":0},{"$f":"$D$6*'[1]Production plan'!D15/17","v":0},{"$f":"$D$6*'[1]Production plan'!E15/17","v":0},{"$f":"$D$6*'[1]Production plan'!F15/17","v":0},{"$f":"$D$6*'[1]Production plan'!G15/17","v":0},{"$f":"$D$6*'[1]Production plan'!H15/17","v":0},{"$f":"$D$6*'[1]Production plan'!I15/17","v":0},{"$f":"$D$6*'[1]Production plan'!J15/17","v":0},{"$f":"$D$6*'[1]Production plan'!K15/17","v":0},{"$f":"$D$6*'[1]Production plan'!L15/17","v":0},{"$f":"$D$6*'[1]Production plan'!M15/17","v":0},{"$f":"$D$6*'[1]Production plan'!N15/17","v":0},{"$f":"$D$6*'[1]Production plan'!O15/17","v":0},{"$f":"$D$6*'[1]Production plan'!P15/17","v":0},{"$f":"$D$6*'[1]Production plan'!Q15/17","v":0},{"$f":"$D$6*'[1]Production plan'!R15/17","v":7317.7302832941168},{"$f":"$D$6*'[1]Production plan'!S15/17","v":0},{"$f":"$D$6*'[1]Production plan'!T15/17","v":0},{"$f":"$D$6*'[1]Production plan'!U15/17","v":0},{"$f":"$D$6*'[1]Production plan'!V15/17","v":0},{"$f":"$D$6*'[1]Production plan'!W15/17","v":0},{"$f":"$D$6*'[1]Production plan'!X15/17","v":0},{"$f":"$D$6*'[1]Production plan'!Y15/17","v":0},{"$f":"$D$6*'[1]Production plan'!Z15/17","v":0},{"$f":"$D$6*'[1]Production plan'!AA15/17","v":0},{"$f":"$D$6*'[1]Production plan'!AB15/17","v":5955.295722352942},{"$f":"$D$6*'[1]Production plan'!AC15/17","v":0},{"$f":"$D$6*'[1]Production plan'!AD15/17","v":5955.295722352942},{"$f":"$D$6*'[1]Production plan'!AE15/17","v":0},{"$f":"$D$6*'[1]Production plan'!AF15/17","v":5955.295722352942},{"$f":"$D$6*'[1]Production plan'!AG15/17","v":0},{"$f":"$D$6*'[1]Production plan'!AH15/17","v":0},{"$f":"$D$6*'[1]Production plan'!AI15/17","v":0},{"$f":"$D$6*'[1]Production plan'!AJ15/17","v":11910.591444705884},{"$f":"$D$6*'[1]Production plan'!AK15/17","v":0},{"$f":"$D$6*'[1]Production plan'!AL15/17","v":15880.788592941179},{"$f":"$D$6*'[1]Production plan'!AM15/17","v":0},{"$f":"$D$6*'[1]Production plan'!AN15/17","v":0},{"$f":"$D$6*'[1]Production plan'!AO15/17","v":0},{"$f":"$D$6*'[1]Production plan'!AP15/17","v":0},{"$f":"$D$6*'[1]Production plan'!AQ15/17","v":0},{"$f":"$D$6*'[1]Production plan'!AR15/17","v":0},{"$f":"$D$6*'[1]Production plan'!AS15/17","v":0},{"$f":"$D$6*'[1]Production plan'!AT15/17","v":0},{"$f":"$D$6*'[1]Production plan'!AU15/17","v":0},{"$f":"$D$6*'[1]Production plan'!AV15/17","v":0},{"$f":"$D$6*'[1]Production plan'!AW15/17","v":18527.586691764707},{"$f":"$D$6*'[1]Production plan'!AX15/17","v":0},{"$f":"$D$6*'[1]Production plan'!AY15/17","v":0},{"$f":"$D$6*'[1]Production plan'!AZ15/17","v":26467.980988235297},{"$f":"$D$6*'[1]Production plan'!BA15/17","v":0},{"$f":"$D$6*'[1]Production plan'!BB15/17","v":23821.182889411768},{"$f":"$D$6*'[1]Production plan'!BC15/17","v":0},{"$f":"$D$6*'[1]Production plan'!BD15/17","v":0},{"$f":"$D$6*'[1]Production plan'!BE15/17","v":0},{"$f":"$D$6*'[1]Production plan'!BF15/17","v":0},{"$f":"$D$6*'[1]Production plan'!BG15/17","v":0},{"$f":"$D$6*'[1]Production plan'!BH15/17","v":0},{"$f":"$D$6*'[1]Production plan'!BI15/17","v":0},{"$f":"$D$6*'[1]Production plan'!BJ15/17","v":0},{"$f":"$D$6*'[1]Production plan'!BK15/17","v":10587.192395294118},{"$f":"$D$6*'[1]Production plan'!BL15/17","v":10587.192395294118},{"$f":"$D$6*'[1]Production plan'!BM15/17","v":7940.3942964705893},{"$f":"$D$6*'[1]Production plan'!BN15/17","v":7940.3942964705893},{"$f":"$D$6*'[1]Production plan'!BO15/17","v":0},{"$f":"$D$6*'[1]Production plan'!BP15/17","v":0},{"$f":"$D$6*'[1]Production plan'!BQ15/17","v":0},{"$f":"$D$6*'[1]Production plan'!BR15/17","v":0},{"$f":"$D$6*'[1]Production plan'!BS15/17","v":0},{"$f":"$D$6*'[1]Production plan'!BT15/17","v":0}]
[null,null,null,null,null,null,"Supply SR",null,null,null,null,null,null,null,null,10000,null,null,null,10000,null,null,null,null,null,null,null,null,null,25000,null,null,null,null,null,null,10000,null,null,null,20000,null,null,10000,null,20000,null,10000,null,null,null,null,null,null,null,null,null,10000,10000,10000,10000,20000,10000,10000,10000,10000,null,null,null,null,10000,10000,10000,20000,10000]
[null,null,null,null,null,null,"Supply HR",null,null,null,null,null,null,null,null,null,null,null,null,null,10000,null,null,null,15000,null,20000,null,null,null,null,null,null,null,null,null,null,null,null,null,null,null,null,null,null,null,null,null,10000,10000,null,10000,null,20000,null,null,20000,null,null,null,null,null,null,null,null,null,20000,null,10000,10000]
{"$rows_left_out":479}
{"sheet":"DATA","index":1,"n_rows":67,"n_cols":3,"rows_kept":67,"cut":false,"hidden":false,"merged":[]}
["CHP001035",{"$f":"INDEX('Supply plan'!B:B,MATCH(DATA!A1,'Supply plan'!A:A,0))","v":"A"},"Si tu changes les descriptions dans feuille Supply elle se reportent ici avec la formule INDEX et la macro utilse les données de DATA"]
["CHP001036",{"$f":"INDEX('Supply plan'!B:B,MATCH(DATA!A2,'Supply plan'!A:A,0))","v":"B"}]
["CHP001043",{"$f":"INDEX('Supply plan'!B:B,MATCH(DATA!A3,'Supply plan'!A:A,0))","v":"C"}]
["COP001009",{"$f":"INDEX('Supply plan'!B:B,MATCH(DATA!A4,'Supply plan'!A:A,0))","v":"D"}]
["CHP000010",{"$f":"INDEX('Supply plan'!B:B,MATCH(DATA!A5,'Supply plan'!A:A,0))","v":"E"}]
["CHP000012",{"$f":"INDEX('Supply plan'!B:B,MATCH(DATA!A6,'Supply plan'!A:A,0))","v":"F"}]
["CHP001039",{"$f":"INDEX('Supply plan'!B:B,MATCH(DATA!A7,'Supply plan'!A:A,0))","v":"G"}]
["CHP001052",{"$f":"INDEX('Supply plan'!B:B,MATCH(DATA!A8,'Supply plan'!A:A,0))","v":"H"}]
{"$rows_left_out":60}
{"sheet":"Recap","index":2,"n_rows":37,"n_cols":200,"rows_kept":37,"cut":false,"hidden":false,"merged":[]}
[null,"Raccourci Ctrl + r pour lancer la macro      Restera après à mettre en forme"]
["A",null,null,"B",null,null,"C",null,null,"D",null,null,"E",null,null,"F",null,null,"G",null,null,"H",null,null,"I",null,null,"J",null,null,"K",null,null,"L",null,null,"M",null,null,"N",null,null,"O",null,null,"P",null,null,"Q",null,null,"R",null,null,"S",null,null,"T",null,null,"U",null,null,"V",null,null,"W",null,null,"X",null,null,"Y",null,null,"Z",null,null,"AA",null,null,"AB",null,null,"AC",null,null,"AD",null,null,"AE",null,null,"AF",null,null,"AG",null,null,"AH",null,null,"AI",null,null,"AJ",null,null,"AK",null,null,"AL",null,null,"AM",null,null,"AN",null,null,"AO",null,null,"AP",null,null,"AQ",null,null,"AR",null,null,"AS",null,null,"AT",null,null,"AU",null,null,"AV",null,null,"AW",null,null,"AX",null,null,"AY",null,null,"AZ",null,null,"BA",null,null,"BB",null,null,"BC",null,null,"BD",null,null,"BE",null,null,"BF",null,null,"BG",null,null,"BH",null,null,"BI",null,null,"BJ",null,null,"BK",null,null,"BL",null,null,"BM",null,null,"BN",null,null,"BO"]
["CHP001035",null,null,"CHP001036",null,null,"CHP001043",null,null,"COP001009",null,null,"CHP000010",null,null,"CHP000012",null,null,"CHP001039",null,null,"CHP001052",null,null,"CHP001031",null,null,"CHP001032",null,null,"CHP001033",null,null,"CHP001053",null,null,"CHP001034",null,null,"CHP000006",null,null,"CHP001040",null,null,"CHP001028",null,null,"MEP001014",null,null,"MEP001119",null,null,"CHP001001",null,null,"CHP001017",null,null,"MEP001011",null,null,"MEP001013",null,null,"MEP000019",null,null,"MEP001009",null,null,"MEP000022",null,null,"MEP001010",null,null,"MEP001126",null,null,"MEP001125",null,null,"MEP001124",null,null,"MEP001123",null,null,"MEP001021",null,null,"MEP001020",null,null,"MEP001090",null,null,"MEP001089",null,null,"MEP001008",null,null,"MEP001005",null,null,"MEP001100",null,null,"MEP001101",null,null,"MEP001091",null,null,"MEP001092",null,null,"MEP001099",null,null,"MEP001058",null,null,"MEP000013",null,null,"MEP000012",null,null,"MEP001093",null,null,"MEP001094",null,null,"MEP001049",null,null,"MEP001050",null,null,"MEP001015",null,null,"MEP001000",null,null,"MEP001033",null,null,"MEP001034",null,null,"MEP001121",null,null,"MEP001003",null,null,"MEP001072",null,null,"MEP000006",null,null,"MEP001111",null,null,"MEP000007",null,null,"MEP001087",null,null,"MEP001041",null,null,"MEP001001",null,null,"MEP001120",null,null,"MEP001065",null,null,"MEP001039",null,null,"MEP001040",null,null,"MEP001112",null,null,"MEP001044"]
["Qté","Délai",null,"Qté","Délai",null,"Qté","Délai",null,"Qté","Délai",null,"Qté","Délai",null,"Qté","Délai",null,"Qté","Délai",null,"Qté","Délai",null,"Qté","Délai",null,"Qté","Délai",null,"Qté","Délai",null,"Qté","Délai",null,"Qté","Délai",null,"Qté","Délai",null,"Qté","Délai",null,"Qté","Délai",null,"Qté","Délai",null,"Qté","Délai",null,"Qté","Délai",null,"Qté","Délai",null,"Qté","Délai",null,"Qté","Délai",null,"Qté","Délai",null,"Qté","Délai",null,"Qté","Délai",null,"Qté","Délai",null,"Qté","Délai",null,"Qté","Délai",null,"Qté","Délai",null,"Qté","Délai",null,"Qté","Délai",null,"Qté","Délai",null,"Qté","Délai",null,"Qté","Délai",null,"Qté","Délai",null,"Qté","Délai",null,"Qté","Délai",null,"Qté","Délai",null,"Qté","Délai",null,"Qté","Délai",null,"Qté","Délai",null,"Qté","Délai",null,"Qté","Délai",null,"Qté","Délai",null,"Qté","Délai",null,"Qté","Délai",null,"Qté","Délai",null,"Qté","Délai",null,"Qté","Délai",null,"Qté","Délai",null,"Qté","Délai",null,"Qté","Délai",null,"Qté","Délai",null,"Qté","Délai",null,"Qté","Délai",null,"Qté","Délai",null,"Qté","Délai",null,"Qté","Délai",null,"Qté","Délai",null,"Qté","Délai",null,"Qté","Délai",null,"Qté","Délai",null,"Qté","Délai",null,"Qté","Délai",null,"Qté","Délai",null,"Qté","Délai",null,"Qté","Délai"]
[10000,"2022-05-23",null,320,"2022-04-25",null,1800,"2022-05-16",null,5000,"2022-04-11",null,40,"2022-05-16",null,45,"2022-05-23",null,2263,"2022-05-23",null,1153,"2022-08-01",null,3000,"2022-06-27",null,3000,"2022-06-27",null,6450,"2022-07-04",null,5400,"2022-07-25",null,800,"2022-05-30",null,500,"2022-06-20",null,2120,"2022-05-23",null,1400,"2022-05-30",null,23100,"2022-05-30",null,1386,"2022-05-16",null,688000,"2022-07-04",null,54456,"2022-05-09",null,1320,"2022-05-30",null,660,"2022-05-30",null,7680,"2022-05-30",null,7680,"2022-05-30",null,7680,"2022-05-30",null,7680,"2022-05-30",null,400,"2022-07-25",null,400,"2022-07-25",null,400,"2022-07-25",null,400,"2022-07-25",null,9000,"2022-07-18",null,9000,"2022-07-18",null,3205,"2022-05-23",null,4500,"2022-05-23",null,400,"2022-08-01",null,5200,"2022-08-01",null,9500,"2022-07-04",null,9500,"2022-07-04",null,2100,"2022-05-09",null,150,"2022-04-11",null,4500,"2022-08-01",null,4500,"2022-08-01",null,5000,"2022-04-25",null,5000,"2022-04-25",null,400,"2022-08-01",null,400,"2022-08-01",null,10000,"2022-07-04",null,10000,"2022-07-04",null,1920,"2023-01-02",null,500,"2023-01-09",null,500,"2023-01-09",null,2000,"2023-01-02",null,924,"2022-05-30",null,200,"2022-05-02",null,15000,"2022-08-01",null,2750,"2022-06-27",null,220,"2022-06-27",null,24,"2022-09-19",null,103,"2022-05-16",null,400,"2022-05-02",null,400,"2022-05-02",null,2112,"2022-05-30",null,220,"2022-05-23",null,800,"2022-05-16",null,4300,"2022-05-30",null,220,"2022-05-30",null,405,"2022-12-05"]
[10000,"2022-06-20",null,320,"2022-06-06",null,1800,"2022-06-27",null,4000,"2022-05-02",null,40,"2022-08-01",null,120,"2022-05-30",null,2000,"2022-08-08",null,2000,"2022-09-26",null,6000,"2022-07-25",null,6000,"2022-07-25",null,3600,"2022-08-01",null,900,"2022-08-29",null,800,"2022-07-18",null,500,"2022-09-19",null,2340,"2022-06-06",null,4072,"2022-07-04",null,13200,"2022-09-05",null,2772,"2022-08-01",null,692737,"2022-07-25",null,1897000,"2022-10-10",null,660,"2022-09-05",null,660,"2022-11-07",null,null,null,null,null,null,null,null,null,null,null,null,null,3600,"2022-08-01",null,3600,"2022-08-01",null,3600,"2022-08-01",null,3600,"2022-08-01",null,7000,"2022-12-12",null,7000,"2022-12-12",null,null,null,null,null,null,null,4800,"2022-08-22",null,12200,"2023-01-16",null,6000,"2022-10-17",null,6000,"2022-10-17",null,3000,"2022-07-18",null,3300,"2022-04-25",null,6000,"2022-11-21",null,6000,"2022-11-21",null,null,null,null,null,null,null,17000,"2022-08-22",null,17000,"2022-08-22",null,10000,"2023-02-27",null,10000,"2023-02-27",null,1920,"2023-01-30",null,500,"2023-02-20",null,500,"2023-02-20",null,2000,"2023-02-27",null,1320,"2022-09-05",null,500,"2022-07-25",null,5000,"2023-05-08",null,2640,"2023-03-06",null,500,"2022-08-01",null,48,"2023-02-06",null,32,"2022-07-18",null,500,"2023-03-13",null,500,"2023-03-13",null,1320,"2023-01-09",null,550,"2022-10-31",null,1030,"2022-07-25",null,2000,"2023-04-17",null,500,"2022-10-31",null,500,"2023-03-06"]
[10000,"2022-06-27",null,220,"2022-06-27",null,1800,"2022-06-27",null,5000,"2022-06-06",null,40,"2023-01-02",null,120,"2022-06-27",null,2000,"2022-10-03",null,2000,"2022-11-28",null,3000,"2022-08-22",null,3000,"2022-08-22",null,8700,"2022-08-29",null,14000,"2022-09-26",null,800,"2022-09-19",null,500,"2023-01-02",null,1550,"2022-06-13",null,3000,"2022-09-12",null,23100,"2023-01-23",null,2640,"2023-01-09",null,688000,"2023-01-23",null,500000,"2023-05-22",null,1320,"2023-01-23",null,660,"2023-01-23",null,null,null,null,null,null,null,null,null,null,null,null,null,5000,"2023-01-09",null,5000,"2023-01-09",null,5000,"2023-01-09",null,5000,"2023-01-09",null,15000,"2023-02-27",null,15000,"2023-02-27",null,null,null,null,null,null,null,12200,"2023-01-16",null,10000,"2023-04-03",null,10000,"2023-03-06",null,10000,"2023-03-06",null,750,"2022-08-01",null,2250,"2022-05-16",null,6000,"2023-02-13",null,6000,"2023-02-13",null,null,null,null,null,null,null,10000,"2023-04-03",null,10000,"2023-04-03",null,10000,"2023-03-13",null,10000,"2023-03-13",null,1920,"2023-02-13",null,500,"2023-03-06",null,500,"2023-03-06",null,2000,"2023-03-27",null,2640,"2023-02-13",null,1000,"2023-01-30",null,null,null,null,2640,"2023-05-29",null,1000,"2023-01-30",null,48,"2023-03-20",null,250,"2022-11-28",null,500,"2023-03-27",null,500,"2023-03-27",null,1320,"2023-03-13",null,1000,"2023-03-06",null,1000,"2023-01-02",null,null,null,null,1000,"2023-03-06",null,500,"2023-03-27"]
[15000,"2022-07-25",null,640,"2022-07-11",null,3600,"2022-07-25",null,5000,"2022-06-20",null,40,"2023-03-06",null,120,"2022-07-18",null,2000,"2022-11-28",null,3000,"2023-01-30",null,3000,"2022-09-05",null,3000,"2022-09-05",null,8700,"2022-10-03",null,16000,"2022-11-07",null,800,"2022-11-28",null,500,"2023-02-13",null,2399,"2022-07-04",null,2500,"2022-11-14",null,23100,"2023-02-13",null,2640,"2023-01-30",null,688000,"2023-02-13",null,500000,"2023-06-05",null,1320,"2023-02-13",null,660,"2023-03-06",null,null,null,null,null,null,null,null,null,null,null,null,null,6000,"2023-02-06",null,6000,"2023-02-06",null,6000,"2023-02-06",null,6000,"2023-02-06",null,15000,"2023-03-20",null,15000,"2023-03-20",null,null,null,null,null,null,null,10000,"2023-04-03",null,5000,"2023-04-24",null,10000,"2023-03-20",null,10000,"2023-03-20",null,2250,"2022-08-22",null,3000,"2022-07-18",null,10000,"2023-03-06",null,10000,"2023-03-06",null,null,null,null,null,null,null,10000,"2023-05-08",null,10000,"2023-05-08",null,10000,"2023-03-27",null,10000,"2023-03-27",null,1920,"2023-02-20",null,500,"2023-04-24",null,500,"2023-04-24",null,2000,"2023-04-17",null,2640,"2023-03-13",null,1000,"2023-02-20",null,null,null,null,null,null,null,1000,"2023-02-20",null,48,"2023-04-17",null,250,"2023-01-02",null,500,"2023-04-10",null,500,"2023-04-10",null,2640,"2023-03-27",null,1000,"2023-03-27",null,10000,"2023-03-06",null,null,null,null,1000,"2023-03-27",null,500,"2023-04-10"]
{"$rows_left_out":29}