{"text_format":"1","workbook":"xlsx","n_sheets":4,"sheets":["Résumé","Planning 2023","Data","Congés"],"not_rendered":{"charts":0,"images":0,"macros":1,"external_links":3,"defined_names":5,"comments":0,"pivot_tables":0},"unopened":[],"bounds":{"document_bytes":16777216,"sheet_cells":100000,"rows_first":2000,"rows_last":500,"rows_between":2000,"halvings":0,"cell_chars":16384,"cell_head_chars":4096},"cells_cut":0,"cells_raw":0,"read":"whole","date_system":"1900"}

{"sheet":"Résumé","index":0,"n_rows":65,"n_cols":12,"rows_kept":65,"cut":false,"hidden":false,"merged":[[1,3,2,3]]}
[null,null,null,"Date"]
[null,null,null,"2023-01-10"]
[]
[]
["Agents","Véhicule","Cronos","Chantier","Adresse",null,"Planning",{"$f":"D2","v":"2023-01-10"},null,null,null,"JACOPS"]
["Beaupain Olivier","1-PLT-828",364467,{"$f":"IF(C6=0,\"\",INDEX('[3]1847-1949-3347-3581'!$C$17:$C$14007,MATCH(C6,'[3]1847-1949-3347-3581'!$F$17:$F$14007,0)))","v":"1847/2423"},{"$f":"IF(ISNA(IF(D6=0,\"\",CONCATENATE(VLOOKUP(D6,'[3]1847-1949-3347-3581'!$C:$I,6,FALSE),\" \",VLOOKUP(D6,'[3]1847-1949-3347-3581'!$C:$I,7,FALSE)))),\"\",IF(D6=0,\"\",CONCATENATE(VLOOKUP(D6,'[3]1847-1949-3347-3581'!$C:$I,6,FALSE),\" \",VLOOKUP(D6,'[3]1847-1949-3347-3581'!$C:$I,7,FALSE))))","v":"Mouscron Rue du Marquis D'Ennetières"},null,"Equipes","Véhicules","Cronos","Chantier","Adresse","Remarques"]
[null,null,null,{"$f":"IF(C7=0,\"\",INDEX('[3]1847-1949-3347-3581'!$C$17:$C$14007,MATCH(C7,'[3]1847-1949-3347-3581'!$F$17:$F$14007,0)))","v":""},{"$f":"IF(ISNA(IF(D7=0,\"\",CONCATENATE(VLOOKUP(D7,'[3]1847-1949-3347-3581'!$C:$I,6,FALSE),\" \",VLOOKUP(D7,'[3]1847-1949-3347-3581'!$C:$I,7,FALSE)))),\"\",IF(D7=0,\"\",CONCATENATE(VLOOKUP(D7,'[3]1847-1949-3347-3581'!$C:$I,6,FALSE),\" \",VLOOKUP(D7,'[3]1847-1949-3347-3581'!$C:$I,7,FALSE))))","v":""},null,"Beaupain Olivier","1-PLT-828",364467,"1847/2423","Mouscron Rue du Marquis D'Ennetières"]
[null,null,null,{"$f":"IF(C8=0,\"\",INDEX('[3]1847-1949-3347-3581'!$C$17:$C$14007,MATCH(C8,'[3]1847-1949-3347-3581'!$F$17:$F$14007,0)))","v":""},{"$f":"IF(ISNA(IF(D8=0,\"\",CONCATENATE(VLOOKUP(D8,'[3]1847-1949-3347-3581'!$C:$I,6,FALSE),\" \",VLOOKUP(D8,'[3]1847-1949-3347-3581'!$C:$I,7,FALSE)))),\"\",IF(D8=0,\"\",CONCATENATE(VLOOKUP(D8,'[3]1847-1949-3347-3581'!$C:$I,6,FALSE),\" \",VLOOKUP(D8,'[3]1847-1949-3347-3581'!$C:$I,7,FALSE))))","v":""},null,"De Grande Johnny","1-NBV-134",364467,"1847/2423"]
[null,null,null,{"$f":"IF(C9=0,\"\",INDEX('[3]1847-1949-3347-3581'!$C$17:$C$14007,MATCH(C9,'[3]1847-1949-3347-3581'!$F$17:$F$14007,0)))","v":""},{"$f":"IF(ISNA(IF(D9=0,\"\",CONCATENATE(VLOOKUP(D9,'[3]1847-1949-3347-3581'!$C:$I,6,FALSE),\" \",VLOOKUP(D9,'[3]1847-1949-3347-3581'!$C:$I,7,FALSE)))),\"\",IF(D9=0,\"\",CONCATENATE(VLOOKUP(D9,'[3]1847-1949-3347-3581'!$C:$I,6,FALSE),\" \",VLOOKUP(D9,'[3]1847-1949-3347-3581'!$C:$I,7,FALSE))))","v":""},null,"De Bodt Yves",null,"malade",{"$error":"#N/A"}]
["De Bodt Yves",null,"malade",{"$f":"IF(C10=0,\"\",INDEX('[3]1847-1949-3347-3581'!$C$17:$C$14007,MATCH(C10,'[3]1847-1949-3347-3581'!$F$17:$F$14007,0)))","v":{"$error":"#N/A"}},{"$f":"IF(ISNA(IF(D10=0,\"\",CONCATENATE(VLOOKUP(D10,'[3]1847-1949-3347-3581'!$C:$I,6,FALSE),\" \",VLOOKUP(D10,'[3]1847-1949-3347-3581'!$C:$I,7,FALSE)))),\"\",IF(D10=0,\"\",CONCATENATE(VLOOKUP(D10,'[3]1847-1949-3347-3581'!$C:$I,6,FALSE),\" \",VLOOKUP(D10,'[3]1847-1949-3347-3581'!$C:$I,7,FALSE))))","v":""},null,"Verdy Geoffrey"]
{"$rows_left_out":56}
{"sheet":"Planning 2023","index":1,"n_rows":82,"n_cols":17,"rows_kept":82,"cut":false,"hidden":false,"merged":[]}
[null,{"$f":"IF(ISNA(VLOOKUP(B2,congés,2,FALSE)),\"-\",VLOOKUP(B2,congés,2,FALSE))","v":"Congé"},{"$f":"B1","v":"Congé"},{"$f":"B1","v":"Congé"},{"$f":"B1","v":"Congé"},{"$f":"IF(ISNA(VLOOKUP(F2,congés,2,FALSE)),\"-\",VLOOKUP(F2,congés,2,FALSE))","v":"-"},{"$f":"F1","v":"-"},{"$f":"F1","v":"-"},{"$f":"F1","v":"-"},{"$f":"IF(ISNA(VLOOKUP(J2,congés,2,FALSE)),\"-\",VLOOKUP(J2,congés,2,FALSE))","v":"-"},{"$f":"J1","v":"-"},{"$f":"J1","v":"-"},{"$f":"J1","v":"-"},{"$f":"IF(ISNA(VLOOKUP(N2,congés,2,FALSE)),\"-\",VLOOKUP(N2,congés,2,FALSE))","v":"-"},{"$f":"N1","v":"-"},{"$f":"N1","v":"-"},{"$f":"N1","v":"-"}]
[null,"2023-01-06",null,null,null,"2023-01-09",null,null,null,"2023-01-10",null,null,null,"2023-01-11"]
["Agents","Véhicule","Cronos","Chantier","Adresse","Véhicule","Cronos","Chantier","Adresse","Véhicule","Cronos","Chantier","Adresse","Véhicule","Cronos","Chantier","Adresse"]
["Beaupain Olivier",null,null,{"$f":"IF(C4=0,\"\",INDEX('[3]1847-1949-3347-3581'!$C$17:$C$14007,MATCH(C4,'[3]1847-1949-3347-3581'!$F$17:$F$14007,0)))","v":""},{"$f":"IF(ISNA(IF(D4=0,\"\",CONCATENATE(VLOOKUP(D4,'[3]1847-1949-3347-3581'!$C:$I,6,FALSE),\" \",VLOOKUP(D4,'[3]1847-1949-3347-3581'!$C:$I,7,FALSE)))),\"\",IF(D4=0,\"\",CONCATENATE(VLOOKUP(D4,'[3]1847-1949-3347-3581'!$C:$I,6,FALSE),\" \",VLOOKUP(D4,'[3]1847-1949-3347-3581'!$C:$I,7,FALSE))))","v":""},"1-PLT-828","EX_23_00035",{"$f":"IF(G4=0,\"\",INDEX('[3]1847-1949-3347-3581'!$C$17:$C$14007,MATCH(G4,'[3]1847-1949-3347-3581'!$F$17:$F$14007,0)))","v":"1847/2743"},{"$f":"IF(ISNA(IF(H4=0,\"\",CONCATENATE(VLOOKUP(H4,'[3]1847-1949-3347-3581'!$C:$I,6,FALSE),\" \",VLOOKUP(H4,'[3]1847-1949-3347-3581'!$C:$I,7,FALSE)))),\"\",IF(H4=0,\"\",CONCATENATE(VLOOKUP(H4,'[3]1847-1949-3347-3581'!$C:$I,6,FALSE),\" \",VLOOKUP(H4,'[3]1847-1949-3347-3581'!$C:$I,7,FALSE))))","v":"Herchies chemin à Joncs 1 - 10/400"},"1-PLT-828",364467,{"$f":"IF(K4=0,\"\",INDEX('[3]1847-1949-3347-3581'!$C$17:$C$14007,MATCH(K4,'[3]1847-1949-3347-3581'!$F$17:$F$14007,0)))","v":"1847/2423"},{"$f":"IF(ISNA(IF(L4=0,\"\",CONCATENATE(VLOOKUP(L4,'[3]1847-1949-3347-3581'!$C:$I,6,FALSE),\" \",VLOOKUP(L4,'[3]1847-1949-3347-3581'!$C:$I,7,FALSE)))),\"\",IF(L4=0,\"\",CONCATENATE(VLOOKUP(L4,'[3]1847-1949-3347-3581'!$C:$I,6,FALSE),\" \",VLOOKUP(L4,'[3]1847-1949-3347-3581'!$C:$I,7,FALSE))))","v":"Mouscron Rue du Marquis D'Ennetières"},"1-PLT-828",378023,{"$f":"IF(O4=0,\"\",INDEX('[3]1847-1949-3347-3581'!$C$17:$C$14007,MATCH(O4,'[3]1847-1949-3347-3581'!$F$17:$F$14007,0)))","v":"1847/2721"},{"$f":"IF(ISNA(IF(P4=0,\"\",CONCATENATE(VLOOKUP(P4,'[3]1847-1949-3347-3581'!$C:$I,6,FALSE),\" \",VLOOKUP(P4,'[3]1847-1949-3347-3581'!$C:$I,7,FALSE)))),\"\",IF(P4=0,\"\",CONCATENATE(VLOOKUP(P4,'[3]1847-1949-3347-3581'!$C:$I,6,FALSE),\" \",VLOOKUP(P4,'[3]1847-1949-3347-3581'!$C:$I,7,FALSE))))","v":"Estaimpuis Rue de l'Armistice "}]
[null,null,null,{"$f":"IF(C5=0,\"\",INDEX('[3]1847-1949-3347-3581'!$C$17:$C$14007,MATCH(C5,'[3]1847-1949-3347-3581'!$F$17:$F$14007,0)))","v":""},{"$f":"IF(ISNA(IF(D5=0,\"\",CONCATENATE(VLOOKUP(D5,'[3]1847-1949-3347-3581'!$C:$I,6,FALSE),\" \",VLOOKUP(D5,'[3]1847-1949-3347-3581'!$C:$I,7,FALSE)))),\"\",IF(D5=0,\"\",CONCATENATE(VLOOKUP(D5,'[3]1847-1949-3347-3581'!$C:$I,6,FALSE),\" \",VLOOKUP(D5,'[3]1847-1949-3347-3581'!$C:$I,7,FALSE))))","v":""},null,null,"0001/0003",{"$f":"IF(ISNA(IF(H5=0,\"\",CONCATENATE(VLOOKUP(H5,'[3]1847-1949-3347-3581'!$C:$I,6,FALSE),\" \",VLOOKUP(H5,'[3]1847-1949-3347-3581'!$C:$I,7,FALSE)))),\"\",IF(H5=0,\"\",CONCATENATE(VLOOKUP(H5,'[3]1847-1949-3347-3581'!$C:$I,6,FALSE),\" \",VLOOKUP(H5,'[3]1847-1949-3347-3581'!$C:$I,7,FALSE))))","v":"Travail général hors chantiers"},null,null,{"$f":"IF(K5=0,\"\",INDEX('[3]1847-1949-3347-3581'!$C$17:$C$14007,MATCH(K5,'[3]1847-1949-3347-3581'!$F$17:$F$14007,0)))","v":""},{"$f":"IF(ISNA(IF(L5=0,\"\",CONCATENATE(VLOOKUP(L5,'[3]1847-1949-3347-3581'!$C:$I,6,FALSE),\" \",VLOOKUP(L5,'[3]1847-1949-3347-3581'!$C:$I,7,FALSE)))),\"\",IF(L5=0,\"\",CONCATENATE(VLOOKUP(L5,'[3]1847-1949-3347-3581'!$C:$I,6,FALSE),\" \",VLOOKUP(L5,'[3]1847-1949-3347-3581'!$C:$I,7,FALSE))))","v":""},null,null,"0001/0040",{"$f":"IF(ISNA(IF(P5=0,\"\",CONCATENATE(VLOOKUP(P5,'[3]1847-1949-3347-3581'!$C:$I,6,FALSE),\" \",VLOOKUP(P5,'[3]1847-1949-3347-3581'!$C:$I,7,FALSE)))),\"\",IF(P5=0,\"\",CONCATENATE(VLOOKUP(P5,'[3]1847-1949-3347-3581'!$C:$I,6,FALSE),\" \",VLOOKUP(P5,'[3]1847-1949-3347-3581'!$C:$I,7,FALSE))))","v":"Visite médicale"}]
[null,null,null,{"$f":"IF(C6=0,\"\",INDEX('[3]1847-1949-3347-3581'!$C$17:$C$14007,MATCH(C6,'[3]1847-1949-3347-3581'!$F$17:$F$14007,0)))","v":""},{"$f":"IF(ISNA(IF(D6=0,\"\",CONCATENATE(VLOOKUP(D6,'[3]1847-1949-3347-3581'!$C:$I,6,FALSE),\" \",VLOOKUP(D6,'[3]1847-1949-3347-3581'!$C:$I,7,FALSE)))),\"\",IF(D6=0,\"\",CONCATENATE(VLOOKUP(D6,'[3]1847-1949-3347-3581'!$C:$I,6,FALSE),\" \",VLOOKUP(D6,'[3]1847-1949-3347-3581'!$C:$I,7,FALSE))))","v":""},null,null,{"$f":"IF(G6=0,\"\",INDEX('[3]1847-1949-3347-3581'!$C$17:$C$14007,MATCH(G6,'[3]1847-1949-3347-3581'!$F$17:$F$14007,0)))","v":""},{"$f":"IF(ISNA(IF(H6=0,\"\",CONCATENATE(VLOOKUP(H6,'[3]1847-1949-3347-3581'!$C:$I,6,FALSE),\" \",VLOOKUP(H6,'[3]1847-1949-3347-3581'!$C:$I,7,FALSE)))),\"\",IF(H6=0,\"\",CONCATENATE(VLOOKUP(H6,'[3]1847-1949-3347-3581'!$C:$I,6,FALSE),\" \",VLOOKUP(H6,'[3]1847-1949-3347-3581'!$C:$I,7,FALSE))))","v":""},null,null,{"$f":"IF(K6=0,\"\",INDEX('[3]1847-1949-3347-3581'!$C$17:$C$14007,MATCH(K6,'[3]1847-1949-3347-3581'!$F$17:$F$14007,0)))","v":""},{"$f":"IF(ISNA(IF(L6=0,\"\",CONCATENATE(VLOOKUP(L6,'[3]1847-1949-3347-3581'!$C:$I,6,FALSE),\" \",VLOOKUP(L6,'[3]1847-1949-3347-3581'!$C:$I,7,FALSE)))),\"\",IF(L6=0,\"\",CONCATENATE(VLOOKUP(L6,'[3]1847-1949-3347-3581'!$C:$I,6,FALSE),\" \",VLOOKUP(L6,'[3]1847-1949-3347-3581'!$C:$I,7,FALSE))))","v":""},null,null,{"$f":"IF(O6=0,\"\",INDEX('[3]1847-1949-3347-3581'!$C$17:$C$14007,MATCH(O6,'[3]1847-1949-3347-3581'!$F$17:$F$14007,0)))","v":""},"11h15"]
[null,null,null,{"$f":"IF(C7=0,\"\",INDEX('[3]1847-1949-3347-3581'!$C$17:$C$14007,MATCH(C7,'[3]1847-1949-3347-3581'!$F$17:$F$14007,0)))","v":""},{"$f":"IF(ISNA(IF(D7=0,\"\",CONCATENATE(VLOOKUP(D7,'[3]1847-1949-3347-3581'!$C:$I,6,FALSE),\" \",VLOOKUP(D7,'[3]1847-1949-3347-3581'!$C:$I,7,FALSE)))),\"\",IF(D7=0,\"\",CONCATENATE(VLOOKUP(D7,'[3]1847-1949-3347-3581'!$C:$I,6,FALSE),\" \",VLOOKUP(D7,'[3]1847-1949-3347-3581'!$C:$I,7,FALSE))))","v":""},null,null,{"$f":"IF(G7=0,\"\",INDEX('[3]1847-1949-3347-3581'!$C$17:$C$14007,MATCH(G7,'[3]1847-1949-3347-3581'!$F$17:$F$14007,0)))","v":""},{"$f":"IF(ISNA(IF(H7=0,\"\",CONCATENATE(VLOOKUP(H7,'[3]1847-1949-3347-3581'!$C:$I,6,FALSE),\" \",VLOOKUP(H7,'[3]1847-1949-3347-3581'!$C:$I,7,FALSE)))),\"\",IF(H7=0,\"\",CONCATENATE(VLOOKUP(H7,'[3]1847-1949-3347-3581'!$C:$I,6,FALSE),\" \",VLOOKUP(H7,'[3]1847-1949-3347-3581'!$C:$I,7,FALSE))))","v":""},null,null,{"$f":"IF(K7=0,\"\",INDEX('[3]1847-1949-3347-3581'!$C$17:$C$14007,MATCH(K7,'[3]1847-1949-3347-3581'!$F$17:$F$14007,0)))","v":""},{"$f":"IF(ISNA(IF(L7=0,\"\",CONCATENATE(VLOOKUP(L7,'[3]1847-1949-3347-3581'!$C:$I,6,FALSE),\" \",VLOOKUP(L7,'[3]1847-1949-3347-3581'!$C:$I,7,FALSE)))),\"\",IF(L7=0,\"\",CONCATENATE(VLOOKUP(L7,'[3]1847-1949-3347-3581'!$C:$I,6,FALSE),\" \",VLOOKUP(L7,'[3]1847-1949-3347-3581'!$C:$I,7,FALSE))))","v":""},null,null,{"$f":"IF(O7=0,\"\",INDEX('[3]1847-1949-3347-3581'!$C$17:$C$14007,MATCH(O7,'[3]1847-1949-3347-3581'!$F$17:$F$14007,0)))","v":""},{"$f":"IF(ISNA(IF(P7=0,\"\",CONCATENATE(VLOOKUP(P7,'[3]1847-1949-3347-3581'!$C:$I,6,FALSE),\" \",VLOOKUP(P7,'[3]1847-1949-3347-3581'!$C:$I,7,FALSE)))),\"\",IF(P7=0,\"\",CONCATENATE(VLOOKUP(P7,'[3]1847-1949-3347-3581'!$C:$I,6,FALSE),\" \",VLOOKUP(P7,'[3]1847-1949-3347-3581'!$C:$I,7,FALSE))))","v":""}]
["De Bodt Yves",null,null,{"$f":"IF(C8=0,\"\",INDEX('[3]1847-1949-3347-3581'!$C$17:$C$14007,MATCH(C8,'[3]1847-1949-3347-3581'!$F$17:$F$14007,0)))","v":""},{"$f":"IF(ISNA(IF(D8=0,\"\",CONCATENATE(VLOOKUP(D8,'[3]1847-1949-3347-3581'!$C:$I,6,FALSE),\" \",VLOOKUP(D8,'[3]1847-1949-3347-3581'!$C:$I,7,FALSE)))),\"\",IF(D8=0,\"\",CONCATENATE(VLOOKUP(D8,'[3]1847-1949-3347-3581'!$C:$I,6,FALSE),\" \",VLOOKUP(D8,'[3]1847-1949-3347-3581'!$C:$I,7,FALSE))))","v":""},null,"malade",{"$f":"IF(G8=0,\"\",INDEX('[3]1847-1949-3347-3581'!$C$17:$C$14007,MATCH(G8,'[3]1847-1949-3347-3581'!$F$17:$F$14007,0)))","v":{"$error":"#N/A"}},{"$f":"IF(ISNA(IF(H8=0,\"\",CONCATENATE(VLOOKUP(H8,'[3]1847-1949-3347-3581'!$C:$I,6,FALSE),\" \",VLOOKUP(H8,'[3]1847-1949-3347-3581'!$C:$I,7,FALSE)))),\"\",IF(H8=0,\"\",CONCATENATE(VLOOKUP(H8,'[3]1847-1949-3347-3581'!$C:$I,6,FALSE),\" \",VLOOKUP(H8,'[3]1847-1949-3347-3581'!$C:$I,7,FALSE))))","v":""},null,"malade",{"$f":"IF(K8=0,\"\",INDEX('[3]1847-1949-3347-3581'!$C$17:$C$14007,MATCH(K8,'[3]1847-1949-3347-3581'!$F$17:$F$14007,0)))","v":{"$error":"#N/A"}},{"$f":"IF(ISNA(IF(L8=0,\"\",CONCATENATE(VLOOKUP(L8,'[3]1847-1949-3347-3581'!$C:$I,6,FALSE),\" \",VLOOKUP(L8,'[3]1847-1949-3347-3581'!$C:$I,7,FALSE)))),\"\",IF(L8=0,\"\",CONCATENATE(VLOOKUP(L8,'[3]1847-1949-3347-3581'!$C:$I,6,FALSE),\" \",VLOOKUP(L8,'[3]1847-1949-3347-3581'!$C:$I,7,FALSE))))","v":""},null,"malade",{"$f":"IF(O8=0,\"\",INDEX('[3]1847-1949-3347-3581'!$C$17:$C$14007,MATCH(O8,'[3]1847-1949-3347-3581'!$F$17:$F$14007,0)))","v":{"$error":"#N/A"}},{"$f":"IF(ISNA(IF(P8=0,\"\",CONCATENATE(VLOOKUP(P8,'[3]1847-1949-3347-3581'!$C:$I,6,FALSE),\" \",VLOOKUP(P8,'[3]1847-1949-3347-3581'!$C:$I,7,FALSE)))),\"\",IF(P8=0,\"\",CONCATENATE(VLOOKUP(P8,'[3]1847-1949-3347-3581'!$C:$I,6,FALSE),\" \",VLOOKUP(P8,'[3]1847-1949-3347-3581'!$C:$I,7,FALSE))))","v":""}]
[null,null,null,{"$f":"IF(C9=0,\"\",INDEX('[3]1847-1949-3347-3581'!$C$17:$C$14007,MATCH(C9,'[3]1847-1949-3347-3581'!$F$17:$F$14007,0)))","v":""},{"$f":"IF(ISNA(IF(D9=0,\"\",CONCATENATE(VLOOKUP(D9,'[3]1847-1949-3347-3581'!$C:$I,6,FALSE),\" \",VLOOKUP(D9,'[3]1847-1949-3347-3581'!$C:$I,7,FALSE)))),\"\",IF(D9=0,\"\",CONCATENATE(VLOOKUP(D9,'[3]1847-1949-3347-3581'!$C:$I,6,FALSE),\" \",VLOOKUP(D9,'[3]1847-1949-3347-3581'!$C:$I,7,FALSE))))","v":""},null,null,{"$f":"IF(G9=0,\"\",INDEX('[3]1847-1949-3347-3581'!$C$17:$C$14007,MATCH(G9,'[3]1847-1949-3347-3581'!$F$17:$F$14007,0)))","v":""},{"$f":"IF(ISNA(IF(H9=0,\"\",CONCATENATE(VLOOKUP(H9,'[3]1847-1949-3347-3581'!$C:$I,6,FALSE),\" \",VLOOKUP(H9,'[3]1847-1949-3347-3581'!$C:$I,7,FALSE)))),\"\",IF(H9=0,\"\",CONCATENATE(VLOOKUP(H9,'[3]1847-1949-3347-3581'!$C:$I,6,FALSE),\" \",VLOOKUP(H9,'[3]1847-1949-3347-3581'!$C:$I,7,FALSE))))","v":""},null,null,{"$f":"IF(K9=0,\"\",INDEX('[3]1847-1949-3347-3581'!$C$17:$C$14007,MATCH(K9,'[3]1847-1949-3347-3581'!$F$17:$F$14007,0)))","v":""},{"$f":"IF(ISNA(IF(L9=0,\"\",CONCATENATE(VLOOKUP(L9,'[3]1847-1949-3347-3581'!$C:$I,6,FALSE),\" \",VLOOKUP(L9,'[3]1847-1949-3347-3581'!$C:$I,7,FALSE)))),\"\",IF(L9=0,\"\",CONCATENATE(VLOOKUP(L9,'[3]1847-1949-3347-3581'!$C:$I,6,FALSE),\" \",VLOOKUP(L9,'[3]1847-1949-3347-3581'!$C:$I,7,FALSE))))","v":""},null,null,{"$f":"IF(O9=0,\"\",INDEX('[3]1847-1949-3347-3581'!$C$17:$C$14007,MATCH(O9,'[3]1847-1949-3347-3581'!$F$17:$F$14007,0)))","v":""},{"$f":"IF(ISNA(IF(P9=0,\"\",CONCATENATE(VLOOKUP(P9,'[3]1847-1949-3347-3581'!$C:$I,6,FALSE),\" \",VLOOKUP(P9,'[3]1847-1949-3347-3581'!$C:$I,7,FALSE)))),\"\",IF(P9=0,\"\",CONCATENATE(VLOOKUP(P9,'[3]1847-1949-3347-3581'!$C:$I,6,FALSE),\" \",VLOOKUP(P9,'[3]1847-1949-3347-3581'!$C:$I,7,FALSE))))","v":""}]
[null,null,null,{"$f":"IF(C10=0,\"\",INDEX('[3]1847-1949-3347-3581'!$C$17:$C$14007,MATCH(C10,'[3]1847-1949-3347-3581'!$F$17:$F$14007,0)))","v":""},{"$f":"IF(ISNA(IF(D10=0,\"\",CONCATENATE(VLOOKUP(D10,'[3]1847-1949-3347-3581'!$C:$I,6,FALSE),\" \",VLOOKUP(D10,'[3]1847-1949-3347-3581'!$C:$I,7,FALSE)))),\"\",IF(D10=0,\"\",CONCATENATE(VLOOKUP(D10,'[3]1847-1949-3347-3581'!$C:$I,6,FALSE),\" \",VLOOKUP(D10,'[3]1847-1949-3347-3581'!$C:$I,7,FALSE))))","v":""},null,null,{"$f":"IF(G10=0,\"\",INDEX('[3]1847-1949-3347-3581'!$C$17:$C$14007,MATCH(G10,'[3]1847-1949-3347-3581'!$F$17:$F$14007,0)))","v":""},{"$f":"IF(ISNA(IF(H10=0,\"\",CONCATENATE(VLOOKUP(H10,'[3]1847-1949-3347-3581'!$C:$I,6,FALSE),\" \",VLOOKUP(H10,'[3]1847-1949-3347-3581'!$C:$I,7,FALSE)))),\"\",IF(H10=0,\"\",CONCATENATE(VLOOKUP(H10,'[3]1847-1949-3347-3581'!$C:$I,6,FALSE),\" \",VLOOKUP(H10,'[3]1847-1949-3347-3581'!$C:$I,7,FALSE))))","v":""},null,null,{"$f":"IF(K10=0,\"\",INDEX('[3]1847-1949-3347-3581'!$C$17:$C$14007,MATCH(K10,'[3]1847-1949-3347-3581'!$F$17:$F$14007,0)))","v":""},{"$f":"IF(ISNA(IF(L10=0,\"\",CONCATENATE(VLOOKUP(L10,'[3]1847-1949-3347-3581'!$C:$I,6,FALSE),\" \",VLOOKUP(L10,'[3]1847-1949-3347-3581'!$C:$I,7,FALSE)))),\"\",IF(L10=0,\"\",CONCATENATE(VLOOKUP(L10,'[3]1847-1949-3347-3581'!$C:$I,6,FALSE),\" \",VLOOKUP(L10,'[3]1847-1949-3347-3581'!$C:$I,7,FALSE))))","v":""},null,null,{"$f":"IF(O10=0,\"\",INDEX('[3]1847-1949-3347-3581'!$C$17:$C$14007,MATCH(O10,'[3]1847-1949-3347-3581'!$F$17:$F$14007,0)))","v":""},{"$f":"IF(ISNA(IF(P10=0,\"\",CONCATENATE(VLOOKUP(P10,'[3]1847-1949-3347-3581'!$C:$I,6,FALSE),\" \",VLOOKUP(P10,'[3]1847-1949-3347-3581'!$C:$I,7,FALSE)))),\"\",IF(P10=0,\"\",CONCATENATE(VLOOKUP(P10,'[3]1847-1949-3347-3581'!$C:$I,6,FALSE),\" \",VLOOKUP(P10,'[3]1847-1949-3347-3581'!$C:$I,7,FALSE))))","v":""}]
{"$rows_left_out":73}
{"sheet":"Data","index":2,"n_rows":25,"n_cols":4,"rows_kept":25,"cut":false,"hidden":false,"merged":[]}
["Prénoms",null,null,"Plaques"]
["Olivier B.",null,null,"1-HPD-336"]
["Yves",null,null,"1-YSQ-618"]
["Fonzy",null,null,"44-U-61"]
["Johnny",null,null,"1-NKK-964"]
["Jean-Pierre",null,null,"1-PLT-828"]
["Donato",null,null,"1-NKK-366"]
["Fabien",null,null,"2-BEP-553"]
["Hubert",null,null,"2-CMR-664"]
["Frédéric",null,null,"1-NNV-473"]
{"$rows_left_out":16}
{"sheet":"Congés","index":3,"n_rows":46,"n_cols":2,"rows_kept":46,"cut":false,"hidden":false,"merged":[]}
["2023-01-02","Congé"]
["2023-01-03","Congé"]
["2023-01-04","Congé"]
["2023-01-05","Congé"]
["2023-01-06","Congé"]
["2023-04-10","Congé"]
["2023-04-11","Congé"]
["2023-04-12","Congé"]
["2023-04-13","Congé"]
["2023-04-14","Congé"]
{"$rows_left_out":36}