{"text_format":"1","workbook":"xlsx","n_sheets":4,"sheets":["Résumé","Planning 2023","Data","Congés"],"not_rendered":{"charts":0,"images":0,"macros":1,"external_links":3,"defined_names":5,"comments":0,"pivot_tables":0},"unopened":[],"bounds":{"document_bytes":16777216,"sheet_cells":100000,"rows_first":2000,"rows_last":500,"rows_between":2000,"halvings":0,"cell_chars":16384,"cell_head_chars":4096},"cells_cut":0,"cells_raw":0,"read":"whole","date_system":"1900"}

{"sheet":"Résumé","index":0,"n_rows":65,"n_cols":12,"rows_kept":65,"cut":false,"hidden":false,"merged":[[1,3,2,3]]}
[null,null,null,"Date"]
[null,null,null,"2023-01-10"]
[]
[]
["Agents","Véhicule","Cronos","Chantier","Adresse",null,"Planning",{"$f":"D2","v":"2023-01-10"},null,null,null,"JACOPS"]
["Beaupain Olivier","1-PLT-828",364467,{"$f":"IF(C6=0,\"\",INDEX('[3]1847-1949-3347-3581'!$C$17:$C$14007,MATCH(C6,'[3]1847-1949-3347-3581'!$F$17:$F$14007,0)))","v":"1847/2423"},{"$f":"IF(ISNA(IF(D6=0,\"\",CONCATENATE(VLOOKUP(D6,'[3]1847-1949-3347-3581'!$C:$I,6,FALSE),\" \",VLOOKUP(D6,'[3]1847-1949-3347-3581'!$C:$I,7,FALSE)))),\"\",IF(D6=0,\"\",CONCATENATE(VLOOKUP(D6,'[3]1847-1949-3347-3581'!$C:$I,6,FALSE),\" \",VLOOKUP(D6,'[3]1847-1949-3347-3581'!$C:$I,7,FALSE))))","v":"Mouscron Rue du Marquis D'Ennetières"},null,"Equipes","Véhicules","Cronos","Chantier","Adresse","Remarques"]
[null,null,null,{"$f":"IF(C7=0,\"\",INDEX('[3]1847-1949-3347-3581'!$C$17:$C$14007,MATCH(C7,'[3]1847-1949-3347-3581'!$F$17:$F$14007,0)))","v":""},{"$f":"IF(ISNA(IF(D7=0,\"\",CONCATENATE(VLOOKUP(D7,'[3]1847-1949-3347-3581'!$C:$I,6,FALSE),\" \",VLOOKUP(D7,'[3]1847-1949-3347-3581'!$C:$I,7,FALSE)))),\"\",IF(D7=0,\"\",CONCATENATE(VLOOKUP(D7,'[3]1847-1949-3347-3581'!$C:$I,6,FALSE),\" \",VLOOKUP(D7,'[3]1847-1949-3347-3581'!$C:$I,7,FALSE))))","v":""},null,"Beaupain Olivier","1-PLT-828",364467,"1847/2423","Mouscron Rue du Marquis D'Ennetières"]
[null,null,null,{"$f":"IF(C8=0,\"\",INDEX('[3]1847-1949-3347-3581'!$C$17:$C$14007,MATCH(C8,'[3]1847-1949-3347-3581'!$F$17:$F$14007,0)))","v":""},{"$f":"IF(ISNA(IF(D8=0,\"\",CONCATENATE(VLOOKUP(D8,'[3]1847-1949-3347-3581'!$C:$I,6,FALSE),\" \",VLOOKUP(D8,'[3]1847-1949-3347-3581'!$C:$I,7,FALSE)))),\"\",IF(D8=0,\"\",CONCATENATE(VLOOKUP(D8,'[3]1847-1949-3347-3581'!$C:$I,6,FALSE),\" \",VLOOKUP(D8,'[3]1847-1949-3347-3581'!$C:$I,7,FALSE))))","v":""},null,"De Grande Johnny","1-NBV-134",364467,"1847/2423"]
[null,null,null,{"$f":"IF(C9=0,\"\",INDEX('[3]1847-1949-3347-3581'!$C$17:$C$14007,MATCH(C9,'[3]1847-1949-3347-3581'!$F$17:$F$14007,0)))","v":""},{"$f":"IF(ISNA(IF(D9=0,\"\",CONCATENATE(VLOOKUP(D9,'[3]1847-1949-3347-3581'!$C:$I,6,FALSE),\" \",VLOOKUP(D9,'[3]1847-1949-3347-3581'!$C:$I,7,FALSE)))),\"\",IF(D9=0,\"\",CONCATENATE(VLOOKUP(D9,'[3]1847-1949-3347-3581'!$C:$I,6,FALSE),\" \",VLOOKUP(D9,'[3]1847-1949-3347-3581'!$C:$I,7,FALSE))))","v":""},null,"De Bodt Yves",null,"malade",{"$error":"#N/A"}]
["De Bodt Yves",null,"malade",{"$f":"IF(C10=0,\"\",INDEX('[3]1847-1949-3347-3581'!$C$17:$C$14007,MATCH(C10,'[3]1847-1949-3347-3581'!$F$17:$F$14007,0)))","v":{"$error":"#N/A"}},{"$f":"IF(ISNA(IF(D10=0,\"\",CONCATENATE(VLOOKUP(D10,'[3]1847-1949-3347-3581'!$C:$I,6,FALSE),\" \",VLOOKUP(D10,'[3]1847-1949-3347-3581'!$C:$I,7,FALSE)))),\"\",IF(D10=0,\"\",CONCATENATE(VLOOKUP(D10,'[3]1847-1949-3347-3581'!$C:$I,6,FALSE),\" \",VLOOKUP(D10,'[3]1847-1949-3347-3581'!$C:$I,7,FALSE))))","v":""},null,"Verdy Geoffrey"]
[null,null,null,{"$f":"IF(C11=0,\"\",INDEX('[3]1847-1949-3347-3581'!$C$17:$C$14007,MATCH(C11,'[3]1847-1949-3347-3581'!$F$17:$F$14007,0)))","v":""},{"$f":"IF(ISNA(IF(D11=0,\"\",CONCATENATE(VLOOKUP(D11,'[3]1847-1949-3347-3581'!$C:$I,6,FALSE),\" \",VLOOKUP(D11,'[3]1847-1949-3347-3581'!$C:$I,7,FALSE)))),\"\",IF(D11=0,\"\",CONCATENATE(VLOOKUP(D11,'[3]1847-1949-3347-3581'!$C:$I,6,FALSE),\" \",VLOOKUP(D11,'[3]1847-1949-3347-3581'!$C:$I,7,FALSE))))","v":""},null,"Vincent Samuel",null,"absent",{"$error":"#N/A"}]
[null,null,null,{"$f":"IF(C12=0,\"\",INDEX('[3]1847-1949-3347-3581'!$C$17:$C$14007,MATCH(C12,'[3]1847-1949-3347-3581'!$F$17:$F$14007,0)))","v":""},{"$f":"IF(ISNA(IF(D12=0,\"\",CONCATENATE(VLOOKUP(D12,'[3]1847-1949-3347-3581'!$C:$I,6,FALSE),\" \",VLOOKUP(D12,'[3]1847-1949-3347-3581'!$C:$I,7,FALSE)))),\"\",IF(D12=0,\"\",CONCATENATE(VLOOKUP(D12,'[3]1847-1949-3347-3581'!$C:$I,6,FALSE),\" \",VLOOKUP(D12,'[3]1847-1949-3347-3581'!$C:$I,7,FALSE))))","v":""},null,"De Grande Fonzy",null,381616,"1847/2566","Kain  Val de la Résistance "]
[null,null,null,{"$f":"IF(C13=0,\"\",INDEX('[3]1847-1949-3347-3581'!$C$17:$C$14007,MATCH(C13,'[3]1847-1949-3347-3581'!$F$17:$F$14007,0)))","v":""},{"$f":"IF(ISNA(IF(D13=0,\"\",CONCATENATE(VLOOKUP(D13,'[3]1847-1949-3347-3581'!$C:$I,6,FALSE),\" \",VLOOKUP(D13,'[3]1847-1949-3347-3581'!$C:$I,7,FALSE)))),\"\",IF(D13=0,\"\",CONCATENATE(VLOOKUP(D13,'[3]1847-1949-3347-3581'!$C:$I,6,FALSE),\" \",VLOOKUP(D13,'[3]1847-1949-3347-3581'!$C:$I,7,FALSE))))","v":""},null,"Denutte Jean-Pierre",null,381616,"1847/2566"]
["De Grande Fonzy",null,381616,{"$f":"IF(C14=0,\"\",INDEX('[3]1847-1949-3347-3581'!$C$17:$C$14007,MATCH(C14,'[3]1847-1949-3347-3581'!$F$17:$F$14007,0)))","v":"1847/2566"},{"$f":"IF(ISNA(IF(D14=0,\"\",CONCATENATE(VLOOKUP(D14,'[3]1847-1949-3347-3581'!$C:$I,6,FALSE),\" \",VLOOKUP(D14,'[3]1847-1949-3347-3581'!$C:$I,7,FALSE)))),\"\",IF(D14=0,\"\",CONCATENATE(VLOOKUP(D14,'[3]1847-1949-3347-3581'!$C:$I,6,FALSE),\" \",VLOOKUP(D14,'[3]1847-1949-3347-3581'!$C:$I,7,FALSE))))","v":"Kain  Val de la Résistance "},null,"Desmet Donato","1-NBV-173",383515,"1847/2714","Bruyelle Chaussée de Tournai 39"]
[33,null,"EX_22_05199",{"$f":"IF(C15=0,\"\",INDEX('[3]1847-1949-3347-3581'!$C$17:$C$14007,MATCH(C15,'[3]1847-1949-3347-3581'!$F$17:$F$14007,0)))","v":"1847/2742"},{"$f":"IF(ISNA(IF(D15=0,\"\",CONCATENATE(VLOOKUP(D15,'[3]1847-1949-3347-3581'!$C:$I,6,FALSE),\" \",VLOOKUP(D15,'[3]1847-1949-3347-3581'!$C:$I,7,FALSE)))),\"\",IF(D15=0,\"\",CONCATENATE(VLOOKUP(D15,'[3]1847-1949-3347-3581'!$C:$I,6,FALSE),\" \",VLOOKUP(D15,'[3]1847-1949-3347-3581'!$C:$I,7,FALSE))))","v":"Velaines Rue Delvourgue - redresser poteau béton "},null,"François Frédéric","1-NTH-884",383515,"1847/2714"]
[null,null,null,{"$f":"IF(C16=0,\"\",INDEX('[3]1847-1949-3347-3581'!$C$17:$C$14007,MATCH(C16,'[3]1847-1949-3347-3581'!$F$17:$F$14007,0)))","v":""},{"$f":"IF(ISNA(IF(D16=0,\"\",CONCATENATE(VLOOKUP(D16,'[3]1847-1949-3347-3581'!$C:$I,6,FALSE),\" \",VLOOKUP(D16,'[3]1847-1949-3347-3581'!$C:$I,7,FALSE)))),\"\",IF(D16=0,\"\",CONCATENATE(VLOOKUP(D16,'[3]1847-1949-3347-3581'!$C:$I,6,FALSE),\" \",VLOOKUP(D16,'[3]1847-1949-3347-3581'!$C:$I,7,FALSE))))","v":""},null,"Lorenzato Jason","2-CMR-664",383515,"1847/2714"]
[null,null,null,{"$f":"IF(C17=0,\"\",INDEX('[3]1847-1949-3347-3581'!$C$17:$C$14007,MATCH(C17,'[3]1847-1949-3347-3581'!$F$17:$F$14007,0)))","v":""},{"$f":"IF(ISNA(IF(D17=0,\"\",CONCATENATE(VLOOKUP(D17,'[3]1847-1949-3347-3581'!$C:$I,6,FALSE),\" \",VLOOKUP(D17,'[3]1847-1949-3347-3581'!$C:$I,7,FALSE)))),\"\",IF(D17=0,\"\",CONCATENATE(VLOOKUP(D17,'[3]1847-1949-3347-3581'!$C:$I,6,FALSE),\" \",VLOOKUP(D17,'[3]1847-1949-3347-3581'!$C:$I,7,FALSE))))","v":""},null,"Mollet Michel","1-HPD-336",383515,"1847/2714"]
["De Grande Johnny","1-NBV-134",364467,{"$f":"IF(C18=0,\"\",INDEX('[3]1847-1949-3347-3581'!$C$17:$C$14007,MATCH(C18,'[3]1847-1949-3347-3581'!$F$17:$F$14007,0)))","v":"1847/2423"},{"$f":"IF(ISNA(IF(D18=0,\"\",CONCATENATE(VLOOKUP(D18,'[3]1847-1949-3347-3581'!$C:$I,6,FALSE),\" \",VLOOKUP(D18,'[3]1847-1949-3347-3581'!$C:$I,7,FALSE)))),\"\",IF(D18=0,\"\",CONCATENATE(VLOOKUP(D18,'[3]1847-1949-3347-3581'!$C:$I,6,FALSE),\" \",VLOOKUP(D18,'[3]1847-1949-3347-3581'!$C:$I,7,FALSE))))","v":"Mouscron Rue du Marquis D'Ennetières"},null,"Desse Fabien","2-CBN-005",null,"5418/0000","MONS Ores Compteurs"]
[null,null,null,{"$f":"IF(C19=0,\"\",INDEX('[3]1847-1949-3347-3581'!$C$17:$C$14007,MATCH(C19,'[3]1847-1949-3347-3581'!$F$17:$F$14007,0)))","v":""},{"$f":"IF(ISNA(IF(D19=0,\"\",CONCATENATE(VLOOKUP(D19,'[3]1847-1949-3347-3581'!$C:$I,6,FALSE),\" \",VLOOKUP(D19,'[3]1847-1949-3347-3581'!$C:$I,7,FALSE)))),\"\",IF(D19=0,\"\",CONCATENATE(VLOOKUP(D19,'[3]1847-1949-3347-3581'!$C:$I,6,FALSE),\" \",VLOOKUP(D19,'[3]1847-1949-3347-3581'!$C:$I,7,FALSE))))","v":""},null,"Duhaut Hubert","1-NKK-366",null,"5419/0000","WAPI Ores Compteurs"]
[null,null,null,{"$f":"IF(C20=0,\"\",INDEX('[3]1847-1949-3347-3581'!$C$17:$C$14007,MATCH(C20,'[3]1847-1949-3347-3581'!$F$17:$F$14007,0)))","v":""},{"$f":"IF(ISNA(IF(D20=0,\"\",CONCATENATE(VLOOKUP(D20,'[3]1847-1949-3347-3581'!$C:$I,6,FALSE),\" \",VLOOKUP(D20,'[3]1847-1949-3347-3581'!$C:$I,7,FALSE)))),\"\",IF(D20=0,\"\",CONCATENATE(VLOOKUP(D20,'[3]1847-1949-3347-3581'!$C:$I,6,FALSE),\" \",VLOOKUP(D20,'[3]1847-1949-3347-3581'!$C:$I,7,FALSE))))","v":""},null,"Vercleven Olivier","2-ARY-258",null,"5419/0000"]
[null,null,null,{"$f":"IF(C21=0,\"\",INDEX('[3]1847-1949-3347-3581'!$C$17:$C$14007,MATCH(C21,'[3]1847-1949-3347-3581'!$F$17:$F$14007,0)))","v":""},{"$f":"IF(ISNA(IF(D21=0,\"\",CONCATENATE(VLOOKUP(D21,'[3]1847-1949-3347-3581'!$C:$I,6,FALSE),\" \",VLOOKUP(D21,'[3]1847-1949-3347-3581'!$C:$I,7,FALSE)))),\"\",IF(D21=0,\"\",CONCATENATE(VLOOKUP(D21,'[3]1847-1949-3347-3581'!$C:$I,6,FALSE),\" \",VLOOKUP(D21,'[3]1847-1949-3347-3581'!$C:$I,7,FALSE))))","v":""},null,"Petruzzelli Michel",null,null,"0001/0003","Travail général hors chantiers"]
["Denutte Jean-Pierre",null,381616,{"$f":"IF(C22=0,\"\",INDEX('[3]1847-1949-3347-3581'!$C$17:$C$14007,MATCH(C22,'[3]1847-1949-3347-3581'!$F$17:$F$14007,0)))","v":"1847/2566"},{"$f":"IF(ISNA(IF(D22=0,\"\",CONCATENATE(VLOOKUP(D22,'[3]1847-1949-3347-3581'!$C:$I,6,FALSE),\" \",VLOOKUP(D22,'[3]1847-1949-3347-3581'!$C:$I,7,FALSE)))),\"\",IF(D22=0,\"\",CONCATENATE(VLOOKUP(D22,'[3]1847-1949-3347-3581'!$C:$I,6,FALSE),\" \",VLOOKUP(D22,'[3]1847-1949-3347-3581'!$C:$I,7,FALSE))))","v":"Kain  Val de la Résistance "}]
[479,null,"EX_22_05199",{"$f":"IF(C23=0,\"\",INDEX('[3]1847-1949-3347-3581'!$C$17:$C$14007,MATCH(C23,'[3]1847-1949-3347-3581'!$F$17:$F$14007,0)))","v":"1847/2742"},{"$f":"IF(ISNA(IF(D23=0,\"\",CONCATENATE(VLOOKUP(D23,'[3]1847-1949-3347-3581'!$C:$I,6,FALSE),\" \",VLOOKUP(D23,'[3]1847-1949-3347-3581'!$C:$I,7,FALSE)))),\"\",IF(D23=0,\"\",CONCATENATE(VLOOKUP(D23,'[3]1847-1949-3347-3581'!$C:$I,6,FALSE),\" \",VLOOKUP(D23,'[3]1847-1949-3347-3581'!$C:$I,7,FALSE))))","v":"Velaines Rue Delvourgue - redresser poteau béton "}]
[null,null,null,{"$f":"IF(C24=0,\"\",INDEX('[3]1847-1949-3347-3581'!$C$17:$C$14007,MATCH(C24,'[3]1847-1949-3347-3581'!$F$17:$F$14007,0)))","v":""},{"$f":"IF(ISNA(IF(D24=0,\"\",CONCATENATE(VLOOKUP(D24,'[3]1847-1949-3347-3581'!$C:$I,6,FALSE),\" \",VLOOKUP(D24,'[3]1847-1949-3347-3581'!$C:$I,7,FALSE)))),\"\",IF(D24=0,\"\",CONCATENATE(VLOOKUP(D24,'[3]1847-1949-3347-3581'!$C:$I,6,FALSE),\" \",VLOOKUP(D24,'[3]1847-1949-3347-3581'!$C:$I,7,FALSE))))","v":""}]
[null,null,null,{"$f":"IF(C25=0,\"\",INDEX('[3]1847-1949-3347-3581'!$C$17:$C$14007,MATCH(C25,'[3]1847-1949-3347-3581'!$F$17:$F$14007,0)))","v":""},{"$f":"IF(ISNA(IF(D25=0,\"\",CONCATENATE(VLOOKUP(D25,'[3]1847-1949-3347-3581'!$C:$I,6,FALSE),\" \",VLOOKUP(D25,'[3]1847-1949-3347-3581'!$C:$I,7,FALSE)))),\"\",IF(D25=0,\"\",CONCATENATE(VLOOKUP(D25,'[3]1847-1949-3347-3581'!$C:$I,6,FALSE),\" \",VLOOKUP(D25,'[3]1847-1949-3347-3581'!$C:$I,7,FALSE))))","v":""}]
["Desmet Donato","1-NBV-173",383515,{"$f":"IF(C26=0,\"\",INDEX('[3]1847-1949-3347-3581'!$C$17:$C$14007,MATCH(C26,'[3]1847-1949-3347-3581'!$F$17:$F$14007,0)))","v":"1847/2714"},{"$f":"IF(ISNA(IF(D26=0,\"\",CONCATENATE(VLOOKUP(D26,'[3]1847-1949-3347-3581'!$C:$I,6,FALSE),\" \",VLOOKUP(D26,'[3]1847-1949-3347-3581'!$C:$I,7,FALSE)))),\"\",IF(D26=0,\"\",CONCATENATE(VLOOKUP(D26,'[3]1847-1949-3347-3581'!$C:$I,6,FALSE),\" \",VLOOKUP(D26,'[3]1847-1949-3347-3581'!$C:$I,7,FALSE))))","v":"Bruyelle Chaussée de Tournai 39"}]
[9419,null,null,{"$f":"IF(C27=0,\"\",INDEX('[3]1847-1949-3347-3581'!$C$17:$C$14007,MATCH(C27,'[3]1847-1949-3347-3581'!$F$17:$F$14007,0)))","v":""},{"$f":"IF(ISNA(IF(D27=0,\"\",CONCATENATE(VLOOKUP(D27,'[3]1847-1949-3347-3581'!$C:$I,6,FALSE),\" \",VLOOKUP(D27,'[3]1847-1949-3347-3581'!$C:$I,7,FALSE)))),\"\",IF(D27=0,\"\",CONCATENATE(VLOOKUP(D27,'[3]1847-1949-3347-3581'!$C:$I,6,FALSE),\" \",VLOOKUP(D27,'[3]1847-1949-3347-3581'!$C:$I,7,FALSE))))","v":""}]
[null,null,null,{"$f":"IF(C28=0,\"\",INDEX('[3]1847-1949-3347-3581'!$C$17:$C$14007,MATCH(C28,'[3]1847-1949-3347-3581'!$F$17:$F$14007,0)))","v":""},{"$f":"IF(ISNA(IF(D28=0,\"\",CONCATENATE(VLOOKUP(D28,'[3]1847-1949-3347-3581'!$C:$I,6,FALSE),\" \",VLOOKUP(D28,'[3]1847-1949-3347-3581'!$C:$I,7,FALSE)))),\"\",IF(D28=0,\"\",CONCATENATE(VLOOKUP(D28,'[3]1847-1949-3347-3581'!$C:$I,6,FALSE),\" \",VLOOKUP(D28,'[3]1847-1949-3347-3581'!$C:$I,7,FALSE))))","v":""}]
[null,null,null,{"$f":"IF(C29=0,\"\",INDEX('[3]1847-1949-3347-3581'!$C$17:$C$14007,MATCH(C29,'[3]1847-1949-3347-3581'!$F$17:$F$14007,0)))","v":""},{"$f":"IF(ISNA(IF(D29=0,\"\",CONCATENATE(VLOOKUP(D29,'[3]1847-1949-3347-3581'!$C:$I,6,FALSE),\" \",VLOOKUP(D29,'[3]1847-1949-3347-3581'!$C:$I,7,FALSE)))),\"\",IF(D29=0,\"\",CONCATENATE(VLOOKUP(D29,'[3]1847-1949-3347-3581'!$C:$I,6,FALSE),\" \",VLOOKUP(D29,'[3]1847-1949-3347-3581'!$C:$I,7,FALSE))))","v":""}]
["Desse Fabien","2-CBN-005",null,"5418/0000",{"$f":"IF(ISNA(IF(D30=0,\"\",CONCATENATE(VLOOKUP(D30,'[3]1847-1949-3347-3581'!$C:$I,6,FALSE),\" \",VLOOKUP(D30,'[3]1847-1949-3347-3581'!$C:$I,7,FALSE)))),\"\",IF(D30=0,\"\",CONCATENATE(VLOOKUP(D30,'[3]1847-1949-3347-3581'!$C:$I,6,FALSE),\" \",VLOOKUP(D30,'[3]1847-1949-3347-3581'!$C:$I,7,FALSE))))","v":"MONS Ores Compteurs"}]
[9215,null,null,{"$f":"IF(C31=0,\"\",INDEX('[3]1847-1949-3347-3581'!$C$17:$C$14007,MATCH(C31,'[3]1847-1949-3347-3581'!$F$17:$F$14007,0)))","v":""},{"$f":"IF(ISNA(IF(D31=0,\"\",CONCATENATE(VLOOKUP(D31,'[3]1847-1949-3347-3581'!$C:$I,6,FALSE),\" \",VLOOKUP(D31,'[3]1847-1949-3347-3581'!$C:$I,7,FALSE)))),\"\",IF(D31=0,\"\",CONCATENATE(VLOOKUP(D31,'[3]1847-1949-3347-3581'!$C:$I,6,FALSE),\" \",VLOOKUP(D31,'[3]1847-1949-3347-3581'!$C:$I,7,FALSE))))","v":""}]
[null,null,null,{"$f":"IF(C32=0,\"\",INDEX('[3]1847-1949-3347-3581'!$C$17:$C$14007,MATCH(C32,'[3]1847-1949-3347-3581'!$F$17:$F$14007,0)))","v":""},{"$f":"IF(ISNA(IF(D32=0,\"\",CONCATENATE(VLOOKUP(D32,'[3]1847-1949-3347-3581'!$C:$I,6,FALSE),\" \",VLOOKUP(D32,'[3]1847-1949-3347-3581'!$C:$I,7,FALSE)))),\"\",IF(D32=0,\"\",CONCATENATE(VLOOKUP(D32,'[3]1847-1949-3347-3581'!$C:$I,6,FALSE),\" \",VLOOKUP(D32,'[3]1847-1949-3347-3581'!$C:$I,7,FALSE))))","v":""}]
[null,null,null,{"$f":"IF(C33=0,\"\",INDEX('[3]1847-1949-3347-3581'!$C$17:$C$14007,MATCH(C33,'[3]1847-1949-3347-3581'!$F$17:$F$14007,0)))","v":""},{"$f":"IF(ISNA(IF(D33=0,\"\",CONCATENATE(VLOOKUP(D33,'[3]1847-1949-3347-3581'!$C:$I,6,FALSE),\" \",VLOOKUP(D33,'[3]1847-1949-3347-3581'!$C:$I,7,FALSE)))),\"\",IF(D33=0,\"\",CONCATENATE(VLOOKUP(D33,'[3]1847-1949-3347-3581'!$C:$I,6,FALSE),\" \",VLOOKUP(D33,'[3]1847-1949-3347-3581'!$C:$I,7,FALSE))))","v":""}]
["Duhaut Hubert","1-NKK-366",null,"5419/0000",{"$f":"IF(ISNA(IF(D34=0,\"\",CONCATENATE(VLOOKUP(D34,'[3]1847-1949-3347-3581'!$C:$I,6,FALSE),\" \",VLOOKUP(D34,'[3]1847-1949-3347-3581'!$C:$I,7,FALSE)))),\"\",IF(D34=0,\"\",CONCATENATE(VLOOKUP(D34,'[3]1847-1949-3347-3581'!$C:$I,6,FALSE),\" \",VLOOKUP(D34,'[3]1847-1949-3347-3581'!$C:$I,7,FALSE))))","v":"WAPI Ores Compteurs"}]
[null,null,null,{"$f":"IF(C35=0,\"\",INDEX('[3]1847-1949-3347-3581'!$C$17:$C$14007,MATCH(C35,'[3]1847-1949-3347-3581'!$F$17:$F$14007,0)))","v":""},{"$f":"IF(ISNA(IF(D35=0,\"\",CONCATENATE(VLOOKUP(D35,'[3]1847-1949-3347-3581'!$C:$I,6,FALSE),\" \",VLOOKUP(D35,'[3]1847-1949-3347-3581'!$C:$I,7,FALSE)))),\"\",IF(D35=0,\"\",CONCATENATE(VLOOKUP(D35,'[3]1847-1949-3347-3581'!$C:$I,6,FALSE),\" \",VLOOKUP(D35,'[3]1847-1949-3347-3581'!$C:$I,7,FALSE))))","v":""}]
[null,null,null,{"$f":"IF(C36=0,\"\",INDEX('[3]1847-1949-3347-3581'!$C$17:$C$14007,MATCH(C36,'[3]1847-1949-3347-3581'!$F$17:$F$14007,0)))","v":""},{"$f":"IF(ISNA(IF(D36=0,\"\",CONCATENATE(VLOOKUP(D36,'[3]1847-1949-3347-3581'!$C:$I,6,FALSE),\" \",VLOOKUP(D36,'[3]1847-1949-3347-3581'!$C:$I,7,FALSE)))),\"\",IF(D36=0,\"\",CONCATENATE(VLOOKUP(D36,'[3]1847-1949-3347-3581'!$C:$I,6,FALSE),\" \",VLOOKUP(D36,'[3]1847-1949-3347-3581'!$C:$I,7,FALSE))))","v":""}]
[null,null,null,{"$f":"IF(C37=0,\"\",INDEX('[3]1847-1949-3347-3581'!$C$17:$C$14007,MATCH(C37,'[3]1847-1949-3347-3581'!$F$17:$F$14007,0)))","v":""},{"$f":"IF(ISNA(IF(D37=0,\"\",CONCATENATE(VLOOKUP(D37,'[3]1847-1949-3347-3581'!$C:$I,6,FALSE),\" \",VLOOKUP(D37,'[3]1847-1949-3347-3581'!$C:$I,7,FALSE)))),\"\",IF(D37=0,\"\",CONCATENATE(VLOOKUP(D37,'[3]1847-1949-3347-3581'!$C:$I,6,FALSE),\" \",VLOOKUP(D37,'[3]1847-1949-3347-3581'!$C:$I,7,FALSE))))","v":""}]
["François Frédéric","1-NTH-884",383515,{"$f":"IF(C38=0,\"\",INDEX('[3]1847-1949-3347-3581'!$C$17:$C$14007,MATCH(C38,'[3]1847-1949-3347-3581'!$F$17:$F$14007,0)))","v":"1847/2714"},{"$f":"IF(ISNA(IF(D38=0,\"\",CONCATENATE(VLOOKUP(D38,'[3]1847-1949-3347-3581'!$C:$I,6,FALSE),\" \",VLOOKUP(D38,'[3]1847-1949-3347-3581'!$C:$I,7,FALSE)))),\"\",IF(D38=0,\"\",CONCATENATE(VLOOKUP(D38,'[3]1847-1949-3347-3581'!$C:$I,6,FALSE),\" \",VLOOKUP(D38,'[3]1847-1949-3347-3581'!$C:$I,7,FALSE))))","v":"Bruyelle Chaussée de Tournai 39"}]
[10330,null,null,{"$f":"IF(C39=0,\"\",INDEX('[3]1847-1949-3347-3581'!$C$17:$C$14007,MATCH(C39,'[3]1847-1949-3347-3581'!$F$17:$F$14007,0)))","v":""},{"$f":"IF(ISNA(IF(D39=0,\"\",CONCATENATE(VLOOKUP(D39,'[3]1847-1949-3347-3581'!$C:$I,6,FALSE),\" \",VLOOKUP(D39,'[3]1847-1949-3347-3581'!$C:$I,7,FALSE)))),\"\",IF(D39=0,\"\",CONCATENATE(VLOOKUP(D39,'[3]1847-1949-3347-3581'!$C:$I,6,FALSE),\" \",VLOOKUP(D39,'[3]1847-1949-3347-3581'!$C:$I,7,FALSE))))","v":""}]
[null,null,null,{"$f":"IF(C40=0,\"\",INDEX('[3]1847-1949-3347-3581'!$C$17:$C$14007,MATCH(C40,'[3]1847-1949-3347-3581'!$F$17:$F$14007,0)))","v":""},{"$f":"IF(ISNA(IF(D40=0,\"\",CONCATENATE(VLOOKUP(D40,'[3]1847-1949-3347-3581'!$C:$I,6,FALSE),\" \",VLOOKUP(D40,'[3]1847-1949-3347-3581'!$C:$I,7,FALSE)))),\"\",IF(D40=0,\"\",CONCATENATE(VLOOKUP(D40,'[3]1847-1949-3347-3581'!$C:$I,6,FALSE),\" \",VLOOKUP(D40,'[3]1847-1949-3347-3581'!$C:$I,7,FALSE))))","v":""}]
[null,null,null,{"$f":"IF(C41=0,\"\",INDEX('[3]1847-1949-3347-3581'!$C$17:$C$14007,MATCH(C41,'[3]1847-1949-3347-3581'!$F$17:$F$14007,0)))","v":""},{"$f":"IF(ISNA(IF(D41=0,\"\",CONCATENATE(VLOOKUP(D41,'[3]1847-1949-3347-3581'!$C:$I,6,FALSE),\" \",VLOOKUP(D41,'[3]1847-1949-3347-3581'!$C:$I,7,FALSE)))),\"\",IF(D41=0,\"\",CONCATENATE(VLOOKUP(D41,'[3]1847-1949-3347-3581'!$C:$I,6,FALSE),\" \",VLOOKUP(D41,'[3]1847-1949-3347-3581'!$C:$I,7,FALSE))))","v":""}]
["Lorenzato Jason","2-CMR-664",383515,{"$f":"IF(C42=0,\"\",INDEX('[3]1847-1949-3347-3581'!$C$17:$C$14007,MATCH(C42,'[3]1847-1949-3347-3581'!$F$17:$F$14007,0)))","v":"1847/2714"},{"$f":"IF(ISNA(IF(D42=0,\"\",CONCATENATE(VLOOKUP(D42,'[3]1847-1949-3347-3581'!$C:$I,6,FALSE),\" \",VLOOKUP(D42,'[3]1847-1949-3347-3581'!$C:$I,7,FALSE)))),\"\",IF(D42=0,\"\",CONCATENATE(VLOOKUP(D42,'[3]1847-1949-3347-3581'!$C:$I,6,FALSE),\" \",VLOOKUP(D42,'[3]1847-1949-3347-3581'!$C:$I,7,FALSE))))","v":"Bruyelle Chaussée de Tournai 39"}]
[null,null,null,{"$f":"IF(C43=0,\"\",INDEX('[3]1847-1949-3347-3581'!$C$17:$C$14007,MATCH(C43,'[3]1847-1949-3347-3581'!$F$17:$F$14007,0)))","v":""},{"$f":"IF(ISNA(IF(D43=0,\"\",CONCATENATE(VLOOKUP(D43,'[3]1847-1949-3347-3581'!$C:$I,6,FALSE),\" \",VLOOKUP(D43,'[3]1847-1949-3347-3581'!$C:$I,7,FALSE)))),\"\",IF(D43=0,\"\",CONCATENATE(VLOOKUP(D43,'[3]1847-1949-3347-3581'!$C:$I,6,FALSE),\" \",VLOOKUP(D43,'[3]1847-1949-3347-3581'!$C:$I,7,FALSE))))","v":""}]
[null,null,null,{"$f":"IF(C44=0,\"\",INDEX('[3]1847-1949-3347-3581'!$C$17:$C$14007,MATCH(C44,'[3]1847-1949-3347-3581'!$F$17:$F$14007,0)))","v":""},{"$f":"IF(ISNA(IF(D44=0,\"\",CONCATENATE(VLOOKUP(D44,'[3]1847-1949-3347-3581'!$C:$I,6,FALSE),\" \",VLOOKUP(D44,'[3]1847-1949-3347-3581'!$C:$I,7,FALSE)))),\"\",IF(D44=0,\"\",CONCATENATE(VLOOKUP(D44,'[3]1847-1949-3347-3581'!$C:$I,6,FALSE),\" \",VLOOKUP(D44,'[3]1847-1949-3347-3581'!$C:$I,7,FALSE))))","v":""}]
[null,null,null,{"$f":"IF(C45=0,\"\",INDEX('[3]1847-1949-3347-3581'!$C$17:$C$14007,MATCH(C45,'[3]1847-1949-3347-3581'!$F$17:$F$14007,0)))","v":""},{"$f":"IF(ISNA(IF(D45=0,\"\",CONCATENATE(VLOOKUP(D45,'[3]1847-1949-3347-3581'!$C:$I,6,FALSE),\" \",VLOOKUP(D45,'[3]1847-1949-3347-3581'!$C:$I,7,FALSE)))),\"\",IF(D45=0,\"\",CONCATENATE(VLOOKUP(D45,'[3]1847-1949-3347-3581'!$C:$I,6,FALSE),\" \",VLOOKUP(D45,'[3]1847-1949-3347-3581'!$C:$I,7,FALSE))))","v":""}]
["Mollet Michel","1-HPD-336",383515,{"$f":"IF(C46=0,\"\",INDEX('[3]1847-1949-3347-3581'!$C$17:$C$14007,MATCH(C46,'[3]1847-1949-3347-3581'!$F$17:$F$14007,0)))","v":"1847/2714"},{"$f":"IF(ISNA(IF(D46=0,\"\",CONCATENATE(VLOOKUP(D46,'[3]1847-1949-3347-3581'!$C:$I,6,FALSE),\" \",VLOOKUP(D46,'[3]1847-1949-3347-3581'!$C:$I,7,FALSE)))),\"\",IF(D46=0,\"\",CONCATENATE(VLOOKUP(D46,'[3]1847-1949-3347-3581'!$C:$I,6,FALSE),\" \",VLOOKUP(D46,'[3]1847-1949-3347-3581'!$C:$I,7,FALSE))))","v":"Bruyelle Chaussée de Tournai 39"}]
[53,null,null,{"$f":"IF(C47=0,\"\",INDEX('[3]1847-1949-3347-3581'!$C$17:$C$14007,MATCH(C47,'[3]1847-1949-3347-3581'!$F$17:$F$14007,0)))","v":""},{"$f":"IF(ISNA(IF(D47=0,\"\",CONCATENATE(VLOOKUP(D47,'[3]1847-1949-3347-3581'!$C:$I,6,FALSE),\" \",VLOOKUP(D47,'[3]1847-1949-3347-3581'!$C:$I,7,FALSE)))),\"\",IF(D47=0,\"\",CONCATENATE(VLOOKUP(D47,'[3]1847-1949-3347-3581'!$C:$I,6,FALSE),\" \",VLOOKUP(D47,'[3]1847-1949-3347-3581'!$C:$I,7,FALSE))))","v":""}]
[null,null,null,{"$f":"IF(C48=0,\"\",INDEX('[3]1847-1949-3347-3581'!$C$17:$C$14007,MATCH(C48,'[3]1847-1949-3347-3581'!$F$17:$F$14007,0)))","v":""},{"$f":"IF(ISNA(IF(D48=0,\"\",CONCATENATE(VLOOKUP(D48,'[3]1847-1949-3347-3581'!$C:$I,6,FALSE),\" \",VLOOKUP(D48,'[3]1847-1949-3347-3581'!$C:$I,7,FALSE)))),\"\",IF(D48=0,\"\",CONCATENATE(VLOOKUP(D48,'[3]1847-1949-3347-3581'!$C:$I,6,FALSE),\" \",VLOOKUP(D48,'[3]1847-1949-3347-3581'!$C:$I,7,FALSE))))","v":""}]
[null,null,null,{"$f":"IF(C49=0,\"\",INDEX('[3]1847-1949-3347-3581'!$C$17:$C$14007,MATCH(C49,'[3]1847-1949-3347-3581'!$F$17:$F$14007,0)))","v":""},{"$f":"IF(ISNA(IF(D49=0,\"\",CONCATENATE(VLOOKUP(D49,'[3]1847-1949-3347-3581'!$C:$I,6,FALSE),\" \",VLOOKUP(D49,'[3]1847-1949-3347-3581'!$C:$I,7,FALSE)))),\"\",IF(D49=0,\"\",CONCATENATE(VLOOKUP(D49,'[3]1847-1949-3347-3581'!$C:$I,6,FALSE),\" \",VLOOKUP(D49,'[3]1847-1949-3347-3581'!$C:$I,7,FALSE))))","v":""}]
["Petruzzelli Michel",null,null,"0001/0003",{"$f":"IF(ISNA(IF(D50=0,\"\",CONCATENATE(VLOOKUP(D50,'[3]1847-1949-3347-3581'!$C:$I,6,FALSE),\" \",VLOOKUP(D50,'[3]1847-1949-3347-3581'!$C:$I,7,FALSE)))),\"\",IF(D50=0,\"\",CONCATENATE(VLOOKUP(D50,'[3]1847-1949-3347-3581'!$C:$I,6,FALSE),\" \",VLOOKUP(D50,'[3]1847-1949-3347-3581'!$C:$I,7,FALSE))))","v":"Travail général hors chantiers"}]
[null,null,null,{"$f":"IF(C51=0,\"\",INDEX('[3]1847-1949-3347-3581'!$C$17:$C$14007,MATCH(C51,'[3]1847-1949-3347-3581'!$F$17:$F$14007,0)))","v":""},{"$f":"IF(ISNA(IF(D51=0,\"\",CONCATENATE(VLOOKUP(D51,'[3]1847-1949-3347-3581'!$C:$I,6,FALSE),\" \",VLOOKUP(D51,'[3]1847-1949-3347-3581'!$C:$I,7,FALSE)))),\"\",IF(D51=0,\"\",CONCATENATE(VLOOKUP(D51,'[3]1847-1949-3347-3581'!$C:$I,6,FALSE),\" \",VLOOKUP(D51,'[3]1847-1949-3347-3581'!$C:$I,7,FALSE))))","v":""}]
[null,null,null,{"$f":"IF(C52=0,\"\",INDEX('[3]1847-1949-3347-3581'!$C$17:$C$14007,MATCH(C52,'[3]1847-1949-3347-3581'!$F$17:$F$14007,0)))","v":""},{"$f":"IF(ISNA(IF(D52=0,\"\",CONCATENATE(VLOOKUP(D52,'[3]1847-1949-3347-3581'!$C:$I,6,FALSE),\" \",VLOOKUP(D52,'[3]1847-1949-3347-3581'!$C:$I,7,FALSE)))),\"\",IF(D52=0,\"\",CONCATENATE(VLOOKUP(D52,'[3]1847-1949-3347-3581'!$C:$I,6,FALSE),\" \",VLOOKUP(D52,'[3]1847-1949-3347-3581'!$C:$I,7,FALSE))))","v":""}]
[null,null,null,{"$f":"IF(C53=0,\"\",INDEX('[3]1847-1949-3347-3581'!$C$17:$C$14007,MATCH(C53,'[3]1847-1949-3347-3581'!$F$17:$F$14007,0)))","v":""},{"$f":"IF(ISNA(IF(D53=0,\"\",CONCATENATE(VLOOKUP(D53,'[3]1847-1949-3347-3581'!$C:$I,6,FALSE),\" \",VLOOKUP(D53,'[3]1847-1949-3347-3581'!$C:$I,7,FALSE)))),\"\",IF(D53=0,\"\",CONCATENATE(VLOOKUP(D53,'[3]1847-1949-3347-3581'!$C:$I,6,FALSE),\" \",VLOOKUP(D53,'[3]1847-1949-3347-3581'!$C:$I,7,FALSE))))","v":""}]
["Vercleven Olivier","2-ARY-258",null,"5419/0000",{"$f":"IF(ISNA(IF(D54=0,\"\",CONCATENATE(VLOOKUP(D54,'[3]1847-1949-3347-3581'!$C:$I,6,FALSE),\" \",VLOOKUP(D54,'[3]1847-1949-3347-3581'!$C:$I,7,FALSE)))),\"\",IF(D54=0,\"\",CONCATENATE(VLOOKUP(D54,'[3]1847-1949-3347-3581'!$C:$I,6,FALSE),\" \",VLOOKUP(D54,'[3]1847-1949-3347-3581'!$C:$I,7,FALSE))))","v":"WAPI Ores Compteurs"}]
[null,null,null,{"$f":"IF(C55=0,\"\",INDEX('[3]1847-1949-3347-3581'!$C$17:$C$14007,MATCH(C55,'[3]1847-1949-3347-3581'!$F$17:$F$14007,0)))","v":""},{"$f":"IF(ISNA(IF(D55=0,\"\",CONCATENATE(VLOOKUP(D55,'[3]1847-1949-3347-3581'!$C:$I,6,FALSE),\" \",VLOOKUP(D55,'[3]1847-1949-3347-3581'!$C:$I,7,FALSE)))),\"\",IF(D55=0,\"\",CONCATENATE(VLOOKUP(D55,'[3]1847-1949-3347-3581'!$C:$I,6,FALSE),\" \",VLOOKUP(D55,'[3]1847-1949-3347-3581'!$C:$I,7,FALSE))))","v":""}]
[null,null,null,{"$f":"IF(C56=0,\"\",INDEX('[3]1847-1949-3347-3581'!$C$17:$C$14007,MATCH(C56,'[3]1847-1949-3347-3581'!$F$17:$F$14007,0)))","v":""},{"$f":"IF(ISNA(IF(D56=0,\"\",CONCATENATE(VLOOKUP(D56,'[3]1847-1949-3347-3581'!$C:$I,6,FALSE),\" \",VLOOKUP(D56,'[3]1847-1949-3347-3581'!$C:$I,7,FALSE)))),\"\",IF(D56=0,\"\",CONCATENATE(VLOOKUP(D56,'[3]1847-1949-3347-3581'!$C:$I,6,FALSE),\" \",VLOOKUP(D56,'[3]1847-1949-3347-3581'!$C:$I,7,FALSE))))","v":""}]
[null,null,null,{"$f":"IF(C57=0,\"\",INDEX('[3]1847-1949-3347-3581'!$C$17:$C$14007,MATCH(C57,'[3]1847-1949-3347-3581'!$F$17:$F$14007,0)))","v":""},{"$f":"IF(ISNA(IF(D57=0,\"\",CONCATENATE(VLOOKUP(D57,'[3]1847-1949-3347-3581'!$C:$I,6,FALSE),\" \",VLOOKUP(D57,'[3]1847-1949-3347-3581'!$C:$I,7,FALSE)))),\"\",IF(D57=0,\"\",CONCATENATE(VLOOKUP(D57,'[3]1847-1949-3347-3581'!$C:$I,6,FALSE),\" \",VLOOKUP(D57,'[3]1847-1949-3347-3581'!$C:$I,7,FALSE))))","v":""}]
["Verdy Geoffrey",null,null,{"$f":"IF(C58=0,\"\",INDEX('[3]1847-1949-3347-3581'!$C$17:$C$14007,MATCH(C58,'[3]1847-1949-3347-3581'!$F$17:$F$14007,0)))","v":""},{"$f":"IF(ISNA(IF(D58=0,\"\",CONCATENATE(VLOOKUP(D58,'[3]1847-1949-3347-3581'!$C:$I,6,FALSE),\" \",VLOOKUP(D58,'[3]1847-1949-3347-3581'!$C:$I,7,FALSE)))),\"\",IF(D58=0,\"\",CONCATENATE(VLOOKUP(D58,'[3]1847-1949-3347-3581'!$C:$I,6,FALSE),\" \",VLOOKUP(D58,'[3]1847-1949-3347-3581'!$C:$I,7,FALSE))))","v":""}]
[10615,null,null,{"$f":"IF(C59=0,\"\",INDEX('[3]1847-1949-3347-3581'!$C$17:$C$14007,MATCH(C59,'[3]1847-1949-3347-3581'!$F$17:$F$14007,0)))","v":""},{"$f":"IF(ISNA(IF(D59=0,\"\",CONCATENATE(VLOOKUP(D59,'[3]1847-1949-3347-3581'!$C:$I,6,FALSE),\" \",VLOOKUP(D59,'[3]1847-1949-3347-3581'!$C:$I,7,FALSE)))),\"\",IF(D59=0,\"\",CONCATENATE(VLOOKUP(D59,'[3]1847-1949-3347-3581'!$C:$I,6,FALSE),\" \",VLOOKUP(D59,'[3]1847-1949-3347-3581'!$C:$I,7,FALSE))))","v":""}]
[null,null,null,{"$f":"IF(C60=0,\"\",INDEX('[3]1847-1949-3347-3581'!$C$17:$C$14007,MATCH(C60,'[3]1847-1949-3347-3581'!$F$17:$F$14007,0)))","v":""},{"$f":"IF(ISNA(IF(D60=0,\"\",CONCATENATE(VLOOKUP(D60,'[3]1847-1949-3347-3581'!$C:$I,6,FALSE),\" \",VLOOKUP(D60,'[3]1847-1949-3347-3581'!$C:$I,7,FALSE)))),\"\",IF(D60=0,\"\",CONCATENATE(VLOOKUP(D60,'[3]1847-1949-3347-3581'!$C:$I,6,FALSE),\" \",VLOOKUP(D60,'[3]1847-1949-3347-3581'!$C:$I,7,FALSE))))","v":""}]
[null,null,null,{"$f":"IF(C61=0,\"\",INDEX('[3]1847-1949-3347-3581'!$C$17:$C$14007,MATCH(C61,'[3]1847-1949-3347-3581'!$F$17:$F$14007,0)))","v":""},{"$f":"IF(ISNA(IF(D61=0,\"\",CONCATENATE(VLOOKUP(D61,'[3]1847-1949-3347-3581'!$C:$I,6,FALSE),\" \",VLOOKUP(D61,'[3]1847-1949-3347-3581'!$C:$I,7,FALSE)))),\"\",IF(D61=0,\"\",CONCATENATE(VLOOKUP(D61,'[3]1847-1949-3347-3581'!$C:$I,6,FALSE),\" \",VLOOKUP(D61,'[3]1847-1949-3347-3581'!$C:$I,7,FALSE))))","v":""}]
["Vincent Samuel",null,"absent",{"$f":"IF(C62=0,\"\",INDEX('[3]1847-1949-3347-3581'!$C$17:$C$14007,MATCH(C62,'[3]1847-1949-3347-3581'!$F$17:$F$14007,0)))","v":{"$error":"#N/A"}},{"$f":"IF(ISNA(IF(D62=0,\"\",CONCATENATE(VLOOKUP(D62,'[3]1847-1949-3347-3581'!$C:$I,6,FALSE),\" \",VLOOKUP(D62,'[3]1847-1949-3347-3581'!$C:$I,7,FALSE)))),\"\",IF(D62=0,\"\",CONCATENATE(VLOOKUP(D62,'[3]1847-1949-3347-3581'!$C:$I,6,FALSE),\" \",VLOOKUP(D62,'[3]1847-1949-3347-3581'!$C:$I,7,FALSE))))","v":""}]
[9349,null,null,{"$f":"IF(C63=0,\"\",INDEX('[3]1847-1949-3347-3581'!$C$17:$C$14007,MATCH(C63,'[3]1847-1949-3347-3581'!$F$17:$F$14007,0)))","v":""},{"$f":"IF(ISNA(IF(D63=0,\"\",CONCATENATE(VLOOKUP(D63,'[3]1847-1949-3347-3581'!$C:$I,6,FALSE),\" \",VLOOKUP(D63,'[3]1847-1949-3347-3581'!$C:$I,7,FALSE)))),\"\",IF(D63=0,\"\",CONCATENATE(VLOOKUP(D63,'[3]1847-1949-3347-3581'!$C:$I,6,FALSE),\" \",VLOOKUP(D63,'[3]1847-1949-3347-3581'!$C:$I,7,FALSE))))","v":""}]
[null,null,null,{"$f":"IF(C64=0,\"\",INDEX('[3]1847-1949-3347-3581'!$C$17:$C$14007,MATCH(C64,'[3]1847-1949-3347-3581'!$F$17:$F$14007,0)))","v":""},{"$f":"IF(ISNA(IF(D64=0,\"\",CONCATENATE(VLOOKUP(D64,'[3]1847-1949-3347-3581'!$C:$I,6,FALSE),\" \",VLOOKUP(D64,'[3]1847-1949-3347-3581'!$C:$I,7,FALSE)))),\"\",IF(D64=0,\"\",CONCATENATE(VLOOKUP(D64,'[3]1847-1949-3347-3581'!$C:$I,6,FALSE),\" \",VLOOKUP(D64,'[3]1847-1949-3347-3581'!$C:$I,7,FALSE))))","v":""}]
[null,null,null,{"$f":"IF(C65=0,\"\",INDEX('[3]1847-1949-3347-3581'!$C$17:$C$14007,MATCH(C65,'[3]1847-1949-3347-3581'!$F$17:$F$14007,0)))","v":""},{"$f":"IF(ISNA(IF(D65=0,\"\",CONCATENATE(VLOOKUP(D65,'[3]1847-1949-3347-3581'!$C:$I,6,FALSE),\" \",VLOOKUP(D65,'[3]1847-1949-3347-3581'!$C:$I,7,FALSE)))),\"\",IF(D65=0,\"\",CONCATENATE(VLOOKUP(D65,'[3]1847-1949-3347-3581'!$C:$I,6,FALSE),\" \",VLOOKUP(D65,'[3]1847-1949-3347-3581'!$C:$I,7,FALSE))))","v":""}]

{"sheet":"Planning 2023","index":1,"n_rows":82,"n_cols":17,"rows_kept":82,"cut":false,"hidden":false,"merged":[]}
[null,{"$f":"IF(ISNA(VLOOKUP(B2,congés,2,FALSE)),\"-\",VLOOKUP(B2,congés,2,FALSE))","v":"Congé"},{"$f":"B1","v":"Congé"},{"$f":"B1","v":"Congé"},{"$f":"B1","v":"Congé"},{"$f":"IF(ISNA(VLOOKUP(F2,congés,2,FALSE)),\"-\",VLOOKUP(F2,congés,2,FALSE))","v":"-"},{"$f":"F1","v":"-"},{"$f":"F1","v":"-"},{"$f":"F1","v":"-"},{"$f":"IF(ISNA(VLOOKUP(J2,congés,2,FALSE)),\"-\",VLOOKUP(J2,congés,2,FALSE))","v":"-"},{"$f":"J1","v":"-"},{"$f":"J1","v":"-"},{"$f":"J1","v":"-"},{"$f":"IF(ISNA(VLOOKUP(N2,congés,2,FALSE)),\"-\",VLOOKUP(N2,congés,2,FALSE))","v":"-"},{"$f":"N1","v":"-"},{"$f":"N1","v":"-"},{"$f":"N1","v":"-"}]
[null,"2023-01-06",null,null,null,"2023-01-09",null,null,null,"2023-01-10",null,null,null,"2023-01-11"]
["Agents","Véhicule","Cronos","Chantier","Adresse","Véhicule","Cronos","Chantier","Adresse","Véhicule","Cronos","Chantier","Adresse","Véhicule","Cronos","Chantier","Adresse"]
["Beaupain Olivier",null,null,{"$f":"IF(C4=0,\"\",INDEX('[3]1847-1949-3347-3581'!$C$17:$C$14007,MATCH(C4,'[3]1847-1949-3347-3581'!$F$17:$F$14007,0)))","v":""},{"$f":"IF(ISNA(IF(D4=0,\"\",CONCATENATE(VLOOKUP(D4,'[3]1847-1949-3347-3581'!$C:$I,6,FALSE),\" \",VLOOKUP(D4,'[3]1847-1949-3347-3581'!$C:$I,7,FALSE)))),\"\",IF(D4=0,\"\",CONCATENATE(VLOOKUP(D4,'[3]1847-1949-3347-3581'!$C:$I,6,FALSE),\" \",VLOOKUP(D4,'[3]1847-1949-3347-3581'!$C:$I,7,FALSE))))","v":""},"1-PLT-828","EX_23_00035",{"$f":"IF(G4=0,\"\",INDEX('[3]1847-1949-3347-3581'!$C$17:$C$14007,MATCH(G4,'[3]1847-1949-3347-3581'!$F$17:$F$14007,0)))","v":"1847/2743"},{"$f":"IF(ISNA(IF(H4=0,\"\",CONCATENATE(VLOOKUP(H4,'[3]1847-1949-3347-3581'!$C:$I,6,FALSE),\" \",VLOOKUP(H4,'[3]1847-1949-3347-3581'!$C:$I,7,FALSE)))),\"\",IF(H4=0,\"\",CONCATENATE(VLOOKUP(H4,'[3]1847-1949-3347-3581'!$C:$I,6,FALSE),\" \",VLOOKUP(H4,'[3]1847-1949-3347-3581'!$C:$I,7,FALSE))))","v":"Herchies chemin à Joncs 1 - 10/400"},"1-PLT-828",364467,{"$f":"IF(K4=0,\"\",INDEX('[3]1847-1949-3347-3581'!$C$17:$C$14007,MATCH(K4,'[3]1847-1949-3347-3581'!$F$17:$F$14007,0)))","v":"1847/2423"},{"$f":"IF(ISNA(IF(L4=0,\"\",CONCATENATE(VLOOKUP(L4,'[3]1847-1949-3347-3581'!$C:$I,6,FALSE),\" \",VLOOKUP(L4,'[3]1847-1949-3347-3581'!$C:$I,7,FALSE)))),\"\",IF(L4=0,\"\",CONCATENATE(VLOOKUP(L4,'[3]1847-1949-3347-3581'!$C:$I,6,FALSE),\" \",VLOOKUP(L4,'[3]1847-1949-3347-3581'!$C:$I,7,FALSE))))","v":"Mouscron Rue du Marquis D'Ennetières"},"1-PLT-828",378023,{"$f":"IF(O4=0,\"\",INDEX('[3]1847-1949-3347-3581'!$C$17:$C$14007,MATCH(O4,'[3]1847-1949-3347-3581'!$F$17:$F$14007,0)))","v":"1847/2721"},{"$f":"IF(ISNA(IF(P4=0,\"\",CONCATENATE(VLOOKUP(P4,'[3]1847-1949-3347-3581'!$C:$I,6,FALSE),\" \",VLOOKUP(P4,'[3]1847-1949-3347-3581'!$C:$I,7,FALSE)))),\"\",IF(P4=0,\"\",CONCATENATE(VLOOKUP(P4,'[3]1847-1949-3347-3581'!$C:$I,6,FALSE),\" \",VLOOKUP(P4,'[3]1847-1949-3347-3581'!$C:$I,7,FALSE))))","v":"Estaimpuis Rue de l'Armistice "}]
[null,null,null,{"$f":"IF(C5=0,\"\",INDEX('[3]1847-1949-3347-3581'!$C$17:$C$14007,MATCH(C5,'[3]1847-1949-3347-3581'!$F$17:$F$14007,0)))","v":""},{"$f":"IF(ISNA(IF(D5=0,\"\",CONCATENATE(VLOOKUP(D5,'[3]1847-1949-3347-3581'!$C:$I,6,FALSE),\" \",VLOOKUP(D5,'[3]1847-1949-3347-3581'!$C:$I,7,FALSE)))),\"\",IF(D5=0,\"\",CONCATENATE(VLOOKUP(D5,'[3]1847-1949-3347-3581'!$C:$I,6,FALSE),\" \",VLOOKUP(D5,'[3]1847-1949-3347-3581'!$C:$I,7,FALSE))))","v":""},null,null,"0001/0003",{"$f":"IF(ISNA(IF(H5=0,\"\",CONCATENATE(VLOOKUP(H5,'[3]1847-1949-3347-3581'!$C:$I,6,FALSE),\" \",VLOOKUP(H5,'[3]1847-1949-3347-3581'!$C:$I,7,FALSE)))),\"\",IF(H5=0,\"\",CONCATENATE(VLOOKUP(H5,'[3]1847-1949-3347-3581'!$C:$I,6,FALSE),\" \",VLOOKUP(H5,'[3]1847-1949-3347-3581'!$C:$I,7,FALSE))))","v":"Travail général hors chantiers"},null,null,{"$f":"IF(K5=0,\"\",INDEX('[3]1847-1949-3347-3581'!$C$17:$C$14007,MATCH(K5,'[3]1847-1949-3347-3581'!$F$17:$F$14007,0)))","v":""},{"$f":"IF(ISNA(IF(L5=0,\"\",CONCATENATE(VLOOKUP(L5,'[3]1847-1949-3347-3581'!$C:$I,6,FALSE),\" \",VLOOKUP(L5,'[3]1847-1949-3347-3581'!$C:$I,7,FALSE)))),\"\",IF(L5=0,\"\",CONCATENATE(VLOOKUP(L5,'[3]1847-1949-3347-3581'!$C:$I,6,FALSE),\" \",VLOOKUP(L5,'[3]1847-1949-3347-3581'!$C:$I,7,FALSE))))","v":""},null,null,"0001/0040",{"$f":"IF(ISNA(IF(P5=0,\"\",CONCATENATE(VLOOKUP(P5,'[3]1847-1949-3347-3581'!$C:$I,6,FALSE),\" \",VLOOKUP(P5,'[3]1847-1949-3347-3581'!$C:$I,7,FALSE)))),\"\",IF(P5=0,\"\",CONCATENATE(VLOOKUP(P5,'[3]1847-1949-3347-3581'!$C:$I,6,FALSE),\" \",VLOOKUP(P5,'[3]1847-1949-3347-3581'!$C:$I,7,FALSE))))","v":"Visite médicale"}]
[null,null,null,{"$f":"IF(C6=0,\"\",INDEX('[3]1847-1949-3347-3581'!$C$17:$C$14007,MATCH(C6,'[3]1847-1949-3347-3581'!$F$17:$F$14007,0)))","v":""},{"$f":"IF(ISNA(IF(D6=0,\"\",CONCATENATE(VLOOKUP(D6,'[3]1847-1949-3347-3581'!$C:$I,6,FALSE),\" \",VLOOKUP(D6,'[3]1847-1949-3347-3581'!$C:$I,7,FALSE)))),\"\",IF(D6=0,\"\",CONCATENATE(VLOOKUP(D6,'[3]1847-1949-3347-3581'!$C:$I,6,FALSE),\" \",VLOOKUP(D6,'[3]1847-1949-3347-3581'!$C:$I,7,FALSE))))","v":""},null,null,{"$f":"IF(G6=0,\"\",INDEX('[3]1847-1949-3347-3581'!$C$17:$C$14007,MATCH(G6,'[3]1847-1949-3347-3581'!$F$17:$F$14007,0)))","v":""},{"$f":"IF(ISNA(IF(H6=0,\"\",CONCATENATE(VLOOKUP(H6,'[3]1847-1949-3347-3581'!$C:$I,6,FALSE),\" \",VLOOKUP(H6,'[3]1847-1949-3347-3581'!$C:$I,7,FALSE)))),\"\",IF(H6=0,\"\",CONCATENATE(VLOOKUP(H6,'[3]1847-1949-3347-3581'!$C:$I,6,FALSE),\" \",VLOOKUP(H6,'[3]1847-1949-3347-3581'!$C:$I,7,FALSE))))","v":""},null,null,{"$f":"IF(K6=0,\"\",INDEX('[3]1847-1949-3347-3581'!$C$17:$C$14007,MATCH(K6,'[3]1847-1949-3347-3581'!$F$17:$F$14007,0)))","v":""},{"$f":"IF(ISNA(IF(L6=0,\"\",CONCATENATE(VLOOKUP(L6,'[3]1847-1949-3347-3581'!$C:$I,6,FALSE),\" \",VLOOKUP(L6,'[3]1847-1949-3347-3581'!$C:$I,7,FALSE)))),\"\",IF(L6=0,\"\",CONCATENATE(VLOOKUP(L6,'[3]1847-1949-3347-3581'!$C:$I,6,FALSE),\" \",VLOOKUP(L6,'[3]1847-1949-3347-3581'!$C:$I,7,FALSE))))","v":""},null,null,{"$f":"IF(O6=0,\"\",INDEX('[3]1847-1949-3347-3581'!$C$17:$C$14007,MATCH(O6,'[3]1847-1949-3347-3581'!$F$17:$F$14007,0)))","v":""},"11h15"]
[null,null,null,{"$f":"IF(C7=0,\"\",INDEX('[3]1847-1949-3347-3581'!$C$17:$C$14007,MATCH(C7,'[3]1847-1949-3347-3581'!$F$17:$F$14007,0)))","v":""},{"$f":"IF(ISNA(IF(D7=0,\"\",CONCATENATE(VLOOKUP(D7,'[3]1847-1949-3347-3581'!$C:$I,6,FALSE),\" \",VLOOKUP(D7,'[3]1847-1949-3347-3581'!$C:$I,7,FALSE)))),\"\",IF(D7=0,\"\",CONCATENATE(VLOOKUP(D7,'[3]1847-1949-3347-3581'!$C:$I,6,FALSE),\" \",VLOOKUP(D7,'[3]1847-1949-3347-3581'!$C:$I,7,FALSE))))","v":""},null,null,{"$f":"IF(G7=0,\"\",INDEX('[3]1847-1949-3347-3581'!$C$17:$C$14007,MATCH(G7,'[3]1847-1949-3347-3581'!$F$17:$F$14007,0)))","v":""},{"$f":"IF(ISNA(IF(H7=0,\"\",CONCATENATE(VLOOKUP(H7,'[3]1847-1949-3347-3581'!$C:$I,6,FALSE),\" \",VLOOKUP(H7,'[3]1847-1949-3347-3581'!$C:$I,7,FALSE)))),\"\",IF(H7=0,\"\",CONCATENATE(VLOOKUP(H7,'[3]1847-1949-3347-3581'!$C:$I,6,FALSE),\" \",VLOOKUP(H7,'[3]1847-1949-3347-3581'!$C:$I,7,FALSE))))","v":""},null,null,{"$f":"IF(K7=0,\"\",INDEX('[3]1847-1949-3347-3581'!$C$17:$C$14007,MATCH(K7,'[3]1847-1949-3347-3581'!$F$17:$F$14007,0)))","v":""},{"$f":"IF(ISNA(IF(L7=0,\"\",CONCATENATE(VLOOKUP(L7,'[3]1847-1949-3347-3581'!$C:$I,6,FALSE),\" \",VLOOKUP(L7,'[3]1847-1949-3347-3581'!$C:$I,7,FALSE)))),\"\",IF(L7=0,\"\",CONCATENATE(VLOOKUP(L7,'[3]1847-1949-3347-3581'!$C:$I,6,FALSE),\" \",VLOOKUP(L7,'[3]1847-1949-3347-3581'!$C:$I,7,FALSE))))","v":""},null,null,{"$f":"IF(O7=0,\"\",INDEX('[3]1847-1949-3347-3581'!$C$17:$C$14007,MATCH(O7,'[3]1847-1949-3347-3581'!$F$17:$F$14007,0)))","v":""},{"$f":"IF(ISNA(IF(P7=0,\"\",CONCATENATE(VLOOKUP(P7,'[3]1847-1949-3347-3581'!$C:$I,6,FALSE),\" \",VLOOKUP(P7,'[3]1847-1949-3347-3581'!$C:$I,7,FALSE)))),\"\",IF(P7=0,\"\",CONCATENATE(VLOOKUP(P7,'[3]1847-1949-3347-3581'!$C:$I,6,FALSE),\" \",VLOOKUP(P7,'[3]1847-1949-3347-3581'!$C:$I,7,FALSE))))","v":""}]
["De Bodt Yves",null,null,{"$f":"IF(C8=0,\"\",INDEX('[3]1847-1949-3347-3581'!$C$17:$C$14007,MATCH(C8,'[3]1847-1949-3347-3581'!$F$17:$F$14007,0)))","v":""},{"$f":"IF(ISNA(IF(D8=0,\"\",CONCATENATE(VLOOKUP(D8,'[3]1847-1949-3347-3581'!$C:$I,6,FALSE),\" \",VLOOKUP(D8,'[3]1847-1949-3347-3581'!$C:$I,7,FALSE)))),\"\",IF(D8=0,\"\",CONCATENATE(VLOOKUP(D8,'[3]1847-1949-3347-3581'!$C:$I,6,FALSE),\" \",VLOOKUP(D8,'[3]1847-1949-3347-3581'!$C:$I,7,FALSE))))","v":""},null,"malade",{"$f":"IF(G8=0,\"\",INDEX('[3]1847-1949-3347-3581'!$C$17:$C$14007,MATCH(G8,'[3]1847-1949-3347-3581'!$F$17:$F$14007,0)))","v":{"$error":"#N/A"}},{"$f":"IF(ISNA(IF(H8=0,\"\",CONCATENATE(VLOOKUP(H8,'[3]1847-1949-3347-3581'!$C:$I,6,FALSE),\" \",VLOOKUP(H8,'[3]1847-1949-3347-3581'!$C:$I,7,FALSE)))),\"\",IF(H8=0,\"\",CONCATENATE(VLOOKUP(H8,'[3]1847-1949-3347-3581'!$C:$I,6,FALSE),\" \",VLOOKUP(H8,'[3]1847-1949-3347-3581'!$C:$I,7,FALSE))))","v":""},null,"malade",{"$f":"IF(K8=0,\"\",INDEX('[3]1847-1949-3347-3581'!$C$17:$C$14007,MATCH(K8,'[3]1847-1949-3347-3581'!$F$17:$F$14007,0)))","v":{"$error":"#N/A"}},{"$f":"IF(ISNA(IF(L8=0,\"\",CONCATENATE(VLOOKUP(L8,'[3]1847-1949-3347-3581'!$C:$I,6,FALSE),\" \",VLOOKUP(L8,'[3]1847-1949-3347-3581'!$C:$I,7,FALSE)))),\"\",IF(L8=0,\"\",CONCATENATE(VLOOKUP(L8,'[3]1847-1949-3347-3581'!$C:$I,6,FALSE),\" \",VLOOKUP(L8,'[3]1847-1949-3347-3581'!$C:$I,7,FALSE))))","v":""},null,"malade",{"$f":"IF(O8=0,\"\",INDEX('[3]1847-1949-3347-3581'!$C$17:$C$14007,MATCH(O8,'[3]1847-1949-3347-3581'!$F$17:$F$14007,0)))","v":{"$error":"#N/A"}},{"$f":"IF(ISNA(IF(P8=0,\"\",CONCATENATE(VLOOKUP(P8,'[3]1847-1949-3347-3581'!$C:$I,6,FALSE),\" \",VLOOKUP(P8,'[3]1847-1949-3347-3581'!$C:$I,7,FALSE)))),\"\",IF(P8=0,\"\",CONCATENATE(VLOOKUP(P8,'[3]1847-1949-3347-3581'!$C:$I,6,FALSE),\" \",VLOOKUP(P8,'[3]1847-1949-3347-3581'!$C:$I,7,FALSE))))","v":""}]
[null,null,null,{"$f":"IF(C9=0,\"\",INDEX('[3]1847-1949-3347-3581'!$C$17:$C$14007,MATCH(C9,'[3]1847-1949-3347-3581'!$F$17:$F$14007,0)))","v":""},{"$f":"IF(ISNA(IF(D9=0,\"\",CONCATENATE(VLOOKUP(D9,'[3]1847-1949-3347-3581'!$C:$I,6,FALSE),\" \",VLOOKUP(D9,'[3]1847-1949-3347-3581'!$C:$I,7,FALSE)))),\"\",IF(D9=0,\"\",CONCATENATE(VLOOKUP(D9,'[3]1847-1949-3347-3581'!$C:$I,6,FALSE),\" \",VLOOKUP(D9,'[3]1847-1949-3347-3581'!$C:$I,7,FALSE))))","v":""},null,null,{"$f":"IF(G9=0,\"\",INDEX('[3]1847-1949-3347-3581'!$C$17:$C$14007,MATCH(G9,'[3]1847-1949-3347-3581'!$F$17:$F$14007,0)))","v":""},{"$f":"IF(ISNA(IF(H9=0,\"\",CONCATENATE(VLOOKUP(H9,'[3]1847-1949-3347-3581'!$C:$I,6,FALSE),\" \",VLOOKUP(H9,'[3]1847-1949-3347-3581'!$C:$I,7,FALSE)))),\"\",IF(H9=0,\"\",CONCATENATE(VLOOKUP(H9,'[3]1847-1949-3347-3581'!$C:$I,6,FALSE),\" \",VLOOKUP(H9,'[3]1847-1949-3347-3581'!$C:$I,7,FALSE))))","v":""},null,null,{"$f":"IF(K9=0,\"\",INDEX('[3]1847-1949-3347-3581'!$C$17:$C$14007,MATCH(K9,'[3]1847-1949-3347-3581'!$F$17:$F$14007,0)))","v":""},{"$f":"IF(ISNA(IF(L9=0,\"\",CONCATENATE(VLOOKUP(L9,'[3]1847-1949-3347-3581'!$C:$I,6,FALSE),\" \",VLOOKUP(L9,'[3]1847-1949-3347-3581'!$C:$I,7,FALSE)))),\"\",IF(L9=0,\"\",CONCATENATE(VLOOKUP(L9,'[3]1847-1949-3347-3581'!$C:$I,6,FALSE),\" \",VLOOKUP(L9,'[3]1847-1949-3347-3581'!$C:$I,7,FALSE))))","v":""},null,null,{"$f":"IF(O9=0,\"\",INDEX('[3]1847-1949-3347-3581'!$C$17:$C$14007,MATCH(O9,'[3]1847-1949-3347-3581'!$F$17:$F$14007,0)))","v":""},{"$f":"IF(ISNA(IF(P9=0,\"\",CONCATENATE(VLOOKUP(P9,'[3]1847-1949-3347-3581'!$C:$I,6,FALSE),\" \",VLOOKUP(P9,'[3]1847-1949-3347-3581'!$C:$I,7,FALSE)))),\"\",IF(P9=0,\"\",CONCATENATE(VLOOKUP(P9,'[3]1847-1949-3347-3581'!$C:$I,6,FALSE),\" \",VLOOKUP(P9,'[3]1847-1949-3347-3581'!$C:$I,7,FALSE))))","v":""}]
[null,null,null,{"$f":"IF(C10=0,\"\",INDEX('[3]1847-1949-3347-3581'!$C$17:$C$14007,MATCH(C10,'[3]1847-1949-3347-3581'!$F$17:$F$14007,0)))","v":""},{"$f":"IF(ISNA(IF(D10=0,\"\",CONCATENATE(VLOOKUP(D10,'[3]1847-1949-3347-3581'!$C:$I,6,FALSE),\" \",VLOOKUP(D10,'[3]1847-1949-3347-3581'!$C:$I,7,FALSE)))),\"\",IF(D10=0,\"\",CONCATENATE(VLOOKUP(D10,'[3]1847-1949-3347-3581'!$C:$I,6,FALSE),\" \",VLOOKUP(D10,'[3]1847-1949-3347-3581'!$C:$I,7,FALSE))))","v":""},null,null,{"$f":"IF(G10=0,\"\",INDEX('[3]1847-1949-3347-3581'!$C$17:$C$14007,MATCH(G10,'[3]1847-1949-3347-3581'!$F$17:$F$14007,0)))","v":""},{"$f":"IF(ISNA(IF(H10=0,\"\",CONCATENATE(VLOOKUP(H10,'[3]1847-1949-3347-3581'!$C:$I,6,FALSE),\" \",VLOOKUP(H10,'[3]1847-1949-3347-3581'!$C:$I,7,FALSE)))),\"\",IF(H10=0,\"\",CONCATENATE(VLOOKUP(H10,'[3]1847-1949-3347-3581'!$C:$I,6,FALSE),\" \",VLOOKUP(H10,'[3]1847-1949-3347-3581'!$C:$I,7,FALSE))))","v":""},null,null,{"$f":"IF(K10=0,\"\",INDEX('[3]1847-1949-3347-3581'!$C$17:$C$14007,MATCH(K10,'[3]1847-1949-3347-3581'!$F$17:$F$14007,0)))","v":""},{"$f":"IF(ISNA(IF(L10=0,\"\",CONCATENATE(VLOOKUP(L10,'[3]1847-1949-3347-3581'!$C:$I,6,FALSE),\" \",VLOOKUP(L10,'[3]1847-1949-3347-3581'!$C:$I,7,FALSE)))),\"\",IF(L10=0,\"\",CONCATENATE(VLOOKUP(L10,'[3]1847-1949-3347-3581'!$C:$I,6,FALSE),\" \",VLOOKUP(L10,'[3]1847-1949-3347-3581'!$C:$I,7,FALSE))))","v":""},null,null,{"$f":"IF(O10=0,\"\",INDEX('[3]1847-1949-3347-3581'!$C$17:$C$14007,MATCH(O10,'[3]1847-1949-3347-3581'!$F$17:$F$14007,0)))","v":""},{"$f":"IF(ISNA(IF(P10=0,\"\",CONCATENATE(VLOOKUP(P10,'[3]1847-1949-3347-3581'!$C:$I,6,FALSE),\" \",VLOOKUP(P10,'[3]1847-1949-3347-3581'!$C:$I,7,FALSE)))),\"\",IF(P10=0,\"\",CONCATENATE(VLOOKUP(P10,'[3]1847-1949-3347-3581'!$C:$I,6,FALSE),\" \",VLOOKUP(P10,'[3]1847-1949-3347-3581'!$C:$I,7,FALSE))))","v":""}]
[null,null,null,{"$f":"IF(C11=0,\"\",INDEX('[3]1847-1949-3347-3581'!$C$17:$C$14007,MATCH(C11,'[3]1847-1949-3347-3581'!$F$17:$F$14007,0)))","v":""},{"$f":"IF(ISNA(IF(D11=0,\"\",CONCATENATE(VLOOKUP(D11,'[3]1847-1949-3347-3581'!$C:$I,6,FALSE),\" \",VLOOKUP(D11,'[3]1847-1949-3347-3581'!$C:$I,7,FALSE)))),\"\",IF(D11=0,\"\",CONCATENATE(VLOOKUP(D11,'[3]1847-1949-3347-3581'!$C:$I,6,FALSE),\" \",VLOOKUP(D11,'[3]1847-1949-3347-3581'!$C:$I,7,FALSE))))","v":""},null,null,{"$f":"IF(G11=0,\"\",INDEX('[3]1847-1949-3347-3581'!$C$17:$C$14007,MATCH(G11,'[3]1847-1949-3347-3581'!$F$17:$F$14007,0)))","v":""},{"$f":"IF(ISNA(IF(H11=0,\"\",CONCATENATE(VLOOKUP(H11,'[3]1847-1949-3347-3581'!$C:$I,6,FALSE),\" \",VLOOKUP(H11,'[3]1847-1949-3347-3581'!$C:$I,7,FALSE)))),\"\",IF(H11=0,\"\",CONCATENATE(VLOOKUP(H11,'[3]1847-1949-3347-3581'!$C:$I,6,FALSE),\" \",VLOOKUP(H11,'[3]1847-1949-3347-3581'!$C:$I,7,FALSE))))","v":""},null,null,{"$f":"IF(K11=0,\"\",INDEX('[3]1847-1949-3347-3581'!$C$17:$C$14007,MATCH(K11,'[3]1847-1949-3347-3581'!$F$17:$F$14007,0)))","v":""},{"$f":"IF(ISNA(IF(L11=0,\"\",CONCATENATE(VLOOKUP(L11,'[3]1847-1949-3347-3581'!$C:$I,6,FALSE),\" \",VLOOKUP(L11,'[3]1847-1949-3347-3581'!$C:$I,7,FALSE)))),\"\",IF(L11=0,\"\",CONCATENATE(VLOOKUP(L11,'[3]1847-1949-3347-3581'!$C:$I,6,FALSE),\" \",VLOOKUP(L11,'[3]1847-1949-3347-3581'!$C:$I,7,FALSE))))","v":""},null,null,{"$f":"IF(O11=0,\"\",INDEX('[3]1847-1949-3347-3581'!$C$17:$C$14007,MATCH(O11,'[3]1847-1949-3347-3581'!$F$17:$F$14007,0)))","v":""},{"$f":"IF(ISNA(IF(P11=0,\"\",CONCATENATE(VLOOKUP(P11,'[3]1847-1949-3347-3581'!$C:$I,6,FALSE),\" \",VLOOKUP(P11,'[3]1847-1949-3347-3581'!$C:$I,7,FALSE)))),\"\",IF(P11=0,\"\",CONCATENATE(VLOOKUP(P11,'[3]1847-1949-3347-3581'!$C:$I,6,FALSE),\" \",VLOOKUP(P11,'[3]1847-1949-3347-3581'!$C:$I,7,FALSE))))","v":""}]
["De Grande Fonzy",null,null,{"$f":"IF(C12=0,\"\",INDEX('[3]1847-1949-3347-3581'!$C$17:$C$14007,MATCH(C12,'[3]1847-1949-3347-3581'!$F$17:$F$14007,0)))","v":""},{"$f":"IF(ISNA(IF(D12=0,\"\",CONCATENATE(VLOOKUP(D12,'[3]1847-1949-3347-3581'!$C:$I,6,FALSE),\" \",VLOOKUP(D12,'[3]1847-1949-3347-3581'!$C:$I,7,FALSE)))),\"\",IF(D12=0,\"\",CONCATENATE(VLOOKUP(D12,'[3]1847-1949-3347-3581'!$C:$I,6,FALSE),\" \",VLOOKUP(D12,'[3]1847-1949-3347-3581'!$C:$I,7,FALSE))))","v":""},null,383754,{"$f":"IF(G12=0,\"\",INDEX('[3]1847-1949-3347-3581'!$C$17:$C$14007,MATCH(G12,'[3]1847-1949-3347-3581'!$F$17:$F$14007,0)))","v":"1847/2718"},{"$f":"IF(ISNA(IF(H12=0,\"\",CONCATENATE(VLOOKUP(H12,'[3]1847-1949-3347-3581'!$C:$I,6,FALSE),\" \",VLOOKUP(H12,'[3]1847-1949-3347-3581'!$C:$I,7,FALSE)))),\"\",IF(H12=0,\"\",CONCATENATE(VLOOKUP(H12,'[3]1847-1949-3347-3581'!$C:$I,6,FALSE),\" \",VLOOKUP(H12,'[3]1847-1949-3347-3581'!$C:$I,7,FALSE))))","v":"Bassilly Rue Warissaet"},null,381616,{"$f":"IF(K12=0,\"\",INDEX('[3]1847-1949-3347-3581'!$C$17:$C$14007,MATCH(K12,'[3]1847-1949-3347-3581'!$F$17:$F$14007,0)))","v":"1847/2566"},{"$f":"IF(ISNA(IF(L12=0,\"\",CONCATENATE(VLOOKUP(L12,'[3]1847-1949-3347-3581'!$C:$I,6,FALSE),\" \",VLOOKUP(L12,'[3]1847-1949-3347-3581'!$C:$I,7,FALSE)))),\"\",IF(L12=0,\"\",CONCATENATE(VLOOKUP(L12,'[3]1847-1949-3347-3581'!$C:$I,6,FALSE),\" \",VLOOKUP(L12,'[3]1847-1949-3347-3581'!$C:$I,7,FALSE))))","v":"Kain  Val de la Résistance "},null,null,"0001/0040",{"$f":"IF(ISNA(IF(P12=0,\"\",CONCATENATE(VLOOKUP(P12,'[3]1847-1949-3347-3581'!$C:$I,6,FALSE),\" \",VLOOKUP(P12,'[3]1847-1949-3347-3581'!$C:$I,7,FALSE)))),\"\",IF(P12=0,\"\",CONCATENATE(VLOOKUP(P12,'[3]1847-1949-3347-3581'!$C:$I,6,FALSE),\" \",VLOOKUP(P12,'[3]1847-1949-3347-3581'!$C:$I,7,FALSE))))","v":"Visite médicale"}]
[33,null,null,{"$f":"IF(C13=0,\"\",INDEX('[3]1847-1949-3347-3581'!$C$17:$C$14007,MATCH(C13,'[3]1847-1949-3347-3581'!$F$17:$F$14007,0)))","v":""},{"$f":"IF(ISNA(IF(D13=0,\"\",CONCATENATE(VLOOKUP(D13,'[3]1847-1949-3347-3581'!$C:$I,6,FALSE),\" \",VLOOKUP(D13,'[3]1847-1949-3347-3581'!$C:$I,7,FALSE)))),\"\",IF(D13=0,\"\",CONCATENATE(VLOOKUP(D13,'[3]1847-1949-3347-3581'!$C:$I,6,FALSE),\" \",VLOOKUP(D13,'[3]1847-1949-3347-3581'!$C:$I,7,FALSE))))","v":""},null,null,{"$f":"IF(G13=0,\"\",INDEX('[3]1847-1949-3347-3581'!$C$17:$C$14007,MATCH(G13,'[3]1847-1949-3347-3581'!$F$17:$F$14007,0)))","v":""},{"$f":"IF(ISNA(IF(H13=0,\"\",CONCATENATE(VLOOKUP(H13,'[3]1847-1949-3347-3581'!$C:$I,6,FALSE),\" \",VLOOKUP(H13,'[3]1847-1949-3347-3581'!$C:$I,7,FALSE)))),\"\",IF(H13=0,\"\",CONCATENATE(VLOOKUP(H13,'[3]1847-1949-3347-3581'!$C:$I,6,FALSE),\" \",VLOOKUP(H13,'[3]1847-1949-3347-3581'!$C:$I,7,FALSE))))","v":""},null,"EX_22_05199",{"$f":"IF(K13=0,\"\",INDEX('[3]1847-1949-3347-3581'!$C$17:$C$14007,MATCH(K13,'[3]1847-1949-3347-3581'!$F$17:$F$14007,0)))","v":"1847/2742"},{"$f":"IF(ISNA(IF(L13=0,\"\",CONCATENATE(VLOOKUP(L13,'[3]1847-1949-3347-3581'!$C:$I,6,FALSE),\" \",VLOOKUP(L13,'[3]1847-1949-3347-3581'!$C:$I,7,FALSE)))),\"\",IF(L13=0,\"\",CONCATENATE(VLOOKUP(L13,'[3]1847-1949-3347-3581'!$C:$I,6,FALSE),\" \",VLOOKUP(L13,'[3]1847-1949-3347-3581'!$C:$I,7,FALSE))))","v":"Velaines Rue Delvourgue - redresser poteau béton "},null,null,{"$f":"IF(O13=0,\"\",INDEX('[3]1847-1949-3347-3581'!$C$17:$C$14007,MATCH(O13,'[3]1847-1949-3347-3581'!$F$17:$F$14007,0)))","v":""},"14h"]
[null,null,null,{"$f":"IF(C14=0,\"\",INDEX('[3]1847-1949-3347-3581'!$C$17:$C$14007,MATCH(C14,'[3]1847-1949-3347-3581'!$F$17:$F$14007,0)))","v":""},{"$f":"IF(ISNA(IF(D14=0,\"\",CONCATENATE(VLOOKUP(D14,'[3]1847-1949-3347-3581'!$C:$I,6,FALSE),\" \",VLOOKUP(D14,'[3]1847-1949-3347-3581'!$C:$I,7,FALSE)))),\"\",IF(D14=0,\"\",CONCATENATE(VLOOKUP(D14,'[3]1847-1949-3347-3581'!$C:$I,6,FALSE),\" \",VLOOKUP(D14,'[3]1847-1949-3347-3581'!$C:$I,7,FALSE))))","v":""},null,null,{"$f":"IF(G14=0,\"\",INDEX('[3]1847-1949-3347-3581'!$C$17:$C$14007,MATCH(G14,'[3]1847-1949-3347-3581'!$F$17:$F$14007,0)))","v":""},{"$f":"IF(ISNA(IF(H14=0,\"\",CONCATENATE(VLOOKUP(H14,'[3]1847-1949-3347-3581'!$C:$I,6,FALSE),\" \",VLOOKUP(H14,'[3]1847-1949-3347-3581'!$C:$I,7,FALSE)))),\"\",IF(H14=0,\"\",CONCATENATE(VLOOKUP(H14,'[3]1847-1949-3347-3581'!$C:$I,6,FALSE),\" \",VLOOKUP(H14,'[3]1847-1949-3347-3581'!$C:$I,7,FALSE))))","v":""},null,null,{"$f":"IF(K14=0,\"\",INDEX('[3]1847-1949-3347-3581'!$C$17:$C$14007,MATCH(K14,'[3]1847-1949-3347-3581'!$F$17:$F$14007,0)))","v":""},{"$f":"IF(ISNA(IF(L14=0,\"\",CONCATENATE(VLOOKUP(L14,'[3]1847-1949-3347-3581'!$C:$I,6,FALSE),\" \",VLOOKUP(L14,'[3]1847-1949-3347-3581'!$C:$I,7,FALSE)))),\"\",IF(L14=0,\"\",CONCATENATE(VLOOKUP(L14,'[3]1847-1949-3347-3581'!$C:$I,6,FALSE),\" \",VLOOKUP(L14,'[3]1847-1949-3347-3581'!$C:$I,7,FALSE))))","v":""},null,383754,{"$f":"IF(O14=0,\"\",INDEX('[3]1847-1949-3347-3581'!$C$17:$C$14007,MATCH(O14,'[3]1847-1949-3347-3581'!$F$17:$F$14007,0)))","v":"1847/2718"},{"$f":"IF(ISNA(IF(P14=0,\"\",CONCATENATE(VLOOKUP(P14,'[3]1847-1949-3347-3581'!$C:$I,6,FALSE),\" \",VLOOKUP(P14,'[3]1847-1949-3347-3581'!$C:$I,7,FALSE)))),\"\",IF(P14=0,\"\",CONCATENATE(VLOOKUP(P14,'[3]1847-1949-3347-3581'!$C:$I,6,FALSE),\" \",VLOOKUP(P14,'[3]1847-1949-3347-3581'!$C:$I,7,FALSE))))","v":"Bassilly Rue Warissaet"}]
[null,null,null,{"$f":"IF(C15=0,\"\",INDEX('[3]1847-1949-3347-3581'!$C$17:$C$14007,MATCH(C15,'[3]1847-1949-3347-3581'!$F$17:$F$14007,0)))","v":""},{"$f":"IF(ISNA(IF(D15=0,\"\",CONCATENATE(VLOOKUP(D15,'[3]1847-1949-3347-3581'!$C:$I,6,FALSE),\" \",VLOOKUP(D15,'[3]1847-1949-3347-3581'!$C:$I,7,FALSE)))),\"\",IF(D15=0,\"\",CONCATENATE(VLOOKUP(D15,'[3]1847-1949-3347-3581'!$C:$I,6,FALSE),\" \",VLOOKUP(D15,'[3]1847-1949-3347-3581'!$C:$I,7,FALSE))))","v":""},null,null,{"$f":"IF(G15=0,\"\",INDEX('[3]1847-1949-3347-3581'!$C$17:$C$14007,MATCH(G15,'[3]1847-1949-3347-3581'!$F$17:$F$14007,0)))","v":""},{"$f":"IF(ISNA(IF(H15=0,\"\",CONCATENATE(VLOOKUP(H15,'[3]1847-1949-3347-3581'!$C:$I,6,FALSE),\" \",VLOOKUP(H15,'[3]1847-1949-3347-3581'!$C:$I,7,FALSE)))),\"\",IF(H15=0,\"\",CONCATENATE(VLOOKUP(H15,'[3]1847-1949-3347-3581'!$C:$I,6,FALSE),\" \",VLOOKUP(H15,'[3]1847-1949-3347-3581'!$C:$I,7,FALSE))))","v":""},null,null,{"$f":"IF(K15=0,\"\",INDEX('[3]1847-1949-3347-3581'!$C$17:$C$14007,MATCH(K15,'[3]1847-1949-3347-3581'!$F$17:$F$14007,0)))","v":""},{"$f":"IF(ISNA(IF(L15=0,\"\",CONCATENATE(VLOOKUP(L15,'[3]1847-1949-3347-3581'!$C:$I,6,FALSE),\" \",VLOOKUP(L15,'[3]1847-1949-3347-3581'!$C:$I,7,FALSE)))),\"\",IF(L15=0,\"\",CONCATENATE(VLOOKUP(L15,'[3]1847-1949-3347-3581'!$C:$I,6,FALSE),\" \",VLOOKUP(L15,'[3]1847-1949-3347-3581'!$C:$I,7,FALSE))))","v":""},null,null,{"$f":"IF(O15=0,\"\",INDEX('[3]1847-1949-3347-3581'!$C$17:$C$14007,MATCH(O15,'[3]1847-1949-3347-3581'!$F$17:$F$14007,0)))","v":""},{"$f":"IF(ISNA(IF(P15=0,\"\",CONCATENATE(VLOOKUP(P15,'[3]1847-1949-3347-3581'!$C:$I,6,FALSE),\" \",VLOOKUP(P15,'[3]1847-1949-3347-3581'!$C:$I,7,FALSE)))),\"\",IF(P15=0,\"\",CONCATENATE(VLOOKUP(P15,'[3]1847-1949-3347-3581'!$C:$I,6,FALSE),\" \",VLOOKUP(P15,'[3]1847-1949-3347-3581'!$C:$I,7,FALSE))))","v":""}]
["De Grande Johnny",null,null,{"$f":"IF(C16=0,\"\",INDEX('[3]1847-1949-3347-3581'!$C$17:$C$14007,MATCH(C16,'[3]1847-1949-3347-3581'!$F$17:$F$14007,0)))","v":""},{"$f":"IF(ISNA(IF(D16=0,\"\",CONCATENATE(VLOOKUP(D16,'[3]1847-1949-3347-3581'!$C:$I,6,FALSE),\" \",VLOOKUP(D16,'[3]1847-1949-3347-3581'!$C:$I,7,FALSE)))),\"\",IF(D16=0,\"\",CONCATENATE(VLOOKUP(D16,'[3]1847-1949-3347-3581'!$C:$I,6,FALSE),\" \",VLOOKUP(D16,'[3]1847-1949-3347-3581'!$C:$I,7,FALSE))))","v":""},"1-NBV-173","EX_23_00035",{"$f":"IF(G16=0,\"\",INDEX('[3]1847-1949-3347-3581'!$C$17:$C$14007,MATCH(G16,'[3]1847-1949-3347-3581'!$F$17:$F$14007,0)))","v":"1847/2743"},{"$f":"IF(ISNA(IF(H16=0,\"\",CONCATENATE(VLOOKUP(H16,'[3]1847-1949-3347-3581'!$C:$I,6,FALSE),\" \",VLOOKUP(H16,'[3]1847-1949-3347-3581'!$C:$I,7,FALSE)))),\"\",IF(H16=0,\"\",CONCATENATE(VLOOKUP(H16,'[3]1847-1949-3347-3581'!$C:$I,6,FALSE),\" \",VLOOKUP(H16,'[3]1847-1949-3347-3581'!$C:$I,7,FALSE))))","v":"Herchies chemin à Joncs 1 - 10/400"},"1-NBV-134",364467,{"$f":"IF(K16=0,\"\",INDEX('[3]1847-1949-3347-3581'!$C$17:$C$14007,MATCH(K16,'[3]1847-1949-3347-3581'!$F$17:$F$14007,0)))","v":"1847/2423"},{"$f":"IF(ISNA(IF(L16=0,\"\",CONCATENATE(VLOOKUP(L16,'[3]1847-1949-3347-3581'!$C:$I,6,FALSE),\" \",VLOOKUP(L16,'[3]1847-1949-3347-3581'!$C:$I,7,FALSE)))),\"\",IF(L16=0,\"\",CONCATENATE(VLOOKUP(L16,'[3]1847-1949-3347-3581'!$C:$I,6,FALSE),\" \",VLOOKUP(L16,'[3]1847-1949-3347-3581'!$C:$I,7,FALSE))))","v":"Mouscron Rue du Marquis D'Ennetières"},null,null,"0001/0040",{"$f":"IF(ISNA(IF(P16=0,\"\",CONCATENATE(VLOOKUP(P16,'[3]1847-1949-3347-3581'!$C:$I,6,FALSE),\" \",VLOOKUP(P16,'[3]1847-1949-3347-3581'!$C:$I,7,FALSE)))),\"\",IF(P16=0,\"\",CONCATENATE(VLOOKUP(P16,'[3]1847-1949-3347-3581'!$C:$I,6,FALSE),\" \",VLOOKUP(P16,'[3]1847-1949-3347-3581'!$C:$I,7,FALSE))))","v":"Visite médicale"}]
[null,null,null,{"$f":"IF(C17=0,\"\",INDEX('[3]1847-1949-3347-3581'!$C$17:$C$14007,MATCH(C17,'[3]1847-1949-3347-3581'!$F$17:$F$14007,0)))","v":""},{"$f":"IF(ISNA(IF(D17=0,\"\",CONCATENATE(VLOOKUP(D17,'[3]1847-1949-3347-3581'!$C:$I,6,FALSE),\" \",VLOOKUP(D17,'[3]1847-1949-3347-3581'!$C:$I,7,FALSE)))),\"\",IF(D17=0,\"\",CONCATENATE(VLOOKUP(D17,'[3]1847-1949-3347-3581'!$C:$I,6,FALSE),\" \",VLOOKUP(D17,'[3]1847-1949-3347-3581'!$C:$I,7,FALSE))))","v":""},null,null,"0001/0003",{"$f":"IF(ISNA(IF(H17=0,\"\",CONCATENATE(VLOOKUP(H17,'[3]1847-1949-3347-3581'!$C:$I,6,FALSE),\" \",VLOOKUP(H17,'[3]1847-1949-3347-3581'!$C:$I,7,FALSE)))),\"\",IF(H17=0,\"\",CONCATENATE(VLOOKUP(H17,'[3]1847-1949-3347-3581'!$C:$I,6,FALSE),\" \",VLOOKUP(H17,'[3]1847-1949-3347-3581'!$C:$I,7,FALSE))))","v":"Travail général hors chantiers"},null,null,{"$f":"IF(K17=0,\"\",INDEX('[3]1847-1949-3347-3581'!$C$17:$C$14007,MATCH(K17,'[3]1847-1949-3347-3581'!$F$17:$F$14007,0)))","v":""},{"$f":"IF(ISNA(IF(L17=0,\"\",CONCATENATE(VLOOKUP(L17,'[3]1847-1949-3347-3581'!$C:$I,6,FALSE),\" \",VLOOKUP(L17,'[3]1847-1949-3347-3581'!$C:$I,7,FALSE)))),\"\",IF(L17=0,\"\",CONCATENATE(VLOOKUP(L17,'[3]1847-1949-3347-3581'!$C:$I,6,FALSE),\" \",VLOOKUP(L17,'[3]1847-1949-3347-3581'!$C:$I,7,FALSE))))","v":""},null,null,{"$f":"IF(O17=0,\"\",INDEX('[3]1847-1949-3347-3581'!$C$17:$C$14007,MATCH(O17,'[3]1847-1949-3347-3581'!$F$17:$F$14007,0)))","v":""},"12h"]
[null,null,null,{"$f":"IF(C18=0,\"\",INDEX('[3]1847-1949-3347-3581'!$C$17:$C$14007,MATCH(C18,'[3]1847-1949-3347-3581'!$F$17:$F$14007,0)))","v":""},{"$f":"IF(ISNA(IF(D18=0,\"\",CONCATENATE(VLOOKUP(D18,'[3]1847-1949-3347-3581'!$C:$I,6,FALSE),\" \",VLOOKUP(D18,'[3]1847-1949-3347-3581'!$C:$I,7,FALSE)))),\"\",IF(D18=0,\"\",CONCATENATE(VLOOKUP(D18,'[3]1847-1949-3347-3581'!$C:$I,6,FALSE),\" \",VLOOKUP(D18,'[3]1847-1949-3347-3581'!$C:$I,7,FALSE))))","v":""},null,null,{"$f":"IF(G18=0,\"\",INDEX('[3]1847-1949-3347-3581'!$C$17:$C$14007,MATCH(G18,'[3]1847-1949-3347-3581'!$F$17:$F$14007,0)))","v":""},{"$f":"IF(ISNA(IF(H18=0,\"\",CONCATENATE(VLOOKUP(H18,'[3]1847-1949-3347-3581'!$C:$I,6,FALSE),\" \",VLOOKUP(H18,'[3]1847-1949-3347-3581'!$C:$I,7,FALSE)))),\"\",IF(H18=0,\"\",CONCATENATE(VLOOKUP(H18,'[3]1847-1949-3347-3581'!$C:$I,6,FALSE),\" \",VLOOKUP(H18,'[3]1847-1949-3347-3581'!$C:$I,7,FALSE))))","v":""},null,null,{"$f":"IF(K18=0,\"\",INDEX('[3]1847-1949-3347-3581'!$C$17:$C$14007,MATCH(K18,'[3]1847-1949-3347-3581'!$F$17:$F$14007,0)))","v":""},{"$f":"IF(ISNA(IF(L18=0,\"\",CONCATENATE(VLOOKUP(L18,'[3]1847-1949-3347-3581'!$C:$I,6,FALSE),\" \",VLOOKUP(L18,'[3]1847-1949-3347-3581'!$C:$I,7,FALSE)))),\"\",IF(L18=0,\"\",CONCATENATE(VLOOKUP(L18,'[3]1847-1949-3347-3581'!$C:$I,6,FALSE),\" \",VLOOKUP(L18,'[3]1847-1949-3347-3581'!$C:$I,7,FALSE))))","v":""},null,null,{"$f":"IF(O18=0,\"\",INDEX('[3]1847-1949-3347-3581'!$C$17:$C$14007,MATCH(O18,'[3]1847-1949-3347-3581'!$F$17:$F$14007,0)))","v":""},{"$f":"IF(ISNA(IF(P18=0,\"\",CONCATENATE(VLOOKUP(P18,'[3]1847-1949-3347-3581'!$C:$I,6,FALSE),\" \",VLOOKUP(P18,'[3]1847-1949-3347-3581'!$C:$I,7,FALSE)))),\"\",IF(P18=0,\"\",CONCATENATE(VLOOKUP(P18,'[3]1847-1949-3347-3581'!$C:$I,6,FALSE),\" \",VLOOKUP(P18,'[3]1847-1949-3347-3581'!$C:$I,7,FALSE))))","v":""}]
[null,null,null,{"$f":"IF(C19=0,\"\",INDEX('[3]1847-1949-3347-3581'!$C$17:$C$14007,MATCH(C19,'[3]1847-1949-3347-3581'!$F$17:$F$14007,0)))","v":""},{"$f":"IF(ISNA(IF(D19=0,\"\",CONCATENATE(VLOOKUP(D19,'[3]1847-1949-3347-3581'!$C:$I,6,FALSE),\" \",VLOOKUP(D19,'[3]1847-1949-3347-3581'!$C:$I,7,FALSE)))),\"\",IF(D19=0,\"\",CONCATENATE(VLOOKUP(D19,'[3]1847-1949-3347-3581'!$C:$I,6,FALSE),\" \",VLOOKUP(D19,'[3]1847-1949-3347-3581'!$C:$I,7,FALSE))))","v":""},null,null,{"$f":"IF(G19=0,\"\",INDEX('[3]1847-1949-3347-3581'!$C$17:$C$14007,MATCH(G19,'[3]1847-1949-3347-3581'!$F$17:$F$14007,0)))","v":""},{"$f":"IF(ISNA(IF(H19=0,\"\",CONCATENATE(VLOOKUP(H19,'[3]1847-1949-3347-3581'!$C:$I,6,FALSE),\" \",VLOOKUP(H19,'[3]1847-1949-3347-3581'!$C:$I,7,FALSE)))),\"\",IF(H19=0,\"\",CONCATENATE(VLOOKUP(H19,'[3]1847-1949-3347-3581'!$C:$I,6,FALSE),\" \",VLOOKUP(H19,'[3]1847-1949-3347-3581'!$C:$I,7,FALSE))))","v":""},null,null,{"$f":"IF(K19=0,\"\",INDEX('[3]1847-1949-3347-3581'!$C$17:$C$14007,MATCH(K19,'[3]1847-1949-3347-3581'!$F$17:$F$14007,0)))","v":""},{"$f":"IF(ISNA(IF(L19=0,\"\",CONCATENATE(VLOOKUP(L19,'[3]1847-1949-3347-3581'!$C:$I,6,FALSE),\" \",VLOOKUP(L19,'[3]1847-1949-3347-3581'!$C:$I,7,FALSE)))),\"\",IF(L19=0,\"\",CONCATENATE(VLOOKUP(L19,'[3]1847-1949-3347-3581'!$C:$I,6,FALSE),\" \",VLOOKUP(L19,'[3]1847-1949-3347-3581'!$C:$I,7,FALSE))))","v":""},null,null,{"$f":"IF(O19=0,\"\",INDEX('[3]1847-1949-3347-3581'!$C$17:$C$14007,MATCH(O19,'[3]1847-1949-3347-3581'!$F$17:$F$14007,0)))","v":""},{"$f":"IF(ISNA(IF(P19=0,\"\",CONCATENATE(VLOOKUP(P19,'[3]1847-1949-3347-3581'!$C:$I,6,FALSE),\" \",VLOOKUP(P19,'[3]1847-1949-3347-3581'!$C:$I,7,FALSE)))),\"\",IF(P19=0,\"\",CONCATENATE(VLOOKUP(P19,'[3]1847-1949-3347-3581'!$C:$I,6,FALSE),\" \",VLOOKUP(P19,'[3]1847-1949-3347-3581'!$C:$I,7,FALSE))))","v":""}]
["Denutte Jean-Pierre",null,null,{"$f":"IF(C20=0,\"\",INDEX('[3]1847-1949-3347-3581'!$C$17:$C$14007,MATCH(C20,'[3]1847-1949-3347-3581'!$F$17:$F$14007,0)))","v":""},{"$f":"IF(ISNA(IF(D20=0,\"\",CONCATENATE(VLOOKUP(D20,'[3]1847-1949-3347-3581'!$C:$I,6,FALSE),\" \",VLOOKUP(D20,'[3]1847-1949-3347-3581'!$C:$I,7,FALSE)))),\"\",IF(D20=0,\"\",CONCATENATE(VLOOKUP(D20,'[3]1847-1949-3347-3581'!$C:$I,6,FALSE),\" \",VLOOKUP(D20,'[3]1847-1949-3347-3581'!$C:$I,7,FALSE))))","v":""},"1-NBV-134","EX_23_00035",{"$f":"IF(G20=0,\"\",INDEX('[3]1847-1949-3347-3581'!$C$17:$C$14007,MATCH(G20,'[3]1847-1949-3347-3581'!$F$17:$F$14007,0)))","v":"1847/2743"},{"$f":"IF(ISNA(IF(H20=0,\"\",CONCATENATE(VLOOKUP(H20,'[3]1847-1949-3347-3581'!$C:$I,6,FALSE),\" \",VLOOKUP(H20,'[3]1847-1949-3347-3581'!$C:$I,7,FALSE)))),\"\",IF(H20=0,\"\",CONCATENATE(VLOOKUP(H20,'[3]1847-1949-3347-3581'!$C:$I,6,FALSE),\" \",VLOOKUP(H20,'[3]1847-1949-3347-3581'!$C:$I,7,FALSE))))","v":"Herchies chemin à Joncs 1 - 10/400"},null,381616,{"$f":"IF(K20=0,\"\",INDEX('[3]1847-1949-3347-3581'!$C$17:$C$14007,MATCH(K20,'[3]1847-1949-3347-3581'!$F$17:$F$14007,0)))","v":"1847/2566"},{"$f":"IF(ISNA(IF(L20=0,\"\",CONCATENATE(VLOOKUP(L20,'[3]1847-1949-3347-3581'!$C:$I,6,FALSE),\" \",VLOOKUP(L20,'[3]1847-1949-3347-3581'!$C:$I,7,FALSE)))),\"\",IF(L20=0,\"\",CONCATENATE(VLOOKUP(L20,'[3]1847-1949-3347-3581'!$C:$I,6,FALSE),\" \",VLOOKUP(L20,'[3]1847-1949-3347-3581'!$C:$I,7,FALSE))))","v":"Kain  Val de la Résistance "},null,378023,{"$f":"IF(O20=0,\"\",INDEX('[3]1847-1949-3347-3581'!$C$17:$C$14007,MATCH(O20,'[3]1847-1949-3347-3581'!$F$17:$F$14007,0)))","v":"1847/2721"},{"$f":"IF(ISNA(IF(P20=0,\"\",CONCATENATE(VLOOKUP(P20,'[3]1847-1949-3347-3581'!$C:$I,6,FALSE),\" \",VLOOKUP(P20,'[3]1847-1949-3347-3581'!$C:$I,7,FALSE)))),\"\",IF(P20=0,\"\",CONCATENATE(VLOOKUP(P20,'[3]1847-1949-3347-3581'!$C:$I,6,FALSE),\" \",VLOOKUP(P20,'[3]1847-1949-3347-3581'!$C:$I,7,FALSE))))","v":"Estaimpuis Rue de l'Armistice "}]
[479,null,null,{"$f":"IF(C21=0,\"\",INDEX('[3]1847-1949-3347-3581'!$C$17:$C$14007,MATCH(C21,'[3]1847-1949-3347-3581'!$F$17:$F$14007,0)))","v":""},{"$f":"IF(ISNA(IF(D21=0,\"\",CONCATENATE(VLOOKUP(D21,'[3]1847-1949-3347-3581'!$C:$I,6,FALSE),\" \",VLOOKUP(D21,'[3]1847-1949-3347-3581'!$C:$I,7,FALSE)))),\"\",IF(D21=0,\"\",CONCATENATE(VLOOKUP(D21,'[3]1847-1949-3347-3581'!$C:$I,6,FALSE),\" \",VLOOKUP(D21,'[3]1847-1949-3347-3581'!$C:$I,7,FALSE))))","v":""},null,null,{"$f":"IF(G21=0,\"\",INDEX('[3]1847-1949-3347-3581'!$C$17:$C$14007,MATCH(G21,'[3]1847-1949-3347-3581'!$F$17:$F$14007,0)))","v":""},"stop job 10h30",null,"EX_22_05199",{"$f":"IF(K21=0,\"\",INDEX('[3]1847-1949-3347-3581'!$C$17:$C$14007,MATCH(K21,'[3]1847-1949-3347-3581'!$F$17:$F$14007,0)))","v":"1847/2742"},{"$f":"IF(ISNA(IF(L21=0,\"\",CONCATENATE(VLOOKUP(L21,'[3]1847-1949-3347-3581'!$C:$I,6,FALSE),\" \",VLOOKUP(L21,'[3]1847-1949-3347-3581'!$C:$I,7,FALSE)))),\"\",IF(L21=0,\"\",CONCATENATE(VLOOKUP(L21,'[3]1847-1949-3347-3581'!$C:$I,6,FALSE),\" \",VLOOKUP(L21,'[3]1847-1949-3347-3581'!$C:$I,7,FALSE))))","v":"Velaines Rue Delvourgue - redresser poteau béton "},null,null,{"$f":"IF(O21=0,\"\",INDEX('[3]1847-1949-3347-3581'!$C$17:$C$14007,MATCH(O21,'[3]1847-1949-3347-3581'!$F$17:$F$14007,0)))","v":""},{"$f":"IF(ISNA(IF(P21=0,\"\",CONCATENATE(VLOOKUP(P21,'[3]1847-1949-3347-3581'!$C:$I,6,FALSE),\" \",VLOOKUP(P21,'[3]1847-1949-3347-3581'!$C:$I,7,FALSE)))),\"\",IF(P21=0,\"\",CONCATENATE(VLOOKUP(P21,'[3]1847-1949-3347-3581'!$C:$I,6,FALSE),\" \",VLOOKUP(P21,'[3]1847-1949-3347-3581'!$C:$I,7,FALSE))))","v":""}]
[null,null,null,{"$f":"IF(C22=0,\"\",INDEX('[3]1847-1949-3347-3581'!$C$17:$C$14007,MATCH(C22,'[3]1847-1949-3347-3581'!$F$17:$F$14007,0)))","v":""},{"$f":"IF(ISNA(IF(D22=0,\"\",CONCATENATE(VLOOKUP(D22,'[3]1847-1949-3347-3581'!$C:$I,6,FALSE),\" \",VLOOKUP(D22,'[3]1847-1949-3347-3581'!$C:$I,7,FALSE)))),\"\",IF(D22=0,\"\",CONCATENATE(VLOOKUP(D22,'[3]1847-1949-3347-3581'!$C:$I,6,FALSE),\" \",VLOOKUP(D22,'[3]1847-1949-3347-3581'!$C:$I,7,FALSE))))","v":""},null,null,{"$f":"IF(G22=0,\"\",INDEX('[3]1847-1949-3347-3581'!$C$17:$C$14007,MATCH(G22,'[3]1847-1949-3347-3581'!$F$17:$F$14007,0)))","v":""},{"$f":"IF(ISNA(IF(H22=0,\"\",CONCATENATE(VLOOKUP(H22,'[3]1847-1949-3347-3581'!$C:$I,6,FALSE),\" \",VLOOKUP(H22,'[3]1847-1949-3347-3581'!$C:$I,7,FALSE)))),\"\",IF(H22=0,\"\",CONCATENATE(VLOOKUP(H22,'[3]1847-1949-3347-3581'!$C:$I,6,FALSE),\" \",VLOOKUP(H22,'[3]1847-1949-3347-3581'!$C:$I,7,FALSE))))","v":""},null,null,{"$f":"IF(K22=0,\"\",INDEX('[3]1847-1949-3347-3581'!$C$17:$C$14007,MATCH(K22,'[3]1847-1949-3347-3581'!$F$17:$F$14007,0)))","v":""},{"$f":"IF(ISNA(IF(L22=0,\"\",CONCATENATE(VLOOKUP(L22,'[3]1847-1949-3347-3581'!$C:$I,6,FALSE),\" \",VLOOKUP(L22,'[3]1847-1949-3347-3581'!$C:$I,7,FALSE)))),\"\",IF(L22=0,\"\",CONCATENATE(VLOOKUP(L22,'[3]1847-1949-3347-3581'!$C:$I,6,FALSE),\" \",VLOOKUP(L22,'[3]1847-1949-3347-3581'!$C:$I,7,FALSE))))","v":""},null,null,{"$f":"IF(O22=0,\"\",INDEX('[3]1847-1949-3347-3581'!$C$17:$C$14007,MATCH(O22,'[3]1847-1949-3347-3581'!$F$17:$F$14007,0)))","v":""},{"$f":"IF(ISNA(IF(P22=0,\"\",CONCATENATE(VLOOKUP(P22,'[3]1847-1949-3347-3581'!$C:$I,6,FALSE),\" \",VLOOKUP(P22,'[3]1847-1949-3347-3581'!$C:$I,7,FALSE)))),\"\",IF(P22=0,\"\",CONCATENATE(VLOOKUP(P22,'[3]1847-1949-3347-3581'!$C:$I,6,FALSE),\" \",VLOOKUP(P22,'[3]1847-1949-3347-3581'!$C:$I,7,FALSE))))","v":""}]
[null,null,null,{"$f":"IF(C23=0,\"\",INDEX('[3]1847-1949-3347-3581'!$C$17:$C$14007,MATCH(C23,'[3]1847-1949-3347-3581'!$F$17:$F$14007,0)))","v":""},{"$f":"IF(ISNA(IF(D23=0,\"\",CONCATENATE(VLOOKUP(D23,'[3]1847-1949-3347-3581'!$C:$I,6,FALSE),\" \",VLOOKUP(D23,'[3]1847-1949-3347-3581'!$C:$I,7,FALSE)))),\"\",IF(D23=0,\"\",CONCATENATE(VLOOKUP(D23,'[3]1847-1949-3347-3581'!$C:$I,6,FALSE),\" \",VLOOKUP(D23,'[3]1847-1949-3347-3581'!$C:$I,7,FALSE))))","v":""},null,null,{"$f":"IF(G23=0,\"\",INDEX('[3]1847-1949-3347-3581'!$C$17:$C$14007,MATCH(G23,'[3]1847-1949-3347-3581'!$F$17:$F$14007,0)))","v":""},{"$f":"IF(ISNA(IF(H23=0,\"\",CONCATENATE(VLOOKUP(H23,'[3]1847-1949-3347-3581'!$C:$I,6,FALSE),\" \",VLOOKUP(H23,'[3]1847-1949-3347-3581'!$C:$I,7,FALSE)))),\"\",IF(H23=0,\"\",CONCATENATE(VLOOKUP(H23,'[3]1847-1949-3347-3581'!$C:$I,6,FALSE),\" \",VLOOKUP(H23,'[3]1847-1949-3347-3581'!$C:$I,7,FALSE))))","v":""},null,null,{"$f":"IF(K23=0,\"\",INDEX('[3]1847-1949-3347-3581'!$C$17:$C$14007,MATCH(K23,'[3]1847-1949-3347-3581'!$F$17:$F$14007,0)))","v":""},{"$f":"IF(ISNA(IF(L23=0,\"\",CONCATENATE(VLOOKUP(L23,'[3]1847-1949-3347-3581'!$C:$I,6,FALSE),\" \",VLOOKUP(L23,'[3]1847-1949-3347-3581'!$C:$I,7,FALSE)))),\"\",IF(L23=0,\"\",CONCATENATE(VLOOKUP(L23,'[3]1847-1949-3347-3581'!$C:$I,6,FALSE),\" \",VLOOKUP(L23,'[3]1847-1949-3347-3581'!$C:$I,7,FALSE))))","v":""},null,null,{"$f":"IF(O23=0,\"\",INDEX('[3]1847-1949-3347-3581'!$C$17:$C$14007,MATCH(O23,'[3]1847-1949-3347-3581'!$F$17:$F$14007,0)))","v":""},{"$f":"IF(ISNA(IF(P23=0,\"\",CONCATENATE(VLOOKUP(P23,'[3]1847-1949-3347-3581'!$C:$I,6,FALSE),\" \",VLOOKUP(P23,'[3]1847-1949-3347-3581'!$C:$I,7,FALSE)))),\"\",IF(P23=0,\"\",CONCATENATE(VLOOKUP(P23,'[3]1847-1949-3347-3581'!$C:$I,6,FALSE),\" \",VLOOKUP(P23,'[3]1847-1949-3347-3581'!$C:$I,7,FALSE))))","v":""}]
["Desmet Donato",null,null,{"$f":"IF(C24=0,\"\",INDEX('[3]1847-1949-3347-3581'!$C$17:$C$14007,MATCH(C24,'[3]1847-1949-3347-3581'!$F$17:$F$14007,0)))","v":""},{"$f":"IF(ISNA(IF(D24=0,\"\",CONCATENATE(VLOOKUP(D24,'[3]1847-1949-3347-3581'!$C:$I,6,FALSE),\" \",VLOOKUP(D24,'[3]1847-1949-3347-3581'!$C:$I,7,FALSE)))),\"\",IF(D24=0,\"\",CONCATENATE(VLOOKUP(D24,'[3]1847-1949-3347-3581'!$C:$I,6,FALSE),\" \",VLOOKUP(D24,'[3]1847-1949-3347-3581'!$C:$I,7,FALSE))))","v":""},"1-VMA-654",383754,{"$f":"IF(G24=0,\"\",INDEX('[3]1847-1949-3347-3581'!$C$17:$C$14007,MATCH(G24,'[3]1847-1949-3347-3581'!$F$17:$F$14007,0)))","v":"1847/2718"},{"$f":"IF(ISNA(IF(H24=0,\"\",CONCATENATE(VLOOKUP(H24,'[3]1847-1949-3347-3581'!$C:$I,6,FALSE),\" \",VLOOKUP(H24,'[3]1847-1949-3347-3581'!$C:$I,7,FALSE)))),\"\",IF(H24=0,\"\",CONCATENATE(VLOOKUP(H24,'[3]1847-1949-3347-3581'!$C:$I,6,FALSE),\" \",VLOOKUP(H24,'[3]1847-1949-3347-3581'!$C:$I,7,FALSE))))","v":"Bassilly Rue Warissaet"},"1-NBV-173",383515,{"$f":"IF(K24=0,\"\",INDEX('[3]1847-1949-3347-3581'!$C$17:$C$14007,MATCH(K24,'[3]1847-1949-3347-3581'!$F$17:$F$14007,0)))","v":"1847/2714"},{"$f":"IF(ISNA(IF(L24=0,\"\",CONCATENATE(VLOOKUP(L24,'[3]1847-1949-3347-3581'!$C:$I,6,FALSE),\" \",VLOOKUP(L24,'[3]1847-1949-3347-3581'!$C:$I,7,FALSE)))),\"\",IF(L24=0,\"\",CONCATENATE(VLOOKUP(L24,'[3]1847-1949-3347-3581'!$C:$I,6,FALSE),\" \",VLOOKUP(L24,'[3]1847-1949-3347-3581'!$C:$I,7,FALSE))))","v":"Bruyelle Chaussée de Tournai 39"},null,null,"0001/0040",{"$f":"IF(ISNA(IF(P24=0,\"\",CONCATENATE(VLOOKUP(P24,'[3]1847-1949-3347-3581'!$C:$I,6,FALSE),\" \",VLOOKUP(P24,'[3]1847-1949-3347-3581'!$C:$I,7,FALSE)))),\"\",IF(P24=0,\"\",CONCATENATE(VLOOKUP(P24,'[3]1847-1949-3347-3581'!$C:$I,6,FALSE),\" \",VLOOKUP(P24,'[3]1847-1949-3347-3581'!$C:$I,7,FALSE))))","v":"Visite médicale"}]
[9419,null,null,{"$f":"IF(C25=0,\"\",INDEX('[3]1847-1949-3347-3581'!$C$17:$C$14007,MATCH(C25,'[3]1847-1949-3347-3581'!$F$17:$F$14007,0)))","v":""},{"$f":"IF(ISNA(IF(D25=0,\"\",CONCATENATE(VLOOKUP(D25,'[3]1847-1949-3347-3581'!$C:$I,6,FALSE),\" \",VLOOKUP(D25,'[3]1847-1949-3347-3581'!$C:$I,7,FALSE)))),\"\",IF(D25=0,\"\",CONCATENATE(VLOOKUP(D25,'[3]1847-1949-3347-3581'!$C:$I,6,FALSE),\" \",VLOOKUP(D25,'[3]1847-1949-3347-3581'!$C:$I,7,FALSE))))","v":""},null,null,{"$f":"IF(G25=0,\"\",INDEX('[3]1847-1949-3347-3581'!$C$17:$C$14007,MATCH(G25,'[3]1847-1949-3347-3581'!$F$17:$F$14007,0)))","v":""},{"$f":"IF(ISNA(IF(H25=0,\"\",CONCATENATE(VLOOKUP(H25,'[3]1847-1949-3347-3581'!$C:$I,6,FALSE),\" \",VLOOKUP(H25,'[3]1847-1949-3347-3581'!$C:$I,7,FALSE)))),\"\",IF(H25=0,\"\",CONCATENATE(VLOOKUP(H25,'[3]1847-1949-3347-3581'!$C:$I,6,FALSE),\" \",VLOOKUP(H25,'[3]1847-1949-3347-3581'!$C:$I,7,FALSE))))","v":""},null,null,{"$f":"IF(K25=0,\"\",INDEX('[3]1847-1949-3347-3581'!$C$17:$C$14007,MATCH(K25,'[3]1847-1949-3347-3581'!$F$17:$F$14007,0)))","v":""},{"$f":"IF(ISNA(IF(L25=0,\"\",CONCATENATE(VLOOKUP(L25,'[3]1847-1949-3347-3581'!$C:$I,6,FALSE),\" \",VLOOKUP(L25,'[3]1847-1949-3347-3581'!$C:$I,7,FALSE)))),\"\",IF(L25=0,\"\",CONCATENATE(VLOOKUP(L25,'[3]1847-1949-3347-3581'!$C:$I,6,FALSE),\" \",VLOOKUP(L25,'[3]1847-1949-3347-3581'!$C:$I,7,FALSE))))","v":""},null,null,{"$f":"IF(O25=0,\"\",INDEX('[3]1847-1949-3347-3581'!$C$17:$C$14007,MATCH(O25,'[3]1847-1949-3347-3581'!$F$17:$F$14007,0)))","v":""},"14h15"]
[null,null,null,{"$f":"IF(C26=0,\"\",INDEX('[3]1847-1949-3347-3581'!$C$17:$C$14007,MATCH(C26,'[3]1847-1949-3347-3581'!$F$17:$F$14007,0)))","v":""},{"$f":"IF(ISNA(IF(D26=0,\"\",CONCATENATE(VLOOKUP(D26,'[3]1847-1949-3347-3581'!$C:$I,6,FALSE),\" \",VLOOKUP(D26,'[3]1847-1949-3347-3581'!$C:$I,7,FALSE)))),\"\",IF(D26=0,\"\",CONCATENATE(VLOOKUP(D26,'[3]1847-1949-3347-3581'!$C:$I,6,FALSE),\" \",VLOOKUP(D26,'[3]1847-1949-3347-3581'!$C:$I,7,FALSE))))","v":""},null,null,{"$f":"IF(G26=0,\"\",INDEX('[3]1847-1949-3347-3581'!$C$17:$C$14007,MATCH(G26,'[3]1847-1949-3347-3581'!$F$17:$F$14007,0)))","v":""},{"$f":"IF(ISNA(IF(H26=0,\"\",CONCATENATE(VLOOKUP(H26,'[3]1847-1949-3347-3581'!$C:$I,6,FALSE),\" \",VLOOKUP(H26,'[3]1847-1949-3347-3581'!$C:$I,7,FALSE)))),\"\",IF(H26=0,\"\",CONCATENATE(VLOOKUP(H26,'[3]1847-1949-3347-3581'!$C:$I,6,FALSE),\" \",VLOOKUP(H26,'[3]1847-1949-3347-3581'!$C:$I,7,FALSE))))","v":""},null,null,{"$f":"IF(K26=0,\"\",INDEX('[3]1847-1949-3347-3581'!$C$17:$C$14007,MATCH(K26,'[3]1847-1949-3347-3581'!$F$17:$F$14007,0)))","v":""},{"$f":"IF(ISNA(IF(L26=0,\"\",CONCATENATE(VLOOKUP(L26,'[3]1847-1949-3347-3581'!$C:$I,6,FALSE),\" \",VLOOKUP(L26,'[3]1847-1949-3347-3581'!$C:$I,7,FALSE)))),\"\",IF(L26=0,\"\",CONCATENATE(VLOOKUP(L26,'[3]1847-1949-3347-3581'!$C:$I,6,FALSE),\" \",VLOOKUP(L26,'[3]1847-1949-3347-3581'!$C:$I,7,FALSE))))","v":""},null,null,{"$f":"IF(O26=0,\"\",INDEX('[3]1847-1949-3347-3581'!$C$17:$C$14007,MATCH(O26,'[3]1847-1949-3347-3581'!$F$17:$F$14007,0)))","v":""},{"$f":"IF(ISNA(IF(P26=0,\"\",CONCATENATE(VLOOKUP(P26,'[3]1847-1949-3347-3581'!$C:$I,6,FALSE),\" \",VLOOKUP(P26,'[3]1847-1949-3347-3581'!$C:$I,7,FALSE)))),\"\",IF(P26=0,\"\",CONCATENATE(VLOOKUP(P26,'[3]1847-1949-3347-3581'!$C:$I,6,FALSE),\" \",VLOOKUP(P26,'[3]1847-1949-3347-3581'!$C:$I,7,FALSE))))","v":""}]
[null,null,null,{"$f":"IF(C27=0,\"\",INDEX('[3]1847-1949-3347-3581'!$C$17:$C$14007,MATCH(C27,'[3]1847-1949-3347-3581'!$F$17:$F$14007,0)))","v":""},{"$f":"IF(ISNA(IF(D27=0,\"\",CONCATENATE(VLOOKUP(D27,'[3]1847-1949-3347-3581'!$C:$I,6,FALSE),\" \",VLOOKUP(D27,'[3]1847-1949-3347-3581'!$C:$I,7,FALSE)))),\"\",IF(D27=0,\"\",CONCATENATE(VLOOKUP(D27,'[3]1847-1949-3347-3581'!$C:$I,6,FALSE),\" \",VLOOKUP(D27,'[3]1847-1949-3347-3581'!$C:$I,7,FALSE))))","v":""},null,null,{"$f":"IF(G27=0,\"\",INDEX('[3]1847-1949-3347-3581'!$C$17:$C$14007,MATCH(G27,'[3]1847-1949-3347-3581'!$F$17:$F$14007,0)))","v":""},{"$f":"IF(ISNA(IF(H27=0,\"\",CONCATENATE(VLOOKUP(H27,'[3]1847-1949-3347-3581'!$C:$I,6,FALSE),\" \",VLOOKUP(H27,'[3]1847-1949-3347-3581'!$C:$I,7,FALSE)))),\"\",IF(H27=0,\"\",CONCATENATE(VLOOKUP(H27,'[3]1847-1949-3347-3581'!$C:$I,6,FALSE),\" \",VLOOKUP(H27,'[3]1847-1949-3347-3581'!$C:$I,7,FALSE))))","v":""},null,null,{"$f":"IF(K27=0,\"\",INDEX('[3]1847-1949-3347-3581'!$C$17:$C$14007,MATCH(K27,'[3]1847-1949-3347-3581'!$F$17:$F$14007,0)))","v":""},{"$f":"IF(ISNA(IF(L27=0,\"\",CONCATENATE(VLOOKUP(L27,'[3]1847-1949-3347-3581'!$C:$I,6,FALSE),\" \",VLOOKUP(L27,'[3]1847-1949-3347-3581'!$C:$I,7,FALSE)))),\"\",IF(L27=0,\"\",CONCATENATE(VLOOKUP(L27,'[3]1847-1949-3347-3581'!$C:$I,6,FALSE),\" \",VLOOKUP(L27,'[3]1847-1949-3347-3581'!$C:$I,7,FALSE))))","v":""},null,null,{"$f":"IF(O27=0,\"\",INDEX('[3]1847-1949-3347-3581'!$C$17:$C$14007,MATCH(O27,'[3]1847-1949-3347-3581'!$F$17:$F$14007,0)))","v":""},{"$f":"IF(ISNA(IF(P27=0,\"\",CONCATENATE(VLOOKUP(P27,'[3]1847-1949-3347-3581'!$C:$I,6,FALSE),\" \",VLOOKUP(P27,'[3]1847-1949-3347-3581'!$C:$I,7,FALSE)))),\"\",IF(P27=0,\"\",CONCATENATE(VLOOKUP(P27,'[3]1847-1949-3347-3581'!$C:$I,6,FALSE),\" \",VLOOKUP(P27,'[3]1847-1949-3347-3581'!$C:$I,7,FALSE))))","v":""}]
["Desse Fabien",null,null,null,{"$f":"IF(ISNA(IF(D28=0,\"\",CONCATENATE(VLOOKUP(D28,'[3]1847-1949-3347-3581'!$C:$I,6,FALSE),\" \",VLOOKUP(D28,'[3]1847-1949-3347-3581'!$C:$I,7,FALSE)))),\"\",IF(D28=0,\"\",CONCATENATE(VLOOKUP(D28,'[3]1847-1949-3347-3581'!$C:$I,6,FALSE),\" \",VLOOKUP(D28,'[3]1847-1949-3347-3581'!$C:$I,7,FALSE))))","v":""},"2-CBN-005",null,"5418/0000",{"$f":"IF(ISNA(IF(H28=0,\"\",CONCATENATE(VLOOKUP(H28,'[3]1847-1949-3347-3581'!$C:$I,6,FALSE),\" \",VLOOKUP(H28,'[3]1847-1949-3347-3581'!$C:$I,7,FALSE)))),\"\",IF(H28=0,\"\",CONCATENATE(VLOOKUP(H28,'[3]1847-1949-3347-3581'!$C:$I,6,FALSE),\" \",VLOOKUP(H28,'[3]1847-1949-3347-3581'!$C:$I,7,FALSE))))","v":"MONS Ores Compteurs"},"2-CBN-005",null,"5418/0000",{"$f":"IF(ISNA(IF(L28=0,\"\",CONCATENATE(VLOOKUP(L28,'[3]1847-1949-3347-3581'!$C:$I,6,FALSE),\" \",VLOOKUP(L28,'[3]1847-1949-3347-3581'!$C:$I,7,FALSE)))),\"\",IF(L28=0,\"\",CONCATENATE(VLOOKUP(L28,'[3]1847-1949-3347-3581'!$C:$I,6,FALSE),\" \",VLOOKUP(L28,'[3]1847-1949-3347-3581'!$C:$I,7,FALSE))))","v":"MONS Ores Compteurs"},"2-CBN-005",null,"5418/0000",{"$f":"IF(ISNA(IF(P28=0,\"\",CONCATENATE(VLOOKUP(P28,'[3]1847-1949-3347-3581'!$C:$I,6,FALSE),\" \",VLOOKUP(P28,'[3]1847-1949-3347-3581'!$C:$I,7,FALSE)))),\"\",IF(P28=0,\"\",CONCATENATE(VLOOKUP(P28,'[3]1847-1949-3347-3581'!$C:$I,6,FALSE),\" \",VLOOKUP(P28,'[3]1847-1949-3347-3581'!$C:$I,7,FALSE))))","v":"MONS Ores Compteurs"}]
[9215,null,null,{"$f":"IF(C29=0,\"\",INDEX('[3]1847-1949-3347-3581'!$C$17:$C$14007,MATCH(C29,'[3]1847-1949-3347-3581'!$F$17:$F$14007,0)))","v":""},{"$f":"IF(ISNA(IF(D29=0,\"\",CONCATENATE(VLOOKUP(D29,'[3]1847-1949-3347-3581'!$C:$I,6,FALSE),\" \",VLOOKUP(D29,'[3]1847-1949-3347-3581'!$C:$I,7,FALSE)))),\"\",IF(D29=0,\"\",CONCATENATE(VLOOKUP(D29,'[3]1847-1949-3347-3581'!$C:$I,6,FALSE),\" \",VLOOKUP(D29,'[3]1847-1949-3347-3581'!$C:$I,7,FALSE))))","v":""},null,null,{"$f":"IF(G29=0,\"\",INDEX('[3]1847-1949-3347-3581'!$C$17:$C$14007,MATCH(G29,'[3]1847-1949-3347-3581'!$F$17:$F$14007,0)))","v":""},{"$f":"IF(ISNA(IF(H29=0,\"\",CONCATENATE(VLOOKUP(H29,'[3]1847-1949-3347-3581'!$C:$I,6,FALSE),\" \",VLOOKUP(H29,'[3]1847-1949-3347-3581'!$C:$I,7,FALSE)))),\"\",IF(H29=0,\"\",CONCATENATE(VLOOKUP(H29,'[3]1847-1949-3347-3581'!$C:$I,6,FALSE),\" \",VLOOKUP(H29,'[3]1847-1949-3347-3581'!$C:$I,7,FALSE))))","v":""},null,null,{"$f":"IF(K29=0,\"\",INDEX('[3]1847-1949-3347-3581'!$C$17:$C$14007,MATCH(K29,'[3]1847-1949-3347-3581'!$F$17:$F$14007,0)))","v":""},{"$f":"IF(ISNA(IF(L29=0,\"\",CONCATENATE(VLOOKUP(L29,'[3]1847-1949-3347-3581'!$C:$I,6,FALSE),\" \",VLOOKUP(L29,'[3]1847-1949-3347-3581'!$C:$I,7,FALSE)))),\"\",IF(L29=0,\"\",CONCATENATE(VLOOKUP(L29,'[3]1847-1949-3347-3581'!$C:$I,6,FALSE),\" \",VLOOKUP(L29,'[3]1847-1949-3347-3581'!$C:$I,7,FALSE))))","v":""},null,null,"0001/0040",{"$f":"IF(ISNA(IF(P29=0,\"\",CONCATENATE(VLOOKUP(P29,'[3]1847-1949-3347-3581'!$C:$I,6,FALSE),\" \",VLOOKUP(P29,'[3]1847-1949-3347-3581'!$C:$I,7,FALSE)))),\"\",IF(P29=0,\"\",CONCATENATE(VLOOKUP(P29,'[3]1847-1949-3347-3581'!$C:$I,6,FALSE),\" \",VLOOKUP(P29,'[3]1847-1949-3347-3581'!$C:$I,7,FALSE))))","v":"Visite médicale"}]
[null,null,null,{"$f":"IF(C30=0,\"\",INDEX('[3]1847-1949-3347-3581'!$C$17:$C$14007,MATCH(C30,'[3]1847-1949-3347-3581'!$F$17:$F$14007,0)))","v":""},{"$f":"IF(ISNA(IF(D30=0,\"\",CONCATENATE(VLOOKUP(D30,'[3]1847-1949-3347-3581'!$C:$I,6,FALSE),\" \",VLOOKUP(D30,'[3]1847-1949-3347-3581'!$C:$I,7,FALSE)))),\"\",IF(D30=0,\"\",CONCATENATE(VLOOKUP(D30,'[3]1847-1949-3347-3581'!$C:$I,6,FALSE),\" \",VLOOKUP(D30,'[3]1847-1949-3347-3581'!$C:$I,7,FALSE))))","v":""},null,null,{"$f":"IF(G30=0,\"\",INDEX('[3]1847-1949-3347-3581'!$C$17:$C$14007,MATCH(G30,'[3]1847-1949-3347-3581'!$F$17:$F$14007,0)))","v":""},{"$f":"IF(ISNA(IF(H30=0,\"\",CONCATENATE(VLOOKUP(H30,'[3]1847-1949-3347-3581'!$C:$I,6,FALSE),\" \",VLOOKUP(H30,'[3]1847-1949-3347-3581'!$C:$I,7,FALSE)))),\"\",IF(H30=0,\"\",CONCATENATE(VLOOKUP(H30,'[3]1847-1949-3347-3581'!$C:$I,6,FALSE),\" \",VLOOKUP(H30,'[3]1847-1949-3347-3581'!$C:$I,7,FALSE))))","v":""},null,null,{"$f":"IF(K30=0,\"\",INDEX('[3]1847-1949-3347-3581'!$C$17:$C$14007,MATCH(K30,'[3]1847-1949-3347-3581'!$F$17:$F$14007,0)))","v":""},{"$f":"IF(ISNA(IF(L30=0,\"\",CONCATENATE(VLOOKUP(L30,'[3]1847-1949-3347-3581'!$C:$I,6,FALSE),\" \",VLOOKUP(L30,'[3]1847-1949-3347-3581'!$C:$I,7,FALSE)))),\"\",IF(L30=0,\"\",CONCATENATE(VLOOKUP(L30,'[3]1847-1949-3347-3581'!$C:$I,6,FALSE),\" \",VLOOKUP(L30,'[3]1847-1949-3347-3581'!$C:$I,7,FALSE))))","v":""},null,null,{"$f":"IF(O30=0,\"\",INDEX('[3]1847-1949-3347-3581'!$C$17:$C$14007,MATCH(O30,'[3]1847-1949-3347-3581'!$F$17:$F$14007,0)))","v":""},"14h30"]
[null,null,null,{"$f":"IF(C31=0,\"\",INDEX('[3]1847-1949-3347-3581'!$C$17:$C$14007,MATCH(C31,'[3]1847-1949-3347-3581'!$F$17:$F$14007,0)))","v":""},{"$f":"IF(ISNA(IF(D31=0,\"\",CONCATENATE(VLOOKUP(D31,'[3]1847-1949-3347-3581'!$C:$I,6,FALSE),\" \",VLOOKUP(D31,'[3]1847-1949-3347-3581'!$C:$I,7,FALSE)))),\"\",IF(D31=0,\"\",CONCATENATE(VLOOKUP(D31,'[3]1847-1949-3347-3581'!$C:$I,6,FALSE),\" \",VLOOKUP(D31,'[3]1847-1949-3347-3581'!$C:$I,7,FALSE))))","v":""},null,null,{"$f":"IF(G31=0,\"\",INDEX('[3]1847-1949-3347-3581'!$C$17:$C$14007,MATCH(G31,'[3]1847-1949-3347-3581'!$F$17:$F$14007,0)))","v":""},{"$f":"IF(ISNA(IF(H31=0,\"\",CONCATENATE(VLOOKUP(H31,'[3]1847-1949-3347-3581'!$C:$I,6,FALSE),\" \",VLOOKUP(H31,'[3]1847-1949-3347-3581'!$C:$I,7,FALSE)))),\"\",IF(H31=0,\"\",CONCATENATE(VLOOKUP(H31,'[3]1847-1949-3347-3581'!$C:$I,6,FALSE),\" \",VLOOKUP(H31,'[3]1847-1949-3347-3581'!$C:$I,7,FALSE))))","v":""},null,null,{"$f":"IF(K31=0,\"\",INDEX('[3]1847-1949-3347-3581'!$C$17:$C$14007,MATCH(K31,'[3]1847-1949-3347-3581'!$F$17:$F$14007,0)))","v":""},{"$f":"IF(ISNA(IF(L31=0,\"\",CONCATENATE(VLOOKUP(L31,'[3]1847-1949-3347-3581'!$C:$I,6,FALSE),\" \",VLOOKUP(L31,'[3]1847-1949-3347-3581'!$C:$I,7,FALSE)))),\"\",IF(L31=0,\"\",CONCATENATE(VLOOKUP(L31,'[3]1847-1949-3347-3581'!$C:$I,6,FALSE),\" \",VLOOKUP(L31,'[3]1847-1949-3347-3581'!$C:$I,7,FALSE))))","v":""},null,null,{"$f":"IF(O31=0,\"\",INDEX('[3]1847-1949-3347-3581'!$C$17:$C$14007,MATCH(O31,'[3]1847-1949-3347-3581'!$F$17:$F$14007,0)))","v":""},{"$f":"IF(ISNA(IF(P31=0,\"\",CONCATENATE(VLOOKUP(P31,'[3]1847-1949-3347-3581'!$C:$I,6,FALSE),\" \",VLOOKUP(P31,'[3]1847-1949-3347-3581'!$C:$I,7,FALSE)))),\"\",IF(P31=0,\"\",CONCATENATE(VLOOKUP(P31,'[3]1847-1949-3347-3581'!$C:$I,6,FALSE),\" \",VLOOKUP(P31,'[3]1847-1949-3347-3581'!$C:$I,7,FALSE))))","v":""}]
["Duhaut Hubert",null,null,null,{"$f":"IF(ISNA(IF(D32=0,\"\",CONCATENATE(VLOOKUP(D32,'[3]1847-1949-3347-3581'!$C:$I,6,FALSE),\" \",VLOOKUP(D32,'[3]1847-1949-3347-3581'!$C:$I,7,FALSE)))),\"\",IF(D32=0,\"\",CONCATENATE(VLOOKUP(D32,'[3]1847-1949-3347-3581'!$C:$I,6,FALSE),\" \",VLOOKUP(D32,'[3]1847-1949-3347-3581'!$C:$I,7,FALSE))))","v":""},"1-NKK-366",null,"5419/0000",{"$f":"IF(ISNA(IF(H32=0,\"\",CONCATENATE(VLOOKUP(H32,'[3]1847-1949-3347-3581'!$C:$I,6,FALSE),\" \",VLOOKUP(H32,'[3]1847-1949-3347-3581'!$C:$I,7,FALSE)))),\"\",IF(H32=0,\"\",CONCATENATE(VLOOKUP(H32,'[3]1847-1949-3347-3581'!$C:$I,6,FALSE),\" \",VLOOKUP(H32,'[3]1847-1949-3347-3581'!$C:$I,7,FALSE))))","v":"WAPI Ores Compteurs"},"1-NKK-366",null,"5419/0000",{"$f":"IF(ISNA(IF(L32=0,\"\",CONCATENATE(VLOOKUP(L32,'[3]1847-1949-3347-3581'!$C:$I,6,FALSE),\" \",VLOOKUP(L32,'[3]1847-1949-3347-3581'!$C:$I,7,FALSE)))),\"\",IF(L32=0,\"\",CONCATENATE(VLOOKUP(L32,'[3]1847-1949-3347-3581'!$C:$I,6,FALSE),\" \",VLOOKUP(L32,'[3]1847-1949-3347-3581'!$C:$I,7,FALSE))))","v":"WAPI Ores Compteurs"},"1-NKK-366",null,"5419/0000",{"$f":"IF(ISNA(IF(P32=0,\"\",CONCATENATE(VLOOKUP(P32,'[3]1847-1949-3347-3581'!$C:$I,6,FALSE),\" \",VLOOKUP(P32,'[3]1847-1949-3347-3581'!$C:$I,7,FALSE)))),\"\",IF(P32=0,\"\",CONCATENATE(VLOOKUP(P32,'[3]1847-1949-3347-3581'!$C:$I,6,FALSE),\" \",VLOOKUP(P32,'[3]1847-1949-3347-3581'!$C:$I,7,FALSE))))","v":"WAPI Ores Compteurs"}]
[null,null,null,{"$f":"IF(C33=0,\"\",INDEX('[3]1847-1949-3347-3581'!$C$17:$C$14007,MATCH(C33,'[3]1847-1949-3347-3581'!$F$17:$F$14007,0)))","v":""},{"$f":"IF(ISNA(IF(D33=0,\"\",CONCATENATE(VLOOKUP(D33,'[3]1847-1949-3347-3581'!$C:$I,6,FALSE),\" \",VLOOKUP(D33,'[3]1847-1949-3347-3581'!$C:$I,7,FALSE)))),\"\",IF(D33=0,\"\",CONCATENATE(VLOOKUP(D33,'[3]1847-1949-3347-3581'!$C:$I,6,FALSE),\" \",VLOOKUP(D33,'[3]1847-1949-3347-3581'!$C:$I,7,FALSE))))","v":""},null,null,{"$f":"IF(G33=0,\"\",INDEX('[3]1847-1949-3347-3581'!$C$17:$C$14007,MATCH(G33,'[3]1847-1949-3347-3581'!$F$17:$F$14007,0)))","v":""},{"$f":"IF(ISNA(IF(H33=0,\"\",CONCATENATE(VLOOKUP(H33,'[3]1847-1949-3347-3581'!$C:$I,6,FALSE),\" \",VLOOKUP(H33,'[3]1847-1949-3347-3581'!$C:$I,7,FALSE)))),\"\",IF(H33=0,\"\",CONCATENATE(VLOOKUP(H33,'[3]1847-1949-3347-3581'!$C:$I,6,FALSE),\" \",VLOOKUP(H33,'[3]1847-1949-3347-3581'!$C:$I,7,FALSE))))","v":""},null,null,{"$f":"IF(K33=0,\"\",INDEX('[3]1847-1949-3347-3581'!$C$17:$C$14007,MATCH(K33,'[3]1847-1949-3347-3581'!$F$17:$F$14007,0)))","v":""},{"$f":"IF(ISNA(IF(L33=0,\"\",CONCATENATE(VLOOKUP(L33,'[3]1847-1949-3347-3581'!$C:$I,6,FALSE),\" \",VLOOKUP(L33,'[3]1847-1949-3347-3581'!$C:$I,7,FALSE)))),\"\",IF(L33=0,\"\",CONCATENATE(VLOOKUP(L33,'[3]1847-1949-3347-3581'!$C:$I,6,FALSE),\" \",VLOOKUP(L33,'[3]1847-1949-3347-3581'!$C:$I,7,FALSE))))","v":""},null,null,{"$f":"IF(O33=0,\"\",INDEX('[3]1847-1949-3347-3581'!$C$17:$C$14007,MATCH(O33,'[3]1847-1949-3347-3581'!$F$17:$F$14007,0)))","v":""},{"$f":"IF(ISNA(IF(P33=0,\"\",CONCATENATE(VLOOKUP(P33,'[3]1847-1949-3347-3581'!$C:$I,6,FALSE),\" \",VLOOKUP(P33,'[3]1847-1949-3347-3581'!$C:$I,7,FALSE)))),\"\",IF(P33=0,\"\",CONCATENATE(VLOOKUP(P33,'[3]1847-1949-3347-3581'!$C:$I,6,FALSE),\" \",VLOOKUP(P33,'[3]1847-1949-3347-3581'!$C:$I,7,FALSE))))","v":""}]
[null,null,null,{"$f":"IF(C34=0,\"\",INDEX('[3]1847-1949-3347-3581'!$C$17:$C$14007,MATCH(C34,'[3]1847-1949-3347-3581'!$F$17:$F$14007,0)))","v":""},{"$f":"IF(ISNA(IF(D34=0,\"\",CONCATENATE(VLOOKUP(D34,'[3]1847-1949-3347-3581'!$C:$I,6,FALSE),\" \",VLOOKUP(D34,'[3]1847-1949-3347-3581'!$C:$I,7,FALSE)))),\"\",IF(D34=0,\"\",CONCATENATE(VLOOKUP(D34,'[3]1847-1949-3347-3581'!$C:$I,6,FALSE),\" \",VLOOKUP(D34,'[3]1847-1949-3347-3581'!$C:$I,7,FALSE))))","v":""},null,null,{"$f":"IF(G34=0,\"\",INDEX('[3]1847-1949-3347-3581'!$C$17:$C$14007,MATCH(G34,'[3]1847-1949-3347-3581'!$F$17:$F$14007,0)))","v":""},{"$f":"IF(ISNA(IF(H34=0,\"\",CONCATENATE(VLOOKUP(H34,'[3]1847-1949-3347-3581'!$C:$I,6,FALSE),\" \",VLOOKUP(H34,'[3]1847-1949-3347-3581'!$C:$I,7,FALSE)))),\"\",IF(H34=0,\"\",CONCATENATE(VLOOKUP(H34,'[3]1847-1949-3347-3581'!$C:$I,6,FALSE),\" \",VLOOKUP(H34,'[3]1847-1949-3347-3581'!$C:$I,7,FALSE))))","v":""},null,null,{"$f":"IF(K34=0,\"\",INDEX('[3]1847-1949-3347-3581'!$C$17:$C$14007,MATCH(K34,'[3]1847-1949-3347-3581'!$F$17:$F$14007,0)))","v":""},{"$f":"IF(ISNA(IF(L34=0,\"\",CONCATENATE(VLOOKUP(L34,'[3]1847-1949-3347-3581'!$C:$I,6,FALSE),\" \",VLOOKUP(L34,'[3]1847-1949-3347-3581'!$C:$I,7,FALSE)))),\"\",IF(L34=0,\"\",CONCATENATE(VLOOKUP(L34,'[3]1847-1949-3347-3581'!$C:$I,6,FALSE),\" \",VLOOKUP(L34,'[3]1847-1949-3347-3581'!$C:$I,7,FALSE))))","v":""},null,null,{"$f":"IF(O34=0,\"\",INDEX('[3]1847-1949-3347-3581'!$C$17:$C$14007,MATCH(O34,'[3]1847-1949-3347-3581'!$F$17:$F$14007,0)))","v":""},{"$f":"IF(ISNA(IF(P34=0,\"\",CONCATENATE(VLOOKUP(P34,'[3]1847-1949-3347-3581'!$C:$I,6,FALSE),\" \",VLOOKUP(P34,'[3]1847-1949-3347-3581'!$C:$I,7,FALSE)))),\"\",IF(P34=0,\"\",CONCATENATE(VLOOKUP(P34,'[3]1847-1949-3347-3581'!$C:$I,6,FALSE),\" \",VLOOKUP(P34,'[3]1847-1949-3347-3581'!$C:$I,7,FALSE))))","v":""}]
[null,null,null,{"$f":"IF(C35=0,\"\",INDEX('[3]1847-1949-3347-3581'!$C$17:$C$14007,MATCH(C35,'[3]1847-1949-3347-3581'!$F$17:$F$14007,0)))","v":""},{"$f":"IF(ISNA(IF(D35=0,\"\",CONCATENATE(VLOOKUP(D35,'[3]1847-1949-3347-3581'!$C:$I,6,FALSE),\" \",VLOOKUP(D35,'[3]1847-1949-3347-3581'!$C:$I,7,FALSE)))),\"\",IF(D35=0,\"\",CONCATENATE(VLOOKUP(D35,'[3]1847-1949-3347-3581'!$C:$I,6,FALSE),\" \",VLOOKUP(D35,'[3]1847-1949-3347-3581'!$C:$I,7,FALSE))))","v":""},null,null,{"$f":"IF(G35=0,\"\",INDEX('[3]1847-1949-3347-3581'!$C$17:$C$14007,MATCH(G35,'[3]1847-1949-3347-3581'!$F$17:$F$14007,0)))","v":""},{"$f":"IF(ISNA(IF(H35=0,\"\",CONCATENATE(VLOOKUP(H35,'[3]1847-1949-3347-3581'!$C:$I,6,FALSE),\" \",VLOOKUP(H35,'[3]1847-1949-3347-3581'!$C:$I,7,FALSE)))),\"\",IF(H35=0,\"\",CONCATENATE(VLOOKUP(H35,'[3]1847-1949-3347-3581'!$C:$I,6,FALSE),\" \",VLOOKUP(H35,'[3]1847-1949-3347-3581'!$C:$I,7,FALSE))))","v":""},null,null,{"$f":"IF(K35=0,\"\",INDEX('[3]1847-1949-3347-3581'!$C$17:$C$14007,MATCH(K35,'[3]1847-1949-3347-3581'!$F$17:$F$14007,0)))","v":""},{"$f":"IF(ISNA(IF(L35=0,\"\",CONCATENATE(VLOOKUP(L35,'[3]1847-1949-3347-3581'!$C:$I,6,FALSE),\" \",VLOOKUP(L35,'[3]1847-1949-3347-3581'!$C:$I,7,FALSE)))),\"\",IF(L35=0,\"\",CONCATENATE(VLOOKUP(L35,'[3]1847-1949-3347-3581'!$C:$I,6,FALSE),\" \",VLOOKUP(L35,'[3]1847-1949-3347-3581'!$C:$I,7,FALSE))))","v":""},null,null,{"$f":"IF(O35=0,\"\",INDEX('[3]1847-1949-3347-3581'!$C$17:$C$14007,MATCH(O35,'[3]1847-1949-3347-3581'!$F$17:$F$14007,0)))","v":""},{"$f":"IF(ISNA(IF(P35=0,\"\",CONCATENATE(VLOOKUP(P35,'[3]1847-1949-3347-3581'!$C:$I,6,FALSE),\" \",VLOOKUP(P35,'[3]1847-1949-3347-3581'!$C:$I,7,FALSE)))),\"\",IF(P35=0,\"\",CONCATENATE(VLOOKUP(P35,'[3]1847-1949-3347-3581'!$C:$I,6,FALSE),\" \",VLOOKUP(P35,'[3]1847-1949-3347-3581'!$C:$I,7,FALSE))))","v":""}]
["François Frédéric",null,null,{"$f":"IF(C36=0,\"\",INDEX('[3]1847-1949-3347-3581'!$C$17:$C$14007,MATCH(C36,'[3]1847-1949-3347-3581'!$F$17:$F$14007,0)))","v":""},{"$f":"IF(ISNA(IF(D36=0,\"\",CONCATENATE(VLOOKUP(D36,'[3]1847-1949-3347-3581'!$C:$I,6,FALSE),\" \",VLOOKUP(D36,'[3]1847-1949-3347-3581'!$C:$I,7,FALSE)))),\"\",IF(D36=0,\"\",CONCATENATE(VLOOKUP(D36,'[3]1847-1949-3347-3581'!$C:$I,6,FALSE),\" \",VLOOKUP(D36,'[3]1847-1949-3347-3581'!$C:$I,7,FALSE))))","v":""},"1-NTH-884","EX_23_00035",{"$f":"IF(G36=0,\"\",INDEX('[3]1847-1949-3347-3581'!$C$17:$C$14007,MATCH(G36,'[3]1847-1949-3347-3581'!$F$17:$F$14007,0)))","v":"1847/2743"},{"$f":"IF(ISNA(IF(H36=0,\"\",CONCATENATE(VLOOKUP(H36,'[3]1847-1949-3347-3581'!$C:$I,6,FALSE),\" \",VLOOKUP(H36,'[3]1847-1949-3347-3581'!$C:$I,7,FALSE)))),\"\",IF(H36=0,\"\",CONCATENATE(VLOOKUP(H36,'[3]1847-1949-3347-3581'!$C:$I,6,FALSE),\" \",VLOOKUP(H36,'[3]1847-1949-3347-3581'!$C:$I,7,FALSE))))","v":"Herchies chemin à Joncs 1 - 10/400"},"1-NTH-884",383515,{"$f":"IF(K36=0,\"\",INDEX('[3]1847-1949-3347-3581'!$C$17:$C$14007,MATCH(K36,'[3]1847-1949-3347-3581'!$F$17:$F$14007,0)))","v":"1847/2714"},{"$f":"IF(ISNA(IF(L36=0,\"\",CONCATENATE(VLOOKUP(L36,'[3]1847-1949-3347-3581'!$C:$I,6,FALSE),\" \",VLOOKUP(L36,'[3]1847-1949-3347-3581'!$C:$I,7,FALSE)))),\"\",IF(L36=0,\"\",CONCATENATE(VLOOKUP(L36,'[3]1847-1949-3347-3581'!$C:$I,6,FALSE),\" \",VLOOKUP(L36,'[3]1847-1949-3347-3581'!$C:$I,7,FALSE))))","v":"Bruyelle Chaussée de Tournai 39"},null,383515,{"$f":"IF(O36=0,\"\",INDEX('[3]1847-1949-3347-3581'!$C$17:$C$14007,MATCH(O36,'[3]1847-1949-3347-3581'!$F$17:$F$14007,0)))","v":"1847/2714"},{"$f":"IF(ISNA(IF(P36=0,\"\",CONCATENATE(VLOOKUP(P36,'[3]1847-1949-3347-3581'!$C:$I,6,FALSE),\" \",VLOOKUP(P36,'[3]1847-1949-3347-3581'!$C:$I,7,FALSE)))),\"\",IF(P36=0,\"\",CONCATENATE(VLOOKUP(P36,'[3]1847-1949-3347-3581'!$C:$I,6,FALSE),\" \",VLOOKUP(P36,'[3]1847-1949-3347-3581'!$C:$I,7,FALSE))))","v":"Bruyelle Chaussée de Tournai 39"}]
[10330,null,null,{"$f":"IF(C37=0,\"\",INDEX('[3]1847-1949-3347-3581'!$C$17:$C$14007,MATCH(C37,'[3]1847-1949-3347-3581'!$F$17:$F$14007,0)))","v":""},{"$f":"IF(ISNA(IF(D37=0,\"\",CONCATENATE(VLOOKUP(D37,'[3]1847-1949-3347-3581'!$C:$I,6,FALSE),\" \",VLOOKUP(D37,'[3]1847-1949-3347-3581'!$C:$I,7,FALSE)))),\"\",IF(D37=0,\"\",CONCATENATE(VLOOKUP(D37,'[3]1847-1949-3347-3581'!$C:$I,6,FALSE),\" \",VLOOKUP(D37,'[3]1847-1949-3347-3581'!$C:$I,7,FALSE))))","v":""},"Minipelle 1,9T",null,"0001/0010",{"$f":"IF(ISNA(IF(H37=0,\"\",CONCATENATE(VLOOKUP(H37,'[3]1847-1949-3347-3581'!$C:$I,6,FALSE),\" \",VLOOKUP(H37,'[3]1847-1949-3347-3581'!$C:$I,7,FALSE)))),\"\",IF(H37=0,\"\",CONCATENATE(VLOOKUP(H37,'[3]1847-1949-3347-3581'!$C:$I,6,FALSE),\" \",VLOOKUP(H37,'[3]1847-1949-3347-3581'!$C:$I,7,FALSE))))","v":"Intervention garage"},null,null,{"$f":"IF(K37=0,\"\",INDEX('[3]1847-1949-3347-3581'!$C$17:$C$14007,MATCH(K37,'[3]1847-1949-3347-3581'!$F$17:$F$14007,0)))","v":""},{"$f":"IF(ISNA(IF(L37=0,\"\",CONCATENATE(VLOOKUP(L37,'[3]1847-1949-3347-3581'!$C:$I,6,FALSE),\" \",VLOOKUP(L37,'[3]1847-1949-3347-3581'!$C:$I,7,FALSE)))),\"\",IF(L37=0,\"\",CONCATENATE(VLOOKUP(L37,'[3]1847-1949-3347-3581'!$C:$I,6,FALSE),\" \",VLOOKUP(L37,'[3]1847-1949-3347-3581'!$C:$I,7,FALSE))))","v":""},null,null,{"$f":"IF(O37=0,\"\",INDEX('[3]1847-1949-3347-3581'!$C$17:$C$14007,MATCH(O37,'[3]1847-1949-3347-3581'!$F$17:$F$14007,0)))","v":""},{"$f":"IF(ISNA(IF(P37=0,\"\",CONCATENATE(VLOOKUP(P37,'[3]1847-1949-3347-3581'!$C:$I,6,FALSE),\" \",VLOOKUP(P37,'[3]1847-1949-3347-3581'!$C:$I,7,FALSE)))),\"\",IF(P37=0,\"\",CONCATENATE(VLOOKUP(P37,'[3]1847-1949-3347-3581'!$C:$I,6,FALSE),\" \",VLOOKUP(P37,'[3]1847-1949-3347-3581'!$C:$I,7,FALSE))))","v":""}]
[null,null,null,{"$f":"IF(C38=0,\"\",INDEX('[3]1847-1949-3347-3581'!$C$17:$C$14007,MATCH(C38,'[3]1847-1949-3347-3581'!$F$17:$F$14007,0)))","v":""},{"$f":"IF(ISNA(IF(D38=0,\"\",CONCATENATE(VLOOKUP(D38,'[3]1847-1949-3347-3581'!$C:$I,6,FALSE),\" \",VLOOKUP(D38,'[3]1847-1949-3347-3581'!$C:$I,7,FALSE)))),\"\",IF(D38=0,\"\",CONCATENATE(VLOOKUP(D38,'[3]1847-1949-3347-3581'!$C:$I,6,FALSE),\" \",VLOOKUP(D38,'[3]1847-1949-3347-3581'!$C:$I,7,FALSE))))","v":""},null,null,{"$f":"IF(G38=0,\"\",INDEX('[3]1847-1949-3347-3581'!$C$17:$C$14007,MATCH(G38,'[3]1847-1949-3347-3581'!$F$17:$F$14007,0)))","v":""},{"$f":"IF(ISNA(IF(H38=0,\"\",CONCATENATE(VLOOKUP(H38,'[3]1847-1949-3347-3581'!$C:$I,6,FALSE),\" \",VLOOKUP(H38,'[3]1847-1949-3347-3581'!$C:$I,7,FALSE)))),\"\",IF(H38=0,\"\",CONCATENATE(VLOOKUP(H38,'[3]1847-1949-3347-3581'!$C:$I,6,FALSE),\" \",VLOOKUP(H38,'[3]1847-1949-3347-3581'!$C:$I,7,FALSE))))","v":""},null,null,{"$f":"IF(K38=0,\"\",INDEX('[3]1847-1949-3347-3581'!$C$17:$C$14007,MATCH(K38,'[3]1847-1949-3347-3581'!$F$17:$F$14007,0)))","v":""},{"$f":"IF(ISNA(IF(L38=0,\"\",CONCATENATE(VLOOKUP(L38,'[3]1847-1949-3347-3581'!$C:$I,6,FALSE),\" \",VLOOKUP(L38,'[3]1847-1949-3347-3581'!$C:$I,7,FALSE)))),\"\",IF(L38=0,\"\",CONCATENATE(VLOOKUP(L38,'[3]1847-1949-3347-3581'!$C:$I,6,FALSE),\" \",VLOOKUP(L38,'[3]1847-1949-3347-3581'!$C:$I,7,FALSE))))","v":""},null,null,{"$f":"IF(O38=0,\"\",INDEX('[3]1847-1949-3347-3581'!$C$17:$C$14007,MATCH(O38,'[3]1847-1949-3347-3581'!$F$17:$F$14007,0)))","v":""},{"$f":"IF(ISNA(IF(P38=0,\"\",CONCATENATE(VLOOKUP(P38,'[3]1847-1949-3347-3581'!$C:$I,6,FALSE),\" \",VLOOKUP(P38,'[3]1847-1949-3347-3581'!$C:$I,7,FALSE)))),\"\",IF(P38=0,\"\",CONCATENATE(VLOOKUP(P38,'[3]1847-1949-3347-3581'!$C:$I,6,FALSE),\" \",VLOOKUP(P38,'[3]1847-1949-3347-3581'!$C:$I,7,FALSE))))","v":""}]
[null,null,null,{"$f":"IF(C39=0,\"\",INDEX('[3]1847-1949-3347-3581'!$C$17:$C$14007,MATCH(C39,'[3]1847-1949-3347-3581'!$F$17:$F$14007,0)))","v":""},{"$f":"IF(ISNA(IF(D39=0,\"\",CONCATENATE(VLOOKUP(D39,'[3]1847-1949-3347-3581'!$C:$I,6,FALSE),\" \",VLOOKUP(D39,'[3]1847-1949-3347-3581'!$C:$I,7,FALSE)))),\"\",IF(D39=0,\"\",CONCATENATE(VLOOKUP(D39,'[3]1847-1949-3347-3581'!$C:$I,6,FALSE),\" \",VLOOKUP(D39,'[3]1847-1949-3347-3581'!$C:$I,7,FALSE))))","v":""},null,null,{"$f":"IF(G39=0,\"\",INDEX('[3]1847-1949-3347-3581'!$C$17:$C$14007,MATCH(G39,'[3]1847-1949-3347-3581'!$F$17:$F$14007,0)))","v":""},{"$f":"IF(ISNA(IF(H39=0,\"\",CONCATENATE(VLOOKUP(H39,'[3]1847-1949-3347-3581'!$C:$I,6,FALSE),\" \",VLOOKUP(H39,'[3]1847-1949-3347-3581'!$C:$I,7,FALSE)))),\"\",IF(H39=0,\"\",CONCATENATE(VLOOKUP(H39,'[3]1847-1949-3347-3581'!$C:$I,6,FALSE),\" \",VLOOKUP(H39,'[3]1847-1949-3347-3581'!$C:$I,7,FALSE))))","v":""},null,null,{"$f":"IF(K39=0,\"\",INDEX('[3]1847-1949-3347-3581'!$C$17:$C$14007,MATCH(K39,'[3]1847-1949-3347-3581'!$F$17:$F$14007,0)))","v":""},{"$f":"IF(ISNA(IF(L39=0,\"\",CONCATENATE(VLOOKUP(L39,'[3]1847-1949-3347-3581'!$C:$I,6,FALSE),\" \",VLOOKUP(L39,'[3]1847-1949-3347-3581'!$C:$I,7,FALSE)))),\"\",IF(L39=0,\"\",CONCATENATE(VLOOKUP(L39,'[3]1847-1949-3347-3581'!$C:$I,6,FALSE),\" \",VLOOKUP(L39,'[3]1847-1949-3347-3581'!$C:$I,7,FALSE))))","v":""},null,null,{"$f":"IF(O39=0,\"\",INDEX('[3]1847-1949-3347-3581'!$C$17:$C$14007,MATCH(O39,'[3]1847-1949-3347-3581'!$F$17:$F$14007,0)))","v":""},{"$f":"IF(ISNA(IF(P39=0,\"\",CONCATENATE(VLOOKUP(P39,'[3]1847-1949-3347-3581'!$C:$I,6,FALSE),\" \",VLOOKUP(P39,'[3]1847-1949-3347-3581'!$C:$I,7,FALSE)))),\"\",IF(P39=0,\"\",CONCATENATE(VLOOKUP(P39,'[3]1847-1949-3347-3581'!$C:$I,6,FALSE),\" \",VLOOKUP(P39,'[3]1847-1949-3347-3581'!$C:$I,7,FALSE))))","v":""}]
["Lorenzato Jason",null,null,{"$f":"IF(C40=0,\"\",INDEX('[3]1847-1949-3347-3581'!$C$17:$C$14007,MATCH(C40,'[3]1847-1949-3347-3581'!$F$17:$F$14007,0)))","v":""},{"$f":"IF(ISNA(IF(D40=0,\"\",CONCATENATE(VLOOKUP(D40,'[3]1847-1949-3347-3581'!$C:$I,6,FALSE),\" \",VLOOKUP(D40,'[3]1847-1949-3347-3581'!$C:$I,7,FALSE)))),\"\",IF(D40=0,\"\",CONCATENATE(VLOOKUP(D40,'[3]1847-1949-3347-3581'!$C:$I,6,FALSE),\" \",VLOOKUP(D40,'[3]1847-1949-3347-3581'!$C:$I,7,FALSE))))","v":""},"2-CMR-664",383754,{"$f":"IF(G40=0,\"\",INDEX('[3]1847-1949-3347-3581'!$C$17:$C$14007,MATCH(G40,'[3]1847-1949-3347-3581'!$F$17:$F$14007,0)))","v":"1847/2718"},{"$f":"IF(ISNA(IF(H40=0,\"\",CONCATENATE(VLOOKUP(H40,'[3]1847-1949-3347-3581'!$C:$I,6,FALSE),\" \",VLOOKUP(H40,'[3]1847-1949-3347-3581'!$C:$I,7,FALSE)))),\"\",IF(H40=0,\"\",CONCATENATE(VLOOKUP(H40,'[3]1847-1949-3347-3581'!$C:$I,6,FALSE),\" \",VLOOKUP(H40,'[3]1847-1949-3347-3581'!$C:$I,7,FALSE))))","v":"Bassilly Rue Warissaet"},"2-CMR-664",383515,{"$f":"IF(K40=0,\"\",INDEX('[3]1847-1949-3347-3581'!$C$17:$C$14007,MATCH(K40,'[3]1847-1949-3347-3581'!$F$17:$F$14007,0)))","v":"1847/2714"},{"$f":"IF(ISNA(IF(L40=0,\"\",CONCATENATE(VLOOKUP(L40,'[3]1847-1949-3347-3581'!$C:$I,6,FALSE),\" \",VLOOKUP(L40,'[3]1847-1949-3347-3581'!$C:$I,7,FALSE)))),\"\",IF(L40=0,\"\",CONCATENATE(VLOOKUP(L40,'[3]1847-1949-3347-3581'!$C:$I,6,FALSE),\" \",VLOOKUP(L40,'[3]1847-1949-3347-3581'!$C:$I,7,FALSE))))","v":"Bruyelle Chaussée de Tournai 39"},null,383515,{"$f":"IF(O40=0,\"\",INDEX('[3]1847-1949-3347-3581'!$C$17:$C$14007,MATCH(O40,'[3]1847-1949-3347-3581'!$F$17:$F$14007,0)))","v":"1847/2714"},{"$f":"IF(ISNA(IF(P40=0,\"\",CONCATENATE(VLOOKUP(P40,'[3]1847-1949-3347-3581'!$C:$I,6,FALSE),\" \",VLOOKUP(P40,'[3]1847-1949-3347-3581'!$C:$I,7,FALSE)))),\"\",IF(P40=0,\"\",CONCATENATE(VLOOKUP(P40,'[3]1847-1949-3347-3581'!$C:$I,6,FALSE),\" \",VLOOKUP(P40,'[3]1847-1949-3347-3581'!$C:$I,7,FALSE))))","v":"Bruyelle Chaussée de Tournai 39"}]
[null,null,null,{"$f":"IF(C41=0,\"\",INDEX('[3]1847-1949-3347-3581'!$C$17:$C$14007,MATCH(C41,'[3]1847-1949-3347-3581'!$F$17:$F$14007,0)))","v":""},{"$f":"IF(ISNA(IF(D41=0,\"\",CONCATENATE(VLOOKUP(D41,'[3]1847-1949-3347-3581'!$C:$I,6,FALSE),\" \",VLOOKUP(D41,'[3]1847-1949-3347-3581'!$C:$I,7,FALSE)))),\"\",IF(D41=0,\"\",CONCATENATE(VLOOKUP(D41,'[3]1847-1949-3347-3581'!$C:$I,6,FALSE),\" \",VLOOKUP(D41,'[3]1847-1949-3347-3581'!$C:$I,7,FALSE))))","v":""},"Dérouleuse",null,{"$f":"IF(G41=0,\"\",INDEX('[3]1847-1949-3347-3581'!$C$17:$C$14007,MATCH(G41,'[3]1847-1949-3347-3581'!$F$17:$F$14007,0)))","v":""},{"$f":"IF(ISNA(IF(H41=0,\"\",CONCATENATE(VLOOKUP(H41,'[3]1847-1949-3347-3581'!$C:$I,6,FALSE),\" \",VLOOKUP(H41,'[3]1847-1949-3347-3581'!$C:$I,7,FALSE)))),\"\",IF(H41=0,\"\",CONCATENATE(VLOOKUP(H41,'[3]1847-1949-3347-3581'!$C:$I,6,FALSE),\" \",VLOOKUP(H41,'[3]1847-1949-3347-3581'!$C:$I,7,FALSE))))","v":""},null,null,{"$f":"IF(K41=0,\"\",INDEX('[3]1847-1949-3347-3581'!$C$17:$C$14007,MATCH(K41,'[3]1847-1949-3347-3581'!$F$17:$F$14007,0)))","v":""},{"$f":"IF(ISNA(IF(L41=0,\"\",CONCATENATE(VLOOKUP(L41,'[3]1847-1949-3347-3581'!$C:$I,6,FALSE),\" \",VLOOKUP(L41,'[3]1847-1949-3347-3581'!$C:$I,7,FALSE)))),\"\",IF(L41=0,\"\",CONCATENATE(VLOOKUP(L41,'[3]1847-1949-3347-3581'!$C:$I,6,FALSE),\" \",VLOOKUP(L41,'[3]1847-1949-3347-3581'!$C:$I,7,FALSE))))","v":""},null,null,{"$f":"IF(O41=0,\"\",INDEX('[3]1847-1949-3347-3581'!$C$17:$C$14007,MATCH(O41,'[3]1847-1949-3347-3581'!$F$17:$F$14007,0)))","v":""},{"$f":"IF(ISNA(IF(P41=0,\"\",CONCATENATE(VLOOKUP(P41,'[3]1847-1949-3347-3581'!$C:$I,6,FALSE),\" \",VLOOKUP(P41,'[3]1847-1949-3347-3581'!$C:$I,7,FALSE)))),\"\",IF(P41=0,\"\",CONCATENATE(VLOOKUP(P41,'[3]1847-1949-3347-3581'!$C:$I,6,FALSE),\" \",VLOOKUP(P41,'[3]1847-1949-3347-3581'!$C:$I,7,FALSE))))","v":""}]
[null,null,null,{"$f":"IF(C42=0,\"\",INDEX('[3]1847-1949-3347-3581'!$C$17:$C$14007,MATCH(C42,'[3]1847-1949-3347-3581'!$F$17:$F$14007,0)))","v":""},{"$f":"IF(ISNA(IF(D42=0,\"\",CONCATENATE(VLOOKUP(D42,'[3]1847-1949-3347-3581'!$C:$I,6,FALSE),\" \",VLOOKUP(D42,'[3]1847-1949-3347-3581'!$C:$I,7,FALSE)))),\"\",IF(D42=0,\"\",CONCATENATE(VLOOKUP(D42,'[3]1847-1949-3347-3581'!$C:$I,6,FALSE),\" \",VLOOKUP(D42,'[3]1847-1949-3347-3581'!$C:$I,7,FALSE))))","v":""},null,null,{"$f":"IF(G42=0,\"\",INDEX('[3]1847-1949-3347-3581'!$C$17:$C$14007,MATCH(G42,'[3]1847-1949-3347-3581'!$F$17:$F$14007,0)))","v":""},{"$f":"IF(ISNA(IF(H42=0,\"\",CONCATENATE(VLOOKUP(H42,'[3]1847-1949-3347-3581'!$C:$I,6,FALSE),\" \",VLOOKUP(H42,'[3]1847-1949-3347-3581'!$C:$I,7,FALSE)))),\"\",IF(H42=0,\"\",CONCATENATE(VLOOKUP(H42,'[3]1847-1949-3347-3581'!$C:$I,6,FALSE),\" \",VLOOKUP(H42,'[3]1847-1949-3347-3581'!$C:$I,7,FALSE))))","v":""},null,null,{"$f":"IF(K42=0,\"\",INDEX('[3]1847-1949-3347-3581'!$C$17:$C$14007,MATCH(K42,'[3]1847-1949-3347-3581'!$F$17:$F$14007,0)))","v":""},{"$f":"IF(ISNA(IF(L42=0,\"\",CONCATENATE(VLOOKUP(L42,'[3]1847-1949-3347-3581'!$C:$I,6,FALSE),\" \",VLOOKUP(L42,'[3]1847-1949-3347-3581'!$C:$I,7,FALSE)))),\"\",IF(L42=0,\"\",CONCATENATE(VLOOKUP(L42,'[3]1847-1949-3347-3581'!$C:$I,6,FALSE),\" \",VLOOKUP(L42,'[3]1847-1949-3347-3581'!$C:$I,7,FALSE))))","v":""},null,null,{"$f":"IF(O42=0,\"\",INDEX('[3]1847-1949-3347-3581'!$C$17:$C$14007,MATCH(O42,'[3]1847-1949-3347-3581'!$F$17:$F$14007,0)))","v":""},{"$f":"IF(ISNA(IF(P42=0,\"\",CONCATENATE(VLOOKUP(P42,'[3]1847-1949-3347-3581'!$C:$I,6,FALSE),\" \",VLOOKUP(P42,'[3]1847-1949-3347-3581'!$C:$I,7,FALSE)))),\"\",IF(P42=0,\"\",CONCATENATE(VLOOKUP(P42,'[3]1847-1949-3347-3581'!$C:$I,6,FALSE),\" \",VLOOKUP(P42,'[3]1847-1949-3347-3581'!$C:$I,7,FALSE))))","v":""}]
[null,null,null,{"$f":"IF(C43=0,\"\",INDEX('[3]1847-1949-3347-3581'!$C$17:$C$14007,MATCH(C43,'[3]1847-1949-3347-3581'!$F$17:$F$14007,0)))","v":""},{"$f":"IF(ISNA(IF(D43=0,\"\",CONCATENATE(VLOOKUP(D43,'[3]1847-1949-3347-3581'!$C:$I,6,FALSE),\" \",VLOOKUP(D43,'[3]1847-1949-3347-3581'!$C:$I,7,FALSE)))),\"\",IF(D43=0,\"\",CONCATENATE(VLOOKUP(D43,'[3]1847-1949-3347-3581'!$C:$I,6,FALSE),\" \",VLOOKUP(D43,'[3]1847-1949-3347-3581'!$C:$I,7,FALSE))))","v":""},null,null,{"$f":"IF(G43=0,\"\",INDEX('[3]1847-1949-3347-3581'!$C$17:$C$14007,MATCH(G43,'[3]1847-1949-3347-3581'!$F$17:$F$14007,0)))","v":""},{"$f":"IF(ISNA(IF(H43=0,\"\",CONCATENATE(VLOOKUP(H43,'[3]1847-1949-3347-3581'!$C:$I,6,FALSE),\" \",VLOOKUP(H43,'[3]1847-1949-3347-3581'!$C:$I,7,FALSE)))),\"\",IF(H43=0,\"\",CONCATENATE(VLOOKUP(H43,'[3]1847-1949-3347-3581'!$C:$I,6,FALSE),\" \",VLOOKUP(H43,'[3]1847-1949-3347-3581'!$C:$I,7,FALSE))))","v":""},null,null,{"$f":"IF(K43=0,\"\",INDEX('[3]1847-1949-3347-3581'!$C$17:$C$14007,MATCH(K43,'[3]1847-1949-3347-3581'!$F$17:$F$14007,0)))","v":""},{"$f":"IF(ISNA(IF(L43=0,\"\",CONCATENATE(VLOOKUP(L43,'[3]1847-1949-3347-3581'!$C:$I,6,FALSE),\" \",VLOOKUP(L43,'[3]1847-1949-3347-3581'!$C:$I,7,FALSE)))),\"\",IF(L43=0,\"\",CONCATENATE(VLOOKUP(L43,'[3]1847-1949-3347-3581'!$C:$I,6,FALSE),\" \",VLOOKUP(L43,'[3]1847-1949-3347-3581'!$C:$I,7,FALSE))))","v":""},null,null,{"$f":"IF(O43=0,\"\",INDEX('[3]1847-1949-3347-3581'!$C$17:$C$14007,MATCH(O43,'[3]1847-1949-3347-3581'!$F$17:$F$14007,0)))","v":""},{"$f":"IF(ISNA(IF(P43=0,\"\",CONCATENATE(VLOOKUP(P43,'[3]1847-1949-3347-3581'!$C:$I,6,FALSE),\" \",VLOOKUP(P43,'[3]1847-1949-3347-3581'!$C:$I,7,FALSE)))),\"\",IF(P43=0,\"\",CONCATENATE(VLOOKUP(P43,'[3]1847-1949-3347-3581'!$C:$I,6,FALSE),\" \",VLOOKUP(P43,'[3]1847-1949-3347-3581'!$C:$I,7,FALSE))))","v":""}]
["Mollet Michel",null,null,{"$f":"IF(C44=0,\"\",INDEX('[3]1847-1949-3347-3581'!$C$17:$C$14007,MATCH(C44,'[3]1847-1949-3347-3581'!$F$17:$F$14007,0)))","v":""},{"$f":"IF(ISNA(IF(D44=0,\"\",CONCATENATE(VLOOKUP(D44,'[3]1847-1949-3347-3581'!$C:$I,6,FALSE),\" \",VLOOKUP(D44,'[3]1847-1949-3347-3581'!$C:$I,7,FALSE)))),\"\",IF(D44=0,\"\",CONCATENATE(VLOOKUP(D44,'[3]1847-1949-3347-3581'!$C:$I,6,FALSE),\" \",VLOOKUP(D44,'[3]1847-1949-3347-3581'!$C:$I,7,FALSE))))","v":""},"44-U-61",383754,{"$f":"IF(G44=0,\"\",INDEX('[3]1847-1949-3347-3581'!$C$17:$C$14007,MATCH(G44,'[3]1847-1949-3347-3581'!$F$17:$F$14007,0)))","v":"1847/2718"},{"$f":"IF(ISNA(IF(H44=0,\"\",CONCATENATE(VLOOKUP(H44,'[3]1847-1949-3347-3581'!$C:$I,6,FALSE),\" \",VLOOKUP(H44,'[3]1847-1949-3347-3581'!$C:$I,7,FALSE)))),\"\",IF(H44=0,\"\",CONCATENATE(VLOOKUP(H44,'[3]1847-1949-3347-3581'!$C:$I,6,FALSE),\" \",VLOOKUP(H44,'[3]1847-1949-3347-3581'!$C:$I,7,FALSE))))","v":"Bassilly Rue Warissaet"},"1-HPD-336",383515,{"$f":"IF(K44=0,\"\",INDEX('[3]1847-1949-3347-3581'!$C$17:$C$14007,MATCH(K44,'[3]1847-1949-3347-3581'!$F$17:$F$14007,0)))","v":"1847/2714"},{"$f":"IF(ISNA(IF(L44=0,\"\",CONCATENATE(VLOOKUP(L44,'[3]1847-1949-3347-3581'!$C:$I,6,FALSE),\" \",VLOOKUP(L44,'[3]1847-1949-3347-3581'!$C:$I,7,FALSE)))),\"\",IF(L44=0,\"\",CONCATENATE(VLOOKUP(L44,'[3]1847-1949-3347-3581'!$C:$I,6,FALSE),\" \",VLOOKUP(L44,'[3]1847-1949-3347-3581'!$C:$I,7,FALSE))))","v":"Bruyelle Chaussée de Tournai 39"},null,383515,{"$f":"IF(O44=0,\"\",INDEX('[3]1847-1949-3347-3581'!$C$17:$C$14007,MATCH(O44,'[3]1847-1949-3347-3581'!$F$17:$F$14007,0)))","v":"1847/2714"},{"$f":"IF(ISNA(IF(P44=0,\"\",CONCATENATE(VLOOKUP(P44,'[3]1847-1949-3347-3581'!$C:$I,6,FALSE),\" \",VLOOKUP(P44,'[3]1847-1949-3347-3581'!$C:$I,7,FALSE)))),\"\",IF(P44=0,\"\",CONCATENATE(VLOOKUP(P44,'[3]1847-1949-3347-3581'!$C:$I,6,FALSE),\" \",VLOOKUP(P44,'[3]1847-1949-3347-3581'!$C:$I,7,FALSE))))","v":"Bruyelle Chaussée de Tournai 39"}]
[53,null,null,{"$f":"IF(C45=0,\"\",INDEX('[3]1847-1949-3347-3581'!$C$17:$C$14007,MATCH(C45,'[3]1847-1949-3347-3581'!$F$17:$F$14007,0)))","v":""},{"$f":"IF(ISNA(IF(D45=0,\"\",CONCATENATE(VLOOKUP(D45,'[3]1847-1949-3347-3581'!$C:$I,6,FALSE),\" \",VLOOKUP(D45,'[3]1847-1949-3347-3581'!$C:$I,7,FALSE)))),\"\",IF(D45=0,\"\",CONCATENATE(VLOOKUP(D45,'[3]1847-1949-3347-3581'!$C:$I,6,FALSE),\" \",VLOOKUP(D45,'[3]1847-1949-3347-3581'!$C:$I,7,FALSE))))","v":""},null,null,{"$f":"IF(G45=0,\"\",INDEX('[3]1847-1949-3347-3581'!$C$17:$C$14007,MATCH(G45,'[3]1847-1949-3347-3581'!$F$17:$F$14007,0)))","v":""},{"$f":"IF(ISNA(IF(H45=0,\"\",CONCATENATE(VLOOKUP(H45,'[3]1847-1949-3347-3581'!$C:$I,6,FALSE),\" \",VLOOKUP(H45,'[3]1847-1949-3347-3581'!$C:$I,7,FALSE)))),\"\",IF(H45=0,\"\",CONCATENATE(VLOOKUP(H45,'[3]1847-1949-3347-3581'!$C:$I,6,FALSE),\" \",VLOOKUP(H45,'[3]1847-1949-3347-3581'!$C:$I,7,FALSE))))","v":""},null,null,{"$f":"IF(K45=0,\"\",INDEX('[3]1847-1949-3347-3581'!$C$17:$C$14007,MATCH(K45,'[3]1847-1949-3347-3581'!$F$17:$F$14007,0)))","v":""},{"$f":"IF(ISNA(IF(L45=0,\"\",CONCATENATE(VLOOKUP(L45,'[3]1847-1949-3347-3581'!$C:$I,6,FALSE),\" \",VLOOKUP(L45,'[3]1847-1949-3347-3581'!$C:$I,7,FALSE)))),\"\",IF(L45=0,\"\",CONCATENATE(VLOOKUP(L45,'[3]1847-1949-3347-3581'!$C:$I,6,FALSE),\" \",VLOOKUP(L45,'[3]1847-1949-3347-3581'!$C:$I,7,FALSE))))","v":""},null,null,{"$f":"IF(O45=0,\"\",INDEX('[3]1847-1949-3347-3581'!$C$17:$C$14007,MATCH(O45,'[3]1847-1949-3347-3581'!$F$17:$F$14007,0)))","v":""},{"$f":"IF(ISNA(IF(P45=0,\"\",CONCATENATE(VLOOKUP(P45,'[3]1847-1949-3347-3581'!$C:$I,6,FALSE),\" \",VLOOKUP(P45,'[3]1847-1949-3347-3581'!$C:$I,7,FALSE)))),\"\",IF(P45=0,\"\",CONCATENATE(VLOOKUP(P45,'[3]1847-1949-3347-3581'!$C:$I,6,FALSE),\" \",VLOOKUP(P45,'[3]1847-1949-3347-3581'!$C:$I,7,FALSE))))","v":""}]
[null,null,null,{"$f":"IF(C46=0,\"\",INDEX('[3]1847-1949-3347-3581'!$C$17:$C$14007,MATCH(C46,'[3]1847-1949-3347-3581'!$F$17:$F$14007,0)))","v":""},{"$f":"IF(ISNA(IF(D46=0,\"\",CONCATENATE(VLOOKUP(D46,'[3]1847-1949-3347-3581'!$C:$I,6,FALSE),\" \",VLOOKUP(D46,'[3]1847-1949-3347-3581'!$C:$I,7,FALSE)))),\"\",IF(D46=0,\"\",CONCATENATE(VLOOKUP(D46,'[3]1847-1949-3347-3581'!$C:$I,6,FALSE),\" \",VLOOKUP(D46,'[3]1847-1949-3347-3581'!$C:$I,7,FALSE))))","v":""},null,null,{"$f":"IF(G46=0,\"\",INDEX('[3]1847-1949-3347-3581'!$C$17:$C$14007,MATCH(G46,'[3]1847-1949-3347-3581'!$F$17:$F$14007,0)))","v":""},{"$f":"IF(ISNA(IF(H46=0,\"\",CONCATENATE(VLOOKUP(H46,'[3]1847-1949-3347-3581'!$C:$I,6,FALSE),\" \",VLOOKUP(H46,'[3]1847-1949-3347-3581'!$C:$I,7,FALSE)))),\"\",IF(H46=0,\"\",CONCATENATE(VLOOKUP(H46,'[3]1847-1949-3347-3581'!$C:$I,6,FALSE),\" \",VLOOKUP(H46,'[3]1847-1949-3347-3581'!$C:$I,7,FALSE))))","v":""},null,null,{"$f":"IF(K46=0,\"\",INDEX('[3]1847-1949-3347-3581'!$C$17:$C$14007,MATCH(K46,'[3]1847-1949-3347-3581'!$F$17:$F$14007,0)))","v":""},{"$f":"IF(ISNA(IF(L46=0,\"\",CONCATENATE(VLOOKUP(L46,'[3]1847-1949-3347-3581'!$C:$I,6,FALSE),\" \",VLOOKUP(L46,'[3]1847-1949-3347-3581'!$C:$I,7,FALSE)))),\"\",IF(L46=0,\"\",CONCATENATE(VLOOKUP(L46,'[3]1847-1949-3347-3581'!$C:$I,6,FALSE),\" \",VLOOKUP(L46,'[3]1847-1949-3347-3581'!$C:$I,7,FALSE))))","v":""},null,null,{"$f":"IF(O46=0,\"\",INDEX('[3]1847-1949-3347-3581'!$C$17:$C$14007,MATCH(O46,'[3]1847-1949-3347-3581'!$F$17:$F$14007,0)))","v":""},{"$f":"IF(ISNA(IF(P46=0,\"\",CONCATENATE(VLOOKUP(P46,'[3]1847-1949-3347-3581'!$C:$I,6,FALSE),\" \",VLOOKUP(P46,'[3]1847-1949-3347-3581'!$C:$I,7,FALSE)))),\"\",IF(P46=0,\"\",CONCATENATE(VLOOKUP(P46,'[3]1847-1949-3347-3581'!$C:$I,6,FALSE),\" \",VLOOKUP(P46,'[3]1847-1949-3347-3581'!$C:$I,7,FALSE))))","v":""}]
[null,null,null,{"$f":"IF(C47=0,\"\",INDEX('[3]1847-1949-3347-3581'!$C$17:$C$14007,MATCH(C47,'[3]1847-1949-3347-3581'!$F$17:$F$14007,0)))","v":""},{"$f":"IF(ISNA(IF(D47=0,\"\",CONCATENATE(VLOOKUP(D47,'[3]1847-1949-3347-3581'!$C:$I,6,FALSE),\" \",VLOOKUP(D47,'[3]1847-1949-3347-3581'!$C:$I,7,FALSE)))),\"\",IF(D47=0,\"\",CONCATENATE(VLOOKUP(D47,'[3]1847-1949-3347-3581'!$C:$I,6,FALSE),\" \",VLOOKUP(D47,'[3]1847-1949-3347-3581'!$C:$I,7,FALSE))))","v":""},null,null,{"$f":"IF(G47=0,\"\",INDEX('[3]1847-1949-3347-3581'!$C$17:$C$14007,MATCH(G47,'[3]1847-1949-3347-3581'!$F$17:$F$14007,0)))","v":""},{"$f":"IF(ISNA(IF(H47=0,\"\",CONCATENATE(VLOOKUP(H47,'[3]1847-1949-3347-3581'!$C:$I,6,FALSE),\" \",VLOOKUP(H47,'[3]1847-1949-3347-3581'!$C:$I,7,FALSE)))),\"\",IF(H47=0,\"\",CONCATENATE(VLOOKUP(H47,'[3]1847-1949-3347-3581'!$C:$I,6,FALSE),\" \",VLOOKUP(H47,'[3]1847-1949-3347-3581'!$C:$I,7,FALSE))))","v":""},null,null,{"$f":"IF(K47=0,\"\",INDEX('[3]1847-1949-3347-3581'!$C$17:$C$14007,MATCH(K47,'[3]1847-1949-3347-3581'!$F$17:$F$14007,0)))","v":""},{"$f":"IF(ISNA(IF(L47=0,\"\",CONCATENATE(VLOOKUP(L47,'[3]1847-1949-3347-3581'!$C:$I,6,FALSE),\" \",VLOOKUP(L47,'[3]1847-1949-3347-3581'!$C:$I,7,FALSE)))),\"\",IF(L47=0,\"\",CONCATENATE(VLOOKUP(L47,'[3]1847-1949-3347-3581'!$C:$I,6,FALSE),\" \",VLOOKUP(L47,'[3]1847-1949-3347-3581'!$C:$I,7,FALSE))))","v":""},null,null,{"$f":"IF(O47=0,\"\",INDEX('[3]1847-1949-3347-3581'!$C$17:$C$14007,MATCH(O47,'[3]1847-1949-3347-3581'!$F$17:$F$14007,0)))","v":""},{"$f":"IF(ISNA(IF(P47=0,\"\",CONCATENATE(VLOOKUP(P47,'[3]1847-1949-3347-3581'!$C:$I,6,FALSE),\" \",VLOOKUP(P47,'[3]1847-1949-3347-3581'!$C:$I,7,FALSE)))),\"\",IF(P47=0,\"\",CONCATENATE(VLOOKUP(P47,'[3]1847-1949-3347-3581'!$C:$I,6,FALSE),\" \",VLOOKUP(P47,'[3]1847-1949-3347-3581'!$C:$I,7,FALSE))))","v":""}]
["Petruzzelli Michel",null,null,"0001/0003",{"$f":"IF(ISNA(IF(D48=0,\"\",CONCATENATE(VLOOKUP(D48,'[3]1847-1949-3347-3581'!$C:$I,6,FALSE),\" \",VLOOKUP(D48,'[3]1847-1949-3347-3581'!$C:$I,7,FALSE)))),\"\",IF(D48=0,\"\",CONCATENATE(VLOOKUP(D48,'[3]1847-1949-3347-3581'!$C:$I,6,FALSE),\" \",VLOOKUP(D48,'[3]1847-1949-3347-3581'!$C:$I,7,FALSE))))","v":"Travail général hors chantiers"},null,null,"0001/0010",{"$f":"IF(ISNA(IF(H48=0,\"\",CONCATENATE(VLOOKUP(H48,'[3]1847-1949-3347-3581'!$C:$I,6,FALSE),\" \",VLOOKUP(H48,'[3]1847-1949-3347-3581'!$C:$I,7,FALSE)))),\"\",IF(H48=0,\"\",CONCATENATE(VLOOKUP(H48,'[3]1847-1949-3347-3581'!$C:$I,6,FALSE),\" \",VLOOKUP(H48,'[3]1847-1949-3347-3581'!$C:$I,7,FALSE))))","v":"Intervention garage"},null,null,"0001/0003",{"$f":"IF(ISNA(IF(L48=0,\"\",CONCATENATE(VLOOKUP(L48,'[3]1847-1949-3347-3581'!$C:$I,6,FALSE),\" \",VLOOKUP(L48,'[3]1847-1949-3347-3581'!$C:$I,7,FALSE)))),\"\",IF(L48=0,\"\",CONCATENATE(VLOOKUP(L48,'[3]1847-1949-3347-3581'!$C:$I,6,FALSE),\" \",VLOOKUP(L48,'[3]1847-1949-3347-3581'!$C:$I,7,FALSE))))","v":"Travail général hors chantiers"},null,null,"0001/0003",{"$f":"IF(ISNA(IF(P48=0,\"\",CONCATENATE(VLOOKUP(P48,'[3]1847-1949-3347-3581'!$C:$I,6,FALSE),\" \",VLOOKUP(P48,'[3]1847-1949-3347-3581'!$C:$I,7,FALSE)))),\"\",IF(P48=0,\"\",CONCATENATE(VLOOKUP(P48,'[3]1847-1949-3347-3581'!$C:$I,6,FALSE),\" \",VLOOKUP(P48,'[3]1847-1949-3347-3581'!$C:$I,7,FALSE))))","v":"Travail général hors chantiers"}]
[null,null,null,{"$f":"IF(C49=0,\"\",INDEX('[3]1847-1949-3347-3581'!$C$17:$C$14007,MATCH(C49,'[3]1847-1949-3347-3581'!$F$17:$F$14007,0)))","v":""},{"$f":"IF(ISNA(IF(D49=0,\"\",CONCATENATE(VLOOKUP(D49,'[3]1847-1949-3347-3581'!$C:$I,6,FALSE),\" \",VLOOKUP(D49,'[3]1847-1949-3347-3581'!$C:$I,7,FALSE)))),\"\",IF(D49=0,\"\",CONCATENATE(VLOOKUP(D49,'[3]1847-1949-3347-3581'!$C:$I,6,FALSE),\" \",VLOOKUP(D49,'[3]1847-1949-3347-3581'!$C:$I,7,FALSE))))","v":""},null,null,{"$f":"IF(G49=0,\"\",INDEX('[3]1847-1949-3347-3581'!$C$17:$C$14007,MATCH(G49,'[3]1847-1949-3347-3581'!$F$17:$F$14007,0)))","v":""},{"$f":"IF(ISNA(IF(H49=0,\"\",CONCATENATE(VLOOKUP(H49,'[3]1847-1949-3347-3581'!$C:$I,6,FALSE),\" \",VLOOKUP(H49,'[3]1847-1949-3347-3581'!$C:$I,7,FALSE)))),\"\",IF(H49=0,\"\",CONCATENATE(VLOOKUP(H49,'[3]1847-1949-3347-3581'!$C:$I,6,FALSE),\" \",VLOOKUP(H49,'[3]1847-1949-3347-3581'!$C:$I,7,FALSE))))","v":""},null,null,{"$f":"IF(K49=0,\"\",INDEX('[3]1847-1949-3347-3581'!$C$17:$C$14007,MATCH(K49,'[3]1847-1949-3347-3581'!$F$17:$F$14007,0)))","v":""},{"$f":"IF(ISNA(IF(L49=0,\"\",CONCATENATE(VLOOKUP(L49,'[3]1847-1949-3347-3581'!$C:$I,6,FALSE),\" \",VLOOKUP(L49,'[3]1847-1949-3347-3581'!$C:$I,7,FALSE)))),\"\",IF(L49=0,\"\",CONCATENATE(VLOOKUP(L49,'[3]1847-1949-3347-3581'!$C:$I,6,FALSE),\" \",VLOOKUP(L49,'[3]1847-1949-3347-3581'!$C:$I,7,FALSE))))","v":""},null,null,{"$f":"IF(O49=0,\"\",INDEX('[3]1847-1949-3347-3581'!$C$17:$C$14007,MATCH(O49,'[3]1847-1949-3347-3581'!$F$17:$F$14007,0)))","v":""},{"$f":"IF(ISNA(IF(P49=0,\"\",CONCATENATE(VLOOKUP(P49,'[3]1847-1949-3347-3581'!$C:$I,6,FALSE),\" \",VLOOKUP(P49,'[3]1847-1949-3347-3581'!$C:$I,7,FALSE)))),\"\",IF(P49=0,\"\",CONCATENATE(VLOOKUP(P49,'[3]1847-1949-3347-3581'!$C:$I,6,FALSE),\" \",VLOOKUP(P49,'[3]1847-1949-3347-3581'!$C:$I,7,FALSE))))","v":""}]
[null,null,null,{"$f":"IF(C50=0,\"\",INDEX('[3]1847-1949-3347-3581'!$C$17:$C$14007,MATCH(C50,'[3]1847-1949-3347-3581'!$F$17:$F$14007,0)))","v":""},{"$f":"IF(ISNA(IF(D50=0,\"\",CONCATENATE(VLOOKUP(D50,'[3]1847-1949-3347-3581'!$C:$I,6,FALSE),\" \",VLOOKUP(D50,'[3]1847-1949-3347-3581'!$C:$I,7,FALSE)))),\"\",IF(D50=0,\"\",CONCATENATE(VLOOKUP(D50,'[3]1847-1949-3347-3581'!$C:$I,6,FALSE),\" \",VLOOKUP(D50,'[3]1847-1949-3347-3581'!$C:$I,7,FALSE))))","v":""},null,null,{"$f":"IF(G50=0,\"\",INDEX('[3]1847-1949-3347-3581'!$C$17:$C$14007,MATCH(G50,'[3]1847-1949-3347-3581'!$F$17:$F$14007,0)))","v":""},{"$f":"IF(ISNA(IF(H50=0,\"\",CONCATENATE(VLOOKUP(H50,'[3]1847-1949-3347-3581'!$C:$I,6,FALSE),\" \",VLOOKUP(H50,'[3]1847-1949-3347-3581'!$C:$I,7,FALSE)))),\"\",IF(H50=0,\"\",CONCATENATE(VLOOKUP(H50,'[3]1847-1949-3347-3581'!$C:$I,6,FALSE),\" \",VLOOKUP(H50,'[3]1847-1949-3347-3581'!$C:$I,7,FALSE))))","v":""},null,null,{"$f":"IF(K50=0,\"\",INDEX('[3]1847-1949-3347-3581'!$C$17:$C$14007,MATCH(K50,'[3]1847-1949-3347-3581'!$F$17:$F$14007,0)))","v":""},{"$f":"IF(ISNA(IF(L50=0,\"\",CONCATENATE(VLOOKUP(L50,'[3]1847-1949-3347-3581'!$C:$I,6,FALSE),\" \",VLOOKUP(L50,'[3]1847-1949-3347-3581'!$C:$I,7,FALSE)))),\"\",IF(L50=0,\"\",CONCATENATE(VLOOKUP(L50,'[3]1847-1949-3347-3581'!$C:$I,6,FALSE),\" \",VLOOKUP(L50,'[3]1847-1949-3347-3581'!$C:$I,7,FALSE))))","v":""},null,null,{"$f":"IF(O50=0,\"\",INDEX('[3]1847-1949-3347-3581'!$C$17:$C$14007,MATCH(O50,'[3]1847-1949-3347-3581'!$F$17:$F$14007,0)))","v":""},{"$f":"IF(ISNA(IF(P50=0,\"\",CONCATENATE(VLOOKUP(P50,'[3]1847-1949-3347-3581'!$C:$I,6,FALSE),\" \",VLOOKUP(P50,'[3]1847-1949-3347-3581'!$C:$I,7,FALSE)))),\"\",IF(P50=0,\"\",CONCATENATE(VLOOKUP(P50,'[3]1847-1949-3347-3581'!$C:$I,6,FALSE),\" \",VLOOKUP(P50,'[3]1847-1949-3347-3581'!$C:$I,7,FALSE))))","v":""}]
[null,null,null,{"$f":"IF(C51=0,\"\",INDEX('[3]1847-1949-3347-3581'!$C$17:$C$14007,MATCH(C51,'[3]1847-1949-3347-3581'!$F$17:$F$14007,0)))","v":""},{"$f":"IF(ISNA(IF(D51=0,\"\",CONCATENATE(VLOOKUP(D51,'[3]1847-1949-3347-3581'!$C:$I,6,FALSE),\" \",VLOOKUP(D51,'[3]1847-1949-3347-3581'!$C:$I,7,FALSE)))),\"\",IF(D51=0,\"\",CONCATENATE(VLOOKUP(D51,'[3]1847-1949-3347-3581'!$C:$I,6,FALSE),\" \",VLOOKUP(D51,'[3]1847-1949-3347-3581'!$C:$I,7,FALSE))))","v":""},null,null,{"$f":"IF(G51=0,\"\",INDEX('[3]1847-1949-3347-3581'!$C$17:$C$14007,MATCH(G51,'[3]1847-1949-3347-3581'!$F$17:$F$14007,0)))","v":""},{"$f":"IF(ISNA(IF(H51=0,\"\",CONCATENATE(VLOOKUP(H51,'[3]1847-1949-3347-3581'!$C:$I,6,FALSE),\" \",VLOOKUP(H51,'[3]1847-1949-3347-3581'!$C:$I,7,FALSE)))),\"\",IF(H51=0,\"\",CONCATENATE(VLOOKUP(H51,'[3]1847-1949-3347-3581'!$C:$I,6,FALSE),\" \",VLOOKUP(H51,'[3]1847-1949-3347-3581'!$C:$I,7,FALSE))))","v":""},null,null,{"$f":"IF(K51=0,\"\",INDEX('[3]1847-1949-3347-3581'!$C$17:$C$14007,MATCH(K51,'[3]1847-1949-3347-3581'!$F$17:$F$14007,0)))","v":""},{"$f":"IF(ISNA(IF(L51=0,\"\",CONCATENATE(VLOOKUP(L51,'[3]1847-1949-3347-3581'!$C:$I,6,FALSE),\" \",VLOOKUP(L51,'[3]1847-1949-3347-3581'!$C:$I,7,FALSE)))),\"\",IF(L51=0,\"\",CONCATENATE(VLOOKUP(L51,'[3]1847-1949-3347-3581'!$C:$I,6,FALSE),\" \",VLOOKUP(L51,'[3]1847-1949-3347-3581'!$C:$I,7,FALSE))))","v":""},null,null,{"$f":"IF(O51=0,\"\",INDEX('[3]1847-1949-3347-3581'!$C$17:$C$14007,MATCH(O51,'[3]1847-1949-3347-3581'!$F$17:$F$14007,0)))","v":""},{"$f":"IF(ISNA(IF(P51=0,\"\",CONCATENATE(VLOOKUP(P51,'[3]1847-1949-3347-3581'!$C:$I,6,FALSE),\" \",VLOOKUP(P51,'[3]1847-1949-3347-3581'!$C:$I,7,FALSE)))),\"\",IF(P51=0,\"\",CONCATENATE(VLOOKUP(P51,'[3]1847-1949-3347-3581'!$C:$I,6,FALSE),\" \",VLOOKUP(P51,'[3]1847-1949-3347-3581'!$C:$I,7,FALSE))))","v":""}]
["Vercleven Olivier",null,null,null,{"$f":"IF(ISNA(IF(D52=0,\"\",CONCATENATE(VLOOKUP(D52,'[3]1847-1949-3347-3581'!$C:$I,6,FALSE),\" \",VLOOKUP(D52,'[3]1847-1949-3347-3581'!$C:$I,7,FALSE)))),\"\",IF(D52=0,\"\",CONCATENATE(VLOOKUP(D52,'[3]1847-1949-3347-3581'!$C:$I,6,FALSE),\" \",VLOOKUP(D52,'[3]1847-1949-3347-3581'!$C:$I,7,FALSE))))","v":""},"2-ARY-258",null,"5419/0000",{"$f":"IF(ISNA(IF(H52=0,\"\",CONCATENATE(VLOOKUP(H52,'[3]1847-1949-3347-3581'!$C:$I,6,FALSE),\" \",VLOOKUP(H52,'[3]1847-1949-3347-3581'!$C:$I,7,FALSE)))),\"\",IF(H52=0,\"\",CONCATENATE(VLOOKUP(H52,'[3]1847-1949-3347-3581'!$C:$I,6,FALSE),\" \",VLOOKUP(H52,'[3]1847-1949-3347-3581'!$C:$I,7,FALSE))))","v":"WAPI Ores Compteurs"},"2-ARY-258",null,"5419/0000",{"$f":"IF(ISNA(IF(L52=0,\"\",CONCATENATE(VLOOKUP(L52,'[3]1847-1949-3347-3581'!$C:$I,6,FALSE),\" \",VLOOKUP(L52,'[3]1847-1949-3347-3581'!$C:$I,7,FALSE)))),\"\",IF(L52=0,\"\",CONCATENATE(VLOOKUP(L52,'[3]1847-1949-3347-3581'!$C:$I,6,FALSE),\" \",VLOOKUP(L52,'[3]1847-1949-3347-3581'!$C:$I,7,FALSE))))","v":"WAPI Ores Compteurs"},"2-ARY-258",null,"5419/0000",{"$f":"IF(ISNA(IF(P52=0,\"\",CONCATENATE(VLOOKUP(P52,'[3]1847-1949-3347-3581'!$C:$I,6,FALSE),\" \",VLOOKUP(P52,'[3]1847-1949-3347-3581'!$C:$I,7,FALSE)))),\"\",IF(P52=0,\"\",CONCATENATE(VLOOKUP(P52,'[3]1847-1949-3347-3581'!$C:$I,6,FALSE),\" \",VLOOKUP(P52,'[3]1847-1949-3347-3581'!$C:$I,7,FALSE))))","v":"WAPI Ores Compteurs"}]
[null,null,null,{"$f":"IF(C53=0,\"\",INDEX('[3]1847-1949-3347-3581'!$C$17:$C$14007,MATCH(C53,'[3]1847-1949-3347-3581'!$F$17:$F$14007,0)))","v":""},{"$f":"IF(ISNA(IF(D53=0,\"\",CONCATENATE(VLOOKUP(D53,'[3]1847-1949-3347-3581'!$C:$I,6,FALSE),\" \",VLOOKUP(D53,'[3]1847-1949-3347-3581'!$C:$I,7,FALSE)))),\"\",IF(D53=0,\"\",CONCATENATE(VLOOKUP(D53,'[3]1847-1949-3347-3581'!$C:$I,6,FALSE),\" \",VLOOKUP(D53,'[3]1847-1949-3347-3581'!$C:$I,7,FALSE))))","v":""},null,null,{"$f":"IF(G53=0,\"\",INDEX('[3]1847-1949-3347-3581'!$C$17:$C$14007,MATCH(G53,'[3]1847-1949-3347-3581'!$F$17:$F$14007,0)))","v":""},{"$f":"IF(ISNA(IF(H53=0,\"\",CONCATENATE(VLOOKUP(H53,'[3]1847-1949-3347-3581'!$C:$I,6,FALSE),\" \",VLOOKUP(H53,'[3]1847-1949-3347-3581'!$C:$I,7,FALSE)))),\"\",IF(H53=0,\"\",CONCATENATE(VLOOKUP(H53,'[3]1847-1949-3347-3581'!$C:$I,6,FALSE),\" \",VLOOKUP(H53,'[3]1847-1949-3347-3581'!$C:$I,7,FALSE))))","v":""},null,null,{"$f":"IF(K53=0,\"\",INDEX('[3]1847-1949-3347-3581'!$C$17:$C$14007,MATCH(K53,'[3]1847-1949-3347-3581'!$F$17:$F$14007,0)))","v":""},{"$f":"IF(ISNA(IF(L53=0,\"\",CONCATENATE(VLOOKUP(L53,'[3]1847-1949-3347-3581'!$C:$I,6,FALSE),\" \",VLOOKUP(L53,'[3]1847-1949-3347-3581'!$C:$I,7,FALSE)))),\"\",IF(L53=0,\"\",CONCATENATE(VLOOKUP(L53,'[3]1847-1949-3347-3581'!$C:$I,6,FALSE),\" \",VLOOKUP(L53,'[3]1847-1949-3347-3581'!$C:$I,7,FALSE))))","v":""},null,null,{"$f":"IF(O53=0,\"\",INDEX('[3]1847-1949-3347-3581'!$C$17:$C$14007,MATCH(O53,'[3]1847-1949-3347-3581'!$F$17:$F$14007,0)))","v":""},{"$f":"IF(ISNA(IF(P53=0,\"\",CONCATENATE(VLOOKUP(P53,'[3]1847-1949-3347-3581'!$C:$I,6,FALSE),\" \",VLOOKUP(P53,'[3]1847-1949-3347-3581'!$C:$I,7,FALSE)))),\"\",IF(P53=0,\"\",CONCATENATE(VLOOKUP(P53,'[3]1847-1949-3347-3581'!$C:$I,6,FALSE),\" \",VLOOKUP(P53,'[3]1847-1949-3347-3581'!$C:$I,7,FALSE))))","v":""}]
[null,null,null,{"$f":"IF(C54=0,\"\",INDEX('[3]1847-1949-3347-3581'!$C$17:$C$14007,MATCH(C54,'[3]1847-1949-3347-3581'!$F$17:$F$14007,0)))","v":""},{"$f":"IF(ISNA(IF(D54=0,\"\",CONCATENATE(VLOOKUP(D54,'[3]1847-1949-3347-3581'!$C:$I,6,FALSE),\" \",VLOOKUP(D54,'[3]1847-1949-3347-3581'!$C:$I,7,FALSE)))),\"\",IF(D54=0,\"\",CONCATENATE(VLOOKUP(D54,'[3]1847-1949-3347-3581'!$C:$I,6,FALSE),\" \",VLOOKUP(D54,'[3]1847-1949-3347-3581'!$C:$I,7,FALSE))))","v":""},null,null,{"$f":"IF(G54=0,\"\",INDEX('[3]1847-1949-3347-3581'!$C$17:$C$14007,MATCH(G54,'[3]1847-1949-3347-3581'!$F$17:$F$14007,0)))","v":""},{"$f":"IF(ISNA(IF(H54=0,\"\",CONCATENATE(VLOOKUP(H54,'[3]1847-1949-3347-3581'!$C:$I,6,FALSE),\" \",VLOOKUP(H54,'[3]1847-1949-3347-3581'!$C:$I,7,FALSE)))),\"\",IF(H54=0,\"\",CONCATENATE(VLOOKUP(H54,'[3]1847-1949-3347-3581'!$C:$I,6,FALSE),\" \",VLOOKUP(H54,'[3]1847-1949-3347-3581'!$C:$I,7,FALSE))))","v":""},null,null,{"$f":"IF(K54=0,\"\",INDEX('[3]1847-1949-3347-3581'!$C$17:$C$14007,MATCH(K54,'[3]1847-1949-3347-3581'!$F$17:$F$14007,0)))","v":""},{"$f":"IF(ISNA(IF(L54=0,\"\",CONCATENATE(VLOOKUP(L54,'[3]1847-1949-3347-3581'!$C:$I,6,FALSE),\" \",VLOOKUP(L54,'[3]1847-1949-3347-3581'!$C:$I,7,FALSE)))),\"\",IF(L54=0,\"\",CONCATENATE(VLOOKUP(L54,'[3]1847-1949-3347-3581'!$C:$I,6,FALSE),\" \",VLOOKUP(L54,'[3]1847-1949-3347-3581'!$C:$I,7,FALSE))))","v":""},null,null,{"$f":"IF(O54=0,\"\",INDEX('[3]1847-1949-3347-3581'!$C$17:$C$14007,MATCH(O54,'[3]1847-1949-3347-3581'!$F$17:$F$14007,0)))","v":""},{"$f":"IF(ISNA(IF(P54=0,\"\",CONCATENATE(VLOOKUP(P54,'[3]1847-1949-3347-3581'!$C:$I,6,FALSE),\" \",VLOOKUP(P54,'[3]1847-1949-3347-3581'!$C:$I,7,FALSE)))),\"\",IF(P54=0,\"\",CONCATENATE(VLOOKUP(P54,'[3]1847-1949-3347-3581'!$C:$I,6,FALSE),\" \",VLOOKUP(P54,'[3]1847-1949-3347-3581'!$C:$I,7,FALSE))))","v":""}]
[null,null,null,{"$f":"IF(C55=0,\"\",INDEX('[3]1847-1949-3347-3581'!$C$17:$C$14007,MATCH(C55,'[3]1847-1949-3347-3581'!$F$17:$F$14007,0)))","v":""},{"$f":"IF(ISNA(IF(D55=0,\"\",CONCATENATE(VLOOKUP(D55,'[3]1847-1949-3347-3581'!$C:$I,6,FALSE),\" \",VLOOKUP(D55,'[3]1847-1949-3347-3581'!$C:$I,7,FALSE)))),\"\",IF(D55=0,\"\",CONCATENATE(VLOOKUP(D55,'[3]1847-1949-3347-3581'!$C:$I,6,FALSE),\" \",VLOOKUP(D55,'[3]1847-1949-3347-3581'!$C:$I,7,FALSE))))","v":""},null,null,{"$f":"IF(G55=0,\"\",INDEX('[3]1847-1949-3347-3581'!$C$17:$C$14007,MATCH(G55,'[3]1847-1949-3347-3581'!$F$17:$F$14007,0)))","v":""},{"$f":"IF(ISNA(IF(H55=0,\"\",CONCATENATE(VLOOKUP(H55,'[3]1847-1949-3347-3581'!$C:$I,6,FALSE),\" \",VLOOKUP(H55,'[3]1847-1949-3347-3581'!$C:$I,7,FALSE)))),\"\",IF(H55=0,\"\",CONCATENATE(VLOOKUP(H55,'[3]1847-1949-3347-3581'!$C:$I,6,FALSE),\" \",VLOOKUP(H55,'[3]1847-1949-3347-3581'!$C:$I,7,FALSE))))","v":""},null,null,{"$f":"IF(K55=0,\"\",INDEX('[3]1847-1949-3347-3581'!$C$17:$C$14007,MATCH(K55,'[3]1847-1949-3347-3581'!$F$17:$F$14007,0)))","v":""},{"$f":"IF(ISNA(IF(L55=0,\"\",CONCATENATE(VLOOKUP(L55,'[3]1847-1949-3347-3581'!$C:$I,6,FALSE),\" \",VLOOKUP(L55,'[3]1847-1949-3347-3581'!$C:$I,7,FALSE)))),\"\",IF(L55=0,\"\",CONCATENATE(VLOOKUP(L55,'[3]1847-1949-3347-3581'!$C:$I,6,FALSE),\" \",VLOOKUP(L55,'[3]1847-1949-3347-3581'!$C:$I,7,FALSE))))","v":""},null,null,{"$f":"IF(O55=0,\"\",INDEX('[3]1847-1949-3347-3581'!$C$17:$C$14007,MATCH(O55,'[3]1847-1949-3347-3581'!$F$17:$F$14007,0)))","v":""},{"$f":"IF(ISNA(IF(P55=0,\"\",CONCATENATE(VLOOKUP(P55,'[3]1847-1949-3347-3581'!$C:$I,6,FALSE),\" \",VLOOKUP(P55,'[3]1847-1949-3347-3581'!$C:$I,7,FALSE)))),\"\",IF(P55=0,\"\",CONCATENATE(VLOOKUP(P55,'[3]1847-1949-3347-3581'!$C:$I,6,FALSE),\" \",VLOOKUP(P55,'[3]1847-1949-3347-3581'!$C:$I,7,FALSE))))","v":""}]
["Verdy Geoffrey",null,null,{"$f":"IF(C56=0,\"\",INDEX('[3]1847-1949-3347-3581'!$C$17:$C$14007,MATCH(C56,'[3]1847-1949-3347-3581'!$F$17:$F$14007,0)))","v":""},{"$f":"IF(ISNA(IF(D56=0,\"\",CONCATENATE(VLOOKUP(D56,'[3]1847-1949-3347-3581'!$C:$I,6,FALSE),\" \",VLOOKUP(D56,'[3]1847-1949-3347-3581'!$C:$I,7,FALSE)))),\"\",IF(D56=0,\"\",CONCATENATE(VLOOKUP(D56,'[3]1847-1949-3347-3581'!$C:$I,6,FALSE),\" \",VLOOKUP(D56,'[3]1847-1949-3347-3581'!$C:$I,7,FALSE))))","v":""},null,"malade",{"$f":"IF(G56=0,\"\",INDEX('[3]1847-1949-3347-3581'!$C$17:$C$14007,MATCH(G56,'[3]1847-1949-3347-3581'!$F$17:$F$14007,0)))","v":{"$error":"#N/A"}},{"$f":"IF(ISNA(IF(H56=0,\"\",CONCATENATE(VLOOKUP(H56,'[3]1847-1949-3347-3581'!$C:$I,6,FALSE),\" \",VLOOKUP(H56,'[3]1847-1949-3347-3581'!$C:$I,7,FALSE)))),\"\",IF(H56=0,\"\",CONCATENATE(VLOOKUP(H56,'[3]1847-1949-3347-3581'!$C:$I,6,FALSE),\" \",VLOOKUP(H56,'[3]1847-1949-3347-3581'!$C:$I,7,FALSE))))","v":""},null,null,{"$f":"IF(K56=0,\"\",INDEX('[3]1847-1949-3347-3581'!$C$17:$C$14007,MATCH(K56,'[3]1847-1949-3347-3581'!$F$17:$F$14007,0)))","v":""},{"$f":"IF(ISNA(IF(L56=0,\"\",CONCATENATE(VLOOKUP(L56,'[3]1847-1949-3347-3581'!$C:$I,6,FALSE),\" \",VLOOKUP(L56,'[3]1847-1949-3347-3581'!$C:$I,7,FALSE)))),\"\",IF(L56=0,\"\",CONCATENATE(VLOOKUP(L56,'[3]1847-1949-3347-3581'!$C:$I,6,FALSE),\" \",VLOOKUP(L56,'[3]1847-1949-3347-3581'!$C:$I,7,FALSE))))","v":""},null,null,{"$f":"IF(O56=0,\"\",INDEX('[3]1847-1949-3347-3581'!$C$17:$C$14007,MATCH(O56,'[3]1847-1949-3347-3581'!$F$17:$F$14007,0)))","v":""},{"$f":"IF(ISNA(IF(P56=0,\"\",CONCATENATE(VLOOKUP(P56,'[3]1847-1949-3347-3581'!$C:$I,6,FALSE),\" \",VLOOKUP(P56,'[3]1847-1949-3347-3581'!$C:$I,7,FALSE)))),\"\",IF(P56=0,\"\",CONCATENATE(VLOOKUP(P56,'[3]1847-1949-3347-3581'!$C:$I,6,FALSE),\" \",VLOOKUP(P56,'[3]1847-1949-3347-3581'!$C:$I,7,FALSE))))","v":""}]
[10615,null,null,{"$f":"IF(C57=0,\"\",INDEX('[3]1847-1949-3347-3581'!$C$17:$C$14007,MATCH(C57,'[3]1847-1949-3347-3581'!$F$17:$F$14007,0)))","v":""},{"$f":"IF(ISNA(IF(D57=0,\"\",CONCATENATE(VLOOKUP(D57,'[3]1847-1949-3347-3581'!$C:$I,6,FALSE),\" \",VLOOKUP(D57,'[3]1847-1949-3347-3581'!$C:$I,7,FALSE)))),\"\",IF(D57=0,\"\",CONCATENATE(VLOOKUP(D57,'[3]1847-1949-3347-3581'!$C:$I,6,FALSE),\" \",VLOOKUP(D57,'[3]1847-1949-3347-3581'!$C:$I,7,FALSE))))","v":""},null,null,{"$f":"IF(G57=0,\"\",INDEX('[3]1847-1949-3347-3581'!$C$17:$C$14007,MATCH(G57,'[3]1847-1949-3347-3581'!$F$17:$F$14007,0)))","v":""},{"$f":"IF(ISNA(IF(H57=0,\"\",CONCATENATE(VLOOKUP(H57,'[3]1847-1949-3347-3581'!$C:$I,6,FALSE),\" \",VLOOKUP(H57,'[3]1847-1949-3347-3581'!$C:$I,7,FALSE)))),\"\",IF(H57=0,\"\",CONCATENATE(VLOOKUP(H57,'[3]1847-1949-3347-3581'!$C:$I,6,FALSE),\" \",VLOOKUP(H57,'[3]1847-1949-3347-3581'!$C:$I,7,FALSE))))","v":""},null,null,{"$f":"IF(K57=0,\"\",INDEX('[3]1847-1949-3347-3581'!$C$17:$C$14007,MATCH(K57,'[3]1847-1949-3347-3581'!$F$17:$F$14007,0)))","v":""},{"$f":"IF(ISNA(IF(L57=0,\"\",CONCATENATE(VLOOKUP(L57,'[3]1847-1949-3347-3581'!$C:$I,6,FALSE),\" \",VLOOKUP(L57,'[3]1847-1949-3347-3581'!$C:$I,7,FALSE)))),\"\",IF(L57=0,\"\",CONCATENATE(VLOOKUP(L57,'[3]1847-1949-3347-3581'!$C:$I,6,FALSE),\" \",VLOOKUP(L57,'[3]1847-1949-3347-3581'!$C:$I,7,FALSE))))","v":""},null,null,{"$f":"IF(O57=0,\"\",INDEX('[3]1847-1949-3347-3581'!$C$17:$C$14007,MATCH(O57,'[3]1847-1949-3347-3581'!$F$17:$F$14007,0)))","v":""},{"$f":"IF(ISNA(IF(P57=0,\"\",CONCATENATE(VLOOKUP(P57,'[3]1847-1949-3347-3581'!$C:$I,6,FALSE),\" \",VLOOKUP(P57,'[3]1847-1949-3347-3581'!$C:$I,7,FALSE)))),\"\",IF(P57=0,\"\",CONCATENATE(VLOOKUP(P57,'[3]1847-1949-3347-3581'!$C:$I,6,FALSE),\" \",VLOOKUP(P57,'[3]1847-1949-3347-3581'!$C:$I,7,FALSE))))","v":""}]
[null,null,null,{"$f":"IF(C58=0,\"\",INDEX('[3]1847-1949-3347-3581'!$C$17:$C$14007,MATCH(C58,'[3]1847-1949-3347-3581'!$F$17:$F$14007,0)))","v":""},{"$f":"IF(ISNA(IF(D58=0,\"\",CONCATENATE(VLOOKUP(D58,'[3]1847-1949-3347-3581'!$C:$I,6,FALSE),\" \",VLOOKUP(D58,'[3]1847-1949-3347-3581'!$C:$I,7,FALSE)))),\"\",IF(D58=0,\"\",CONCATENATE(VLOOKUP(D58,'[3]1847-1949-3347-3581'!$C:$I,6,FALSE),\" \",VLOOKUP(D58,'[3]1847-1949-3347-3581'!$C:$I,7,FALSE))))","v":""},null,null,{"$f":"IF(G58=0,\"\",INDEX('[3]1847-1949-3347-3581'!$C$17:$C$14007,MATCH(G58,'[3]1847-1949-3347-3581'!$F$17:$F$14007,0)))","v":""},{"$f":"IF(ISNA(IF(H58=0,\"\",CONCATENATE(VLOOKUP(H58,'[3]1847-1949-3347-3581'!$C:$I,6,FALSE),\" \",VLOOKUP(H58,'[3]1847-1949-3347-3581'!$C:$I,7,FALSE)))),\"\",IF(H58=0,\"\",CONCATENATE(VLOOKUP(H58,'[3]1847-1949-3347-3581'!$C:$I,6,FALSE),\" \",VLOOKUP(H58,'[3]1847-1949-3347-3581'!$C:$I,7,FALSE))))","v":""},null,null,{"$f":"IF(K58=0,\"\",INDEX('[3]1847-1949-3347-3581'!$C$17:$C$14007,MATCH(K58,'[3]1847-1949-3347-3581'!$F$17:$F$14007,0)))","v":""},{"$f":"IF(ISNA(IF(L58=0,\"\",CONCATENATE(VLOOKUP(L58,'[3]1847-1949-3347-3581'!$C:$I,6,FALSE),\" \",VLOOKUP(L58,'[3]1847-1949-3347-3581'!$C:$I,7,FALSE)))),\"\",IF(L58=0,\"\",CONCATENATE(VLOOKUP(L58,'[3]1847-1949-3347-3581'!$C:$I,6,FALSE),\" \",VLOOKUP(L58,'[3]1847-1949-3347-3581'!$C:$I,7,FALSE))))","v":""},null,null,{"$f":"IF(O58=0,\"\",INDEX('[3]1847-1949-3347-3581'!$C$17:$C$14007,MATCH(O58,'[3]1847-1949-3347-3581'!$F$17:$F$14007,0)))","v":""},{"$f":"IF(ISNA(IF(P58=0,\"\",CONCATENATE(VLOOKUP(P58,'[3]1847-1949-3347-3581'!$C:$I,6,FALSE),\" \",VLOOKUP(P58,'[3]1847-1949-3347-3581'!$C:$I,7,FALSE)))),\"\",IF(P58=0,\"\",CONCATENATE(VLOOKUP(P58,'[3]1847-1949-3347-3581'!$C:$I,6,FALSE),\" \",VLOOKUP(P58,'[3]1847-1949-3347-3581'!$C:$I,7,FALSE))))","v":""}]
[null,null,null,{"$f":"IF(C59=0,\"\",INDEX('[3]1847-1949-3347-3581'!$C$17:$C$14007,MATCH(C59,'[3]1847-1949-3347-3581'!$F$17:$F$14007,0)))","v":""},{"$f":"IF(ISNA(IF(D59=0,\"\",CONCATENATE(VLOOKUP(D59,'[3]1847-1949-3347-3581'!$C:$I,6,FALSE),\" \",VLOOKUP(D59,'[3]1847-1949-3347-3581'!$C:$I,7,FALSE)))),\"\",IF(D59=0,\"\",CONCATENATE(VLOOKUP(D59,'[3]1847-1949-3347-3581'!$C:$I,6,FALSE),\" \",VLOOKUP(D59,'[3]1847-1949-3347-3581'!$C:$I,7,FALSE))))","v":""},null,null,{"$f":"IF(G59=0,\"\",INDEX('[3]1847-1949-3347-3581'!$C$17:$C$14007,MATCH(G59,'[3]1847-1949-3347-3581'!$F$17:$F$14007,0)))","v":""},{"$f":"IF(ISNA(IF(H59=0,\"\",CONCATENATE(VLOOKUP(H59,'[3]1847-1949-3347-3581'!$C:$I,6,FALSE),\" \",VLOOKUP(H59,'[3]1847-1949-3347-3581'!$C:$I,7,FALSE)))),\"\",IF(H59=0,\"\",CONCATENATE(VLOOKUP(H59,'[3]1847-1949-3347-3581'!$C:$I,6,FALSE),\" \",VLOOKUP(H59,'[3]1847-1949-3347-3581'!$C:$I,7,FALSE))))","v":""},null,null,{"$f":"IF(K59=0,\"\",INDEX('[3]1847-1949-3347-3581'!$C$17:$C$14007,MATCH(K59,'[3]1847-1949-3347-3581'!$F$17:$F$14007,0)))","v":""},{"$f":"IF(ISNA(IF(L59=0,\"\",CONCATENATE(VLOOKUP(L59,'[3]1847-1949-3347-3581'!$C:$I,6,FALSE),\" \",VLOOKUP(L59,'[3]1847-1949-3347-3581'!$C:$I,7,FALSE)))),\"\",IF(L59=0,\"\",CONCATENATE(VLOOKUP(L59,'[3]1847-1949-3347-3581'!$C:$I,6,FALSE),\" \",VLOOKUP(L59,'[3]1847-1949-3347-3581'!$C:$I,7,FALSE))))","v":""},null,null,{"$f":"IF(O59=0,\"\",INDEX('[3]1847-1949-3347-3581'!$C$17:$C$14007,MATCH(O59,'[3]1847-1949-3347-3581'!$F$17:$F$14007,0)))","v":""},{"$f":"IF(ISNA(IF(P59=0,\"\",CONCATENATE(VLOOKUP(P59,'[3]1847-1949-3347-3581'!$C:$I,6,FALSE),\" \",VLOOKUP(P59,'[3]1847-1949-3347-3581'!$C:$I,7,FALSE)))),\"\",IF(P59=0,\"\",CONCATENATE(VLOOKUP(P59,'[3]1847-1949-3347-3581'!$C:$I,6,FALSE),\" \",VLOOKUP(P59,'[3]1847-1949-3347-3581'!$C:$I,7,FALSE))))","v":""}]
["Vincent Samuel",null,null,{"$f":"IF(C60=0,\"\",INDEX('[3]1847-1949-3347-3581'!$C$17:$C$14007,MATCH(C60,'[3]1847-1949-3347-3581'!$F$17:$F$14007,0)))","v":""},{"$f":"IF(ISNA(IF(D60=0,\"\",CONCATENATE(VLOOKUP(D60,'[3]1847-1949-3347-3581'!$C:$I,6,FALSE),\" \",VLOOKUP(D60,'[3]1847-1949-3347-3581'!$C:$I,7,FALSE)))),\"\",IF(D60=0,\"\",CONCATENATE(VLOOKUP(D60,'[3]1847-1949-3347-3581'!$C:$I,6,FALSE),\" \",VLOOKUP(D60,'[3]1847-1949-3347-3581'!$C:$I,7,FALSE))))","v":""},"1-HPD-336",383754,{"$f":"IF(G60=0,\"\",INDEX('[3]1847-1949-3347-3581'!$C$17:$C$14007,MATCH(G60,'[3]1847-1949-3347-3581'!$F$17:$F$14007,0)))","v":"1847/2718"},{"$f":"IF(ISNA(IF(H60=0,\"\",CONCATENATE(VLOOKUP(H60,'[3]1847-1949-3347-3581'!$C:$I,6,FALSE),\" \",VLOOKUP(H60,'[3]1847-1949-3347-3581'!$C:$I,7,FALSE)))),\"\",IF(H60=0,\"\",CONCATENATE(VLOOKUP(H60,'[3]1847-1949-3347-3581'!$C:$I,6,FALSE),\" \",VLOOKUP(H60,'[3]1847-1949-3347-3581'!$C:$I,7,FALSE))))","v":"Bassilly Rue Warissaet"},null,"absent",{"$f":"IF(K60=0,\"\",INDEX('[3]1847-1949-3347-3581'!$C$17:$C$14007,MATCH(K60,'[3]1847-1949-3347-3581'!$F$17:$F$14007,0)))","v":{"$error":"#N/A"}},{"$f":"IF(ISNA(IF(L60=0,\"\",CONCATENATE(VLOOKUP(L60,'[3]1847-1949-3347-3581'!$C:$I,6,FALSE),\" \",VLOOKUP(L60,'[3]1847-1949-3347-3581'!$C:$I,7,FALSE)))),\"\",IF(L60=0,\"\",CONCATENATE(VLOOKUP(L60,'[3]1847-1949-3347-3581'!$C:$I,6,FALSE),\" \",VLOOKUP(L60,'[3]1847-1949-3347-3581'!$C:$I,7,FALSE))))","v":""},null,378023,{"$f":"IF(O60=0,\"\",INDEX('[3]1847-1949-3347-3581'!$C$17:$C$14007,MATCH(O60,'[3]1847-1949-3347-3581'!$F$17:$F$14007,0)))","v":"1847/2721"},{"$f":"IF(ISNA(IF(P60=0,\"\",CONCATENATE(VLOOKUP(P60,'[3]1847-1949-3347-3581'!$C:$I,6,FALSE),\" \",VLOOKUP(P60,'[3]1847-1949-3347-3581'!$C:$I,7,FALSE)))),\"\",IF(P60=0,\"\",CONCATENATE(VLOOKUP(P60,'[3]1847-1949-3347-3581'!$C:$I,6,FALSE),\" \",VLOOKUP(P60,'[3]1847-1949-3347-3581'!$C:$I,7,FALSE))))","v":"Estaimpuis Rue de l'Armistice "}]
[9349,null,null,{"$f":"IF(C61=0,\"\",INDEX('[3]1847-1949-3347-3581'!$C$17:$C$14007,MATCH(C61,'[3]1847-1949-3347-3581'!$F$17:$F$14007,0)))","v":""},{"$f":"IF(ISNA(IF(D61=0,\"\",CONCATENATE(VLOOKUP(D61,'[3]1847-1949-3347-3581'!$C:$I,6,FALSE),\" \",VLOOKUP(D61,'[3]1847-1949-3347-3581'!$C:$I,7,FALSE)))),\"\",IF(D61=0,\"\",CONCATENATE(VLOOKUP(D61,'[3]1847-1949-3347-3581'!$C:$I,6,FALSE),\" \",VLOOKUP(D61,'[3]1847-1949-3347-3581'!$C:$I,7,FALSE))))","v":""},null,"stop job 08h30",{"$f":"IF(G61=0,\"\",INDEX('[3]1847-1949-3347-3581'!$C$17:$C$14007,MATCH(G61,'[3]1847-1949-3347-3581'!$F$17:$F$14007,0)))","v":{"$error":"#N/A"}},{"$f":"IF(ISNA(IF(H61=0,\"\",CONCATENATE(VLOOKUP(H61,'[3]1847-1949-3347-3581'!$C:$I,6,FALSE),\" \",VLOOKUP(H61,'[3]1847-1949-3347-3581'!$C:$I,7,FALSE)))),\"\",IF(H61=0,\"\",CONCATENATE(VLOOKUP(H61,'[3]1847-1949-3347-3581'!$C:$I,6,FALSE),\" \",VLOOKUP(H61,'[3]1847-1949-3347-3581'!$C:$I,7,FALSE))))","v":""},null,null,{"$f":"IF(K61=0,\"\",INDEX('[3]1847-1949-3347-3581'!$C$17:$C$14007,MATCH(K61,'[3]1847-1949-3347-3581'!$F$17:$F$14007,0)))","v":""},{"$f":"IF(ISNA(IF(L61=0,\"\",CONCATENATE(VLOOKUP(L61,'[3]1847-1949-3347-3581'!$C:$I,6,FALSE),\" \",VLOOKUP(L61,'[3]1847-1949-3347-3581'!$C:$I,7,FALSE)))),\"\",IF(L61=0,\"\",CONCATENATE(VLOOKUP(L61,'[3]1847-1949-3347-3581'!$C:$I,6,FALSE),\" \",VLOOKUP(L61,'[3]1847-1949-3347-3581'!$C:$I,7,FALSE))))","v":""},null,null,{"$f":"IF(O61=0,\"\",INDEX('[3]1847-1949-3347-3581'!$C$17:$C$14007,MATCH(O61,'[3]1847-1949-3347-3581'!$F$17:$F$14007,0)))","v":""},{"$f":"IF(ISNA(IF(P61=0,\"\",CONCATENATE(VLOOKUP(P61,'[3]1847-1949-3347-3581'!$C:$I,6,FALSE),\" \",VLOOKUP(P61,'[3]1847-1949-3347-3581'!$C:$I,7,FALSE)))),\"\",IF(P61=0,\"\",CONCATENATE(VLOOKUP(P61,'[3]1847-1949-3347-3581'!$C:$I,6,FALSE),\" \",VLOOKUP(P61,'[3]1847-1949-3347-3581'!$C:$I,7,FALSE))))","v":""}]
[null,null,null,{"$f":"IF(C62=0,\"\",INDEX('[3]1847-1949-3347-3581'!$C$17:$C$14007,MATCH(C62,'[3]1847-1949-3347-3581'!$F$17:$F$14007,0)))","v":""},{"$f":"IF(ISNA(IF(D62=0,\"\",CONCATENATE(VLOOKUP(D62,'[3]1847-1949-3347-3581'!$C:$I,6,FALSE),\" \",VLOOKUP(D62,'[3]1847-1949-3347-3581'!$C:$I,7,FALSE)))),\"\",IF(D62=0,\"\",CONCATENATE(VLOOKUP(D62,'[3]1847-1949-3347-3581'!$C:$I,6,FALSE),\" \",VLOOKUP(D62,'[3]1847-1949-3347-3581'!$C:$I,7,FALSE))))","v":""},null,null,{"$f":"IF(G62=0,\"\",INDEX('[3]1847-1949-3347-3581'!$C$17:$C$14007,MATCH(G62,'[3]1847-1949-3347-3581'!$F$17:$F$14007,0)))","v":""},{"$f":"IF(ISNA(IF(H62=0,\"\",CONCATENATE(VLOOKUP(H62,'[3]1847-1949-3347-3581'!$C:$I,6,FALSE),\" \",VLOOKUP(H62,'[3]1847-1949-3347-3581'!$C:$I,7,FALSE)))),\"\",IF(H62=0,\"\",CONCATENATE(VLOOKUP(H62,'[3]1847-1949-3347-3581'!$C:$I,6,FALSE),\" \",VLOOKUP(H62,'[3]1847-1949-3347-3581'!$C:$I,7,FALSE))))","v":""},null,null,{"$f":"IF(K62=0,\"\",INDEX('[3]1847-1949-3347-3581'!$C$17:$C$14007,MATCH(K62,'[3]1847-1949-3347-3581'!$F$17:$F$14007,0)))","v":""},{"$f":"IF(ISNA(IF(L62=0,\"\",CONCATENATE(VLOOKUP(L62,'[3]1847-1949-3347-3581'!$C:$I,6,FALSE),\" \",VLOOKUP(L62,'[3]1847-1949-3347-3581'!$C:$I,7,FALSE)))),\"\",IF(L62=0,\"\",CONCATENATE(VLOOKUP(L62,'[3]1847-1949-3347-3581'!$C:$I,6,FALSE),\" \",VLOOKUP(L62,'[3]1847-1949-3347-3581'!$C:$I,7,FALSE))))","v":""},null,null,{"$f":"IF(O62=0,\"\",INDEX('[3]1847-1949-3347-3581'!$C$17:$C$14007,MATCH(O62,'[3]1847-1949-3347-3581'!$F$17:$F$14007,0)))","v":""},{"$f":"IF(ISNA(IF(P62=0,\"\",CONCATENATE(VLOOKUP(P62,'[3]1847-1949-3347-3581'!$C:$I,6,FALSE),\" \",VLOOKUP(P62,'[3]1847-1949-3347-3581'!$C:$I,7,FALSE)))),\"\",IF(P62=0,\"\",CONCATENATE(VLOOKUP(P62,'[3]1847-1949-3347-3581'!$C:$I,6,FALSE),\" \",VLOOKUP(P62,'[3]1847-1949-3347-3581'!$C:$I,7,FALSE))))","v":""}]
[null,null,null,{"$f":"IF(C63=0,\"\",INDEX('[3]1847-1949-3347-3581'!$C$17:$C$14007,MATCH(C63,'[3]1847-1949-3347-3581'!$F$17:$F$14007,0)))","v":""},{"$f":"IF(ISNA(IF(D63=0,\"\",CONCATENATE(VLOOKUP(D63,'[3]1847-1949-3347-3581'!$C:$I,6,FALSE),\" \",VLOOKUP(D63,'[3]1847-1949-3347-3581'!$C:$I,7,FALSE)))),\"\",IF(D63=0,\"\",CONCATENATE(VLOOKUP(D63,'[3]1847-1949-3347-3581'!$C:$I,6,FALSE),\" \",VLOOKUP(D63,'[3]1847-1949-3347-3581'!$C:$I,7,FALSE))))","v":""},null,null,{"$f":"IF(G63=0,\"\",INDEX('[3]1847-1949-3347-3581'!$C$17:$C$14007,MATCH(G63,'[3]1847-1949-3347-3581'!$F$17:$F$14007,0)))","v":""},{"$f":"IF(ISNA(IF(H63=0,\"\",CONCATENATE(VLOOKUP(H63,'[3]1847-1949-3347-3581'!$C:$I,6,FALSE),\" \",VLOOKUP(H63,'[3]1847-1949-3347-3581'!$C:$I,7,FALSE)))),\"\",IF(H63=0,\"\",CONCATENATE(VLOOKUP(H63,'[3]1847-1949-3347-3581'!$C:$I,6,FALSE),\" \",VLOOKUP(H63,'[3]1847-1949-3347-3581'!$C:$I,7,FALSE))))","v":""},null,null,{"$f":"IF(K63=0,\"\",INDEX('[3]1847-1949-3347-3581'!$C$17:$C$14007,MATCH(K63,'[3]1847-1949-3347-3581'!$F$17:$F$14007,0)))","v":""},{"$f":"IF(ISNA(IF(L63=0,\"\",CONCATENATE(VLOOKUP(L63,'[3]1847-1949-3347-3581'!$C:$I,6,FALSE),\" \",VLOOKUP(L63,'[3]1847-1949-3347-3581'!$C:$I,7,FALSE)))),\"\",IF(L63=0,\"\",CONCATENATE(VLOOKUP(L63,'[3]1847-1949-3347-3581'!$C:$I,6,FALSE),\" \",VLOOKUP(L63,'[3]1847-1949-3347-3581'!$C:$I,7,FALSE))))","v":""},null,null,{"$f":"IF(O63=0,\"\",INDEX('[3]1847-1949-3347-3581'!$C$17:$C$14007,MATCH(O63,'[3]1847-1949-3347-3581'!$F$17:$F$14007,0)))","v":""},{"$f":"IF(ISNA(IF(P63=0,\"\",CONCATENATE(VLOOKUP(P63,'[3]1847-1949-3347-3581'!$C:$I,6,FALSE),\" \",VLOOKUP(P63,'[3]1847-1949-3347-3581'!$C:$I,7,FALSE)))),\"\",IF(P63=0,\"\",CONCATENATE(VLOOKUP(P63,'[3]1847-1949-3347-3581'!$C:$I,6,FALSE),\" \",VLOOKUP(P63,'[3]1847-1949-3347-3581'!$C:$I,7,FALSE))))","v":""}]
[]
[]
[]
[]
[]
[]
[]
[]
[]
[]
[]
[]
[]
[]
[]
[null,"Cronos",null,null,null,"Cronos",null,null,null,"Cronos",null,null,null,"Cronos"]
[null,{"$f":"IF(C80=0,\"\",VLOOKUP(C80,'[3]1847-1949-3347-3581'!$C:$I,4,FALSE))","v":""},null,null,null,{"$f":"IF(G80=0,\"\",VLOOKUP(G80,'[3]1847-1949-3347-3581'!$C:$I,4,FALSE))","v":""},null,null,null,{"$f":"IF(K80=0,\"\",VLOOKUP(K80,'[3]1847-1949-3347-3581'!$C:$I,4,FALSE))","v":""},null,null,null,{"$f":"IF(O80=0,\"\",VLOOKUP(O80,'[3]1847-1949-3347-3581'!$C:$I,4,FALSE))","v":""}]
[null,"Chantier",null,null,null,"Chantier",null,null,null,"Chantier",null,null,null,"Chantier"]
[null,{"$f":"INDEX('[3]1847-1949-3347-3581'!$C$17:$C$14007,MATCH(#REF!,'[3]1847-1949-3347-3581'!$F$17:$F$14007,0))","v":{"$error":"#REF!"}},null,null,null,{"$f":"INDEX('[3]1847-1949-3347-3581'!$C$17:$C$14007,MATCH(A82,'[3]1847-1949-3347-3581'!$F$17:$F$14007,0))","v":"5419/0000"},null,null,null,{"$f":"INDEX('[3]1847-1949-3347-3581'!$C$17:$C$14007,MATCH(I82,'[3]1847-1949-3347-3581'!$F$17:$F$14007,0))","v":"5419/0000"},null,null,null,{"$f":"INDEX('[3]1847-1949-3347-3581'!$C$17:$C$14007,MATCH(M82,'[3]1847-1949-3347-3581'!$F$17:$F$14007,0))","v":"5419/0000"}]

{"sheet":"Data","index":2,"n_rows":25,"n_cols":4,"rows_kept":25,"cut":false,"hidden":false,"merged":[]}
["Prénoms",null,null,"Plaques"]
["Olivier B.",null,null,"1-HPD-336"]
["Yves",null,null,"1-YSQ-618"]
["Fonzy",null,null,"44-U-61"]
["Johnny",null,null,"1-NKK-964"]
["Jean-Pierre",null,null,"1-PLT-828"]
["Donato",null,null,"1-NKK-366"]
["Fabien",null,null,"2-BEP-553"]
["Hubert",null,null,"2-CMR-664"]
["Frédéric",null,null,"1-NNV-473"]
["Jason",null,null,"1-NNL-811"]
["Michel M.",null,null,"2-ARY-258"]
["Michel P.",null,null,"2-CBN-005"]
["Olivier V.",null,null,"1-NBX-656"]
["Geoffrey",null,null,"1-NBV-134"]
["Samuel",null,null,"1-NBV-173"]
[null,null,null,"1-NTH-884"]
[null,null,null,"1-VMA-654"]
[null,null,null,"Q-AEB-285"]
[null,null,null,"Minipelle 1,9T"]
[null,null,null,"UEV-047"]
[null,null,null,"Minipelle 2,5T"]
[null,null,null,"Q-AJX-613"]
[null,null,null,"Dérouleuse"]
[null,null,null,"UEC-607"]

{"sheet":"Congés","index":3,"n_rows":46,"n_cols":2,"rows_kept":46,"cut":false,"hidden":false,"merged":[]}
["2023-01-02","Congé"]
["2023-01-03","Congé"]
["2023-01-04","Congé"]
["2023-01-05","Congé"]
["2023-01-06","Congé"]
["2023-04-10","Congé"]
["2023-04-11","Congé"]
["2023-04-12","Congé"]
["2023-04-13","Congé"]
["2023-04-14","Congé"]
["2023-05-01","Congé"]
["2023-05-18","Congé"]
["2023-05-19","Congé"]
["2023-05-29","Congé"]
["2023-07-17","Congé"]
["2023-07-18","Congé"]
["2023-07-19","Congé"]
["2023-07-20","Congé"]
["2023-07-21","Congé"]
["2023-07-24","Congé"]
["2023-07-25","Congé"]
["2023-07-26","Congé"]
["2023-07-27","Congé"]
["2023-07-28","Congé"]
["2023-07-31","Congé"]
["2023-08-01","Congé"]
["2023-08-02","Congé"]
["2023-08-03","Congé"]
["2023-08-04","Congé"]
["2023-08-14","Congé"]
["2023-08-15","Congé"]
["2023-10-30","Congé"]
["2023-10-31","Congé"]
["2023-11-01","Congé"]
["2023-11-02","Congé"]
["2023-11-03","Congé"]
["2023-12-25","Congé"]
["2023-12-26","Congé"]
["2023-12-27","Congé"]
["2023-12-28","Congé"]
["2023-12-29","Congé"]
["2024-01-01","Congé"]
["2024-01-02","Congé"]
["2024-01-03","Congé"]
["2024-01-04","Congé"]
["2024-01-05","Congé"]