{"text_format":"1","workbook":"xlsx","n_sheets":3,"sheets":["Planning","Personnel","Explications"],"not_rendered":{"charts":0,"images":0,"macros":1,"external_links":0,"defined_names":63,"comments":1,"pivot_tables":0},"unopened":[],"bounds":{"document_bytes":16777216,"sheet_cells":100000,"rows_first":2000,"rows_last":500,"rows_between":2000,"halvings":0,"cell_chars":16384,"cell_head_chars":4096},"cells_cut":0,"cells_raw":0,"read":"whole","date_system":"1900"}

{"sheet":"Planning","index":0,"n_rows":125,"n_cols":189,"rows_kept":125,"cut":false,"hidden":false,"merged":[[0,1,0,4],[1,1,1,6],[0,8,0,11],[1,8,1,13],[0,15,0,18],[1,15,1,20],[0,22,0,25],[1,22,1,27],[18,7,18,10],[19,7,19,12],[107,133,107,138],[107,139,107,144],[107,145,107,150],[107,151,107,156],[108,133,108,136],[108,139,108,142],[108,145,108,148],[108,151,108,154],[109,133,109,138],[109,139,109,144],[109,145,109,150],[109,151,109,156],[110,133,110,136],[110,139,110,142],[110,145,110,148],[110,151,110,154],[123,133,123,137],[123,139,123,143],[123,145,123,149],[123,151,123,155],[91,133,91,138],[91,139,91,144],[91,145,91,150],[91,151,91,156],[102,133,102,137],[102,139,102,143],[102,145,102,149],[102,151,102,155],[103,133,103,137],[103,139,103,143],[103,145,103,149],[103,151,103,155],[104,133,104,136],[104,139,104,142],[104,145,104,148],[104,151,104,154],[105,133,105,138],[105,139,105,144],[105,145,105,150],[105,151,105,156],[85,151,85,156],[86,133,86,136],[86,139,86,142],[86,145,86,148],[86,151,86,154],[87,133,87,138],[87,139,87,144],[87,145,87,150],[87,151,87,156],[88,133,88,136],[88,139,88,142],[88,145,88,148],[88,151,88,154],[89,133,89,138],[89,139,89,144],[89,145,89,150],[89,151,89,156],[48,139,48,142],[48,145,48,148],[48,151,48,154],[49,133,49,138],[49,139,49,144],[49,145,49,150],[49,151,49,156],[50,133,50,136],[50,139,50,142],[50,145,50,148],[50,151,50,154],[51,133,51,138],[51,139,51,144],[51,145,51,150],[51,151,51,156],[83,133,83,137],[83,139,83,143],[83,145,83,149],[83,151,83,155],[39,133,39,137],[39,139,39,143],[39,145,39,149],[39,151,39,155],[43,133,43,137],[43,139,43,143],[43,145,43,149],[43,151,43,155],[44,133,44,136],[44,139,44,142],[44,145,44,148],[44,151,44,154],[45,133,45,138],[45,139,45,144],[45,145,45,150],[45,151,45,156],[46,133,46,136],[46,139,46,142],[46,145,46,148],[46,151,46,154],[34,151,34,154],[35,133,35,138],[35,139,35,144],[35,145,35,150],[35,151,35,156],[36,133,36,138],[36,139,36,144],[36,145,36,150],[36,151,36,156],[37,133,37,138],[37,139,37,144],[37,145,37,150],[37,151,37,156],[38,133,38,137],[38,139,38,143],[38,145,38,149],[38,151,38,155],[24,133,24,136],[24,139,24,142],[24,145,24,148],[24,151,24,154],[25,133,25,138],[25,139,25,144],[25,145,25,150],[25,151,25,156],[26,133,26,136],[26,139,26,142],[26,145,26,148],[26,151,26,154],[27,133,27,138],[27,139,27,144],[27,145,27,150],[27,151,27,156],[31,133,31,138],[31,139,31,144],[31,145,31,150],[31,151,31,156],[12,139,12,142],[12,145,12,148],[12,151,12,154],[13,133,13,138],[13,139,13,144],[13,145,13,150],[13,151,13,156],[14,133,14,136],[14,139,14,142],[14,145,14,148],[14,151,14,154],[19,151,19,155],[20,133,20,137],[20,139,20,143],[20,145,20,149],[20,151,20,155],[21,133,21,137],[21,139,21,143],[21,145,21,149],[21,151,21,155],[123,121,123,125],[123,127,123,131],[3,134,3,137],[3,140,3,143],[3,146,3,149],[3,152,3,155],[4,133,4,136],[4,139,4,142],[4,145,4,148],[4,151,4,154],[5,133,5,138],[5,139,5,144],[5,145,5,150],[5,151,5,156],[6,133,6,136],[6,139,6,142],[6,145,6,148],[6,151,6,154],[7,133,7,138],[7,139,7,144],[7,145,7,150],[7,151,7,156],[8,133,8,136],[8,139,8,142],[8,145,8,148],[8,151,8,154],[9,133,9,138],[9,139,9,144],[9,145,9,150],[9,151,9,156],[10,133,10,136],[10,139,10,142],[108,121,108,124],[108,127,108,130],[109,121,109,126],[109,127,109,132],[110,121,110,124],[110,127,110,130],[111,121,111,126],[111,127,111,132],[112,121,112,124],[112,127,112,130],[113,121,113,126],[113,127,113,132],[114,121,114,124],[114,127,114,130],[115,121,115,126],[115,127,115,132],[116,121,116,126],[116,127,116,132],[98,121,98,125],[98,127,98,131],[99,121,99,125],[99,127,99,131],[100,121,100,125],[100,127,100,131],[102,121,102,125],[102,127,102,131],[103,121,103,125],[103,127,103,131],[104,121,104,124],[104,127,104,130],[105,121,105,126],[105,127,105,132],[106,121,106,124],[106,127,106,130],[107,121,107,126],[107,127,107,132],[86,121,86,124],[86,127,86,130],[87,121,87,126],[87,127,87,132],[88,121,88,124],[88,127,88,130],[89,121,89,126],[89,127,89,132],[90,121,90,124],[90,127,90,130],[91,121,91,126],[91,127,91,132],[92,121,92,124],[92,127,92,130],[93,121,93,126],[93,127,93,132],[94,121,94,124],[94,127,94,130],[53,121,53,126],[53,127,53,132],[54,121,54,124],[54,127,54,130],[55,121,55,126],[55,127,55,132],[56,121,56,126],[56,127,56,132],[57,121,57,126],[57,127,57,132],[58,121,58,125],[58,127,58,131],[59,121,59,125],[59,127,59,131],[84,121,84,124],[84,127,84,130],[85,121,85,126],[85,127,85,132],[36,127,36,132],[37,121,37,126],[37,127,37,132],[38,121,38,125],[38,127,38,131],[39,121,39,125],[39,127,39,131],[40,121,40,125],[40,127,40,131],[43,121,43,125],[43,127,43,131],[44,121,44,124],[44,127,44,130],[45,121,45,126],[45,127,45,132],[46,121,46,124],[46,127,46,130],[24,121,24,124],[24,127,24,130],[25,121,25,126],[25,127,25,132],[26,121,26,124],[26,127,26,130],[27,121,27,126],[27,127,27,132],[28,121,28,124],[28,127,28,130],[29,121,29,126],[29,127,29,132],[30,121,30,124],[30,127,30,130],[31,121,31,126],[31,127,31,132],[32,121,32,124],[32,127,32,130],[23,121,23,125],[23,127,23,131],[15,133,15,138],[15,139,15,144],[15,145,15,150],[15,151,15,156],[16,133,16,138],[16,139,16,144],[16,145,16,150],[16,151,16,156],[17,133,17,138],[17,139,17,144],[17,145,17,150],[17,151,17,156],[18,133,18,137],[18,139,18,143],[18,145,18,149],[18,151,18,155],[22,133,22,137],[22,139,22,143],[22,145,22,149],[22,151,22,155],[23,133,23,137],[23,139,23,143],[23,145,23,149],[23,151,23,155],[22,188,22,192],[23,182,23,186],[23,188,23,192],[3,122,3,125],[3,128,3,131],[4,121,4,124],[4,127,4,130],[5,121,5,126],[5,127,5,132],[6,121,6,124],[6,127,6,130],[7,121,7,126],[7,127,7,132],[8,121,8,124],[8,127,8,130],[9,121,9,126],[9,127,9,132],[10,121,10,124],[10,127,10,130],[11,121,11,126],[11,127,11,132],[12,121,12,124],[12,127,12,130],[13,121,13,126],[13,127,13,132],[14,121,14,124],[14,127,14,130],[15,121,15,126],[15,127,15,132],[16,121,16,126],[16,127,16,132],[17,121,17,126],[13,188,13,192],[14,182,14,186],[14,188,14,192],[15,182,15,186],[15,188,15,192],[16,182,16,186],[16,188,16,192],[17,182,17,186],[17,188,17,192],[18,182,18,186],[18,188,18,192],[19,182,19,186],[19,188,19,192],[20,182,20,186],[20,188,20,192],[21,182,21,186],[21,188,21,192],[4,188,4,193],[5,182,5,186],[5,188,5,192],[6,182,6,186],[6,188,6,192],[7,182,7,186],[7,188,7,192],[8,182,8,186],[8,188,8,192],[9,182,9,186],[9,188,9,192],[10,182,10,186],[10,188,10,192],[11,182,11,186],[11,188,11,192],[12,182,12,186],[12,188,12,192],[5,73,5,78],[5,79,5,84],[6,43,6,46],[12,37,12,40],[12,43,12,46],[9,37,9,42],[9,43,9,48],[14,13,14,16],[14,19,14,22],[14,25,14,28],[22,158,22,162],[14,158,14,162],[15,158,15,162],[15,115,15,120],[21,158,21,162],[2,1,2,3],[4,182,4,187],[13,182,13,186],[22,182,22,186],[17,127,17,132],[18,121,18,125],[18,127,18,131],[19,121,19,125],[19,127,19,131],[20,121,20,125],[20,127,20,131],[21,121,21,125],[21,127,21,131],[22,121,22,125],[22,127,22,131],[10,145,10,148],[10,151,10,154],[5,13,5,18],[4,1,4,4],[8,1,8,4],[4,25,4,28],[18,79,18,83],[7,49,7,54],[7,55,7,60],[14,61,14,64],[14,67,14,70],[14,73,14,76],[15,73,15,78],[7,61,7,66],[7,67,7,72],[3,116,3,119],[3,62,3,65],[3,68,3,71],[3,74,3,77],[3,80,3,83],[3,86,3,89],[3,92,3,95],[3,98,3,101],[3,104,3,107],[3,110,3,113],[6,115,6,118],[10,85,10,88],[4,85,4,88],[6,85,6,88],[8,85,8,88],[8,49,8,52],[8,55,8,58],[8,61,8,64],[8,67,8,70],[3,50,3,53],[3,56,3,59],[12,61,12,64],[14,49,14,52],[14,55,14,58],[14,79,14,82],[8,43,8,46],[6,79,6,82],[12,79,12,82],[12,67,12,70],[18,1,18,5],[3,14,3,17],[3,20,3,23],[3,26,3,29],[3,32,3,35],[3,38,3,41],[18,31,18,35],[18,37,18,41],[4,13,4,16],[4,19,4,22],[12,13,12,16],[6,25,6,28],[6,31,6,34],[3,2,3,5],[3,8,3,11],[14,7,14,10],[12,7,12,10],[8,7,8,10],[17,7,17,12],[10,1,10,4],[14,1,14,4],[5,19,5,24],[7,19,7,24],[9,19,9,24],[11,19,11,24],[13,19,13,24],[15,19,15,24],[4,49,4,52],[4,55,4,58],[7,43,7,48],[5,37,5,42],[5,43,5,48],[5,49,5,54],[5,55,5,60],[7,37,7,42],[16,1,16,4],[16,7,16,10],[16,13,16,16],[16,19,16,22],[16,25,16,28],[10,13,10,16],[10,19,10,22],[10,25,10,28],[10,31,10,34],[10,37,10,40],[6,13,6,16],[6,19,6,22],[6,55,6,58],[12,49,12,52],[12,55,12,58],[12,19,12,22],[12,25,12,28],[12,31,12,34],[23,7,23,11],[10,7,10,10],[4,7,4,10],[12,1,12,4],[6,1,6,4],[11,7,11,12],[13,7,13,12],[19,49,19,53],[22,49,22,53],[20,49,20,53],[20,55,20,59],[18,49,18,53],[21,49,21,53],[21,55,21,59],[19,19,19,23],[21,25,21,29],[22,25,22,29],[23,25,23,29],[20,37,20,41],[18,43,18,47],[16,31,16,36],[16,37,16,42],[16,43,16,48],[17,31,17,36],[20,13,20,17],[10,43,10,46],[19,31,19,35],[7,13,7,18],[9,13,9,18],[11,13,11,18],[13,13,13,18],[14,31,14,34],[19,37,19,41],[19,43,19,47],[20,19,20,23],[21,19,21,23],[22,19,22,23],[22,37,22,41],[22,43,22,47],[20,43,20,47],[21,31,21,35],[21,37,21,41],[21,43,21,47],[17,19,17,24],[18,19,18,23],[21,7,21,11],[5,1,5,6],[7,1,7,6],[9,1,9,6],[11,1,11,6],[13,1,13,6],[15,1,15,6],[5,7,5,12],[7,7,7,12],[9,7,9,12],[17,1,17,6],[8,13,8,16],[8,19,8,22],[18,13,18,17],[19,13,19,17],[17,13,17,18],[22,7,22,11],[14,37,14,40],[15,13,15,18],[3,44,3,47],[22,1,22,5],[23,1,23,5],[20,1,20,5],[21,1,21,5],[19,1,19,5],[17,25,17,30],[18,25,18,29],[19,25,19,29],[20,25,20,29],[20,31,20,35],[4,37,4,40],[4,43,4,46],[21,13,21,17],[22,13,22,17],[23,13,23,17],[22,31,22,35],[17,37,17,42],[17,43,17,48],[6,7,6,10],[8,25,8,28],[8,31,8,34],[8,37,8,40],[4,31,4,34],[15,7,15,12],[5,25,5,30],[7,25,7,30],[9,25,9,30],[11,25,11,30],[13,25,13,30],[15,25,15,30],[5,31,5,36],[21,176,21,180],[21,109,21,113],[16,91,16,96],[16,97,16,102],[16,103,16,108],[18,91,18,95],[20,91,20,95],[20,97,20,101],[20,103,20,107],[20,109,20,113],[14,103,14,106],[14,109,14,112],[19,91,19,95],[19,97,19,101],[17,115,17,120],[16,115,16,120],[19,133,19,137],[19,139,19,143],[19,145,19,149],[15,176,15,180],[12,158,12,162],[23,115,23,119],[22,115,22,119],[21,115,21,119],[20,115,20,119],[19,115,19,119],[18,115,18,119],[22,97,22,101],[22,103,22,107],[22,109,22,113],[22,176,22,180],[23,176,23,180],[18,158,18,162],[19,158,19,162],[23,158,23,162],[22,164,22,168],[23,164,23,168],[22,170,22,174],[23,170,23,174],[16,164,16,168],[14,164,14,168],[15,164,15,168],[20,164,20,168],[21,164,21,168],[20,170,20,174],[14,97,14,100],[15,97,15,102],[12,103,12,106],[16,109,16,114],[18,97,18,101],[18,103,18,107],[5,61,5,66],[5,67,5,72],[11,170,11,174],[16,170,16,174],[17,170,17,174],[15,170,15,174],[14,170,14,174],[13,170,13,174],[12,170,12,174],[18,164,18,168],[19,164,19,168],[18,170,18,174],[19,170,19,174],[17,91,17,96],[17,97,17,102],[17,103,17,108],[17,109,17,114],[12,91,12,94],[12,109,12,112],[14,91,14,94],[15,91,15,96],[18,109,18,113],[15,103,15,108],[15,109,15,114],[17,158,17,162],[13,158,13,162],[17,67,17,72],[17,73,17,78],[17,79,17,84],[18,61,18,65],[8,73,8,76],[10,61,10,64],[4,158,4,163],[4,164,4,169],[4,170,4,175],[4,176,4,181],[5,164,5,168],[6,164,6,168],[5,176,5,180],[6,176,6,180],[4,97,4,100],[4,103,4,106],[8,79,8,82],[10,79,10,82],[4,61,4,64],[4,67,4,70],[4,73,4,76],[4,109,4,112],[6,91,6,94],[6,97,6,100],[6,103,6,106],[6,109,6,112],[5,91,5,96],[5,97,5,102],[5,103,5,108],[5,109,5,114],[10,91,10,94],[10,97,10,100],[8,91,8,94],[8,97,8,100],[10,109,10,112],[4,91,4,94],[4,115,4,118],[7,73,7,78],[7,31,7,36],[9,31,9,36],[11,31,11,36],[13,31,13,36],[19,103,19,107],[19,109,19,113],[9,109,9,114],[7,85,7,90],[7,91,7,96],[7,97,7,102],[7,103,7,108],[12,73,12,76],[20,85,20,89],[23,73,23,77],[22,73,22,77],[22,61,22,65],[4,79,4,82],[19,79,19,83],[16,79,16,84],[14,85,14,88],[15,79,15,84],[15,85,15,90],[17,85,17,90],[18,85,18,89],[19,85,19,89],[16,85,16,90],[18,73,18,77],[18,67,18,71],[19,61,19,65],[19,67,19,71],[19,73,19,77],[17,61,17,66],[21,91,21,95],[21,97,21,101],[21,103,21,107],[13,91,13,96],[13,97,13,102],[13,103,13,108],[13,109,13,114],[7,109,7,114],[9,73,9,78],[9,79,9,84],[9,85,9,90],[9,91,9,96],[9,97,9,102],[9,103,9,108],[9,49,9,54],[9,55,9,60],[9,61,9,66],[9,67,9,72],[11,49,11,54],[11,55,11,60],[11,61,11,66],[11,67,11,72],[16,61,16,66],[16,67,16,72],[7,79,7,84],[10,49,10,52],[10,55,10,58],[17,49,17,54],[19,55,19,59],[18,55,18,59],[10,67,10,70],[10,73,10,76],[15,37,15,42],[15,43,15,48],[15,49,15,54],[15,55,15,60],[15,61,15,66],[15,67,15,72],[12,97,12,100],[11,115,11,120],[22,79,22,83],[22,85,22,89],[23,67,23,71],[23,31,23,35],[23,37,23,41],[23,43,23,47],[23,49,23,53],[23,55,23,59],[22,55,22,59],[23,79,23,83],[23,97,23,101],[23,103,23,107],[23,109,23,113],[23,91,23,95],[22,91,22,95],[23,85,23,89],[21,67,21,71],[21,73,21,77],[21,79,21,83],[21,85,21,89],[21,61,21,65],[23,61,23,65],[22,67,22,71],[15,31,15,36],[8,170,8,174],[9,170,9,174],[10,170,10,174],[7,164,7,168],[8,164,8,168],[9,164,9,168],[10,164,10,168],[14,176,14,180],[11,73,11,78],[11,79,11,84],[11,85,11,90],[11,91,11,96],[11,97,11,102],[11,103,11,108],[11,109,11,114],[13,37,13,42],[13,43,13,48],[13,49,13,54],[13,55,13,60],[13,61,13,66],[13,67,13,72],[11,37,11,42],[11,43,11,48],[14,43,14,46],[10,103,10,106],[8,103,8,106],[8,109,8,112],[11,133,11,138],[11,139,11,144],[11,145,11,150],[11,151,11,156],[12,133,12,136],[24,158,24,163],[24,164,24,169],[24,170,24,175],[24,176,24,181],[25,1,25,6],[25,7,25,12],[25,13,25,18],[25,19,25,24],[25,25,25,30],[5,170,5,174],[6,170,6,174],[5,158,5,162],[6,37,6,40],[6,49,6,52],[6,158,6,162],[12,176,12,180],[13,176,13,180],[20,176,20,180],[5,85,5,90],[5,115,5,120],[6,61,6,64],[6,67,6,70],[6,73,6,76],[16,55,16,60],[17,55,17,60],[20,61,20,65],[20,67,20,71],[20,73,20,77],[16,49,16,54],[21,170,21,174],[20,158,20,162],[7,158,7,162],[25,176,25,180],[26,1,26,4],[26,7,26,10],[26,13,26,16],[26,19,26,22],[26,25,26,28],[26,31,26,34],[26,37,26,40],[26,43,26,46],[26,49,26,52],[26,55,26,58],[26,61,26,64],[26,67,26,70],[26,73,26,76],[26,79,26,82],[26,85,26,88],[26,91,26,94],[26,97,26,100],[26,103,26,106],[26,109,26,112],[26,115,26,118],[26,158,26,162],[26,164,26,168],[26,170,26,174],[26,176,26,180],[13,73,13,78],[13,79,13,84],[13,85,13,90],[12,85,12,88],[16,73,16,78],[20,79,20,83],[7,176,7,180],[8,176,8,180],[9,176,9,180],[10,176,10,180],[11,176,11,180],[16,176,16,180],[17,176,17,180],[12,115,12,118],[14,115,14,118],[10,115,10,118],[8,115,8,118],[17,164,17,168],[18,176,18,180],[19,176,19,180],[8,158,8,162],[9,158,9,162],[10,158,10,162],[11,158,11,162],[16,158,16,162],[13,115,13,120],[7,115,7,120],[9,115,9,120],[12,164,12,168],[13,164,13,168],[11,164,11,168],[7,170,7,174],[27,176,27,180],[28,1,28,4],[28,7,28,10],[28,13,28,16],[28,19,28,22],[28,25,28,28],[28,31,28,34],[28,37,28,40],[28,43,28,46],[28,49,28,52],[28,55,28,58],[28,61,28,64],[28,67,28,70],[28,73,28,76],[28,79,28,82],[28,85,28,88],[28,91,28,94],[28,97,28,100],[28,103,28,106],[28,109,28,112],[28,115,28,118],[28,158,28,162],[28,164,28,168],[28,170,28,174],[28,176,28,180],[27,1,27,6],[27,7,27,12],[27,13,27,18],[27,19,27,24],[27,25,27,30],[27,31,27,36],[27,37,27,42],[24,43,24,46],[25,79,25,84],[25,85,25,90],[25,91,25,96],[25,97,25,102],[24,49,24,52],[24,55,24,58],[24,61,24,64],[24,67,24,70],[24,73,24,76],[24,79,24,82],[27,103,27,108],[27,109,27,114],[27,115,27,120],[27,158,27,162],[27,164,27,168],[27,170,27,174],[27,43,27,48],[27,49,27,54]],"merged_total":3685,"flags":["merged_cut"]}
[null,"OP 4",null,null,null,40,"E",null,"OP 2",null,null,null,40,"G",null,null,null,null,null,null,null,null,"OP 3",null,null,null,35,"L"]
[null,"LA GARDE > GM",null,null,null,null,null,null,"LA GARDE > GM",null,null,null,null,null,null,null,null,null,null,null,null,null,"TOULON > TOULON"]
[null,"Semaine",null,null,44,"du",31,"au",5,"Novembre",null,null,null,null,null,null,null,null,null,{"$f":"B3","v":"Semaine"},null,{"$f":"E3","v":44},"du",31,"au",5,"Novembre",null,null,null,null,null,null,null,null,null,null,{"$f":"T3","v":"Semaine"},{"$f":"V3","v":44},"du",31,"au",5,"Novembre",null,null,null,null,null,null,null,null,null,null,null,{"$f":"AL3","v":"Semaine"},{"$f":"AM3","v":44},"du",31,"au",5,"Novembre",null,null,null,null,null,null,null,null,null,null,null,{"$f":"BD3","v":"Semaine"},{"$f":"BE3","v":44},"du",31,"au",5,"Novembre",null,null,null,null,null,null,null,null,null,null,null,{"$f":"BV3","v":"Semaine"},{"$f":"BW3","v":44},"du",31,"au",5,"Novembre",null,null,null,null,null,null,null,null,null,null,null,{"$f":"CN3","v":"Semaine"},{"$f":"CO3","v":44},"du",31,"au",5,"Novembre",null,null,null,null,null,{"$f":"CZ3","v":0},0,0,0,0,0,"Semaine",null,null,null,null,null,{"$f":"DL3","v":"Novembre"},0,0,0,0,0,0,null,null,null,null,null,{"$f":"DX3","v":"Semaine"},0,0,0,0,0,"Novembre",null,null,null,null,null,null,null,null,null,null,null,{"$f":"DF3","v":"Semaine"},44,"du",31,"au",5,"Novembre"]
[]
["Lundi",null,null,null,null,null,null,null,null,null,null,null,null,null,null,null,null,null,null,null,null,null,null,null,null,null,null,null,null,null,null,null,null,null,null,null,null,null,null,null,null,null,null,null,null,null,null,null,null,null,null,null,null,null,null,null,null,null,null,null,null,null,null,null,null,null,null,null,null,null,null,null,null,null,null,null,null,null,null,null,null,null,null,null,null,null,null,null,null,null,null,null,null,null,null,null,null,null,null,null,null,null,null,null,null,null,null,null,null,null,null,null,null,null,null,null,null,null,null,null,null,null,null,null,null,null,null,null,null,null,null,null,null,null,null,null,null,null,null,null,null,null,null,null,null,null,null,null,null,null,null,null,null,null,null,null,null,null,"Disponible",null,null,null,null,null,"Congés",null,null,null,null,null,"Formation",null,null,null,null,null,"Maladie / AT",null,null,null,null,null,"Absent (non justifié)",null,null,null,null,null,"Repos (payé)"]
[null,null,null,null,null,null,null,null,null,null,null,null,null,null,null,null,null,null,null,null,null,null,null,null,null,null,null,null,null,null,null,null,null,null,null,null,null,null,null,null,null,null,null,null,null,null,null,null,null,null,null,null,null,null,null,null,null,null,null,null,null,null,null,null,null,null,null,null,null,null,null,null,null,null,null,null,null,null,null,null,null,null,null,null,null,null,null,null,null,null,null,null,null,null,null,null,null,null,null,null,null,null,null,null,null,null,null,null,null,null,null,null,null,null,null,null,null,null,null,null,null,null,null,null,null,null,null,null,null,null,null,null,null,null,null,null,null,null,null,null,null,null,null,null,null,null,null,null,null,null,null,null,null,null,null,null,null,null,{"$f":"IFERROR(VLOOKUP(FH6,Personnel!$A$3:$B$290,2,FALSE),\"\")","v":""},null,null,null,null,null,{"$f":"IFERROR(VLOOKUP(FN6,Personnel!$A$3:$B$290,2,FALSE),\"\")","v":""},null,null,null,null,null,{"$f":"IFERROR(VLOOKUP(FT6,Personnel!$A$3:$B$290,2,FALSE),\"\")","v":""},null,null,null,null,null,{"$f":"IFERROR(VLOOKUP(FZ6,Personnel!$A$3:$B$290,2,FALSE),\"\")","v":""},null,null,null,null,null,{"$f":"IFERROR(VLOOKUP(GF6,Personnel!$A$3:$B$290,2,FALSE),\"\")","v":""},null,null,null,null,null,{"$f":"IFERROR(VLOOKUP(GL6,Personnel!$A$3:$B$290,2,FALSE),\"\")","v":""}]
[null,null,null,null,null,null,null,null,null,null,null,null,null,null,null,null,null,null,null,null,null,null,null,null,null,null,null,null,null,null,null,null,null,null,null,null,null,null,null,null,null,null,null,null,null,null,null,null,null,null,null,null,null,null,null,null,null,null,null,null,null,null,null,null,null,null,null,null,null,null,null,null,null,null,null,null,null,null,null,null,null,null,null,null,null,null,null,null,null,null,null,null,null,null,null,null,null,null,null,null,null,null,null,null,null,null,null,null,null,null,null,null,null,null,null,null,null,null,null,null,null,null,null,null,null,null,null,null,null,null,null,null,null,null,null,null,null,null,null,null,null,null,null,null,null,null,null,null,null,null,null,null,null,null,null,null,null,null,{"$f":"IFERROR(VLOOKUP(FH7,Personnel!$A$3:$B$290,2,FALSE),\"\")","v":""},null,null,null,null,null,{"$f":"IFERROR(VLOOKUP(FN7,Personnel!$A$3:$B$290,2,FALSE),\"\")","v":""},null,null,null,null,null,{"$f":"IFERROR(VLOOKUP(FT7,Personnel!$A$3:$B$290,2,FALSE),\"\")","v":""},null,null,null,null,null,{"$f":"IFERROR(VLOOKUP(FZ7,Personnel!$A$3:$B$290,2,FALSE),\"\")","v":""},null,null,null,null,null,{"$f":"IFERROR(VLOOKUP(GF7,Personnel!$A$3:$B$290,2,FALSE),\"\")","v":""},null,null,null,null,null,{"$f":"IFERROR(VLOOKUP(GL7,Personnel!$A$3:$B$290,2,FALSE),\"\")","v":""}]
[null,null,null,null,null,null,null,null,null,null,null,null,null,null,null,null,null,null,null,null,null,null,null,null,null,null,null,null,null,null,null,null,null,null,null,null,null,null,null,null,null,null,null,null,null,null,null,null,null,null,null,null,null,null,null,null,null,null,null,null,null,null,null,null,null,null,null,null,null,null,null,null,null,null,null,null,null,null,null,null,null,null,null,null,null,null,null,null,null,null,null,null,null,null,null,null,null,null,null,null,null,null,null,null,null,null,null,null,null,null,null,null,null,null,null,null,null,null,null,null,null,null,null,null,null,null,null,null,null,null,null,null,null,null,null,null,null,null,null,null,null,null,null,null,null,null,null,null,null,null,null,null,null,null,null,null,null,null,{"$f":"IFERROR(VLOOKUP(FH8,Personnel!$A$3:$B$290,2,FALSE),\"\")","v":""},null,null,null,null,null,{"$f":"IFERROR(VLOOKUP(FN8,Personnel!$A$3:$B$290,2,FALSE),\"\")","v":""},null,null,null,null,null,{"$f":"IFERROR(VLOOKUP(FT8,Personnel!$A$3:$B$290,2,FALSE),\"\")","v":""},null,null,null,null,null,{"$f":"IFERROR(VLOOKUP(FZ8,Personnel!$A$3:$B$290,2,FALSE),\"\")","v":""},null,null,null,null,null,{"$f":"IFERROR(VLOOKUP(GF8,Personnel!$A$3:$B$290,2,FALSE),\"\")","v":""},null,null,null,null,null,{"$f":"IFERROR(VLOOKUP(GL8,Personnel!$A$3:$B$290,2,FALSE),\"\")","v":""}]
{"$rows_left_out":118}
{"sheet":"Personnel","index":1,"n_rows":148,"n_cols":12,"rows_kept":148,"cut":false,"hidden":false,"merged":[[0,0,0,5]]}
["Personnel"]
["Acronymes","Prenom Nom","Date Embauche","Ordre\nAffectation","Liste","Chef d'équipe","Véhicule attitré","Permis","CACES","UTILISATION MM ELEC","UTILISATION MM ESS","Colonne1"]
["TN","Equipier 1",null,1,"OUI","OUI",null,"SPL","C1"]
["DD","Equipier 2",null,2,"OUI","OUI",null,"B","OUI"]
["VV","Equipier 3",null,1,"OUI","OUI",null,"SPL","C1",null,"OUI"]
["RM","Equipier 4",null,2,"OUI","OUI",null,"SPL"]
["RT","Equipier 5",null,2,"OUI","OUI",null,"B","OUI",null,"OUI"]
["DM","Equipier 6",null,3,"OUI","OUI"]
{"$rows_left_out":141}
{"sheet":"Explications","index":2,"n_rows":42,"n_cols":16,"rows_kept":42,"cut":false,"hidden":false,"merged":[[19,4,19,8],[20,4,20,8],[21,4,21,8],[22,4,22,8],[13,4,13,7],[14,4,14,9],[15,4,15,9],[16,4,16,9],[17,4,17,8],[18,4,18,8],[12,4,12,9],[7,4,7,7],[8,4,8,9],[9,4,9,7],[10,4,10,9],[11,4,11,7]]}
[null,null,null,null,null,null,null,null,null,null,null,"PROCEDURE POUR OTER LA PROTECTION DE LA FEUILLE"]
[null,null,null,null,null,null,null,null,null,null,null,"ALLER DANS L'ONGLET REVISION"]
[null,null,null,null,null,null,null,null,null,null,null,"CLIQUER SUR \"OTER LA PROTECTION\""]
[null,null,null,null,null,null,null,null,null,null,null,"MOT DE PASSE POUR DEVEROUILLER LA FEUILLE",null,null,null,"apiway"]
[]
[]
[]
[null,null,null,null,"OPERATION 1",null,null,null,12,"A"]
{"$rows_left_out":34}