{"text_format":"1","workbook":"xlsx","n_sheets":3,"sheets":["Feuil1","Feuil2","Feuil3"],"not_rendered":{"charts":0,"images":27,"macros":1,"external_links":0,"defined_names":2,"comments":0,"pivot_tables":0},"unopened":[],"bounds":{"document_bytes":16777216,"sheet_cells":100000,"rows_first":2000,"rows_last":500,"rows_between":2000,"halvings":0,"cell_chars":16384,"cell_head_chars":4096},"cells_cut":0,"cells_raw":0,"read":"whole","date_system":"1900"}

{"sheet":"Feuil1","index":0,"n_rows":28,"n_cols":24,"rows_kept":28,"cut":false,"hidden":false,"merged":[[25,22,25,23],[8,1,8,2],[8,11,8,12],[1,1,1,15],[2,1,2,15],[6,0,6,6],[6,10,6,16],[4,7,4,9],[4,10,4,11],[4,3,4,4]]}
[]
[null,"14:05:37.74"]
[null,"Formule pour décompte sur ce site : https://fr.extendoffice.com/documents/excel/2144-excel-countdown-timer.html#a1"]
[]
[null,null,null,"Temps SC",null,null,null,null,null,null,"00:00:16.41"]
[]
[14,null,null,null,null,null,null,null,null,null,16]
[]
[null,"chrono départ pilote",null,null,null,null,"00:00:11.69",null,null,null,null,"chrono départ pilote",null,null,null,null,"00:00:19.06",null,{"$f":"RIGHT(Q9,8)","v":"00:19.06"}]
[null,null,null,null,null,null,null,null,null,null,null,null,null,null,null,null,null,null,{"$f":"RIGHT(O12,8)","v":"24:30.77"}]
["pilote","ESSENCE          en L","nombre de tours effectués","Consommation par tour","temps de roulage exact","position classement à l'arrêt","SC entrée",null,null,null,"pilote","ESSENCE          en L","nombre de tours effectués","Consommation par tour","temps de roulage exact","position classement à l'arrêt","SC entrée",null,null,"compteur","tablo"]
["jp",56,37,{"$f":"B12/C12","v":1.5135135135135136},"01:47:42",2,"chrono",null,null,null,"jp",56,37,{"$f":"L12/M12","v":1.5135135135135136},"02:24:30.77",2,"chrono",null,null,1906.25]
[null,null,null,null,null,null,null,null,null,null,null,null,null,null,null,null,null,null,null,19]
[null,null,null,null,null,null,null,null,null,null,null,null,null,null,null,null,null,null,null,0]
[null,null,null,null,null,null,null,null,null,null,null,null,null,null,null,null,null,null,"heures"]
[null,null,null,null,null,null,null,null,null,null,null,null,null,null,null,null,null,null,"minutes"]
[null,null,null,null,null,null,null,null,null,null,null,null,null,null,null,null,null,null,"secondes"]
[null,null,null,null,null,null,null,null,null,null,null,null,null,null,null,null,null,null,"centième"]
[]
[null,null,null,null,null,null,null,null,null,null,null,null,null,null,null,null,null,null,"centième",6,77,null,1,65.999999999999986]
[null,null,null,null,null,null,null,null,null,null,null,null,null,null,null,null,null,null,"secondes",19,30,null,"00:01:04"]
[null,null,null,null,null,null,null,null,null,null,null,null,null,null,null,null,null,null,"minutes",0,24,null,"00:29:00"]
[null,null,null,null,null,null,null,null,null,null,null,null,null,null,null,null,null,null,"heures",0,2,null,"02:00:00"]
[null,null,null,null,null,null,null,null,null,null,null,null,null,null,null,null,null,null,null,null,null,null,{"$f":"SUM(W20:W23)","v":1.1042129629629629}]
[]
[null,null,null,null,null,null,null,null,null,null,null,null,null,null,null,null,null,null,null,null,null,null,{"$f":"TEXT(W24,\"hh:mm:ss\")&\".\"&X20","v":"02:30:04.66"}]
[]
[null,null,null,null,null,null,null,null,null,null,null,null,null,null,null,null,null,null,null,null,"02:24:30.77"]

{"sheet":"Feuil2","index":1,"n_rows":28,"n_cols":26,"rows_kept":28,"cut":false,"hidden":false,"merged":[[25,24,25,25],[1,1,1,17],[2,1,2,17],[4,3,4,5],[4,8,4,10],[6,0,6,7],[6,11,6,18],[8,6,8,7],[8,17,8,18],[4,12,4,13]]}
[null,null,null,null,null,null,null,null,null,null,null,null,null,null,1]
[null,"15:30:17,59"]
[]
[]
[null,null,null,"Temps SC",null,null,null,null,{"$f":"TEXT(LEFT(B2,8),\"hh:mm:ss\")","v":"15:30:17"},null,null,null,{"$f":"IFERROR(IF(G5<>\"\",TEXT(I5-G5,\"hh:mm:ss\")&\",\"&RIGHT(B2,2),\"Circuit ouvert\"),\"Arrêt Chrono\")","v":"Circuit ouvert"}]
[]
[14,null,null,null,null,null,null,null,null,null,null,16]
[]
[null,null,null,null,null,null,{"$f":"IFERROR(IF(AND(INDIRECT(ADDRESS(MATCH(9^9,E:E),5,4))<>\"\",INDIRECT(ADDRESS(MATCH(9^9,E:E),6,4))=\"\"),TEXT(B2-INDIRECT(ADDRESS(MATCH(9^9,E:E),5,4)),\"hh:mm:ss\")&\",\"&RIGHT(B2,2),\"Attente\"),\"Arrêt Chrono\")","v":"00:00:34,59"},null,null,null,null,null,null,null,null,null,null,{"$f":"IFERROR(IF(AND(INDIRECT(ADDRESS(MATCH(9^9,P:P),16,4))<>\"\",INDIRECT(ADDRESS(MATCH(9^9,P:P),17,4))=\"\"),TEXT(B2-INDIRECT(ADDRESS(MATCH(9^9,P:P),16,4)),\"hh:mm:ss\")&\",\"&RIGHT(B2,2),\"Attente\"),\"Arrêt Chrono\")","v":"Attente"},null,null,{"$f":"RIGHT(R9,8)","v":"Attente"}]
[null,null,null,null,null,null,null,null,null,null,null,null,null,null,null,null,null,null,null,null,{"$f":"RIGHT(P12,8)","v":",8646875"}]
["pilote","ESSENCE          en L","nombre de tours effectués","Consommation par tour","Début de\npilotage","temps de roulage exact","position classement à l'arrêt","SC entrée",null,null,null,"pilote","ESSENCE          en L","nombre de tours effectués","Consommation par tour","Début de\npilotage","temps de roulage exact","position classement à l'arrêt","SC entrée",null,null,"compteur","tablo"]
["jp",56,37,{"$f":"B12/C12","v":1.5135135135135136},"20:25:46","00:00:12",2,"chrono",null,null,null,"jp",56,37,{"$f":"M12/N12","v":1.5135135135135136},"20:45:09","00:01:11",2,"chrono",null,null,105.46875]
[null,null,null,null,"15:29:44",null,null,null,null,null,null,null,null,null,null,null,null,null,null,null,null,1]
[null,null,null,null,null,null,null,null,null,null,null,null,null,null,null,null,null,null,null,null,null,0]
[null,null,null,null,null,null,null,null,null,null,null,null,null,null,null,null,null,null,null,null,"heures"]
[null,null,null,null,null,null,null,null,null,null,null,null,null,null,null,null,null,null,null,null,"minutes"]
[null,null,null,null,null,null,null,null,null,null,null,null,null,null,null,null,null,null,null,null,"secondes"]
[null,null,null,null,null,null,null,null,null,null,null,null,null,null,null,null,null,null,null,null,"centième"]
[]
[null,null,null,null,null,null,null,null,null,null,null,null,null,null,null,null,null,null,null,null,"centième",5,77,null,1,65.999999999999986]
[null,null,null,null,null,null,null,null,null,null,null,null,null,null,null,null,null,null,null,null,"secondes",1,30,null,"00:01:04"]
[null,null,null,null,null,null,null,null,null,null,null,null,null,null,null,null,null,null,null,null,"minutes",0,24,null,"00:29:00"]
[null,null,null,null,null,null,null,null,null,null,null,null,null,null,null,null,null,null,null,null,"heures",0,2,null,"02:00:00"]
[null,null,null,null,null,null,null,null,null,null,null,null,null,null,null,null,null,null,null,null,null,null,null,null,{"$f":"SUM(Y20:Y23)","v":1.1042129629629629}]
[]
[null,null,null,null,null,null,null,null,null,null,null,null,null,null,null,null,null,null,null,null,null,null,null,null,{"$f":"TEXT(Y24,\"hh:mm:ss\")&\".\"&Z20","v":"02:30:04.66"}]
[]
[null,null,null,null,null,null,null,null,null,null,null,null,null,null,null,null,null,null,null,null,null,null,"02:24:30.77"]

{"sheet":"Feuil3","index":2,"n_rows":14,"n_cols":27,"rows_kept":14,"cut":false,"hidden":false,"merged":[[13,20,17,20],[1,25,1,26],[10,5,11,6],[10,15,11,16],[1,1,4,15],[10,19,11,21],[13,12,17,12],[13,13,17,13],[13,14,17,14],[13,15,17,15],[13,16,17,16],[13,6,17,6],[13,5,17,5],[13,10,17,10],[13,11,17,11],[13,0,17,0],[13,1,17,1],[13,2,17,2],[13,3,17,3],[13,4,17,4],[6,0,8,6],[6,10,8,16]]}
[]
[null,"15:46:46,42",null,null,null,null,null,null,null,null,null,null,null,null,null,null,null,null,null,null,null,null,null,null,null,"Tableau de pilotage"]
[null,null,null,null,null,null,null,null,null,null,null,null,null,null,null,null,null,null,null,null,null,null,null,null,null,null,"Chrono pilote 1"]
[null,null,null,null,null,null,null,null,null,null,null,null,null,null,null,null,null,null,null,null,null,null,null,null,null,null,"Chrono pilote 2"]
[]
[null,null,null,null,null,null,null,null,null,null,null,null,null,null,null,null,null,null,null,null,null,null,null,null,null,null,"Sortie SC"]
[14,null,null,null,null,null,null,null,null,null,16,null,null,null,null,null,null,null,null,null,null,null,null,null,null,null,"Durée SC"]
[]
[]
[null,null,null,null,null,null,null,null,null,null,null,null,null,null,null,null,null,null,null,null,"Temps SC"]
[null,null,null,null,null,{"$f":"IFERROR(IF(AND(INDIRECT(ADDRESS(MATCH(9^9,D:D),5,4))<>\"\",INDIRECT(ADDRESS(MATCH(9^9,D:D),6,4))=\"\"),TEXT(A5-INDIRECT(ADDRESS(MATCH(9^9,D:D),5,4)),\"hh:mm:ss\")&\",\"&RIGHT(A5,2),\"Attente\"),\"Arrêt Chrono\")","v":"Arrêt Chrono"},null,null,null,null,null,null,null,null,null,{"$f":"IFERROR(IF(AND(INDIRECT(ADDRESS(MATCH(9^9,N:N),5,4))<>\"\",INDIRECT(ADDRESS(MATCH(9^9,N:N),6,4))=\"\"),TEXT(K5-INDIRECT(ADDRESS(MATCH(9^9,N:N),5,4)),\"hh:mm:ss\")&\",\"&RIGHT(K5,2),\"Attente\"),\"Arrêt Chrono\")","v":"Arrêt Chrono"},null,null,null,{"$f":"IFERROR(IF(M11<>\"\",TEXT(O11-M11,\"hh:mm:ss\")&\",\"&RIGHT(#REF!,2),\"Circuit ouvert\"),\"Arrêt Chrono\")","v":"Circuit ouvert"}]
[]
[]
["pilote","ESSENCE          en L","nombre de tours effectués","Consommation par tour","Début de\npilotage","temps de roulage exact","position classement à l'arrêt",null,null,null,"pilote","ESSENCE          en L","nombre de tours effectués","Consommation par tour","Début de\npilotage","temps de roulage exact","position classement à l'arrêt",null,null,null,"Safety Car"]