{"text_format":"1","workbook":"xlsx","n_sheets":9,"sheets":["Quotats","Lundi","Mardi","Mercredi","Jeudi","Vendredi","Samedi","Dimanche","infos"],"not_rendered":{"charts":0,"images":0,"macros":1,"external_links":0,"defined_names":1,"comments":0,"pivot_tables":0},"unopened":[],"bounds":{"document_bytes":16777216,"sheet_cells":100000,"rows_first":2000,"rows_last":500,"rows_between":2000,"halvings":0,"cell_chars":16384,"cell_head_chars":4096},"cells_cut":0,"cells_raw":0,"read":"whole","date_system":"1900"}

{"sheet":"Quotats","index":0,"n_rows":47,"n_cols":29,"rows_kept":47,"cut":false,"hidden":true,"merged":[[21,0,25,0],[27,0,30,0],[31,0,34,0],[2,28,2,29],[3,28,3,29],[4,28,4,29],[5,28,5,29],[11,0,15,0],[9,2,9,4],[16,0,20,0],[35,0,38,0],[47,0,50,0],[39,0,42,0],[51,0,54,0],[43,0,46,0]]}
["Jour","VILLETTE","BEDIER","MENILMONTANT","MARAUDE 93","MARAUDE 75","DENFERT","NATION","ST LAZARE","GARE DE L'EST","SALPETRIERE","INVALIDES","REPUBLIQUE","R. LENOIR","SAINT-OUEN","MENILMONTANT SOIR","ST ROCH",null,"Nb/soir","Quotas/soir",null,"Nb/midi","Quotas/midi",null,"Nb m/m","Quotas m/midi"]
["Lundi",170,400,600,600,20,160,200,200,300,50,null,null,null,null,90,90,null,{"$f":"COUNT(G2:Q2)","v":7},{"$f":"SUM(G2:Q2)","v":1090},null,{"$f":"COUNT(B2:D2)","v":3},{"$f":"SUM(B2:D2)","v":1170},null,{"$f":"COUNT(Tableau1[[#This Row],[MARAUDE 93]:[MARAUDE 75]])","v":2},{"$f":"SUM(Tableau1[[#This Row],[MARAUDE 93]:[MARAUDE 75]])","v":620}]
["Mardi",170,400,650,600,20,140,null,null,null,null,210,280,130,120,90,90,null,7,1060,null,3,1220,null,{"$f":"COUNT(Tableau1[[#This Row],[MARAUDE 93]:[MARAUDE 75]])","v":2},{"$f":"SUM(Tableau1[[#This Row],[MARAUDE 93]:[MARAUDE 75]])","v":620},65535,{"$f":"SOMME_SI_COULEUR(Tableau1[[VILLETTE]:[ST ROCH]])","v":520},"EXCELLENT EXCEDENTS"]
["Mercredi",170,400,650,600,20,220,280,210,350,null,null,null,null,150,75,80,null,7,1365,null,3,1220,null,{"$f":"COUNT(Tableau1[[#This Row],[MARAUDE 93]:[MARAUDE 75]])","v":2},{"$f":"SUM(Tableau1[[#This Row],[MARAUDE 93]:[MARAUDE 75]])","v":620},15773696,{"$f":"SOMME_SI_COULEUR(Tableau1[[VILLETTE]:[ST ROCH]])","v":1050},"MENUS SANS VIANDE"]
["Jeudi",170,400,650,600,20,null,null,null,null,65,220,300,190,180,90,85,null,7,1130,null,3,1220,null,{"$f":"COUNT(Tableau1[[#This Row],[MARAUDE 93]:[MARAUDE 75]])","v":2},{"$f":"SUM(Tableau1[[#This Row],[MARAUDE 93]:[MARAUDE 75]])","v":620},5287936,{"$f":"SOMME_SI_COULEUR(Tableau1[[VILLETTE]:[ST ROCH]])","v":4825},"SUBSTITUTION"]
["Vendredi",170,400,650,1200,20,250,160,180,400,null,null,null,null,250,80,85,null,7,1405,null,3,1220,null,{"$f":"COUNT(Tableau1[[#This Row],[MARAUDE 93]:[MARAUDE 75]])","v":2},{"$f":"SUM(Tableau1[[#This Row],[MARAUDE 93]:[MARAUDE 75]])","v":1220},49407,{"$f":"SOMME_SI_COULEUR(Tableau1[[VILLETTE]:[ST ROCH]])","v":8410},"SOGERES"]
["Samedi",null,null,null,null,null,null,null,null,null,null,220,400,150,null,75,80,null,5,925,null,0,0,null,{"$f":"COUNT(Tableau1[[#This Row],[MARAUDE 93]:[MARAUDE 75]])","v":0},{"$f":"SUM(Tableau1[[#This Row],[MARAUDE 93]:[MARAUDE 75]])","v":0}]
["Dimanche",null,null,null,null,null,200,null,null,500,null,220,null,null,null,80,100,null,5,1100,null,0,0,null,{"$f":"COUNT(Tableau1[[#This Row],[MARAUDE 93]:[MARAUDE 75]])","v":0},{"$f":"SUM(Tableau1[[#This Row],[MARAUDE 93]:[MARAUDE 75]])","v":0}]
[]
[null,null,"SOGERES"]
[null,null,"Midi","Soir","Sans viande","EXCELLENT EXCEDENTS","Substitution"]
["Lundi","Protéine","Veau","Poisson","Thon","Agneau","Steack"]
[null,"Conditionnement protéine",6,4,4,6,4]
[null,"Quantité indiquée"]
[null,"Accompagnement","Riz","purée","Riz","purée","Riz"]
{"$rows_left_out":33}
{"sheet":"Lundi","index":1,"n_rows":230,"n_cols":18,"rows_kept":230,"cut":false,"hidden":false,"merged":[[8,0,8,4],[8,7,8,11],[140,2,169,2],[170,2,197,2],[43,0,45,0],[47,0,49,0],[50,0,52,0],[53,0,55,0],[56,0,58,0],[59,0,61,0],[62,0,64,0],[198,2,217,2],[218,2,229,2],[16,0,18,0],[19,0,21,0],[22,0,24,0],[25,0,27,0],[28,0,30,0],[31,0,33,0],[34,0,36,0],[37,0,39,0],[40,0,42,0],[80,0,82,0],[83,0,85,0],[65,0,67,0],[68,0,70,0],[71,0,73,0],[74,0,76,0],[77,0,79,0]]}
[null,{"$f":"Quotats!B1","v":"VILLETTE"},{"$f":"Quotats!C1","v":"BEDIER"},{"$f":"Quotats!D1","v":"MENILMONTANT"},{"$f":"Quotats!E1","v":"MARAUDE 93"},{"$f":"Quotats!F1","v":"MARAUDE 75"},null,{"$f":"Quotats!G1","v":"DENFERT"},{"$f":"Quotats!H1","v":"NATION"},{"$f":"Quotats!I1","v":"ST LAZARE"},{"$f":"Quotats!J1","v":"GARE DE L'EST"},{"$f":"Quotats!K1","v":"SALPETRIERE"},{"$f":"Quotats!L1","v":"INVALIDES"},{"$f":"Quotats!M1","v":"REPUBLIQUE"},{"$f":"Quotats!N1","v":"R. LENOIR"},{"$f":"Quotats!O1","v":"SAINT-OUEN"},{"$f":"Quotats!P1","v":"MENILMONTANT SOIR"},{"$f":"Quotats!Q1","v":"ST ROCH"}]
["Lundi",{"$f":"Quotats!B2","v":170},{"$f":"Quotats!C2","v":400},{"$f":"Quotats!D2","v":600},{"$f":"Quotats!E2","v":600},{"$f":"Quotats!F2","v":20},null,{"$f":"Quotats!G2","v":160},{"$f":"Quotats!H2","v":200},{"$f":"Quotats!I2","v":200},{"$f":"Quotats!J2","v":300},{"$f":"Quotats!K2","v":50},{"$f":"Quotats!L2","v":0},{"$f":"Quotats!M2","v":0},{"$f":"Quotats!N2","v":0},{"$f":"Quotats!O2","v":0},{"$f":"Quotats!P2","v":90},{"$f":"Quotats!Q2","v":90}]
["Choix menu","Midi","Midi","Midi","Substitution","Substitution",null,"Substitution","Substitution","Sans viande","Sans viande","Substitution","Subsitution","Subsitution","Subsitution","Subsitution","Soir","EXCELLENT EXCEDENTS"]
["Nb barquettes",{"$f":"ROUNDUP(INDEX($B$2:$R$2,MATCH(B$1,$B$1:$R$1,0))/INDEX(Quotats!$C$16:$G$16,MATCH(B$3,Quotats!$C$11:$G$11,0)),0)","v":29},{"$f":"ROUNDUP(INDEX($B$2:$R$2,MATCH(C$1,$B$1:$R$1,0))/INDEX(Quotats!$C$16:$G$16,MATCH(C$3,Quotats!$C$11:$G$11,0)),0)","v":67},{"$f":"ROUNDUP(INDEX($B$2:$R$2,MATCH(D$1,$B$1:$R$1,0))/INDEX(Quotats!$C$16:$G$16,MATCH(D$3,Quotats!$C$11:$G$11,0)),0)","v":100},{"$f":"ROUNDUP(INDEX($B$2:$R$2,MATCH(E$1,$B$1:$R$1,0))/INDEX(Quotats!$C$16:$G$16,MATCH(E$3,Quotats!$C$11:$G$11,0)),0)","v":150},{"$f":"ROUNDUP(INDEX($B$2:$R$2,MATCH(F$1,$B$1:$R$1,0))/INDEX(Quotats!$C$16:$G$16,MATCH(F$3,Quotats!$C$11:$G$11,0)),0)","v":5},null,{"$f":"ROUNDUP(INDEX($B$2:$R$2,MATCH(H$1,$B$1:$R$1,0))/INDEX(Quotats!$C$16:$G$16,MATCH(H$3,Quotats!$C$11:$G$11,0)),0)","v":40},{"$f":"ROUNDUP(INDEX($B$2:$R$2,MATCH(I$1,$B$1:$R$1,0))/INDEX(Quotats!$C$16:$G$16,MATCH(I$3,Quotats!$C$11:$G$11,0)),0)","v":50},{"$f":"ROUNDUP(INDEX($B$2:$R$2,MATCH(J$1,$B$1:$R$1,0))/INDEX(Quotats!$C$16:$G$16,MATCH(J$3,Quotats!$C$11:$G$11,0)),0)","v":50},{"$f":"ROUNDUP(INDEX($B$2:$R$2,MATCH(K$1,$B$1:$R$1,0))/INDEX(Quotats!$C$16:$G$16,MATCH(K$3,Quotats!$C$11:$G$11,0)),0)","v":75},{"$f":"ROUNDUP(INDEX($B$2:$R$2,MATCH(L$1,$B$1:$R$1,0))/INDEX(Quotats!$C$16:$G$16,MATCH(L$3,Quotats!$C$11:$G$11,0)),0)","v":13},{"$f":"ROUNDUP(INDEX($B$2:$R$2,MATCH(M$1,$B$1:$R$1,0))/INDEX(Quotats!$C$16:$G$16,MATCH(M$3,Quotats!$C$11:$G$11,0)),0)","v":{"$error":"#N/A"}},{"$f":"ROUNDUP(INDEX($B$2:$R$2,MATCH(N$1,$B$1:$R$1,0))/INDEX(Quotats!$C$16:$G$16,MATCH(N$3,Quotats!$C$11:$G$11,0)),0)","v":{"$error":"#N/A"}},{"$f":"ROUNDUP(INDEX($B$2:$R$2,MATCH(O$1,$B$1:$R$1,0))/INDEX(Quotats!$C$16:$G$16,MATCH(O$3,Quotats!$C$11:$G$11,0)),0)","v":{"$error":"#N/A"}},{"$f":"ROUNDUP(INDEX($B$2:$R$2,MATCH(P$1,$B$1:$R$1,0))/INDEX(Quotats!$C$16:$G$16,MATCH(P$3,Quotats!$C$11:$G$11,0)),0)","v":{"$error":"#N/A"}},{"$f":"ROUNDUP(INDEX($B$2:$R$2,MATCH(Q$1,$B$1:$R$1,0))/INDEX(Quotats!$C$16:$G$16,MATCH(Q$3,Quotats!$C$11:$G$11,0)),0)","v":23},{"$f":"ROUNDUP(INDEX($B$2:$R$2,MATCH(R$1,$B$1:$R$1,0))/INDEX(Quotats!$C$16:$G$16,MATCH(R$3,Quotats!$C$11:$G$11,0)),0)","v":23}]
["accompagnement",{"$f":"INDEX(Quotats!$C$15:$G$15,MATCH(Lundi!B3,Quotats!$C$11:$G$11,0))","v":"Riz"},{"$f":"INDEX(Quotats!$C$15:$G$15,MATCH(Lundi!C3,Quotats!$C$11:$G$11,0))","v":"Riz"},{"$f":"INDEX(Quotats!$C$15:$G$15,MATCH(Lundi!D3,Quotats!$C$11:$G$11,0))","v":"Riz"},{"$f":"INDEX(Quotats!$C$15:$G$15,MATCH(Lundi!E3,Quotats!$C$11:$G$11,0))","v":"Riz"},{"$f":"INDEX(Quotats!$C$15:$G$15,MATCH(Lundi!F3,Quotats!$C$11:$G$11,0))","v":"Riz"},null,{"$f":"INDEX(Quotats!$C$15:$G$15,MATCH(Lundi!H3,Quotats!$C$11:$G$11,0))","v":"Riz"},{"$f":"INDEX(Quotats!$C$15:$G$15,MATCH(Lundi!I3,Quotats!$C$11:$G$11,0))","v":"Riz"},{"$f":"INDEX(Quotats!$C$15:$G$15,MATCH(Lundi!J3,Quotats!$C$11:$G$11,0))","v":"Riz"},{"$f":"INDEX(Quotats!$C$15:$G$15,MATCH(Lundi!K3,Quotats!$C$11:$G$11,0))","v":"Riz"},{"$f":"INDEX(Quotats!$C$15:$G$15,MATCH(Lundi!L3,Quotats!$C$11:$G$11,0))","v":"Riz"},{"$f":"INDEX(Quotats!$C$15:$G$15,MATCH(Lundi!M3,Quotats!$C$11:$G$11,0))","v":{"$error":"#N/A"}},{"$f":"INDEX(Quotats!$C$15:$G$15,MATCH(Lundi!N3,Quotats!$C$11:$G$11,0))","v":{"$error":"#N/A"}},{"$f":"INDEX(Quotats!$C$15:$G$15,MATCH(Lundi!O3,Quotats!$C$11:$G$11,0))","v":{"$error":"#N/A"}},{"$f":"INDEX(Quotats!$C$15:$G$15,MATCH(Lundi!P3,Quotats!$C$11:$G$11,0))","v":{"$error":"#N/A"}},{"$f":"INDEX(Quotats!$C$15:$G$15,MATCH(Lundi!Q3,Quotats!$C$11:$G$11,0))","v":"purée"},{"$f":"INDEX(Quotats!$C$15:$G$15,MATCH(Lundi!R3,Quotats!$C$11:$G$11,0))","v":"purée"}]
["Nb barquettes ",{"$f":"ROUNDUP(INDEX($B$2:$R$2,MATCH(B$1,$B$1:$R$1,0))/INDEX(Quotats!$C$13:$G$13,MATCH(B$3,Quotats!$C$11:$G$11,0)),0)","v":29},{"$f":"ROUNDUP(INDEX($B$2:$R$2,MATCH(C$1,$B$1:$R$1,0))/INDEX(Quotats!$C$13:$G$13,MATCH(C$3,Quotats!$C$11:$G$11,0)),0)","v":67},{"$f":"ROUNDUP(INDEX($B$2:$R$2,MATCH(D$1,$B$1:$R$1,0))/INDEX(Quotats!$C$13:$G$13,MATCH(D$3,Quotats!$C$11:$G$11,0)),0)","v":100},{"$f":"ROUNDUP(INDEX($B$2:$R$2,MATCH(E$1,$B$1:$R$1,0))/INDEX(Quotats!$C$13:$G$13,MATCH(E$3,Quotats!$C$11:$G$11,0)),0)","v":150},{"$f":"ROUNDUP(INDEX($B$2:$R$2,MATCH(F$1,$B$1:$R$1,0))/INDEX(Quotats!$C$13:$G$13,MATCH(F$3,Quotats!$C$11:$G$11,0)),0)","v":5},null,{"$f":"ROUNDUP(INDEX($B$2:$R$2,MATCH(H$1,$B$1:$R$1,0))/INDEX(Quotats!$C$13:$G$13,MATCH(H$3,Quotats!$C$11:$G$11,0)),0)","v":40},{"$f":"ROUNDUP(INDEX($B$2:$R$2,MATCH(I$1,$B$1:$R$1,0))/INDEX(Quotats!$C$13:$G$13,MATCH(I$3,Quotats!$C$11:$G$11,0)),0)","v":50},{"$f":"ROUNDUP(INDEX($B$2:$R$2,MATCH(J$1,$B$1:$R$1,0))/INDEX(Quotats!$C$13:$G$13,MATCH(J$3,Quotats!$C$11:$G$11,0)),0)","v":50},{"$f":"ROUNDUP(INDEX($B$2:$R$2,MATCH(K$1,$B$1:$R$1,0))/INDEX(Quotats!$C$13:$G$13,MATCH(K$3,Quotats!$C$11:$G$11,0)),0)","v":75},{"$f":"ROUNDUP(INDEX($B$2:$R$2,MATCH(L$1,$B$1:$R$1,0))/INDEX(Quotats!$C$13:$G$13,MATCH(L$3,Quotats!$C$11:$G$11,0)),0)","v":13},{"$f":"ROUNDUP(INDEX($B$2:$R$2,MATCH(M$1,$B$1:$R$1,0))/INDEX(Quotats!$C$13:$G$13,MATCH(M$3,Quotats!$C$11:$G$11,0)),0)","v":{"$error":"#N/A"}},{"$f":"ROUNDUP(INDEX($B$2:$R$2,MATCH(N$1,$B$1:$R$1,0))/INDEX(Quotats!$C$13:$G$13,MATCH(N$3,Quotats!$C$11:$G$11,0)),0)","v":{"$error":"#N/A"}},{"$f":"ROUNDUP(INDEX($B$2:$R$2,MATCH(O$1,$B$1:$R$1,0))/INDEX(Quotats!$C$13:$G$13,MATCH(O$3,Quotats!$C$11:$G$11,0)),0)","v":{"$error":"#N/A"}},{"$f":"ROUNDUP(INDEX($B$2:$R$2,MATCH(P$1,$B$1:$R$1,0))/INDEX(Quotats!$C$13:$G$13,MATCH(P$3,Quotats!$C$11:$G$11,0)),0)","v":{"$error":"#N/A"}},{"$f":"ROUNDUP(INDEX($B$2:$R$2,MATCH(Q$1,$B$1:$R$1,0))/INDEX(Quotats!$C$13:$G$13,MATCH(Q$3,Quotats!$C$11:$G$11,0)),0)","v":23},{"$f":"ROUNDUP(INDEX($B$2:$R$2,MATCH(R$1,$B$1:$R$1,0))/INDEX(Quotats!$C$13:$G$13,MATCH(R$3,Quotats!$C$11:$G$11,0)),0)","v":15}]
["protéine",{"$f":"INDEX(Quotats!$C$12:$G$12,MATCH(Lundi!B3,Quotats!$C$11:$G$11,0))","v":"Veau"},{"$f":"INDEX(Quotats!$C$12:$G$12,MATCH(Lundi!C3,Quotats!$C$11:$G$11,0))","v":"Veau"},{"$f":"INDEX(Quotats!$C$12:$G$12,MATCH(Lundi!D3,Quotats!$C$11:$G$11,0))","v":"Veau"},{"$f":"INDEX(Quotats!$C$12:$G$12,MATCH(Lundi!E3,Quotats!$C$11:$G$11,0))","v":"Steack"},{"$f":"INDEX(Quotats!$C$12:$G$12,MATCH(Lundi!F3,Quotats!$C$11:$G$11,0))","v":"Steack"},null,{"$f":"INDEX(Quotats!$C$12:$G$12,MATCH(Lundi!H3,Quotats!$C$11:$G$11,0))","v":"Steack"},{"$f":"INDEX(Quotats!$C$12:$G$12,MATCH(Lundi!I3,Quotats!$C$11:$G$11,0))","v":"Steack"},{"$f":"INDEX(Quotats!$C$12:$G$12,MATCH(Lundi!J3,Quotats!$C$11:$G$11,0))","v":"Thon"},{"$f":"INDEX(Quotats!$C$12:$G$12,MATCH(Lundi!K3,Quotats!$C$11:$G$11,0))","v":"Thon"},{"$f":"INDEX(Quotats!$C$12:$G$12,MATCH(Lundi!L3,Quotats!$C$11:$G$11,0))","v":"Steack"},{"$f":"INDEX(Quotats!$C$12:$G$12,MATCH(Lundi!M3,Quotats!$C$11:$G$11,0))","v":{"$error":"#N/A"}},{"$f":"INDEX(Quotats!$C$12:$G$12,MATCH(Lundi!N3,Quotats!$C$11:$G$11,0))","v":{"$error":"#N/A"}},{"$f":"INDEX(Quotats!$C$12:$G$12,MATCH(Lundi!O3,Quotats!$C$11:$G$11,0))","v":{"$error":"#N/A"}},{"$f":"INDEX(Quotats!$C$12:$G$12,MATCH(Lundi!P3,Quotats!$C$11:$G$11,0))","v":{"$error":"#N/A"}},{"$f":"INDEX(Quotats!$C$12:$G$12,MATCH(Lundi!Q3,Quotats!$C$11:$G$11,0))","v":"Poisson"},{"$f":"INDEX(Quotats!$C$12:$G$12,MATCH(Lundi!R3,Quotats!$C$11:$G$11,0))","v":"Agneau"}]
[]
["MIDI",null,null,null,null,null,null,"SOIR"]
["TOTAL COMMANDÉ",{"$f":"SUMIF($B$3:$F$3,\"Midi\",$B$2:$F$2)+SUMIF($B$3:$F$3,\"Soir\",$B$2:$F$2)","v":1170},{"$f":"SUMIF($B$3:$F$3,\"Substitution\",$B$2:$F$2)","v":620},{"$f":"SUMIF($B$3:$F$3,\"Sans viande\",$B$2:$F$2)","v":0},{"$f":"SUMIF($B$3:$F$3,\"EXCEDENT EXCELLENTS\",$B$2:$F$2)","v":0},null,null,"TOTAL COMMANDÉ",{"$f":"SUMIF($H$3:$R$3,\"Midi\",$H$2:$R$2)+SUMIF($H$3:$R$3,\"Soir\",$H$2:$R$2)","v":90},{"$f":"SUMIF($H$3:$R$3,\"Substitution\",$H$2:$R$2)","v":410},{"$f":"SUMIF($H$3:$R$3,\"Sans viande\",$H$2:$R$2)","v":500},{"$f":"SUMIF($H$3:$R$3,\"EXCELLENT EXCEDENTS\",$H$2:$R$2)","v":90}]
["TOTAL FAIT",null,null,null,null,null,null,"TOTAL FAIT"]
["TOTAL À FAIRE",{"$f":"IF(B10-B11>0,B10-B11,0)","v":1170},{"$f":"IF(C10-C11>0,C10-C11,0)","v":620},0,0,null,null,"TOTAL À FAIRE",{"$f":"IF(I10-I11>0,I10-I11,0)","v":90},{"$f":"IF(J10-J11>0,J10-J11,0)","v":410},{"$f":"IF(K10-K11>0,K10-K11,0)","v":500},{"$f":"IF(L10-L11>0,L10-L11,0)","v":90}]
["TOTAL RESTE ",{"$f":"IF(B10-B11>0,0,B11-B10)","v":0},{"$f":"IF(C10-C11>0,0,C11-C10)","v":0},0,0,null,null,"TOTAL RESTE ",{"$f":"IF(I10-I11>0,0,I11-I10)","v":0},{"$f":"IF(J10-J11>0,0,J11-J10)","v":0},0,0]
[]
["Nb max par contenairs","Nb contenairs pleins protéine","Nb contenairs pleins protéine","Nb contenairs pleins protéine","Nb contenairs pleins protéine","Nb contenairs pleins protéine",null,"Nb contenairs pleins protéine","Nb contenairs pleins protéine","Nb contenairs pleins protéine","Nb contenairs pleins protéine","Nb contenairs pleins protéine","Nb contenairs pleins protéine","Nb contenairs pleins protéine","Nb contenairs pleins protéine","Nb contenairs pleins protéine","Nb contenairs pleins protéine","Nb contenairs pleins protéine"]
{"$rows_left_out":216}
{"sheet":"Mardi","index":2,"n_rows":10,"n_cols":17,"rows_kept":10,"cut":false,"hidden":true,"merged":[[5,0,5,4],[5,6,5,10]]}
[null,{"$f":"Quotats!B1","v":"VILLETTE"},{"$f":"Quotats!C1","v":"BEDIER"},{"$f":"Quotats!D1","v":"MENILMONTANT"},{"$f":"Quotats!E1","v":"MARAUDE 93"},{"$f":"Quotats!F1","v":"MARAUDE 75"},{"$f":"Quotats!G1","v":"DENFERT"},{"$f":"Quotats!H1","v":"NATION"},{"$f":"Quotats!I1","v":"ST LAZARE"},{"$f":"Quotats!J1","v":"GARE DE L'EST"},{"$f":"Quotats!K1","v":"SALPETRIERE"},{"$f":"Quotats!L1","v":"INVALIDES"},{"$f":"Quotats!M1","v":"REPUBLIQUE"},{"$f":"Quotats!N1","v":"R. LENOIR"},{"$f":"Quotats!O1","v":"SAINT-OUEN"},{"$f":"Quotats!P1","v":"MENILMONTANT SOIR"},{"$f":"Quotats!Q1","v":"ST ROCH"}]
["Mardi",{"$f":"Quotats!B3","v":170},{"$f":"Quotats!C3","v":400},{"$f":"Quotats!D3","v":650},{"$f":"Quotats!E3","v":600},{"$f":"Quotats!F3","v":20},{"$f":"Quotats!G3","v":140},{"$f":"Quotats!H3","v":0},{"$f":"Quotats!I3","v":0},{"$f":"Quotats!J3","v":0},{"$f":"Quotats!K3","v":0},{"$f":"Quotats!L3","v":210},{"$f":"Quotats!M3","v":280},{"$f":"Quotats!N3","v":130},{"$f":"Quotats!O3","v":120},{"$f":"Quotats!P3","v":90},{"$f":"Quotats!Q3","v":90}]
[]
[]
[]
["MIDI",null,null,null,null,null,"SOIR"]
["TOTAL COMMANDÉ",{"$f":"SOMME_SI_COULEUR($B$2:$F$2)","v":1220},{"$f":"SOMME_SI_COULEUR($B$2:$F$2)","v":620},{"$f":"SOMME_SI_COULEUR($B$2:$F$2)","v":0},{"$f":"SOMME_SI_COULEUR($B$2:$F$2)","v":0},null,"TOTAL COMMANDÉ",{"$f":"SOMME_SI_COULEUR($G$2:$Q$2)","v":360},{"$f":"SOMME_SI_COULEUR($G$2:$Q$2)","v":490},{"$f":"SOMME_SI_COULEUR($G$2:$Q$2)","v":120},{"$f":"SOMME_SI_COULEUR($G$2:$Q$2)","v":90}]
["TOTAL FAIT",null,null,null,null,null,"TOTAL FAIT"]
["TOTAL À FAIRE",null,null,null,null,null,"TOTAL À FAIRE"]
["TOTAL RESTE ",null,null,null,null,null,"TOTAL RESTE "]

{"sheet":"Mercredi","index":3,"n_rows":10,"n_cols":17,"rows_kept":10,"cut":false,"hidden":true,"merged":[[5,0,5,4],[5,6,5,10]]}
[null,{"$f":"Quotats!B1","v":"VILLETTE"},{"$f":"Quotats!C1","v":"BEDIER"},{"$f":"Quotats!D1","v":"MENILMONTANT"},{"$f":"Quotats!E1","v":"MARAUDE 93"},{"$f":"Quotats!F1","v":"MARAUDE 75"},{"$f":"Quotats!G1","v":"DENFERT"},{"$f":"Quotats!H1","v":"NATION"},{"$f":"Quotats!I1","v":"ST LAZARE"},{"$f":"Quotats!J1","v":"GARE DE L'EST"},{"$f":"Quotats!K1","v":"SALPETRIERE"},{"$f":"Quotats!L1","v":"INVALIDES"},{"$f":"Quotats!M1","v":"REPUBLIQUE"},{"$f":"Quotats!N1","v":"R. LENOIR"},{"$f":"Quotats!O1","v":"SAINT-OUEN"},{"$f":"Quotats!P1","v":"MENILMONTANT SOIR"},{"$f":"Quotats!Q1","v":"ST ROCH"}]
["Mercredi",{"$f":"Quotats!B4","v":170},{"$f":"Quotats!C4","v":400},{"$f":"Quotats!D4","v":650},{"$f":"Quotats!E4","v":600},{"$f":"Quotats!F4","v":20},{"$f":"Quotats!G4","v":220},{"$f":"Quotats!H4","v":280},{"$f":"Quotats!I4","v":210},{"$f":"Quotats!J4","v":350},{"$f":"Quotats!K4","v":0},{"$f":"Quotats!L4","v":0},{"$f":"Quotats!M4","v":0},{"$f":"Quotats!N4","v":0},{"$f":"Quotats!O4","v":150},{"$f":"Quotats!P4","v":75},{"$f":"Quotats!Q4","v":80}]
[]
[]
[]
["MIDI",null,null,null,null,null,"SOIR"]
["TOTAL COMMANDÉ",{"$f":"SOMME_SI_COULEUR($B$2:$F$2)","v":1220},{"$f":"SOMME_SI_COULEUR($B$2:$F$2)","v":620},{"$f":"SOMME_SI_COULEUR($B$2:$F$2)","v":0},{"$f":"SOMME_SI_COULEUR($B$2:$F$2)","v":0},null,"TOTAL COMMANDÉ",{"$f":"SOMME_SI_COULEUR($G$2:$Q$2)","v":355},{"$f":"SOMME_SI_COULEUR($G$2:$Q$2)","v":430},{"$f":"SOMME_SI_COULEUR($G$2:$Q$2)","v":500},{"$f":"SOMME_SI_COULEUR($G$2:$Q$2)","v":80}]
["TOTAL FAIT",null,null,null,null,null,"TOTAL FAIT"]
["TOTAL À FAIRE",null,null,null,null,null,"TOTAL À FAIRE"]
["TOTAL RESTE ",null,null,null,null,null,"TOTAL RESTE "]

{"sheet":"Jeudi","index":4,"n_rows":10,"n_cols":17,"rows_kept":10,"cut":false,"hidden":true,"merged":[[5,0,5,4],[5,6,5,10]]}
[null,{"$f":"Quotats!B1","v":"VILLETTE"},{"$f":"Quotats!C1","v":"BEDIER"},{"$f":"Quotats!D1","v":"MENILMONTANT"},{"$f":"Quotats!E1","v":"MARAUDE 93"},{"$f":"Quotats!F1","v":"MARAUDE 75"},{"$f":"Quotats!G1","v":"DENFERT"},{"$f":"Quotats!H1","v":"NATION"},{"$f":"Quotats!I1","v":"ST LAZARE"},{"$f":"Quotats!J1","v":"GARE DE L'EST"},{"$f":"Quotats!K1","v":"SALPETRIERE"},{"$f":"Quotats!L1","v":"INVALIDES"},{"$f":"Quotats!M1","v":"REPUBLIQUE"},{"$f":"Quotats!N1","v":"R. LENOIR"},{"$f":"Quotats!O1","v":"SAINT-OUEN"},{"$f":"Quotats!P1","v":"MENILMONTANT SOIR"},{"$f":"Quotats!Q1","v":"ST ROCH"}]
["Jeudi",{"$f":"Quotats!B5","v":170},{"$f":"Quotats!C5","v":400},{"$f":"Quotats!D5","v":650},{"$f":"Quotats!E5","v":600},{"$f":"Quotats!F5","v":20},{"$f":"Quotats!G5","v":0},{"$f":"Quotats!H5","v":0},{"$f":"Quotats!I5","v":0},{"$f":"Quotats!J5","v":0},{"$f":"Quotats!K5","v":65},{"$f":"Quotats!L5","v":220},{"$f":"Quotats!M5","v":300},{"$f":"Quotats!N5","v":190},{"$f":"Quotats!O5","v":180},{"$f":"Quotats!P5","v":90},{"$f":"Quotats!Q5","v":85}]
[]
[]
[]
["MIDI",null,null,null,null,null,"SOIR"]
["TOTAL COMMANDÉ",{"$f":"SOMME_SI_COULEUR($B$2:$F$2)","v":1220},{"$f":"SOMME_SI_COULEUR($B$2:$F$2)","v":620},{"$f":"SOMME_SI_COULEUR($B$2:$F$2)","v":0},{"$f":"SOMME_SI_COULEUR($B$2:$F$2)","v":0},null,"TOTAL COMMANDÉ",{"$f":"SOMME_SI_COULEUR($G$2:$Q$2)","v":610},{"$f":"SOMME_SI_COULEUR($G$2:$Q$2)","v":255},{"$f":"SOMME_SI_COULEUR($G$2:$Q$2)","v":180},{"$f":"SOMME_SI_COULEUR($G$2:$Q$2)","v":85}]
["TOTAL FAIT",null,null,null,null,null,"TOTAL FAIT"]
["TOTAL À FAIRE",null,null,null,null,null,"TOTAL À FAIRE"]
["TOTAL RESTE ",null,null,null,null,null,"TOTAL RESTE "]

{"sheet":"Vendredi","index":5,"n_rows":10,"n_cols":17,"rows_kept":10,"cut":false,"hidden":true,"merged":[[5,0,5,4],[5,6,5,10]]}
[null,{"$f":"Quotats!B1","v":"VILLETTE"},{"$f":"Quotats!C1","v":"BEDIER"},{"$f":"Quotats!D1","v":"MENILMONTANT"},{"$f":"Quotats!E1","v":"MARAUDE 93"},{"$f":"Quotats!F1","v":"MARAUDE 75"},{"$f":"Quotats!G1","v":"DENFERT"},{"$f":"Quotats!H1","v":"NATION"},{"$f":"Quotats!I1","v":"ST LAZARE"},{"$f":"Quotats!J1","v":"GARE DE L'EST"},{"$f":"Quotats!K1","v":"SALPETRIERE"},{"$f":"Quotats!L1","v":"INVALIDES"},{"$f":"Quotats!M1","v":"REPUBLIQUE"},{"$f":"Quotats!N1","v":"R. LENOIR"},{"$f":"Quotats!O1","v":"SAINT-OUEN"},{"$f":"Quotats!P1","v":"MENILMONTANT SOIR"},{"$f":"Quotats!Q1","v":"ST ROCH"}]
["Vendredi",{"$f":"Quotats!B6","v":170},{"$f":"Quotats!C6","v":400},{"$f":"Quotats!D6","v":650},{"$f":"Quotats!E6","v":1200},{"$f":"Quotats!F6","v":20},{"$f":"Quotats!G6","v":250},{"$f":"Quotats!H6","v":160},{"$f":"Quotats!I6","v":180},{"$f":"Quotats!J6","v":400},{"$f":"Quotats!K6","v":0},{"$f":"Quotats!L6","v":0},{"$f":"Quotats!M6","v":0},{"$f":"Quotats!N6","v":0},{"$f":"Quotats!O6","v":250},{"$f":"Quotats!P6","v":80},{"$f":"Quotats!Q6","v":85}]
[]
[]
[]
["MIDI",null,null,null,null,null,"SOIR"]
["TOTAL COMMANDÉ",{"$f":"SOMME_SI_COULEUR($B$2:$F$2)","v":1220},{"$f":"SOMME_SI_COULEUR($B$2:$F$2)","v":1220},{"$f":"SOMME_SI_COULEUR($B$2:$F$2)","v":0},{"$f":"SOMME_SI_COULEUR($B$2:$F$2)","v":0},null,"TOTAL COMMANDÉ",{"$f":"SOMME_SI_COULEUR($G$2:$Q$2)","v":1070},{"$f":"SOMME_SI_COULEUR($G$2:$Q$2)","v":0},{"$f":"SOMME_SI_COULEUR($G$2:$Q$2)","v":250},{"$f":"SOMME_SI_COULEUR($G$2:$Q$2)","v":85}]
["TOTAL FAIT",null,null,null,null,null,"TOTAL FAIT"]
["TOTAL À FAIRE",null,null,null,null,null,"TOTAL À FAIRE"]
["TOTAL RESTE ",null,null,null,null,null,"TOTAL RESTE "]

{"sheet":"Samedi","index":6,"n_rows":10,"n_cols":17,"rows_kept":10,"cut":false,"hidden":true,"merged":[[5,0,5,4],[5,6,5,10]]}
[null,{"$f":"Quotats!B1","v":"VILLETTE"},{"$f":"Quotats!C1","v":"BEDIER"},{"$f":"Quotats!D1","v":"MENILMONTANT"},{"$f":"Quotats!E1","v":"MARAUDE 93"},{"$f":"Quotats!F1","v":"MARAUDE 75"},{"$f":"Quotats!G1","v":"DENFERT"},{"$f":"Quotats!H1","v":"NATION"},{"$f":"Quotats!I1","v":"ST LAZARE"},{"$f":"Quotats!J1","v":"GARE DE L'EST"},{"$f":"Quotats!K1","v":"SALPETRIERE"},{"$f":"Quotats!L1","v":"INVALIDES"},{"$f":"Quotats!M1","v":"REPUBLIQUE"},{"$f":"Quotats!N1","v":"R. LENOIR"},{"$f":"Quotats!O1","v":"SAINT-OUEN"},{"$f":"Quotats!P1","v":"MENILMONTANT SOIR"},{"$f":"Quotats!Q1","v":"ST ROCH"}]
["Samedi",{"$f":"Quotats!B7","v":0},{"$f":"Quotats!C7","v":0},{"$f":"Quotats!D7","v":0},{"$f":"Quotats!E7","v":0},{"$f":"Quotats!F7","v":0},{"$f":"Quotats!G7","v":0},{"$f":"Quotats!H7","v":0},{"$f":"Quotats!I7","v":0},{"$f":"Quotats!J7","v":0},{"$f":"Quotats!K7","v":0},{"$f":"Quotats!L7","v":220},{"$f":"Quotats!M7","v":400},{"$f":"Quotats!N7","v":150},{"$f":"Quotats!O7","v":0},{"$f":"Quotats!P7","v":75},{"$f":"Quotats!Q7","v":80}]
[]
[]
[]
["MIDI",null,null,null,null,null,"SOIR"]
["TOTAL COMMANDÉ",{"$f":"SOMME_SI_COULEUR($B$2:$F$2)","v":0},{"$f":"SOMME_SI_COULEUR($B$2:$F$2)","v":0},{"$f":"SOMME_SI_COULEUR($B$2:$F$2)","v":0},{"$f":"SOMME_SI_COULEUR($B$2:$F$2)","v":0},null,"TOTAL COMMANDÉ",{"$f":"SOMME_SI_COULEUR($G$2:$Q$2)","v":475},{"$f":"SOMME_SI_COULEUR($G$2:$Q$2)","v":370},{"$f":"SOMME_SI_COULEUR($G$2:$Q$2)","v":0},{"$f":"SOMME_SI_COULEUR($G$2:$Q$2)","v":80}]
["TOTAL FAIT",null,null,null,null,null,"TOTAL FAIT"]
["TOTAL À FAIRE",null,null,null,null,null,"TOTAL À FAIRE"]
["TOTAL RESTE ",null,null,null,null,null,"TOTAL RESTE "]

{"sheet":"Dimanche","index":7,"n_rows":10,"n_cols":17,"rows_kept":10,"cut":false,"hidden":true,"merged":[[5,0,5,4],[5,6,5,10]]}
[null,{"$f":"Quotats!B1","v":"VILLETTE"},{"$f":"Quotats!C1","v":"BEDIER"},{"$f":"Quotats!D1","v":"MENILMONTANT"},{"$f":"Quotats!E1","v":"MARAUDE 93"},{"$f":"Quotats!F1","v":"MARAUDE 75"},{"$f":"Quotats!G1","v":"DENFERT"},{"$f":"Quotats!H1","v":"NATION"},{"$f":"Quotats!I1","v":"ST LAZARE"},{"$f":"Quotats!J1","v":"GARE DE L'EST"},{"$f":"Quotats!K1","v":"SALPETRIERE"},{"$f":"Quotats!L1","v":"INVALIDES"},{"$f":"Quotats!M1","v":"REPUBLIQUE"},{"$f":"Quotats!N1","v":"R. LENOIR"},{"$f":"Quotats!O1","v":"SAINT-OUEN"},{"$f":"Quotats!P1","v":"MENILMONTANT SOIR"},{"$f":"Quotats!Q1","v":"ST ROCH"}]
["Dimanche",{"$f":"Quotats!B8","v":0},{"$f":"Quotats!C8","v":0},{"$f":"Quotats!D8","v":0},{"$f":"Quotats!E8","v":0},{"$f":"Quotats!F8","v":0},{"$f":"Quotats!G8","v":200},{"$f":"Quotats!H8","v":0},{"$f":"Quotats!I8","v":0},{"$f":"Quotats!J8","v":500},{"$f":"Quotats!K8","v":0},{"$f":"Quotats!L8","v":220},{"$f":"Quotats!M8","v":0},{"$f":"Quotats!N8","v":0},{"$f":"Quotats!O8","v":0},{"$f":"Quotats!P8","v":80},{"$f":"Quotats!Q8","v":100}]
[]
[]
[]
["MIDI",null,null,null,null,null,"SOIR"]
["TOTAL COMMANDÉ",{"$f":"SOMME_SI_COULEUR($B$2:$F$2)","v":0},{"$f":"SOMME_SI_COULEUR($B$2:$F$2)","v":0},{"$f":"SOMME_SI_COULEUR($B$2:$F$2)","v":0},{"$f":"SOMME_SI_COULEUR($B$2:$F$2)","v":0},null,"TOTAL COMMANDÉ",{"$f":"SOMME_SI_COULEUR($G$2:$Q$2)","v":800},{"$f":"SOMME_SI_COULEUR($G$2:$Q$2)","v":200},{"$f":"SOMME_SI_COULEUR($G$2:$Q$2)","v":0},{"$f":"SOMME_SI_COULEUR($G$2:$Q$2)","v":100}]
["TOTAL FAIT",null,null,null,null,null,"TOTAL FAIT"]
["TOTAL À FAIRE",null,null,null,null,null,"TOTAL À FAIRE"]
["TOTAL RESTE ",null,null,null,null,null,"TOTAL RESTE "]

{"sheet":"infos","index":8,"n_rows":23,"n_cols":3,"rows_kept":23,"cut":false,"hidden":true,"merged":[]}
[]
[]
[]
[]
[]
[]
[null,"si imprévu pas assez, montrer le stock dispo, puis remonter l'info pour modifier les stocks futurs"]
[]
[null,"Calendrier hebdo avec ce qui a déjà été fait, ce qui est à faire, s'il y en a trop ou pas assez"]
[null,null,"s'il y en a trop, le sortir et le mettre en subs"]
[null,null,"Si y en a pas assez, par quoi on compense (SOGERES) puis le remonter "]
[]
[null,"Ils font les échelles, ils indiquent cb, puis ils recoivent l'info de quoi mettre sur le papier "]
[null,null,"l'excel génère les étiquettes"]
[null,null,"la cuisine colle les étiquettes "]
{"$rows_left_out":8}