{"text_format":"1","workbook":"xlsx","n_sheets":17,"sheets":["Calendrier","Feuil2","Module1","JAN","FEV","MAR","AVR","MAI","JUN","JUL","AOU","SEP","OCT","NOV","DEC","Fériés","Lisez_moi"],"not_rendered":{"charts":0,"images":0,"macros":1,"external_links":0,"defined_names":80,"comments":0,"pivot_tables":0},"unopened":[{"sheet":"Module1","index":2,"reason":"part_missing"}],"bounds":{"document_bytes":16777216,"sheet_cells":100000,"rows_first":2000,"rows_last":500,"rows_between":2000,"halvings":0,"cell_chars":16384,"cell_head_chars":4096},"cells_cut":0,"cells_raw":0,"read":"whole","date_system":"1900"}

{"sheet":"Calendrier","index":0,"n_rows":59,"n_cols":49,"rows_kept":59,"cut":false,"hidden":false,"merged":[[4,9,4,10],[0,13,0,14],[0,20,0,21],[1,11,1,12],[1,13,1,14],[2,11,2,12],[2,13,2,14],[3,11,3,12],[3,13,3,14],[4,11,4,12],[4,13,4,14],[4,15,4,21],[3,9,3,10],[2,9,2,10],[5,11,5,12],[5,13,5,14],[6,11,6,12],[6,13,6,14],[6,15,6,20],[7,1,7,5],[7,9,7,10],[7,11,7,12],[7,13,7,14],[7,15,7,20],[6,9,6,10],[8,9,8,10],[8,11,8,12],[8,13,8,14],[8,15,8,20]]}
[2023,null,null,null,"N° ident.","T506489",null,null,null,null,null,"année",null,{"$f":"IF(ISERROR(VALUE(\"29/02/\"&VLOOKUP(\"Février\",Fériés!$I$1:$J$12,2,FALSE))),365,366)","v":365},null,"jours",null,null,"contrôle",null,{"$f":"SUM(AH11:AP11)","v":365},null,null,null,null,null,null,null,null,null,null,null,null,null,null,null,null,null,null,null,null,null,null,null,"Sa","Samedi"]
[null,null,null,null,"nom","Isq",null,null,null,null,null,{"$f":"$AS$3","v":"F"},null,{"$f":"COUNTIF($B$12:$AF$59,L2)/2","v":12},null,"férié",null,null,null,null,null,null,null,null,null,null,null,null,null,null,null,null,null,null,null,null,null,null,null,null,null,null,null,null,"Di","Dimanche",null,null,{"$f":"CHAR(189)","v":"½"}]
[null,null,null,null,"prénom","Philippe",null,null,null,{"$f":"CHAR(189)&\" \"&$AS$2","v":"½ Di"},null,{"$f":"$AS$2","v":"Di"},null,{"$f":"AJ11","v":50},null,"dimanche",null,null,null,null,null,null,null,null,null,null,null,null,null,null,null,null,null,null,null,null,null,null,null,null,null,null,null,null,"F","Férié",null,null,{"$f":"CODE(\"1/2\")","v":49}]
[null,null,null,null,"service","Administratif",null,null,null,"½ Sa",null,{"$f":"$AS$1","v":"Sa"},null,{"$f":"AI11","v":51},null,"samedi",null,null,null,{"$f":"$AO$11","v":0},{"$f":"$AS$7","v":"Ma"},null,null,null,null,null,null,null,null,null,null,null,null,null,null,null,null,null,null,null,null,null,null,null,"CA","Congés annuel"]
[null,null,null,null,null,null,null,null,null,"½ CA",null,{"$f":"$AS$4","v":"CA"},null,{"$f":"COUNTIF($B$12:$AF$59,L5)-COUNTIF(copie_cal_aou,\"CA\")","v":25},null,{"$f":"IF($AL$11>$N$5,\"nombre de CA dépassé\",\"reste \"&25-$N$5)","v":"reste 0"},null,null,null,null,null,null,null,null,null,null,null,null,null,null,null,null,null,null,null,null,null,null,null,null,null,null,null,null,"CP","Chômage partiel"]
[null,null,null,null,null,null,null,null,null,null,null,{"$f":"$AS$5","v":"CP"},null,{"$f":"AM11","v":0},null,null,null,null,null,null,null,null,null,null,null,null,null,null,null,null,null,null,null,null,null,null,null,null,null,null,null,null,null,null,"RTT","Recupération temps travail"]
[null,null,null,null,null,null,null,null,null,{"$f":"CHAR(189)&\" \"&$AS$11","v":"½ T"},null,{"$f":"$AS$11","v":"T"},null,{"$f":"$AT$11-(AM11+AP11+V4)","v":218},null,{"$f":"IF(SUM($AH$15:$AH$59)>$N$7,\"trop de jour travaillés\",IF((SUM($AH$15:$AH$59)+AM11)=$N$7,\"Nb jour travailler bon\",\"reste à travailler\"))","v":"Nb jour travailler bon"},null,null,null,null,null,{"$f":"IF($AH$11+$T$4<=$N$7,$N$7-(AH11+T4),$N$7-AH11)","v":0},null,null,null,null,null,null,null,null,null,null,null,null,null,null,null,null,null,null,null,null,null,null,"Ma","Maladie"]
[null,"HORAIRE 2 X 4",null,null,null,null,null,null,null,"½ RTT",null,{"$f":"$AS$6","v":"RTT"},null,{"$f":"N1-(N2+N3+N4+N5+AM11+AT11+N9)","v":9},null,{"$f":"IF($AN$11>$N$8,\"Nb de RTT dépassé\",\"reste \"&+$N$8-$AN$11)","v":"reste 0"},null,null,null,null,null,null,null,null,null,null,null,null,null,null,null,null,null,{"$f":"SUM(AH11:AP11)","v":365},null,null,null,null,null,null,null,null,null,null,"CS","Congés suplémentaires (ancienneté)"]
[null,null,null,null,null,null,null,null,null,"½ CS",null,{"$f":"$AS$8","v":"CS"},null,null,null,{"$f":"IF($AP$11>$N$9,\"Nb CS dépassé\",\"reste \"&+$N$9-$AP$11&\" CS \")","v":"reste 0 CS "},null,null,null,null,null,null,null,null,null,null,null,null,null,null,null,null,null,{"$f":"CHAR(189)&$AS$11","v":"½T"},{"$f":"CHAR(189)&\" \"&$AS$1","v":"½ Sa"},{"$f":"CHAR(189)&\" \"&$AS$2","v":"½ Di"},null,{"$f":"CHAR(189)&\" \"&$AS$4","v":"½ CA"},null,{"$f":"CHAR(189)&\" \"&$AS$6","v":"½ RTT"},null,{"$f":"CHAR(189)&\" \"&$AS$8","v":"½ CS"},null,null,"H",8,"horaire journalier"]
[{"$f":"$AT$11&\" Jours de travail d'une durée de \"&AT9&\" heures soit \"&AT11*AT9&\" heures / an y compris les 7 Heures de la journée de solidaritée\"","v":"218 Jours de travail d'une durée de 8 heures soit 1744 heures / an y compris les 7 Heures de la journée de solidaritée"},null,null,null,null,null,null,null,null,null,null,null,null,null,null,null,null,null,null,null,null,null,null,null,null,null,null,null,null,null,null,null,null,{"$f":"$AS$11","v":"T"},{"$f":"$AS$1","v":"Sa"},{"$f":"$AS$2","v":"Di"},{"$f":"$AS$3","v":"F"},{"$f":"$AS$4","v":"CA"},{"$f":"$AS$5","v":"CP"},{"$f":"$AS$6","v":"RTT"},{"$f":"$AS$7","v":"Ma"},{"$f":"$AS$8","v":"CS"},null,null,"Pause",0.75,"pause mi-journée"]
[null,1,2,3,4,5,6,7,8,9,10,11,12,13,14,15,16,17,18,19,20,21,22,23,24,25,26,27,28,29,30,31,null,{"$f":"SUM(AH15:AH59)","v":218},{"$f":"SUM(AI15:AI59)","v":51},50,12,25,0,9,0,0,null,null,"T",218,"Nombre de jour dû à l'année"]
[null,{"$f":"CHOOSE(WEEKDAY(B13,2),\"Lu\",\"Ma\",\"Me\",\"Je\",\"Ve\",\"Sa\",\"Di\")","v":"Di"},{"$f":"CHOOSE(WEEKDAY(C13,2),\"Lu\",\"Ma\",\"Me\",\"Je\",\"Ve\",\"Sa\",\"Di\")","v":"Lu"},"Ma","Me","Je","Ve","Sa","Di","Lu","Ma","Me","Je","Ve","Sa","Di","Lu","Ma","Me","Je","Ve","Sa","Di","Lu","Ma","Me","Je","Ve","Sa",{"$f":"IF(AD13=0,0,CHOOSE(WEEKDAY(AD13,2),\"Lu\",\"Ma\",\"Me\",\"Je\",\"Ve\",\"Sa\",\"Di\"))","v":"Di"},{"$f":"IF(AE13=0,0,CHOOSE(WEEKDAY(AE13,2),\"Lu\",\"Ma\",\"Me\",\"Je\",\"Ve\",\"Sa\",\"Di\"))","v":"Lu"},{"$f":"IF(AF13=0,0,CHOOSE(WEEKDAY(AF13,2),\"Lu\",\"Ma\",\"Me\",\"Je\",\"Ve\",\"Sa\",\"Di\"))","v":"Ma"},null,null,null,null,null,null,null,null,null,null,null,null,{"$f":"INDIRECT(\"Fériés!k\"&MATCH(AT12,Fériés!L1:L12,0))","v":"01"},"Janvier","l'année commence en :"]
[null,{"$f":"VALUE(\"01/\"&$AS$12&\"/\"&AN_1)","v":44927},{"$f":"B13+1","v":44928},{"$f":"C13+1","v":44929},44930,44931,44932,44933,44934,44935,44936,44937,44938,44939,44940,44941,44942,44943,44944,44945,44946,44947,44948,44949,44950,44951,44952,44953,44954,{"$f":"IF(MONTH($AC13+1)=MONTH($B13)+1,0,$AC13+1)","v":44955},{"$f":"IF(MONTH(AC13+2)=MONTH(B13)+1,0,AC13+2)","v":44956},{"$f":"IF(MONTH($AC13+3)=MONTH($B13)+1,0,$AC13+3)","v":44957}]
[null,{"$f":"IF(AND(ISERROR(VLOOKUP(B13,liste_fériés,1,FALSE)),OR(B12=\"Sa\",B12=\"Di\")),B12,IF(ISERROR(VLOOKUP(B13,liste_fériés,1,FALSE)),\"T\",\"F\"))","v":"F"},"T","T","T","T","T","Sa","Di","T","T","T","T","T","Sa","Di","T","T","T","T","T","Sa","Di","T","T","T","T","T","Sa",{"$f":"IF(AD13=0,0,IF(AND(ISERROR(VLOOKUP(AD13,liste_fériés,1,FALSE)),OR(AD12=\"Sa\",AD12=\"Di\")),AD12,IF(ISERROR(VLOOKUP(AD13,liste_fériés,1,FALSE)),\"T\",\"F\")))","v":"Di"},{"$f":"IF(AE13=0,0,IF(AND(ISERROR(VLOOKUP(AE13,liste_fériés,1,FALSE)),OR(AE12=\"Sa\",AE12=\"Di\")),AE12,IF(ISERROR(VLOOKUP(AE13,liste_fériés,1,FALSE)),\"T\",\"F\")))","v":"T"},{"$f":"IF(AF13=0,0,IF(AND(ISERROR(VLOOKUP(AF13,liste_fériés,1,FALSE)),OR(AF12=\"Sa\",AF12=\"Di\")),AF12,IF(ISERROR(VLOOKUP(AF13,liste_fériés,1,FALSE)),\"T\",\"F\")))","v":"T"}]
[{"$f":"CHOOSE(MONTH(B13),\"JAN\",\"FEV\",\"MAR\",\"AVR\",\"MAI\",\"JUN\",\"JUL\",\"AOU\",\"SEP\",\"OCT\",\"NOV\",\"DEC\")","v":"JAN"},"F","T","T","T","T","T","Sa","Di","RTT","T","T","T","T","Sa","Di","T","T","RTT","T","T","Sa","Di","T","T","T","T","T","Sa","Di","T","T",null,{"$f":"COUNTIF($B15:$AF15,$AH$10)+COUNTIF($B15:$AF15,$AH$9)*0.5+COUNTIF($B15:$AF15,$AN$9)*0.5++COUNTIF($B15:$AF15,$AP$9)*0.5","v":20},{"$f":"COUNTIF($B15:$AF15,$AI$10)+((COUNTIF($B12:$AF12,$AI$10)-COUNTIF($B15:$AF15,$AI$10))/2)","v":4},{"$f":"COUNTIF($B15:$AF15,$AJ$10)","v":4},{"$f":"COUNTIF($B15:$AF15,$AK$10)","v":1},{"$f":"COUNTIF($B15:$AF15,$AL$10)","v":0},{"$f":"COUNTIF($B15:$AF15,$AM$10)","v":0},{"$f":"COUNTIF($B15:$AF15,$AN$10)+COUNTIF($B15:$AF15,$AN$9)*0.5","v":2},{"$f":"COUNTIF($B15:$AF15,$AO$10)","v":0},{"$f":"COUNTIF($B15:$AF15,$AP$10)+COUNTIF($B15:$AF15,$AP$9)*0.5","v":0},null,{"$f":"SUM(AH15:AQ15)","v":31},{"$f":"DAY(EOMONTH(DATE(AN_1,MONTH(B13),1),0))","v":31}]
[null,{"$f":"CHOOSE(WEEKDAY(B17,2),\"Lu\",\"Ma\",\"Me\",\"Je\",\"Ve\",\"Sa\",\"Di\")","v":"Me"},{"$f":"CHOOSE(WEEKDAY(C17,2),\"Lu\",\"Ma\",\"Me\",\"Je\",\"Ve\",\"Sa\",\"Di\")","v":"Je"},"Ve","Sa","Di","Lu","Ma","Me","Je","Ve","Sa","Di","Lu","Ma","Me","Je","Ve","Sa","Di","Lu","Ma","Me","Je","Ve","Sa","Di","Lu","Ma",{"$f":"IF(AD17=0,0,CHOOSE(WEEKDAY(AD17,2),\"Lu\",\"Ma\",\"Me\",\"Je\",\"Ve\",\"Sa\",\"Di\"))","v":0},{"$f":"IF(AE17=0,0,CHOOSE(WEEKDAY(AE17,2),\"Lu\",\"Ma\",\"Me\",\"Je\",\"Ve\",\"Sa\",\"Di\"))","v":0},{"$f":"IF(AF17=0,0,CHOOSE(WEEKDAY(AF17,2),\"Lu\",\"Ma\",\"Me\",\"Je\",\"Ve\",\"Sa\",\"Di\"))","v":0},null,null,null,null,null,null,null,{"$f":"COUNTIF($B16:$AF16,$AN$10)+COUNTIF($B16:$AF16,$AN$9)*0.5","v":0}]
[null,{"$f":"VALUE(\"01/\"&INDIRECT(\"Fériés!h\"&COUNTA($A$11:A17)+1,1)&\"/\"&INDIRECT(\"Fériés!j\"&COUNTA($A$11:A17)+1,1))","v":44958},{"$f":"B17+1","v":44959},{"$f":"C17+1","v":44960},44961,44962,44963,44964,44965,44966,44967,44968,44969,44970,44971,44972,44973,44974,44975,44976,44977,44978,44979,44980,44981,44982,44983,44984,{"$f":"AB17+1","v":44985},{"$f":"IF(MONTH($AC17+1)=MONTH($B17)+1,0,$AC17+1)","v":0},{"$f":"IF(MONTH(AC17+2)=MONTH(B17)+1,0,AC17+2)","v":0},{"$f":"IF(MONTH($AC17+3)=MONTH($B17)+1,0,$AC17+3)","v":0},null,null,null,null,null,null,null,0]
[null,{"$f":"IF(AND(ISERROR(VLOOKUP(B17,liste_fériés,1,FALSE)),OR(B16=\"Sa\",B16=\"Di\")),B16,IF(ISERROR(VLOOKUP(B17,liste_fériés,1,FALSE)),\"T\",\"F\"))","v":"T"},"T","T","Sa","Di","T","T","T","T","T","Sa","Di","T","T","T","T","T","Sa","Di","T","T","T","T","T","Sa","Di","T","T",{"$f":"IF(AD17=0,0,IF(AND(ISERROR(VLOOKUP(AD17,liste_fériés,1,FALSE)),OR(AD16=\"Sa\",AD16=\"Di\")),AD16,IF(ISERROR(VLOOKUP(AD17,liste_fériés,1,FALSE)),\"T\",\"F\")))","v":0},{"$f":"IF(AE17=0,0,IF(AND(ISERROR(VLOOKUP(AE17,liste_fériés,1,FALSE)),OR(AE16=\"Sa\",AE16=\"Di\")),AE16,IF(ISERROR(VLOOKUP(AE17,liste_fériés,1,FALSE)),\"T\",\"F\")))","v":0},{"$f":"IF(AF17=0,0,IF(AND(ISERROR(VLOOKUP(AF17,liste_fériés,1,FALSE)),OR(AF16=\"Sa\",AF16=\"Di\")),AF16,IF(ISERROR(VLOOKUP(AF17,liste_fériés,1,FALSE)),\"T\",\"F\")))","v":0},null,null,null,null,null,null,null,0]
[{"$f":"CHOOSE(MONTH(B17),\"JAN\",\"FEV\",\"MAR\",\"AVR\",\"MAI\",\"JUN\",\"JUL\",\"AOU\",\"SEP\",\"OCT\",\"NOV\",\"DEC\")","v":"FEV"},"T","T","T","Sa","Di","T","RTT","T","T","T","Sa","Di","T","T","T","T","T","Sa","Di","T","T","RTT","T","T","Sa","Di","T","T",null,null,null,null,{"$f":"COUNTIF($B19:$AF19,$AH$10)+COUNTIF($B19:$AF19,$AH$9)*0.5+COUNTIF($B19:$AF19,$AN$9)*0.5++COUNTIF($B19:$AF19,$AP$9)*0.5","v":18},{"$f":"COUNTIF($B19:$AF19,$AI$10)","v":4},{"$f":"COUNTIF($B19:$AF19,$AJ$10)","v":4},{"$f":"COUNTIF($B19:$AF19,$AK$10)","v":0},{"$f":"COUNTIF($B19:$AF19,$AL$10)","v":0},{"$f":"COUNTIF($B19:$AF19,$AM$10)","v":0},2,{"$f":"COUNTIF($B19:$AF19,$AO$10)","v":0},{"$f":"COUNTIF($B19:$AF19,$AP$10)+COUNTIF($B19:$AF19,$AP$9)*0.5","v":0},null,28,{"$f":"DAY(EOMONTH(DATE(AN_1,MONTH(B17),1),0))","v":28}]
[null,{"$f":"CHOOSE(WEEKDAY(B21,2),\"Lu\",\"Ma\",\"Me\",\"Je\",\"Ve\",\"Sa\",\"Di\")","v":"Me"},{"$f":"CHOOSE(WEEKDAY(C21,2),\"Lu\",\"Ma\",\"Me\",\"Je\",\"Ve\",\"Sa\",\"Di\")","v":"Je"},"Ve","Sa","Di","Lu","Ma","Me","Je","Ve","Sa","Di","Lu","Ma","Me","Je","Ve","Sa","Di","Lu","Ma","Me","Je","Ve","Sa","Di","Lu","Ma",{"$f":"IF(AD21=0,0,CHOOSE(WEEKDAY(AD21,2),\"Lu\",\"Ma\",\"Me\",\"Je\",\"Ve\",\"Sa\",\"Di\"))","v":"Me"},{"$f":"IF(AE21=0,0,CHOOSE(WEEKDAY(AE21,2),\"Lu\",\"Ma\",\"Me\",\"Je\",\"Ve\",\"Sa\",\"Di\"))","v":"Je"},{"$f":"IF(AF21=0,0,CHOOSE(WEEKDAY(AF21,2),\"Lu\",\"Ma\",\"Me\",\"Je\",\"Ve\",\"Sa\",\"Di\"))","v":"Ve"},null,null,null,null,null,null,null,0]
[null,{"$f":"VALUE(\"01/\"&INDIRECT(\"Fériés!h\"&COUNTA($A$11:A21)+1,1)&\"/\"&INDIRECT(\"Fériés!j\"&COUNTA($A$11:A21)+1,1))","v":44986},{"$f":"B21+1","v":44987},{"$f":"C21+1","v":44988},44989,44990,44991,44992,44993,44994,44995,44996,44997,44998,44999,45000,45001,45002,45003,45004,45005,45006,45007,45008,45009,45010,45011,45012,45013,{"$f":"IF(MONTH($AC21+1)=MONTH($B21)+1,0,$AC21+1)","v":45014},{"$f":"IF(MONTH(AC21+2)=MONTH(B21)+1,0,AC21+2)","v":45015},{"$f":"IF(MONTH($AC21+3)=MONTH($B21)+1,0,$AC21+3)","v":45016},null,null,null,null,null,null,null,0]
[null,{"$f":"IF(AND(ISERROR(VLOOKUP(B21,liste_fériés,1,FALSE)),OR(B20=\"Sa\",B20=\"Di\")),B20,IF(ISERROR(VLOOKUP(B21,liste_fériés,1,FALSE)),\"T\",\"F\"))","v":"T"},"T","T","Sa","Di","T","T","T","T","T","Sa","Di","T","T","T","T","T","Sa","Di","T","T","T","T","T","Sa","Di","T","T",{"$f":"IF(AD21=0,0,IF(AND(ISERROR(VLOOKUP(AD21,liste_fériés,1,FALSE)),OR(AD20=\"Sa\",AD20=\"Di\")),AD20,IF(ISERROR(VLOOKUP(AD21,liste_fériés,1,FALSE)),\"T\",\"F\")))","v":"T"},{"$f":"IF(AE21=0,0,IF(AND(ISERROR(VLOOKUP(AE21,liste_fériés,1,FALSE)),OR(AE20=\"Sa\",AE20=\"Di\")),AE20,IF(ISERROR(VLOOKUP(AE21,liste_fériés,1,FALSE)),\"T\",\"F\")))","v":"T"},{"$f":"IF(AF21=0,0,IF(AND(ISERROR(VLOOKUP(AF21,liste_fériés,1,FALSE)),OR(AF20=\"Sa\",AF20=\"Di\")),AF20,IF(ISERROR(VLOOKUP(AF21,liste_fériés,1,FALSE)),\"T\",\"F\")))","v":"T"},null,null,null,null,null,null,null,0]
[{"$f":"CHOOSE(MONTH(B21),\"JAN\",\"FEV\",\"MAR\",\"AVR\",\"MAI\",\"JUN\",\"JUL\",\"AOU\",\"SEP\",\"OCT\",\"NOV\",\"DEC\")","v":"MAR"},"T","T","T","Sa","Di","T","T","T","T","T","Sa","Di","T","T","T","T","T","Sa","Di","T","T","T","T","T","Sa","Di","T","T","T","T","T",null,{"$f":"COUNTIF($B23:$AF23,$AH$10)+COUNTIF($B23:$AF23,$AH$9)*0.5+COUNTIF($B23:$AF23,$AN$9)*0.5++COUNTIF($B23:$AF23,$AP$9)*0.5","v":23},{"$f":"COUNTIF($B23:$AF23,$AI$10)","v":4},{"$f":"COUNTIF($B23:$AF23,$AJ$10)","v":4},0,0,0,0,0,0,null,31,{"$f":"DAY(EOMONTH(DATE(AN_1,MONTH(B21),1),0))","v":31}]
[null,{"$f":"CHOOSE(WEEKDAY(B25,2),\"Lu\",\"Ma\",\"Me\",\"Je\",\"Ve\",\"Sa\",\"Di\")","v":"Sa"},{"$f":"CHOOSE(WEEKDAY(C25,2),\"Lu\",\"Ma\",\"Me\",\"Je\",\"Ve\",\"Sa\",\"Di\")","v":"Di"},"Lu","Ma","Me","Je","Ve","Sa","Di","Lu","Ma","Me","Je","Ve","Sa","Di","Lu","Ma","Me","Je","Ve","Sa","Di","Lu","Ma","Me","Je","Ve",{"$f":"IF(AD25=0,0,CHOOSE(WEEKDAY(AD25,2),\"Lu\",\"Ma\",\"Me\",\"Je\",\"Ve\",\"Sa\",\"Di\"))","v":"Sa"},{"$f":"IF(AE25=0,0,CHOOSE(WEEKDAY(AE25,2),\"Lu\",\"Ma\",\"Me\",\"Je\",\"Ve\",\"Sa\",\"Di\"))","v":"Di"},{"$f":"IF(AF25=0,0,CHOOSE(WEEKDAY(AF25,2),\"Lu\",\"Ma\",\"Me\",\"Je\",\"Ve\",\"Sa\",\"Di\"))","v":0},null,null,null,null,null,null,null,0]
[null,{"$f":"VALUE(\"01/\"&INDIRECT(\"Fériés!h\"&COUNTA($A$11:A25)+1,1)&\"/\"&INDIRECT(\"Fériés!j\"&COUNTA($A$11:A25)+1,1))","v":45017},{"$f":"B25+1","v":45018},{"$f":"C25+1","v":45019},45020,45021,45022,45023,45024,45025,45026,45027,45028,45029,45030,45031,45032,45033,45034,45035,45036,45037,45038,45039,45040,45041,45042,45043,45044,{"$f":"IF(MONTH($AC25+1)=MONTH($B25)+1,0,$AC25+1)","v":45045},{"$f":"IF(MONTH(AC25+2)=MONTH(B25)+1,0,AC25+2)","v":45046},{"$f":"IF(MONTH($AC25+3)=MONTH($B25)+1,0,$AC25+3)","v":0},null,null,null,null,null,null,null,0]
[null,{"$f":"IF(AND(ISERROR(VLOOKUP(B25,liste_fériés,1,FALSE)),OR(B24=\"Sa\",B24=\"Di\")),B24,IF(ISERROR(VLOOKUP(B25,liste_fériés,1,FALSE)),\"T\",\"F\"))","v":"Sa"},"Di","T","T","T","T","T","Sa","F","F","T","T","T","T","Sa","Di","T","T","T","T","T","Sa","Di","T","T","T","T","T",{"$f":"IF(AD25=0,0,IF(AND(ISERROR(VLOOKUP(AD25,liste_fériés,1,FALSE)),OR(AD24=\"Sa\",AD24=\"Di\")),AD24,IF(ISERROR(VLOOKUP(AD25,liste_fériés,1,FALSE)),\"T\",\"F\")))","v":"Sa"},{"$f":"IF(AE25=0,0,IF(AND(ISERROR(VLOOKUP(AE25,liste_fériés,1,FALSE)),OR(AE24=\"Sa\",AE24=\"Di\")),AE24,IF(ISERROR(VLOOKUP(AE25,liste_fériés,1,FALSE)),\"T\",\"F\")))","v":"Di"},{"$f":"IF(AF25=0,0,IF(AND(ISERROR(VLOOKUP(AF25,liste_fériés,1,FALSE)),OR(AF24=\"Sa\",AF24=\"Di\")),AF24,IF(ISERROR(VLOOKUP(AF25,liste_fériés,1,FALSE)),\"T\",\"F\")))","v":0},null,null,null,null,null,null,null,0]
[{"$f":"CHOOSE(MONTH(B25),\"JAN\",\"FEV\",\"MAR\",\"AVR\",\"MAI\",\"JUN\",\"JUL\",\"AOU\",\"SEP\",\"OCT\",\"NOV\",\"DEC\")","v":"AVR"},"Sa","Di","T","T","T","T","T","Sa","F","F","T","T","RTT","T","Sa","Di","T","T","T","T","T","Sa","Di","T","T","T","T","T","Sa","Di",null,null,{"$f":"COUNTIF($B27:$AF27,$AH$10)+COUNTIF($B27:$AF27,$AH$9)*0.5+COUNTIF($B27:$AF27,$AN$9)*0.5++COUNTIF($B27:$AF27,$AP$9)*0.5","v":18},{"$f":"COUNTIF($B27:$AF27,$AI$10)","v":5},{"$f":"COUNTIF($B27:$AF27,$AJ$10)","v":4},2,0,0,1,0,0,null,30,{"$f":"DAY(EOMONTH(DATE(AN_1,MONTH(B25),1),0))","v":30}]
[null,{"$f":"CHOOSE(WEEKDAY(B29,2),\"Lu\",\"Ma\",\"Me\",\"Je\",\"Ve\",\"Sa\",\"Di\")","v":"Lu"},{"$f":"CHOOSE(WEEKDAY(C29,2),\"Lu\",\"Ma\",\"Me\",\"Je\",\"Ve\",\"Sa\",\"Di\")","v":"Ma"},"Me","Je","Ve","Sa","Di","Lu","Ma","Me","Je","Ve","Sa","Di","Lu","Ma","Me","Je","Ve","Sa","Di","Lu","Ma","Me","Je","Ve","Sa","Di",{"$f":"IF(AD29=0,0,CHOOSE(WEEKDAY(AD29,2),\"Lu\",\"Ma\",\"Me\",\"Je\",\"Ve\",\"Sa\",\"Di\"))","v":"Lu"},{"$f":"IF(AE29=0,0,CHOOSE(WEEKDAY(AE29,2),\"Lu\",\"Ma\",\"Me\",\"Je\",\"Ve\",\"Sa\",\"Di\"))","v":"Ma"},{"$f":"IF(AF29=0,0,CHOOSE(WEEKDAY(AF29,2),\"Lu\",\"Ma\",\"Me\",\"Je\",\"Ve\",\"Sa\",\"Di\"))","v":"Me"},null,null,null,null,null,null,null,0]
[null,{"$f":"VALUE(\"01/\"&INDIRECT(\"Fériés!h\"&COUNTA($A$11:A29)+1,1)&\"/\"&INDIRECT(\"Fériés!j\"&COUNTA($A$11:A29)+1,1))","v":45047},{"$f":"B29+1","v":45048},{"$f":"C29+1","v":45049},45050,45051,45052,45053,45054,45055,45056,45057,45058,45059,45060,45061,45062,45063,45064,45065,45066,45067,45068,45069,45070,45071,45072,45073,45074,{"$f":"IF(MONTH($AC29+1)=MONTH($B29)+1,0,$AC29+1)","v":45075},{"$f":"IF(MONTH(AC29+2)=MONTH(B29)+1,0,AC29+2)","v":45076},{"$f":"IF(MONTH($AC29+3)=MONTH($B29)+1,0,$AC29+3)","v":45077},null,null,null,null,null,null,null,0]
[null,{"$f":"IF(AND(ISERROR(VLOOKUP(B29,liste_fériés,1,FALSE)),OR(B28=\"Sa\",B28=\"Di\")),B28,IF(ISERROR(VLOOKUP(B29,liste_fériés,1,FALSE)),\"T\",\"F\"))","v":"F"},"T","T","T","T","Sa","Di","F","T","T","T","T","Sa","Di","T","T","T","F","T","Sa","Di","T","T","T","T","T","Sa","F",{"$f":"IF(AD29=0,0,IF(AND(ISERROR(VLOOKUP(AD29,liste_fériés,1,FALSE)),OR(AD28=\"Sa\",AD28=\"Di\")),AD28,IF(ISERROR(VLOOKUP(AD29,liste_fériés,1,FALSE)),\"T\",\"F\")))","v":"T"},{"$f":"IF(AE29=0,0,IF(AND(ISERROR(VLOOKUP(AE29,liste_fériés,1,FALSE)),OR(AE28=\"Sa\",AE28=\"Di\")),AE28,IF(ISERROR(VLOOKUP(AE29,liste_fériés,1,FALSE)),\"T\",\"F\")))","v":"T"},{"$f":"IF(AF29=0,0,IF(AND(ISERROR(VLOOKUP(AF29,liste_fériés,1,FALSE)),OR(AF28=\"Sa\",AF28=\"Di\")),AF28,IF(ISERROR(VLOOKUP(AF29,liste_fériés,1,FALSE)),\"T\",\"F\")))","v":"T"},null,null,null,null,null,null,null,0]
[{"$f":"CHOOSE(MONTH(B29),\"JAN\",\"FEV\",\"MAR\",\"AVR\",\"MAI\",\"JUN\",\"JUL\",\"AOU\",\"SEP\",\"OCT\",\"NOV\",\"DEC\")","v":"MAI"},"F","T","T","T","T","Sa","Di","F","T","T","T","T","Sa","Di","T","T","T","F","CA","Sa","Di","T","T","T","T","T","Sa","F","T","T","T",null,{"$f":"COUNTIF($B31:$AF31,$AH$10)+COUNTIF($B31:$AF31,$AH$9)*0.5+COUNTIF($B31:$AF31,$AN$9)*0.5++COUNTIF($B31:$AF31,$AP$9)*0.5","v":19},{"$f":"COUNTIF($B31:$AF31,$AI$10)","v":4},{"$f":"COUNTIF($B31:$AF31,$AJ$10)","v":3},4,1,0,0,0,0,null,31,{"$f":"DAY(EOMONTH(DATE(AN_1,MONTH(B29),1),0))","v":31}]
[null,{"$f":"CHOOSE(WEEKDAY(B33,2),\"Lu\",\"Ma\",\"Me\",\"Je\",\"Ve\",\"Sa\",\"Di\")","v":"Je"},{"$f":"CHOOSE(WEEKDAY(C33,2),\"Lu\",\"Ma\",\"Me\",\"Je\",\"Ve\",\"Sa\",\"Di\")","v":"Ve"},"Sa","Di","Lu","Ma","Me","Je","Ve","Sa","Di","Lu","Ma","Me","Je","Ve","Sa","Di","Lu","Ma","Me","Je","Ve","Sa","Di","Lu","Ma","Me",{"$f":"IF(AD33=0,0,CHOOSE(WEEKDAY(AD33,2),\"Lu\",\"Ma\",\"Me\",\"Je\",\"Ve\",\"Sa\",\"Di\"))","v":"Je"},{"$f":"IF(AE33=0,0,CHOOSE(WEEKDAY(AE33,2),\"Lu\",\"Ma\",\"Me\",\"Je\",\"Ve\",\"Sa\",\"Di\"))","v":"Ve"},{"$f":"IF(AF33=0,0,CHOOSE(WEEKDAY(AF33,2),\"Lu\",\"Ma\",\"Me\",\"Je\",\"Ve\",\"Sa\",\"Di\"))","v":0},null,null,null,null,null,null,null,0]
[null,{"$f":"VALUE(\"01/\"&INDIRECT(\"Fériés!h\"&COUNTA($A$11:A33)+1,1)&\"/\"&INDIRECT(\"Fériés!j\"&COUNTA($A$11:A33)+1,1))","v":45078},{"$f":"B33+1","v":45079},{"$f":"C33+1","v":45080},45081,45082,45083,45084,45085,45086,45087,45088,45089,45090,45091,45092,45093,45094,45095,45096,45097,45098,45099,45100,45101,45102,45103,45104,45105,{"$f":"IF(MONTH($AC33+1)=MONTH($B33)+1,0,$AC33+1)","v":45106},{"$f":"IF(MONTH(AC33+2)=MONTH(B33)+1,0,AC33+2)","v":45107},{"$f":"IF(MONTH($AC33+3)=MONTH($B33)+1,0,$AC33+3)","v":0},null,null,null,null,null,null,null,0]
[null,{"$f":"IF(AND(ISERROR(VLOOKUP(B33,liste_fériés,1,FALSE)),OR(B32=\"Sa\",B32=\"Di\")),B32,IF(ISERROR(VLOOKUP(B33,liste_fériés,1,FALSE)),\"T\",\"F\"))","v":"T"},"T","Sa","Di","T","T","T","T","T","Sa","Di","T","T","T","T","T","Sa","Di","T","T","T","T","T","Sa","Di","T","T","T",{"$f":"IF(AD33=0,0,IF(AND(ISERROR(VLOOKUP(AD33,liste_fériés,1,FALSE)),OR(AD32=\"Sa\",AD32=\"Di\")),AD32,IF(ISERROR(VLOOKUP(AD33,liste_fériés,1,FALSE)),\"T\",\"F\")))","v":"T"},{"$f":"IF(AE33=0,0,IF(AND(ISERROR(VLOOKUP(AE33,liste_fériés,1,FALSE)),OR(AE32=\"Sa\",AE32=\"Di\")),AE32,IF(ISERROR(VLOOKUP(AE33,liste_fériés,1,FALSE)),\"T\",\"F\")))","v":"T"},{"$f":"IF(AF33=0,0,IF(AND(ISERROR(VLOOKUP(AF33,liste_fériés,1,FALSE)),OR(AF32=\"Sa\",AF32=\"Di\")),AF32,IF(ISERROR(VLOOKUP(AF33,liste_fériés,1,FALSE)),\"T\",\"F\")))","v":0},null,null,null,null,null,null,null,0]
[{"$f":"CHOOSE(MONTH(B33),\"JAN\",\"FEV\",\"MAR\",\"AVR\",\"MAI\",\"JUN\",\"JUL\",\"AOU\",\"SEP\",\"OCT\",\"NOV\",\"DEC\")","v":"JUN"},"T","T","Sa","Di","T","T","T","T","T","Sa","Di","T","T","T","T","T","Sa","Di","T","T","T","T","T","Sa","Di","T","T","T","T","T",null,null,{"$f":"COUNTIF($B35:$AF35,$AH$10)+COUNTIF($B35:$AF35,$AH$9)*0.5+COUNTIF($B35:$AF35,$AN$9)*0.5++COUNTIF($B35:$AF35,$AP$9)*0.5","v":22},{"$f":"COUNTIF($B35:$AF35,$AI$10)","v":4},{"$f":"COUNTIF($B35:$AF35,$AJ$10)","v":4},0,0,0,0,0,0,null,30,{"$f":"DAY(EOMONTH(DATE(AN_1,MONTH(B33),1),0))","v":30}]
[null,{"$f":"CHOOSE(WEEKDAY(B37,2),\"Lu\",\"Ma\",\"Me\",\"Je\",\"Ve\",\"Sa\",\"Di\")","v":"Sa"},{"$f":"CHOOSE(WEEKDAY(C37,2),\"Lu\",\"Ma\",\"Me\",\"Je\",\"Ve\",\"Sa\",\"Di\")","v":"Di"},"Lu","Ma","Me","Je","Ve","Sa","Di","Lu","Ma","Me","Je","Ve","Sa","Di","Lu","Ma","Me","Je","Ve","Sa","Di","Lu","Ma","Me","Je","Ve",{"$f":"IF(AD37=0,0,CHOOSE(WEEKDAY(AD37,2),\"Lu\",\"Ma\",\"Me\",\"Je\",\"Ve\",\"Sa\",\"Di\"))","v":"Sa"},{"$f":"IF(AE37=0,0,CHOOSE(WEEKDAY(AE37,2),\"Lu\",\"Ma\",\"Me\",\"Je\",\"Ve\",\"Sa\",\"Di\"))","v":"Di"},{"$f":"IF(AF37=0,0,CHOOSE(WEEKDAY(AF37,2),\"Lu\",\"Ma\",\"Me\",\"Je\",\"Ve\",\"Sa\",\"Di\"))","v":"Lu"}]
[null,{"$f":"VALUE(\"01/\"&INDIRECT(\"Fériés!h\"&COUNTA($A$11:A37)+1,1)&\"/\"&INDIRECT(\"Fériés!j\"&COUNTA($A$11:A37)+1,1))","v":45108},{"$f":"B37+1","v":45109},{"$f":"C37+1","v":45110},45111,45112,45113,45114,45115,45116,45117,45118,45119,45120,45121,45122,45123,45124,45125,45126,45127,45128,45129,45130,45131,45132,45133,45134,45135,{"$f":"IF(MONTH($AC37+1)=MONTH($B37)+1,0,$AC37+1)","v":45136},{"$f":"IF(MONTH(AC37+2)=MONTH(B37)+1,0,AC37+2)","v":45137},{"$f":"IF(MONTH($AC37+3)=MONTH($B37)+1,0,$AC37+3)","v":45138}]
[null,{"$f":"IF(AND(ISERROR(VLOOKUP(B37,liste_fériés,1,FALSE)),OR(B36=\"Sa\",B36=\"Di\")),B36,IF(ISERROR(VLOOKUP(B37,liste_fériés,1,FALSE)),\"T\",\"F\"))","v":"Sa"},"Di","T","T","T","T","T","Sa","Di","T","T","T","T","F","Sa","Di","T","T","T","T","T","Sa","Di","T","T","T","T","T",{"$f":"IF(AD37=0,0,IF(AND(ISERROR(VLOOKUP(AD37,liste_fériés,1,FALSE)),OR(AD36=\"Sa\",AD36=\"Di\")),AD36,IF(ISERROR(VLOOKUP(AD37,liste_fériés,1,FALSE)),\"T\",\"F\")))","v":"Sa"},{"$f":"IF(AE37=0,0,IF(AND(ISERROR(VLOOKUP(AE37,liste_fériés,1,FALSE)),OR(AE36=\"Sa\",AE36=\"Di\")),AE36,IF(ISERROR(VLOOKUP(AE37,liste_fériés,1,FALSE)),\"T\",\"F\")))","v":"Di"},{"$f":"IF(AF37=0,0,IF(AND(ISERROR(VLOOKUP(AF37,liste_fériés,1,FALSE)),OR(AF36=\"Sa\",AF36=\"Di\")),AF36,IF(ISERROR(VLOOKUP(AF37,liste_fériés,1,FALSE)),\"T\",\"F\")))","v":"T"}]
[{"$f":"CHOOSE(MONTH(B37),\"JAN\",\"FEV\",\"MAR\",\"AVR\",\"MAI\",\"JUN\",\"JUL\",\"AOU\",\"SEP\",\"OCT\",\"NOV\",\"DEC\")","v":"JUL"},"Sa","Di","T","T","T","T","T","Sa","Di","T","T","T","T","F","Sa","Di","T","T","T","T","T","Sa","Di","T","T","T","T","T","Sa","Di","CA",null,{"$f":"COUNTIF($B39:$AF39,$AH$10)+COUNTIF($B39:$AF39,$AH$9)*0.5+COUNTIF($B39:$AF39,$AN$9)*0.5++COUNTIF($B39:$AF39,$AP$9)*0.5","v":19},{"$f":"COUNTIF($B39:$AF39,$AI$10)","v":5},{"$f":"COUNTIF($B39:$AF39,$AJ$10)","v":5},1,1,0,0,0,0,null,31,{"$f":"DAY(EOMONTH(DATE(AN_1,MONTH(B37),1),0))","v":31}]
[null,{"$f":"CHOOSE(WEEKDAY(B41,2),\"Lu\",\"Ma\",\"Me\",\"Je\",\"Ve\",\"Sa\",\"Di\")","v":"Ma"},{"$f":"CHOOSE(WEEKDAY(C41,2),\"Lu\",\"Ma\",\"Me\",\"Je\",\"Ve\",\"Sa\",\"Di\")","v":"Me"},"Je","Ve","Sa","Di","Lu","Ma","Me","Je","Ve","Sa","Di","Lu","Ma","Me","Je","Ve","Sa","Di","Lu","Ma","Me","Je","Ve","Sa","Di","Lu",{"$f":"IF(AD41=0,0,CHOOSE(WEEKDAY(AD41,2),\"Lu\",\"Ma\",\"Me\",\"Je\",\"Ve\",\"Sa\",\"Di\"))","v":"Ma"},{"$f":"IF(AE41=0,0,CHOOSE(WEEKDAY(AE41,2),\"Lu\",\"Ma\",\"Me\",\"Je\",\"Ve\",\"Sa\",\"Di\"))","v":"Me"},{"$f":"IF(AF41=0,0,CHOOSE(WEEKDAY(AF41,2),\"Lu\",\"Ma\",\"Me\",\"Je\",\"Ve\",\"Sa\",\"Di\"))","v":"Je"}]
[null,{"$f":"VALUE(\"01/\"&INDIRECT(\"Fériés!h\"&COUNTA($A$11:A41)+1,1)&\"/\"&INDIRECT(\"Fériés!j\"&COUNTA($A$11:A41)+1,1))","v":45139},{"$f":"B41+1","v":45140},{"$f":"C41+1","v":45141},45142,45143,45144,45145,45146,45147,45148,45149,45150,45151,45152,45153,45154,45155,45156,45157,45158,45159,45160,45161,45162,45163,45164,45165,45166,{"$f":"IF(MONTH($AC41+1)=MONTH($B41)+1,0,$AC41+1)","v":45167},{"$f":"IF(MONTH(AC41+2)=MONTH(B41)+1,0,AC41+2)","v":45168},{"$f":"IF(MONTH($AC41+3)=MONTH($B41)+1,0,$AC41+3)","v":45169}]
[null,{"$f":"IF(AND(ISERROR(VLOOKUP(B41,liste_fériés,1,FALSE)),OR(B40=\"Sa\",B40=\"Di\")),B40,IF(ISERROR(VLOOKUP(B41,liste_fériés,1,FALSE)),\"T\",\"F\"))","v":"T"},"T","T","T","Sa","Di","T","T","T","T","T","Sa","Di","T","F","T","T","T","Sa","Di","T","T","T","T","T","Sa","Di","T",{"$f":"IF(AD41=0,0,IF(AND(ISERROR(VLOOKUP(AD41,liste_fériés,1,FALSE)),OR(AD40=\"Sa\",AD40=\"Di\")),AD40,IF(ISERROR(VLOOKUP(AD41,liste_fériés,1,FALSE)),\"T\",\"F\")))","v":"T"},{"$f":"IF(AE41=0,0,IF(AND(ISERROR(VLOOKUP(AE41,liste_fériés,1,FALSE)),OR(AE40=\"Sa\",AE40=\"Di\")),AE40,IF(ISERROR(VLOOKUP(AE41,liste_fériés,1,FALSE)),\"T\",\"F\")))","v":"T"},{"$f":"IF(AF41=0,0,IF(AND(ISERROR(VLOOKUP(AF41,liste_fériés,1,FALSE)),OR(AF40=\"Sa\",AF40=\"Di\")),AF40,IF(ISERROR(VLOOKUP(AF41,liste_fériés,1,FALSE)),\"T\",\"F\")))","v":"T"}]
[{"$f":"CHOOSE(MONTH(B41),\"JAN\",\"FEV\",\"MAR\",\"AVR\",\"MAI\",\"JUN\",\"JUL\",\"AOU\",\"SEP\",\"OCT\",\"NOV\",\"DEC\")","v":"AOU"},"CA","CA","CA","CA","Sa","Di","CA","CA","CA","CA","CA","Sa","Di","CA","F","CA","CA","CA","Sa","Di","CA","CA","CA","CA","CA","Sa","Di","T","T","T","T",null,{"$f":"COUNTIF($B43:$AF43,$AH$10)+COUNTIF($B43:$AF43,$AH$9)*0.5+COUNTIF($B43:$AF43,$AN$9)*0.5++COUNTIF($B43:$AF43,$AP$9)*0.5","v":4},{"$f":"COUNTIF($B43:$AF43,$AI$10)","v":4},{"$f":"COUNTIF($B43:$AF43,$AJ$10)","v":4},1,18,0,0,0,0,null,31,{"$f":"DAY(EOMONTH(DATE(AN_1,MONTH(B41),1),0))","v":31}]
[null,{"$f":"CHOOSE(WEEKDAY(B45,2),\"Lu\",\"Ma\",\"Me\",\"Je\",\"Ve\",\"Sa\",\"Di\")","v":"Ve"},{"$f":"CHOOSE(WEEKDAY(C45,2),\"Lu\",\"Ma\",\"Me\",\"Je\",\"Ve\",\"Sa\",\"Di\")","v":"Sa"},"Di","Lu","Ma","Me","Je","Ve","Sa","Di","Lu","Ma","Me","Je","Ve","Sa","Di","Lu","Ma","Me","Je","Ve","Sa","Di","Lu","Ma","Me","Je",{"$f":"IF(AD45=0,0,CHOOSE(WEEKDAY(AD45,2),\"Lu\",\"Ma\",\"Me\",\"Je\",\"Ve\",\"Sa\",\"Di\"))","v":"Ve"},"Sa",{"$f":"IF(AF45=0,0,CHOOSE(WEEKDAY(AF45,2),\"Lu\",\"Ma\",\"Me\",\"Je\",\"Ve\",\"Sa\",\"Di\"))","v":0}]
[null,{"$f":"VALUE(\"01/\"&INDIRECT(\"Fériés!h\"&COUNTA($A$11:A45)+1,1)&\"/\"&INDIRECT(\"Fériés!j\"&COUNTA($A$11:A45)+1,1))","v":45170},{"$f":"B45+1","v":45171},{"$f":"C45+1","v":45172},45173,45174,45175,45176,45177,45178,45179,45180,45181,45182,45183,45184,45185,45186,45187,45188,45189,45190,45191,45192,45193,45194,45195,45196,45197,{"$f":"IF(MONTH($AC45+1)=MONTH($B45)+1,0,$AC45+1)","v":45198},{"$f":"IF(MONTH(AC45+2)=MONTH(B45)+1,0,AC45+2)","v":45199},{"$f":"IF(MONTH($AC45+3)=MONTH($B45)+1,0,$AC45+3)","v":0}]
[null,{"$f":"IF(AND(ISERROR(VLOOKUP(B45,liste_fériés,1,FALSE)),OR(B44=\"Sa\",B44=\"Di\")),B44,IF(ISERROR(VLOOKUP(B45,liste_fériés,1,FALSE)),\"T\",\"F\"))","v":"T"},"Sa","Di","T","T","T","T","T","Sa","Di","T","T","T","T","T","Sa","Di","T","T","T","T","T","Sa","Di","T","T","T","T",{"$f":"IF(AD45=0,0,IF(AND(ISERROR(VLOOKUP(AD45,liste_fériés,1,FALSE)),OR(AD44=\"Sa\",AD44=\"Di\")),AD44,IF(ISERROR(VLOOKUP(AD45,liste_fériés,1,FALSE)),\"T\",\"F\")))","v":"T"},{"$f":"IF(AE45=0,0,IF(AND(ISERROR(VLOOKUP(AE45,liste_fériés,1,FALSE)),OR(AE44=\"Sa\",AE44=\"Di\")),AE44,IF(ISERROR(VLOOKUP(AE45,liste_fériés,1,FALSE)),\"T\",\"F\")))","v":"Sa"},{"$f":"IF(AF45=0,0,IF(AND(ISERROR(VLOOKUP(AF45,liste_fériés,1,FALSE)),OR(AF44=\"Sa\",AF44=\"Di\")),AF44,IF(ISERROR(VLOOKUP(AF45,liste_fériés,1,FALSE)),\"T\",\"F\")))","v":0}]
[{"$f":"CHOOSE(MONTH(B45),\"JAN\",\"FEV\",\"MAR\",\"AVR\",\"MAI\",\"JUN\",\"JUL\",\"AOU\",\"SEP\",\"OCT\",\"NOV\",\"DEC\")","v":"SEP"},"T","Sa","Di","T","T","T","T","T","Sa","Di","T","T","T","T","T","Sa","Di","T","T","T","T","T","Sa","Di","T","T","RTT","T","T","Sa",null,null,{"$f":"COUNTIF($B47:$AF47,$AH$10)+COUNTIF($B47:$AF47,$AH$9)*0.5+COUNTIF($B47:$AF47,$AN$9)*0.5++COUNTIF($B47:$AF47,$AP$9)*0.5","v":20},{"$f":"COUNTIF($B47:$AF47,$AI$10)","v":5},{"$f":"COUNTIF($B47:$AF47,$AJ$10)","v":4},0,0,0,1,0,0,null,30,{"$f":"DAY(EOMONTH(DATE(AN_1,MONTH(B45),1),0))","v":30}]
[null,{"$f":"CHOOSE(WEEKDAY(B49,2),\"Lu\",\"Ma\",\"Me\",\"Je\",\"Ve\",\"Sa\",\"Di\")","v":"Di"},{"$f":"CHOOSE(WEEKDAY(C49,2),\"Lu\",\"Ma\",\"Me\",\"Je\",\"Ve\",\"Sa\",\"Di\")","v":"Lu"},"Ma","Me","Je","Ve","Sa","Di","Lu","Ma","Me","Je","Ve","Sa","Di","Lu","Ma","Me","Je","Ve","Sa","Di","Lu","Ma","Me","Je","Ve","Sa",{"$f":"IF(AD49=0,0,CHOOSE(WEEKDAY(AD49,2),\"Lu\",\"Ma\",\"Me\",\"Je\",\"Ve\",\"Sa\",\"Di\"))","v":"Di"},{"$f":"IF(AE49=0,0,CHOOSE(WEEKDAY(AE49,2),\"Lu\",\"Ma\",\"Me\",\"Je\",\"Ve\",\"Sa\",\"Di\"))","v":"Lu"},{"$f":"IF(AF49=0,0,CHOOSE(WEEKDAY(AF49,2),\"Lu\",\"Ma\",\"Me\",\"Je\",\"Ve\",\"Sa\",\"Di\"))","v":"Ma"}]
[null,{"$f":"VALUE(\"01/\"&INDIRECT(\"Fériés!h\"&COUNTA($A$11:A49)+1,1)&\"/\"&INDIRECT(\"Fériés!j\"&COUNTA($A$11:A49)+1,1))","v":45200},{"$f":"B49+1","v":45201},{"$f":"C49+1","v":45202},45203,45204,45205,45206,45207,45208,45209,45210,45211,45212,45213,45214,45215,45216,45217,45218,45219,45220,45221,45222,45223,45224,45225,45226,45227,{"$f":"IF(MONTH($AC49+1)=MONTH($B49)+1,0,$AC49+1)","v":45228},{"$f":"IF(MONTH(AC49+2)=MONTH(B49)+1,0,AC49+2)","v":45229},{"$f":"IF(MONTH($AC49+3)=MONTH($B49)+1,0,$AC49+3)","v":45230}]
[null,{"$f":"IF(AND(ISERROR(VLOOKUP(B49,liste_fériés,1,FALSE)),OR(B48=\"Sa\",B48=\"Di\")),B48,IF(ISERROR(VLOOKUP(B49,liste_fériés,1,FALSE)),\"T\",\"F\"))","v":"Di"},"T","T","T","T","T","Sa","Di","T","T","T","T","T","Sa","Di","T","T","T","T","T","Sa","Di","T","T","T","T","T","Sa",{"$f":"IF(AD49=0,0,IF(AND(ISERROR(VLOOKUP(AD49,liste_fériés,1,FALSE)),OR(AD48=\"Sa\",AD48=\"Di\")),AD48,IF(ISERROR(VLOOKUP(AD49,liste_fériés,1,FALSE)),\"T\",\"F\")))","v":"Di"},{"$f":"IF(AE49=0,0,IF(AND(ISERROR(VLOOKUP(AE49,liste_fériés,1,FALSE)),OR(AE48=\"Sa\",AE48=\"Di\")),AE48,IF(ISERROR(VLOOKUP(AE49,liste_fériés,1,FALSE)),\"T\",\"F\")))","v":"T"},{"$f":"IF(AF49=0,0,IF(AND(ISERROR(VLOOKUP(AF49,liste_fériés,1,FALSE)),OR(AF48=\"Sa\",AF48=\"Di\")),AF48,IF(ISERROR(VLOOKUP(AF49,liste_fériés,1,FALSE)),\"T\",\"F\")))","v":"T"}]
[{"$f":"CHOOSE(MONTH(B49),\"JAN\",\"FEV\",\"MAR\",\"AVR\",\"MAI\",\"JUN\",\"JUL\",\"AOU\",\"SEP\",\"OCT\",\"NOV\",\"DEC\")","v":"OCT"},"Di","T","T","T","T","T","Sa","Di","T","T","T","T","T","Sa","Di","T","T","RTT","T","T","Sa","Di","T","T","T","T","T","Sa","Di","T","T",null,{"$f":"COUNTIF($B51:$AF51,$AH$10)+COUNTIF($B51:$AF51,$AH$9)*0.5+COUNTIF($B51:$AF51,$AN$9)*0.5++COUNTIF($B51:$AF51,$AP$9)*0.5","v":21},{"$f":"COUNTIF($B51:$AF51,$AI$10)","v":4},{"$f":"COUNTIF($B51:$AF51,$AJ$10)","v":5},0,0,0,1,0,0,null,31,{"$f":"DAY(EOMONTH(DATE(AN_1,MONTH(B49),1),0))","v":31}]
[null,{"$f":"CHOOSE(WEEKDAY(B53,2),\"Lu\",\"Ma\",\"Me\",\"Je\",\"Ve\",\"Sa\",\"Di\")","v":"Me"},{"$f":"CHOOSE(WEEKDAY(C53,2),\"Lu\",\"Ma\",\"Me\",\"Je\",\"Ve\",\"Sa\",\"Di\")","v":"Je"},"Ve","Sa","Di","Lu","Ma","Me","Je","Ve","Sa","Di","Lu","Ma","Me","Je","Ve","Sa","Di","Lu","Ma","Me","Je","Ve","Sa","Di","Lu","Ma",{"$f":"IF(AD53=0,0,CHOOSE(WEEKDAY(AD53,2),\"Lu\",\"Ma\",\"Me\",\"Je\",\"Ve\",\"Sa\",\"Di\"))","v":"Me"},{"$f":"IF(AE53=0,0,CHOOSE(WEEKDAY(AE53,2),\"Lu\",\"Ma\",\"Me\",\"Je\",\"Ve\",\"Sa\",\"Di\"))","v":"Je"},{"$f":"IF(AF53=0,0,CHOOSE(WEEKDAY(AF53,2),\"Lu\",\"Ma\",\"Me\",\"Je\",\"Ve\",\"Sa\",\"Di\"))","v":0}]
[null,{"$f":"VALUE(\"01/\"&INDIRECT(\"Fériés!h\"&COUNTA($A$11:A53)+1,1)&\"/\"&INDIRECT(\"Fériés!j\"&COUNTA($A$11:A53)+1,1))","v":45231},{"$f":"B53+1","v":45232},{"$f":"C53+1","v":45233},45234,45235,45236,45237,45238,45239,45240,45241,45242,45243,45244,45245,45246,45247,45248,45249,45250,45251,45252,45253,45254,45255,45256,45257,45258,{"$f":"IF(MONTH($AC53+1)=MONTH($B53)+1,0,$AC53+1)","v":45259},{"$f":"IF(MONTH(AC53+2)=MONTH(B53)+1,0,AC53+2)","v":45260},{"$f":"IF(MONTH($AC53+3)=MONTH($B53)+1,0,$AC53+3)","v":0}]
[null,{"$f":"IF(AND(ISERROR(VLOOKUP(B53,liste_fériés,1,FALSE)),OR(B52=\"Sa\",B52=\"Di\")),B52,IF(ISERROR(VLOOKUP(B53,liste_fériés,1,FALSE)),\"T\",\"F\"))","v":"F"},"T","T","Sa","Di","T","T","T","T","T","F","Di","T","T","T","T","T","Sa","Di","T","T","T","T","T","Sa","Di","T","T",{"$f":"IF(AD53=0,0,IF(AND(ISERROR(VLOOKUP(AD53,liste_fériés,1,FALSE)),OR(AD52=\"Sa\",AD52=\"Di\")),AD52,IF(ISERROR(VLOOKUP(AD53,liste_fériés,1,FALSE)),\"T\",\"F\")))","v":"T"},{"$f":"IF(AE53=0,0,IF(AND(ISERROR(VLOOKUP(AE53,liste_fériés,1,FALSE)),OR(AE52=\"Sa\",AE52=\"Di\")),AE52,IF(ISERROR(VLOOKUP(AE53,liste_fériés,1,FALSE)),\"T\",\"F\")))","v":"T"},{"$f":"IF(AF53=0,0,IF(AND(ISERROR(VLOOKUP(AF53,liste_fériés,1,FALSE)),OR(AF52=\"Sa\",AF52=\"Di\")),AF52,IF(ISERROR(VLOOKUP(AF53,liste_fériés,1,FALSE)),\"T\",\"F\")))","v":0}]
[{"$f":"CHOOSE(MONTH(B53),\"JAN\",\"FEV\",\"MAR\",\"AVR\",\"MAI\",\"JUN\",\"JUL\",\"AOU\",\"SEP\",\"OCT\",\"NOV\",\"DEC\")","v":"NOV"},"F","T","T","Sa","Di","T","T","T","T","T","F","Di","T","T","T","T","T","Sa","Di","T","T","RTT","T","T","Sa","Di","T","T","T","T",null,null,{"$f":"COUNTIF($B55:$AF55,$AH$10)+COUNTIF($B55:$AF55,$AH$9)*0.5+COUNTIF($B55:$AF55,$AN$9)*0.5++COUNTIF($B55:$AF55,$AP$9)*0.5","v":20},{"$f":"COUNTIF($B55:$AF55,$AI$10)","v":3},{"$f":"COUNTIF($B55:$AF55,$AJ$10)","v":4},2,0,0,1,0,0,null,30,{"$f":"DAY(EOMONTH(DATE(AN_1,MONTH(B53),1),0))","v":30}]
[null,{"$f":"CHOOSE(WEEKDAY(B57,2),\"Lu\",\"Ma\",\"Me\",\"Je\",\"Ve\",\"Sa\",\"Di\")","v":"Ve"},{"$f":"CHOOSE(WEEKDAY(C57,2),\"Lu\",\"Ma\",\"Me\",\"Je\",\"Ve\",\"Sa\",\"Di\")","v":"Sa"},"Di","Lu","Ma","Me","Je","Ve","Sa","Di","Lu","Ma","Me","Je","Ve","Sa","Di","Lu","Ma","Me","Je","Ve","Sa","Di","Lu","Ma","Me","Je",{"$f":"IF(AD57=0,0,CHOOSE(WEEKDAY(AD57,2),\"Lu\",\"Ma\",\"Me\",\"Je\",\"Ve\",\"Sa\",\"Di\"))","v":"Ve"},{"$f":"IF(AE57=0,0,CHOOSE(WEEKDAY(AE57,2),\"Lu\",\"Ma\",\"Me\",\"Je\",\"Ve\",\"Sa\",\"Di\"))","v":"Sa"},{"$f":"IF(AF57=0,0,CHOOSE(WEEKDAY(AF57,2),\"Lu\",\"Ma\",\"Me\",\"Je\",\"Ve\",\"Sa\",\"Di\"))","v":"Di"}]
[null,{"$f":"VALUE(\"01/\"&INDIRECT(\"Fériés!h\"&COUNTA($A$11:A57)+1,1)&\"/\"&INDIRECT(\"Fériés!j\"&COUNTA($A$11:A57)+1,1))","v":45261},{"$f":"B57+1","v":45262},{"$f":"C57+1","v":45263},45264,45265,45266,45267,45268,45269,45270,45271,45272,45273,45274,45275,45276,45277,45278,45279,45280,45281,45282,45283,45284,45285,45286,45287,45288,{"$f":"IF(MONTH($AC57+1)=MONTH($B57)+1,0,$AC57+1)","v":45289},{"$f":"IF(MONTH(AC57+2)=MONTH(B57)+1,0,AC57+2)","v":45290},{"$f":"IF(MONTH($AC57+3)=MONTH($B57)+1,0,$AC57+3)","v":45291}]
[null,{"$f":"IF(AND(ISERROR(VLOOKUP(B57,liste_fériés,1,FALSE)),OR(B56=\"Sa\",B56=\"Di\")),B56,IF(ISERROR(VLOOKUP(B57,liste_fériés,1,FALSE)),\"T\",\"F\"))","v":"T"},"Sa","Di","T","T","T","T","T","Sa","Di","T","T","T","T","T","Sa","Di","T","T","T","T","T","Sa","Di","F","T","T","T",{"$f":"IF(AD57=0,0,IF(AND(ISERROR(VLOOKUP(AD57,liste_fériés,1,FALSE)),OR(AD56=\"Sa\",AD56=\"Di\")),AD56,IF(ISERROR(VLOOKUP(AD57,liste_fériés,1,FALSE)),\"T\",\"F\")))","v":"T"},{"$f":"IF(AE57=0,0,IF(AND(ISERROR(VLOOKUP(AE57,liste_fériés,1,FALSE)),OR(AE56=\"Sa\",AE56=\"Di\")),AE56,IF(ISERROR(VLOOKUP(AE57,liste_fériés,1,FALSE)),\"T\",\"F\")))","v":"Sa"},{"$f":"IF(AF57=0,0,IF(AND(ISERROR(VLOOKUP(AF57,liste_fériés,1,FALSE)),OR(AF56=\"Sa\",AF56=\"Di\")),AF56,IF(ISERROR(VLOOKUP(AF57,liste_fériés,1,FALSE)),\"T\",\"F\")))","v":"Di"}]
[{"$f":"CHOOSE(MONTH(B57),\"JAN\",\"FEV\",\"MAR\",\"AVR\",\"MAI\",\"JUN\",\"JUL\",\"AOU\",\"SEP\",\"OCT\",\"NOV\",\"DEC\")","v":"DEC"},"T","Sa","Di","T","T","T","T","T","Sa","Di","T","T","T","T","T","Sa","Di","T","RTT","T","T","CA","Sa","Di","F","CA","CA","CA","CA","Sa","Di",null,{"$f":"COUNTIF($B59:$AF59,$AH$10)+COUNTIF($B59:$AF59,$AH$9)*0.5+COUNTIF($B59:$AF59,$AN$9)*0.5++COUNTIF($B59:$AF59,$AP$9)*0.5","v":14},{"$f":"COUNTIF($B59:$AF59,$AI$10)","v":5},{"$f":"COUNTIF($B59:$AF59,$AJ$10)","v":5},1,5,0,1,0,0,null,31,{"$f":"DAY(EOMONTH(DATE(AN_1,MONTH(B57),1),0))","v":31}]

{"sheet":"Feuil2","index":1,"n_rows":255,"n_cols":1,"rows_kept":255,"cut":false,"hidden":false,"merged":[]}
[{"$f":"CHAR(ROW())","v":"\u0001"}]
[{"$f":"CHAR(ROW())","v":"\u0002"}]
["\u0003"]
["\u0004"]
["\u0005"]
["\u0006"]
["\u0007"]
["\b"]
["\t"]
["\n"]
["\u000b"]
["\f"]
["\r"]
["\u000e"]
["\u000f"]
["\u0010"]
["\u0011"]
["\u0012"]
["\u0013"]
["\u0014"]
["\u0015"]
["\u0016"]
["\u0017"]
["\u0018"]
["\u0019"]
["\u001a"]
["\u001b"]
["\u001c"]
["\u001d"]
["\u001e"]
["\u001f"]
[" "]
["!"]
["\""]
["#"]
["$"]
["%"]
["&"]
["'"]
["("]
[")"]
["*"]
["+"]
[","]
["-"]
["."]
["/"]
["0"]
["1"]
["2"]
["3"]
["4"]
["5"]
["6"]
["7"]
["8"]
["9"]
[":"]
[";"]
["<"]
["="]
[">"]
["?"]
["@"]
["A"]
[{"$f":"CHAR(ROW())","v":"B"}]
["C"]
["D"]
["E"]
["F"]
["G"]
["H"]
["I"]
["J"]
["K"]
["L"]
["M"]
["N"]
["O"]
["P"]
["Q"]
["R"]
["S"]
["T"]
["U"]
["V"]
["W"]
["X"]
["Y"]
["Z"]
["["]
["\\"]
["]"]
["^"]
["_"]
["`"]
["a"]
["b"]
["c"]
["d"]
["e"]
["f"]
["g"]
["h"]
["i"]
["j"]
["k"]
["l"]
["m"]
["n"]
["o"]
["p"]
["q"]
["r"]
["s"]
["t"]
["u"]
["v"]
["w"]
["x"]
["y"]
["z"]
["{"]
["|"]
["}"]
["~"]
["\u007f"]
["€"]
["\u0081"]
[{"$f":"CHAR(ROW())","v":"‚"}]
["ƒ"]
["„"]
["…"]
["†"]
["‡"]
["ˆ"]
["‰"]
["Š"]
["‹"]
["Œ"]
["\u008d"]
["Ž"]
["\u008f"]
["\u0090"]
["‘"]
["’"]
["“"]
["”"]
["•"]
["–"]
["—"]
["˜"]
["™"]
["š"]
["›"]
["œ"]
["\u009d"]
["ž"]
["Ÿ"]
[" "]
["¡"]
["¢"]
["£"]
["¤"]
["¥"]
["¦"]
["§"]
["¨"]
["©"]
["ª"]
["«"]
["¬"]
["­"]
["®"]
["¯"]
["°"]
["±"]
["²"]
["³"]
["´"]
["µ"]
["¶"]
["·"]
["¸"]
["¹"]
["º"]
["»"]
["¼"]
["½"]
["¾"]
["¿"]
["À"]
["Á"]
[{"$f":"CHAR(ROW())","v":"Â"}]
["Ã"]
["Ä"]
["Å"]
["Æ"]
["Ç"]
["È"]
["É"]
["Ê"]
["Ë"]
["Ì"]
["Í"]
["Î"]
["Ï"]
["Ð"]
["Ñ"]
["Ò"]
["Ó"]
["Ô"]
["Õ"]
["Ö"]
["×"]
["Ø"]
["Ù"]
["Ú"]
["Û"]
["Ü"]
["Ý"]
["Þ"]
["ß"]
["à"]
["á"]
["â"]
["ã"]
["ä"]
["å"]
["æ"]
["ç"]
["è"]
["é"]
["ê"]
["ë"]
["ì"]
["í"]
["î"]
["ï"]
["ð"]
["ñ"]
["ò"]
["ó"]
["ô"]
["õ"]
["ö"]
["÷"]
["ø"]
["ù"]
["ú"]
["û"]
["ü"]
["ý"]
["þ"]
["ÿ"]

{"sheet":"JAN","index":3,"n_rows":50,"n_cols":17,"rows_kept":50,"cut":false,"hidden":false,"merged":[]}
[null,{"$f":"RIGHT(CELL(\"nomfichier\",$A$1),3)","v":"JAN"},"FICHE DE SUIVI HORAIRE"]
[]
[null,"mois :","JANVIER",null,null,"année ",{"$f":"VLOOKUP(C3,Fériés!$I$1:$J$12,2,FALSE)","v":2023},null,null,"service",{"$f":"Calendrier!F4","v":"Administratif"}]
[]
[null,"nom :",{"$f":"Calendrier!F2","v":"Isq"},null,null," prénom ",{"$f":"Calendrier!F3","v":"Philippe"},null,null,"N° Ident",{"$f":"Calendrier!F1","v":"T506489"}]
[null,null,null,null,null,null,null,"à réaliser","cumul","en cours","reste",null,"N.cumul"]
[null,null,null,"Nb J",{"$f":"Calendrier!$AT11","v":218},{"$f":"$H$10","v":0},{"$f":"E7-F7","v":218},{"$f":"Calendrier!N1","v":365},null,{"$f":"SUM(J8:J15)","v":27.5},{"$f":"H7-(I7+J7)","v":337.5},null,{"$f":"SUM(M8:M15)","v":27.5},null,null,null,{"$f":"MAI!M7","v":147.5}]
[null,null,null,null,null,"1/2CA","CA",{"$f":"Calendrier!N5","v":25},null,{"$f":"COUNTIF($J$19:$J$49,G8)+COUNTIF($J$19:$J$49,F8)/2","v":0},{"$f":"+H8-(I8+J8)","v":25},"J",{"$f":"I8+J8","v":0},null,null,null,{"$f":"MAI!M8","v":1}]
[null,null,null,null,null,"1/2RTT","RTT",{"$f":"Calendrier!N8","v":9},null,{"$f":"COUNTIF($J$19:$J$49,G9)+COUNTIF($J$19:$J$49,F9)/2","v":0},{"$f":"+H9-(I9+J9)","v":9},"J",{"$f":"I9+J9","v":0},null,null,null,{"$f":"MAI!M9","v":3}]
[null,null,null,null,null,"1/2CS","CS",{"$f":"Calendrier!N9","v":0},null,0,{"$f":"H10-(I10+J10)","v":0},"J",0,null,null,null,{"$f":"MAI!M10","v":0}]
[null,null,null,null,null,"1/2CP","CP",{"$f":"Calendrier!N6","v":0},null,0,{"$f":"H11-(I11+J11)","v":0},"J",0,null,null,null,{"$f":"MAI!M11","v":0}]
[null,null,null,null,null,"1/2T","T",{"$f":"Calendrier!N7","v":218},null,18.5,{"$f":"H12-(I12+J12)","v":199.5},"J",18.5,null,null,null,{"$f":"MAI!M12","v":96.5}]
[null,null,null,null,null,0,"Sa",{"$f":"Calendrier!N4","v":51},null,{"$f":"COUNTIF($J$19:$J$49,G13)","v":4},{"$f":"+H13-(I13+J13)","v":47},"J",4,null,null,null,{"$f":"MAI!M13","v":21}]
[null,null,null,null,null,0,"Di",{"$f":"Calendrier!N3","v":50},null,{"$f":"COUNTIF($J$19:$J$49,G14)","v":4},{"$f":"+H14-(I14+J14)","v":46},"J",4,null,null,null,{"$f":"MAI!M14","v":19}]
[null,null,null,null,null,0,"F",{"$f":"Calendrier!N2","v":12},null,{"$f":"COUNTIF($J$19:$J$49,G15)","v":1},{"$f":"+H15-(I15+J15)","v":11},"J",1,null,null,null,{"$f":"MAI!M15","v":7}]
[null,null,null,null,null,null,"heure/avance fin mois",null,null,null,null,null,{"$f":"I50","v":1.75},"avec bon",null,null,{"$f":"MAI!M16","v":1.75}]
[null,"Prévu","Entrée","Sortie","Entrée","Sortie","total","variation","cumul","Type","nb J/T",null,"div. E/S","Sortie","Retour"]
[null,null,null,null,null,null,null,null,null,null,null,null,null,null,null,null,{"$f":"MAI!I50","v":1.75}]
[{"$f":"VALUE(\"01/01/\"&G3)","v":"2023-01-01"},{"$f":"INDIRECT(ADDRESS(MATCH($B$1,Calendrier!$A$15:$A$59,0)+14,ROW()-17,3,1,\"Calendrier\"),1)","v":"F"},null,null,null,null,{"$f":"IF(AND(C19<>0,D19<>0,E19<>0,F19<>0),F19-E19+D19-C19-K19-IF(E19-D19<Calendrier!$AT$10,Calendrier!$AT$10,0),IF(AND(C19<>0,D19<>0,E19=0,F19=0),D19-C19-K19,IF(AND(C19=0,D19=0,E19<>0,F19<>0),F19-E19-K19,IF(AND(C19>20,D19=0,E19=0,F19<>0),24-C19+F19-K19,IF(AND(C19<>0,D19=0,E19=0,F19<>0),F19-C19-K19,0)))))","v":0},{"$f":"IF(G19=0,0,IF(K19=0.5,0,G19-Calendrier!$AT$9))","v":0},{"$f":"I18+H19","v":0},{"$f":"IF(AND(COUNTA(C19:F19)=0,OR(B19=\"F\",WEEKDAY(A19,2)>5,B19=\"T\",B19=\"RTT\",B19=\"CA\")),B19,IF(AND(COUNTA(C19:F19)>=2,OR(B19=\"F\",B19=\"RTT\",B19=\"CA\",B19=\"Sa\",B19=\"Di\")),\"calendrier\",IF(AND(COUNTA(C19)+COUNTA(F19)=2,OR(COUNTA(C19:D19)<1,COUNTA(E19:F19)<1)),\"erreur\",IF(COUNTA(C19:F19)=3,\"en cours\",IF(COUNTA(C19:F19)=4,B19,IF(OR(AND(C19<>0,D19<>0),AND(E19<>0,F19<>0)),$F$12,IF(AND(C19<>0,D19=0,E19=0,F19<>0,WEEKDAY(A19,2)>5),\"calendrier\",IF(AND(C19<>0,D19=0,E19=0,F19<>0),$B19,\"\"))))))))","v":"F"},{"$f":"IF(COUNTA(C19:F19)=4,1,IF(OR(AND(C19<>0,D19<>0),AND(E19<>0,F19<>0)),0.5,IF(AND(C19<>0,F19<>0,D19=0,E19=0,B19=\"T\"),1,0)))","v":0},null,{"$f":"IF(OR(N19=0,O19=0),0,O19-N19)","v":0}]
[{"$f":"A19+1","v":"2023-01-02"},{"$f":"INDIRECT(ADDRESS(MATCH($B$1,Calendrier!$A$15:$A$59,0)+14,ROW()-17,3,1,\"Calendrier\"),1)","v":"T"},null,null,13,18,{"$f":"IF(AND(C20<>0,D20<>0,E20<>0,F20<>0),F20-E20+D20-C20-K20-IF(E20-D20<Calendrier!$AT$10,Calendrier!$AT$10,0),IF(AND(C20<>0,D20<>0,E20=0,F20=0),D20-C20-K20,IF(AND(C20=0,D20=0,E20<>0,F20<>0),F20-E20-K20,IF(AND(C20>20,D20=0,E20=0,F20<>0),24-C20+F20-K20,IF(AND(C20<>0,D20=0,E20=0,F20<>0),F20-C20-K20,0)))))","v":4.5},{"$f":"IF(G20=0,0,IF(K20=0.5,0,G20-Calendrier!$AT$9))","v":0},0,"1/2T",0.5,null,0]
[{"$f":"A20+1","v":"2023-01-03"},{"$f":"INDIRECT(ADDRESS(MATCH($B$1,Calendrier!$A$15:$A$59,0)+14,ROW()-17,3,1,\"Calendrier\"),1)","v":"T"},7,13,null,null,{"$f":"IF(AND(C21<>0,D21<>0,E21<>0,F21<>0),F21-E21+D21-C21-M21-IF(E21-D21<Calendrier!$AT$10,Calendrier!$AT$10,0),IF(AND(C21<>0,D21<>0,E21=0,F21=0),D21-C21-M21,IF(AND(C21=0,D21=0,E21<>0,F21<>0),F21-E21-M21,IF(AND(C21>20,D21=0,E21=0,F21<>0),24-C21+F21-M21,IF(AND(C21<>0,D21=0,E21=0,F21<>0),F21-C21-M21,0)))))","v":6},{"$f":"IF(G21=0,0,IF(K21=0.5,0,G21-Calendrier!$AT$9))","v":0},{"$f":"I20+H21","v":0},"1/2T",0.5,null,0]
["2023-01-04",{"$f":"INDIRECT(ADDRESS(MATCH($B$1,Calendrier!$A$15:$A$59,0)+14,ROW()-17,3,1,\"Calendrier\"),1)","v":"T"},null,null,null,null,{"$f":"IF(AND(C22<>0,D22<>0,E22<>0,F22<>0),F22-E22+D22-C22-M22-IF(E22-D22<Calendrier!$AT$10,Calendrier!$AT$10,0),IF(AND(C22<>0,D22<>0,E22=0,F22=0),D22-C22-M22,IF(AND(C22=0,D22=0,E22<>0,F22<>0),F22-E22-M22,IF(AND(C22>20,D22=0,E22=0,F22<>0),24-C22+F22-M22,IF(AND(C22<>0,D22=0,E22=0,F22<>0),F22-C22-M22,0)))))","v":0},{"$f":"IF(G22=0,0,IF(K22=0.5,0,G22-Calendrier!$AT$9))","v":0},0,"T",0,null,0]
["2023-01-05",{"$f":"INDIRECT(ADDRESS(MATCH($B$1,Calendrier!$A$15:$A$59,0)+14,ROW()-17,3,1,\"Calendrier\"),1)","v":"T"},null,null,null,null,{"$f":"IF(AND(C23<>0,D23<>0,E23<>0,F23<>0),F23-E23+D23-C23-M23-IF(E23-D23<Calendrier!$AT$10,Calendrier!$AT$10,0),IF(AND(C23<>0,D23<>0,E23=0,F23=0),D23-C23-M23,IF(AND(C23=0,D23=0,E23<>0,F23<>0),F23-E23-M23,IF(AND(C23>20,D23=0,E23=0,F23<>0),24-C23+F23-M23,IF(AND(C23<>0,D23=0,E23=0,F23<>0),F23-C23-M23,0)))))","v":0},{"$f":"IF(G23=0,0,IF(K23=0.5,0,G23-Calendrier!$AT$9))","v":0},0,"T",0,null,0]
["2023-01-06",{"$f":"INDIRECT(ADDRESS(MATCH($B$1,Calendrier!$A$15:$A$59,0)+14,ROW()-17,3,1,\"Calendrier\"),1)","v":"T"},null,null,null,null,{"$f":"IF(AND(C24<>0,D24<>0,E24<>0,F24<>0),F24-E24+D24-C24-M24-IF(E24-D24<Calendrier!$AT$10,Calendrier!$AT$10,0),IF(AND(C24<>0,D24<>0,E24=0,F24=0),D24-C24-M24,IF(AND(C24=0,D24=0,E24<>0,F24<>0),F24-E24-M24,IF(AND(C24>20,D24=0,E24=0,F24<>0),24-C24+F24-M24,IF(AND(C24<>0,D24=0,E24=0,F24<>0),F24-C24-M24,0)))))","v":0},{"$f":"IF(G24=0,0,IF(K24=0.5,0,G24-Calendrier!$AT$9))","v":0},0,"T",0,null,{"$f":"IF(OR(N24=0,O24=0),0,O24-N24)","v":0}]
["2023-01-07",{"$f":"INDIRECT(ADDRESS(MATCH($B$1,Calendrier!$A$15:$A$59,0)+14,ROW()-17,3,1,\"Calendrier\"),1)","v":"Sa"},null,null,null,null,{"$f":"IF(AND(C25<>0,D25<>0,E25<>0,F25<>0),F25-E25+D25-C25-M25-IF(E25-D25<Calendrier!$AT$10,Calendrier!$AT$10,0),IF(AND(C25<>0,D25<>0,E25=0,F25=0),D25-C25-M25,IF(AND(C25=0,D25=0,E25<>0,F25<>0),F25-E25-M25,IF(AND(C25>20,D25=0,E25=0,F25<>0),24-C25+F25-M25,IF(AND(C25<>0,D25=0,E25=0,F25<>0),F25-C25-M25,0)))))","v":0},{"$f":"IF(G25=0,0,IF(K25=0.5,0,G25-Calendrier!$AT$9))","v":0},0,"Sa",0,null,{"$f":"IF(OR(N25=0,O25=0),0,O25-N25)","v":0}]
["2023-01-08",{"$f":"INDIRECT(ADDRESS(MATCH($B$1,Calendrier!$A$15:$A$59,0)+14,ROW()-17,3,1,\"Calendrier\"),1)","v":"Di"},null,null,null,null,{"$f":"IF(AND(C26<>0,D26<>0,E26<>0,F26<>0),F26-E26+D26-C26-M26-IF(E26-D26<Calendrier!$AT$10,Calendrier!$AT$10,0),IF(AND(C26<>0,D26<>0,E26=0,F26=0),D26-C26-M26,IF(AND(C26=0,D26=0,E26<>0,F26<>0),F26-E26-M26,IF(AND(C26>20,D26=0,E26=0,F26<>0),24-C26+F26-M26,IF(AND(C26<>0,D26=0,E26=0,F26<>0),F26-C26-M26,0)))))","v":0},{"$f":"IF(G26=0,0,IF(K26=0.5,0,G26-Calendrier!$AT$9))","v":0},0,"Di",0,null,0]
["2023-01-09",{"$f":"INDIRECT(ADDRESS(MATCH($B$1,Calendrier!$A$15:$A$59,0)+14,ROW()-17,3,1,\"Calendrier\"),1)","v":"RTT"},8,12.5,13,17.25,{"$f":"IF(AND(C27<>0,D27<>0,E27<>0,F27<>0),F27-E27+D27-C27-M27-IF(E27-D27<Calendrier!$AT$10,Calendrier!$AT$10,0),IF(AND(C27<>0,D27<>0,E27=0,F27=0),D27-C27-M27,IF(AND(C27=0,D27=0,E27<>0,F27<>0),F27-E27-M27,IF(AND(C27>20,D27=0,E27=0,F27<>0),24-C27+F27-M27,IF(AND(C27<>0,D27=0,E27=0,F27<>0),F27-C27-M27,0)))))","v":8},{"$f":"IF(G27=0,0,IF(K27=0.5,0,G27-Calendrier!$AT$9))","v":0},0,"calendrier",1,null,0]
["2023-01-10",{"$f":"INDIRECT(ADDRESS(MATCH($B$1,Calendrier!$A$15:$A$59,0)+14,ROW()-17,3,1,\"Calendrier\"),1)","v":"T"},null,null,13,18,{"$f":"IF(AND(C28<>0,D28<>0,E28<>0,F28<>0),F28-E28+D28-C28-M28-IF(E28-D28<Calendrier!$AT$10,Calendrier!$AT$10,0),IF(AND(C28<>0,D28<>0,E28=0,F28=0),D28-C28-M28,IF(AND(C28=0,D28=0,E28<>0,F28<>0),F28-E28-M28,IF(AND(C28>20,D28=0,E28=0,F28<>0),24-C28+F28-M28,IF(AND(C28<>0,D28=0,E28=0,F28<>0),F28-C28-M28,0)))))","v":5},{"$f":"IF(G28=0,0,IF(K28=0.5,0,G28-Calendrier!$AT$9))","v":0},0,"1/2T",0.5,null,0]
["2023-01-11",{"$f":"INDIRECT(ADDRESS(MATCH($B$1,Calendrier!$A$15:$A$59,0)+14,ROW()-17,3,1,\"Calendrier\"),1)","v":"T"},5,null,null,13,{"$f":"IF(AND(C29<>0,D29<>0,E29<>0,F29<>0),F29-E29+D29-C29-M29-IF(E29-D29<Calendrier!$AT$10,Calendrier!$AT$10,0),IF(AND(C29<>0,D29<>0,E29=0,F29=0),D29-C29-M29,IF(AND(C29=0,D29=0,E29<>0,F29<>0),F29-E29-M29,IF(AND(C29>20,D29=0,E29=0,F29<>0),24-C29+F29-M29,IF(AND(C29<>0,D29=0,E29=0,F29<>0),F29-C29-M29,0)))))","v":8},{"$f":"IF(G29=0,0,IF(K29=0.5,0,G29-Calendrier!$AT$9))","v":0},0,"T",1,null,0]
["2023-01-12",{"$f":"INDIRECT(ADDRESS(MATCH($B$1,Calendrier!$A$15:$A$59,0)+14,ROW()-17,3,1,\"Calendrier\"),1)","v":"T"},null,null,null,null,{"$f":"IF(AND(C30<>0,D30<>0,E30<>0,F30<>0),F30-E30+D30-C30-M30-IF(E30-D30<Calendrier!$AT$10,Calendrier!$AT$10,0),IF(AND(C30<>0,D30<>0,E30=0,F30=0),D30-C30-M30,IF(AND(C30=0,D30=0,E30<>0,F30<>0),F30-E30-M30,IF(AND(C30>20,D30=0,E30=0,F30<>0),24-C30+F30-M30,IF(AND(C30<>0,D30=0,E30=0,F30<>0),F30-C30-M30,0)))))","v":0},{"$f":"IF(G30=0,0,IF(K30=0.5,0,G30-Calendrier!$AT$9))","v":0},0,"T",0,null,0]
["2023-01-13",{"$f":"INDIRECT(ADDRESS(MATCH($B$1,Calendrier!$A$15:$A$59,0)+14,ROW()-17,3,1,\"Calendrier\"),1)","v":"T"},13,null,null,21,{"$f":"IF(AND(C31<>0,D31<>0,E31<>0,F31<>0),F31-E31+D31-C31-M31-IF(E31-D31<Calendrier!$AT$10,Calendrier!$AT$10,0),IF(AND(C31<>0,D31<>0,E31=0,F31=0),D31-C31-M31,IF(AND(C31=0,D31=0,E31<>0,F31<>0),F31-E31-M31,IF(AND(C31>20,D31=0,E31=0,F31<>0),24-C31+F31-M31,IF(AND(C31<>0,D31=0,E31=0,F31<>0),F31-C31-M31,0)))))","v":8},{"$f":"IF(G31=0,0,IF(K31=0.5,0,G31-Calendrier!$AT$9))","v":0},0,"T",1,null,0]
["2023-01-14",{"$f":"INDIRECT(ADDRESS(MATCH($B$1,Calendrier!$A$15:$A$59,0)+14,ROW()-17,3,1,\"Calendrier\"),1)","v":"Sa"},null,null,null,null,{"$f":"IF(AND(C32<>0,D32<>0,E32<>0,F32<>0),F32-E32+D32-C32-M32-IF(E32-D32<Calendrier!$AT$10,Calendrier!$AT$10,0),IF(AND(C32<>0,D32<>0,E32=0,F32=0),D32-C32-M32,IF(AND(C32=0,D32=0,E32<>0,F32<>0),F32-E32-M32,IF(AND(C32>20,D32=0,E32=0,F32<>0),24-C32+F32-M32,IF(AND(C32<>0,D32=0,E32=0,F32<>0),F32-C32-M32,0)))))","v":0},{"$f":"IF(G32=0,0,IF(K32=0.5,0,G32-Calendrier!$AT$9))","v":0},0,"Sa",0,null,0]
["2023-01-15",{"$f":"INDIRECT(ADDRESS(MATCH($B$1,Calendrier!$A$15:$A$59,0)+14,ROW()-17,3,1,\"Calendrier\"),1)","v":"Di"},null,null,null,null,{"$f":"IF(AND(C33<>0,D33<>0,E33<>0,F33<>0),F33-E33+D33-C33-M33-IF(E33-D33<Calendrier!$AT$10,Calendrier!$AT$10,0),IF(AND(C33<>0,D33<>0,E33=0,F33=0),D33-C33-M33,IF(AND(C33=0,D33=0,E33<>0,F33<>0),F33-E33-M33,IF(AND(C33>20,D33=0,E33=0,F33<>0),24-C33+F33-M33,IF(AND(C33<>0,D33=0,E33=0,F33<>0),F33-C33-M33,0)))))","v":0},{"$f":"IF(G33=0,0,IF(K33=0.5,0,G33-Calendrier!$AT$9))","v":0},0,"Di",0,null,0]
["2023-01-16",{"$f":"INDIRECT(ADDRESS(MATCH($B$1,Calendrier!$A$15:$A$59,0)+14,ROW()-17,3,1,\"Calendrier\"),1)","v":"T"},21,null,null,5,{"$f":"IF(AND(C34<>0,D34<>0,E34<>0,F34<>0),F34-E34+D34-C34-M34-IF(E34-D34<Calendrier!$AT$10,Calendrier!$AT$10,0),IF(AND(C34<>0,D34<>0,E34=0,F34=0),D34-C34-M34,IF(AND(C34=0,D34=0,E34<>0,F34<>0),F34-E34-M34,IF(AND(C34>20,D34=0,E34=0,F34<>0),24-C34+F34-M34,IF(AND(C34<>0,D34=0,E34=0,F34<>0),F34-C34-M34,0)))))","v":8},{"$f":"IF(G34=0,0,IF(K34=0.5,0,G34-Calendrier!$AT$9))","v":0},0,{"$f":"IF(AND(COUNTA(C34:F34)=0,OR(B34=\"F\",WEEKDAY(A34,2)>5,B34=\"T\",B34=\"RTT\",B34=\"CA\")),B34,IF(AND(COUNTA(C34:F34)>=2,OR(B34=\"F\",B34=\"RTT\",B34=\"CA\",B34=\"Sa\",B34=\"Di\")),\"calendrier\",IF(AND(COUNTA(C34)+COUNTA(F34)=2,OR(COUNTA(C34:D34)<1,COUNTA(E34:F34)<1)),\"erreur\",IF(COUNTA(C34:F34)=3,\"en cours\",IF(COUNTA(C34:F34)=4,B34,IF(OR(AND(C34<>0,D34<>0),AND(E34<>0,F34<>0)),$F$12,IF(AND(C34<>0,D34=0,E34=0,F34<>0,WEEKDAY(A34,2)>5),\"calendrier\",IF(AND(C34<>0,D34=0,E34=0,F34<>0),$B34,\"\"))))))))","v":"T"},1,null,0]
["2023-01-17",{"$f":"INDIRECT(ADDRESS(MATCH($B$1,Calendrier!$A$15:$A$59,0)+14,ROW()-17,3,1,\"Calendrier\"),1)","v":"T"},7,12,13,17,{"$f":"IF(AND(C35<>0,D35<>0,E35<>0,F35<>0),F35-E35+D35-C35-M35-IF(E35-D35<Calendrier!$AT$10,Calendrier!$AT$10,0),IF(AND(C35<>0,D35<>0,E35=0,F35=0),D35-C35-M35,IF(AND(C35=0,D35=0,E35<>0,F35<>0),F35-E35-M35,IF(AND(C35>20,D35=0,E35=0,F35<>0),24-C35+F35-M35,IF(AND(C35<>0,D35=0,E35=0,F35<>0),F35-C35-M35,0)))))","v":9},{"$f":"IF(G35=0,0,IF(K35=0.5,0,G35-Calendrier!$AT$9))","v":1},1,"T",1,null,0]
["2023-01-18",{"$f":"INDIRECT(ADDRESS(MATCH($B$1,Calendrier!$A$15:$A$59,0)+14,ROW()-17,3,1,\"Calendrier\"),1)","v":"RTT"},7,12,12.5,17,{"$f":"IF(AND(C36<>0,D36<>0,E36<>0,F36<>0),F36-E36+D36-C36-M36-IF(E36-D36<Calendrier!$AT$10,Calendrier!$AT$10,0),IF(AND(C36<>0,D36<>0,E36=0,F36=0),D36-C36-M36,IF(AND(C36=0,D36=0,E36<>0,F36<>0),F36-E36-M36,IF(AND(C36>20,D36=0,E36=0,F36<>0),24-C36+F36-M36,IF(AND(C36<>0,D36=0,E36=0,F36<>0),F36-C36-M36,0)))))","v":8.75},{"$f":"IF(G36=0,0,IF(K36=0.5,0,G36-Calendrier!$AT$9))","v":0.75},1.75,"calendrier",1,null,0]
["2023-01-19",{"$f":"INDIRECT(ADDRESS(MATCH($B$1,Calendrier!$A$15:$A$59,0)+14,ROW()-17,3,1,\"Calendrier\"),1)","v":"T"},null,null,null,null,{"$f":"IF(AND(C37<>0,D37<>0,E37<>0,F37<>0),F37-E37+D37-C37-M37-IF(E37-D37<Calendrier!$AT$10,Calendrier!$AT$10,0),IF(AND(C37<>0,D37<>0,E37=0,F37=0),D37-C37-M37,IF(AND(C37=0,D37=0,E37<>0,F37<>0),F37-E37-M37,IF(AND(C37>20,D37=0,E37=0,F37<>0),24-C37+F37-M37,IF(AND(C37<>0,D37=0,E37=0,F37<>0),F37-C37-M37,0)))))","v":0},{"$f":"IF(G37=0,0,IF(K37=0.5,0,G37-Calendrier!$AT$9))","v":0},1.75,"T",0,null,0]
["2023-01-20",{"$f":"INDIRECT(ADDRESS(MATCH($B$1,Calendrier!$A$15:$A$59,0)+14,ROW()-17,3,1,\"Calendrier\"),1)","v":"T"},null,null,null,null,{"$f":"IF(AND(C38<>0,D38<>0,E38<>0,F38<>0),F38-E38+D38-C38-M38-IF(E38-D38<Calendrier!$AT$10,Calendrier!$AT$10,0),IF(AND(C38<>0,D38<>0,E38=0,F38=0),D38-C38-M38,IF(AND(C38=0,D38=0,E38<>0,F38<>0),F38-E38-M38,IF(AND(C38>20,D38=0,E38=0,F38<>0),24-C38+F38-M38,IF(AND(C38<>0,D38=0,E38=0,F38<>0),F38-C38-M38,0)))))","v":0},{"$f":"IF(G38=0,0,IF(K38=0.5,0,G38-Calendrier!$AT$9))","v":0},1.75,"T",0,null,0]
["2023-01-21",{"$f":"INDIRECT(ADDRESS(MATCH($B$1,Calendrier!$A$15:$A$59,0)+14,ROW()-17,3,1,\"Calendrier\"),1)","v":"Sa"},null,null,null,null,{"$f":"IF(AND(C39<>0,D39<>0,E39<>0,F39<>0),F39-E39+D39-C39-M39-IF(E39-D39<Calendrier!$AT$10,Calendrier!$AT$10,0),IF(AND(C39<>0,D39<>0,E39=0,F39=0),D39-C39-M39,IF(AND(C39=0,D39=0,E39<>0,F39<>0),F39-E39-M39,IF(AND(C39>20,D39=0,E39=0,F39<>0),24-C39+F39-M39,IF(AND(C39<>0,D39=0,E39=0,F39<>0),F39-C39-M39,0)))))","v":0},{"$f":"IF(G39=0,0,IF(K39=0.5,0,G39-Calendrier!$AT$9))","v":0},1.75,"Sa",0,null,0]
["2023-01-22",{"$f":"INDIRECT(ADDRESS(MATCH($B$1,Calendrier!$A$15:$A$59,0)+14,ROW()-17,3,1,\"Calendrier\"),1)","v":"Di"},null,null,null,null,{"$f":"IF(AND(C40<>0,D40<>0,E40<>0,F40<>0),F40-E40+D40-C40-M40-IF(E40-D40<Calendrier!$AT$10,Calendrier!$AT$10,0),IF(AND(C40<>0,D40<>0,E40=0,F40=0),D40-C40-M40,IF(AND(C40=0,D40=0,E40<>0,F40<>0),F40-E40-M40,IF(AND(C40>20,D40=0,E40=0,F40<>0),24-C40+F40-M40,IF(AND(C40<>0,D40=0,E40=0,F40<>0),F40-C40-M40,0)))))","v":0},{"$f":"IF(G40=0,0,IF(K40=0.5,0,G40-Calendrier!$AT$9))","v":0},1.75,"Di",0,null,0]
["2023-01-23",{"$f":"INDIRECT(ADDRESS(MATCH($B$1,Calendrier!$A$15:$A$59,0)+14,ROW()-17,3,1,\"Calendrier\"),1)","v":"T"},null,null,null,null,{"$f":"IF(AND(C41<>0,D41<>0,E41<>0,F41<>0),F41-E41+D41-C41-M41-IF(E41-D41<Calendrier!$AT$10,Calendrier!$AT$10,0),IF(AND(C41<>0,D41<>0,E41=0,F41=0),D41-C41-M41,IF(AND(C41=0,D41=0,E41<>0,F41<>0),F41-E41-M41,IF(AND(C41>20,D41=0,E41=0,F41<>0),24-C41+F41-M41,IF(AND(C41<>0,D41=0,E41=0,F41<>0),F41-C41-M41,0)))))","v":0},{"$f":"IF(G41=0,0,IF(K41=0.5,0,G41-Calendrier!$AT$9))","v":0},1.75,"T",0,null,0]
["2023-01-24",{"$f":"INDIRECT(ADDRESS(MATCH($B$1,Calendrier!$A$15:$A$59,0)+14,ROW()-17,3,1,\"Calendrier\"),1)","v":"T"},null,null,null,null,{"$f":"IF(AND(C42<>0,D42<>0,E42<>0,F42<>0),F42-E42+D42-C42-M42-IF(E42-D42<Calendrier!$AT$10,Calendrier!$AT$10,0),IF(AND(C42<>0,D42<>0,E42=0,F42=0),D42-C42-M42,IF(AND(C42=0,D42=0,E42<>0,F42<>0),F42-E42-M42,IF(AND(C42>20,D42=0,E42=0,F42<>0),24-C42+F42-M42,IF(AND(C42<>0,D42=0,E42=0,F42<>0),F42-C42-M42,0)))))","v":0},{"$f":"IF(G42=0,0,IF(K42=0.5,0,G42-Calendrier!$AT$9))","v":0},1.75,"T",0,null,0]
["2023-01-25",{"$f":"INDIRECT(ADDRESS(MATCH($B$1,Calendrier!$A$15:$A$59,0)+14,ROW()-17,3,1,\"Calendrier\"),1)","v":"T"},null,null,null,null,{"$f":"IF(AND(C43<>0,D43<>0,E43<>0,F43<>0),F43-E43+D43-C43-M43-IF(E43-D43<Calendrier!$AT$10,Calendrier!$AT$10,0),IF(AND(C43<>0,D43<>0,E43=0,F43=0),D43-C43-M43,IF(AND(C43=0,D43=0,E43<>0,F43<>0),F43-E43-M43,IF(AND(C43>20,D43=0,E43=0,F43<>0),24-C43+F43-M43,IF(AND(C43<>0,D43=0,E43=0,F43<>0),F43-C43-M43,0)))))","v":0},{"$f":"IF(G43=0,0,IF(K43=0.5,0,G43-Calendrier!$AT$9))","v":0},1.75,"T",0,null,0]
["2023-01-26",{"$f":"INDIRECT(ADDRESS(MATCH($B$1,Calendrier!$A$15:$A$59,0)+14,ROW()-17,3,1,\"Calendrier\"),1)","v":"T"},null,null,null,null,{"$f":"IF(AND(C44<>0,D44<>0,E44<>0,F44<>0),F44-E44+D44-C44-M44-IF(E44-D44<Calendrier!$AT$10,Calendrier!$AT$10,0),IF(AND(C44<>0,D44<>0,E44=0,F44=0),D44-C44-M44,IF(AND(C44=0,D44=0,E44<>0,F44<>0),F44-E44-M44,IF(AND(C44>20,D44=0,E44=0,F44<>0),24-C44+F44-M44,IF(AND(C44<>0,D44=0,E44=0,F44<>0),F44-C44-M44,0)))))","v":0},{"$f":"IF(G44=0,0,IF(K44=0.5,0,G44-Calendrier!$AT$9))","v":0},1.75,"T",0,null,0]
["2023-01-27",{"$f":"INDIRECT(ADDRESS(MATCH($B$1,Calendrier!$A$15:$A$59,0)+14,ROW()-17,3,1,\"Calendrier\"),1)","v":"T"},null,null,null,null,{"$f":"IF(AND(C45<>0,D45<>0,E45<>0,F45<>0),F45-E45+D45-C45-M45-IF(E45-D45<Calendrier!$AT$10,Calendrier!$AT$10,0),IF(AND(C45<>0,D45<>0,E45=0,F45=0),D45-C45-M45,IF(AND(C45=0,D45=0,E45<>0,F45<>0),F45-E45-M45,IF(AND(C45>20,D45=0,E45=0,F45<>0),24-C45+F45-M45,IF(AND(C45<>0,D45=0,E45=0,F45<>0),F45-C45-M45,0)))))","v":0},{"$f":"IF(G45=0,0,IF(K45=0.5,0,G45-Calendrier!$AT$9))","v":0},1.75,"T",0,null,0]
["2023-01-28",{"$f":"INDIRECT(ADDRESS(MATCH($B$1,Calendrier!$A$15:$A$59,0)+14,ROW()-17,3,1,\"Calendrier\"),1)","v":"Sa"},null,null,null,null,{"$f":"IF(AND(C46<>0,D46<>0,E46<>0,F46<>0),F46-E46+D46-C46-M46-IF(E46-D46<Calendrier!$AT$10,Calendrier!$AT$10,0),IF(AND(C46<>0,D46<>0,E46=0,F46=0),D46-C46-M46,IF(AND(C46=0,D46=0,E46<>0,F46<>0),F46-E46-M46,IF(AND(C46>20,D46=0,E46=0,F46<>0),24-C46+F46-M46,IF(AND(C46<>0,D46=0,E46=0,F46<>0),F46-C46-M46,0)))))","v":0},{"$f":"IF(G46=0,0,IF(K46=0.5,0,G46-Calendrier!$AT$9))","v":0},1.75,"Sa",0,null,0]
["2023-01-29",{"$f":"INDIRECT(ADDRESS(MATCH($B$1,Calendrier!$A$15:$A$59,0)+14,ROW()-17,3,1,\"Calendrier\"),1)","v":"Di"},null,null,null,null,{"$f":"IF(AND(C47<>0,D47<>0,E47<>0,F47<>0),F47-E47+D47-C47-M47-IF(E47-D47<Calendrier!$AT$10,Calendrier!$AT$10,0),IF(AND(C47<>0,D47<>0,E47=0,F47=0),D47-C47-M47,IF(AND(C47=0,D47=0,E47<>0,F47<>0),F47-E47-M47,IF(AND(C47>20,D47=0,E47=0,F47<>0),24-C47+F47-M47,IF(AND(C47<>0,D47=0,E47=0,F47<>0),F47-C47-M47,0)))))","v":0},{"$f":"IF(G47=0,0,IF(K47=0.5,0,G47-Calendrier!$AT$9))","v":0},1.75,"Di",0,null,0]
["2023-01-30",{"$f":"INDIRECT(ADDRESS(MATCH($B$1,Calendrier!$A$15:$A$59,0)+14,ROW()-17,3,1,\"Calendrier\"),1)","v":"T"},null,null,null,null,{"$f":"IF(AND(C48<>0,D48<>0,E48<>0,F48<>0),F48-E48+D48-C48-M48-IF(E48-D48<Calendrier!$AT$10,Calendrier!$AT$10,0),IF(AND(C48<>0,D48<>0,E48=0,F48=0),D48-C48-M48,IF(AND(C48=0,D48=0,E48<>0,F48<>0),F48-E48-M48,IF(AND(C48>20,D48=0,E48=0,F48<>0),24-C48+F48-M48,IF(AND(C48<>0,D48=0,E48=0,F48<>0),F48-C48-M48,0)))))","v":0},{"$f":"IF(G48=0,0,IF(K48=0.5,0,G48-Calendrier!$AT$9))","v":0},1.75,"T",0,null,0]
["2023-01-31",{"$f":"INDIRECT(ADDRESS(MATCH($B$1,Calendrier!$A$15:$A$59,0)+14,ROW()-17,3,1,\"Calendrier\"),1)","v":"T"},null,null,null,null,{"$f":"IF(AND(C49<>0,D49<>0,E49<>0,F49<>0),F49-E49+D49-C49-M49-IF(E49-D49<Calendrier!$AT$10,Calendrier!$AT$10,0),IF(AND(C49<>0,D49<>0,E49=0,F49=0),D49-C49-M49,IF(AND(C49=0,D49=0,E49<>0,F49<>0),F49-E49-M49,IF(AND(C49>20,D49=0,E49=0,F49<>0),24-C49+F49-M49,IF(AND(C49<>0,D49=0,E49=0,F49<>0),F49-C49-M49,0)))))","v":0},{"$f":"IF(G49=0,0,IF(K49=0.5,0,G49-Calendrier!$AT$9))","v":0},1.75,"T",0,null,0]
[null,null,null,null,null,null,{"$f":"SUM(G19:G49)","v":65.25},null,{"$f":"I49","v":1.75}]

{"sheet":"FEV","index":4,"n_rows":50,"n_cols":17,"rows_kept":50,"cut":false,"hidden":false,"merged":[]}
[null,{"$f":"RIGHT(CELL(\"nomfichier\",$A$1),3)","v":"FEV"},"FICHE DE SUIVI HORAIRE"]
[]
[null,"mois :","FEVRIER",null,null,"année ",{"$f":"VLOOKUP(C3,Fériés!$I$1:$J$12,2,FALSE)","v":2023},null,null,"service",{"$f":"Calendrier!F4","v":"Administratif"}]
[]
[null,"nom :",{"$f":"Calendrier!F2","v":"Isq"},null,null," prénom ",{"$f":"Calendrier!F3","v":"Philippe"},null,null,"N° Ident",{"$f":"Calendrier!F1","v":"T506489"}]
[null,null,null,null,null,null,null,"à réaliser","cumul","en cours","reste",null,"N.cumul"]
[null,null,null,"Nb J",{"$f":"Calendrier!$AT$11","v":218},{"$f":"+$H$10","v":0},{"$f":"E7-F7","v":218},{"$f":"Calendrier!N1","v":365},{"$f":"JAN!M7","v":27.5},{"$f":"SUM(J8:J15)","v":28},{"$f":"H7-(I7+J7)","v":309.5},null,{"$f":"SUM(M8:M15)","v":55.5}]
[null,null,null,null,null,"1/2CA","CA",{"$f":"Calendrier!N5","v":25},{"$f":"JAN!M8","v":0},{"$f":"COUNTIF($J$19:$J$49,G8)","v":0},{"$f":"+H8-(I8+J8)","v":25},"J",{"$f":"+I8+J8","v":0}]
[null,null,null,null,null,"1/2RTT","RTT",{"$f":"Calendrier!N8","v":9},{"$f":"JAN!M9","v":0},{"$f":"COUNTIF($J$19:$J$49,G9)+COUNTIF($J$19:$J$49,F9)/2","v":2},{"$f":"+H9-(I9+J9)","v":7},"J",2]
[null,null,null,null,null,"1/2CS","CS",{"$f":"Calendrier!N9","v":0},{"$f":"JAN!M10","v":0},0,{"$f":"H10-(I10+J10)","v":0},"J",0]
[null,null,null,null,null,"1/2CP","CP",{"$f":"Calendrier!N6","v":0},{"$f":"JAN!M11","v":0},0,{"$f":"H11-(I11+J11)","v":0},"J",0]
[null,null,null,null,null,"1/2T","T",{"$f":"Calendrier!N7","v":218},{"$f":"JAN!M12","v":18.5},18,{"$f":"H12-(I12+J12)","v":181.5},"J",36.5]
[null,null,null,null,null,0,"Sa",{"$f":"Calendrier!N4","v":51},{"$f":"JAN!M13","v":4},{"$f":"COUNTIF($J$19:$J$49,G13)","v":4},{"$f":"+H13-(I13+J13)","v":43},"J",8]
[null,null,null,null,null,0,"Di",{"$f":"Calendrier!N3","v":50},{"$f":"JAN!M14","v":4},{"$f":"COUNTIF($J$19:$J$49,G14)","v":4},{"$f":"+H14-(I14+J14)","v":42},"J",8]
[null,null,null,null,null,0,"F",{"$f":"Calendrier!N2","v":12},{"$f":"JAN!M15","v":1},{"$f":"COUNTIF($J$19:$J$49,G15)","v":0},{"$f":"+H15-(I15+J15)","v":11},"J",1]
[null,null,null,null,null,null,"heure/avance fin mois",null,{"$f":"JAN!$I$50","v":1.75},null,null,null,{"$f":"I50","v":1.75},"avec bon"]
[null,"Prévu","Entrée","Sortie","Entrée","Sortie","total","variation","cumul","Type","nb J/T",null,"divers E/S","Sortie","Retour"]
[null,null,null,null,null,null,null,null,{"$f":"JAN!$I$50","v":1.75}]
[{"$f":"VALUE(\"01/02/\"&G3)","v":"2023-02-01"},{"$f":"INDIRECT(ADDRESS(MATCH($B$1,Calendrier!$A$15:$A$59,0)+14,ROW()-17,3,1,\"Calendrier\"),1)","v":"T"},null,null,null,null,{"$f":"IF(AND(C19<>0,D19<>0,E19<>0,F19<>0),F19-E19+D19-C19-K19-IF(E19-D19<Calendrier!$AT$10,Calendrier!$AT$10,0),IF(AND(C19<>0,D19<>0,E19=0,F19=0),D19-C19-K19,IF(AND(C19=0,D19=0,E19<>0,F19<>0),F19-E19-K19,IF(AND(C19>20,D19=0,E19=0,F19<>0),24-C19+F19-K19,IF(AND(C19<>0,D19=0,E19=0,F19<>0),F19-C19-K19,0)))))","v":0},{"$f":"IF(G19=0,0,IF(K19=0.5,0,G19-Calendrier!$AT$9))","v":0},{"$f":"I18+H19","v":1.75},{"$f":"IF(AND(COUNTA(C19:F19)=0,OR(B19=\"F\",WEEKDAY(A19,2)>5,B19=\"T\",B19=\"RTT\",B19=\"CA\")),B19,IF(AND(COUNTA(C19:F19)>=2,OR(B19=\"F\",B19=\"RTT\",B19=\"CA\",B19=\"Sa\",B19=\"Di\")),\"calendrier\",IF(AND(COUNTA(C19)+COUNTA(F19)=2,OR(COUNTA(C19:D19)<1,COUNTA(E19:F19)<1)),\"erreur\",IF(COUNTA(C19:F19)=3,\"en cours\",IF(COUNTA(C19:F19)=4,B19,IF(OR(AND(C19<>0,D19<>0),AND(E19<>0,F19<>0)),$F$12,IF(AND(C19<>0,D19=0,E19=0,F19<>0,WEEKDAY(A19,2)>5),\"calendrier\",IF(AND(C19<>0,D19=0,E19=0,F19<>0),$B19,\"\"))))))))","v":"T"},{"$f":"IF(COUNTA(C19:F19)=4,1,IF(OR(AND(C19<>0,D19<>0),AND(E19<>0,F19<>0)),0.5,IF(AND(C19<>0,F19<>0,D19=0,E19=0,B19=\"T\"),1,0)))","v":0},null,{"$f":"IF(OR(N19=0,O19=0),0,O19-N19)","v":0}]
[{"$f":"A19+1","v":"2023-02-02"},{"$f":"INDIRECT(ADDRESS(MATCH($B$1,Calendrier!$A$15:$A$59,0)+14,ROW()-17,3,1,\"Calendrier\"),1)","v":"T"},null,null,null,null,{"$f":"IF(AND(C20<>0,D20<>0,E20<>0,F20<>0),F20-E20+D20-C20-K20-IF(E20-D20<Calendrier!$AT$10,Calendrier!$AT$10,0),IF(AND(C20<>0,D20<>0,E20=0,F20=0),D20-C20-K20,IF(AND(C20=0,D20=0,E20<>0,F20<>0),F20-E20-K20,IF(AND(C20>20,D20=0,E20=0,F20<>0),24-C20+F20-K20,IF(AND(C20<>0,D20=0,E20=0,F20<>0),F20-C20-K20,0)))))","v":0},{"$f":"IF(G20=0,0,IF(K20=0.5,0,G20-Calendrier!$AT$9))","v":0},1.75,"T",0,null,0,null,null,null,{"$f":"IF(AND(COUNTA(C19:F19)=0,WEEKDAY(A19,2)>5),B19,IF(COUNTA(C19:F19)=0,\"\",IF(COUNTA(C19:F19)=0,\"\",IF(AND(COUNTA(D19:F19)=0,C19<>0),\"erreur\",IF(COUNTA(C19:F19)=4,B19,IF(COUNTA(C19:F19)=3,\"H manquante\",IF(AND(C19<>0,D19<>0),$F$12,IF(AND(E19<>0,F19<>0),$F$12,IF(AND(C19<>0,D19=0,E19=0,F19<>0,WEEKDAY(A19)>5),\"Modif  calendrier\",IF(AND(C19<>0,D19=0,E19=0,F19<>0),$B19))))))))))","v":""}]
[{"$f":"A20+1","v":"2023-02-03"},{"$f":"INDIRECT(ADDRESS(MATCH($B$1,Calendrier!$A$15:$A$59,0)+14,ROW()-17,3,1,\"Calendrier\"),1)","v":"T"},null,null,null,null,{"$f":"IF(AND(C21<>0,D21<>0,E21<>0,F21<>0),F21-E21+D21-C21-M21-IF(E21-D21<Calendrier!$AT$10,Calendrier!$AT$10,0),IF(AND(C21<>0,D21<>0,E21=0,F21=0),D21-C21-M21,IF(AND(C21=0,D21=0,E21<>0,F21<>0),F21-E21-M21,IF(AND(C21>20,D21=0,E21=0,F21<>0),24-C21+F21-M21,IF(AND(C21<>0,D21=0,E21=0,F21<>0),F21-C21-M21,0)))))","v":0},{"$f":"IF(G21=0,0,IF(K21=0.5,0,G21-Calendrier!$AT$9))","v":0},{"$f":"I20+H21","v":1.75},"T",0,null,0]
["2023-02-04",{"$f":"INDIRECT(ADDRESS(MATCH($B$1,Calendrier!$A$15:$A$59,0)+14,ROW()-17,3,1,\"Calendrier\"),1)","v":"Sa"},null,null,null,null,{"$f":"IF(AND(C22<>0,D22<>0,E22<>0,F22<>0),F22-E22+D22-C22-M22-IF(E22-D22<Calendrier!$AT$10,Calendrier!$AT$10,0),IF(AND(C22<>0,D22<>0,E22=0,F22=0),D22-C22-M22,IF(AND(C22=0,D22=0,E22<>0,F22<>0),F22-E22-M22,IF(AND(C22>20,D22=0,E22=0,F22<>0),24-C22+F22-M22,IF(AND(C22<>0,D22=0,E22=0,F22<>0),F22-C22-M22,0)))))","v":0},{"$f":"IF(G22=0,0,IF(K22=0.5,0,G22-Calendrier!$AT$9))","v":0},1.75,"Sa",0,null,0]
["2023-02-05",{"$f":"INDIRECT(ADDRESS(MATCH($B$1,Calendrier!$A$15:$A$59,0)+14,ROW()-17,3,1,\"Calendrier\"),1)","v":"Di"},null,null,null,null,{"$f":"IF(AND(C23<>0,D23<>0,E23<>0,F23<>0),F23-E23+D23-C23-M23-IF(E23-D23<Calendrier!$AT$10,Calendrier!$AT$10,0),IF(AND(C23<>0,D23<>0,E23=0,F23=0),D23-C23-M23,IF(AND(C23=0,D23=0,E23<>0,F23<>0),F23-E23-M23,IF(AND(C23>20,D23=0,E23=0,F23<>0),24-C23+F23-M23,IF(AND(C23<>0,D23=0,E23=0,F23<>0),F23-C23-M23,0)))))","v":0},{"$f":"IF(G23=0,0,IF(K23=0.5,0,G23-Calendrier!$AT$9))","v":0},1.75,"Di",0,null,0]
["2023-02-06",{"$f":"INDIRECT(ADDRESS(MATCH($B$1,Calendrier!$A$15:$A$59,0)+14,ROW()-17,3,1,\"Calendrier\"),1)","v":"T"},null,null,null,null,{"$f":"IF(AND(C24<>0,D24<>0,E24<>0,F24<>0),F24-E24+D24-C24-M24-IF(E24-D24<Calendrier!$AT$10,Calendrier!$AT$10,0),IF(AND(C24<>0,D24<>0,E24=0,F24=0),D24-C24-M24,IF(AND(C24=0,D24=0,E24<>0,F24<>0),F24-E24-M24,IF(AND(C24>20,D24=0,E24=0,F24<>0),24-C24+F24-M24,IF(AND(C24<>0,D24=0,E24=0,F24<>0),F24-C24-M24,0)))))","v":0},{"$f":"IF(G24=0,0,IF(K24=0.5,0,G24-Calendrier!$AT$9))","v":0},1.75,"T",0,null,{"$f":"IF(OR(N24=0,O24=0),0,O24-N24)","v":0}]
["2023-02-07",{"$f":"INDIRECT(ADDRESS(MATCH($B$1,Calendrier!$A$15:$A$59,0)+14,ROW()-17,3,1,\"Calendrier\"),1)","v":"RTT"},null,null,null,null,{"$f":"IF(AND(C25<>0,D25<>0,E25<>0,F25<>0),F25-E25+D25-C25-M25-IF(E25-D25<Calendrier!$AT$10,Calendrier!$AT$10,0),IF(AND(C25<>0,D25<>0,E25=0,F25=0),D25-C25-M25,IF(AND(C25=0,D25=0,E25<>0,F25<>0),F25-E25-M25,IF(AND(C25>20,D25=0,E25=0,F25<>0),24-C25+F25-M25,IF(AND(C25<>0,D25=0,E25=0,F25<>0),F25-C25-M25,0)))))","v":0},{"$f":"IF(G25=0,0,IF(K25=0.5,0,G25-Calendrier!$AT$9))","v":0},1.75,"RTT",0,null,{"$f":"IF(OR(N25=0,O25=0),0,O25-N25)","v":0}]
["2023-02-08",{"$f":"INDIRECT(ADDRESS(MATCH($B$1,Calendrier!$A$15:$A$59,0)+14,ROW()-17,3,1,\"Calendrier\"),1)","v":"T"},null,null,null,null,{"$f":"IF(AND(C26<>0,D26<>0,E26<>0,F26<>0),F26-E26+D26-C26-M26-IF(E26-D26<Calendrier!$AT$10,Calendrier!$AT$10,0),IF(AND(C26<>0,D26<>0,E26=0,F26=0),D26-C26-M26,IF(AND(C26=0,D26=0,E26<>0,F26<>0),F26-E26-M26,IF(AND(C26>20,D26=0,E26=0,F26<>0),24-C26+F26-M26,IF(AND(C26<>0,D26=0,E26=0,F26<>0),F26-C26-M26,0)))))","v":0},{"$f":"IF(G26=0,0,IF(K26=0.5,0,G26-Calendrier!$AT$9))","v":0},1.75,"T",0,null,0]
["2023-02-09",{"$f":"INDIRECT(ADDRESS(MATCH($B$1,Calendrier!$A$15:$A$59,0)+14,ROW()-17,3,1,\"Calendrier\"),1)","v":"T"},null,null,null,null,{"$f":"IF(AND(C27<>0,D27<>0,E27<>0,F27<>0),F27-E27+D27-C27-M27-IF(E27-D27<Calendrier!$AT$10,Calendrier!$AT$10,0),IF(AND(C27<>0,D27<>0,E27=0,F27=0),D27-C27-M27,IF(AND(C27=0,D27=0,E27<>0,F27<>0),F27-E27-M27,IF(AND(C27>20,D27=0,E27=0,F27<>0),24-C27+F27-M27,IF(AND(C27<>0,D27=0,E27=0,F27<>0),F27-C27-M27,0)))))","v":0},{"$f":"IF(G27=0,0,IF(K27=0.5,0,G27-Calendrier!$AT$9))","v":0},1.75,"T",0,null,0]
["2023-02-10",{"$f":"INDIRECT(ADDRESS(MATCH($B$1,Calendrier!$A$15:$A$59,0)+14,ROW()-17,3,1,\"Calendrier\"),1)","v":"T"},null,null,null,null,{"$f":"IF(AND(C28<>0,D28<>0,E28<>0,F28<>0),F28-E28+D28-C28-M28-IF(E28-D28<Calendrier!$AT$10,Calendrier!$AT$10,0),IF(AND(C28<>0,D28<>0,E28=0,F28=0),D28-C28-M28,IF(AND(C28=0,D28=0,E28<>0,F28<>0),F28-E28-M28,IF(AND(C28>20,D28=0,E28=0,F28<>0),24-C28+F28-M28,IF(AND(C28<>0,D28=0,E28=0,F28<>0),F28-C28-M28,0)))))","v":0},{"$f":"IF(G28=0,0,IF(K28=0.5,0,G28-Calendrier!$AT$9))","v":0},1.75,"T",0,null,0]
["2023-02-11",{"$f":"INDIRECT(ADDRESS(MATCH($B$1,Calendrier!$A$15:$A$59,0)+14,ROW()-17,3,1,\"Calendrier\"),1)","v":"Sa"},null,null,null,null,{"$f":"IF(AND(C29<>0,D29<>0,E29<>0,F29<>0),F29-E29+D29-C29-M29-IF(E29-D29<Calendrier!$AT$10,Calendrier!$AT$10,0),IF(AND(C29<>0,D29<>0,E29=0,F29=0),D29-C29-M29,IF(AND(C29=0,D29=0,E29<>0,F29<>0),F29-E29-M29,IF(AND(C29>20,D29=0,E29=0,F29<>0),24-C29+F29-M29,IF(AND(C29<>0,D29=0,E29=0,F29<>0),F29-C29-M29,0)))))","v":0},{"$f":"IF(G29=0,0,IF(K29=0.5,0,G29-Calendrier!$AT$9))","v":0},1.75,"Sa",0,null,0]
["2023-02-12",{"$f":"INDIRECT(ADDRESS(MATCH($B$1,Calendrier!$A$15:$A$59,0)+14,ROW()-17,3,1,\"Calendrier\"),1)","v":"Di"},null,null,null,null,{"$f":"IF(AND(C30<>0,D30<>0,E30<>0,F30<>0),F30-E30+D30-C30-M30-IF(E30-D30<Calendrier!$AT$10,Calendrier!$AT$10,0),IF(AND(C30<>0,D30<>0,E30=0,F30=0),D30-C30-M30,IF(AND(C30=0,D30=0,E30<>0,F30<>0),F30-E30-M30,IF(AND(C30>20,D30=0,E30=0,F30<>0),24-C30+F30-M30,IF(AND(C30<>0,D30=0,E30=0,F30<>0),F30-C30-M30,0)))))","v":0},{"$f":"IF(G30=0,0,IF(K30=0.5,0,G30-Calendrier!$AT$9))","v":0},1.75,"Di",0,null,0]
["2023-02-13",{"$f":"INDIRECT(ADDRESS(MATCH($B$1,Calendrier!$A$15:$A$59,0)+14,ROW()-17,3,1,\"Calendrier\"),1)","v":"T"},null,null,null,null,{"$f":"IF(AND(C31<>0,D31<>0,E31<>0,F31<>0),F31-E31+D31-C31-M31-IF(E31-D31<Calendrier!$AT$10,Calendrier!$AT$10,0),IF(AND(C31<>0,D31<>0,E31=0,F31=0),D31-C31-M31,IF(AND(C31=0,D31=0,E31<>0,F31<>0),F31-E31-M31,IF(AND(C31>20,D31=0,E31=0,F31<>0),24-C31+F31-M31,IF(AND(C31<>0,D31=0,E31=0,F31<>0),F31-C31-M31,0)))))","v":0},{"$f":"IF(G31=0,0,IF(K31=0.5,0,G31-Calendrier!$AT$9))","v":0},1.75,"T",0,null,0]
["2023-02-14",{"$f":"INDIRECT(ADDRESS(MATCH($B$1,Calendrier!$A$15:$A$59,0)+14,ROW()-17,3,1,\"Calendrier\"),1)","v":"T"},null,null,null,null,{"$f":"IF(AND(C32<>0,D32<>0,E32<>0,F32<>0),F32-E32+D32-C32-M32-IF(E32-D32<Calendrier!$AT$10,Calendrier!$AT$10,0),IF(AND(C32<>0,D32<>0,E32=0,F32=0),D32-C32-M32,IF(AND(C32=0,D32=0,E32<>0,F32<>0),F32-E32-M32,IF(AND(C32>20,D32=0,E32=0,F32<>0),24-C32+F32-M32,IF(AND(C32<>0,D32=0,E32=0,F32<>0),F32-C32-M32,0)))))","v":0},{"$f":"IF(G32=0,0,IF(K32=0.5,0,G32-Calendrier!$AT$9))","v":0},1.75,"T",0,null,0]
["2023-02-15",{"$f":"INDIRECT(ADDRESS(MATCH($B$1,Calendrier!$A$15:$A$59,0)+14,ROW()-17,3,1,\"Calendrier\"),1)","v":"T"},null,null,null,null,{"$f":"IF(AND(C33<>0,D33<>0,E33<>0,F33<>0),F33-E33+D33-C33-M33-IF(E33-D33<Calendrier!$AT$10,Calendrier!$AT$10,0),IF(AND(C33<>0,D33<>0,E33=0,F33=0),D33-C33-M33,IF(AND(C33=0,D33=0,E33<>0,F33<>0),F33-E33-M33,IF(AND(C33>20,D33=0,E33=0,F33<>0),24-C33+F33-M33,IF(AND(C33<>0,D33=0,E33=0,F33<>0),F33-C33-M33,0)))))","v":0},{"$f":"IF(G33=0,0,IF(K33=0.5,0,G33-Calendrier!$AT$9))","v":0},1.75,"T",0,null,0]
["2023-02-16",{"$f":"INDIRECT(ADDRESS(MATCH($B$1,Calendrier!$A$15:$A$59,0)+14,ROW()-17,3,1,\"Calendrier\"),1)","v":"T"},null,null,null,null,{"$f":"IF(AND(C34<>0,D34<>0,E34<>0,F34<>0),F34-E34+D34-C34-M34-IF(E34-D34<Calendrier!$AT$10,Calendrier!$AT$10,0),IF(AND(C34<>0,D34<>0,E34=0,F34=0),D34-C34-M34,IF(AND(C34=0,D34=0,E34<>0,F34<>0),F34-E34-M34,IF(AND(C34>20,D34=0,E34=0,F34<>0),24-C34+F34-M34,IF(AND(C34<>0,D34=0,E34=0,F34<>0),F34-C34-M34,0)))))","v":0},{"$f":"IF(G34=0,0,IF(K34=0.5,0,G34-Calendrier!$AT$9))","v":0},1.75,{"$f":"IF(AND(COUNTA(C34:F34)=0,OR(B34=\"F\",WEEKDAY(A34,2)>5,B34=\"T\",B34=\"RTT\",B34=\"CA\")),B34,IF(AND(COUNTA(C34:F34)>=2,OR(B34=\"F\",B34=\"RTT\",B34=\"CA\",B34=\"Sa\",B34=\"Di\")),\"calendrier\",IF(AND(COUNTA(C34)+COUNTA(F34)=2,OR(COUNTA(C34:D34)<1,COUNTA(E34:F34)<1)),\"erreur\",IF(COUNTA(C34:F34)=3,\"en cours\",IF(COUNTA(C34:F34)=4,B34,IF(OR(AND(C34<>0,D34<>0),AND(E34<>0,F34<>0)),$F$12,IF(AND(C34<>0,D34=0,E34=0,F34<>0,WEEKDAY(A34,2)>5),\"calendrier\",IF(AND(C34<>0,D34=0,E34=0,F34<>0),$B34,\"\"))))))))","v":"T"},0,null,0]
["2023-02-17",{"$f":"INDIRECT(ADDRESS(MATCH($B$1,Calendrier!$A$15:$A$59,0)+14,ROW()-17,3,1,\"Calendrier\"),1)","v":"T"},null,null,null,null,{"$f":"IF(AND(C35<>0,D35<>0,E35<>0,F35<>0),F35-E35+D35-C35-M35-IF(E35-D35<Calendrier!$AT$10,Calendrier!$AT$10,0),IF(AND(C35<>0,D35<>0,E35=0,F35=0),D35-C35-M35,IF(AND(C35=0,D35=0,E35<>0,F35<>0),F35-E35-M35,IF(AND(C35>20,D35=0,E35=0,F35<>0),24-C35+F35-M35,IF(AND(C35<>0,D35=0,E35=0,F35<>0),F35-C35-M35,0)))))","v":0},{"$f":"IF(G35=0,0,IF(K35=0.5,0,G35-Calendrier!$AT$9))","v":0},1.75,"T",0,null,0]
["2023-02-18",{"$f":"INDIRECT(ADDRESS(MATCH($B$1,Calendrier!$A$15:$A$59,0)+14,ROW()-17,3,1,\"Calendrier\"),1)","v":"Sa"},null,null,null,null,{"$f":"IF(AND(C36<>0,D36<>0,E36<>0,F36<>0),F36-E36+D36-C36-M36-IF(E36-D36<Calendrier!$AT$10,Calendrier!$AT$10,0),IF(AND(C36<>0,D36<>0,E36=0,F36=0),D36-C36-M36,IF(AND(C36=0,D36=0,E36<>0,F36<>0),F36-E36-M36,IF(AND(C36>20,D36=0,E36=0,F36<>0),24-C36+F36-M36,IF(AND(C36<>0,D36=0,E36=0,F36<>0),F36-C36-M36,0)))))","v":0},{"$f":"IF(G36=0,0,IF(K36=0.5,0,G36-Calendrier!$AT$9))","v":0},1.75,"Sa",0,null,0]
["2023-02-19",{"$f":"INDIRECT(ADDRESS(MATCH($B$1,Calendrier!$A$15:$A$59,0)+14,ROW()-17,3,1,\"Calendrier\"),1)","v":"Di"},null,null,null,null,{"$f":"IF(AND(C37<>0,D37<>0,E37<>0,F37<>0),F37-E37+D37-C37-M37-IF(E37-D37<Calendrier!$AT$10,Calendrier!$AT$10,0),IF(AND(C37<>0,D37<>0,E37=0,F37=0),D37-C37-M37,IF(AND(C37=0,D37=0,E37<>0,F37<>0),F37-E37-M37,IF(AND(C37>20,D37=0,E37=0,F37<>0),24-C37+F37-M37,IF(AND(C37<>0,D37=0,E37=0,F37<>0),F37-C37-M37,0)))))","v":0},{"$f":"IF(G37=0,0,IF(K37=0.5,0,G37-Calendrier!$AT$9))","v":0},1.75,"Di",0,null,0]
["2023-02-20",{"$f":"INDIRECT(ADDRESS(MATCH($B$1,Calendrier!$A$15:$A$59,0)+14,ROW()-17,3,1,\"Calendrier\"),1)","v":"T"},null,null,null,null,{"$f":"IF(AND(C38<>0,D38<>0,E38<>0,F38<>0),F38-E38+D38-C38-M38-IF(E38-D38<Calendrier!$AT$10,Calendrier!$AT$10,0),IF(AND(C38<>0,D38<>0,E38=0,F38=0),D38-C38-M38,IF(AND(C38=0,D38=0,E38<>0,F38<>0),F38-E38-M38,IF(AND(C38>20,D38=0,E38=0,F38<>0),24-C38+F38-M38,IF(AND(C38<>0,D38=0,E38=0,F38<>0),F38-C38-M38,0)))))","v":0},{"$f":"IF(G38=0,0,IF(K38=0.5,0,G38-Calendrier!$AT$9))","v":0},1.75,"T",0,null,0]
["2023-02-21",{"$f":"INDIRECT(ADDRESS(MATCH($B$1,Calendrier!$A$15:$A$59,0)+14,ROW()-17,3,1,\"Calendrier\"),1)","v":"T"},null,null,null,null,{"$f":"IF(AND(C39<>0,D39<>0,E39<>0,F39<>0),F39-E39+D39-C39-M39-IF(E39-D39<Calendrier!$AT$10,Calendrier!$AT$10,0),IF(AND(C39<>0,D39<>0,E39=0,F39=0),D39-C39-M39,IF(AND(C39=0,D39=0,E39<>0,F39<>0),F39-E39-M39,IF(AND(C39>20,D39=0,E39=0,F39<>0),24-C39+F39-M39,IF(AND(C39<>0,D39=0,E39=0,F39<>0),F39-C39-M39,0)))))","v":0},{"$f":"IF(G39=0,0,IF(K39=0.5,0,G39-Calendrier!$AT$9))","v":0},1.75,"T",0,null,0]
["2023-02-22",{"$f":"INDIRECT(ADDRESS(MATCH($B$1,Calendrier!$A$15:$A$59,0)+14,ROW()-17,3,1,\"Calendrier\"),1)","v":"RTT"},null,null,null,null,{"$f":"IF(AND(C40<>0,D40<>0,E40<>0,F40<>0),F40-E40+D40-C40-M40-IF(E40-D40<Calendrier!$AT$10,Calendrier!$AT$10,0),IF(AND(C40<>0,D40<>0,E40=0,F40=0),D40-C40-M40,IF(AND(C40=0,D40=0,E40<>0,F40<>0),F40-E40-M40,IF(AND(C40>20,D40=0,E40=0,F40<>0),24-C40+F40-M40,IF(AND(C40<>0,D40=0,E40=0,F40<>0),F40-C40-M40,0)))))","v":0},{"$f":"IF(G40=0,0,IF(K40=0.5,0,G40-Calendrier!$AT$9))","v":0},1.75,"RTT",0,null,0]
["2023-02-23",{"$f":"INDIRECT(ADDRESS(MATCH($B$1,Calendrier!$A$15:$A$59,0)+14,ROW()-17,3,1,\"Calendrier\"),1)","v":"T"},null,null,null,null,{"$f":"IF(AND(C41<>0,D41<>0,E41<>0,F41<>0),F41-E41+D41-C41-M41-IF(E41-D41<Calendrier!$AT$10,Calendrier!$AT$10,0),IF(AND(C41<>0,D41<>0,E41=0,F41=0),D41-C41-M41,IF(AND(C41=0,D41=0,E41<>0,F41<>0),F41-E41-M41,IF(AND(C41>20,D41=0,E41=0,F41<>0),24-C41+F41-M41,IF(AND(C41<>0,D41=0,E41=0,F41<>0),F41-C41-M41,0)))))","v":0},{"$f":"IF(G41=0,0,IF(K41=0.5,0,G41-Calendrier!$AT$9))","v":0},1.75,"T",0,null,0]
["2023-02-24",{"$f":"INDIRECT(ADDRESS(MATCH($B$1,Calendrier!$A$15:$A$59,0)+14,ROW()-17,3,1,\"Calendrier\"),1)","v":"T"},null,null,null,null,{"$f":"IF(AND(C42<>0,D42<>0,E42<>0,F42<>0),F42-E42+D42-C42-M42-IF(E42-D42<Calendrier!$AT$10,Calendrier!$AT$10,0),IF(AND(C42<>0,D42<>0,E42=0,F42=0),D42-C42-M42,IF(AND(C42=0,D42=0,E42<>0,F42<>0),F42-E42-M42,IF(AND(C42>20,D42=0,E42=0,F42<>0),24-C42+F42-M42,IF(AND(C42<>0,D42=0,E42=0,F42<>0),F42-C42-M42,0)))))","v":0},{"$f":"IF(G42=0,0,IF(K42=0.5,0,G42-Calendrier!$AT$9))","v":0},1.75,"T",0,null,0]
["2023-02-25",{"$f":"INDIRECT(ADDRESS(MATCH($B$1,Calendrier!$A$15:$A$59,0)+14,ROW()-17,3,1,\"Calendrier\"),1)","v":"Sa"},null,null,null,null,{"$f":"IF(AND(C43<>0,D43<>0,E43<>0,F43<>0),F43-E43+D43-C43-M43-IF(E43-D43<Calendrier!$AT$10,Calendrier!$AT$10,0),IF(AND(C43<>0,D43<>0,E43=0,F43=0),D43-C43-M43,IF(AND(C43=0,D43=0,E43<>0,F43<>0),F43-E43-M43,IF(AND(C43>20,D43=0,E43=0,F43<>0),24-C43+F43-M43,IF(AND(C43<>0,D43=0,E43=0,F43<>0),F43-C43-M43,0)))))","v":0},{"$f":"IF(G43=0,0,IF(K43=0.5,0,G43-Calendrier!$AT$9))","v":0},1.75,"Sa",0,null,0]
["2023-02-26",{"$f":"INDIRECT(ADDRESS(MATCH($B$1,Calendrier!$A$15:$A$59,0)+14,ROW()-17,3,1,\"Calendrier\"),1)","v":"Di"},null,null,null,null,{"$f":"IF(AND(C44<>0,D44<>0,E44<>0,F44<>0),F44-E44+D44-C44-M44-IF(E44-D44<Calendrier!$AT$10,Calendrier!$AT$10,0),IF(AND(C44<>0,D44<>0,E44=0,F44=0),D44-C44-M44,IF(AND(C44=0,D44=0,E44<>0,F44<>0),F44-E44-M44,IF(AND(C44>20,D44=0,E44=0,F44<>0),24-C44+F44-M44,IF(AND(C44<>0,D44=0,E44=0,F44<>0),F44-C44-M44,0)))))","v":0},{"$f":"IF(G44=0,0,IF(K44=0.5,0,G44-Calendrier!$AT$9))","v":0},1.75,"Di",0,null,0]
["2023-02-27",{"$f":"INDIRECT(ADDRESS(MATCH($B$1,Calendrier!$A$15:$A$59,0)+14,ROW()-17,3,1,\"Calendrier\"),1)","v":"T"},null,null,null,null,{"$f":"IF(AND(C45<>0,D45<>0,E45<>0,F45<>0),F45-E45+D45-C45-M45-IF(E45-D45<Calendrier!$AT$10,Calendrier!$AT$10,0),IF(AND(C45<>0,D45<>0,E45=0,F45=0),D45-C45-M45,IF(AND(C45=0,D45=0,E45<>0,F45<>0),F45-E45-M45,IF(AND(C45>20,D45=0,E45=0,F45<>0),24-C45+F45-M45,IF(AND(C45<>0,D45=0,E45=0,F45<>0),F45-C45-M45,0)))))","v":0},{"$f":"IF(G45=0,0,IF(K45=0.5,0,G45-Calendrier!$AT$9))","v":0},1.75,"T",0,null,0]
["2023-02-28",{"$f":"INDIRECT(ADDRESS(MATCH($B$1,Calendrier!$A$15:$A$59,0)+14,ROW()-17,3,1,\"Calendrier\"),1)","v":"T"},null,null,null,null,{"$f":"IF(AND(C46<>0,D46<>0,E46<>0,F46<>0),F46-E46+D46-C46-M46-IF(E46-D46<Calendrier!$AT$10,Calendrier!$AT$10,0),IF(AND(C46<>0,D46<>0,E46=0,F46=0),D46-C46-M46,IF(AND(C46=0,D46=0,E46<>0,F46<>0),F46-E46-M46,IF(AND(C46>20,D46=0,E46=0,F46<>0),24-C46+F46-M46,IF(AND(C46<>0,D46=0,E46=0,F46<>0),F46-C46-M46,0)))))","v":0},{"$f":"IF(G46=0,0,IF(K46=0.5,0,G46-Calendrier!$AT$9))","v":0},1.75,"T",0,null,0]
[{"$f":"IF(MONTH(A46+1)=3,0,A46+1)","v":"00:00:00"},{"$f":"INDIRECT(ADDRESS(MATCH($B$1,Calendrier!$A$15:$A$59,0)+14,ROW()-17,3,1,\"Calendrier\"),1)","v":0},null,null,null,null,{"$f":"IF(AND(C47<>0,D47<>0,E47<>0,F47<>0),F47-E47+D47-C47-M47-IF(E47-D47<Calendrier!$AT$10,Calendrier!$AT$10,0),IF(AND(C47<>0,D47<>0,E47=0,F47=0),D47-C47-M47,IF(AND(C47=0,D47=0,E47<>0,F47<>0),F47-E47-M47,IF(AND(C47>20,D47=0,E47=0,F47<>0),24-C47+F47-M47,IF(AND(C47<>0,D47=0,E47=0,F47<>0),F47-C47-M47,0)))))","v":0},{"$f":"IF(G47=0,0,IF(K47=0.5,0,G47-Calendrier!$AT$9))","v":0},1.75,0,0,null,0]
[null,{"$f":"INDIRECT(ADDRESS(MATCH($B$1,Calendrier!$A$15:$A$59,0)+14,ROW()-17,3,1,\"Calendrier\"),1)","v":0},null,null,null,null,{"$f":"IF(AND(C48<>0,D48<>0,E48<>0,F48<>0),F48-E48+D48-C48-M48-IF(E48-D48<Calendrier!$AT$10,Calendrier!$AT$10,0),IF(AND(C48<>0,D48<>0,E48=0,F48=0),D48-C48-M48,IF(AND(C48=0,D48=0,E48<>0,F48<>0),F48-E48-M48,IF(AND(C48>20,D48=0,E48=0,F48<>0),24-C48+F48-M48,IF(AND(C48<>0,D48=0,E48=0,F48<>0),F48-C48-M48,0)))))","v":0},{"$f":"IF(G48=0,0,IF(K48=0.5,0,G48-Calendrier!$AT$9))","v":0},1.75,{"$f":"IF(AND(COUNTA(C48:F48)=0,OR(B48=\"F\",B48=\"CA\",WEEKDAY(A48,2)>5,B48=\"RTT\")),B48,IF(AND(COUNTA(C48:F48)=0,B48=\"T\"),\"\",IF(AND(COUNTA(D48:F48)=0,C48<>0),\"erreur\",IF(AND(COUNTA(C48:F48)=4,B48=\"RTT\"),\"Err. RTT\",IF(AND(COUNTA(C48:F48)=4,B48=\"CA\"),\"Err. CA\",IF(AND(COUNTA(C48:F48)=4,B48=\"F\"),\"Err. F\",IF(COUNTA(C48:F48)=4,\"T\",IF(COUNTA(C48:F48)=3,\"Erreur\",IF(AND(C48<>0,D48<>0),$F$12,IF(AND(E48<>0,F48<>0),$F$12,IF(AND(C48<>0,D48=0,E48=0,F48<>0,WEEKDAY(A48,2)>5),\"Modif  calendrier\",IF(AND(C48<>0,D48=0,E48=0,F48<>0),$B48))))))))))))","v":0},0,null,0]
[null,{"$f":"INDIRECT(ADDRESS(MATCH($B$1,Calendrier!$A$15:$A$59,0)+14,ROW()-17,3,1,\"Calendrier\"),1)","v":0},null,null,null,null,{"$f":"IF(AND(C49<>0,D49<>0,E49<>0,F49<>0),F49-E49+D49-C49-M49-IF(E49-D49<Calendrier!$AT$10,Calendrier!$AT$10,0),IF(AND(C49<>0,D49<>0,E49=0,F49=0),D49-C49-M49,IF(AND(C49=0,D49=0,E49<>0,F49<>0),F49-E49-M49,IF(AND(C49>20,D49=0,E49=0,F49<>0),24-C49+F49-M49,IF(AND(C49<>0,D49=0,E49=0,F49<>0),F49-C49-M49,0)))))","v":0},{"$f":"IF(G49=0,0,IF(K49=0.5,0,G49-Calendrier!$AT$9))","v":0},1.75,0,0,null,0]
[null,null,null,null,null,null,{"$f":"SUM(G19:G49)","v":0},null,{"$f":"I49","v":1.75}]

{"sheet":"MAR","index":5,"n_rows":50,"n_cols":15,"rows_kept":50,"cut":false,"hidden":false,"merged":[]}
[null,{"$f":"RIGHT(CELL(\"nomfichier\",$A$1),3)","v":"MAR"},"FICHE DE SUIVI HORAIRE"]
[]
[null,"mois :","MARS",null,null,"année ",{"$f":"VLOOKUP(C3,Fériés!$I$1:$J$12,2,FALSE)","v":2023},null,null,"service",{"$f":"Calendrier!F4","v":"Administratif"}]
[]
[null,"nom :",{"$f":"Calendrier!F2","v":"Isq"},null,null," prénom ",{"$f":"Calendrier!F3","v":"Philippe"},null,null,"N° Ident",{"$f":"Calendrier!F1","v":"T506489"}]
[null,null,null,null,null,null,null,"à réaliser","cumul","en cours","reste",null,"N.cumul"]
[null,null,null,"Nb J",{"$f":"Calendrier!$AT$11","v":218},{"$f":"+$H$10","v":0},{"$f":"E7-F7","v":218},{"$f":"Calendrier!N1","v":365},{"$f":"FEV!M7","v":55.5},{"$f":"SUM(J8:J15)","v":31},{"$f":"H7-(I7+J7)","v":278.5},null,{"$f":"SUM(M8:M15)","v":86.5}]
[null,null,null,null,null,"1/2CA","CA",{"$f":"Calendrier!N5","v":25},{"$f":"FEV!M8","v":0},{"$f":"COUNTIF($J$19:$J$49,G8)+COUNTIF($J$19:$J$49,F8)/2","v":0},{"$f":"+H8-(I8+J8)","v":25},"J",{"$f":"+I8+J8","v":0}]
[null,null,null,null,null,"1/2RTT","RTT",{"$f":"Calendrier!N8","v":9},{"$f":"FEV!M9","v":2},{"$f":"COUNTIF($J$19:$J$49,G9)+COUNTIF($J$19:$J$49,F9)/2","v":0},{"$f":"+H9-(I9+J9)","v":7},"J",2]
[null,null,null,null,null,"1/2CS","CS",{"$f":"Calendrier!N9","v":0},{"$f":"FEV!M10","v":0},0,{"$f":"H10-(I10+J10)","v":0},"J",0]
[null,null,null,null,null,"1/2CP","CP",{"$f":"Calendrier!N6","v":0},{"$f":"FEV!M11","v":0},0,{"$f":"H11-(I11+J11)","v":0},"J",0]
[null,null,null,null,null,"1/2T","T",{"$f":"Calendrier!N7","v":218},{"$f":"FEV!M12","v":36.5},23,{"$f":"+H12-(I12+J12)","v":158.5},"J",59.5]
[null,null,null,null,null,0,"Sa",{"$f":"Calendrier!N4","v":51},{"$f":"FEV!M13","v":8},{"$f":"COUNTIF($J$19:$J$49,G13)","v":4},{"$f":"+H13-(I13+J13)","v":39},"J",12]
[null,null,null,null,null,0,"Di",{"$f":"Calendrier!N3","v":50},{"$f":"FEV!M14","v":8},{"$f":"COUNTIF($J$19:$J$49,G14)","v":4},{"$f":"+H14-(I14+J14)","v":38},"J",12]
[null,null,null,null,null,0,"F",{"$f":"Calendrier!N2","v":12},{"$f":"FEV!M15","v":1},{"$f":"COUNTIF($J$19:$J$49,G15)","v":0},{"$f":"+H15-(I15+J15)","v":11},"J",1]
[null,null,null,null,null,null,"heure/avance fin mois",null,{"$f":"FEV!$I$50","v":1.75},null,null,null,{"$f":"I50","v":1.75},"avec bon"]
[null,"Prévu","Entrée","Sortie","Entrée","Sortie","total","variation","cumul","Type","nb J/T",null,"divers E/S","Sortie","Retour"]
[null,null,null,null,null,null,null,null,{"$f":"FEV!$I$50","v":1.75}]
[{"$f":"VALUE(\"01/03/\"&G3)","v":"2023-03-01"},{"$f":"INDIRECT(ADDRESS(MATCH($B$1,Calendrier!$A$15:$A$59,0)+14,ROW()-17,3,1,\"Calendrier\"),1)","v":"T"},null,null,null,null,{"$f":"IF(AND(C19<>0,D19<>0,E19<>0,F19<>0),F19-E19+D19-C19-K19-IF(E19-D19<Calendrier!$AT$10,Calendrier!$AT$10,0),IF(AND(C19<>0,D19<>0,E19=0,F19=0),D19-C19-K19,IF(AND(C19=0,D19=0,E19<>0,F19<>0),F19-E19-K19,IF(AND(C19>20,D19=0,E19=0,F19<>0),24-C19+F19-K19,IF(AND(C19<>0,D19=0,E19=0,F19<>0),F19-C19-K19,0)))))","v":0},{"$f":"IF(G19=0,0,IF(K19=0.5,0,G19-Calendrier!$AT$9))","v":0},{"$f":"I18+H19","v":1.75},{"$f":"IF(AND(COUNTA(C19:F19)=0,OR(B19=\"F\",WEEKDAY(A19,2)>5,B19=\"T\",B19=\"RTT\",B19=\"CA\")),B19,IF(AND(COUNTA(C19:F19)>=2,OR(B19=\"F\",B19=\"RTT\",B19=\"CA\",B19=\"Sa\",B19=\"Di\")),\"calendrier\",IF(AND(COUNTA(C19)+COUNTA(F19)=2,OR(COUNTA(C19:D19)<1,COUNTA(E19:F19)<1)),\"erreur\",IF(COUNTA(C19:F19)=3,\"en cours\",IF(COUNTA(C19:F19)=4,B19,IF(OR(AND(C19<>0,D19<>0),AND(E19<>0,F19<>0)),$F$12,IF(AND(C19<>0,D19=0,E19=0,F19<>0,WEEKDAY(A19,2)>5),\"calendrier\",IF(AND(C19<>0,D19=0,E19=0,F19<>0),$B19,\"\"))))))))","v":"T"},{"$f":"IF(COUNTA(C19:F19)=4,1,IF(OR(AND(C19<>0,D19<>0),AND(E19<>0,F19<>0)),0.5,IF(AND(C19<>0,F19<>0,D19=0,E19=0,B19=\"T\"),1,0)))","v":0},null,{"$f":"IF(OR(N19=0,O19=0),0,O19-N19)","v":0}]
[{"$f":"A19+1","v":"2023-03-02"},{"$f":"INDIRECT(ADDRESS(MATCH($B$1,Calendrier!$A$15:$A$59,0)+14,ROW()-17,3,1,\"Calendrier\"),1)","v":"T"},null,null,null,null,{"$f":"IF(AND(C20<>0,D20<>0,E20<>0,F20<>0),F20-E20+D20-C20-K20-IF(E20-D20<Calendrier!$AT$10,Calendrier!$AT$10,0),IF(AND(C20<>0,D20<>0,E20=0,F20=0),D20-C20-K20,IF(AND(C20=0,D20=0,E20<>0,F20<>0),F20-E20-K20,IF(AND(C20>20,D20=0,E20=0,F20<>0),24-C20+F20-K20,IF(AND(C20<>0,D20=0,E20=0,F20<>0),F20-C20-K20,0)))))","v":0},{"$f":"IF(G20=0,0,IF(K20=0.5,0,G20-Calendrier!$AT$9))","v":0},1.75,"T",0,null,0]
[{"$f":"A20+1","v":"2023-03-03"},{"$f":"INDIRECT(ADDRESS(MATCH($B$1,Calendrier!$A$15:$A$59,0)+14,ROW()-17,3,1,\"Calendrier\"),1)","v":"T"},null,null,null,null,{"$f":"IF(AND(C21<>0,D21<>0,E21<>0,F21<>0),F21-E21+D21-C21-M21-IF(E21-D21<Calendrier!$AT$10,Calendrier!$AT$10,0),IF(AND(C21<>0,D21<>0,E21=0,F21=0),D21-C21-M21,IF(AND(C21=0,D21=0,E21<>0,F21<>0),F21-E21-M21,IF(AND(C21>20,D21=0,E21=0,F21<>0),24-C21+F21-M21,IF(AND(C21<>0,D21=0,E21=0,F21<>0),F21-C21-M21,0)))))","v":0},{"$f":"IF(G21=0,0,IF(K21=0.5,0,G21-Calendrier!$AT$9))","v":0},{"$f":"I20+H21","v":1.75},"T",0,null,0]
["2023-03-04",{"$f":"INDIRECT(ADDRESS(MATCH($B$1,Calendrier!$A$15:$A$59,0)+14,ROW()-17,3,1,\"Calendrier\"),1)","v":"Sa"},null,null,null,null,{"$f":"IF(AND(C22<>0,D22<>0,E22<>0,F22<>0),F22-E22+D22-C22-M22-IF(E22-D22<Calendrier!$AT$10,Calendrier!$AT$10,0),IF(AND(C22<>0,D22<>0,E22=0,F22=0),D22-C22-M22,IF(AND(C22=0,D22=0,E22<>0,F22<>0),F22-E22-M22,IF(AND(C22>20,D22=0,E22=0,F22<>0),24-C22+F22-M22,IF(AND(C22<>0,D22=0,E22=0,F22<>0),F22-C22-M22,0)))))","v":0},{"$f":"IF(G22=0,0,IF(K22=0.5,0,G22-Calendrier!$AT$9))","v":0},1.75,"Sa",0,null,0]
["2023-03-05",{"$f":"INDIRECT(ADDRESS(MATCH($B$1,Calendrier!$A$15:$A$59,0)+14,ROW()-17,3,1,\"Calendrier\"),1)","v":"Di"},null,null,null,null,{"$f":"IF(AND(C23<>0,D23<>0,E23<>0,F23<>0),F23-E23+D23-C23-M23-IF(E23-D23<Calendrier!$AT$10,Calendrier!$AT$10,0),IF(AND(C23<>0,D23<>0,E23=0,F23=0),D23-C23-M23,IF(AND(C23=0,D23=0,E23<>0,F23<>0),F23-E23-M23,IF(AND(C23>20,D23=0,E23=0,F23<>0),24-C23+F23-M23,IF(AND(C23<>0,D23=0,E23=0,F23<>0),F23-C23-M23,0)))))","v":0},{"$f":"IF(G23=0,0,IF(K23=0.5,0,G23-Calendrier!$AT$9))","v":0},1.75,"Di",0,null,0]
["2023-03-06",{"$f":"INDIRECT(ADDRESS(MATCH($B$1,Calendrier!$A$15:$A$59,0)+14,ROW()-17,3,1,\"Calendrier\"),1)","v":"T"},null,null,null,null,{"$f":"IF(AND(C24<>0,D24<>0,E24<>0,F24<>0),F24-E24+D24-C24-M24-IF(E24-D24<Calendrier!$AT$10,Calendrier!$AT$10,0),IF(AND(C24<>0,D24<>0,E24=0,F24=0),D24-C24-M24,IF(AND(C24=0,D24=0,E24<>0,F24<>0),F24-E24-M24,IF(AND(C24>20,D24=0,E24=0,F24<>0),24-C24+F24-M24,IF(AND(C24<>0,D24=0,E24=0,F24<>0),F24-C24-M24,0)))))","v":0},{"$f":"IF(G24=0,0,IF(K24=0.5,0,G24-Calendrier!$AT$9))","v":0},1.75,"T",0,null,{"$f":"IF(OR(N24=0,O24=0),0,O24-N24)","v":0}]
["2023-03-07",{"$f":"INDIRECT(ADDRESS(MATCH($B$1,Calendrier!$A$15:$A$59,0)+14,ROW()-17,3,1,\"Calendrier\"),1)","v":"T"},null,null,null,null,{"$f":"IF(AND(C25<>0,D25<>0,E25<>0,F25<>0),F25-E25+D25-C25-M25-IF(E25-D25<Calendrier!$AT$10,Calendrier!$AT$10,0),IF(AND(C25<>0,D25<>0,E25=0,F25=0),D25-C25-M25,IF(AND(C25=0,D25=0,E25<>0,F25<>0),F25-E25-M25,IF(AND(C25>20,D25=0,E25=0,F25<>0),24-C25+F25-M25,IF(AND(C25<>0,D25=0,E25=0,F25<>0),F25-C25-M25,0)))))","v":0},{"$f":"IF(G25=0,0,IF(K25=0.5,0,G25-Calendrier!$AT$9))","v":0},1.75,"T",0,null,{"$f":"IF(OR(N25=0,O25=0),0,O25-N25)","v":0}]
["2023-03-08",{"$f":"INDIRECT(ADDRESS(MATCH($B$1,Calendrier!$A$15:$A$59,0)+14,ROW()-17,3,1,\"Calendrier\"),1)","v":"T"},null,null,null,null,{"$f":"IF(AND(C26<>0,D26<>0,E26<>0,F26<>0),F26-E26+D26-C26-M26-IF(E26-D26<Calendrier!$AT$10,Calendrier!$AT$10,0),IF(AND(C26<>0,D26<>0,E26=0,F26=0),D26-C26-M26,IF(AND(C26=0,D26=0,E26<>0,F26<>0),F26-E26-M26,IF(AND(C26>20,D26=0,E26=0,F26<>0),24-C26+F26-M26,IF(AND(C26<>0,D26=0,E26=0,F26<>0),F26-C26-M26,0)))))","v":0},{"$f":"IF(G26=0,0,IF(K26=0.5,0,G26-Calendrier!$AT$9))","v":0},1.75,"T",0,null,0]
["2023-03-09",{"$f":"INDIRECT(ADDRESS(MATCH($B$1,Calendrier!$A$15:$A$59,0)+14,ROW()-17,3,1,\"Calendrier\"),1)","v":"T"},null,null,null,null,{"$f":"IF(AND(C27<>0,D27<>0,E27<>0,F27<>0),F27-E27+D27-C27-M27-IF(E27-D27<Calendrier!$AT$10,Calendrier!$AT$10,0),IF(AND(C27<>0,D27<>0,E27=0,F27=0),D27-C27-M27,IF(AND(C27=0,D27=0,E27<>0,F27<>0),F27-E27-M27,IF(AND(C27>20,D27=0,E27=0,F27<>0),24-C27+F27-M27,IF(AND(C27<>0,D27=0,E27=0,F27<>0),F27-C27-M27,0)))))","v":0},{"$f":"IF(G27=0,0,IF(K27=0.5,0,G27-Calendrier!$AT$9))","v":0},1.75,"T",0,null,0]
["2023-03-10",{"$f":"INDIRECT(ADDRESS(MATCH($B$1,Calendrier!$A$15:$A$59,0)+14,ROW()-17,3,1,\"Calendrier\"),1)","v":"T"},null,null,null,null,{"$f":"IF(AND(C28<>0,D28<>0,E28<>0,F28<>0),F28-E28+D28-C28-M28-IF(E28-D28<Calendrier!$AT$10,Calendrier!$AT$10,0),IF(AND(C28<>0,D28<>0,E28=0,F28=0),D28-C28-M28,IF(AND(C28=0,D28=0,E28<>0,F28<>0),F28-E28-M28,IF(AND(C28>20,D28=0,E28=0,F28<>0),24-C28+F28-M28,IF(AND(C28<>0,D28=0,E28=0,F28<>0),F28-C28-M28,0)))))","v":0},{"$f":"IF(G28=0,0,IF(K28=0.5,0,G28-Calendrier!$AT$9))","v":0},1.75,"T",0,null,0]
["2023-03-11",{"$f":"INDIRECT(ADDRESS(MATCH($B$1,Calendrier!$A$15:$A$59,0)+14,ROW()-17,3,1,\"Calendrier\"),1)","v":"Sa"},null,null,null,null,{"$f":"IF(AND(C29<>0,D29<>0,E29<>0,F29<>0),F29-E29+D29-C29-M29-IF(E29-D29<Calendrier!$AT$10,Calendrier!$AT$10,0),IF(AND(C29<>0,D29<>0,E29=0,F29=0),D29-C29-M29,IF(AND(C29=0,D29=0,E29<>0,F29<>0),F29-E29-M29,IF(AND(C29>20,D29=0,E29=0,F29<>0),24-C29+F29-M29,IF(AND(C29<>0,D29=0,E29=0,F29<>0),F29-C29-M29,0)))))","v":0},{"$f":"IF(G29=0,0,IF(K29=0.5,0,G29-Calendrier!$AT$9))","v":0},1.75,"Sa",0,null,0]
["2023-03-12",{"$f":"INDIRECT(ADDRESS(MATCH($B$1,Calendrier!$A$15:$A$59,0)+14,ROW()-17,3,1,\"Calendrier\"),1)","v":"Di"},null,null,null,null,{"$f":"IF(AND(C30<>0,D30<>0,E30<>0,F30<>0),F30-E30+D30-C30-M30-IF(E30-D30<Calendrier!$AT$10,Calendrier!$AT$10,0),IF(AND(C30<>0,D30<>0,E30=0,F30=0),D30-C30-M30,IF(AND(C30=0,D30=0,E30<>0,F30<>0),F30-E30-M30,IF(AND(C30>20,D30=0,E30=0,F30<>0),24-C30+F30-M30,IF(AND(C30<>0,D30=0,E30=0,F30<>0),F30-C30-M30,0)))))","v":0},{"$f":"IF(G30=0,0,IF(K30=0.5,0,G30-Calendrier!$AT$9))","v":0},1.75,"Di",0,null,0]
["2023-03-13",{"$f":"INDIRECT(ADDRESS(MATCH($B$1,Calendrier!$A$15:$A$59,0)+14,ROW()-17,3,1,\"Calendrier\"),1)","v":"T"},null,null,null,null,{"$f":"IF(AND(C31<>0,D31<>0,E31<>0,F31<>0),F31-E31+D31-C31-M31-IF(E31-D31<Calendrier!$AT$10,Calendrier!$AT$10,0),IF(AND(C31<>0,D31<>0,E31=0,F31=0),D31-C31-M31,IF(AND(C31=0,D31=0,E31<>0,F31<>0),F31-E31-M31,IF(AND(C31>20,D31=0,E31=0,F31<>0),24-C31+F31-M31,IF(AND(C31<>0,D31=0,E31=0,F31<>0),F31-C31-M31,0)))))","v":0},{"$f":"IF(G31=0,0,IF(K31=0.5,0,G31-Calendrier!$AT$9))","v":0},1.75,"T",0,null,0]
["2023-03-14",{"$f":"INDIRECT(ADDRESS(MATCH($B$1,Calendrier!$A$15:$A$59,0)+14,ROW()-17,3,1,\"Calendrier\"),1)","v":"T"},null,null,null,null,{"$f":"IF(AND(C32<>0,D32<>0,E32<>0,F32<>0),F32-E32+D32-C32-M32-IF(E32-D32<Calendrier!$AT$10,Calendrier!$AT$10,0),IF(AND(C32<>0,D32<>0,E32=0,F32=0),D32-C32-M32,IF(AND(C32=0,D32=0,E32<>0,F32<>0),F32-E32-M32,IF(AND(C32>20,D32=0,E32=0,F32<>0),24-C32+F32-M32,IF(AND(C32<>0,D32=0,E32=0,F32<>0),F32-C32-M32,0)))))","v":0},{"$f":"IF(G32=0,0,IF(K32=0.5,0,G32-Calendrier!$AT$9))","v":0},1.75,"T",0,null,0]
["2023-03-15",{"$f":"INDIRECT(ADDRESS(MATCH($B$1,Calendrier!$A$15:$A$59,0)+14,ROW()-17,3,1,\"Calendrier\"),1)","v":"T"},null,null,null,null,{"$f":"IF(AND(C33<>0,D33<>0,E33<>0,F33<>0),F33-E33+D33-C33-M33-IF(E33-D33<Calendrier!$AT$10,Calendrier!$AT$10,0),IF(AND(C33<>0,D33<>0,E33=0,F33=0),D33-C33-M33,IF(AND(C33=0,D33=0,E33<>0,F33<>0),F33-E33-M33,IF(AND(C33>20,D33=0,E33=0,F33<>0),24-C33+F33-M33,IF(AND(C33<>0,D33=0,E33=0,F33<>0),F33-C33-M33,0)))))","v":0},{"$f":"IF(G33=0,0,IF(K33=0.5,0,G33-Calendrier!$AT$9))","v":0},1.75,"T",0,null,0]
["2023-03-16",{"$f":"INDIRECT(ADDRESS(MATCH($B$1,Calendrier!$A$15:$A$59,0)+14,ROW()-17,3,1,\"Calendrier\"),1)","v":"T"},null,null,null,null,{"$f":"IF(AND(C34<>0,D34<>0,E34<>0,F34<>0),F34-E34+D34-C34-M34-IF(E34-D34<Calendrier!$AT$10,Calendrier!$AT$10,0),IF(AND(C34<>0,D34<>0,E34=0,F34=0),D34-C34-M34,IF(AND(C34=0,D34=0,E34<>0,F34<>0),F34-E34-M34,IF(AND(C34>20,D34=0,E34=0,F34<>0),24-C34+F34-M34,IF(AND(C34<>0,D34=0,E34=0,F34<>0),F34-C34-M34,0)))))","v":0},{"$f":"IF(G34=0,0,IF(K34=0.5,0,G34-Calendrier!$AT$9))","v":0},1.75,{"$f":"IF(AND(COUNTA(C34:F34)=0,OR(B34=\"F\",WEEKDAY(A34,2)>5,B34=\"T\",B34=\"RTT\",B34=\"CA\")),B34,IF(AND(COUNTA(C34:F34)>=2,OR(B34=\"F\",B34=\"RTT\",B34=\"CA\",B34=\"Sa\",B34=\"Di\")),\"calendrier\",IF(AND(COUNTA(C34)+COUNTA(F34)=2,OR(COUNTA(C34:D34)<1,COUNTA(E34:F34)<1)),\"erreur\",IF(COUNTA(C34:F34)=3,\"en cours\",IF(COUNTA(C34:F34)=4,B34,IF(OR(AND(C34<>0,D34<>0),AND(E34<>0,F34<>0)),$F$12,IF(AND(C34<>0,D34=0,E34=0,F34<>0,WEEKDAY(A34,2)>5),\"calendrier\",IF(AND(C34<>0,D34=0,E34=0,F34<>0),$B34,\"\"))))))))","v":"T"},0,null,0]
["2023-03-17",{"$f":"INDIRECT(ADDRESS(MATCH($B$1,Calendrier!$A$15:$A$59,0)+14,ROW()-17,3,1,\"Calendrier\"),1)","v":"T"},null,null,null,null,{"$f":"IF(AND(C35<>0,D35<>0,E35<>0,F35<>0),F35-E35+D35-C35-M35-IF(E35-D35<Calendrier!$AT$10,Calendrier!$AT$10,0),IF(AND(C35<>0,D35<>0,E35=0,F35=0),D35-C35-M35,IF(AND(C35=0,D35=0,E35<>0,F35<>0),F35-E35-M35,IF(AND(C35>20,D35=0,E35=0,F35<>0),24-C35+F35-M35,IF(AND(C35<>0,D35=0,E35=0,F35<>0),F35-C35-M35,0)))))","v":0},{"$f":"IF(G35=0,0,IF(K35=0.5,0,G35-Calendrier!$AT$9))","v":0},1.75,"T",0,null,0]
["2023-03-18",{"$f":"INDIRECT(ADDRESS(MATCH($B$1,Calendrier!$A$15:$A$59,0)+14,ROW()-17,3,1,\"Calendrier\"),1)","v":"Sa"},null,null,null,null,{"$f":"IF(AND(C36<>0,D36<>0,E36<>0,F36<>0),F36-E36+D36-C36-M36-IF(E36-D36<Calendrier!$AT$10,Calendrier!$AT$10,0),IF(AND(C36<>0,D36<>0,E36=0,F36=0),D36-C36-M36,IF(AND(C36=0,D36=0,E36<>0,F36<>0),F36-E36-M36,IF(AND(C36>20,D36=0,E36=0,F36<>0),24-C36+F36-M36,IF(AND(C36<>0,D36=0,E36=0,F36<>0),F36-C36-M36,0)))))","v":0},{"$f":"IF(G36=0,0,IF(K36=0.5,0,G36-Calendrier!$AT$9))","v":0},1.75,"Sa",0,null,0]
["2023-03-19",{"$f":"INDIRECT(ADDRESS(MATCH($B$1,Calendrier!$A$15:$A$59,0)+14,ROW()-17,3,1,\"Calendrier\"),1)","v":"Di"},null,null,null,null,{"$f":"IF(AND(C37<>0,D37<>0,E37<>0,F37<>0),F37-E37+D37-C37-M37-IF(E37-D37<Calendrier!$AT$10,Calendrier!$AT$10,0),IF(AND(C37<>0,D37<>0,E37=0,F37=0),D37-C37-M37,IF(AND(C37=0,D37=0,E37<>0,F37<>0),F37-E37-M37,IF(AND(C37>20,D37=0,E37=0,F37<>0),24-C37+F37-M37,IF(AND(C37<>0,D37=0,E37=0,F37<>0),F37-C37-M37,0)))))","v":0},{"$f":"IF(G37=0,0,IF(K37=0.5,0,G37-Calendrier!$AT$9))","v":0},1.75,"Di",0,null,0]
["2023-03-20",{"$f":"INDIRECT(ADDRESS(MATCH($B$1,Calendrier!$A$15:$A$59,0)+14,ROW()-17,3,1,\"Calendrier\"),1)","v":"T"},null,null,null,null,{"$f":"IF(AND(C38<>0,D38<>0,E38<>0,F38<>0),F38-E38+D38-C38-M38-IF(E38-D38<Calendrier!$AT$10,Calendrier!$AT$10,0),IF(AND(C38<>0,D38<>0,E38=0,F38=0),D38-C38-M38,IF(AND(C38=0,D38=0,E38<>0,F38<>0),F38-E38-M38,IF(AND(C38>20,D38=0,E38=0,F38<>0),24-C38+F38-M38,IF(AND(C38<>0,D38=0,E38=0,F38<>0),F38-C38-M38,0)))))","v":0},{"$f":"IF(G38=0,0,IF(K38=0.5,0,G38-Calendrier!$AT$9))","v":0},1.75,"T",0,null,0]
["2023-03-21",{"$f":"INDIRECT(ADDRESS(MATCH($B$1,Calendrier!$A$15:$A$59,0)+14,ROW()-17,3,1,\"Calendrier\"),1)","v":"T"},null,null,null,null,{"$f":"IF(AND(C39<>0,D39<>0,E39<>0,F39<>0),F39-E39+D39-C39-M39-IF(E39-D39<Calendrier!$AT$10,Calendrier!$AT$10,0),IF(AND(C39<>0,D39<>0,E39=0,F39=0),D39-C39-M39,IF(AND(C39=0,D39=0,E39<>0,F39<>0),F39-E39-M39,IF(AND(C39>20,D39=0,E39=0,F39<>0),24-C39+F39-M39,IF(AND(C39<>0,D39=0,E39=0,F39<>0),F39-C39-M39,0)))))","v":0},{"$f":"IF(G39=0,0,IF(K39=0.5,0,G39-Calendrier!$AT$9))","v":0},1.75,"T",0,null,0]
["2023-03-22",{"$f":"INDIRECT(ADDRESS(MATCH($B$1,Calendrier!$A$15:$A$59,0)+14,ROW()-17,3,1,\"Calendrier\"),1)","v":"T"},null,null,null,null,{"$f":"IF(AND(C40<>0,D40<>0,E40<>0,F40<>0),F40-E40+D40-C40-M40-IF(E40-D40<Calendrier!$AT$10,Calendrier!$AT$10,0),IF(AND(C40<>0,D40<>0,E40=0,F40=0),D40-C40-M40,IF(AND(C40=0,D40=0,E40<>0,F40<>0),F40-E40-M40,IF(AND(C40>20,D40=0,E40=0,F40<>0),24-C40+F40-M40,IF(AND(C40<>0,D40=0,E40=0,F40<>0),F40-C40-M40,0)))))","v":0},{"$f":"IF(G40=0,0,IF(K40=0.5,0,G40-Calendrier!$AT$9))","v":0},1.75,"T",0,null,0]
["2023-03-23",{"$f":"INDIRECT(ADDRESS(MATCH($B$1,Calendrier!$A$15:$A$59,0)+14,ROW()-17,3,1,\"Calendrier\"),1)","v":"T"},null,null,null,null,{"$f":"IF(AND(C41<>0,D41<>0,E41<>0,F41<>0),F41-E41+D41-C41-M41-IF(E41-D41<Calendrier!$AT$10,Calendrier!$AT$10,0),IF(AND(C41<>0,D41<>0,E41=0,F41=0),D41-C41-M41,IF(AND(C41=0,D41=0,E41<>0,F41<>0),F41-E41-M41,IF(AND(C41>20,D41=0,E41=0,F41<>0),24-C41+F41-M41,IF(AND(C41<>0,D41=0,E41=0,F41<>0),F41-C41-M41,0)))))","v":0},{"$f":"IF(G41=0,0,IF(K41=0.5,0,G41-Calendrier!$AT$9))","v":0},1.75,"T",0,null,0]
["2023-03-24",{"$f":"INDIRECT(ADDRESS(MATCH($B$1,Calendrier!$A$15:$A$59,0)+14,ROW()-17,3,1,\"Calendrier\"),1)","v":"T"},null,null,null,null,{"$f":"IF(AND(C42<>0,D42<>0,E42<>0,F42<>0),F42-E42+D42-C42-M42-IF(E42-D42<Calendrier!$AT$10,Calendrier!$AT$10,0),IF(AND(C42<>0,D42<>0,E42=0,F42=0),D42-C42-M42,IF(AND(C42=0,D42=0,E42<>0,F42<>0),F42-E42-M42,IF(AND(C42>20,D42=0,E42=0,F42<>0),24-C42+F42-M42,IF(AND(C42<>0,D42=0,E42=0,F42<>0),F42-C42-M42,0)))))","v":0},{"$f":"IF(G42=0,0,IF(K42=0.5,0,G42-Calendrier!$AT$9))","v":0},1.75,"T",0,null,0]
["2023-03-25",{"$f":"INDIRECT(ADDRESS(MATCH($B$1,Calendrier!$A$15:$A$59,0)+14,ROW()-17,3,1,\"Calendrier\"),1)","v":"Sa"},null,null,null,null,{"$f":"IF(AND(C43<>0,D43<>0,E43<>0,F43<>0),F43-E43+D43-C43-M43-IF(E43-D43<Calendrier!$AT$10,Calendrier!$AT$10,0),IF(AND(C43<>0,D43<>0,E43=0,F43=0),D43-C43-M43,IF(AND(C43=0,D43=0,E43<>0,F43<>0),F43-E43-M43,IF(AND(C43>20,D43=0,E43=0,F43<>0),24-C43+F43-M43,IF(AND(C43<>0,D43=0,E43=0,F43<>0),F43-C43-M43,0)))))","v":0},{"$f":"IF(G43=0,0,IF(K43=0.5,0,G43-Calendrier!$AT$9))","v":0},1.75,"Sa",0,null,0]
["2023-03-26",{"$f":"INDIRECT(ADDRESS(MATCH($B$1,Calendrier!$A$15:$A$59,0)+14,ROW()-17,3,1,\"Calendrier\"),1)","v":"Di"},null,null,null,null,{"$f":"IF(AND(C44<>0,D44<>0,E44<>0,F44<>0),F44-E44+D44-C44-M44-IF(E44-D44<Calendrier!$AT$10,Calendrier!$AT$10,0),IF(AND(C44<>0,D44<>0,E44=0,F44=0),D44-C44-M44,IF(AND(C44=0,D44=0,E44<>0,F44<>0),F44-E44-M44,IF(AND(C44>20,D44=0,E44=0,F44<>0),24-C44+F44-M44,IF(AND(C44<>0,D44=0,E44=0,F44<>0),F44-C44-M44,0)))))","v":0},{"$f":"IF(G44=0,0,IF(K44=0.5,0,G44-Calendrier!$AT$9))","v":0},1.75,"Di",0,null,0]
["2023-03-27",{"$f":"INDIRECT(ADDRESS(MATCH($B$1,Calendrier!$A$15:$A$59,0)+14,ROW()-17,3,1,\"Calendrier\"),1)","v":"T"},null,null,null,null,{"$f":"IF(AND(C45<>0,D45<>0,E45<>0,F45<>0),F45-E45+D45-C45-M45-IF(E45-D45<Calendrier!$AT$10,Calendrier!$AT$10,0),IF(AND(C45<>0,D45<>0,E45=0,F45=0),D45-C45-M45,IF(AND(C45=0,D45=0,E45<>0,F45<>0),F45-E45-M45,IF(AND(C45>20,D45=0,E45=0,F45<>0),24-C45+F45-M45,IF(AND(C45<>0,D45=0,E45=0,F45<>0),F45-C45-M45,0)))))","v":0},{"$f":"IF(G45=0,0,IF(K45=0.5,0,G45-Calendrier!$AT$9))","v":0},1.75,"T",0,null,0]
["2023-03-28",{"$f":"INDIRECT(ADDRESS(MATCH($B$1,Calendrier!$A$15:$A$59,0)+14,ROW()-17,3,1,\"Calendrier\"),1)","v":"T"},null,null,null,null,{"$f":"IF(AND(C46<>0,D46<>0,E46<>0,F46<>0),F46-E46+D46-C46-M46-IF(E46-D46<Calendrier!$AT$10,Calendrier!$AT$10,0),IF(AND(C46<>0,D46<>0,E46=0,F46=0),D46-C46-M46,IF(AND(C46=0,D46=0,E46<>0,F46<>0),F46-E46-M46,IF(AND(C46>20,D46=0,E46=0,F46<>0),24-C46+F46-M46,IF(AND(C46<>0,D46=0,E46=0,F46<>0),F46-C46-M46,0)))))","v":0},{"$f":"IF(G46=0,0,IF(K46=0.5,0,G46-Calendrier!$AT$9))","v":0},1.75,"T",0,null,0]
["2023-03-29",{"$f":"INDIRECT(ADDRESS(MATCH($B$1,Calendrier!$A$15:$A$59,0)+14,ROW()-17,3,1,\"Calendrier\"),1)","v":"T"},null,null,null,null,{"$f":"IF(AND(C47<>0,D47<>0,E47<>0,F47<>0),F47-E47+D47-C47-M47-IF(E47-D47<Calendrier!$AT$10,Calendrier!$AT$10,0),IF(AND(C47<>0,D47<>0,E47=0,F47=0),D47-C47-M47,IF(AND(C47=0,D47=0,E47<>0,F47<>0),F47-E47-M47,IF(AND(C47>20,D47=0,E47=0,F47<>0),24-C47+F47-M47,IF(AND(C47<>0,D47=0,E47=0,F47<>0),F47-C47-M47,0)))))","v":0},{"$f":"IF(G47=0,0,IF(K47=0.5,0,G47-Calendrier!$AT$9))","v":0},1.75,"T",0,null,0]
["2023-03-30",{"$f":"INDIRECT(ADDRESS(MATCH($B$1,Calendrier!$A$15:$A$59,0)+14,ROW()-17,3,1,\"Calendrier\"),1)","v":"T"},null,null,null,null,{"$f":"IF(AND(C48<>0,D48<>0,E48<>0,F48<>0),F48-E48+D48-C48-M48-IF(E48-D48<Calendrier!$AT$10,Calendrier!$AT$10,0),IF(AND(C48<>0,D48<>0,E48=0,F48=0),D48-C48-M48,IF(AND(C48=0,D48=0,E48<>0,F48<>0),F48-E48-M48,IF(AND(C48>20,D48=0,E48=0,F48<>0),24-C48+F48-M48,IF(AND(C48<>0,D48=0,E48=0,F48<>0),F48-C48-M48,0)))))","v":0},{"$f":"IF(G48=0,0,IF(K48=0.5,0,G48-Calendrier!$AT$9))","v":0},1.75,"T",0,null,0]
["2023-03-31",{"$f":"INDIRECT(ADDRESS(MATCH($B$1,Calendrier!$A$15:$A$59,0)+14,ROW()-17,3,1,\"Calendrier\"),1)","v":"T"},null,null,null,null,{"$f":"IF(AND(C49<>0,D49<>0,E49<>0,F49<>0),F49-E49+D49-C49-M49-IF(E49-D49<Calendrier!$AT$10,Calendrier!$AT$10,0),IF(AND(C49<>0,D49<>0,E49=0,F49=0),D49-C49-M49,IF(AND(C49=0,D49=0,E49<>0,F49<>0),F49-E49-M49,IF(AND(C49>20,D49=0,E49=0,F49<>0),24-C49+F49-M49,IF(AND(C49<>0,D49=0,E49=0,F49<>0),F49-C49-M49,0)))))","v":0},{"$f":"IF(G49=0,0,IF(K49=0.5,0,G49-Calendrier!$AT$9))","v":0},1.75,"T",0,null,0]
[null,null,null,null,null,null,{"$f":"SUM(G19:G49)","v":0},null,{"$f":"I49","v":1.75}]

{"sheet":"AVR","index":6,"n_rows":52,"n_cols":15,"rows_kept":52,"cut":false,"hidden":false,"merged":[]}
[null,{"$f":"RIGHT(CELL(\"nomfichier\",$A$1),3)","v":"AVR"},"FICHE DE SUIVI HORAIRE"]
[]
[null,"mois :","AVRIL",null,null,"année ",{"$f":"VLOOKUP(C3,Fériés!$I$1:$J$12,2,FALSE)","v":2023},null,null,"service",{"$f":"Calendrier!F4","v":"Administratif"}]
[]
[null,"nom :",{"$f":"Calendrier!F2","v":"Isq"},null,null," prénom ",{"$f":"Calendrier!F3","v":"Philippe"},null,null,"N° Ident",{"$f":"Calendrier!F1","v":"T506489"}]
[null,null,null,null,null,null,null,"à réaliser","cumul","en cours","reste",null,"N.cumul"]
[null,null,null,"Nb J",{"$f":"Calendrier!$AT$11","v":218},{"$f":"+$H$10","v":0},{"$f":"E7-F7","v":218},{"$f":"Calendrier!N1","v":365},{"$f":"MAR!M7","v":86.5},{"$f":"SUM(J8:J15)","v":30},{"$f":"H7-(I7+J7)","v":248.5},null,{"$f":"SUM(M8:M15)","v":116.5}]
[null,null,null,null,null,"1/2CA","CA",{"$f":"Calendrier!N5","v":25},{"$f":"MAR!M8","v":0},{"$f":"COUNTIF($J$19:$J$49,G8)+COUNTIF($J$19:$J$49,F8)/2","v":0},{"$f":"+H8-(I8+J8)","v":25},"J",{"$f":"+I8+J8","v":0}]
[null,null,null,null,null,"1/2RTT","RTT",{"$f":"Calendrier!N8","v":9},{"$f":"MAR!M9","v":2},{"$f":"COUNTIF($J$19:$J$49,G9)+COUNTIF($J$19:$J$49,F9)/2","v":1},{"$f":"+H9-(I9+J9)","v":6},"J",3]
[null,null,null,null,null,"1/2CS","CS",{"$f":"Calendrier!N9","v":0},{"$f":"MAR!M10","v":0},0,{"$f":"H10-(I10+J10)","v":0},"J",0]
[null,null,null,null,null,"1/2CP","CP",{"$f":"Calendrier!N6","v":0},{"$f":"MAR!M11","v":0},0,{"$f":"H11-(I11+J11)","v":0},"J",0]
[null,null,null,null,null,"1/2T","T",{"$f":"Calendrier!N7","v":218},{"$f":"MAR!M12","v":59.5},18,{"$f":"+H12-(I12+J12)","v":140.5},"J",77.5]
[null,null,null,null,null,0,"Sa",{"$f":"Calendrier!N4","v":51},{"$f":"MAR!M13","v":12},{"$f":"COUNTIF($J$19:$J$49,G13)","v":5},{"$f":"+H13-(I13+J13)","v":34},"J",17]
[null,null,null,null,null,0,"Di",{"$f":"Calendrier!N3","v":50},{"$f":"MAR!M14","v":12},{"$f":"COUNTIF($J$19:$J$49,G14)","v":4},{"$f":"+H14-(I14+J14)","v":34},"J",16]
[null,null,null,null,null,0,"F",{"$f":"Calendrier!N2","v":12},{"$f":"MAR!M15","v":1},{"$f":"COUNTIF($J$19:$J$49,G15)","v":2},{"$f":"+H15-(I15+J15)","v":9},"J",3]
[null,null,null,null,null,null,"heure/avance fin mois",null,{"$f":"MAR!$I$50","v":1.75},null,null,null,{"$f":"I50","v":1.75},"avec bon"]
[null,"Prévu","Entrée","Sortie","Entrée","Sortie","total","variation","cumul","Type","nb J/T",null,"divers E/S","Sortie","Retour"]
[null,null,null,null,null,null,null,null,{"$f":"MAR!$I$50","v":1.75}]
[{"$f":"VALUE(\"01/04/\"&G3)","v":"2023-04-01"},{"$f":"INDIRECT(ADDRESS(MATCH($B$1,Calendrier!$A$15:$A$59,0)+14,ROW()-17,3,1,\"Calendrier\"),1)","v":"Sa"},null,null,null,null,{"$f":"IF(AND(C19<>0,D19<>0,E19<>0,F19<>0),F19-E19+D19-C19-K19-IF(E19-D19<Calendrier!$AT$10,Calendrier!$AT$10,0),IF(AND(C19<>0,D19<>0,E19=0,F19=0),D19-C19-K19,IF(AND(C19=0,D19=0,E19<>0,F19<>0),F19-E19-K19,IF(AND(C19>20,D19=0,E19=0,F19<>0),24-C19+F19-K19,IF(AND(C19<>0,D19=0,E19=0,F19<>0),F19-C19-K19,0)))))","v":0},{"$f":"IF(G19=0,0,IF(K19=0.5,0,G19-Calendrier!$AT$9))","v":0},{"$f":"I18+H19","v":1.75},{"$f":"IF(AND(COUNTA(C19:F19)=0,OR(B19=\"F\",WEEKDAY(A19,2)>5,B19=\"T\",B19=\"RTT\",B19=\"CA\")),B19,IF(AND(COUNTA(C19:F19)>=2,OR(B19=\"F\",B19=\"RTT\",B19=\"CA\",B19=\"Sa\",B19=\"Di\")),\"calendrier\",IF(AND(COUNTA(C19)+COUNTA(F19)=2,OR(COUNTA(C19:D19)<1,COUNTA(E19:F19)<1)),\"erreur\",IF(COUNTA(C19:F19)=3,\"en cours\",IF(COUNTA(C19:F19)=4,B19,IF(OR(AND(C19<>0,D19<>0),AND(E19<>0,F19<>0)),$F$12,IF(AND(C19<>0,D19=0,E19=0,F19<>0,WEEKDAY(A19,2)>5),\"calendrier\",IF(AND(C19<>0,D19=0,E19=0,F19<>0),$B19,\"\"))))))))","v":"Sa"},{"$f":"IF(COUNTA(C19:F19)=4,1,IF(OR(AND(C19<>0,D19<>0),AND(E19<>0,F19<>0)),0.5,IF(AND(C19<>0,F19<>0,D19=0,E19=0,B19=\"T\"),1,0)))","v":0},null,{"$f":"IF(OR(N19=0,O19=0),0,O19-N19)","v":0}]
[{"$f":"A19+1","v":"2023-04-02"},{"$f":"INDIRECT(ADDRESS(MATCH($B$1,Calendrier!$A$15:$A$59,0)+14,ROW()-17,3,1,\"Calendrier\"),1)","v":"Di"},null,null,null,null,{"$f":"IF(AND(C20<>0,D20<>0,E20<>0,F20<>0),F20-E20+D20-C20-K20-IF(E20-D20<Calendrier!$AT$10,Calendrier!$AT$10,0),IF(AND(C20<>0,D20<>0,E20=0,F20=0),D20-C20-K20,IF(AND(C20=0,D20=0,E20<>0,F20<>0),F20-E20-K20,IF(AND(C20>20,D20=0,E20=0,F20<>0),24-C20+F20-K20,IF(AND(C20<>0,D20=0,E20=0,F20<>0),F20-C20-K20,0)))))","v":0},{"$f":"IF(G20=0,0,IF(K20=0.5,0,G20-Calendrier!$AT$9))","v":0},1.75,"Di",0,null,0]
[{"$f":"A20+1","v":"2023-04-03"},{"$f":"INDIRECT(ADDRESS(MATCH($B$1,Calendrier!$A$15:$A$59,0)+14,ROW()-17,3,1,\"Calendrier\"),1)","v":"T"},null,null,null,null,{"$f":"IF(AND(C21<>0,D21<>0,E21<>0,F21<>0),F21-E21+D21-C21-M21-IF(E21-D21<Calendrier!$AT$10,Calendrier!$AT$10,0),IF(AND(C21<>0,D21<>0,E21=0,F21=0),D21-C21-M21,IF(AND(C21=0,D21=0,E21<>0,F21<>0),F21-E21-M21,IF(AND(C21>20,D21=0,E21=0,F21<>0),24-C21+F21-M21,IF(AND(C21<>0,D21=0,E21=0,F21<>0),F21-C21-M21,0)))))","v":0},{"$f":"IF(G21=0,0,IF(K21=0.5,0,G21-Calendrier!$AT$9))","v":0},{"$f":"I20+H21","v":1.75},"T",0,null,0]
["2023-04-04",{"$f":"INDIRECT(ADDRESS(MATCH($B$1,Calendrier!$A$15:$A$59,0)+14,ROW()-17,3,1,\"Calendrier\"),1)","v":"T"},null,null,null,null,{"$f":"IF(AND(C22<>0,D22<>0,E22<>0,F22<>0),F22-E22+D22-C22-M22-IF(E22-D22<Calendrier!$AT$10,Calendrier!$AT$10,0),IF(AND(C22<>0,D22<>0,E22=0,F22=0),D22-C22-M22,IF(AND(C22=0,D22=0,E22<>0,F22<>0),F22-E22-M22,IF(AND(C22>20,D22=0,E22=0,F22<>0),24-C22+F22-M22,IF(AND(C22<>0,D22=0,E22=0,F22<>0),F22-C22-M22,0)))))","v":0},{"$f":"IF(G22=0,0,IF(K22=0.5,0,G22-Calendrier!$AT$9))","v":0},1.75,"T",0,null,0]
["2023-04-05",{"$f":"INDIRECT(ADDRESS(MATCH($B$1,Calendrier!$A$15:$A$59,0)+14,ROW()-17,3,1,\"Calendrier\"),1)","v":"T"},null,null,null,null,{"$f":"IF(AND(C23<>0,D23<>0,E23<>0,F23<>0),F23-E23+D23-C23-M23-IF(E23-D23<Calendrier!$AT$10,Calendrier!$AT$10,0),IF(AND(C23<>0,D23<>0,E23=0,F23=0),D23-C23-M23,IF(AND(C23=0,D23=0,E23<>0,F23<>0),F23-E23-M23,IF(AND(C23>20,D23=0,E23=0,F23<>0),24-C23+F23-M23,IF(AND(C23<>0,D23=0,E23=0,F23<>0),F23-C23-M23,0)))))","v":0},{"$f":"IF(G23=0,0,IF(K23=0.5,0,G23-Calendrier!$AT$9))","v":0},1.75,"T",0,null,0]
["2023-04-06",{"$f":"INDIRECT(ADDRESS(MATCH($B$1,Calendrier!$A$15:$A$59,0)+14,ROW()-17,3,1,\"Calendrier\"),1)","v":"T"},null,null,null,null,{"$f":"IF(AND(C24<>0,D24<>0,E24<>0,F24<>0),F24-E24+D24-C24-M24-IF(E24-D24<Calendrier!$AT$10,Calendrier!$AT$10,0),IF(AND(C24<>0,D24<>0,E24=0,F24=0),D24-C24-M24,IF(AND(C24=0,D24=0,E24<>0,F24<>0),F24-E24-M24,IF(AND(C24>20,D24=0,E24=0,F24<>0),24-C24+F24-M24,IF(AND(C24<>0,D24=0,E24=0,F24<>0),F24-C24-M24,0)))))","v":0},{"$f":"IF(G24=0,0,IF(K24=0.5,0,G24-Calendrier!$AT$9))","v":0},1.75,"T",0,null,{"$f":"IF(OR(N24=0,O24=0),0,O24-N24)","v":0}]
["2023-04-07",{"$f":"INDIRECT(ADDRESS(MATCH($B$1,Calendrier!$A$15:$A$59,0)+14,ROW()-17,3,1,\"Calendrier\"),1)","v":"T"},null,null,null,null,{"$f":"IF(AND(C25<>0,D25<>0,E25<>0,F25<>0),F25-E25+D25-C25-M25-IF(E25-D25<Calendrier!$AT$10,Calendrier!$AT$10,0),IF(AND(C25<>0,D25<>0,E25=0,F25=0),D25-C25-M25,IF(AND(C25=0,D25=0,E25<>0,F25<>0),F25-E25-M25,IF(AND(C25>20,D25=0,E25=0,F25<>0),24-C25+F25-M25,IF(AND(C25<>0,D25=0,E25=0,F25<>0),F25-C25-M25,0)))))","v":0},{"$f":"IF(G25=0,0,IF(K25=0.5,0,G25-Calendrier!$AT$9))","v":0},1.75,"T",0,null,{"$f":"IF(OR(N25=0,O25=0),0,O25-N25)","v":0}]
["2023-04-08",{"$f":"INDIRECT(ADDRESS(MATCH($B$1,Calendrier!$A$15:$A$59,0)+14,ROW()-17,3,1,\"Calendrier\"),1)","v":"Sa"},null,null,null,null,{"$f":"IF(AND(C26<>0,D26<>0,E26<>0,F26<>0),F26-E26+D26-C26-M26-IF(E26-D26<Calendrier!$AT$10,Calendrier!$AT$10,0),IF(AND(C26<>0,D26<>0,E26=0,F26=0),D26-C26-M26,IF(AND(C26=0,D26=0,E26<>0,F26<>0),F26-E26-M26,IF(AND(C26>20,D26=0,E26=0,F26<>0),24-C26+F26-M26,IF(AND(C26<>0,D26=0,E26=0,F26<>0),F26-C26-M26,0)))))","v":0},{"$f":"IF(G26=0,0,IF(K26=0.5,0,G26-Calendrier!$AT$9))","v":0},1.75,"Sa",0,null,0]
["2023-04-09",{"$f":"INDIRECT(ADDRESS(MATCH($B$1,Calendrier!$A$15:$A$59,0)+14,ROW()-17,3,1,\"Calendrier\"),1)","v":"F"},null,null,null,null,{"$f":"IF(AND(C27<>0,D27<>0,E27<>0,F27<>0),F27-E27+D27-C27-M27-IF(E27-D27<Calendrier!$AT$10,Calendrier!$AT$10,0),IF(AND(C27<>0,D27<>0,E27=0,F27=0),D27-C27-M27,IF(AND(C27=0,D27=0,E27<>0,F27<>0),F27-E27-M27,IF(AND(C27>20,D27=0,E27=0,F27<>0),24-C27+F27-M27,IF(AND(C27<>0,D27=0,E27=0,F27<>0),F27-C27-M27,0)))))","v":0},{"$f":"IF(G27=0,0,IF(K27=0.5,0,G27-Calendrier!$AT$9))","v":0},1.75,"F",0,null,0]
["2023-04-10",{"$f":"INDIRECT(ADDRESS(MATCH($B$1,Calendrier!$A$15:$A$59,0)+14,ROW()-17,3,1,\"Calendrier\"),1)","v":"F"},null,null,null,null,{"$f":"IF(AND(C28<>0,D28<>0,E28<>0,F28<>0),F28-E28+D28-C28-M28-IF(E28-D28<Calendrier!$AT$10,Calendrier!$AT$10,0),IF(AND(C28<>0,D28<>0,E28=0,F28=0),D28-C28-M28,IF(AND(C28=0,D28=0,E28<>0,F28<>0),F28-E28-M28,IF(AND(C28>20,D28=0,E28=0,F28<>0),24-C28+F28-M28,IF(AND(C28<>0,D28=0,E28=0,F28<>0),F28-C28-M28,0)))))","v":0},{"$f":"IF(G28=0,0,IF(K28=0.5,0,G28-Calendrier!$AT$9))","v":0},1.75,"F",0,null,0]
["2023-04-11",{"$f":"INDIRECT(ADDRESS(MATCH($B$1,Calendrier!$A$15:$A$59,0)+14,ROW()-17,3,1,\"Calendrier\"),1)","v":"T"},null,null,null,null,{"$f":"IF(AND(C29<>0,D29<>0,E29<>0,F29<>0),F29-E29+D29-C29-M29-IF(E29-D29<Calendrier!$AT$10,Calendrier!$AT$10,0),IF(AND(C29<>0,D29<>0,E29=0,F29=0),D29-C29-M29,IF(AND(C29=0,D29=0,E29<>0,F29<>0),F29-E29-M29,IF(AND(C29>20,D29=0,E29=0,F29<>0),24-C29+F29-M29,IF(AND(C29<>0,D29=0,E29=0,F29<>0),F29-C29-M29,0)))))","v":0},{"$f":"IF(G29=0,0,IF(K29=0.5,0,G29-Calendrier!$AT$9))","v":0},1.75,"T",0,null,0]
["2023-04-12",{"$f":"INDIRECT(ADDRESS(MATCH($B$1,Calendrier!$A$15:$A$59,0)+14,ROW()-17,3,1,\"Calendrier\"),1)","v":"T"},null,null,null,null,{"$f":"IF(AND(C30<>0,D30<>0,E30<>0,F30<>0),F30-E30+D30-C30-M30-IF(E30-D30<Calendrier!$AT$10,Calendrier!$AT$10,0),IF(AND(C30<>0,D30<>0,E30=0,F30=0),D30-C30-M30,IF(AND(C30=0,D30=0,E30<>0,F30<>0),F30-E30-M30,IF(AND(C30>20,D30=0,E30=0,F30<>0),24-C30+F30-M30,IF(AND(C30<>0,D30=0,E30=0,F30<>0),F30-C30-M30,0)))))","v":0},{"$f":"IF(G30=0,0,IF(K30=0.5,0,G30-Calendrier!$AT$9))","v":0},1.75,"T",0,null,0]
["2023-04-13",{"$f":"INDIRECT(ADDRESS(MATCH($B$1,Calendrier!$A$15:$A$59,0)+14,ROW()-17,3,1,\"Calendrier\"),1)","v":"RTT"},null,null,null,null,{"$f":"IF(AND(C31<>0,D31<>0,E31<>0,F31<>0),F31-E31+D31-C31-M31-IF(E31-D31<Calendrier!$AT$10,Calendrier!$AT$10,0),IF(AND(C31<>0,D31<>0,E31=0,F31=0),D31-C31-M31,IF(AND(C31=0,D31=0,E31<>0,F31<>0),F31-E31-M31,IF(AND(C31>20,D31=0,E31=0,F31<>0),24-C31+F31-M31,IF(AND(C31<>0,D31=0,E31=0,F31<>0),F31-C31-M31,0)))))","v":0},{"$f":"IF(G31=0,0,IF(K31=0.5,0,G31-Calendrier!$AT$9))","v":0},1.75,"RTT",0,null,0]
["2023-04-14",{"$f":"INDIRECT(ADDRESS(MATCH($B$1,Calendrier!$A$15:$A$59,0)+14,ROW()-17,3,1,\"Calendrier\"),1)","v":"T"},null,null,null,null,{"$f":"IF(AND(C32<>0,D32<>0,E32<>0,F32<>0),F32-E32+D32-C32-M32-IF(E32-D32<Calendrier!$AT$10,Calendrier!$AT$10,0),IF(AND(C32<>0,D32<>0,E32=0,F32=0),D32-C32-M32,IF(AND(C32=0,D32=0,E32<>0,F32<>0),F32-E32-M32,IF(AND(C32>20,D32=0,E32=0,F32<>0),24-C32+F32-M32,IF(AND(C32<>0,D32=0,E32=0,F32<>0),F32-C32-M32,0)))))","v":0},{"$f":"IF(G32=0,0,IF(K32=0.5,0,G32-Calendrier!$AT$9))","v":0},1.75,"T",0,null,0]
["2023-04-15",{"$f":"INDIRECT(ADDRESS(MATCH($B$1,Calendrier!$A$15:$A$59,0)+14,ROW()-17,3,1,\"Calendrier\"),1)","v":"Sa"},null,null,null,null,{"$f":"IF(AND(C33<>0,D33<>0,E33<>0,F33<>0),F33-E33+D33-C33-M33-IF(E33-D33<Calendrier!$AT$10,Calendrier!$AT$10,0),IF(AND(C33<>0,D33<>0,E33=0,F33=0),D33-C33-M33,IF(AND(C33=0,D33=0,E33<>0,F33<>0),F33-E33-M33,IF(AND(C33>20,D33=0,E33=0,F33<>0),24-C33+F33-M33,IF(AND(C33<>0,D33=0,E33=0,F33<>0),F33-C33-M33,0)))))","v":0},{"$f":"IF(G33=0,0,IF(K33=0.5,0,G33-Calendrier!$AT$9))","v":0},1.75,"Sa",0,null,0]
["2023-04-16",{"$f":"INDIRECT(ADDRESS(MATCH($B$1,Calendrier!$A$15:$A$59,0)+14,ROW()-17,3,1,\"Calendrier\"),1)","v":"Di"},null,null,null,null,{"$f":"IF(AND(C34<>0,D34<>0,E34<>0,F34<>0),F34-E34+D34-C34-M34-IF(E34-D34<Calendrier!$AT$10,Calendrier!$AT$10,0),IF(AND(C34<>0,D34<>0,E34=0,F34=0),D34-C34-M34,IF(AND(C34=0,D34=0,E34<>0,F34<>0),F34-E34-M34,IF(AND(C34>20,D34=0,E34=0,F34<>0),24-C34+F34-M34,IF(AND(C34<>0,D34=0,E34=0,F34<>0),F34-C34-M34,0)))))","v":0},{"$f":"IF(G34=0,0,IF(K34=0.5,0,G34-Calendrier!$AT$9))","v":0},1.75,{"$f":"IF(AND(COUNTA(C34:F34)=0,OR(B34=\"F\",WEEKDAY(A34,2)>5,B34=\"T\",B34=\"RTT\",B34=\"CA\")),B34,IF(AND(COUNTA(C34:F34)>=2,OR(B34=\"F\",B34=\"RTT\",B34=\"CA\",B34=\"Sa\",B34=\"Di\")),\"calendrier\",IF(AND(COUNTA(C34)+COUNTA(F34)=2,OR(COUNTA(C34:D34)<1,COUNTA(E34:F34)<1)),\"erreur\",IF(COUNTA(C34:F34)=3,\"en cours\",IF(COUNTA(C34:F34)=4,B34,IF(OR(AND(C34<>0,D34<>0),AND(E34<>0,F34<>0)),$F$12,IF(AND(C34<>0,D34=0,E34=0,F34<>0,WEEKDAY(A34,2)>5),\"calendrier\",IF(AND(C34<>0,D34=0,E34=0,F34<>0),$B34,\"\"))))))))","v":"Di"},0,null,0]
["2023-04-17",{"$f":"INDIRECT(ADDRESS(MATCH($B$1,Calendrier!$A$15:$A$59,0)+14,ROW()-17,3,1,\"Calendrier\"),1)","v":"T"},null,null,null,null,{"$f":"IF(AND(C35<>0,D35<>0,E35<>0,F35<>0),F35-E35+D35-C35-M35-IF(E35-D35<Calendrier!$AT$10,Calendrier!$AT$10,0),IF(AND(C35<>0,D35<>0,E35=0,F35=0),D35-C35-M35,IF(AND(C35=0,D35=0,E35<>0,F35<>0),F35-E35-M35,IF(AND(C35>20,D35=0,E35=0,F35<>0),24-C35+F35-M35,IF(AND(C35<>0,D35=0,E35=0,F35<>0),F35-C35-M35,0)))))","v":0},{"$f":"IF(G35=0,0,IF(K35=0.5,0,G35-Calendrier!$AT$9))","v":0},1.75,"T",0,null,0]
["2023-04-18",{"$f":"INDIRECT(ADDRESS(MATCH($B$1,Calendrier!$A$15:$A$59,0)+14,ROW()-17,3,1,\"Calendrier\"),1)","v":"T"},null,null,null,null,{"$f":"IF(AND(C36<>0,D36<>0,E36<>0,F36<>0),F36-E36+D36-C36-M36-IF(E36-D36<Calendrier!$AT$10,Calendrier!$AT$10,0),IF(AND(C36<>0,D36<>0,E36=0,F36=0),D36-C36-M36,IF(AND(C36=0,D36=0,E36<>0,F36<>0),F36-E36-M36,IF(AND(C36>20,D36=0,E36=0,F36<>0),24-C36+F36-M36,IF(AND(C36<>0,D36=0,E36=0,F36<>0),F36-C36-M36,0)))))","v":0},{"$f":"IF(G36=0,0,IF(K36=0.5,0,G36-Calendrier!$AT$9))","v":0},1.75,"T",0,null,0]
["2023-04-19",{"$f":"INDIRECT(ADDRESS(MATCH($B$1,Calendrier!$A$15:$A$59,0)+14,ROW()-17,3,1,\"Calendrier\"),1)","v":"T"},null,null,null,null,{"$f":"IF(AND(C37<>0,D37<>0,E37<>0,F37<>0),F37-E37+D37-C37-M37-IF(E37-D37<Calendrier!$AT$10,Calendrier!$AT$10,0),IF(AND(C37<>0,D37<>0,E37=0,F37=0),D37-C37-M37,IF(AND(C37=0,D37=0,E37<>0,F37<>0),F37-E37-M37,IF(AND(C37>20,D37=0,E37=0,F37<>0),24-C37+F37-M37,IF(AND(C37<>0,D37=0,E37=0,F37<>0),F37-C37-M37,0)))))","v":0},{"$f":"IF(G37=0,0,IF(K37=0.5,0,G37-Calendrier!$AT$9))","v":0},1.75,"T",0,null,0]
["2023-04-20",{"$f":"INDIRECT(ADDRESS(MATCH($B$1,Calendrier!$A$15:$A$59,0)+14,ROW()-17,3,1,\"Calendrier\"),1)","v":"T"},null,null,null,null,{"$f":"IF(AND(C38<>0,D38<>0,E38<>0,F38<>0),F38-E38+D38-C38-M38-IF(E38-D38<Calendrier!$AT$10,Calendrier!$AT$10,0),IF(AND(C38<>0,D38<>0,E38=0,F38=0),D38-C38-M38,IF(AND(C38=0,D38=0,E38<>0,F38<>0),F38-E38-M38,IF(AND(C38>20,D38=0,E38=0,F38<>0),24-C38+F38-M38,IF(AND(C38<>0,D38=0,E38=0,F38<>0),F38-C38-M38,0)))))","v":0},{"$f":"IF(G38=0,0,IF(K38=0.5,0,G38-Calendrier!$AT$9))","v":0},1.75,"T",0,null,0]
["2023-04-21",{"$f":"INDIRECT(ADDRESS(MATCH($B$1,Calendrier!$A$15:$A$59,0)+14,ROW()-17,3,1,\"Calendrier\"),1)","v":"T"},null,null,null,null,{"$f":"IF(AND(C39<>0,D39<>0,E39<>0,F39<>0),F39-E39+D39-C39-M39-IF(E39-D39<Calendrier!$AT$10,Calendrier!$AT$10,0),IF(AND(C39<>0,D39<>0,E39=0,F39=0),D39-C39-M39,IF(AND(C39=0,D39=0,E39<>0,F39<>0),F39-E39-M39,IF(AND(C39>20,D39=0,E39=0,F39<>0),24-C39+F39-M39,IF(AND(C39<>0,D39=0,E39=0,F39<>0),F39-C39-M39,0)))))","v":0},{"$f":"IF(G39=0,0,IF(K39=0.5,0,G39-Calendrier!$AT$9))","v":0},1.75,"T",0,null,0]
["2023-04-22",{"$f":"INDIRECT(ADDRESS(MATCH($B$1,Calendrier!$A$15:$A$59,0)+14,ROW()-17,3,1,\"Calendrier\"),1)","v":"Sa"},null,null,null,null,{"$f":"IF(AND(C40<>0,D40<>0,E40<>0,F40<>0),F40-E40+D40-C40-M40-IF(E40-D40<Calendrier!$AT$10,Calendrier!$AT$10,0),IF(AND(C40<>0,D40<>0,E40=0,F40=0),D40-C40-M40,IF(AND(C40=0,D40=0,E40<>0,F40<>0),F40-E40-M40,IF(AND(C40>20,D40=0,E40=0,F40<>0),24-C40+F40-M40,IF(AND(C40<>0,D40=0,E40=0,F40<>0),F40-C40-M40,0)))))","v":0},{"$f":"IF(G40=0,0,IF(K40=0.5,0,G40-Calendrier!$AT$9))","v":0},1.75,"Sa",0,null,0]
["2023-04-23",{"$f":"INDIRECT(ADDRESS(MATCH($B$1,Calendrier!$A$15:$A$59,0)+14,ROW()-17,3,1,\"Calendrier\"),1)","v":"Di"},null,null,null,null,{"$f":"IF(AND(C41<>0,D41<>0,E41<>0,F41<>0),F41-E41+D41-C41-M41-IF(E41-D41<Calendrier!$AT$10,Calendrier!$AT$10,0),IF(AND(C41<>0,D41<>0,E41=0,F41=0),D41-C41-M41,IF(AND(C41=0,D41=0,E41<>0,F41<>0),F41-E41-M41,IF(AND(C41>20,D41=0,E41=0,F41<>0),24-C41+F41-M41,IF(AND(C41<>0,D41=0,E41=0,F41<>0),F41-C41-M41,0)))))","v":0},{"$f":"IF(G41=0,0,IF(K41=0.5,0,G41-Calendrier!$AT$9))","v":0},1.75,"Di",0,null,0]
["2023-04-24",{"$f":"INDIRECT(ADDRESS(MATCH($B$1,Calendrier!$A$15:$A$59,0)+14,ROW()-17,3,1,\"Calendrier\"),1)","v":"T"},null,null,null,null,{"$f":"IF(AND(C42<>0,D42<>0,E42<>0,F42<>0),F42-E42+D42-C42-M42-IF(E42-D42<Calendrier!$AT$10,Calendrier!$AT$10,0),IF(AND(C42<>0,D42<>0,E42=0,F42=0),D42-C42-M42,IF(AND(C42=0,D42=0,E42<>0,F42<>0),F42-E42-M42,IF(AND(C42>20,D42=0,E42=0,F42<>0),24-C42+F42-M42,IF(AND(C42<>0,D42=0,E42=0,F42<>0),F42-C42-M42,0)))))","v":0},{"$f":"IF(G42=0,0,IF(K42=0.5,0,G42-Calendrier!$AT$9))","v":0},1.75,"T",0,null,0]
["2023-04-25",{"$f":"INDIRECT(ADDRESS(MATCH($B$1,Calendrier!$A$15:$A$59,0)+14,ROW()-17,3,1,\"Calendrier\"),1)","v":"T"},null,null,null,null,{"$f":"IF(AND(C43<>0,D43<>0,E43<>0,F43<>0),F43-E43+D43-C43-M43-IF(E43-D43<Calendrier!$AT$10,Calendrier!$AT$10,0),IF(AND(C43<>0,D43<>0,E43=0,F43=0),D43-C43-M43,IF(AND(C43=0,D43=0,E43<>0,F43<>0),F43-E43-M43,IF(AND(C43>20,D43=0,E43=0,F43<>0),24-C43+F43-M43,IF(AND(C43<>0,D43=0,E43=0,F43<>0),F43-C43-M43,0)))))","v":0},{"$f":"IF(G43=0,0,IF(K43=0.5,0,G43-Calendrier!$AT$9))","v":0},1.75,"T",0,null,0]
["2023-04-26",{"$f":"INDIRECT(ADDRESS(MATCH($B$1,Calendrier!$A$15:$A$59,0)+14,ROW()-17,3,1,\"Calendrier\"),1)","v":"T"},null,null,null,null,{"$f":"IF(AND(C44<>0,D44<>0,E44<>0,F44<>0),F44-E44+D44-C44-M44-IF(E44-D44<Calendrier!$AT$10,Calendrier!$AT$10,0),IF(AND(C44<>0,D44<>0,E44=0,F44=0),D44-C44-M44,IF(AND(C44=0,D44=0,E44<>0,F44<>0),F44-E44-M44,IF(AND(C44>20,D44=0,E44=0,F44<>0),24-C44+F44-M44,IF(AND(C44<>0,D44=0,E44=0,F44<>0),F44-C44-M44,0)))))","v":0},{"$f":"IF(G44=0,0,IF(K44=0.5,0,G44-Calendrier!$AT$9))","v":0},1.75,"T",0,null,0]
["2023-04-27",{"$f":"INDIRECT(ADDRESS(MATCH($B$1,Calendrier!$A$15:$A$59,0)+14,ROW()-17,3,1,\"Calendrier\"),1)","v":"T"},null,null,null,null,{"$f":"IF(AND(C45<>0,D45<>0,E45<>0,F45<>0),F45-E45+D45-C45-M45-IF(E45-D45<Calendrier!$AT$10,Calendrier!$AT$10,0),IF(AND(C45<>0,D45<>0,E45=0,F45=0),D45-C45-M45,IF(AND(C45=0,D45=0,E45<>0,F45<>0),F45-E45-M45,IF(AND(C45>20,D45=0,E45=0,F45<>0),24-C45+F45-M45,IF(AND(C45<>0,D45=0,E45=0,F45<>0),F45-C45-M45,0)))))","v":0},{"$f":"IF(G45=0,0,IF(K45=0.5,0,G45-Calendrier!$AT$9))","v":0},1.75,"T",0,null,0]
["2023-04-28",{"$f":"INDIRECT(ADDRESS(MATCH($B$1,Calendrier!$A$15:$A$59,0)+14,ROW()-17,3,1,\"Calendrier\"),1)","v":"T"},null,null,null,null,{"$f":"IF(AND(C46<>0,D46<>0,E46<>0,F46<>0),F46-E46+D46-C46-M46-IF(E46-D46<Calendrier!$AT$10,Calendrier!$AT$10,0),IF(AND(C46<>0,D46<>0,E46=0,F46=0),D46-C46-M46,IF(AND(C46=0,D46=0,E46<>0,F46<>0),F46-E46-M46,IF(AND(C46>20,D46=0,E46=0,F46<>0),24-C46+F46-M46,IF(AND(C46<>0,D46=0,E46=0,F46<>0),F46-C46-M46,0)))))","v":0},{"$f":"IF(G46=0,0,IF(K46=0.5,0,G46-Calendrier!$AT$9))","v":0},1.75,"T",0,null,0]
["2023-04-29",{"$f":"INDIRECT(ADDRESS(MATCH($B$1,Calendrier!$A$15:$A$59,0)+14,ROW()-17,3,1,\"Calendrier\"),1)","v":"Sa"},null,null,null,null,{"$f":"IF(AND(C47<>0,D47<>0,E47<>0,F47<>0),F47-E47+D47-C47-M47-IF(E47-D47<Calendrier!$AT$10,Calendrier!$AT$10,0),IF(AND(C47<>0,D47<>0,E47=0,F47=0),D47-C47-M47,IF(AND(C47=0,D47=0,E47<>0,F47<>0),F47-E47-M47,IF(AND(C47>20,D47=0,E47=0,F47<>0),24-C47+F47-M47,IF(AND(C47<>0,D47=0,E47=0,F47<>0),F47-C47-M47,0)))))","v":0},{"$f":"IF(G47=0,0,IF(K47=0.5,0,G47-Calendrier!$AT$9))","v":0},1.75,"Sa",0,null,0]
["2023-04-30",{"$f":"INDIRECT(ADDRESS(MATCH($B$1,Calendrier!$A$15:$A$59,0)+14,ROW()-17,3,1,\"Calendrier\"),1)","v":"Di"},null,null,null,null,{"$f":"IF(AND(C48<>0,D48<>0,E48<>0,F48<>0),F48-E48+D48-C48-M48-IF(E48-D48<Calendrier!$AT$10,Calendrier!$AT$10,0),IF(AND(C48<>0,D48<>0,E48=0,F48=0),D48-C48-M48,IF(AND(C48=0,D48=0,E48<>0,F48<>0),F48-E48-M48,IF(AND(C48>20,D48=0,E48=0,F48<>0),24-C48+F48-M48,IF(AND(C48<>0,D48=0,E48=0,F48<>0),F48-C48-M48,0)))))","v":0},{"$f":"IF(G48=0,0,IF(K48=0.5,0,G48-Calendrier!$AT$9))","v":0},1.75,"Di",0,null,0]
[{"$f":"IF(MONTH(A48+1)>4,0,A48+1)","v":"00:00:00"},{"$f":"INDIRECT(ADDRESS(MATCH($B$1,Calendrier!$A$15:$A$59,0)+14,ROW()-17,3,1,\"Calendrier\"),1)","v":0},null,null,null,null,{"$f":"IF(AND(C49<>0,D49<>0,E49<>0,F49<>0),F49-E49+D49-C49-M49-IF(E49-D49<Calendrier!$AT$10,Calendrier!$AT$10,0),IF(AND(C49<>0,D49<>0,E49=0,F49=0),D49-C49-M49,IF(AND(C49=0,D49=0,E49<>0,F49<>0),F49-E49-M49,IF(AND(C49>20,D49=0,E49=0,F49<>0),24-C49+F49-M49,IF(AND(C49<>0,D49=0,E49=0,F49<>0),F49-C49-M49,0)))))","v":0},{"$f":"IF(G49=0,0,IF(K49=0.5,0,G49-Calendrier!$AT$9))","v":0},1.75,{"$f":"IF(AND(COUNTA(C49:F49)=0,B49=\"F\"),B49,IF(AND(COUNTA(C49:F49)=0,WEEKDAY(A49,2)>5),B49,IF(AND(COUNTA(C49:F49)=0,B49=\"T\"),\"\",IF(AND(COUNTA(C49:F49)=0,B49=\"RTT\"),B49,IF(AND(COUNTA(D49:F49)=0,C49<>0),\"erreur\",IF(AND(COUNTA(C49:F49)=4,B49=\"RTT\"),\"Erreur RTT\",IF(AND(COUNTA(C49:F49)=4,B49=\"F\"),\"fériés\",IF(COUNTA(C49:F49)=4,B49,IF(COUNTA(C49:F49)=3,\"Erreur\",IF(AND(C49<>0,D49<>0),$F$12,IF(AND(E49<>0,F49<>0),$F$12,IF(AND(C49<>0,D49=0,E49=0,F49<>0,WEEKDAY(A49,2)>5),\"Modif  calendrier\",IF(AND(C49<>0,D49=0,E49=0,F49<>0),$B49)))))))))))))","v":0},0,null,0]
[null,null,null,null,null,null,{"$f":"SUM(G19:G49)","v":0},null,{"$f":"I49","v":1.75}]
[]
[null,null,null,null,null,null,null,null,null,{"$f":"IF(G52>6,\"T\",\"\")","v":""}]

{"sheet":"MAI","index":7,"n_rows":50,"n_cols":15,"rows_kept":50,"cut":false,"hidden":false,"merged":[]}
[null,{"$f":"RIGHT(CELL(\"nomfichier\",$A$1),3)","v":"MAI"},"FICHE DE SUIVI HORAIRE"]
[]
[null,"mois :","MAI",null,null,"année ",{"$f":"VLOOKUP(C3,Fériés!$I$1:$J$12,2,FALSE)","v":2023},null,null,"service",{"$f":"Calendrier!F4","v":"Administratif"}]
[]
[null,"nom :",{"$f":"Calendrier!F2","v":"Isq"},null,null," prénom ",{"$f":"Calendrier!F3","v":"Philippe"},null,null,"N° Ident",{"$f":"Calendrier!F1","v":"T506489"}]
[null,null,null,null,null,null,null,"à réaliser","cumul","en cours","reste",null,"N.cumul"]
[null,null,null,"Nb J",{"$f":"Calendrier!$AT$11","v":218},{"$f":"+$H$10","v":0},{"$f":"E7-F7","v":218},{"$f":"Calendrier!N1","v":365},{"$f":"AVR!M7","v":116.5},{"$f":"SUM(J8:J15)","v":31},{"$f":"H7-(I7+J7)","v":217.5},null,{"$f":"SUM(M8:M15)","v":147.5}]
[null,null,null,null,null,"1/2CA","CA",{"$f":"Calendrier!N5","v":25},{"$f":"AVR!M8","v":0},{"$f":"COUNTIF($J$19:$J$49,G8)+COUNTIF($J$19:$J$49,F8)/2","v":1},{"$f":"+H8-(I8+J8)","v":24},"J",{"$f":"+I8+J8","v":1}]
[null,null,null,null,null,"1/2RTT","RTT",{"$f":"Calendrier!N8","v":9},{"$f":"AVR!M9","v":3},{"$f":"COUNTIF($J$19:$J$49,G9)+COUNTIF($J$19:$J$49,F9)/2","v":0},{"$f":"+H9-(I9+J9)","v":6},"J",3]
[null,null,null,null,null,"1/2CS","CS",{"$f":"Calendrier!N9","v":0},{"$f":"AVR!M10","v":0},0,{"$f":"H10-(I10+J10)","v":0},"J",0]
[null,null,null,null,null,"1/2CP","CP",{"$f":"Calendrier!N6","v":0},{"$f":"AVR!M11","v":0},0,{"$f":"H11-(I11+J11)","v":0},"J",0]
[null,null,null,null,null,"1/2T","T",{"$f":"Calendrier!N7","v":218},{"$f":"AVR!M12","v":77.5},19,{"$f":"+H12-(I12+J12)","v":121.5},"J",96.5]
[null,null,null,null,null,0,"Sa",{"$f":"Calendrier!N4","v":51},{"$f":"AVR!M13","v":17},{"$f":"COUNTIF($J$19:$J$49,G13)","v":4},{"$f":"+H13-(I13+J13)","v":30},"J",21]
[null,null,null,null,null,0,"Di",{"$f":"Calendrier!N3","v":50},{"$f":"AVR!M14","v":16},{"$f":"COUNTIF($J$19:$J$49,G14)","v":3},{"$f":"+H14-(I14+J14)","v":31},"J",19]
[null,null,null,null,null,0,"F",{"$f":"Calendrier!N2","v":12},{"$f":"AVR!M15","v":3},{"$f":"COUNTIF($J$19:$J$49,G15)","v":4},{"$f":"+H15-(I15+J15)","v":5},"J",7]
[null,null,null,null,null,null,"heure/avance fin mois",null,{"$f":"AVR!$I$50","v":1.75},null,null,null,{"$f":"I50","v":1.75},"avec bon"]
[null,"Prévu","Entrée","Sortie","Entrée","Sortie","total","variation","cumul","Type","nb J/T",null,"divers E/S","Sortie","Retour"]
[null,null,null,null,null,null,null,null,{"$f":"AVR!$I$50","v":1.75}]
[{"$f":"VALUE(\"01/05/\"&G3)","v":"2023-05-01"},{"$f":"INDIRECT(ADDRESS(MATCH($B$1,Calendrier!$A$15:$A$59,0)+14,ROW()-17,3,1,\"Calendrier\"),1)","v":"F"},null,null,null,null,{"$f":"IF(AND(C19<>0,D19<>0,E19<>0,F19<>0),F19-E19+D19-C19-K19-IF(E19-D19<Calendrier!$AT$10,Calendrier!$AT$10,0),IF(AND(C19<>0,D19<>0,E19=0,F19=0),D19-C19-K19,IF(AND(C19=0,D19=0,E19<>0,F19<>0),F19-E19-K19,IF(AND(C19>20,D19=0,E19=0,F19<>0),24-C19+F19-K19,IF(AND(C19<>0,D19=0,E19=0,F19<>0),F19-C19-K19,0)))))","v":0},{"$f":"IF(G19=0,0,IF(K19=0.5,0,G19-Calendrier!$AT$9))","v":0},{"$f":"I18+H19","v":1.75},{"$f":"IF(AND(COUNTA(C19:F19)=0,OR(B19=\"F\",WEEKDAY(A19,2)>5,B19=\"T\",B19=\"RTT\",B19=\"CA\")),B19,IF(AND(COUNTA(C19:F19)>=2,OR(B19=\"F\",B19=\"RTT\",B19=\"CA\",B19=\"Sa\",B19=\"Di\")),\"calendrier\",IF(AND(COUNTA(C19)+COUNTA(F19)=2,OR(COUNTA(C19:D19)<1,COUNTA(E19:F19)<1)),\"erreur\",IF(COUNTA(C19:F19)=3,\"en cours\",IF(COUNTA(C19:F19)=4,B19,IF(OR(AND(C19<>0,D19<>0),AND(E19<>0,F19<>0)),$F$12,IF(AND(C19<>0,D19=0,E19=0,F19<>0,WEEKDAY(A19,2)>5),\"calendrier\",IF(AND(C19<>0,D19=0,E19=0,F19<>0),$B19,\"\"))))))))","v":"F"},{"$f":"IF(COUNTA(C19:F19)=4,1,IF(OR(AND(C19<>0,D19<>0),AND(E19<>0,F19<>0)),0.5,IF(AND(C19<>0,F19<>0,D19=0,E19=0,B19=\"T\"),1,0)))","v":0},null,{"$f":"IF(OR(N19=0,O19=0),0,O19-N19)","v":0}]
[{"$f":"A19+1","v":"2023-05-02"},{"$f":"INDIRECT(ADDRESS(MATCH($B$1,Calendrier!$A$15:$A$59,0)+14,ROW()-17,3,1,\"Calendrier\"),1)","v":"T"},null,null,null,null,{"$f":"IF(AND(C20<>0,D20<>0,E20<>0,F20<>0),F20-E20+D20-C20-K20-IF(E20-D20<Calendrier!$AT$10,Calendrier!$AT$10,0),IF(AND(C20<>0,D20<>0,E20=0,F20=0),D20-C20-K20,IF(AND(C20=0,D20=0,E20<>0,F20<>0),F20-E20-K20,IF(AND(C20>20,D20=0,E20=0,F20<>0),24-C20+F20-K20,IF(AND(C20<>0,D20=0,E20=0,F20<>0),F20-C20-K20,0)))))","v":0},{"$f":"IF(G20=0,0,IF(K20=0.5,0,G20-Calendrier!$AT$9))","v":0},1.75,"T",0,null,0]
[{"$f":"A20+1","v":"2023-05-03"},{"$f":"INDIRECT(ADDRESS(MATCH($B$1,Calendrier!$A$15:$A$59,0)+14,ROW()-17,3,1,\"Calendrier\"),1)","v":"T"},null,null,null,null,{"$f":"IF(AND(C21<>0,D21<>0,E21<>0,F21<>0),F21-E21+D21-C21-M21-IF(E21-D21<Calendrier!$AT$10,Calendrier!$AT$10,0),IF(AND(C21<>0,D21<>0,E21=0,F21=0),D21-C21-M21,IF(AND(C21=0,D21=0,E21<>0,F21<>0),F21-E21-M21,IF(AND(C21>20,D21=0,E21=0,F21<>0),24-C21+F21-M21,IF(AND(C21<>0,D21=0,E21=0,F21<>0),F21-C21-M21,0)))))","v":0},{"$f":"IF(G21=0,0,IF(K21=0.5,0,G21-Calendrier!$AT$9))","v":0},{"$f":"I20+H21","v":1.75},"T",0,null,0]
["2023-05-04",{"$f":"INDIRECT(ADDRESS(MATCH($B$1,Calendrier!$A$15:$A$59,0)+14,ROW()-17,3,1,\"Calendrier\"),1)","v":"T"},null,null,null,null,{"$f":"IF(AND(C22<>0,D22<>0,E22<>0,F22<>0),F22-E22+D22-C22-M22-IF(E22-D22<Calendrier!$AT$10,Calendrier!$AT$10,0),IF(AND(C22<>0,D22<>0,E22=0,F22=0),D22-C22-M22,IF(AND(C22=0,D22=0,E22<>0,F22<>0),F22-E22-M22,IF(AND(C22>20,D22=0,E22=0,F22<>0),24-C22+F22-M22,IF(AND(C22<>0,D22=0,E22=0,F22<>0),F22-C22-M22,0)))))","v":0},{"$f":"IF(G22=0,0,IF(K22=0.5,0,G22-Calendrier!$AT$9))","v":0},1.75,"T",0,null,0]
["2023-05-05",{"$f":"INDIRECT(ADDRESS(MATCH($B$1,Calendrier!$A$15:$A$59,0)+14,ROW()-17,3,1,\"Calendrier\"),1)","v":"T"},null,null,null,null,{"$f":"IF(AND(C23<>0,D23<>0,E23<>0,F23<>0),F23-E23+D23-C23-M23-IF(E23-D23<Calendrier!$AT$10,Calendrier!$AT$10,0),IF(AND(C23<>0,D23<>0,E23=0,F23=0),D23-C23-M23,IF(AND(C23=0,D23=0,E23<>0,F23<>0),F23-E23-M23,IF(AND(C23>20,D23=0,E23=0,F23<>0),24-C23+F23-M23,IF(AND(C23<>0,D23=0,E23=0,F23<>0),F23-C23-M23,0)))))","v":0},{"$f":"IF(G23=0,0,IF(K23=0.5,0,G23-Calendrier!$AT$9))","v":0},1.75,"T",0,null,0]
["2023-05-06",{"$f":"INDIRECT(ADDRESS(MATCH($B$1,Calendrier!$A$15:$A$59,0)+14,ROW()-17,3,1,\"Calendrier\"),1)","v":"Sa"},null,null,null,null,{"$f":"IF(AND(C24<>0,D24<>0,E24<>0,F24<>0),F24-E24+D24-C24-M24-IF(E24-D24<Calendrier!$AT$10,Calendrier!$AT$10,0),IF(AND(C24<>0,D24<>0,E24=0,F24=0),D24-C24-M24,IF(AND(C24=0,D24=0,E24<>0,F24<>0),F24-E24-M24,IF(AND(C24>20,D24=0,E24=0,F24<>0),24-C24+F24-M24,IF(AND(C24<>0,D24=0,E24=0,F24<>0),F24-C24-M24,0)))))","v":0},{"$f":"IF(G24=0,0,IF(K24=0.5,0,G24-Calendrier!$AT$9))","v":0},1.75,"Sa",0,null,{"$f":"IF(OR(N24=0,O24=0),0,O24-N24)","v":0}]
["2023-05-07",{"$f":"INDIRECT(ADDRESS(MATCH($B$1,Calendrier!$A$15:$A$59,0)+14,ROW()-17,3,1,\"Calendrier\"),1)","v":"Di"},null,null,null,null,{"$f":"IF(AND(C25<>0,D25<>0,E25<>0,F25<>0),F25-E25+D25-C25-M25-IF(E25-D25<Calendrier!$AT$10,Calendrier!$AT$10,0),IF(AND(C25<>0,D25<>0,E25=0,F25=0),D25-C25-M25,IF(AND(C25=0,D25=0,E25<>0,F25<>0),F25-E25-M25,IF(AND(C25>20,D25=0,E25=0,F25<>0),24-C25+F25-M25,IF(AND(C25<>0,D25=0,E25=0,F25<>0),F25-C25-M25,0)))))","v":0},{"$f":"IF(G25=0,0,IF(K25=0.5,0,G25-Calendrier!$AT$9))","v":0},1.75,"Di",0,null,{"$f":"IF(OR(N25=0,O25=0),0,O25-N25)","v":0}]
["2023-05-08",{"$f":"INDIRECT(ADDRESS(MATCH($B$1,Calendrier!$A$15:$A$59,0)+14,ROW()-17,3,1,\"Calendrier\"),1)","v":"F"},null,null,null,null,{"$f":"IF(AND(C26<>0,D26<>0,E26<>0,F26<>0),F26-E26+D26-C26-M26-IF(E26-D26<Calendrier!$AT$10,Calendrier!$AT$10,0),IF(AND(C26<>0,D26<>0,E26=0,F26=0),D26-C26-M26,IF(AND(C26=0,D26=0,E26<>0,F26<>0),F26-E26-M26,IF(AND(C26>20,D26=0,E26=0,F26<>0),24-C26+F26-M26,IF(AND(C26<>0,D26=0,E26=0,F26<>0),F26-C26-M26,0)))))","v":0},{"$f":"IF(G26=0,0,IF(K26=0.5,0,G26-Calendrier!$AT$9))","v":0},1.75,"F",0,null,0]
["2023-05-09",{"$f":"INDIRECT(ADDRESS(MATCH($B$1,Calendrier!$A$15:$A$59,0)+14,ROW()-17,3,1,\"Calendrier\"),1)","v":"T"},null,null,null,null,{"$f":"IF(AND(C27<>0,D27<>0,E27<>0,F27<>0),F27-E27+D27-C27-M27-IF(E27-D27<Calendrier!$AT$10,Calendrier!$AT$10,0),IF(AND(C27<>0,D27<>0,E27=0,F27=0),D27-C27-M27,IF(AND(C27=0,D27=0,E27<>0,F27<>0),F27-E27-M27,IF(AND(C27>20,D27=0,E27=0,F27<>0),24-C27+F27-M27,IF(AND(C27<>0,D27=0,E27=0,F27<>0),F27-C27-M27,0)))))","v":0},{"$f":"IF(G27=0,0,IF(K27=0.5,0,G27-Calendrier!$AT$9))","v":0},1.75,"T",0,null,0]
["2023-05-10",{"$f":"INDIRECT(ADDRESS(MATCH($B$1,Calendrier!$A$15:$A$59,0)+14,ROW()-17,3,1,\"Calendrier\"),1)","v":"T"},null,null,null,null,{"$f":"IF(AND(C28<>0,D28<>0,E28<>0,F28<>0),F28-E28+D28-C28-M28-IF(E28-D28<Calendrier!$AT$10,Calendrier!$AT$10,0),IF(AND(C28<>0,D28<>0,E28=0,F28=0),D28-C28-M28,IF(AND(C28=0,D28=0,E28<>0,F28<>0),F28-E28-M28,IF(AND(C28>20,D28=0,E28=0,F28<>0),24-C28+F28-M28,IF(AND(C28<>0,D28=0,E28=0,F28<>0),F28-C28-M28,0)))))","v":0},{"$f":"IF(G28=0,0,IF(K28=0.5,0,G28-Calendrier!$AT$9))","v":0},1.75,"T",0,null,0]
["2023-05-11",{"$f":"INDIRECT(ADDRESS(MATCH($B$1,Calendrier!$A$15:$A$59,0)+14,ROW()-17,3,1,\"Calendrier\"),1)","v":"T"},null,null,null,null,{"$f":"IF(AND(C29<>0,D29<>0,E29<>0,F29<>0),F29-E29+D29-C29-M29-IF(E29-D29<Calendrier!$AT$10,Calendrier!$AT$10,0),IF(AND(C29<>0,D29<>0,E29=0,F29=0),D29-C29-M29,IF(AND(C29=0,D29=0,E29<>0,F29<>0),F29-E29-M29,IF(AND(C29>20,D29=0,E29=0,F29<>0),24-C29+F29-M29,IF(AND(C29<>0,D29=0,E29=0,F29<>0),F29-C29-M29,0)))))","v":0},{"$f":"IF(G29=0,0,IF(K29=0.5,0,G29-Calendrier!$AT$9))","v":0},1.75,"T",0,null,0]
["2023-05-12",{"$f":"INDIRECT(ADDRESS(MATCH($B$1,Calendrier!$A$15:$A$59,0)+14,ROW()-17,3,1,\"Calendrier\"),1)","v":"T"},null,null,null,null,{"$f":"IF(AND(C30<>0,D30<>0,E30<>0,F30<>0),F30-E30+D30-C30-M30-IF(E30-D30<Calendrier!$AT$10,Calendrier!$AT$10,0),IF(AND(C30<>0,D30<>0,E30=0,F30=0),D30-C30-M30,IF(AND(C30=0,D30=0,E30<>0,F30<>0),F30-E30-M30,IF(AND(C30>20,D30=0,E30=0,F30<>0),24-C30+F30-M30,IF(AND(C30<>0,D30=0,E30=0,F30<>0),F30-C30-M30,0)))))","v":0},{"$f":"IF(G30=0,0,IF(K30=0.5,0,G30-Calendrier!$AT$9))","v":0},1.75,"T",0,null,0]
["2023-05-13",{"$f":"INDIRECT(ADDRESS(MATCH($B$1,Calendrier!$A$15:$A$59,0)+14,ROW()-17,3,1,\"Calendrier\"),1)","v":"Sa"},null,null,null,null,{"$f":"IF(AND(C31<>0,D31<>0,E31<>0,F31<>0),F31-E31+D31-C31-M31-IF(E31-D31<Calendrier!$AT$10,Calendrier!$AT$10,0),IF(AND(C31<>0,D31<>0,E31=0,F31=0),D31-C31-M31,IF(AND(C31=0,D31=0,E31<>0,F31<>0),F31-E31-M31,IF(AND(C31>20,D31=0,E31=0,F31<>0),24-C31+F31-M31,IF(AND(C31<>0,D31=0,E31=0,F31<>0),F31-C31-M31,0)))))","v":0},{"$f":"IF(G31=0,0,IF(K31=0.5,0,G31-Calendrier!$AT$9))","v":0},1.75,"Sa",0,null,0]
["2023-05-14",{"$f":"INDIRECT(ADDRESS(MATCH($B$1,Calendrier!$A$15:$A$59,0)+14,ROW()-17,3,1,\"Calendrier\"),1)","v":"Di"},null,null,null,null,{"$f":"IF(AND(C32<>0,D32<>0,E32<>0,F32<>0),F32-E32+D32-C32-M32-IF(E32-D32<Calendrier!$AT$10,Calendrier!$AT$10,0),IF(AND(C32<>0,D32<>0,E32=0,F32=0),D32-C32-M32,IF(AND(C32=0,D32=0,E32<>0,F32<>0),F32-E32-M32,IF(AND(C32>20,D32=0,E32=0,F32<>0),24-C32+F32-M32,IF(AND(C32<>0,D32=0,E32=0,F32<>0),F32-C32-M32,0)))))","v":0},{"$f":"IF(G32=0,0,IF(K32=0.5,0,G32-Calendrier!$AT$9))","v":0},1.75,"Di",0,null,0]
["2023-05-15",{"$f":"INDIRECT(ADDRESS(MATCH($B$1,Calendrier!$A$15:$A$59,0)+14,ROW()-17,3,1,\"Calendrier\"),1)","v":"T"},null,null,null,null,{"$f":"IF(AND(C33<>0,D33<>0,E33<>0,F33<>0),F33-E33+D33-C33-M33-IF(E33-D33<Calendrier!$AT$10,Calendrier!$AT$10,0),IF(AND(C33<>0,D33<>0,E33=0,F33=0),D33-C33-M33,IF(AND(C33=0,D33=0,E33<>0,F33<>0),F33-E33-M33,IF(AND(C33>20,D33=0,E33=0,F33<>0),24-C33+F33-M33,IF(AND(C33<>0,D33=0,E33=0,F33<>0),F33-C33-M33,0)))))","v":0},{"$f":"IF(G33=0,0,IF(K33=0.5,0,G33-Calendrier!$AT$9))","v":0},1.75,"T",0,null,0]
["2023-05-16",{"$f":"INDIRECT(ADDRESS(MATCH($B$1,Calendrier!$A$15:$A$59,0)+14,ROW()-17,3,1,\"Calendrier\"),1)","v":"T"},null,null,null,null,{"$f":"IF(AND(C34<>0,D34<>0,E34<>0,F34<>0),F34-E34+D34-C34-M34-IF(E34-D34<Calendrier!$AT$10,Calendrier!$AT$10,0),IF(AND(C34<>0,D34<>0,E34=0,F34=0),D34-C34-M34,IF(AND(C34=0,D34=0,E34<>0,F34<>0),F34-E34-M34,IF(AND(C34>20,D34=0,E34=0,F34<>0),24-C34+F34-M34,IF(AND(C34<>0,D34=0,E34=0,F34<>0),F34-C34-M34,0)))))","v":0},{"$f":"IF(G34=0,0,IF(K34=0.5,0,G34-Calendrier!$AT$9))","v":0},1.75,{"$f":"IF(AND(COUNTA(C34:F34)=0,OR(B34=\"F\",WEEKDAY(A34,2)>5,B34=\"T\",B34=\"RTT\",B34=\"CA\")),B34,IF(AND(COUNTA(C34:F34)>=2,OR(B34=\"F\",B34=\"RTT\",B34=\"CA\",B34=\"Sa\",B34=\"Di\")),\"calendrier\",IF(AND(COUNTA(C34)+COUNTA(F34)=2,OR(COUNTA(C34:D34)<1,COUNTA(E34:F34)<1)),\"erreur\",IF(COUNTA(C34:F34)=3,\"en cours\",IF(COUNTA(C34:F34)=4,B34,IF(OR(AND(C34<>0,D34<>0),AND(E34<>0,F34<>0)),$F$12,IF(AND(C34<>0,D34=0,E34=0,F34<>0,WEEKDAY(A34,2)>5),\"calendrier\",IF(AND(C34<>0,D34=0,E34=0,F34<>0),$B34,\"\"))))))))","v":"T"},0,null,0]
["2023-05-17",{"$f":"INDIRECT(ADDRESS(MATCH($B$1,Calendrier!$A$15:$A$59,0)+14,ROW()-17,3,1,\"Calendrier\"),1)","v":"T"},null,null,null,null,{"$f":"IF(AND(C35<>0,D35<>0,E35<>0,F35<>0),F35-E35+D35-C35-M35-IF(E35-D35<Calendrier!$AT$10,Calendrier!$AT$10,0),IF(AND(C35<>0,D35<>0,E35=0,F35=0),D35-C35-M35,IF(AND(C35=0,D35=0,E35<>0,F35<>0),F35-E35-M35,IF(AND(C35>20,D35=0,E35=0,F35<>0),24-C35+F35-M35,IF(AND(C35<>0,D35=0,E35=0,F35<>0),F35-C35-M35,0)))))","v":0},{"$f":"IF(G35=0,0,IF(K35=0.5,0,G35-Calendrier!$AT$9))","v":0},1.75,"T",0,null,0]
["2023-05-18",{"$f":"INDIRECT(ADDRESS(MATCH($B$1,Calendrier!$A$15:$A$59,0)+14,ROW()-17,3,1,\"Calendrier\"),1)","v":"F"},null,null,null,null,{"$f":"IF(AND(C36<>0,D36<>0,E36<>0,F36<>0),F36-E36+D36-C36-M36-IF(E36-D36<Calendrier!$AT$10,Calendrier!$AT$10,0),IF(AND(C36<>0,D36<>0,E36=0,F36=0),D36-C36-M36,IF(AND(C36=0,D36=0,E36<>0,F36<>0),F36-E36-M36,IF(AND(C36>20,D36=0,E36=0,F36<>0),24-C36+F36-M36,IF(AND(C36<>0,D36=0,E36=0,F36<>0),F36-C36-M36,0)))))","v":0},{"$f":"IF(G36=0,0,IF(K36=0.5,0,G36-Calendrier!$AT$9))","v":0},1.75,"F",0,null,0]
["2023-05-19",{"$f":"INDIRECT(ADDRESS(MATCH($B$1,Calendrier!$A$15:$A$59,0)+14,ROW()-17,3,1,\"Calendrier\"),1)","v":"CA"},null,null,null,null,{"$f":"IF(AND(C37<>0,D37<>0,E37<>0,F37<>0),F37-E37+D37-C37-M37-IF(E37-D37<Calendrier!$AT$10,Calendrier!$AT$10,0),IF(AND(C37<>0,D37<>0,E37=0,F37=0),D37-C37-M37,IF(AND(C37=0,D37=0,E37<>0,F37<>0),F37-E37-M37,IF(AND(C37>20,D37=0,E37=0,F37<>0),24-C37+F37-M37,IF(AND(C37<>0,D37=0,E37=0,F37<>0),F37-C37-M37,0)))))","v":0},{"$f":"IF(G37=0,0,IF(K37=0.5,0,G37-Calendrier!$AT$9))","v":0},1.75,"CA",0,null,0]
["2023-05-20",{"$f":"INDIRECT(ADDRESS(MATCH($B$1,Calendrier!$A$15:$A$59,0)+14,ROW()-17,3,1,\"Calendrier\"),1)","v":"Sa"},null,null,null,null,{"$f":"IF(AND(C38<>0,D38<>0,E38<>0,F38<>0),F38-E38+D38-C38-M38-IF(E38-D38<Calendrier!$AT$10,Calendrier!$AT$10,0),IF(AND(C38<>0,D38<>0,E38=0,F38=0),D38-C38-M38,IF(AND(C38=0,D38=0,E38<>0,F38<>0),F38-E38-M38,IF(AND(C38>20,D38=0,E38=0,F38<>0),24-C38+F38-M38,IF(AND(C38<>0,D38=0,E38=0,F38<>0),F38-C38-M38,0)))))","v":0},{"$f":"IF(G38=0,0,IF(K38=0.5,0,G38-Calendrier!$AT$9))","v":0},1.75,"Sa",0,null,0]
["2023-05-21",{"$f":"INDIRECT(ADDRESS(MATCH($B$1,Calendrier!$A$15:$A$59,0)+14,ROW()-17,3,1,\"Calendrier\"),1)","v":"Di"},null,null,null,null,{"$f":"IF(AND(C39<>0,D39<>0,E39<>0,F39<>0),F39-E39+D39-C39-M39-IF(E39-D39<Calendrier!$AT$10,Calendrier!$AT$10,0),IF(AND(C39<>0,D39<>0,E39=0,F39=0),D39-C39-M39,IF(AND(C39=0,D39=0,E39<>0,F39<>0),F39-E39-M39,IF(AND(C39>20,D39=0,E39=0,F39<>0),24-C39+F39-M39,IF(AND(C39<>0,D39=0,E39=0,F39<>0),F39-C39-M39,0)))))","v":0},{"$f":"IF(G39=0,0,IF(K39=0.5,0,G39-Calendrier!$AT$9))","v":0},1.75,"Di",0,null,0]
["2023-05-22",{"$f":"INDIRECT(ADDRESS(MATCH($B$1,Calendrier!$A$15:$A$59,0)+14,ROW()-17,3,1,\"Calendrier\"),1)","v":"T"},null,null,null,null,{"$f":"IF(AND(C40<>0,D40<>0,E40<>0,F40<>0),F40-E40+D40-C40-M40-IF(E40-D40<Calendrier!$AT$10,Calendrier!$AT$10,0),IF(AND(C40<>0,D40<>0,E40=0,F40=0),D40-C40-M40,IF(AND(C40=0,D40=0,E40<>0,F40<>0),F40-E40-M40,IF(AND(C40>20,D40=0,E40=0,F40<>0),24-C40+F40-M40,IF(AND(C40<>0,D40=0,E40=0,F40<>0),F40-C40-M40,0)))))","v":0},{"$f":"IF(G40=0,0,IF(K40=0.5,0,G40-Calendrier!$AT$9))","v":0},1.75,"T",0,null,0]
["2023-05-23",{"$f":"INDIRECT(ADDRESS(MATCH($B$1,Calendrier!$A$15:$A$59,0)+14,ROW()-17,3,1,\"Calendrier\"),1)","v":"T"},null,null,null,null,{"$f":"IF(AND(C41<>0,D41<>0,E41<>0,F41<>0),F41-E41+D41-C41-M41-IF(E41-D41<Calendrier!$AT$10,Calendrier!$AT$10,0),IF(AND(C41<>0,D41<>0,E41=0,F41=0),D41-C41-M41,IF(AND(C41=0,D41=0,E41<>0,F41<>0),F41-E41-M41,IF(AND(C41>20,D41=0,E41=0,F41<>0),24-C41+F41-M41,IF(AND(C41<>0,D41=0,E41=0,F41<>0),F41-C41-M41,0)))))","v":0},{"$f":"IF(G41=0,0,IF(K41=0.5,0,G41-Calendrier!$AT$9))","v":0},1.75,"T",0,null,0]
["2023-05-24",{"$f":"INDIRECT(ADDRESS(MATCH($B$1,Calendrier!$A$15:$A$59,0)+14,ROW()-17,3,1,\"Calendrier\"),1)","v":"T"},null,null,null,null,{"$f":"IF(AND(C42<>0,D42<>0,E42<>0,F42<>0),F42-E42+D42-C42-M42-IF(E42-D42<Calendrier!$AT$10,Calendrier!$AT$10,0),IF(AND(C42<>0,D42<>0,E42=0,F42=0),D42-C42-M42,IF(AND(C42=0,D42=0,E42<>0,F42<>0),F42-E42-M42,IF(AND(C42>20,D42=0,E42=0,F42<>0),24-C42+F42-M42,IF(AND(C42<>0,D42=0,E42=0,F42<>0),F42-C42-M42,0)))))","v":0},{"$f":"IF(G42=0,0,IF(K42=0.5,0,G42-Calendrier!$AT$9))","v":0},1.75,"T",0,null,0]
["2023-05-25",{"$f":"INDIRECT(ADDRESS(MATCH($B$1,Calendrier!$A$15:$A$59,0)+14,ROW()-17,3,1,\"Calendrier\"),1)","v":"T"},null,null,null,null,{"$f":"IF(AND(C43<>0,D43<>0,E43<>0,F43<>0),F43-E43+D43-C43-M43-IF(E43-D43<Calendrier!$AT$10,Calendrier!$AT$10,0),IF(AND(C43<>0,D43<>0,E43=0,F43=0),D43-C43-M43,IF(AND(C43=0,D43=0,E43<>0,F43<>0),F43-E43-M43,IF(AND(C43>20,D43=0,E43=0,F43<>0),24-C43+F43-M43,IF(AND(C43<>0,D43=0,E43=0,F43<>0),F43-C43-M43,0)))))","v":0},{"$f":"IF(G43=0,0,IF(K43=0.5,0,G43-Calendrier!$AT$9))","v":0},1.75,"T",0,null,0]
["2023-05-26",{"$f":"INDIRECT(ADDRESS(MATCH($B$1,Calendrier!$A$15:$A$59,0)+14,ROW()-17,3,1,\"Calendrier\"),1)","v":"T"},null,null,null,null,{"$f":"IF(AND(C44<>0,D44<>0,E44<>0,F44<>0),F44-E44+D44-C44-M44-IF(E44-D44<Calendrier!$AT$10,Calendrier!$AT$10,0),IF(AND(C44<>0,D44<>0,E44=0,F44=0),D44-C44-M44,IF(AND(C44=0,D44=0,E44<>0,F44<>0),F44-E44-M44,IF(AND(C44>20,D44=0,E44=0,F44<>0),24-C44+F44-M44,IF(AND(C44<>0,D44=0,E44=0,F44<>0),F44-C44-M44,0)))))","v":0},{"$f":"IF(G44=0,0,IF(K44=0.5,0,G44-Calendrier!$AT$9))","v":0},1.75,"T",0,null,0]
["2023-05-27",{"$f":"INDIRECT(ADDRESS(MATCH($B$1,Calendrier!$A$15:$A$59,0)+14,ROW()-17,3,1,\"Calendrier\"),1)","v":"Sa"},null,null,null,null,{"$f":"IF(AND(C45<>0,D45<>0,E45<>0,F45<>0),F45-E45+D45-C45-M45-IF(E45-D45<Calendrier!$AT$10,Calendrier!$AT$10,0),IF(AND(C45<>0,D45<>0,E45=0,F45=0),D45-C45-M45,IF(AND(C45=0,D45=0,E45<>0,F45<>0),F45-E45-M45,IF(AND(C45>20,D45=0,E45=0,F45<>0),24-C45+F45-M45,IF(AND(C45<>0,D45=0,E45=0,F45<>0),F45-C45-M45,0)))))","v":0},{"$f":"IF(G45=0,0,IF(K45=0.5,0,G45-Calendrier!$AT$9))","v":0},1.75,"Sa",0,null,0]
["2023-05-28",{"$f":"INDIRECT(ADDRESS(MATCH($B$1,Calendrier!$A$15:$A$59,0)+14,ROW()-17,3,1,\"Calendrier\"),1)","v":"F"},null,null,null,null,{"$f":"IF(AND(C46<>0,D46<>0,E46<>0,F46<>0),F46-E46+D46-C46-M46-IF(E46-D46<Calendrier!$AT$10,Calendrier!$AT$10,0),IF(AND(C46<>0,D46<>0,E46=0,F46=0),D46-C46-M46,IF(AND(C46=0,D46=0,E46<>0,F46<>0),F46-E46-M46,IF(AND(C46>20,D46=0,E46=0,F46<>0),24-C46+F46-M46,IF(AND(C46<>0,D46=0,E46=0,F46<>0),F46-C46-M46,0)))))","v":0},{"$f":"IF(G46=0,0,IF(K46=0.5,0,G46-Calendrier!$AT$9))","v":0},1.75,"F",0,null,0]
["2023-05-29",{"$f":"INDIRECT(ADDRESS(MATCH($B$1,Calendrier!$A$15:$A$59,0)+14,ROW()-17,3,1,\"Calendrier\"),1)","v":"T"},null,null,null,null,{"$f":"IF(AND(C47<>0,D47<>0,E47<>0,F47<>0),F47-E47+D47-C47-M47-IF(E47-D47<Calendrier!$AT$10,Calendrier!$AT$10,0),IF(AND(C47<>0,D47<>0,E47=0,F47=0),D47-C47-M47,IF(AND(C47=0,D47=0,E47<>0,F47<>0),F47-E47-M47,IF(AND(C47>20,D47=0,E47=0,F47<>0),24-C47+F47-M47,IF(AND(C47<>0,D47=0,E47=0,F47<>0),F47-C47-M47,0)))))","v":0},{"$f":"IF(G47=0,0,IF(K47=0.5,0,G47-Calendrier!$AT$9))","v":0},1.75,"T",0,null,0]
["2023-05-30",{"$f":"INDIRECT(ADDRESS(MATCH($B$1,Calendrier!$A$15:$A$59,0)+14,ROW()-17,3,1,\"Calendrier\"),1)","v":"T"},null,null,null,null,{"$f":"IF(AND(C48<>0,D48<>0,E48<>0,F48<>0),F48-E48+D48-C48-M48-IF(E48-D48<Calendrier!$AT$10,Calendrier!$AT$10,0),IF(AND(C48<>0,D48<>0,E48=0,F48=0),D48-C48-M48,IF(AND(C48=0,D48=0,E48<>0,F48<>0),F48-E48-M48,IF(AND(C48>20,D48=0,E48=0,F48<>0),24-C48+F48-M48,IF(AND(C48<>0,D48=0,E48=0,F48<>0),F48-C48-M48,0)))))","v":0},{"$f":"IF(G48=0,0,IF(K48=0.5,0,G48-Calendrier!$AT$9))","v":0},1.75,"T",0,null,0]
["2023-05-31",{"$f":"INDIRECT(ADDRESS(MATCH($B$1,Calendrier!$A$15:$A$59,0)+14,ROW()-17,3,1,\"Calendrier\"),1)","v":"T"},null,null,null,null,{"$f":"IF(AND(C49<>0,D49<>0,E49<>0,F49<>0),F49-E49+D49-C49-M49-IF(E49-D49<Calendrier!$AT$10,Calendrier!$AT$10,0),IF(AND(C49<>0,D49<>0,E49=0,F49=0),D49-C49-M49,IF(AND(C49=0,D49=0,E49<>0,F49<>0),F49-E49-M49,IF(AND(C49>20,D49=0,E49=0,F49<>0),24-C49+F49-M49,IF(AND(C49<>0,D49=0,E49=0,F49<>0),F49-C49-M49,0)))))","v":0},{"$f":"IF(G49=0,0,IF(K49=0.5,0,G49-Calendrier!$AT$9))","v":0},1.75,"T",0,null,0]
[null,null,null,null,null,null,{"$f":"SUM(G19:G49)","v":0},null,{"$f":"I49","v":1.75}]

{"sheet":"JUN","index":8,"n_rows":50,"n_cols":18,"rows_kept":50,"cut":false,"hidden":false,"merged":[]}
[null,{"$f":"RIGHT(CELL(\"nomfichier\",$A$1),3)","v":"JUN"},"FICHE DE SUIVI HORAIRE"]
[]
[null,"mois :","JUIN",null,null,"année ",{"$f":"VLOOKUP(C3,Fériés!$I$1:$J$12,2,FALSE)","v":2023},null,null,"service",{"$f":"Calendrier!F4","v":"Administratif"}]
[]
[null,"nom :",{"$f":"Calendrier!F2","v":"Isq"},null,null," prénom ",{"$f":"Calendrier!F3","v":"Philippe"},null,null,"N° Ident",{"$f":"Calendrier!F1","v":"T506489"}]
[null,null,null,null,null,null,null,"à réaliser","cumul","en cours","reste",null,"N.cumul"]
[null,null,null,"Nb J",{"$f":"Calendrier!$AT$11","v":218},{"$f":"$H$10","v":0},{"$f":"E7-F7","v":218},{"$f":"Calendrier!N1","v":365},{"$f":"MAI!I7","v":116.5},{"$f":"SUM(J8:J15)","v":27},{"$f":"H7-(I7+J7)","v":221.5},null,{"$f":"SUM(M8:M15)","v":143.5},null,null,null,{"$f":"MAI!M7","v":147.5}]
[null,null,null,null,null,"1/2CA","CA",{"$f":"Calendrier!N5","v":25},{"$f":"MAI!I8","v":0},{"$f":"COUNTIF($J$19:$J$49,G8)+COUNTIF($J$19:$J$49,F8)/2","v":0},{"$f":"+H8-(I8+J8)","v":25},"J",{"$f":"+I8+J8","v":0},null,null,null,{"$f":"MAI!M8","v":1}]
[null,null,null,null,null,"1/2RTT","RTT",{"$f":"Calendrier!N8","v":9},{"$f":"MAI!I9","v":3},{"$f":"COUNTIF($J$19:$J$49,G9)+COUNTIF($J$19:$J$49,F9)/2","v":0},{"$f":"+H9-(I9+J9)","v":6},"J",3,null,null,null,{"$f":"MAI!M9","v":3},{"$f":"IF(COUNTA($C$27:$F$27)=0,0,\"suite\")","v":0}]
[null,null,null,null,null,"1/2CS","CS",{"$f":"Calendrier!N9","v":0},{"$f":"MAI!I10","v":0},0,{"$f":"H10-(I10+J10)","v":0},"J",0,null,null,null,{"$f":"MAI!M10","v":0},{"$f":"IF(AND(C27<>0,D27=0,E27=0,F27<>0),F27-C27-M27-IF(OR(AND(C27=5,F27=13),AND(C27=13,F27=21),AND(C27=21,F27=5)),0,Calendrier!$AT$10),\"suite\")","v":"suite"}]
[null,null,null,null,null,"1/2CP","CP",{"$f":"Calendrier!N6","v":0},{"$f":"MAI!I11","v":0},0,{"$f":"H11-(I11+J11)","v":0},"J",0,null,null,null,{"$f":"MAI!M11","v":0}]
[null,null,null,null,null,"1/2T","T",{"$f":"Calendrier!N7","v":218},{"$f":"MAI!I12","v":77.5},21,{"$f":"+H12-(I12+J12)","v":119.5},"J",98.5,null,null,null,{"$f":"MAI!M12","v":96.5}]
[null,null,null,null,null,0,"Sa",{"$f":"Calendrier!N4","v":51},{"$f":"MAI!I13","v":17},{"$f":"COUNTIF($J$19:$J$49,G13)","v":2},{"$f":"+H13-(I13+J13)","v":32},"J",19,null,null,null,{"$f":"MAI!M13","v":21}]
[null,null,null,null,null,0,"Di",{"$f":"Calendrier!N3","v":50},{"$f":"MAI!I14","v":16},{"$f":"COUNTIF($J$19:$J$49,G14)","v":4},{"$f":"+H14-(I14+J14)","v":30},"J",20,null,null,null,{"$f":"MAI!M14","v":19}]
[null,null,null,null,null,0,"F",{"$f":"Calendrier!N2","v":12},{"$f":"MAI!I15","v":3},{"$f":"COUNTIF($J$19:$J$49,G15)","v":0},{"$f":"+H15-(I15+J15)","v":9},"J",3,null,null,null,{"$f":"MAI!M15","v":7}]
[null,null,null,null,null,null,"heure/avance fin mois",null,{"$f":"MAI!I16","v":1.75},null,null,null,{"$f":"I50","v":4.5},"avec bon",null,null,{"$f":"MAI!M16","v":1.75}]
[null,"Prévu","Entrée","Sortie","Entrée","Sortie","total","variation","cumul","Type","nb J/T",null,"divers E/S","Sortie","Retour"]
[null,null,null,null,null,null,null,null,{"$f":"MAI!I18","v":1.75},null,null,null,null,null,null,null,{"$f":"MAI!I50","v":1.75}]
[{"$f":"VALUE(\"01/06/\"&G3)","v":"2023-06-01"},{"$f":"INDIRECT(ADDRESS(MATCH($B$1,Calendrier!$A$15:$A$59,0)+14,ROW()-17,3,1,\"Calendrier\"),1)","v":"T"},null,null,null,null,{"$f":"IF(AND(C19<>0,D19<>0,E19<>0,F19<>0),F19-E19+D19-C19-K19-IF(E19-D19<Calendrier!$AT$10,Calendrier!$AT$10,0),IF(AND(C19<>0,D19<>0,E19=0,F19=0),D19-C19-K19,IF(AND(C19=0,D19=0,E19<>0,F19<>0),F19-E19-K19,IF(AND(C19>20,D19=0,E19=0,F19<>0),24-C19+F19-K19,IF(AND(C19<>0,D19=0,E19=0,F19<>0),F19-C19-K19,0)))))","v":0},{"$f":"IF(G19=0,0,IF(K19=0.5,0,G19-Calendrier!$AT$9))","v":0},{"$f":"I18+H19","v":1.75},{"$f":"IF(AND(COUNTA(C19:F19)=0,OR(B19=\"F\",WEEKDAY(A19,2)>5,B19=\"T\",B19=\"RTT\",B19=\"CA\")),B19,IF(AND(COUNTA(C19:F19)>=2,OR(B19=\"F\",B19=\"RTT\",B19=\"CA\",B19=\"Sa\",B19=\"Di\")),\"calendrier\",IF(AND(COUNTA(C19)+COUNTA(F19)=2,OR(COUNTA(C19:D19)<1,COUNTA(E19:F19)<1)),\"erreur\",IF(COUNTA(C19:F19)=3,\"en cours\",IF(COUNTA(C19:F19)=4,B19,IF(OR(AND(C19<>0,D19<>0),AND(E19<>0,F19<>0)),$F$12,IF(AND(C19<>0,D19=0,E19=0,F19<>0,WEEKDAY(A19,2)>5),\"calendrier\",IF(AND(C19<>0,D19=0,E19=0,F19<>0),$B19,\"\"))))))))","v":"T"},{"$f":"IF(COUNTA(C19:F19)=4,1,IF(OR(AND(C19<>0,D19<>0),AND(E19<>0,F19<>0)),0.5,IF(AND(C19<>0,F19<>0,D19=0,E19=0,B19=\"T\"),1,0)))","v":0},null,{"$f":"IF(OR(N19=0,O19=0),0,O19-N19)","v":0}]
[{"$f":"A19+1","v":"2023-06-02"},{"$f":"INDIRECT(ADDRESS(MATCH($B$1,Calendrier!$A$15:$A$59,0)+14,ROW()-17,3,1,\"Calendrier\"),1)","v":"T"},7,13,null,null,{"$f":"IF(AND(C20<>0,D20<>0,E20<>0,F20<>0),F20-E20+D20-C20-K20-IF(E20-D20<Calendrier!$AT$10,Calendrier!$AT$10,0),IF(AND(C20<>0,D20<>0,E20=0,F20=0),D20-C20-K20,IF(AND(C20=0,D20=0,E20<>0,F20<>0),F20-E20-K20,IF(AND(C20>20,D20=0,E20=0,F20<>0),24-C20+F20-K20,IF(AND(C20<>0,D20=0,E20=0,F20<>0),F20-C20-K20,0)))))","v":5.5},{"$f":"IF(G20=0,0,IF(K20=0.5,0,G20-Calendrier!$AT$9))","v":0},1.75,"1/2T",0.5,null,0]
[{"$f":"A20+1","v":"2023-06-03"},{"$f":"INDIRECT(ADDRESS(MATCH($B$1,Calendrier!$A$15:$A$59,0)+14,ROW()-17,3,1,\"Calendrier\"),1)","v":"Sa"},8,null,null,17,{"$f":"IF(AND(C21<>0,D21<>0,E21<>0,F21<>0),F21-E21+D21-C21-M21-IF(E21-D21<Calendrier!$AT$10,Calendrier!$AT$10,0),IF(AND(C21<>0,D21<>0,E21=0,F21=0),D21-C21-M21,IF(AND(C21=0,D21=0,E21<>0,F21<>0),F21-E21-M21,IF(AND(C21>20,D21=0,E21=0,F21<>0),24-C21+F21-M21,IF(AND(C21<>0,D21=0,E21=0,F21<>0),F21-C21-M21,0)))))","v":9},{"$f":"IF(G21=0,0,IF(K21=0.5,0,G21-Calendrier!$AT$9))","v":1},{"$f":"I20+H21","v":2.75},"calendrier",0,null,0]
["2023-06-04",{"$f":"INDIRECT(ADDRESS(MATCH($B$1,Calendrier!$A$15:$A$59,0)+14,ROW()-17,3,1,\"Calendrier\"),1)","v":"Di"},null,null,null,null,{"$f":"IF(AND(C22<>0,D22<>0,E22<>0,F22<>0),F22-E22+D22-C22-M22-IF(E22-D22<Calendrier!$AT$10,Calendrier!$AT$10,0),IF(AND(C22<>0,D22<>0,E22=0,F22=0),D22-C22-M22,IF(AND(C22=0,D22=0,E22<>0,F22<>0),F22-E22-M22,IF(AND(C22>20,D22=0,E22=0,F22<>0),24-C22+F22-M22,IF(AND(C22<>0,D22=0,E22=0,F22<>0),F22-C22-M22,0)))))","v":0},{"$f":"IF(G22=0,0,IF(K22=0.5,0,G22-Calendrier!$AT$9))","v":0},2.75,"Di",0,null,0]
["2023-06-05",{"$f":"INDIRECT(ADDRESS(MATCH($B$1,Calendrier!$A$15:$A$59,0)+14,ROW()-17,3,1,\"Calendrier\"),1)","v":"T"},null,null,null,null,{"$f":"IF(AND(C23<>0,D23<>0,E23<>0,F23<>0),F23-E23+D23-C23-M23-IF(E23-D23<Calendrier!$AT$10,Calendrier!$AT$10,0),IF(AND(C23<>0,D23<>0,E23=0,F23=0),D23-C23-M23,IF(AND(C23=0,D23=0,E23<>0,F23<>0),F23-E23-M23,IF(AND(C23>20,D23=0,E23=0,F23<>0),24-C23+F23-M23,IF(AND(C23<>0,D23=0,E23=0,F23<>0),F23-C23-M23,0)))))","v":0},{"$f":"IF(G23=0,0,IF(K23=0.5,0,G23-Calendrier!$AT$9))","v":0},2.75,"T",0,null,0]
["2023-06-06",{"$f":"INDIRECT(ADDRESS(MATCH($B$1,Calendrier!$A$15:$A$59,0)+14,ROW()-17,3,1,\"Calendrier\"),1)","v":"T"},8,12.5,13,17.25,{"$f":"IF(AND(C24<>0,D24<>0,E24<>0,F24<>0),F24-E24+D24-C24-M24-IF(E24-D24<Calendrier!$AT$10,Calendrier!$AT$10,0),IF(AND(C24<>0,D24<>0,E24=0,F24=0),D24-C24-M24,IF(AND(C24=0,D24=0,E24<>0,F24<>0),F24-E24-M24,IF(AND(C24>20,D24=0,E24=0,F24<>0),24-C24+F24-M24,IF(AND(C24<>0,D24=0,E24=0,F24<>0),F24-C24-M24,0)))))","v":8},{"$f":"IF(G24=0,0,IF(K24=0.5,0,G24-Calendrier!$AT$9))","v":0},2.75,"T",1,null,{"$f":"IF(OR(N24=0,O24=0),0,O24-N24)","v":0}]
["2023-06-07",{"$f":"INDIRECT(ADDRESS(MATCH($B$1,Calendrier!$A$15:$A$59,0)+14,ROW()-17,3,1,\"Calendrier\"),1)","v":"T"},null,null,13,18,{"$f":"IF(AND(C25<>0,D25<>0,E25<>0,F25<>0),F25-E25+D25-C25-M25-IF(E25-D25<Calendrier!$AT$10,Calendrier!$AT$10,0),IF(AND(C25<>0,D25<>0,E25=0,F25=0),D25-C25-M25,IF(AND(C25=0,D25=0,E25<>0,F25<>0),F25-E25-M25,IF(AND(C25>20,D25=0,E25=0,F25<>0),24-C25+F25-M25,IF(AND(C25<>0,D25=0,E25=0,F25<>0),F25-C25-M25,0)))))","v":5},{"$f":"IF(G25=0,0,IF(K25=0.5,0,G25-Calendrier!$AT$9))","v":0},2.75,"1/2T",0.5,null,{"$f":"IF(OR(N25=0,O25=0),0,O25-N25)","v":0}]
["2023-06-08",{"$f":"INDIRECT(ADDRESS(MATCH($B$1,Calendrier!$A$15:$A$59,0)+14,ROW()-17,3,1,\"Calendrier\"),1)","v":"T"},5,null,null,13,{"$f":"IF(AND(C26<>0,D26<>0,E26<>0,F26<>0),F26-E26+D26-C26-M26-IF(E26-D26<Calendrier!$AT$10,Calendrier!$AT$10,0),IF(AND(C26<>0,D26<>0,E26=0,F26=0),D26-C26-M26,IF(AND(C26=0,D26=0,E26<>0,F26<>0),F26-E26-M26,IF(AND(C26>20,D26=0,E26=0,F26<>0),24-C26+F26-M26,IF(AND(C26<>0,D26=0,E26=0,F26<>0),F26-C26-M26,0)))))","v":8},{"$f":"IF(G26=0,0,IF(K26=0.5,0,G26-Calendrier!$AT$9))","v":0},2.75,"T",1,null,0]
["2023-06-09",{"$f":"INDIRECT(ADDRESS(MATCH($B$1,Calendrier!$A$15:$A$59,0)+14,ROW()-17,3,1,\"Calendrier\"),1)","v":"T"},null,null,null,null,{"$f":"IF(AND(C27<>0,D27<>0,E27<>0,F27<>0),F27-E27+D27-C27-M27-IF(E27-D27<Calendrier!$AT$10,Calendrier!$AT$10,0),IF(AND(C27<>0,D27<>0,E27=0,F27=0),D27-C27-M27,IF(AND(C27=0,D27=0,E27<>0,F27<>0),F27-E27-M27,IF(AND(C27>20,D27=0,E27=0,F27<>0),24-C27+F27-M27,IF(AND(C27<>0,D27=0,E27=0,F27<>0),F27-C27-M27,0)))))","v":0},{"$f":"IF(G27=0,0,IF(K27=0.5,0,G27-Calendrier!$AT$9))","v":0},2.75,"T",0,null,0]
["2023-06-10",{"$f":"INDIRECT(ADDRESS(MATCH($B$1,Calendrier!$A$15:$A$59,0)+14,ROW()-17,3,1,\"Calendrier\"),1)","v":"Sa"},13,null,null,21,{"$f":"IF(AND(C28<>0,D28<>0,E28<>0,F28<>0),F28-E28+D28-C28-M28-IF(E28-D28<Calendrier!$AT$10,Calendrier!$AT$10,0),IF(AND(C28<>0,D28<>0,E28=0,F28=0),D28-C28-M28,IF(AND(C28=0,D28=0,E28<>0,F28<>0),F28-E28-M28,IF(AND(C28>20,D28=0,E28=0,F28<>0),24-C28+F28-M28,IF(AND(C28<>0,D28=0,E28=0,F28<>0),F28-C28-M28,0)))))","v":8},{"$f":"IF(G28=0,0,IF(K28=0.5,0,G28-Calendrier!$AT$9))","v":0},2.75,"calendrier",0,null,0]
["2023-06-11",{"$f":"INDIRECT(ADDRESS(MATCH($B$1,Calendrier!$A$15:$A$59,0)+14,ROW()-17,3,1,\"Calendrier\"),1)","v":"Di"},null,null,null,null,{"$f":"IF(AND(C29<>0,D29<>0,E29<>0,F29<>0),F29-E29+D29-C29-M29-IF(E29-D29<Calendrier!$AT$10,Calendrier!$AT$10,0),IF(AND(C29<>0,D29<>0,E29=0,F29=0),D29-C29-M29,IF(AND(C29=0,D29=0,E29<>0,F29<>0),F29-E29-M29,IF(AND(C29>20,D29=0,E29=0,F29<>0),24-C29+F29-M29,IF(AND(C29<>0,D29=0,E29=0,F29<>0),F29-C29-M29,0)))))","v":0},{"$f":"IF(G29=0,0,IF(K29=0.5,0,G29-Calendrier!$AT$9))","v":0},2.75,"Di",0,null,0]
["2023-06-12",{"$f":"INDIRECT(ADDRESS(MATCH($B$1,Calendrier!$A$15:$A$59,0)+14,ROW()-17,3,1,\"Calendrier\"),1)","v":"T"},null,null,null,null,{"$f":"IF(AND(C30<>0,D30<>0,E30<>0,F30<>0),F30-E30+D30-C30-M30-IF(E30-D30<Calendrier!$AT$10,Calendrier!$AT$10,0),IF(AND(C30<>0,D30<>0,E30=0,F30=0),D30-C30-M30,IF(AND(C30=0,D30=0,E30<>0,F30<>0),F30-E30-M30,IF(AND(C30>20,D30=0,E30=0,F30<>0),24-C30+F30-M30,IF(AND(C30<>0,D30=0,E30=0,F30<>0),F30-C30-M30,0)))))","v":0},{"$f":"IF(G30=0,0,IF(K30=0.5,0,G30-Calendrier!$AT$9))","v":0},2.75,"T",0,null,0]
["2023-06-13",{"$f":"INDIRECT(ADDRESS(MATCH($B$1,Calendrier!$A$15:$A$59,0)+14,ROW()-17,3,1,\"Calendrier\"),1)","v":"T"},21,null,null,5,{"$f":"IF(AND(C31<>0,D31<>0,E31<>0,F31<>0),F31-E31+D31-C31-M31-IF(E31-D31<Calendrier!$AT$10,Calendrier!$AT$10,0),IF(AND(C31<>0,D31<>0,E31=0,F31=0),D31-C31-M31,IF(AND(C31=0,D31=0,E31<>0,F31<>0),F31-E31-M31,IF(AND(C31>20,D31=0,E31=0,F31<>0),24-C31+F31-M31,IF(AND(C31<>0,D31=0,E31=0,F31<>0),F31-C31-M31,0)))))","v":8},{"$f":"IF(G31=0,0,IF(K31=0.5,0,G31-Calendrier!$AT$9))","v":0},2.75,"T",1,null,0]
["2023-06-14",{"$f":"INDIRECT(ADDRESS(MATCH($B$1,Calendrier!$A$15:$A$59,0)+14,ROW()-17,3,1,\"Calendrier\"),1)","v":"T"},7,12,13,17,{"$f":"IF(AND(C32<>0,D32<>0,E32<>0,F32<>0),F32-E32+D32-C32-M32-IF(E32-D32<Calendrier!$AT$10,Calendrier!$AT$10,0),IF(AND(C32<>0,D32<>0,E32=0,F32=0),D32-C32-M32,IF(AND(C32=0,D32=0,E32<>0,F32<>0),F32-E32-M32,IF(AND(C32>20,D32=0,E32=0,F32<>0),24-C32+F32-M32,IF(AND(C32<>0,D32=0,E32=0,F32<>0),F32-C32-M32,0)))))","v":9},{"$f":"IF(G32=0,0,IF(K32=0.5,0,G32-Calendrier!$AT$9))","v":1},3.75,"T",1,null,0]
["2023-06-15",{"$f":"INDIRECT(ADDRESS(MATCH($B$1,Calendrier!$A$15:$A$59,0)+14,ROW()-17,3,1,\"Calendrier\"),1)","v":"T"},7,12,12.5,17,{"$f":"IF(AND(C33<>0,D33<>0,E33<>0,F33<>0),F33-E33+D33-C33-M33-IF(E33-D33<Calendrier!$AT$10,Calendrier!$AT$10,0),IF(AND(C33<>0,D33<>0,E33=0,F33=0),D33-C33-M33,IF(AND(C33=0,D33=0,E33<>0,F33<>0),F33-E33-M33,IF(AND(C33>20,D33=0,E33=0,F33<>0),24-C33+F33-M33,IF(AND(C33<>0,D33=0,E33=0,F33<>0),F33-C33-M33,0)))))","v":8.75},{"$f":"IF(G33=0,0,IF(K33=0.5,0,G33-Calendrier!$AT$9))","v":0.75},4.5,"T",1,null,0]
["2023-06-16",{"$f":"INDIRECT(ADDRESS(MATCH($B$1,Calendrier!$A$15:$A$59,0)+14,ROW()-17,3,1,\"Calendrier\"),1)","v":"T"},null,null,null,null,{"$f":"IF(AND(C34<>0,D34<>0,E34<>0,F34<>0),F34-E34+D34-C34-M34-IF(E34-D34<Calendrier!$AT$10,Calendrier!$AT$10,0),IF(AND(C34<>0,D34<>0,E34=0,F34=0),D34-C34-M34,IF(AND(C34=0,D34=0,E34<>0,F34<>0),F34-E34-M34,IF(AND(C34>20,D34=0,E34=0,F34<>0),24-C34+F34-M34,IF(AND(C34<>0,D34=0,E34=0,F34<>0),F34-C34-M34,0)))))","v":0},{"$f":"IF(G34=0,0,IF(K34=0.5,0,G34-Calendrier!$AT$9))","v":0},4.5,{"$f":"IF(AND(COUNTA(C34:F34)=0,OR(B34=\"F\",WEEKDAY(A34,2)>5,B34=\"T\",B34=\"RTT\",B34=\"CA\")),B34,IF(AND(COUNTA(C34:F34)>=2,OR(B34=\"F\",B34=\"RTT\",B34=\"CA\",B34=\"Sa\",B34=\"Di\")),\"calendrier\",IF(AND(COUNTA(C34)+COUNTA(F34)=2,OR(COUNTA(C34:D34)<1,COUNTA(E34:F34)<1)),\"erreur\",IF(COUNTA(C34:F34)=3,\"en cours\",IF(COUNTA(C34:F34)=4,B34,IF(OR(AND(C34<>0,D34<>0),AND(E34<>0,F34<>0)),$F$12,IF(AND(C34<>0,D34=0,E34=0,F34<>0,WEEKDAY(A34,2)>5),\"calendrier\",IF(AND(C34<>0,D34=0,E34=0,F34<>0),$B34,\"\"))))))))","v":"T"},0,null,0]
["2023-06-17",{"$f":"INDIRECT(ADDRESS(MATCH($B$1,Calendrier!$A$15:$A$59,0)+14,ROW()-17,3,1,\"Calendrier\"),1)","v":"Sa"},null,null,null,null,{"$f":"IF(AND(C35<>0,D35<>0,E35<>0,F35<>0),F35-E35+D35-C35-M35-IF(E35-D35<Calendrier!$AT$10,Calendrier!$AT$10,0),IF(AND(C35<>0,D35<>0,E35=0,F35=0),D35-C35-M35,IF(AND(C35=0,D35=0,E35<>0,F35<>0),F35-E35-M35,IF(AND(C35>20,D35=0,E35=0,F35<>0),24-C35+F35-M35,IF(AND(C35<>0,D35=0,E35=0,F35<>0),F35-C35-M35,0)))))","v":0},{"$f":"IF(G35=0,0,IF(K35=0.5,0,G35-Calendrier!$AT$9))","v":0},4.5,"Sa",0,null,0]
["2023-06-18",{"$f":"INDIRECT(ADDRESS(MATCH($B$1,Calendrier!$A$15:$A$59,0)+14,ROW()-17,3,1,\"Calendrier\"),1)","v":"Di"},null,null,null,null,{"$f":"IF(AND(C36<>0,D36<>0,E36<>0,F36<>0),F36-E36+D36-C36-M36-IF(E36-D36<Calendrier!$AT$10,Calendrier!$AT$10,0),IF(AND(C36<>0,D36<>0,E36=0,F36=0),D36-C36-M36,IF(AND(C36=0,D36=0,E36<>0,F36<>0),F36-E36-M36,IF(AND(C36>20,D36=0,E36=0,F36<>0),24-C36+F36-M36,IF(AND(C36<>0,D36=0,E36=0,F36<>0),F36-C36-M36,0)))))","v":0},{"$f":"IF(G36=0,0,IF(K36=0.5,0,G36-Calendrier!$AT$9))","v":0},4.5,"Di",0,null,0]
["2023-06-19",{"$f":"INDIRECT(ADDRESS(MATCH($B$1,Calendrier!$A$15:$A$59,0)+14,ROW()-17,3,1,\"Calendrier\"),1)","v":"T"},null,null,null,null,{"$f":"IF(AND(C37<>0,D37<>0,E37<>0,F37<>0),F37-E37+D37-C37-M37-IF(E37-D37<Calendrier!$AT$10,Calendrier!$AT$10,0),IF(AND(C37<>0,D37<>0,E37=0,F37=0),D37-C37-M37,IF(AND(C37=0,D37=0,E37<>0,F37<>0),F37-E37-M37,IF(AND(C37>20,D37=0,E37=0,F37<>0),24-C37+F37-M37,IF(AND(C37<>0,D37=0,E37=0,F37<>0),F37-C37-M37,0)))))","v":0},{"$f":"IF(G37=0,0,IF(K37=0.5,0,G37-Calendrier!$AT$9))","v":0},4.5,"T",0,null,0]
["2023-06-20",{"$f":"INDIRECT(ADDRESS(MATCH($B$1,Calendrier!$A$15:$A$59,0)+14,ROW()-17,3,1,\"Calendrier\"),1)","v":"T"},null,null,null,null,{"$f":"IF(AND(C38<>0,D38<>0,E38<>0,F38<>0),F38-E38+D38-C38-M38-IF(E38-D38<Calendrier!$AT$10,Calendrier!$AT$10,0),IF(AND(C38<>0,D38<>0,E38=0,F38=0),D38-C38-M38,IF(AND(C38=0,D38=0,E38<>0,F38<>0),F38-E38-M38,IF(AND(C38>20,D38=0,E38=0,F38<>0),24-C38+F38-M38,IF(AND(C38<>0,D38=0,E38=0,F38<>0),F38-C38-M38,0)))))","v":0},{"$f":"IF(G38=0,0,IF(K38=0.5,0,G38-Calendrier!$AT$9))","v":0},4.5,"T",0,null,0]
["2023-06-21",{"$f":"INDIRECT(ADDRESS(MATCH($B$1,Calendrier!$A$15:$A$59,0)+14,ROW()-17,3,1,\"Calendrier\"),1)","v":"T"},null,null,null,null,{"$f":"IF(AND(C39<>0,D39<>0,E39<>0,F39<>0),F39-E39+D39-C39-M39-IF(E39-D39<Calendrier!$AT$10,Calendrier!$AT$10,0),IF(AND(C39<>0,D39<>0,E39=0,F39=0),D39-C39-M39,IF(AND(C39=0,D39=0,E39<>0,F39<>0),F39-E39-M39,IF(AND(C39>20,D39=0,E39=0,F39<>0),24-C39+F39-M39,IF(AND(C39<>0,D39=0,E39=0,F39<>0),F39-C39-M39,0)))))","v":0},{"$f":"IF(G39=0,0,IF(K39=0.5,0,G39-Calendrier!$AT$9))","v":0},4.5,"T",0,null,0]
["2023-06-22",{"$f":"INDIRECT(ADDRESS(MATCH($B$1,Calendrier!$A$15:$A$59,0)+14,ROW()-17,3,1,\"Calendrier\"),1)","v":"T"},null,null,null,null,{"$f":"IF(AND(C40<>0,D40<>0,E40<>0,F40<>0),F40-E40+D40-C40-M40-IF(E40-D40<Calendrier!$AT$10,Calendrier!$AT$10,0),IF(AND(C40<>0,D40<>0,E40=0,F40=0),D40-C40-M40,IF(AND(C40=0,D40=0,E40<>0,F40<>0),F40-E40-M40,IF(AND(C40>20,D40=0,E40=0,F40<>0),24-C40+F40-M40,IF(AND(C40<>0,D40=0,E40=0,F40<>0),F40-C40-M40,0)))))","v":0},{"$f":"IF(G40=0,0,IF(K40=0.5,0,G40-Calendrier!$AT$9))","v":0},4.5,"T",0,null,0]
["2023-06-23",{"$f":"INDIRECT(ADDRESS(MATCH($B$1,Calendrier!$A$15:$A$59,0)+14,ROW()-17,3,1,\"Calendrier\"),1)","v":"T"},null,null,null,null,{"$f":"IF(AND(C41<>0,D41<>0,E41<>0,F41<>0),F41-E41+D41-C41-M41-IF(E41-D41<Calendrier!$AT$10,Calendrier!$AT$10,0),IF(AND(C41<>0,D41<>0,E41=0,F41=0),D41-C41-M41,IF(AND(C41=0,D41=0,E41<>0,F41<>0),F41-E41-M41,IF(AND(C41>20,D41=0,E41=0,F41<>0),24-C41+F41-M41,IF(AND(C41<>0,D41=0,E41=0,F41<>0),F41-C41-M41,0)))))","v":0},{"$f":"IF(G41=0,0,IF(K41=0.5,0,G41-Calendrier!$AT$9))","v":0},4.5,"T",0,null,0]
["2023-06-24",{"$f":"INDIRECT(ADDRESS(MATCH($B$1,Calendrier!$A$15:$A$59,0)+14,ROW()-17,3,1,\"Calendrier\"),1)","v":"Sa"},null,null,null,null,{"$f":"IF(AND(C42<>0,D42<>0,E42<>0,F42<>0),F42-E42+D42-C42-M42-IF(E42-D42<Calendrier!$AT$10,Calendrier!$AT$10,0),IF(AND(C42<>0,D42<>0,E42=0,F42=0),D42-C42-M42,IF(AND(C42=0,D42=0,E42<>0,F42<>0),F42-E42-M42,IF(AND(C42>20,D42=0,E42=0,F42<>0),24-C42+F42-M42,IF(AND(C42<>0,D42=0,E42=0,F42<>0),F42-C42-M42,0)))))","v":0},{"$f":"IF(G42=0,0,IF(K42=0.5,0,G42-Calendrier!$AT$9))","v":0},4.5,"Sa",0,null,0]
["2023-06-25",{"$f":"INDIRECT(ADDRESS(MATCH($B$1,Calendrier!$A$15:$A$59,0)+14,ROW()-17,3,1,\"Calendrier\"),1)","v":"Di"},null,null,null,null,{"$f":"IF(AND(C43<>0,D43<>0,E43<>0,F43<>0),F43-E43+D43-C43-M43-IF(E43-D43<Calendrier!$AT$10,Calendrier!$AT$10,0),IF(AND(C43<>0,D43<>0,E43=0,F43=0),D43-C43-M43,IF(AND(C43=0,D43=0,E43<>0,F43<>0),F43-E43-M43,IF(AND(C43>20,D43=0,E43=0,F43<>0),24-C43+F43-M43,IF(AND(C43<>0,D43=0,E43=0,F43<>0),F43-C43-M43,0)))))","v":0},{"$f":"IF(G43=0,0,IF(K43=0.5,0,G43-Calendrier!$AT$9))","v":0},4.5,"Di",0,null,0]
["2023-06-26",{"$f":"INDIRECT(ADDRESS(MATCH($B$1,Calendrier!$A$15:$A$59,0)+14,ROW()-17,3,1,\"Calendrier\"),1)","v":"T"},null,null,null,null,{"$f":"IF(AND(C44<>0,D44<>0,E44<>0,F44<>0),F44-E44+D44-C44-M44-IF(E44-D44<Calendrier!$AT$10,Calendrier!$AT$10,0),IF(AND(C44<>0,D44<>0,E44=0,F44=0),D44-C44-M44,IF(AND(C44=0,D44=0,E44<>0,F44<>0),F44-E44-M44,IF(AND(C44>20,D44=0,E44=0,F44<>0),24-C44+F44-M44,IF(AND(C44<>0,D44=0,E44=0,F44<>0),F44-C44-M44,0)))))","v":0},{"$f":"IF(G44=0,0,IF(K44=0.5,0,G44-Calendrier!$AT$9))","v":0},4.5,"T",0,null,0]
["2023-06-27",{"$f":"INDIRECT(ADDRESS(MATCH($B$1,Calendrier!$A$15:$A$59,0)+14,ROW()-17,3,1,\"Calendrier\"),1)","v":"T"},null,null,null,null,{"$f":"IF(AND(C45<>0,D45<>0,E45<>0,F45<>0),F45-E45+D45-C45-M45-IF(E45-D45<Calendrier!$AT$10,Calendrier!$AT$10,0),IF(AND(C45<>0,D45<>0,E45=0,F45=0),D45-C45-M45,IF(AND(C45=0,D45=0,E45<>0,F45<>0),F45-E45-M45,IF(AND(C45>20,D45=0,E45=0,F45<>0),24-C45+F45-M45,IF(AND(C45<>0,D45=0,E45=0,F45<>0),F45-C45-M45,0)))))","v":0},{"$f":"IF(G45=0,0,IF(K45=0.5,0,G45-Calendrier!$AT$9))","v":0},4.5,"T",0,null,0]
["2023-06-28",{"$f":"INDIRECT(ADDRESS(MATCH($B$1,Calendrier!$A$15:$A$59,0)+14,ROW()-17,3,1,\"Calendrier\"),1)","v":"T"},null,null,null,null,{"$f":"IF(AND(C46<>0,D46<>0,E46<>0,F46<>0),F46-E46+D46-C46-M46-IF(E46-D46<Calendrier!$AT$10,Calendrier!$AT$10,0),IF(AND(C46<>0,D46<>0,E46=0,F46=0),D46-C46-M46,IF(AND(C46=0,D46=0,E46<>0,F46<>0),F46-E46-M46,IF(AND(C46>20,D46=0,E46=0,F46<>0),24-C46+F46-M46,IF(AND(C46<>0,D46=0,E46=0,F46<>0),F46-C46-M46,0)))))","v":0},{"$f":"IF(G46=0,0,IF(K46=0.5,0,G46-Calendrier!$AT$9))","v":0},4.5,"T",0,null,0]
["2023-06-29",{"$f":"INDIRECT(ADDRESS(MATCH($B$1,Calendrier!$A$15:$A$59,0)+14,ROW()-17,3,1,\"Calendrier\"),1)","v":"T"},null,null,null,null,{"$f":"IF(AND(C47<>0,D47<>0,E47<>0,F47<>0),F47-E47+D47-C47-M47-IF(E47-D47<Calendrier!$AT$10,Calendrier!$AT$10,0),IF(AND(C47<>0,D47<>0,E47=0,F47=0),D47-C47-M47,IF(AND(C47=0,D47=0,E47<>0,F47<>0),F47-E47-M47,IF(AND(C47>20,D47=0,E47=0,F47<>0),24-C47+F47-M47,IF(AND(C47<>0,D47=0,E47=0,F47<>0),F47-C47-M47,0)))))","v":0},{"$f":"IF(G47=0,0,IF(K47=0.5,0,G47-Calendrier!$AT$9))","v":0},4.5,"T",0,null,0]
["2023-06-30",{"$f":"INDIRECT(ADDRESS(MATCH($B$1,Calendrier!$A$15:$A$59,0)+14,ROW()-17,3,1,\"Calendrier\"),1)","v":"T"},null,null,null,null,{"$f":"IF(AND(C48<>0,D48<>0,E48<>0,F48<>0),F48-E48+D48-C48-M48-IF(E48-D48<Calendrier!$AT$10,Calendrier!$AT$10,0),IF(AND(C48<>0,D48<>0,E48=0,F48=0),D48-C48-M48,IF(AND(C48=0,D48=0,E48<>0,F48<>0),F48-E48-M48,IF(AND(C48>20,D48=0,E48=0,F48<>0),24-C48+F48-M48,IF(AND(C48<>0,D48=0,E48=0,F48<>0),F48-C48-M48,0)))))","v":0},{"$f":"IF(G48=0,0,IF(K48=0.5,0,G48-Calendrier!$AT$9))","v":0},4.5,"T",0,null,0]
[{"$f":"IF(MONTH(A48+1)>6,0,A48+1)","v":"00:00:00"},{"$f":"INDIRECT(ADDRESS(MATCH($B$1,Calendrier!$A$15:$A$59,0)+14,ROW()-17,3,1,\"Calendrier\"),1)","v":0},null,null,null,null,{"$f":"IF(AND(C49<>0,D49<>0,E49<>0,F49<>0),F49-E49+D49-C49-M49-IF(E49-D49<Calendrier!$AT$10,Calendrier!$AT$10,0),IF(AND(C49<>0,D49<>0,E49=0,F49=0),D49-C49-M49,IF(AND(C49=0,D49=0,E49<>0,F49<>0),F49-E49-M49,IF(AND(C49>20,D49=0,E49=0,F49<>0),24-C49+F49-M49,IF(AND(C49<>0,D49=0,E49=0,F49<>0),F49-C49-M49,0)))))","v":0},{"$f":"IF(G49=0,0,IF(K49=0.5,0,G49-Calendrier!$AT$9))","v":0},4.5,{"$f":"IF(AND(COUNTA(C49:F49)=0,B49=\"F\"),B49,IF(AND(COUNTA(C49:F49)=0,WEEKDAY(A49,2)>5),B49,IF(AND(COUNTA(C49:F49)=0,B49=\"T\"),\"\",IF(AND(COUNTA(C49:F49)=0,B49=\"RTT\"),B49,IF(AND(COUNTA(D49:F49)=0,C49<>0),\"erreur\",IF(AND(COUNTA(C49:F49)=4,B49=\"RTT\"),\"Erreur RTT\",IF(AND(COUNTA(C49:F49)=4,B49=\"F\"),\"fériés\",IF(COUNTA(C49:F49)=4,B49,IF(COUNTA(C49:F49)=3,\"Erreur\",IF(AND(C49<>0,D49<>0),$F$12,IF(AND(E49<>0,F49<>0),$F$12,IF(AND(C49<>0,D49=0,E49=0,F49<>0,WEEKDAY(A49,2)>5),\"Modif  calendrier\",IF(AND(C49<>0,D49=0,E49=0,F49<>0),$B49)))))))))))))","v":0},0,null,0]
[null,null,null,null,null,null,{"$f":"SUM(G19:G49)","v":69.25},null,{"$f":"I49","v":4.5}]

{"sheet":"JUL","index":9,"n_rows":50,"n_cols":15,"rows_kept":50,"cut":false,"hidden":false,"merged":[]}
[null,{"$f":"RIGHT(CELL(\"nomfichier\",$A$1),3)","v":"JUL"},"FICHE DE SUIVI HORAIRE"]
[]
[null,"mois :","JUILLET",null,null,"année ",{"$f":"VLOOKUP(C3,Fériés!$I$1:$J$12,2,FALSE)","v":2023},null,null,"service",{"$f":"Calendrier!F4","v":"Administratif"}]
[]
[null,"nom :",{"$f":"Calendrier!F2","v":"Isq"},null,null," prénom ",{"$f":"Calendrier!F3","v":"Philippe"},null,null,"N° Ident",{"$f":"Calendrier!F1","v":"T506489"}]
[null,null,null,null,null,null,null,"à réaliser","cumul","en cours","reste",null,"N.cumul"]
[null,null,null,"Nb J",{"$f":"Calendrier!$AT$11","v":218},{"$f":"+$H$10","v":0},{"$f":"E7-F7","v":218},{"$f":"Calendrier!N1","v":365},{"$f":"JUN!M7","v":143.5},{"$f":"SUM(J8:J15)","v":31},{"$f":"H7-(I7+J7)","v":190.5},null,{"$f":"SUM(M8:M15)","v":174.5}]
[null,null,null,null,null,"1/2CA","CA",{"$f":"Calendrier!N5","v":25},{"$f":"JUN!M8","v":0},{"$f":"COUNTIF($J$19:$J$49,G8)+COUNTIF($J$19:$J$49,F8)/2","v":1},{"$f":"+H8-(I8+J8)","v":24},"J",{"$f":"+I8+J8","v":1}]
[null,null,null,null,null,"1/2RTT","RTT",{"$f":"Calendrier!N8","v":9},{"$f":"JUN!M9","v":3},{"$f":"COUNTIF($J$19:$J$49,G9)+COUNTIF($J$19:$J$49,F9)/2","v":0},{"$f":"+H9-(I9+J9)","v":6},"J",3]
[null,null,null,null,null,"1/2CS","CS",{"$f":"Calendrier!N9","v":0},{"$f":"JUN!M10","v":0},0,{"$f":"H10-(I10+J10)","v":0},"J",0]
[null,null,null,null,null,"1/2CP","CP",{"$f":"Calendrier!N6","v":0},{"$f":"JUN!M11","v":0},0,{"$f":"H11-(I11+J11)","v":0},"J",0]
[null,null,null,null,null,"1/2T","T",{"$f":"Calendrier!N7","v":218},{"$f":"JUN!M12","v":98.5},19,{"$f":"+H12-(I12+J12)","v":100.5},"J",117.5]
[null,null,null,null,null,0,"Sa",{"$f":"Calendrier!N4","v":51},{"$f":"JUN!M13","v":19},{"$f":"COUNTIF($J$19:$J$49,G13)","v":5},{"$f":"+H13-(I13+J13)","v":27},"J",24]
[null,null,null,null,null,0,"Di",{"$f":"Calendrier!N3","v":50},{"$f":"JUN!M14","v":20},{"$f":"COUNTIF($J$19:$J$49,G14)","v":5},{"$f":"+H14-(I14+J14)","v":25},"J",25]
[null,null,null,null,null,0,"F",{"$f":"Calendrier!N2","v":12},{"$f":"JUN!M15","v":3},{"$f":"COUNTIF($J$19:$J$49,G15)","v":1},{"$f":"+H15-(I15+J15)","v":8},"J",4]
[null,null,null,null,null,null,"heure/avance fin mois",null,{"$f":"JUN!$I$50","v":4.5},null,null,null,{"$f":"I50","v":4.5},"avec bon"]
[null,"Prévu","Entrée","Sortie","Entrée","Sortie","total","variation","cumul","Type","nb J/T",null,"divers E/S","Sortie","Retour"]
[null,null,null,null,null,null,null,null,{"$f":"JUN!$I$50","v":4.5}]
[{"$f":"VALUE(\"01/07/\"&G3)","v":"2023-07-01"},{"$f":"INDIRECT(ADDRESS(MATCH($B$1,Calendrier!$A$15:$A$59,0)+14,ROW()-17,3,1,\"Calendrier\"),1)","v":"Sa"},null,null,null,null,{"$f":"IF(AND(C19<>0,D19<>0,E19<>0,F19<>0),F19-E19+D19-C19-K19-IF(E19-D19<Calendrier!$AT$10,Calendrier!$AT$10,0),IF(AND(C19<>0,D19<>0,E19=0,F19=0),D19-C19-K19,IF(AND(C19=0,D19=0,E19<>0,F19<>0),F19-E19-K19,IF(AND(C19>20,D19=0,E19=0,F19<>0),24-C19+F19-K19,IF(AND(C19<>0,D19=0,E19=0,F19<>0),F19-C19-K19,0)))))","v":0},{"$f":"IF(G19=0,0,IF(K19=0.5,0,G19-Calendrier!$AT$9))","v":0},{"$f":"I18+H19","v":4.5},{"$f":"IF(AND(COUNTA(C19:F19)=0,OR(B19=\"F\",WEEKDAY(A19,2)>5,B19=\"T\",B19=\"RTT\",B19=\"CA\")),B19,IF(AND(COUNTA(C19:F19)>=2,OR(B19=\"F\",B19=\"RTT\",B19=\"CA\",B19=\"Sa\",B19=\"Di\")),\"calendrier\",IF(AND(COUNTA(C19)+COUNTA(F19)=2,OR(COUNTA(C19:D19)<1,COUNTA(E19:F19)<1)),\"erreur\",IF(COUNTA(C19:F19)=3,\"en cours\",IF(COUNTA(C19:F19)=4,B19,IF(OR(AND(C19<>0,D19<>0),AND(E19<>0,F19<>0)),$F$12,IF(AND(C19<>0,D19=0,E19=0,F19<>0,WEEKDAY(A19,2)>5),\"calendrier\",IF(AND(C19<>0,D19=0,E19=0,F19<>0),$B19,\"\"))))))))","v":"Sa"},{"$f":"IF(COUNTA(C19:F19)=4,1,IF(OR(AND(C19<>0,D19<>0),AND(E19<>0,F19<>0)),0.5,IF(AND(C19<>0,F19<>0,D19=0,E19=0,B19=\"T\"),1,0)))","v":0},null,{"$f":"IF(OR(N19=0,O19=0),0,O19-N19)","v":0}]
[{"$f":"A19+1","v":"2023-07-02"},{"$f":"INDIRECT(ADDRESS(MATCH($B$1,Calendrier!$A$15:$A$59,0)+14,ROW()-17,3,1,\"Calendrier\"),1)","v":"Di"},null,null,null,null,{"$f":"IF(AND(C20<>0,D20<>0,E20<>0,F20<>0),F20-E20+D20-C20-K20-IF(E20-D20<Calendrier!$AT$10,Calendrier!$AT$10,0),IF(AND(C20<>0,D20<>0,E20=0,F20=0),D20-C20-K20,IF(AND(C20=0,D20=0,E20<>0,F20<>0),F20-E20-K20,IF(AND(C20>20,D20=0,E20=0,F20<>0),24-C20+F20-K20,IF(AND(C20<>0,D20=0,E20=0,F20<>0),F20-C20-K20,0)))))","v":0},{"$f":"IF(G20=0,0,IF(K20=0.5,0,G20-Calendrier!$AT$9))","v":0},4.5,"Di",0,null,0]
[{"$f":"A20+1","v":"2023-07-03"},{"$f":"INDIRECT(ADDRESS(MATCH($B$1,Calendrier!$A$15:$A$59,0)+14,ROW()-17,3,1,\"Calendrier\"),1)","v":"T"},null,null,null,null,{"$f":"IF(AND(C21<>0,D21<>0,E21<>0,F21<>0),F21-E21+D21-C21-M21-IF(E21-D21<Calendrier!$AT$10,Calendrier!$AT$10,0),IF(AND(C21<>0,D21<>0,E21=0,F21=0),D21-C21-M21,IF(AND(C21=0,D21=0,E21<>0,F21<>0),F21-E21-M21,IF(AND(C21>20,D21=0,E21=0,F21<>0),24-C21+F21-M21,IF(AND(C21<>0,D21=0,E21=0,F21<>0),F21-C21-M21,0)))))","v":0},{"$f":"IF(G21=0,0,IF(K21=0.5,0,G21-Calendrier!$AT$9))","v":0},{"$f":"I20+H21","v":4.5},"T",0,null,0]
["2023-07-04",{"$f":"INDIRECT(ADDRESS(MATCH($B$1,Calendrier!$A$15:$A$59,0)+14,ROW()-17,3,1,\"Calendrier\"),1)","v":"T"},null,null,null,null,{"$f":"IF(AND(C22<>0,D22<>0,E22<>0,F22<>0),F22-E22+D22-C22-M22-IF(E22-D22<Calendrier!$AT$10,Calendrier!$AT$10,0),IF(AND(C22<>0,D22<>0,E22=0,F22=0),D22-C22-M22,IF(AND(C22=0,D22=0,E22<>0,F22<>0),F22-E22-M22,IF(AND(C22>20,D22=0,E22=0,F22<>0),24-C22+F22-M22,IF(AND(C22<>0,D22=0,E22=0,F22<>0),F22-C22-M22,0)))))","v":0},{"$f":"IF(G22=0,0,IF(K22=0.5,0,G22-Calendrier!$AT$9))","v":0},4.5,"T",0,null,0]
["2023-07-05",{"$f":"INDIRECT(ADDRESS(MATCH($B$1,Calendrier!$A$15:$A$59,0)+14,ROW()-17,3,1,\"Calendrier\"),1)","v":"T"},null,null,null,null,{"$f":"IF(AND(C23<>0,D23<>0,E23<>0,F23<>0),F23-E23+D23-C23-M23-IF(E23-D23<Calendrier!$AT$10,Calendrier!$AT$10,0),IF(AND(C23<>0,D23<>0,E23=0,F23=0),D23-C23-M23,IF(AND(C23=0,D23=0,E23<>0,F23<>0),F23-E23-M23,IF(AND(C23>20,D23=0,E23=0,F23<>0),24-C23+F23-M23,IF(AND(C23<>0,D23=0,E23=0,F23<>0),F23-C23-M23,0)))))","v":0},{"$f":"IF(G23=0,0,IF(K23=0.5,0,G23-Calendrier!$AT$9))","v":0},4.5,"T",0,null,0]
["2023-07-06",{"$f":"INDIRECT(ADDRESS(MATCH($B$1,Calendrier!$A$15:$A$59,0)+14,ROW()-17,3,1,\"Calendrier\"),1)","v":"T"},null,null,null,null,{"$f":"IF(AND(C24<>0,D24<>0,E24<>0,F24<>0),F24-E24+D24-C24-M24-IF(E24-D24<Calendrier!$AT$10,Calendrier!$AT$10,0),IF(AND(C24<>0,D24<>0,E24=0,F24=0),D24-C24-M24,IF(AND(C24=0,D24=0,E24<>0,F24<>0),F24-E24-M24,IF(AND(C24>20,D24=0,E24=0,F24<>0),24-C24+F24-M24,IF(AND(C24<>0,D24=0,E24=0,F24<>0),F24-C24-M24,0)))))","v":0},{"$f":"IF(G24=0,0,IF(K24=0.5,0,G24-Calendrier!$AT$9))","v":0},4.5,"T",0,null,{"$f":"IF(OR(N24=0,O24=0),0,O24-N24)","v":0}]
["2023-07-07",{"$f":"INDIRECT(ADDRESS(MATCH($B$1,Calendrier!$A$15:$A$59,0)+14,ROW()-17,3,1,\"Calendrier\"),1)","v":"T"},null,null,null,null,{"$f":"IF(AND(C25<>0,D25<>0,E25<>0,F25<>0),F25-E25+D25-C25-M25-IF(E25-D25<Calendrier!$AT$10,Calendrier!$AT$10,0),IF(AND(C25<>0,D25<>0,E25=0,F25=0),D25-C25-M25,IF(AND(C25=0,D25=0,E25<>0,F25<>0),F25-E25-M25,IF(AND(C25>20,D25=0,E25=0,F25<>0),24-C25+F25-M25,IF(AND(C25<>0,D25=0,E25=0,F25<>0),F25-C25-M25,0)))))","v":0},{"$f":"IF(G25=0,0,IF(K25=0.5,0,G25-Calendrier!$AT$9))","v":0},4.5,"T",0,null,{"$f":"IF(OR(N25=0,O25=0),0,O25-N25)","v":0}]
["2023-07-08",{"$f":"INDIRECT(ADDRESS(MATCH($B$1,Calendrier!$A$15:$A$59,0)+14,ROW()-17,3,1,\"Calendrier\"),1)","v":"Sa"},null,null,null,null,{"$f":"IF(AND(C26<>0,D26<>0,E26<>0,F26<>0),F26-E26+D26-C26-M26-IF(E26-D26<Calendrier!$AT$10,Calendrier!$AT$10,0),IF(AND(C26<>0,D26<>0,E26=0,F26=0),D26-C26-M26,IF(AND(C26=0,D26=0,E26<>0,F26<>0),F26-E26-M26,IF(AND(C26>20,D26=0,E26=0,F26<>0),24-C26+F26-M26,IF(AND(C26<>0,D26=0,E26=0,F26<>0),F26-C26-M26,0)))))","v":0},{"$f":"IF(G26=0,0,IF(K26=0.5,0,G26-Calendrier!$AT$9))","v":0},4.5,"Sa",0,null,0]
["2023-07-09",{"$f":"INDIRECT(ADDRESS(MATCH($B$1,Calendrier!$A$15:$A$59,0)+14,ROW()-17,3,1,\"Calendrier\"),1)","v":"Di"},null,null,null,null,{"$f":"IF(AND(C27<>0,D27<>0,E27<>0,F27<>0),F27-E27+D27-C27-M27-IF(E27-D27<Calendrier!$AT$10,Calendrier!$AT$10,0),IF(AND(C27<>0,D27<>0,E27=0,F27=0),D27-C27-M27,IF(AND(C27=0,D27=0,E27<>0,F27<>0),F27-E27-M27,IF(AND(C27>20,D27=0,E27=0,F27<>0),24-C27+F27-M27,IF(AND(C27<>0,D27=0,E27=0,F27<>0),F27-C27-M27,0)))))","v":0},{"$f":"IF(G27=0,0,IF(K27=0.5,0,G27-Calendrier!$AT$9))","v":0},4.5,"Di",0,null,0]
["2023-07-10",{"$f":"INDIRECT(ADDRESS(MATCH($B$1,Calendrier!$A$15:$A$59,0)+14,ROW()-17,3,1,\"Calendrier\"),1)","v":"T"},null,null,null,null,{"$f":"IF(AND(C28<>0,D28<>0,E28<>0,F28<>0),F28-E28+D28-C28-M28-IF(E28-D28<Calendrier!$AT$10,Calendrier!$AT$10,0),IF(AND(C28<>0,D28<>0,E28=0,F28=0),D28-C28-M28,IF(AND(C28=0,D28=0,E28<>0,F28<>0),F28-E28-M28,IF(AND(C28>20,D28=0,E28=0,F28<>0),24-C28+F28-M28,IF(AND(C28<>0,D28=0,E28=0,F28<>0),F28-C28-M28,0)))))","v":0},{"$f":"IF(G28=0,0,IF(K28=0.5,0,G28-Calendrier!$AT$9))","v":0},4.5,"T",0,null,0]
["2023-07-11",{"$f":"INDIRECT(ADDRESS(MATCH($B$1,Calendrier!$A$15:$A$59,0)+14,ROW()-17,3,1,\"Calendrier\"),1)","v":"T"},null,null,null,null,{"$f":"IF(AND(C29<>0,D29<>0,E29<>0,F29<>0),F29-E29+D29-C29-M29-IF(E29-D29<Calendrier!$AT$10,Calendrier!$AT$10,0),IF(AND(C29<>0,D29<>0,E29=0,F29=0),D29-C29-M29,IF(AND(C29=0,D29=0,E29<>0,F29<>0),F29-E29-M29,IF(AND(C29>20,D29=0,E29=0,F29<>0),24-C29+F29-M29,IF(AND(C29<>0,D29=0,E29=0,F29<>0),F29-C29-M29,0)))))","v":0},{"$f":"IF(G29=0,0,IF(K29=0.5,0,G29-Calendrier!$AT$9))","v":0},4.5,"T",0,null,0]
["2023-07-12",{"$f":"INDIRECT(ADDRESS(MATCH($B$1,Calendrier!$A$15:$A$59,0)+14,ROW()-17,3,1,\"Calendrier\"),1)","v":"T"},null,null,null,null,{"$f":"IF(AND(C30<>0,D30<>0,E30<>0,F30<>0),F30-E30+D30-C30-M30-IF(E30-D30<Calendrier!$AT$10,Calendrier!$AT$10,0),IF(AND(C30<>0,D30<>0,E30=0,F30=0),D30-C30-M30,IF(AND(C30=0,D30=0,E30<>0,F30<>0),F30-E30-M30,IF(AND(C30>20,D30=0,E30=0,F30<>0),24-C30+F30-M30,IF(AND(C30<>0,D30=0,E30=0,F30<>0),F30-C30-M30,0)))))","v":0},{"$f":"IF(G30=0,0,IF(K30=0.5,0,G30-Calendrier!$AT$9))","v":0},4.5,"T",0,null,0]
["2023-07-13",{"$f":"INDIRECT(ADDRESS(MATCH($B$1,Calendrier!$A$15:$A$59,0)+14,ROW()-17,3,1,\"Calendrier\"),1)","v":"T"},null,null,null,null,{"$f":"IF(AND(C31<>0,D31<>0,E31<>0,F31<>0),F31-E31+D31-C31-M31-IF(E31-D31<Calendrier!$AT$10,Calendrier!$AT$10,0),IF(AND(C31<>0,D31<>0,E31=0,F31=0),D31-C31-M31,IF(AND(C31=0,D31=0,E31<>0,F31<>0),F31-E31-M31,IF(AND(C31>20,D31=0,E31=0,F31<>0),24-C31+F31-M31,IF(AND(C31<>0,D31=0,E31=0,F31<>0),F31-C31-M31,0)))))","v":0},{"$f":"IF(G31=0,0,IF(K31=0.5,0,G31-Calendrier!$AT$9))","v":0},4.5,"T",0,null,0]
["2023-07-14",{"$f":"INDIRECT(ADDRESS(MATCH($B$1,Calendrier!$A$15:$A$59,0)+14,ROW()-17,3,1,\"Calendrier\"),1)","v":"F"},null,null,null,null,{"$f":"IF(AND(C32<>0,D32<>0,E32<>0,F32<>0),F32-E32+D32-C32-M32-IF(E32-D32<Calendrier!$AT$10,Calendrier!$AT$10,0),IF(AND(C32<>0,D32<>0,E32=0,F32=0),D32-C32-M32,IF(AND(C32=0,D32=0,E32<>0,F32<>0),F32-E32-M32,IF(AND(C32>20,D32=0,E32=0,F32<>0),24-C32+F32-M32,IF(AND(C32<>0,D32=0,E32=0,F32<>0),F32-C32-M32,0)))))","v":0},{"$f":"IF(G32=0,0,IF(K32=0.5,0,G32-Calendrier!$AT$9))","v":0},4.5,"F",0,null,0]
["2023-07-15",{"$f":"INDIRECT(ADDRESS(MATCH($B$1,Calendrier!$A$15:$A$59,0)+14,ROW()-17,3,1,\"Calendrier\"),1)","v":"Sa"},null,null,null,null,{"$f":"IF(AND(C33<>0,D33<>0,E33<>0,F33<>0),F33-E33+D33-C33-M33-IF(E33-D33<Calendrier!$AT$10,Calendrier!$AT$10,0),IF(AND(C33<>0,D33<>0,E33=0,F33=0),D33-C33-M33,IF(AND(C33=0,D33=0,E33<>0,F33<>0),F33-E33-M33,IF(AND(C33>20,D33=0,E33=0,F33<>0),24-C33+F33-M33,IF(AND(C33<>0,D33=0,E33=0,F33<>0),F33-C33-M33,0)))))","v":0},{"$f":"IF(G33=0,0,IF(K33=0.5,0,G33-Calendrier!$AT$9))","v":0},4.5,"Sa",0,null,0]
["2023-07-16",{"$f":"INDIRECT(ADDRESS(MATCH($B$1,Calendrier!$A$15:$A$59,0)+14,ROW()-17,3,1,\"Calendrier\"),1)","v":"Di"},null,null,null,null,{"$f":"IF(AND(C34<>0,D34<>0,E34<>0,F34<>0),F34-E34+D34-C34-M34-IF(E34-D34<Calendrier!$AT$10,Calendrier!$AT$10,0),IF(AND(C34<>0,D34<>0,E34=0,F34=0),D34-C34-M34,IF(AND(C34=0,D34=0,E34<>0,F34<>0),F34-E34-M34,IF(AND(C34>20,D34=0,E34=0,F34<>0),24-C34+F34-M34,IF(AND(C34<>0,D34=0,E34=0,F34<>0),F34-C34-M34,0)))))","v":0},{"$f":"IF(G34=0,0,IF(K34=0.5,0,G34-Calendrier!$AT$9))","v":0},4.5,{"$f":"IF(AND(COUNTA(C34:F34)=0,OR(B34=\"F\",WEEKDAY(A34,2)>5,B34=\"T\",B34=\"RTT\",B34=\"CA\")),B34,IF(AND(COUNTA(C34:F34)>=2,OR(B34=\"F\",B34=\"RTT\",B34=\"CA\",B34=\"Sa\",B34=\"Di\")),\"calendrier\",IF(AND(COUNTA(C34)+COUNTA(F34)=2,OR(COUNTA(C34:D34)<1,COUNTA(E34:F34)<1)),\"erreur\",IF(COUNTA(C34:F34)=3,\"en cours\",IF(COUNTA(C34:F34)=4,B34,IF(OR(AND(C34<>0,D34<>0),AND(E34<>0,F34<>0)),$F$12,IF(AND(C34<>0,D34=0,E34=0,F34<>0,WEEKDAY(A34,2)>5),\"calendrier\",IF(AND(C34<>0,D34=0,E34=0,F34<>0),$B34,\"\"))))))))","v":"Di"},0,null,0]
["2023-07-17",{"$f":"INDIRECT(ADDRESS(MATCH($B$1,Calendrier!$A$15:$A$59,0)+14,ROW()-17,3,1,\"Calendrier\"),1)","v":"T"},null,null,null,null,{"$f":"IF(AND(C35<>0,D35<>0,E35<>0,F35<>0),F35-E35+D35-C35-M35-IF(E35-D35<Calendrier!$AT$10,Calendrier!$AT$10,0),IF(AND(C35<>0,D35<>0,E35=0,F35=0),D35-C35-M35,IF(AND(C35=0,D35=0,E35<>0,F35<>0),F35-E35-M35,IF(AND(C35>20,D35=0,E35=0,F35<>0),24-C35+F35-M35,IF(AND(C35<>0,D35=0,E35=0,F35<>0),F35-C35-M35,0)))))","v":0},{"$f":"IF(G35=0,0,IF(K35=0.5,0,G35-Calendrier!$AT$9))","v":0},4.5,"T",0,null,0]
["2023-07-18",{"$f":"INDIRECT(ADDRESS(MATCH($B$1,Calendrier!$A$15:$A$59,0)+14,ROW()-17,3,1,\"Calendrier\"),1)","v":"T"},null,null,null,null,{"$f":"IF(AND(C36<>0,D36<>0,E36<>0,F36<>0),F36-E36+D36-C36-M36-IF(E36-D36<Calendrier!$AT$10,Calendrier!$AT$10,0),IF(AND(C36<>0,D36<>0,E36=0,F36=0),D36-C36-M36,IF(AND(C36=0,D36=0,E36<>0,F36<>0),F36-E36-M36,IF(AND(C36>20,D36=0,E36=0,F36<>0),24-C36+F36-M36,IF(AND(C36<>0,D36=0,E36=0,F36<>0),F36-C36-M36,0)))))","v":0},{"$f":"IF(G36=0,0,IF(K36=0.5,0,G36-Calendrier!$AT$9))","v":0},4.5,"T",0,null,0]
["2023-07-19",{"$f":"INDIRECT(ADDRESS(MATCH($B$1,Calendrier!$A$15:$A$59,0)+14,ROW()-17,3,1,\"Calendrier\"),1)","v":"T"},null,null,null,null,{"$f":"IF(AND(C37<>0,D37<>0,E37<>0,F37<>0),F37-E37+D37-C37-M37-IF(E37-D37<Calendrier!$AT$10,Calendrier!$AT$10,0),IF(AND(C37<>0,D37<>0,E37=0,F37=0),D37-C37-M37,IF(AND(C37=0,D37=0,E37<>0,F37<>0),F37-E37-M37,IF(AND(C37>20,D37=0,E37=0,F37<>0),24-C37+F37-M37,IF(AND(C37<>0,D37=0,E37=0,F37<>0),F37-C37-M37,0)))))","v":0},{"$f":"IF(G37=0,0,IF(K37=0.5,0,G37-Calendrier!$AT$9))","v":0},4.5,"T",0,null,0]
["2023-07-20",{"$f":"INDIRECT(ADDRESS(MATCH($B$1,Calendrier!$A$15:$A$59,0)+14,ROW()-17,3,1,\"Calendrier\"),1)","v":"T"},null,null,null,null,{"$f":"IF(AND(C38<>0,D38<>0,E38<>0,F38<>0),F38-E38+D38-C38-M38-IF(E38-D38<Calendrier!$AT$10,Calendrier!$AT$10,0),IF(AND(C38<>0,D38<>0,E38=0,F38=0),D38-C38-M38,IF(AND(C38=0,D38=0,E38<>0,F38<>0),F38-E38-M38,IF(AND(C38>20,D38=0,E38=0,F38<>0),24-C38+F38-M38,IF(AND(C38<>0,D38=0,E38=0,F38<>0),F38-C38-M38,0)))))","v":0},{"$f":"IF(G38=0,0,IF(K38=0.5,0,G38-Calendrier!$AT$9))","v":0},4.5,"T",0,null,0]
["2023-07-21",{"$f":"INDIRECT(ADDRESS(MATCH($B$1,Calendrier!$A$15:$A$59,0)+14,ROW()-17,3,1,\"Calendrier\"),1)","v":"T"},null,null,null,null,{"$f":"IF(AND(C39<>0,D39<>0,E39<>0,F39<>0),F39-E39+D39-C39-M39-IF(E39-D39<Calendrier!$AT$10,Calendrier!$AT$10,0),IF(AND(C39<>0,D39<>0,E39=0,F39=0),D39-C39-M39,IF(AND(C39=0,D39=0,E39<>0,F39<>0),F39-E39-M39,IF(AND(C39>20,D39=0,E39=0,F39<>0),24-C39+F39-M39,IF(AND(C39<>0,D39=0,E39=0,F39<>0),F39-C39-M39,0)))))","v":0},{"$f":"IF(G39=0,0,IF(K39=0.5,0,G39-Calendrier!$AT$9))","v":0},4.5,"T",0,null,0]
["2023-07-22",{"$f":"INDIRECT(ADDRESS(MATCH($B$1,Calendrier!$A$15:$A$59,0)+14,ROW()-17,3,1,\"Calendrier\"),1)","v":"Sa"},null,null,null,null,{"$f":"IF(AND(C40<>0,D40<>0,E40<>0,F40<>0),F40-E40+D40-C40-M40-IF(E40-D40<Calendrier!$AT$10,Calendrier!$AT$10,0),IF(AND(C40<>0,D40<>0,E40=0,F40=0),D40-C40-M40,IF(AND(C40=0,D40=0,E40<>0,F40<>0),F40-E40-M40,IF(AND(C40>20,D40=0,E40=0,F40<>0),24-C40+F40-M40,IF(AND(C40<>0,D40=0,E40=0,F40<>0),F40-C40-M40,0)))))","v":0},{"$f":"IF(G40=0,0,IF(K40=0.5,0,G40-Calendrier!$AT$9))","v":0},4.5,"Sa",0,null,0]
["2023-07-23",{"$f":"INDIRECT(ADDRESS(MATCH($B$1,Calendrier!$A$15:$A$59,0)+14,ROW()-17,3,1,\"Calendrier\"),1)","v":"Di"},null,null,null,null,{"$f":"IF(AND(C41<>0,D41<>0,E41<>0,F41<>0),F41-E41+D41-C41-M41-IF(E41-D41<Calendrier!$AT$10,Calendrier!$AT$10,0),IF(AND(C41<>0,D41<>0,E41=0,F41=0),D41-C41-M41,IF(AND(C41=0,D41=0,E41<>0,F41<>0),F41-E41-M41,IF(AND(C41>20,D41=0,E41=0,F41<>0),24-C41+F41-M41,IF(AND(C41<>0,D41=0,E41=0,F41<>0),F41-C41-M41,0)))))","v":0},{"$f":"IF(G41=0,0,IF(K41=0.5,0,G41-Calendrier!$AT$9))","v":0},4.5,"Di",0,null,0]
["2023-07-24",{"$f":"INDIRECT(ADDRESS(MATCH($B$1,Calendrier!$A$15:$A$59,0)+14,ROW()-17,3,1,\"Calendrier\"),1)","v":"T"},null,null,null,null,{"$f":"IF(AND(C42<>0,D42<>0,E42<>0,F42<>0),F42-E42+D42-C42-M42-IF(E42-D42<Calendrier!$AT$10,Calendrier!$AT$10,0),IF(AND(C42<>0,D42<>0,E42=0,F42=0),D42-C42-M42,IF(AND(C42=0,D42=0,E42<>0,F42<>0),F42-E42-M42,IF(AND(C42>20,D42=0,E42=0,F42<>0),24-C42+F42-M42,IF(AND(C42<>0,D42=0,E42=0,F42<>0),F42-C42-M42,0)))))","v":0},{"$f":"IF(G42=0,0,IF(K42=0.5,0,G42-Calendrier!$AT$9))","v":0},4.5,"T",0,null,0]
["2023-07-25",{"$f":"INDIRECT(ADDRESS(MATCH($B$1,Calendrier!$A$15:$A$59,0)+14,ROW()-17,3,1,\"Calendrier\"),1)","v":"T"},null,null,null,null,{"$f":"IF(AND(C43<>0,D43<>0,E43<>0,F43<>0),F43-E43+D43-C43-M43-IF(E43-D43<Calendrier!$AT$10,Calendrier!$AT$10,0),IF(AND(C43<>0,D43<>0,E43=0,F43=0),D43-C43-M43,IF(AND(C43=0,D43=0,E43<>0,F43<>0),F43-E43-M43,IF(AND(C43>20,D43=0,E43=0,F43<>0),24-C43+F43-M43,IF(AND(C43<>0,D43=0,E43=0,F43<>0),F43-C43-M43,0)))))","v":0},{"$f":"IF(G43=0,0,IF(K43=0.5,0,G43-Calendrier!$AT$9))","v":0},4.5,"T",0,null,0]
["2023-07-26",{"$f":"INDIRECT(ADDRESS(MATCH($B$1,Calendrier!$A$15:$A$59,0)+14,ROW()-17,3,1,\"Calendrier\"),1)","v":"T"},null,null,null,null,{"$f":"IF(AND(C44<>0,D44<>0,E44<>0,F44<>0),F44-E44+D44-C44-M44-IF(E44-D44<Calendrier!$AT$10,Calendrier!$AT$10,0),IF(AND(C44<>0,D44<>0,E44=0,F44=0),D44-C44-M44,IF(AND(C44=0,D44=0,E44<>0,F44<>0),F44-E44-M44,IF(AND(C44>20,D44=0,E44=0,F44<>0),24-C44+F44-M44,IF(AND(C44<>0,D44=0,E44=0,F44<>0),F44-C44-M44,0)))))","v":0},{"$f":"IF(G44=0,0,IF(K44=0.5,0,G44-Calendrier!$AT$9))","v":0},4.5,"T",0,null,0]
["2023-07-27",{"$f":"INDIRECT(ADDRESS(MATCH($B$1,Calendrier!$A$15:$A$59,0)+14,ROW()-17,3,1,\"Calendrier\"),1)","v":"T"},null,null,null,null,{"$f":"IF(AND(C45<>0,D45<>0,E45<>0,F45<>0),F45-E45+D45-C45-M45-IF(E45-D45<Calendrier!$AT$10,Calendrier!$AT$10,0),IF(AND(C45<>0,D45<>0,E45=0,F45=0),D45-C45-M45,IF(AND(C45=0,D45=0,E45<>0,F45<>0),F45-E45-M45,IF(AND(C45>20,D45=0,E45=0,F45<>0),24-C45+F45-M45,IF(AND(C45<>0,D45=0,E45=0,F45<>0),F45-C45-M45,0)))))","v":0},{"$f":"IF(G45=0,0,IF(K45=0.5,0,G45-Calendrier!$AT$9))","v":0},4.5,"T",0,null,0]
["2023-07-28",{"$f":"INDIRECT(ADDRESS(MATCH($B$1,Calendrier!$A$15:$A$59,0)+14,ROW()-17,3,1,\"Calendrier\"),1)","v":"T"},null,null,null,null,{"$f":"IF(AND(C46<>0,D46<>0,E46<>0,F46<>0),F46-E46+D46-C46-M46-IF(E46-D46<Calendrier!$AT$10,Calendrier!$AT$10,0),IF(AND(C46<>0,D46<>0,E46=0,F46=0),D46-C46-M46,IF(AND(C46=0,D46=0,E46<>0,F46<>0),F46-E46-M46,IF(AND(C46>20,D46=0,E46=0,F46<>0),24-C46+F46-M46,IF(AND(C46<>0,D46=0,E46=0,F46<>0),F46-C46-M46,0)))))","v":0},{"$f":"IF(G46=0,0,IF(K46=0.5,0,G46-Calendrier!$AT$9))","v":0},4.5,"T",0,null,0]
["2023-07-29",{"$f":"INDIRECT(ADDRESS(MATCH($B$1,Calendrier!$A$15:$A$59,0)+14,ROW()-17,3,1,\"Calendrier\"),1)","v":"Sa"},null,null,null,null,{"$f":"IF(AND(C47<>0,D47<>0,E47<>0,F47<>0),F47-E47+D47-C47-M47-IF(E47-D47<Calendrier!$AT$10,Calendrier!$AT$10,0),IF(AND(C47<>0,D47<>0,E47=0,F47=0),D47-C47-M47,IF(AND(C47=0,D47=0,E47<>0,F47<>0),F47-E47-M47,IF(AND(C47>20,D47=0,E47=0,F47<>0),24-C47+F47-M47,IF(AND(C47<>0,D47=0,E47=0,F47<>0),F47-C47-M47,0)))))","v":0},{"$f":"IF(G47=0,0,IF(K47=0.5,0,G47-Calendrier!$AT$9))","v":0},4.5,"Sa",0,null,0]
["2023-07-30",{"$f":"INDIRECT(ADDRESS(MATCH($B$1,Calendrier!$A$15:$A$59,0)+14,ROW()-17,3,1,\"Calendrier\"),1)","v":"Di"},null,null,null,null,{"$f":"IF(AND(C48<>0,D48<>0,E48<>0,F48<>0),F48-E48+D48-C48-M48-IF(E48-D48<Calendrier!$AT$10,Calendrier!$AT$10,0),IF(AND(C48<>0,D48<>0,E48=0,F48=0),D48-C48-M48,IF(AND(C48=0,D48=0,E48<>0,F48<>0),F48-E48-M48,IF(AND(C48>20,D48=0,E48=0,F48<>0),24-C48+F48-M48,IF(AND(C48<>0,D48=0,E48=0,F48<>0),F48-C48-M48,0)))))","v":0},{"$f":"IF(G48=0,0,IF(K48=0.5,0,G48-Calendrier!$AT$9))","v":0},4.5,"Di",0,null,0]
["2023-07-31",{"$f":"INDIRECT(ADDRESS(MATCH($B$1,Calendrier!$A$15:$A$59,0)+14,ROW()-17,3,1,\"Calendrier\"),1)","v":"CA"},null,null,null,null,{"$f":"IF(AND(C49<>0,D49<>0,E49<>0,F49<>0),F49-E49+D49-C49-M49-IF(E49-D49<Calendrier!$AT$10,Calendrier!$AT$10,0),IF(AND(C49<>0,D49<>0,E49=0,F49=0),D49-C49-M49,IF(AND(C49=0,D49=0,E49<>0,F49<>0),F49-E49-M49,IF(AND(C49>20,D49=0,E49=0,F49<>0),24-C49+F49-M49,IF(AND(C49<>0,D49=0,E49=0,F49<>0),F49-C49-M49,0)))))","v":0},{"$f":"IF(G49=0,0,IF(K49=0.5,0,G49-Calendrier!$AT$9))","v":0},4.5,"CA",0,null,0]
[null,null,null,null,null,null,{"$f":"SUM(G19:G49)","v":0},null,{"$f":"I49","v":4.5}]

{"sheet":"AOU","index":10,"n_rows":50,"n_cols":15,"rows_kept":50,"cut":false,"hidden":false,"merged":[]}
[null,{"$f":"RIGHT(CELL(\"nomfichier\",$A$1),3)","v":"AOU"},"FICHE DE SUIVI HORAIRE"]
[]
[null,"mois :","AOUT",null,null,"année ",{"$f":"VLOOKUP(C3,Fériés!$I$1:$J$12,2,FALSE)","v":2023},null,null,"service",{"$f":"Calendrier!F4","v":"Administratif"}]
[]
[null,"nom :",{"$f":"Calendrier!F2","v":"Isq"},null,null," prénom ",{"$f":"Calendrier!F3","v":"Philippe"},null,null,"N° Ident",{"$f":"Calendrier!F1","v":"T506489"}]
[null,null,null,null,null,null,null,"à réaliser","cumul","en cours","reste",null,"N.cumul"]
[null,null,null,"Nb J",{"$f":"Calendrier!$AT$11","v":218},{"$f":"+$H$10","v":0},{"$f":"E7-F7","v":218},{"$f":"Calendrier!N1","v":365},{"$f":"JUL!M7","v":174.5},{"$f":"SUM(J8:J15)","v":31},{"$f":"H7-(I7+J7)","v":159.5},null,{"$f":"SUM(M8:M15)","v":205.5}]
[null,null,null,null,null,"1/2CA","CA",{"$f":"Calendrier!N5","v":25},{"$f":"JUL!M8","v":1},{"$f":"COUNTIF($J$19:$J$49,G8)+COUNTIF($J$19:$J$49,F8)/2","v":18},{"$f":"+H8-(I8+J8)","v":6},"J",{"$f":"+I8+J8","v":19}]
[null,null,null,null,null,"1/2RTT","RTT",{"$f":"Calendrier!N8","v":9},{"$f":"JUL!M9","v":3},{"$f":"COUNTIF($J$19:$J$49,G9)+COUNTIF($J$19:$J$49,F9)/2","v":0},{"$f":"+H9-(I9+J9)","v":6},"J",3]
[null,null,null,null,null,"1/2CS","CS",{"$f":"Calendrier!N9","v":0},{"$f":"JUL!M10","v":0},0,{"$f":"H10-(I10+J10)","v":0},"J",0]
[null,null,null,null,null,"1/2CP","CP",{"$f":"Calendrier!N6","v":0},{"$f":"JUL!M11","v":0},0,{"$f":"H11-(I11+J11)","v":0},"J",0]
[null,null,null,null,null,"1/2T","T",{"$f":"Calendrier!N7","v":218},{"$f":"JUL!M12","v":117.5},4,{"$f":"+H12-(I12+J12)","v":96.5},"J",121.5]
[null,null,null,null,null,0,"Sa",{"$f":"Calendrier!N4","v":51},{"$f":"JUL!M13","v":24},{"$f":"COUNTIF($J$19:$J$49,G13)","v":4},{"$f":"+H13-(I13+J13)","v":23},"J",28]
[null,null,null,null,null,0,"Di",{"$f":"Calendrier!N3","v":50},{"$f":"JUL!M14","v":25},{"$f":"COUNTIF($J$19:$J$49,G14)","v":4},{"$f":"+H14-(I14+J14)","v":21},"J",29]
[null,null,null,null,null,0,"F",{"$f":"Calendrier!N2","v":12},{"$f":"JUL!M15","v":4},{"$f":"COUNTIF($J$19:$J$49,G15)","v":1},{"$f":"+H15-(I15+J15)","v":7},"J",5]
[null,null,null,null,null,null,"heure/avance fin mois",null,{"$f":"JUL!$I$50","v":4.5},null,null,null,{"$f":"I50","v":4.5},"avec bon"]
[null,"Prévu","Entrée","Sortie","Entrée","Sortie","total","variation","cumul","Type","nb J/T",null,"divers E/S","Sortie","Retour"]
[null,null,null,null,null,null,null,null,{"$f":"JUL!$I$50","v":4.5}]
[{"$f":"VALUE(\"01/08/\"&G3)","v":"2023-08-01"},{"$f":"INDIRECT(ADDRESS(MATCH($B$1,Calendrier!$A$15:$A$59,0)+14,ROW()-17,3,1,\"Calendrier\"),1)","v":"CA"},null,null,null,null,{"$f":"IF(AND(C19<>0,D19<>0,E19<>0,F19<>0),F19-E19+D19-C19-K19-IF(E19-D19<Calendrier!$AT$10,Calendrier!$AT$10,0),IF(AND(C19<>0,D19<>0,E19=0,F19=0),D19-C19-K19,IF(AND(C19=0,D19=0,E19<>0,F19<>0),F19-E19-K19,IF(AND(C19>20,D19=0,E19=0,F19<>0),24-C19+F19-K19,IF(AND(C19<>0,D19=0,E19=0,F19<>0),F19-C19-K19,0)))))","v":0},{"$f":"IF(G19=0,0,IF(K19=0.5,0,G19-Calendrier!$AT$9))","v":0},{"$f":"I18+H19","v":4.5},{"$f":"IF(AND(COUNTA(C19:F19)=0,OR(B19=\"F\",WEEKDAY(A19,2)>5,B19=\"T\",B19=\"RTT\",B19=\"CA\")),B19,IF(AND(COUNTA(C19:F19)>=2,OR(B19=\"F\",B19=\"RTT\",B19=\"CA\",B19=\"Sa\",B19=\"Di\")),\"calendrier\",IF(AND(COUNTA(C19)+COUNTA(F19)=2,OR(COUNTA(C19:D19)<1,COUNTA(E19:F19)<1)),\"erreur\",IF(COUNTA(C19:F19)=3,\"en cours\",IF(COUNTA(C19:F19)=4,B19,IF(OR(AND(C19<>0,D19<>0),AND(E19<>0,F19<>0)),$F$12,IF(AND(C19<>0,D19=0,E19=0,F19<>0,WEEKDAY(A19,2)>5),\"calendrier\",IF(AND(C19<>0,D19=0,E19=0,F19<>0),$B19,\"\"))))))))","v":"CA"},{"$f":"IF(COUNTA(C19:F19)=4,1,IF(OR(AND(C19<>0,D19<>0),AND(E19<>0,F19<>0)),0.5,IF(AND(C19<>0,F19<>0,D19=0,E19=0,B19=\"T\"),1,0)))","v":0},null,{"$f":"IF(OR(N19=0,O19=0),0,O19-N19)","v":0}]
[{"$f":"A19+1","v":"2023-08-02"},{"$f":"INDIRECT(ADDRESS(MATCH($B$1,Calendrier!$A$15:$A$59,0)+14,ROW()-17,3,1,\"Calendrier\"),1)","v":"CA"},null,null,null,null,{"$f":"IF(AND(C20<>0,D20<>0,E20<>0,F20<>0),F20-E20+D20-C20-K20-IF(E20-D20<Calendrier!$AT$10,Calendrier!$AT$10,0),IF(AND(C20<>0,D20<>0,E20=0,F20=0),D20-C20-K20,IF(AND(C20=0,D20=0,E20<>0,F20<>0),F20-E20-K20,IF(AND(C20>20,D20=0,E20=0,F20<>0),24-C20+F20-K20,IF(AND(C20<>0,D20=0,E20=0,F20<>0),F20-C20-K20,0)))))","v":0},{"$f":"IF(G20=0,0,IF(K20=0.5,0,G20-Calendrier!$AT$9))","v":0},4.5,"CA",0,null,0]
[{"$f":"A20+1","v":"2023-08-03"},{"$f":"INDIRECT(ADDRESS(MATCH($B$1,Calendrier!$A$15:$A$59,0)+14,ROW()-17,3,1,\"Calendrier\"),1)","v":"CA"},null,null,null,null,{"$f":"IF(AND(C21<>0,D21<>0,E21<>0,F21<>0),F21-E21+D21-C21-M21-IF(E21-D21<Calendrier!$AT$10,Calendrier!$AT$10,0),IF(AND(C21<>0,D21<>0,E21=0,F21=0),D21-C21-M21,IF(AND(C21=0,D21=0,E21<>0,F21<>0),F21-E21-M21,IF(AND(C21>20,D21=0,E21=0,F21<>0),24-C21+F21-M21,IF(AND(C21<>0,D21=0,E21=0,F21<>0),F21-C21-M21,0)))))","v":0},{"$f":"IF(G21=0,0,IF(K21=0.5,0,G21-Calendrier!$AT$9))","v":0},{"$f":"I20+H21","v":4.5},"CA",0,null,0]
["2023-08-04",{"$f":"INDIRECT(ADDRESS(MATCH($B$1,Calendrier!$A$15:$A$59,0)+14,ROW()-17,3,1,\"Calendrier\"),1)","v":"CA"},null,null,null,null,{"$f":"IF(AND(C22<>0,D22<>0,E22<>0,F22<>0),F22-E22+D22-C22-M22-IF(E22-D22<Calendrier!$AT$10,Calendrier!$AT$10,0),IF(AND(C22<>0,D22<>0,E22=0,F22=0),D22-C22-M22,IF(AND(C22=0,D22=0,E22<>0,F22<>0),F22-E22-M22,IF(AND(C22>20,D22=0,E22=0,F22<>0),24-C22+F22-M22,IF(AND(C22<>0,D22=0,E22=0,F22<>0),F22-C22-M22,0)))))","v":0},{"$f":"IF(G22=0,0,IF(K22=0.5,0,G22-Calendrier!$AT$9))","v":0},4.5,"CA",0,null,0]
["2023-08-05",{"$f":"INDIRECT(ADDRESS(MATCH($B$1,Calendrier!$A$15:$A$59,0)+14,ROW()-17,3,1,\"Calendrier\"),1)","v":"Sa"},null,null,null,null,{"$f":"IF(AND(C23<>0,D23<>0,E23<>0,F23<>0),F23-E23+D23-C23-M23-IF(E23-D23<Calendrier!$AT$10,Calendrier!$AT$10,0),IF(AND(C23<>0,D23<>0,E23=0,F23=0),D23-C23-M23,IF(AND(C23=0,D23=0,E23<>0,F23<>0),F23-E23-M23,IF(AND(C23>20,D23=0,E23=0,F23<>0),24-C23+F23-M23,IF(AND(C23<>0,D23=0,E23=0,F23<>0),F23-C23-M23,0)))))","v":0},{"$f":"IF(G23=0,0,IF(K23=0.5,0,G23-Calendrier!$AT$9))","v":0},4.5,"Sa",0,null,0]
["2023-08-06",{"$f":"INDIRECT(ADDRESS(MATCH($B$1,Calendrier!$A$15:$A$59,0)+14,ROW()-17,3,1,\"Calendrier\"),1)","v":"Di"},null,null,null,null,{"$f":"IF(AND(C24<>0,D24<>0,E24<>0,F24<>0),F24-E24+D24-C24-M24-IF(E24-D24<Calendrier!$AT$10,Calendrier!$AT$10,0),IF(AND(C24<>0,D24<>0,E24=0,F24=0),D24-C24-M24,IF(AND(C24=0,D24=0,E24<>0,F24<>0),F24-E24-M24,IF(AND(C24>20,D24=0,E24=0,F24<>0),24-C24+F24-M24,IF(AND(C24<>0,D24=0,E24=0,F24<>0),F24-C24-M24,0)))))","v":0},{"$f":"IF(G24=0,0,IF(K24=0.5,0,G24-Calendrier!$AT$9))","v":0},4.5,"Di",0,null,{"$f":"IF(OR(N24=0,O24=0),0,O24-N24)","v":0}]
["2023-08-07",{"$f":"INDIRECT(ADDRESS(MATCH($B$1,Calendrier!$A$15:$A$59,0)+14,ROW()-17,3,1,\"Calendrier\"),1)","v":"CA"},null,null,null,null,{"$f":"IF(AND(C25<>0,D25<>0,E25<>0,F25<>0),F25-E25+D25-C25-M25-IF(E25-D25<Calendrier!$AT$10,Calendrier!$AT$10,0),IF(AND(C25<>0,D25<>0,E25=0,F25=0),D25-C25-M25,IF(AND(C25=0,D25=0,E25<>0,F25<>0),F25-E25-M25,IF(AND(C25>20,D25=0,E25=0,F25<>0),24-C25+F25-M25,IF(AND(C25<>0,D25=0,E25=0,F25<>0),F25-C25-M25,0)))))","v":0},{"$f":"IF(G25=0,0,IF(K25=0.5,0,G25-Calendrier!$AT$9))","v":0},4.5,"CA",0,null,{"$f":"IF(OR(N25=0,O25=0),0,O25-N25)","v":0}]
["2023-08-08",{"$f":"INDIRECT(ADDRESS(MATCH($B$1,Calendrier!$A$15:$A$59,0)+14,ROW()-17,3,1,\"Calendrier\"),1)","v":"CA"},null,null,null,null,{"$f":"IF(AND(C26<>0,D26<>0,E26<>0,F26<>0),F26-E26+D26-C26-M26-IF(E26-D26<Calendrier!$AT$10,Calendrier!$AT$10,0),IF(AND(C26<>0,D26<>0,E26=0,F26=0),D26-C26-M26,IF(AND(C26=0,D26=0,E26<>0,F26<>0),F26-E26-M26,IF(AND(C26>20,D26=0,E26=0,F26<>0),24-C26+F26-M26,IF(AND(C26<>0,D26=0,E26=0,F26<>0),F26-C26-M26,0)))))","v":0},{"$f":"IF(G26=0,0,IF(K26=0.5,0,G26-Calendrier!$AT$9))","v":0},4.5,"CA",0,null,0]
["2023-08-09",{"$f":"INDIRECT(ADDRESS(MATCH($B$1,Calendrier!$A$15:$A$59,0)+14,ROW()-17,3,1,\"Calendrier\"),1)","v":"CA"},null,null,null,null,{"$f":"IF(AND(C27<>0,D27<>0,E27<>0,F27<>0),F27-E27+D27-C27-M27-IF(E27-D27<Calendrier!$AT$10,Calendrier!$AT$10,0),IF(AND(C27<>0,D27<>0,E27=0,F27=0),D27-C27-M27,IF(AND(C27=0,D27=0,E27<>0,F27<>0),F27-E27-M27,IF(AND(C27>20,D27=0,E27=0,F27<>0),24-C27+F27-M27,IF(AND(C27<>0,D27=0,E27=0,F27<>0),F27-C27-M27,0)))))","v":0},{"$f":"IF(G27=0,0,IF(K27=0.5,0,G27-Calendrier!$AT$9))","v":0},4.5,"CA",0,null,0]
["2023-08-10",{"$f":"INDIRECT(ADDRESS(MATCH($B$1,Calendrier!$A$15:$A$59,0)+14,ROW()-17,3,1,\"Calendrier\"),1)","v":"CA"},null,null,null,null,{"$f":"IF(AND(C28<>0,D28<>0,E28<>0,F28<>0),F28-E28+D28-C28-M28-IF(E28-D28<Calendrier!$AT$10,Calendrier!$AT$10,0),IF(AND(C28<>0,D28<>0,E28=0,F28=0),D28-C28-M28,IF(AND(C28=0,D28=0,E28<>0,F28<>0),F28-E28-M28,IF(AND(C28>20,D28=0,E28=0,F28<>0),24-C28+F28-M28,IF(AND(C28<>0,D28=0,E28=0,F28<>0),F28-C28-M28,0)))))","v":0},{"$f":"IF(G28=0,0,IF(K28=0.5,0,G28-Calendrier!$AT$9))","v":0},4.5,"CA",0,null,0]
["2023-08-11",{"$f":"INDIRECT(ADDRESS(MATCH($B$1,Calendrier!$A$15:$A$59,0)+14,ROW()-17,3,1,\"Calendrier\"),1)","v":"CA"},null,null,null,null,{"$f":"IF(AND(C29<>0,D29<>0,E29<>0,F29<>0),F29-E29+D29-C29-M29-IF(E29-D29<Calendrier!$AT$10,Calendrier!$AT$10,0),IF(AND(C29<>0,D29<>0,E29=0,F29=0),D29-C29-M29,IF(AND(C29=0,D29=0,E29<>0,F29<>0),F29-E29-M29,IF(AND(C29>20,D29=0,E29=0,F29<>0),24-C29+F29-M29,IF(AND(C29<>0,D29=0,E29=0,F29<>0),F29-C29-M29,0)))))","v":0},{"$f":"IF(G29=0,0,IF(K29=0.5,0,G29-Calendrier!$AT$9))","v":0},4.5,"CA",0,null,0]
["2023-08-12",{"$f":"INDIRECT(ADDRESS(MATCH($B$1,Calendrier!$A$15:$A$59,0)+14,ROW()-17,3,1,\"Calendrier\"),1)","v":"Sa"},null,null,null,null,{"$f":"IF(AND(C30<>0,D30<>0,E30<>0,F30<>0),F30-E30+D30-C30-M30-IF(E30-D30<Calendrier!$AT$10,Calendrier!$AT$10,0),IF(AND(C30<>0,D30<>0,E30=0,F30=0),D30-C30-M30,IF(AND(C30=0,D30=0,E30<>0,F30<>0),F30-E30-M30,IF(AND(C30>20,D30=0,E30=0,F30<>0),24-C30+F30-M30,IF(AND(C30<>0,D30=0,E30=0,F30<>0),F30-C30-M30,0)))))","v":0},{"$f":"IF(G30=0,0,IF(K30=0.5,0,G30-Calendrier!$AT$9))","v":0},4.5,"Sa",0,null,0]
["2023-08-13",{"$f":"INDIRECT(ADDRESS(MATCH($B$1,Calendrier!$A$15:$A$59,0)+14,ROW()-17,3,1,\"Calendrier\"),1)","v":"Di"},null,null,null,null,{"$f":"IF(AND(C31<>0,D31<>0,E31<>0,F31<>0),F31-E31+D31-C31-M31-IF(E31-D31<Calendrier!$AT$10,Calendrier!$AT$10,0),IF(AND(C31<>0,D31<>0,E31=0,F31=0),D31-C31-M31,IF(AND(C31=0,D31=0,E31<>0,F31<>0),F31-E31-M31,IF(AND(C31>20,D31=0,E31=0,F31<>0),24-C31+F31-M31,IF(AND(C31<>0,D31=0,E31=0,F31<>0),F31-C31-M31,0)))))","v":0},{"$f":"IF(G31=0,0,IF(K31=0.5,0,G31-Calendrier!$AT$9))","v":0},4.5,"Di",0,null,0]
["2023-08-14",{"$f":"INDIRECT(ADDRESS(MATCH($B$1,Calendrier!$A$15:$A$59,0)+14,ROW()-17,3,1,\"Calendrier\"),1)","v":"CA"},null,null,null,null,{"$f":"IF(AND(C32<>0,D32<>0,E32<>0,F32<>0),F32-E32+D32-C32-M32-IF(E32-D32<Calendrier!$AT$10,Calendrier!$AT$10,0),IF(AND(C32<>0,D32<>0,E32=0,F32=0),D32-C32-M32,IF(AND(C32=0,D32=0,E32<>0,F32<>0),F32-E32-M32,IF(AND(C32>20,D32=0,E32=0,F32<>0),24-C32+F32-M32,IF(AND(C32<>0,D32=0,E32=0,F32<>0),F32-C32-M32,0)))))","v":0},{"$f":"IF(G32=0,0,IF(K32=0.5,0,G32-Calendrier!$AT$9))","v":0},4.5,"CA",0,null,0]
["2023-08-15",{"$f":"INDIRECT(ADDRESS(MATCH($B$1,Calendrier!$A$15:$A$59,0)+14,ROW()-17,3,1,\"Calendrier\"),1)","v":"F"},null,null,null,null,{"$f":"IF(AND(C33<>0,D33<>0,E33<>0,F33<>0),F33-E33+D33-C33-M33-IF(E33-D33<Calendrier!$AT$10,Calendrier!$AT$10,0),IF(AND(C33<>0,D33<>0,E33=0,F33=0),D33-C33-M33,IF(AND(C33=0,D33=0,E33<>0,F33<>0),F33-E33-M33,IF(AND(C33>20,D33=0,E33=0,F33<>0),24-C33+F33-M33,IF(AND(C33<>0,D33=0,E33=0,F33<>0),F33-C33-M33,0)))))","v":0},{"$f":"IF(G33=0,0,IF(K33=0.5,0,G33-Calendrier!$AT$9))","v":0},4.5,"F",0,null,0]
["2023-08-16",{"$f":"INDIRECT(ADDRESS(MATCH($B$1,Calendrier!$A$15:$A$59,0)+14,ROW()-17,3,1,\"Calendrier\"),1)","v":"CA"},null,null,null,null,{"$f":"IF(AND(C34<>0,D34<>0,E34<>0,F34<>0),F34-E34+D34-C34-M34-IF(E34-D34<Calendrier!$AT$10,Calendrier!$AT$10,0),IF(AND(C34<>0,D34<>0,E34=0,F34=0),D34-C34-M34,IF(AND(C34=0,D34=0,E34<>0,F34<>0),F34-E34-M34,IF(AND(C34>20,D34=0,E34=0,F34<>0),24-C34+F34-M34,IF(AND(C34<>0,D34=0,E34=0,F34<>0),F34-C34-M34,0)))))","v":0},{"$f":"IF(G34=0,0,IF(K34=0.5,0,G34-Calendrier!$AT$9))","v":0},4.5,{"$f":"IF(AND(COUNTA(C34:F34)=0,OR(B34=\"F\",WEEKDAY(A34,2)>5,B34=\"T\",B34=\"RTT\",B34=\"CA\")),B34,IF(AND(COUNTA(C34:F34)>=2,OR(B34=\"F\",B34=\"RTT\",B34=\"CA\",B34=\"Sa\",B34=\"Di\")),\"calendrier\",IF(AND(COUNTA(C34)+COUNTA(F34)=2,OR(COUNTA(C34:D34)<1,COUNTA(E34:F34)<1)),\"erreur\",IF(COUNTA(C34:F34)=3,\"en cours\",IF(COUNTA(C34:F34)=4,B34,IF(OR(AND(C34<>0,D34<>0),AND(E34<>0,F34<>0)),$F$12,IF(AND(C34<>0,D34=0,E34=0,F34<>0,WEEKDAY(A34,2)>5),\"calendrier\",IF(AND(C34<>0,D34=0,E34=0,F34<>0),$B34,\"\"))))))))","v":"CA"},0,null,0]
["2023-08-17",{"$f":"INDIRECT(ADDRESS(MATCH($B$1,Calendrier!$A$15:$A$59,0)+14,ROW()-17,3,1,\"Calendrier\"),1)","v":"CA"},null,null,null,null,{"$f":"IF(AND(C35<>0,D35<>0,E35<>0,F35<>0),F35-E35+D35-C35-M35-IF(E35-D35<Calendrier!$AT$10,Calendrier!$AT$10,0),IF(AND(C35<>0,D35<>0,E35=0,F35=0),D35-C35-M35,IF(AND(C35=0,D35=0,E35<>0,F35<>0),F35-E35-M35,IF(AND(C35>20,D35=0,E35=0,F35<>0),24-C35+F35-M35,IF(AND(C35<>0,D35=0,E35=0,F35<>0),F35-C35-M35,0)))))","v":0},{"$f":"IF(G35=0,0,IF(K35=0.5,0,G35-Calendrier!$AT$9))","v":0},4.5,"CA",0,null,0]
["2023-08-18",{"$f":"INDIRECT(ADDRESS(MATCH($B$1,Calendrier!$A$15:$A$59,0)+14,ROW()-17,3,1,\"Calendrier\"),1)","v":"CA"},null,null,null,null,{"$f":"IF(AND(C36<>0,D36<>0,E36<>0,F36<>0),F36-E36+D36-C36-M36-IF(E36-D36<Calendrier!$AT$10,Calendrier!$AT$10,0),IF(AND(C36<>0,D36<>0,E36=0,F36=0),D36-C36-M36,IF(AND(C36=0,D36=0,E36<>0,F36<>0),F36-E36-M36,IF(AND(C36>20,D36=0,E36=0,F36<>0),24-C36+F36-M36,IF(AND(C36<>0,D36=0,E36=0,F36<>0),F36-C36-M36,0)))))","v":0},{"$f":"IF(G36=0,0,IF(K36=0.5,0,G36-Calendrier!$AT$9))","v":0},4.5,"CA",0,null,0]
["2023-08-19",{"$f":"INDIRECT(ADDRESS(MATCH($B$1,Calendrier!$A$15:$A$59,0)+14,ROW()-17,3,1,\"Calendrier\"),1)","v":"Sa"},null,null,null,null,{"$f":"IF(AND(C37<>0,D37<>0,E37<>0,F37<>0),F37-E37+D37-C37-M37-IF(E37-D37<Calendrier!$AT$10,Calendrier!$AT$10,0),IF(AND(C37<>0,D37<>0,E37=0,F37=0),D37-C37-M37,IF(AND(C37=0,D37=0,E37<>0,F37<>0),F37-E37-M37,IF(AND(C37>20,D37=0,E37=0,F37<>0),24-C37+F37-M37,IF(AND(C37<>0,D37=0,E37=0,F37<>0),F37-C37-M37,0)))))","v":0},{"$f":"IF(G37=0,0,IF(K37=0.5,0,G37-Calendrier!$AT$9))","v":0},4.5,"Sa",0,null,0]
["2023-08-20",{"$f":"INDIRECT(ADDRESS(MATCH($B$1,Calendrier!$A$15:$A$59,0)+14,ROW()-17,3,1,\"Calendrier\"),1)","v":"Di"},null,null,null,null,{"$f":"IF(AND(C38<>0,D38<>0,E38<>0,F38<>0),F38-E38+D38-C38-M38-IF(E38-D38<Calendrier!$AT$10,Calendrier!$AT$10,0),IF(AND(C38<>0,D38<>0,E38=0,F38=0),D38-C38-M38,IF(AND(C38=0,D38=0,E38<>0,F38<>0),F38-E38-M38,IF(AND(C38>20,D38=0,E38=0,F38<>0),24-C38+F38-M38,IF(AND(C38<>0,D38=0,E38=0,F38<>0),F38-C38-M38,0)))))","v":0},{"$f":"IF(G38=0,0,IF(K38=0.5,0,G38-Calendrier!$AT$9))","v":0},4.5,"Di",0,null,0]
["2023-08-21",{"$f":"INDIRECT(ADDRESS(MATCH($B$1,Calendrier!$A$15:$A$59,0)+14,ROW()-17,3,1,\"Calendrier\"),1)","v":"CA"},null,null,null,null,{"$f":"IF(AND(C39<>0,D39<>0,E39<>0,F39<>0),F39-E39+D39-C39-M39-IF(E39-D39<Calendrier!$AT$10,Calendrier!$AT$10,0),IF(AND(C39<>0,D39<>0,E39=0,F39=0),D39-C39-M39,IF(AND(C39=0,D39=0,E39<>0,F39<>0),F39-E39-M39,IF(AND(C39>20,D39=0,E39=0,F39<>0),24-C39+F39-M39,IF(AND(C39<>0,D39=0,E39=0,F39<>0),F39-C39-M39,0)))))","v":0},{"$f":"IF(G39=0,0,IF(K39=0.5,0,G39-Calendrier!$AT$9))","v":0},4.5,"CA",0,null,0]
["2023-08-22",{"$f":"INDIRECT(ADDRESS(MATCH($B$1,Calendrier!$A$15:$A$59,0)+14,ROW()-17,3,1,\"Calendrier\"),1)","v":"CA"},null,null,null,null,{"$f":"IF(AND(C40<>0,D40<>0,E40<>0,F40<>0),F40-E40+D40-C40-M40-IF(E40-D40<Calendrier!$AT$10,Calendrier!$AT$10,0),IF(AND(C40<>0,D40<>0,E40=0,F40=0),D40-C40-M40,IF(AND(C40=0,D40=0,E40<>0,F40<>0),F40-E40-M40,IF(AND(C40>20,D40=0,E40=0,F40<>0),24-C40+F40-M40,IF(AND(C40<>0,D40=0,E40=0,F40<>0),F40-C40-M40,0)))))","v":0},{"$f":"IF(G40=0,0,IF(K40=0.5,0,G40-Calendrier!$AT$9))","v":0},4.5,"CA",0,null,0]
["2023-08-23",{"$f":"INDIRECT(ADDRESS(MATCH($B$1,Calendrier!$A$15:$A$59,0)+14,ROW()-17,3,1,\"Calendrier\"),1)","v":"CA"},null,null,null,null,{"$f":"IF(AND(C41<>0,D41<>0,E41<>0,F41<>0),F41-E41+D41-C41-M41-IF(E41-D41<Calendrier!$AT$10,Calendrier!$AT$10,0),IF(AND(C41<>0,D41<>0,E41=0,F41=0),D41-C41-M41,IF(AND(C41=0,D41=0,E41<>0,F41<>0),F41-E41-M41,IF(AND(C41>20,D41=0,E41=0,F41<>0),24-C41+F41-M41,IF(AND(C41<>0,D41=0,E41=0,F41<>0),F41-C41-M41,0)))))","v":0},{"$f":"IF(G41=0,0,IF(K41=0.5,0,G41-Calendrier!$AT$9))","v":0},4.5,"CA",0,null,0]
["2023-08-24",{"$f":"INDIRECT(ADDRESS(MATCH($B$1,Calendrier!$A$15:$A$59,0)+14,ROW()-17,3,1,\"Calendrier\"),1)","v":"CA"},null,null,null,null,{"$f":"IF(AND(C42<>0,D42<>0,E42<>0,F42<>0),F42-E42+D42-C42-M42-IF(E42-D42<Calendrier!$AT$10,Calendrier!$AT$10,0),IF(AND(C42<>0,D42<>0,E42=0,F42=0),D42-C42-M42,IF(AND(C42=0,D42=0,E42<>0,F42<>0),F42-E42-M42,IF(AND(C42>20,D42=0,E42=0,F42<>0),24-C42+F42-M42,IF(AND(C42<>0,D42=0,E42=0,F42<>0),F42-C42-M42,0)))))","v":0},{"$f":"IF(G42=0,0,IF(K42=0.5,0,G42-Calendrier!$AT$9))","v":0},4.5,"CA",0,null,0]
["2023-08-25",{"$f":"INDIRECT(ADDRESS(MATCH($B$1,Calendrier!$A$15:$A$59,0)+14,ROW()-17,3,1,\"Calendrier\"),1)","v":"CA"},null,null,null,null,{"$f":"IF(AND(C43<>0,D43<>0,E43<>0,F43<>0),F43-E43+D43-C43-M43-IF(E43-D43<Calendrier!$AT$10,Calendrier!$AT$10,0),IF(AND(C43<>0,D43<>0,E43=0,F43=0),D43-C43-M43,IF(AND(C43=0,D43=0,E43<>0,F43<>0),F43-E43-M43,IF(AND(C43>20,D43=0,E43=0,F43<>0),24-C43+F43-M43,IF(AND(C43<>0,D43=0,E43=0,F43<>0),F43-C43-M43,0)))))","v":0},{"$f":"IF(G43=0,0,IF(K43=0.5,0,G43-Calendrier!$AT$9))","v":0},4.5,"CA",0,null,0]
["2023-08-26",{"$f":"INDIRECT(ADDRESS(MATCH($B$1,Calendrier!$A$15:$A$59,0)+14,ROW()-17,3,1,\"Calendrier\"),1)","v":"Sa"},null,null,null,null,{"$f":"IF(AND(C44<>0,D44<>0,E44<>0,F44<>0),F44-E44+D44-C44-M44-IF(E44-D44<Calendrier!$AT$10,Calendrier!$AT$10,0),IF(AND(C44<>0,D44<>0,E44=0,F44=0),D44-C44-M44,IF(AND(C44=0,D44=0,E44<>0,F44<>0),F44-E44-M44,IF(AND(C44>20,D44=0,E44=0,F44<>0),24-C44+F44-M44,IF(AND(C44<>0,D44=0,E44=0,F44<>0),F44-C44-M44,0)))))","v":0},{"$f":"IF(G44=0,0,IF(K44=0.5,0,G44-Calendrier!$AT$9))","v":0},4.5,"Sa",0,null,0]
["2023-08-27",{"$f":"INDIRECT(ADDRESS(MATCH($B$1,Calendrier!$A$15:$A$59,0)+14,ROW()-17,3,1,\"Calendrier\"),1)","v":"Di"},null,null,null,null,{"$f":"IF(AND(C45<>0,D45<>0,E45<>0,F45<>0),F45-E45+D45-C45-M45-IF(E45-D45<Calendrier!$AT$10,Calendrier!$AT$10,0),IF(AND(C45<>0,D45<>0,E45=0,F45=0),D45-C45-M45,IF(AND(C45=0,D45=0,E45<>0,F45<>0),F45-E45-M45,IF(AND(C45>20,D45=0,E45=0,F45<>0),24-C45+F45-M45,IF(AND(C45<>0,D45=0,E45=0,F45<>0),F45-C45-M45,0)))))","v":0},{"$f":"IF(G45=0,0,IF(K45=0.5,0,G45-Calendrier!$AT$9))","v":0},4.5,"Di",0,null,0]
["2023-08-28",{"$f":"INDIRECT(ADDRESS(MATCH($B$1,Calendrier!$A$15:$A$59,0)+14,ROW()-17,3,1,\"Calendrier\"),1)","v":"T"},null,null,null,null,{"$f":"IF(AND(C46<>0,D46<>0,E46<>0,F46<>0),F46-E46+D46-C46-M46-IF(E46-D46<Calendrier!$AT$10,Calendrier!$AT$10,0),IF(AND(C46<>0,D46<>0,E46=0,F46=0),D46-C46-M46,IF(AND(C46=0,D46=0,E46<>0,F46<>0),F46-E46-M46,IF(AND(C46>20,D46=0,E46=0,F46<>0),24-C46+F46-M46,IF(AND(C46<>0,D46=0,E46=0,F46<>0),F46-C46-M46,0)))))","v":0},{"$f":"IF(G46=0,0,IF(K46=0.5,0,G46-Calendrier!$AT$9))","v":0},4.5,"T",0,null,0]
["2023-08-29",{"$f":"INDIRECT(ADDRESS(MATCH($B$1,Calendrier!$A$15:$A$59,0)+14,ROW()-17,3,1,\"Calendrier\"),1)","v":"T"},null,null,null,null,{"$f":"IF(AND(C47<>0,D47<>0,E47<>0,F47<>0),F47-E47+D47-C47-M47-IF(E47-D47<Calendrier!$AT$10,Calendrier!$AT$10,0),IF(AND(C47<>0,D47<>0,E47=0,F47=0),D47-C47-M47,IF(AND(C47=0,D47=0,E47<>0,F47<>0),F47-E47-M47,IF(AND(C47>20,D47=0,E47=0,F47<>0),24-C47+F47-M47,IF(AND(C47<>0,D47=0,E47=0,F47<>0),F47-C47-M47,0)))))","v":0},{"$f":"IF(G47=0,0,IF(K47=0.5,0,G47-Calendrier!$AT$9))","v":0},4.5,"T",0,null,0]
["2023-08-30",{"$f":"INDIRECT(ADDRESS(MATCH($B$1,Calendrier!$A$15:$A$59,0)+14,ROW()-17,3,1,\"Calendrier\"),1)","v":"T"},null,null,null,null,{"$f":"IF(AND(C48<>0,D48<>0,E48<>0,F48<>0),F48-E48+D48-C48-M48-IF(E48-D48<Calendrier!$AT$10,Calendrier!$AT$10,0),IF(AND(C48<>0,D48<>0,E48=0,F48=0),D48-C48-M48,IF(AND(C48=0,D48=0,E48<>0,F48<>0),F48-E48-M48,IF(AND(C48>20,D48=0,E48=0,F48<>0),24-C48+F48-M48,IF(AND(C48<>0,D48=0,E48=0,F48<>0),F48-C48-M48,0)))))","v":0},{"$f":"IF(G48=0,0,IF(K48=0.5,0,G48-Calendrier!$AT$9))","v":0},4.5,"T",0,null,0]
["2023-08-31",{"$f":"INDIRECT(ADDRESS(MATCH($B$1,Calendrier!$A$15:$A$59,0)+14,ROW()-17,3,1,\"Calendrier\"),1)","v":"T"},null,null,null,null,{"$f":"IF(AND(C49<>0,D49<>0,E49<>0,F49<>0),F49-E49+D49-C49-M49-IF(E49-D49<Calendrier!$AT$10,Calendrier!$AT$10,0),IF(AND(C49<>0,D49<>0,E49=0,F49=0),D49-C49-M49,IF(AND(C49=0,D49=0,E49<>0,F49<>0),F49-E49-M49,IF(AND(C49>20,D49=0,E49=0,F49<>0),24-C49+F49-M49,IF(AND(C49<>0,D49=0,E49=0,F49<>0),F49-C49-M49,0)))))","v":0},{"$f":"IF(G49=0,0,IF(K49=0.5,0,G49-Calendrier!$AT$9))","v":0},4.5,"T",0,null,0]
[null,null,null,null,null,null,{"$f":"SUM(G19:G49)","v":0},null,{"$f":"I49","v":4.5}]

{"sheet":"SEP","index":11,"n_rows":50,"n_cols":15,"rows_kept":50,"cut":false,"hidden":false,"merged":[]}
[null,{"$f":"RIGHT(CELL(\"nomfichier\",$A$1),3)","v":"SEP"},"FICHE DE SUIVI HORAIRE"]
[]
[null,"mois :","SEPTEMBRE",null,null,"année ",{"$f":"VLOOKUP(C3,Fériés!$I$1:$J$12,2,FALSE)","v":2023},null,null,"service",{"$f":"Calendrier!F4","v":"Administratif"}]
[]
[null,"nom :",{"$f":"Calendrier!F2","v":"Isq"},null,null," prénom ",{"$f":"Calendrier!F3","v":"Philippe"},null,null,"N° Ident",{"$f":"Calendrier!F1","v":"T506489"}]
[null,null,null,null,null,null,null,"à réaliser","cumul","en cours","reste",null,"N.cumul"]
[null,null,null,"Nb J",{"$f":"Calendrier!$AT$11","v":218},{"$f":"+$H$10","v":0},{"$f":"E7-F7","v":218},{"$f":"Calendrier!N1","v":365},{"$f":"AOU!M7","v":205.5},{"$f":"SUM(J8:J15)","v":30},{"$f":"H7-(I7+J7)","v":129.5},null,{"$f":"SUM(M8:M15)","v":235.5}]
[null,null,null,null,null,"1/2CA","CA",{"$f":"Calendrier!N5","v":25},{"$f":"AOU!M8","v":19},{"$f":"COUNTIF($J$19:$J$49,G8)+COUNTIF($J$19:$J$49,F8)/2","v":0},{"$f":"+H8-(I8+J8)","v":6},"J",{"$f":"+I8+J8","v":19}]
[null,null,null,null,null,"1/2RTT","RTT",{"$f":"Calendrier!N8","v":9},{"$f":"AOU!M9","v":3},{"$f":"COUNTIF($J$19:$J$49,G9)+COUNTIF($J$19:$J$49,F9)/2","v":1},{"$f":"+H9-(I9+J9)","v":5},"J",4]
[null,null,null,null,null,"1/2CS","CS",{"$f":"Calendrier!N9","v":0},{"$f":"AOU!M10","v":0},0,{"$f":"H10-(I10+J10)","v":0},"J",0]
[null,null,null,null,null,"1/2CP","CP",{"$f":"Calendrier!N6","v":0},{"$f":"AOU!M11","v":0},0,{"$f":"H11-(I11+J11)","v":0},"J",0]
[null,null,null,null,null,"1/2T","T",{"$f":"Calendrier!N7","v":218},{"$f":"AOU!M12","v":121.5},20,{"$f":"+H12-(I12+J12)","v":76.5},"J",141.5]
[null,null,null,null,null,0,"Sa",{"$f":"Calendrier!N4","v":51},{"$f":"AOU!M13","v":28},{"$f":"COUNTIF($J$19:$J$49,G13)","v":5},{"$f":"+H13-(I13+J13)","v":18},"J",33]
[null,null,null,null,null,0,"Di",{"$f":"Calendrier!N3","v":50},{"$f":"AOU!M14","v":29},{"$f":"COUNTIF($J$19:$J$49,G14)","v":4},{"$f":"+H14-(I14+J14)","v":17},"J",33]
[null,null,null,null,null,0,"F",{"$f":"Calendrier!N2","v":12},{"$f":"AOU!M15","v":5},{"$f":"COUNTIF($J$19:$J$49,G15)","v":0},{"$f":"+H15-(I15+J15)","v":7},"J",5]
[null,null,null,null,null,null,"heure/avance fin mois",null,{"$f":"AOU!I50","v":4.5},null,null,null,{"$f":"I50","v":4.5},"avec bon"]
[null,"Prévu","Entrée","Sortie","Entrée","Sortie","total","variation","cumul","Type","nb J/T",null,"divers E/S","Sortie","Retour"]
[null,null,null,null,null,null,null,null,{"$f":"AOU!$I$50","v":4.5}]
[{"$f":"VALUE(\"01/09/\"&G3)","v":"2023-09-01"},{"$f":"INDIRECT(ADDRESS(MATCH($B$1,Calendrier!$A$15:$A$59,0)+14,ROW()-17,3,1,\"Calendrier\"),1)","v":"T"},null,null,null,null,{"$f":"IF(AND(C19<>0,D19<>0,E19<>0,F19<>0),F19-E19+D19-C19-K19-IF(E19-D19<Calendrier!$AT$10,Calendrier!$AT$10,0),IF(AND(C19<>0,D19<>0,E19=0,F19=0),D19-C19-K19,IF(AND(C19=0,D19=0,E19<>0,F19<>0),F19-E19-K19,IF(AND(C19>20,D19=0,E19=0,F19<>0),24-C19+F19-K19,IF(AND(C19<>0,D19=0,E19=0,F19<>0),F19-C19-K19,0)))))","v":0},{"$f":"IF(G19=0,0,IF(K19=0.5,0,G19-Calendrier!$AT$9))","v":0},{"$f":"I18+H19","v":4.5},{"$f":"IF(AND(COUNTA(C19:F19)=0,OR(B19=\"F\",WEEKDAY(A19,2)>5,B19=\"T\",B19=\"RTT\",B19=\"CA\")),B19,IF(AND(COUNTA(C19:F19)>=2,OR(B19=\"F\",B19=\"RTT\",B19=\"CA\",B19=\"Sa\",B19=\"Di\")),\"calendrier\",IF(AND(COUNTA(C19)+COUNTA(F19)=2,OR(COUNTA(C19:D19)<1,COUNTA(E19:F19)<1)),\"erreur\",IF(COUNTA(C19:F19)=3,\"en cours\",IF(COUNTA(C19:F19)=4,B19,IF(OR(AND(C19<>0,D19<>0),AND(E19<>0,F19<>0)),$F$12,IF(AND(C19<>0,D19=0,E19=0,F19<>0,WEEKDAY(A19,2)>5),\"calendrier\",IF(AND(C19<>0,D19=0,E19=0,F19<>0),$B19,\"\"))))))))","v":"T"},{"$f":"IF(COUNTA(C19:F19)=4,1,IF(OR(AND(C19<>0,D19<>0),AND(E19<>0,F19<>0)),0.5,IF(AND(C19<>0,F19<>0,D19=0,E19=0,B19=\"T\"),1,0)))","v":0},null,{"$f":"IF(OR(N19=0,O19=0),0,O19-N19)","v":0}]
[{"$f":"A19+1","v":"2023-09-02"},{"$f":"INDIRECT(ADDRESS(MATCH($B$1,Calendrier!$A$15:$A$59,0)+14,ROW()-17,3,1,\"Calendrier\"),1)","v":"Sa"},null,null,null,null,{"$f":"IF(AND(C20<>0,D20<>0,E20<>0,F20<>0),F20-E20+D20-C20-K20-IF(E20-D20<Calendrier!$AT$10,Calendrier!$AT$10,0),IF(AND(C20<>0,D20<>0,E20=0,F20=0),D20-C20-K20,IF(AND(C20=0,D20=0,E20<>0,F20<>0),F20-E20-K20,IF(AND(C20>20,D20=0,E20=0,F20<>0),24-C20+F20-K20,IF(AND(C20<>0,D20=0,E20=0,F20<>0),F20-C20-K20,0)))))","v":0},{"$f":"IF(G20=0,0,IF(K20=0.5,0,G20-Calendrier!$AT$9))","v":0},4.5,"Sa",0,null,0]
[{"$f":"A20+1","v":"2023-09-03"},{"$f":"INDIRECT(ADDRESS(MATCH($B$1,Calendrier!$A$15:$A$59,0)+14,ROW()-17,3,1,\"Calendrier\"),1)","v":"Di"},null,null,null,null,{"$f":"IF(AND(C21<>0,D21<>0,E21<>0,F21<>0),F21-E21+D21-C21-M21-IF(E21-D21<Calendrier!$AT$10,Calendrier!$AT$10,0),IF(AND(C21<>0,D21<>0,E21=0,F21=0),D21-C21-M21,IF(AND(C21=0,D21=0,E21<>0,F21<>0),F21-E21-M21,IF(AND(C21>20,D21=0,E21=0,F21<>0),24-C21+F21-M21,IF(AND(C21<>0,D21=0,E21=0,F21<>0),F21-C21-M21,0)))))","v":0},{"$f":"IF(G21=0,0,IF(K21=0.5,0,G21-Calendrier!$AT$9))","v":0},{"$f":"I20+H21","v":4.5},"Di",0,null,0]
["2023-09-04",{"$f":"INDIRECT(ADDRESS(MATCH($B$1,Calendrier!$A$15:$A$59,0)+14,ROW()-17,3,1,\"Calendrier\"),1)","v":"T"},null,null,null,null,{"$f":"IF(AND(C22<>0,D22<>0,E22<>0,F22<>0),F22-E22+D22-C22-M22-IF(E22-D22<Calendrier!$AT$10,Calendrier!$AT$10,0),IF(AND(C22<>0,D22<>0,E22=0,F22=0),D22-C22-M22,IF(AND(C22=0,D22=0,E22<>0,F22<>0),F22-E22-M22,IF(AND(C22>20,D22=0,E22=0,F22<>0),24-C22+F22-M22,IF(AND(C22<>0,D22=0,E22=0,F22<>0),F22-C22-M22,0)))))","v":0},{"$f":"IF(G22=0,0,IF(K22=0.5,0,G22-Calendrier!$AT$9))","v":0},4.5,"T",0,null,0]
["2023-09-05",{"$f":"INDIRECT(ADDRESS(MATCH($B$1,Calendrier!$A$15:$A$59,0)+14,ROW()-17,3,1,\"Calendrier\"),1)","v":"T"},null,null,null,null,{"$f":"IF(AND(C23<>0,D23<>0,E23<>0,F23<>0),F23-E23+D23-C23-M23-IF(E23-D23<Calendrier!$AT$10,Calendrier!$AT$10,0),IF(AND(C23<>0,D23<>0,E23=0,F23=0),D23-C23-M23,IF(AND(C23=0,D23=0,E23<>0,F23<>0),F23-E23-M23,IF(AND(C23>20,D23=0,E23=0,F23<>0),24-C23+F23-M23,IF(AND(C23<>0,D23=0,E23=0,F23<>0),F23-C23-M23,0)))))","v":0},{"$f":"IF(G23=0,0,IF(K23=0.5,0,G23-Calendrier!$AT$9))","v":0},4.5,"T",0,null,0]
["2023-09-06",{"$f":"INDIRECT(ADDRESS(MATCH($B$1,Calendrier!$A$15:$A$59,0)+14,ROW()-17,3,1,\"Calendrier\"),1)","v":"T"},null,null,null,null,{"$f":"IF(AND(C24<>0,D24<>0,E24<>0,F24<>0),F24-E24+D24-C24-M24-IF(E24-D24<Calendrier!$AT$10,Calendrier!$AT$10,0),IF(AND(C24<>0,D24<>0,E24=0,F24=0),D24-C24-M24,IF(AND(C24=0,D24=0,E24<>0,F24<>0),F24-E24-M24,IF(AND(C24>20,D24=0,E24=0,F24<>0),24-C24+F24-M24,IF(AND(C24<>0,D24=0,E24=0,F24<>0),F24-C24-M24,0)))))","v":0},{"$f":"IF(G24=0,0,IF(K24=0.5,0,G24-Calendrier!$AT$9))","v":0},4.5,"T",0,null,{"$f":"IF(OR(N24=0,O24=0),0,O24-N24)","v":0}]
["2023-09-07",{"$f":"INDIRECT(ADDRESS(MATCH($B$1,Calendrier!$A$15:$A$59,0)+14,ROW()-17,3,1,\"Calendrier\"),1)","v":"T"},null,null,null,null,{"$f":"IF(AND(C25<>0,D25<>0,E25<>0,F25<>0),F25-E25+D25-C25-M25-IF(E25-D25<Calendrier!$AT$10,Calendrier!$AT$10,0),IF(AND(C25<>0,D25<>0,E25=0,F25=0),D25-C25-M25,IF(AND(C25=0,D25=0,E25<>0,F25<>0),F25-E25-M25,IF(AND(C25>20,D25=0,E25=0,F25<>0),24-C25+F25-M25,IF(AND(C25<>0,D25=0,E25=0,F25<>0),F25-C25-M25,0)))))","v":0},{"$f":"IF(G25=0,0,IF(K25=0.5,0,G25-Calendrier!$AT$9))","v":0},4.5,"T",0,null,{"$f":"IF(OR(N25=0,O25=0),0,O25-N25)","v":0}]
["2023-09-08",{"$f":"INDIRECT(ADDRESS(MATCH($B$1,Calendrier!$A$15:$A$59,0)+14,ROW()-17,3,1,\"Calendrier\"),1)","v":"T"},null,null,null,null,{"$f":"IF(AND(C26<>0,D26<>0,E26<>0,F26<>0),F26-E26+D26-C26-M26-IF(E26-D26<Calendrier!$AT$10,Calendrier!$AT$10,0),IF(AND(C26<>0,D26<>0,E26=0,F26=0),D26-C26-M26,IF(AND(C26=0,D26=0,E26<>0,F26<>0),F26-E26-M26,IF(AND(C26>20,D26=0,E26=0,F26<>0),24-C26+F26-M26,IF(AND(C26<>0,D26=0,E26=0,F26<>0),F26-C26-M26,0)))))","v":0},{"$f":"IF(G26=0,0,IF(K26=0.5,0,G26-Calendrier!$AT$9))","v":0},4.5,"T",0,null,0]
["2023-09-09",{"$f":"INDIRECT(ADDRESS(MATCH($B$1,Calendrier!$A$15:$A$59,0)+14,ROW()-17,3,1,\"Calendrier\"),1)","v":"Sa"},null,null,null,null,{"$f":"IF(AND(C27<>0,D27<>0,E27<>0,F27<>0),F27-E27+D27-C27-M27-IF(E27-D27<Calendrier!$AT$10,Calendrier!$AT$10,0),IF(AND(C27<>0,D27<>0,E27=0,F27=0),D27-C27-M27,IF(AND(C27=0,D27=0,E27<>0,F27<>0),F27-E27-M27,IF(AND(C27>20,D27=0,E27=0,F27<>0),24-C27+F27-M27,IF(AND(C27<>0,D27=0,E27=0,F27<>0),F27-C27-M27,0)))))","v":0},{"$f":"IF(G27=0,0,IF(K27=0.5,0,G27-Calendrier!$AT$9))","v":0},4.5,"Sa",0,null,0]
["2023-09-10",{"$f":"INDIRECT(ADDRESS(MATCH($B$1,Calendrier!$A$15:$A$59,0)+14,ROW()-17,3,1,\"Calendrier\"),1)","v":"Di"},null,null,null,null,{"$f":"IF(AND(C28<>0,D28<>0,E28<>0,F28<>0),F28-E28+D28-C28-M28-IF(E28-D28<Calendrier!$AT$10,Calendrier!$AT$10,0),IF(AND(C28<>0,D28<>0,E28=0,F28=0),D28-C28-M28,IF(AND(C28=0,D28=0,E28<>0,F28<>0),F28-E28-M28,IF(AND(C28>20,D28=0,E28=0,F28<>0),24-C28+F28-M28,IF(AND(C28<>0,D28=0,E28=0,F28<>0),F28-C28-M28,0)))))","v":0},{"$f":"IF(G28=0,0,IF(K28=0.5,0,G28-Calendrier!$AT$9))","v":0},4.5,"Di",0,null,0]
["2023-09-11",{"$f":"INDIRECT(ADDRESS(MATCH($B$1,Calendrier!$A$15:$A$59,0)+14,ROW()-17,3,1,\"Calendrier\"),1)","v":"T"},null,null,null,null,{"$f":"IF(AND(C29<>0,D29<>0,E29<>0,F29<>0),F29-E29+D29-C29-M29-IF(E29-D29<Calendrier!$AT$10,Calendrier!$AT$10,0),IF(AND(C29<>0,D29<>0,E29=0,F29=0),D29-C29-M29,IF(AND(C29=0,D29=0,E29<>0,F29<>0),F29-E29-M29,IF(AND(C29>20,D29=0,E29=0,F29<>0),24-C29+F29-M29,IF(AND(C29<>0,D29=0,E29=0,F29<>0),F29-C29-M29,0)))))","v":0},{"$f":"IF(G29=0,0,IF(K29=0.5,0,G29-Calendrier!$AT$9))","v":0},4.5,"T",0,null,0]
["2023-09-12",{"$f":"INDIRECT(ADDRESS(MATCH($B$1,Calendrier!$A$15:$A$59,0)+14,ROW()-17,3,1,\"Calendrier\"),1)","v":"T"},null,null,null,null,{"$f":"IF(AND(C30<>0,D30<>0,E30<>0,F30<>0),F30-E30+D30-C30-M30-IF(E30-D30<Calendrier!$AT$10,Calendrier!$AT$10,0),IF(AND(C30<>0,D30<>0,E30=0,F30=0),D30-C30-M30,IF(AND(C30=0,D30=0,E30<>0,F30<>0),F30-E30-M30,IF(AND(C30>20,D30=0,E30=0,F30<>0),24-C30+F30-M30,IF(AND(C30<>0,D30=0,E30=0,F30<>0),F30-C30-M30,0)))))","v":0},{"$f":"IF(G30=0,0,IF(K30=0.5,0,G30-Calendrier!$AT$9))","v":0},4.5,"T",0,null,0]
["2023-09-13",{"$f":"INDIRECT(ADDRESS(MATCH($B$1,Calendrier!$A$15:$A$59,0)+14,ROW()-17,3,1,\"Calendrier\"),1)","v":"T"},null,null,null,null,{"$f":"IF(AND(C31<>0,D31<>0,E31<>0,F31<>0),F31-E31+D31-C31-M31-IF(E31-D31<Calendrier!$AT$10,Calendrier!$AT$10,0),IF(AND(C31<>0,D31<>0,E31=0,F31=0),D31-C31-M31,IF(AND(C31=0,D31=0,E31<>0,F31<>0),F31-E31-M31,IF(AND(C31>20,D31=0,E31=0,F31<>0),24-C31+F31-M31,IF(AND(C31<>0,D31=0,E31=0,F31<>0),F31-C31-M31,0)))))","v":0},{"$f":"IF(G31=0,0,IF(K31=0.5,0,G31-Calendrier!$AT$9))","v":0},4.5,"T",0,null,0]
["2023-09-14",{"$f":"INDIRECT(ADDRESS(MATCH($B$1,Calendrier!$A$15:$A$59,0)+14,ROW()-17,3,1,\"Calendrier\"),1)","v":"T"},null,null,null,null,{"$f":"IF(AND(C32<>0,D32<>0,E32<>0,F32<>0),F32-E32+D32-C32-M32-IF(E32-D32<Calendrier!$AT$10,Calendrier!$AT$10,0),IF(AND(C32<>0,D32<>0,E32=0,F32=0),D32-C32-M32,IF(AND(C32=0,D32=0,E32<>0,F32<>0),F32-E32-M32,IF(AND(C32>20,D32=0,E32=0,F32<>0),24-C32+F32-M32,IF(AND(C32<>0,D32=0,E32=0,F32<>0),F32-C32-M32,0)))))","v":0},{"$f":"IF(G32=0,0,IF(K32=0.5,0,G32-Calendrier!$AT$9))","v":0},4.5,"T",0,null,0]
["2023-09-15",{"$f":"INDIRECT(ADDRESS(MATCH($B$1,Calendrier!$A$15:$A$59,0)+14,ROW()-17,3,1,\"Calendrier\"),1)","v":"T"},null,null,null,null,{"$f":"IF(AND(C33<>0,D33<>0,E33<>0,F33<>0),F33-E33+D33-C33-M33-IF(E33-D33<Calendrier!$AT$10,Calendrier!$AT$10,0),IF(AND(C33<>0,D33<>0,E33=0,F33=0),D33-C33-M33,IF(AND(C33=0,D33=0,E33<>0,F33<>0),F33-E33-M33,IF(AND(C33>20,D33=0,E33=0,F33<>0),24-C33+F33-M33,IF(AND(C33<>0,D33=0,E33=0,F33<>0),F33-C33-M33,0)))))","v":0},{"$f":"IF(G33=0,0,IF(K33=0.5,0,G33-Calendrier!$AT$9))","v":0},4.5,"T",0,null,0]
["2023-09-16",{"$f":"INDIRECT(ADDRESS(MATCH($B$1,Calendrier!$A$15:$A$59,0)+14,ROW()-17,3,1,\"Calendrier\"),1)","v":"Sa"},null,null,null,null,{"$f":"IF(AND(C34<>0,D34<>0,E34<>0,F34<>0),F34-E34+D34-C34-M34-IF(E34-D34<Calendrier!$AT$10,Calendrier!$AT$10,0),IF(AND(C34<>0,D34<>0,E34=0,F34=0),D34-C34-M34,IF(AND(C34=0,D34=0,E34<>0,F34<>0),F34-E34-M34,IF(AND(C34>20,D34=0,E34=0,F34<>0),24-C34+F34-M34,IF(AND(C34<>0,D34=0,E34=0,F34<>0),F34-C34-M34,0)))))","v":0},{"$f":"IF(G34=0,0,IF(K34=0.5,0,G34-Calendrier!$AT$9))","v":0},4.5,{"$f":"IF(AND(COUNTA(C34:F34)=0,OR(B34=\"F\",WEEKDAY(A34,2)>5,B34=\"T\",B34=\"RTT\",B34=\"CA\")),B34,IF(AND(COUNTA(C34:F34)>=2,OR(B34=\"F\",B34=\"RTT\",B34=\"CA\",B34=\"Sa\",B34=\"Di\")),\"calendrier\",IF(AND(COUNTA(C34)+COUNTA(F34)=2,OR(COUNTA(C34:D34)<1,COUNTA(E34:F34)<1)),\"erreur\",IF(COUNTA(C34:F34)=3,\"en cours\",IF(COUNTA(C34:F34)=4,B34,IF(OR(AND(C34<>0,D34<>0),AND(E34<>0,F34<>0)),$F$12,IF(AND(C34<>0,D34=0,E34=0,F34<>0,WEEKDAY(A34,2)>5),\"calendrier\",IF(AND(C34<>0,D34=0,E34=0,F34<>0),$B34,\"\"))))))))","v":"Sa"},0,null,0]
["2023-09-17",{"$f":"INDIRECT(ADDRESS(MATCH($B$1,Calendrier!$A$15:$A$59,0)+14,ROW()-17,3,1,\"Calendrier\"),1)","v":"Di"},null,null,null,null,{"$f":"IF(AND(C35<>0,D35<>0,E35<>0,F35<>0),F35-E35+D35-C35-M35-IF(E35-D35<Calendrier!$AT$10,Calendrier!$AT$10,0),IF(AND(C35<>0,D35<>0,E35=0,F35=0),D35-C35-M35,IF(AND(C35=0,D35=0,E35<>0,F35<>0),F35-E35-M35,IF(AND(C35>20,D35=0,E35=0,F35<>0),24-C35+F35-M35,IF(AND(C35<>0,D35=0,E35=0,F35<>0),F35-C35-M35,0)))))","v":0},{"$f":"IF(G35=0,0,IF(K35=0.5,0,G35-Calendrier!$AT$9))","v":0},4.5,"Di",0,null,0]
["2023-09-18",{"$f":"INDIRECT(ADDRESS(MATCH($B$1,Calendrier!$A$15:$A$59,0)+14,ROW()-17,3,1,\"Calendrier\"),1)","v":"T"},null,null,null,null,{"$f":"IF(AND(C36<>0,D36<>0,E36<>0,F36<>0),F36-E36+D36-C36-M36-IF(E36-D36<Calendrier!$AT$10,Calendrier!$AT$10,0),IF(AND(C36<>0,D36<>0,E36=0,F36=0),D36-C36-M36,IF(AND(C36=0,D36=0,E36<>0,F36<>0),F36-E36-M36,IF(AND(C36>20,D36=0,E36=0,F36<>0),24-C36+F36-M36,IF(AND(C36<>0,D36=0,E36=0,F36<>0),F36-C36-M36,0)))))","v":0},{"$f":"IF(G36=0,0,IF(K36=0.5,0,G36-Calendrier!$AT$9))","v":0},4.5,"T",0,null,0]
["2023-09-19",{"$f":"INDIRECT(ADDRESS(MATCH($B$1,Calendrier!$A$15:$A$59,0)+14,ROW()-17,3,1,\"Calendrier\"),1)","v":"T"},null,null,null,null,{"$f":"IF(AND(C37<>0,D37<>0,E37<>0,F37<>0),F37-E37+D37-C37-M37-IF(E37-D37<Calendrier!$AT$10,Calendrier!$AT$10,0),IF(AND(C37<>0,D37<>0,E37=0,F37=0),D37-C37-M37,IF(AND(C37=0,D37=0,E37<>0,F37<>0),F37-E37-M37,IF(AND(C37>20,D37=0,E37=0,F37<>0),24-C37+F37-M37,IF(AND(C37<>0,D37=0,E37=0,F37<>0),F37-C37-M37,0)))))","v":0},{"$f":"IF(G37=0,0,IF(K37=0.5,0,G37-Calendrier!$AT$9))","v":0},4.5,"T",0,null,0]
["2023-09-20",{"$f":"INDIRECT(ADDRESS(MATCH($B$1,Calendrier!$A$15:$A$59,0)+14,ROW()-17,3,1,\"Calendrier\"),1)","v":"T"},null,null,null,null,{"$f":"IF(AND(C38<>0,D38<>0,E38<>0,F38<>0),F38-E38+D38-C38-M38-IF(E38-D38<Calendrier!$AT$10,Calendrier!$AT$10,0),IF(AND(C38<>0,D38<>0,E38=0,F38=0),D38-C38-M38,IF(AND(C38=0,D38=0,E38<>0,F38<>0),F38-E38-M38,IF(AND(C38>20,D38=0,E38=0,F38<>0),24-C38+F38-M38,IF(AND(C38<>0,D38=0,E38=0,F38<>0),F38-C38-M38,0)))))","v":0},{"$f":"IF(G38=0,0,IF(K38=0.5,0,G38-Calendrier!$AT$9))","v":0},4.5,"T",0,null,0]
["2023-09-21",{"$f":"INDIRECT(ADDRESS(MATCH($B$1,Calendrier!$A$15:$A$59,0)+14,ROW()-17,3,1,\"Calendrier\"),1)","v":"T"},null,null,null,null,{"$f":"IF(AND(C39<>0,D39<>0,E39<>0,F39<>0),F39-E39+D39-C39-M39-IF(E39-D39<Calendrier!$AT$10,Calendrier!$AT$10,0),IF(AND(C39<>0,D39<>0,E39=0,F39=0),D39-C39-M39,IF(AND(C39=0,D39=0,E39<>0,F39<>0),F39-E39-M39,IF(AND(C39>20,D39=0,E39=0,F39<>0),24-C39+F39-M39,IF(AND(C39<>0,D39=0,E39=0,F39<>0),F39-C39-M39,0)))))","v":0},{"$f":"IF(G39=0,0,IF(K39=0.5,0,G39-Calendrier!$AT$9))","v":0},4.5,"T",0,null,0]
["2023-09-22",{"$f":"INDIRECT(ADDRESS(MATCH($B$1,Calendrier!$A$15:$A$59,0)+14,ROW()-17,3,1,\"Calendrier\"),1)","v":"T"},null,null,null,null,{"$f":"IF(AND(C40<>0,D40<>0,E40<>0,F40<>0),F40-E40+D40-C40-M40-IF(E40-D40<Calendrier!$AT$10,Calendrier!$AT$10,0),IF(AND(C40<>0,D40<>0,E40=0,F40=0),D40-C40-M40,IF(AND(C40=0,D40=0,E40<>0,F40<>0),F40-E40-M40,IF(AND(C40>20,D40=0,E40=0,F40<>0),24-C40+F40-M40,IF(AND(C40<>0,D40=0,E40=0,F40<>0),F40-C40-M40,0)))))","v":0},{"$f":"IF(G40=0,0,IF(K40=0.5,0,G40-Calendrier!$AT$9))","v":0},4.5,"T",0,null,0]
["2023-09-23",{"$f":"INDIRECT(ADDRESS(MATCH($B$1,Calendrier!$A$15:$A$59,0)+14,ROW()-17,3,1,\"Calendrier\"),1)","v":"Sa"},null,null,null,null,{"$f":"IF(AND(C41<>0,D41<>0,E41<>0,F41<>0),F41-E41+D41-C41-M41-IF(E41-D41<Calendrier!$AT$10,Calendrier!$AT$10,0),IF(AND(C41<>0,D41<>0,E41=0,F41=0),D41-C41-M41,IF(AND(C41=0,D41=0,E41<>0,F41<>0),F41-E41-M41,IF(AND(C41>20,D41=0,E41=0,F41<>0),24-C41+F41-M41,IF(AND(C41<>0,D41=0,E41=0,F41<>0),F41-C41-M41,0)))))","v":0},{"$f":"IF(G41=0,0,IF(K41=0.5,0,G41-Calendrier!$AT$9))","v":0},4.5,"Sa",0,null,0]
["2023-09-24",{"$f":"INDIRECT(ADDRESS(MATCH($B$1,Calendrier!$A$15:$A$59,0)+14,ROW()-17,3,1,\"Calendrier\"),1)","v":"Di"},null,null,null,null,{"$f":"IF(AND(C42<>0,D42<>0,E42<>0,F42<>0),F42-E42+D42-C42-M42-IF(E42-D42<Calendrier!$AT$10,Calendrier!$AT$10,0),IF(AND(C42<>0,D42<>0,E42=0,F42=0),D42-C42-M42,IF(AND(C42=0,D42=0,E42<>0,F42<>0),F42-E42-M42,IF(AND(C42>20,D42=0,E42=0,F42<>0),24-C42+F42-M42,IF(AND(C42<>0,D42=0,E42=0,F42<>0),F42-C42-M42,0)))))","v":0},{"$f":"IF(G42=0,0,IF(K42=0.5,0,G42-Calendrier!$AT$9))","v":0},4.5,"Di",0,null,0]
["2023-09-25",{"$f":"INDIRECT(ADDRESS(MATCH($B$1,Calendrier!$A$15:$A$59,0)+14,ROW()-17,3,1,\"Calendrier\"),1)","v":"T"},null,null,null,null,{"$f":"IF(AND(C43<>0,D43<>0,E43<>0,F43<>0),F43-E43+D43-C43-M43-IF(E43-D43<Calendrier!$AT$10,Calendrier!$AT$10,0),IF(AND(C43<>0,D43<>0,E43=0,F43=0),D43-C43-M43,IF(AND(C43=0,D43=0,E43<>0,F43<>0),F43-E43-M43,IF(AND(C43>20,D43=0,E43=0,F43<>0),24-C43+F43-M43,IF(AND(C43<>0,D43=0,E43=0,F43<>0),F43-C43-M43,0)))))","v":0},{"$f":"IF(G43=0,0,IF(K43=0.5,0,G43-Calendrier!$AT$9))","v":0},4.5,"T",0,null,0]
["2023-09-26",{"$f":"INDIRECT(ADDRESS(MATCH($B$1,Calendrier!$A$15:$A$59,0)+14,ROW()-17,3,1,\"Calendrier\"),1)","v":"T"},null,null,null,null,{"$f":"IF(AND(C44<>0,D44<>0,E44<>0,F44<>0),F44-E44+D44-C44-M44-IF(E44-D44<Calendrier!$AT$10,Calendrier!$AT$10,0),IF(AND(C44<>0,D44<>0,E44=0,F44=0),D44-C44-M44,IF(AND(C44=0,D44=0,E44<>0,F44<>0),F44-E44-M44,IF(AND(C44>20,D44=0,E44=0,F44<>0),24-C44+F44-M44,IF(AND(C44<>0,D44=0,E44=0,F44<>0),F44-C44-M44,0)))))","v":0},{"$f":"IF(G44=0,0,IF(K44=0.5,0,G44-Calendrier!$AT$9))","v":0},4.5,"T",0,null,0]
["2023-09-27",{"$f":"INDIRECT(ADDRESS(MATCH($B$1,Calendrier!$A$15:$A$59,0)+14,ROW()-17,3,1,\"Calendrier\"),1)","v":"RTT"},null,null,null,null,{"$f":"IF(AND(C45<>0,D45<>0,E45<>0,F45<>0),F45-E45+D45-C45-M45-IF(E45-D45<Calendrier!$AT$10,Calendrier!$AT$10,0),IF(AND(C45<>0,D45<>0,E45=0,F45=0),D45-C45-M45,IF(AND(C45=0,D45=0,E45<>0,F45<>0),F45-E45-M45,IF(AND(C45>20,D45=0,E45=0,F45<>0),24-C45+F45-M45,IF(AND(C45<>0,D45=0,E45=0,F45<>0),F45-C45-M45,0)))))","v":0},{"$f":"IF(G45=0,0,IF(K45=0.5,0,G45-Calendrier!$AT$9))","v":0},4.5,"RTT",0,null,0]
["2023-09-28",{"$f":"INDIRECT(ADDRESS(MATCH($B$1,Calendrier!$A$15:$A$59,0)+14,ROW()-17,3,1,\"Calendrier\"),1)","v":"T"},null,null,null,null,{"$f":"IF(AND(C46<>0,D46<>0,E46<>0,F46<>0),F46-E46+D46-C46-M46-IF(E46-D46<Calendrier!$AT$10,Calendrier!$AT$10,0),IF(AND(C46<>0,D46<>0,E46=0,F46=0),D46-C46-M46,IF(AND(C46=0,D46=0,E46<>0,F46<>0),F46-E46-M46,IF(AND(C46>20,D46=0,E46=0,F46<>0),24-C46+F46-M46,IF(AND(C46<>0,D46=0,E46=0,F46<>0),F46-C46-M46,0)))))","v":0},{"$f":"IF(G46=0,0,IF(K46=0.5,0,G46-Calendrier!$AT$9))","v":0},4.5,"T",0,null,0]
["2023-09-29",{"$f":"INDIRECT(ADDRESS(MATCH($B$1,Calendrier!$A$15:$A$59,0)+14,ROW()-17,3,1,\"Calendrier\"),1)","v":"T"},null,null,null,null,{"$f":"IF(AND(C47<>0,D47<>0,E47<>0,F47<>0),F47-E47+D47-C47-M47-IF(E47-D47<Calendrier!$AT$10,Calendrier!$AT$10,0),IF(AND(C47<>0,D47<>0,E47=0,F47=0),D47-C47-M47,IF(AND(C47=0,D47=0,E47<>0,F47<>0),F47-E47-M47,IF(AND(C47>20,D47=0,E47=0,F47<>0),24-C47+F47-M47,IF(AND(C47<>0,D47=0,E47=0,F47<>0),F47-C47-M47,0)))))","v":0},{"$f":"IF(G47=0,0,IF(K47=0.5,0,G47-Calendrier!$AT$9))","v":0},4.5,"T",0,null,0]
["2023-09-30",{"$f":"INDIRECT(ADDRESS(MATCH($B$1,Calendrier!$A$15:$A$59,0)+14,ROW()-17,3,1,\"Calendrier\"),1)","v":"Sa"},null,null,null,null,{"$f":"IF(AND(C48<>0,D48<>0,E48<>0,F48<>0),F48-E48+D48-C48-M48-IF(E48-D48<Calendrier!$AT$10,Calendrier!$AT$10,0),IF(AND(C48<>0,D48<>0,E48=0,F48=0),D48-C48-M48,IF(AND(C48=0,D48=0,E48<>0,F48<>0),F48-E48-M48,IF(AND(C48>20,D48=0,E48=0,F48<>0),24-C48+F48-M48,IF(AND(C48<>0,D48=0,E48=0,F48<>0),F48-C48-M48,0)))))","v":0},{"$f":"IF(G48=0,0,IF(K48=0.5,0,G48-Calendrier!$AT$9))","v":0},4.5,"Sa",0,null,0]
[{"$f":"IF(MONTH(A48+1)>9,0,A48+1)","v":"00:00:00"},{"$f":"INDIRECT(ADDRESS(MATCH($B$1,Calendrier!$A$15:$A$59,0)+14,ROW()-17,3,1,\"Calendrier\"),1)","v":0},null,null,null,null,{"$f":"IF(AND(C49<>0,D49<>0,E49<>0,F49<>0),F49-E49+D49-C49-M49-IF(E49-D49<Calendrier!$AT$10,Calendrier!$AT$10,0),IF(AND(C49<>0,D49<>0,E49=0,F49=0),D49-C49-M49,IF(AND(C49=0,D49=0,E49<>0,F49<>0),F49-E49-M49,IF(AND(C49>20,D49=0,E49=0,F49<>0),24-C49+F49-M49,IF(AND(C49<>0,D49=0,E49=0,F49<>0),F49-C49-M49,0)))))","v":0},{"$f":"IF(G49=0,0,IF(K49=0.5,0,G49-Calendrier!$AT$9))","v":0},4.5,{"$f":"IF(AND(COUNTA(C49:F49)=0,B49=\"F\"),B49,IF(AND(COUNTA(C49:F49)=0,WEEKDAY(A49,2)>5),B49,IF(AND(COUNTA(C49:F49)=0,B49=\"T\"),\"\",IF(AND(COUNTA(C49:F49)=0,B49=\"RTT\"),B49,IF(AND(COUNTA(D49:F49)=0,C49<>0),\"erreur\",IF(AND(COUNTA(C49:F49)=4,B49=\"RTT\"),\"Erreur RTT\",IF(AND(COUNTA(C49:F49)=4,B49=\"F\"),\"fériés\",IF(COUNTA(C49:F49)=4,B49,IF(COUNTA(C49:F49)=3,\"Erreur\",IF(AND(C49<>0,D49<>0),$F$12,IF(AND(E49<>0,F49<>0),$F$12,IF(AND(C49<>0,D49=0,E49=0,F49<>0,WEEKDAY(A49,2)>5),\"Modif  calendrier\",IF(AND(C49<>0,D49=0,E49=0,F49<>0),$B49)))))))))))))","v":0},0,null,0]
[null,null,null,null,null,null,{"$f":"SUM(G19:G49)","v":0},null,{"$f":"I49","v":4.5}]

{"sheet":"OCT","index":12,"n_rows":50,"n_cols":15,"rows_kept":50,"cut":false,"hidden":false,"merged":[]}
[null,{"$f":"RIGHT(CELL(\"nomfichier\",$A$1),3)","v":"OCT"},"FICHE DE SUIVI HORAIRE"]
[]
[null,"mois :","OCTOBRE",null,null,"année ",{"$f":"VLOOKUP(C3,Fériés!$I$1:$J$12,2,FALSE)","v":2023},null,null,"service",{"$f":"Calendrier!F4","v":"Administratif"}]
[]
[null,"nom :",{"$f":"Calendrier!F2","v":"Isq"},null,null," prénom ",{"$f":"Calendrier!F3","v":"Philippe"},null,null,"N° Ident",{"$f":"Calendrier!F1","v":"T506489"}]
[null,null,null,null,null,null,"type","à réaliser","cumul","en cours","reste",null,"N.cumul"]
[null,null,null,"Nb J",{"$f":"Calendrier!$AT$11","v":218},{"$f":"+$H$10","v":0},{"$f":"E7-F7","v":218},{"$f":"Calendrier!N1","v":365},{"$f":"SEP!M7","v":235.5},{"$f":"SUM(J8:J15)","v":31},{"$f":"H7-(I7+J7)","v":98.5},null,{"$f":"SUM(M8:M15)","v":266.5}]
[null,null,null,null,null,"1/2CA","CA",{"$f":"Calendrier!N5","v":25},{"$f":"SEP!M8","v":19},{"$f":"COUNTIF($J$19:$J$49,G8)+COUNTIF($J$19:$J$49,F8)/2","v":0},{"$f":"+H8-(I8+J8)","v":6},"J",{"$f":"+I8+J8","v":19}]
[null,null,null,null,null,"1/2RTT","RTT",{"$f":"Calendrier!N8","v":9},{"$f":"SEP!M9","v":4},{"$f":"COUNTIF($J$19:$J$49,G9)+COUNTIF($J$19:$J$49,F9)/2","v":1},{"$f":"+H9-(I9+J9)","v":4},"J",5]
[null,null,null,null,null,"1/2CS","CS",{"$f":"Calendrier!N9","v":0},{"$f":"SEP!M10","v":0},0,{"$f":"H10-(I10+J10)","v":0},"J",0]
[null,null,null,null,null,"1/2CP","CP",{"$f":"Calendrier!N6","v":0},{"$f":"SEP!M11","v":0},0,{"$f":"H11-(I11+J11)","v":0},"J",0]
[null,null,null,null,null,"1/2T","T",{"$f":"Calendrier!N7","v":218},{"$f":"SEP!M12","v":141.5},21,{"$f":"+H12-(I12+J12)","v":55.5},"J",162.5]
[null,null,null,null,null,0,"Sa",{"$f":"Calendrier!N4","v":51},{"$f":"SEP!M13","v":33},{"$f":"COUNTIF($J$19:$J$49,G13)","v":4},{"$f":"+H13-(I13+J13)","v":14},"J",37]
[null,null,null,null,null,0,"Di",{"$f":"Calendrier!N3","v":50},{"$f":"SEP!M14","v":33},{"$f":"COUNTIF($J$19:$J$49,G14)","v":5},{"$f":"+H14-(I14+J14)","v":12},"J",38]
[null,null,null,null,null,0,"F",{"$f":"Calendrier!N2","v":12},{"$f":"SEP!M15","v":5},{"$f":"COUNTIF($J$19:$J$49,G15)","v":0},{"$f":"+H15-(I15+J15)","v":7},"J",5]
[null,null,null,null,null,null,"heure/avance fin mois",null,{"$f":"SEP!I50","v":4.5},null,null,null,{"$f":"I50","v":4.5},"avec bon"]
[null,"Prévu","Entrée","Sortie","Entrée","Sortie","total","variation","cumul","Type","nb J/T",null,"divers E/S","Sortie","Retour"]
[null,null,null,null,null,null,null,null,{"$f":"SEP!$I$50","v":4.5}]
[{"$f":"VALUE(\"01/10/\"&G3)","v":"2023-10-01"},{"$f":"INDIRECT(ADDRESS(MATCH($B$1,Calendrier!$A$15:$A$59,0)+14,ROW()-17,3,1,\"Calendrier\"),1)","v":"Di"},null,null,null,null,{"$f":"IF(AND(C19<>0,D19<>0,E19<>0,F19<>0),F19-E19+D19-C19-K19-IF(E19-D19<Calendrier!$AT$10,Calendrier!$AT$10,0),IF(AND(C19<>0,D19<>0,E19=0,F19=0),D19-C19-K19,IF(AND(C19=0,D19=0,E19<>0,F19<>0),F19-E19-K19,IF(AND(C19>20,D19=0,E19=0,F19<>0),24-C19+F19-K19,IF(AND(C19<>0,D19=0,E19=0,F19<>0),F19-C19-K19,0)))))","v":0},{"$f":"IF(G19=0,0,IF(K19=0.5,0,G19-Calendrier!$AT$9))","v":0},{"$f":"I18+H19","v":4.5},{"$f":"IF(AND(COUNTA(C19:F19)=0,OR(B19=\"F\",WEEKDAY(A19,2)>5,B19=\"T\",B19=\"RTT\",B19=\"CA\")),B19,IF(AND(COUNTA(C19:F19)>=2,OR(B19=\"F\",B19=\"RTT\",B19=\"CA\",B19=\"Sa\",B19=\"Di\")),\"calendrier\",IF(AND(COUNTA(C19)+COUNTA(F19)=2,OR(COUNTA(C19:D19)<1,COUNTA(E19:F19)<1)),\"erreur\",IF(COUNTA(C19:F19)=3,\"en cours\",IF(COUNTA(C19:F19)=4,B19,IF(OR(AND(C19<>0,D19<>0),AND(E19<>0,F19<>0)),$F$12,IF(AND(C19<>0,D19=0,E19=0,F19<>0,WEEKDAY(A19,2)>5),\"calendrier\",IF(AND(C19<>0,D19=0,E19=0,F19<>0),$B19,\"\"))))))))","v":"Di"},{"$f":"IF(COUNTA(C19:F19)=4,1,IF(OR(AND(C19<>0,D19<>0),AND(E19<>0,F19<>0)),0.5,IF(AND(C19<>0,F19<>0,D19=0,E19=0,B19=\"T\"),1,0)))","v":0},null,{"$f":"IF(OR(N19=0,O19=0),0,O19-N19)","v":0}]
[{"$f":"A19+1","v":"2023-10-02"},{"$f":"INDIRECT(ADDRESS(MATCH($B$1,Calendrier!$A$15:$A$59,0)+14,ROW()-17,3,1,\"Calendrier\"),1)","v":"T"},null,null,null,null,{"$f":"IF(AND(C20<>0,D20<>0,E20<>0,F20<>0),F20-E20+D20-C20-K20-IF(E20-D20<Calendrier!$AT$10,Calendrier!$AT$10,0),IF(AND(C20<>0,D20<>0,E20=0,F20=0),D20-C20-K20,IF(AND(C20=0,D20=0,E20<>0,F20<>0),F20-E20-K20,IF(AND(C20>20,D20=0,E20=0,F20<>0),24-C20+F20-K20,IF(AND(C20<>0,D20=0,E20=0,F20<>0),F20-C20-K20,0)))))","v":0},{"$f":"IF(G20=0,0,IF(K20=0.5,0,G20-Calendrier!$AT$9))","v":0},4.5,"T",0,null,0]
[{"$f":"A20+1","v":"2023-10-03"},{"$f":"INDIRECT(ADDRESS(MATCH($B$1,Calendrier!$A$15:$A$59,0)+14,ROW()-17,3,1,\"Calendrier\"),1)","v":"T"},null,null,null,null,{"$f":"IF(AND(C21<>0,D21<>0,E21<>0,F21<>0),F21-E21+D21-C21-M21-IF(E21-D21<Calendrier!$AT$10,Calendrier!$AT$10,0),IF(AND(C21<>0,D21<>0,E21=0,F21=0),D21-C21-M21,IF(AND(C21=0,D21=0,E21<>0,F21<>0),F21-E21-M21,IF(AND(C21>20,D21=0,E21=0,F21<>0),24-C21+F21-M21,IF(AND(C21<>0,D21=0,E21=0,F21<>0),F21-C21-M21,0)))))","v":0},{"$f":"IF(G21=0,0,IF(K21=0.5,0,G21-Calendrier!$AT$9))","v":0},{"$f":"I20+H21","v":4.5},"T",0,null,0]
["2023-10-04",{"$f":"INDIRECT(ADDRESS(MATCH($B$1,Calendrier!$A$15:$A$59,0)+14,ROW()-17,3,1,\"Calendrier\"),1)","v":"T"},null,null,null,null,{"$f":"IF(AND(C22<>0,D22<>0,E22<>0,F22<>0),F22-E22+D22-C22-M22-IF(E22-D22<Calendrier!$AT$10,Calendrier!$AT$10,0),IF(AND(C22<>0,D22<>0,E22=0,F22=0),D22-C22-M22,IF(AND(C22=0,D22=0,E22<>0,F22<>0),F22-E22-M22,IF(AND(C22>20,D22=0,E22=0,F22<>0),24-C22+F22-M22,IF(AND(C22<>0,D22=0,E22=0,F22<>0),F22-C22-M22,0)))))","v":0},{"$f":"IF(G22=0,0,IF(K22=0.5,0,G22-Calendrier!$AT$9))","v":0},4.5,"T",0,null,0]
["2023-10-05",{"$f":"INDIRECT(ADDRESS(MATCH($B$1,Calendrier!$A$15:$A$59,0)+14,ROW()-17,3,1,\"Calendrier\"),1)","v":"T"},null,null,null,null,{"$f":"IF(AND(C23<>0,D23<>0,E23<>0,F23<>0),F23-E23+D23-C23-M23-IF(E23-D23<Calendrier!$AT$10,Calendrier!$AT$10,0),IF(AND(C23<>0,D23<>0,E23=0,F23=0),D23-C23-M23,IF(AND(C23=0,D23=0,E23<>0,F23<>0),F23-E23-M23,IF(AND(C23>20,D23=0,E23=0,F23<>0),24-C23+F23-M23,IF(AND(C23<>0,D23=0,E23=0,F23<>0),F23-C23-M23,0)))))","v":0},{"$f":"IF(G23=0,0,IF(K23=0.5,0,G23-Calendrier!$AT$9))","v":0},4.5,"T",0,null,0]
["2023-10-06",{"$f":"INDIRECT(ADDRESS(MATCH($B$1,Calendrier!$A$15:$A$59,0)+14,ROW()-17,3,1,\"Calendrier\"),1)","v":"T"},null,null,null,null,{"$f":"IF(AND(C24<>0,D24<>0,E24<>0,F24<>0),F24-E24+D24-C24-M24-IF(E24-D24<Calendrier!$AT$10,Calendrier!$AT$10,0),IF(AND(C24<>0,D24<>0,E24=0,F24=0),D24-C24-M24,IF(AND(C24=0,D24=0,E24<>0,F24<>0),F24-E24-M24,IF(AND(C24>20,D24=0,E24=0,F24<>0),24-C24+F24-M24,IF(AND(C24<>0,D24=0,E24=0,F24<>0),F24-C24-M24,0)))))","v":0},{"$f":"IF(G24=0,0,IF(K24=0.5,0,G24-Calendrier!$AT$9))","v":0},4.5,"T",0,null,{"$f":"IF(OR(N24=0,O24=0),0,O24-N24)","v":0}]
["2023-10-07",{"$f":"INDIRECT(ADDRESS(MATCH($B$1,Calendrier!$A$15:$A$59,0)+14,ROW()-17,3,1,\"Calendrier\"),1)","v":"Sa"},null,null,null,null,{"$f":"IF(AND(C25<>0,D25<>0,E25<>0,F25<>0),F25-E25+D25-C25-M25-IF(E25-D25<Calendrier!$AT$10,Calendrier!$AT$10,0),IF(AND(C25<>0,D25<>0,E25=0,F25=0),D25-C25-M25,IF(AND(C25=0,D25=0,E25<>0,F25<>0),F25-E25-M25,IF(AND(C25>20,D25=0,E25=0,F25<>0),24-C25+F25-M25,IF(AND(C25<>0,D25=0,E25=0,F25<>0),F25-C25-M25,0)))))","v":0},{"$f":"IF(G25=0,0,IF(K25=0.5,0,G25-Calendrier!$AT$9))","v":0},4.5,"Sa",0,null,{"$f":"IF(OR(N25=0,O25=0),0,O25-N25)","v":0}]
["2023-10-08",{"$f":"INDIRECT(ADDRESS(MATCH($B$1,Calendrier!$A$15:$A$59,0)+14,ROW()-17,3,1,\"Calendrier\"),1)","v":"Di"},null,null,null,null,{"$f":"IF(AND(C26<>0,D26<>0,E26<>0,F26<>0),F26-E26+D26-C26-M26-IF(E26-D26<Calendrier!$AT$10,Calendrier!$AT$10,0),IF(AND(C26<>0,D26<>0,E26=0,F26=0),D26-C26-M26,IF(AND(C26=0,D26=0,E26<>0,F26<>0),F26-E26-M26,IF(AND(C26>20,D26=0,E26=0,F26<>0),24-C26+F26-M26,IF(AND(C26<>0,D26=0,E26=0,F26<>0),F26-C26-M26,0)))))","v":0},{"$f":"IF(G26=0,0,IF(K26=0.5,0,G26-Calendrier!$AT$9))","v":0},4.5,"Di",0,null,0]
["2023-10-09",{"$f":"INDIRECT(ADDRESS(MATCH($B$1,Calendrier!$A$15:$A$59,0)+14,ROW()-17,3,1,\"Calendrier\"),1)","v":"T"},null,null,null,null,{"$f":"IF(AND(C27<>0,D27<>0,E27<>0,F27<>0),F27-E27+D27-C27-M27-IF(E27-D27<Calendrier!$AT$10,Calendrier!$AT$10,0),IF(AND(C27<>0,D27<>0,E27=0,F27=0),D27-C27-M27,IF(AND(C27=0,D27=0,E27<>0,F27<>0),F27-E27-M27,IF(AND(C27>20,D27=0,E27=0,F27<>0),24-C27+F27-M27,IF(AND(C27<>0,D27=0,E27=0,F27<>0),F27-C27-M27,0)))))","v":0},{"$f":"IF(G27=0,0,IF(K27=0.5,0,G27-Calendrier!$AT$9))","v":0},4.5,"T",0,null,0]
["2023-10-10",{"$f":"INDIRECT(ADDRESS(MATCH($B$1,Calendrier!$A$15:$A$59,0)+14,ROW()-17,3,1,\"Calendrier\"),1)","v":"T"},null,null,null,null,{"$f":"IF(AND(C28<>0,D28<>0,E28<>0,F28<>0),F28-E28+D28-C28-M28-IF(E28-D28<Calendrier!$AT$10,Calendrier!$AT$10,0),IF(AND(C28<>0,D28<>0,E28=0,F28=0),D28-C28-M28,IF(AND(C28=0,D28=0,E28<>0,F28<>0),F28-E28-M28,IF(AND(C28>20,D28=0,E28=0,F28<>0),24-C28+F28-M28,IF(AND(C28<>0,D28=0,E28=0,F28<>0),F28-C28-M28,0)))))","v":0},{"$f":"IF(G28=0,0,IF(K28=0.5,0,G28-Calendrier!$AT$9))","v":0},4.5,"T",0,null,0]
["2023-10-11",{"$f":"INDIRECT(ADDRESS(MATCH($B$1,Calendrier!$A$15:$A$59,0)+14,ROW()-17,3,1,\"Calendrier\"),1)","v":"T"},null,null,null,null,{"$f":"IF(AND(C29<>0,D29<>0,E29<>0,F29<>0),F29-E29+D29-C29-M29-IF(E29-D29<Calendrier!$AT$10,Calendrier!$AT$10,0),IF(AND(C29<>0,D29<>0,E29=0,F29=0),D29-C29-M29,IF(AND(C29=0,D29=0,E29<>0,F29<>0),F29-E29-M29,IF(AND(C29>20,D29=0,E29=0,F29<>0),24-C29+F29-M29,IF(AND(C29<>0,D29=0,E29=0,F29<>0),F29-C29-M29,0)))))","v":0},{"$f":"IF(G29=0,0,IF(K29=0.5,0,G29-Calendrier!$AT$9))","v":0},4.5,"T",0,null,0]
["2023-10-12",{"$f":"INDIRECT(ADDRESS(MATCH($B$1,Calendrier!$A$15:$A$59,0)+14,ROW()-17,3,1,\"Calendrier\"),1)","v":"T"},null,null,null,null,{"$f":"IF(AND(C30<>0,D30<>0,E30<>0,F30<>0),F30-E30+D30-C30-M30-IF(E30-D30<Calendrier!$AT$10,Calendrier!$AT$10,0),IF(AND(C30<>0,D30<>0,E30=0,F30=0),D30-C30-M30,IF(AND(C30=0,D30=0,E30<>0,F30<>0),F30-E30-M30,IF(AND(C30>20,D30=0,E30=0,F30<>0),24-C30+F30-M30,IF(AND(C30<>0,D30=0,E30=0,F30<>0),F30-C30-M30,0)))))","v":0},{"$f":"IF(G30=0,0,IF(K30=0.5,0,G30-Calendrier!$AT$9))","v":0},4.5,"T",0,null,0]
["2023-10-13",{"$f":"INDIRECT(ADDRESS(MATCH($B$1,Calendrier!$A$15:$A$59,0)+14,ROW()-17,3,1,\"Calendrier\"),1)","v":"T"},null,null,null,null,{"$f":"IF(AND(C31<>0,D31<>0,E31<>0,F31<>0),F31-E31+D31-C31-M31-IF(E31-D31<Calendrier!$AT$10,Calendrier!$AT$10,0),IF(AND(C31<>0,D31<>0,E31=0,F31=0),D31-C31-M31,IF(AND(C31=0,D31=0,E31<>0,F31<>0),F31-E31-M31,IF(AND(C31>20,D31=0,E31=0,F31<>0),24-C31+F31-M31,IF(AND(C31<>0,D31=0,E31=0,F31<>0),F31-C31-M31,0)))))","v":0},{"$f":"IF(G31=0,0,IF(K31=0.5,0,G31-Calendrier!$AT$9))","v":0},4.5,"T",0,null,0]
["2023-10-14",{"$f":"INDIRECT(ADDRESS(MATCH($B$1,Calendrier!$A$15:$A$59,0)+14,ROW()-17,3,1,\"Calendrier\"),1)","v":"Sa"},null,null,null,null,{"$f":"IF(AND(C32<>0,D32<>0,E32<>0,F32<>0),F32-E32+D32-C32-M32-IF(E32-D32<Calendrier!$AT$10,Calendrier!$AT$10,0),IF(AND(C32<>0,D32<>0,E32=0,F32=0),D32-C32-M32,IF(AND(C32=0,D32=0,E32<>0,F32<>0),F32-E32-M32,IF(AND(C32>20,D32=0,E32=0,F32<>0),24-C32+F32-M32,IF(AND(C32<>0,D32=0,E32=0,F32<>0),F32-C32-M32,0)))))","v":0},{"$f":"IF(G32=0,0,IF(K32=0.5,0,G32-Calendrier!$AT$9))","v":0},4.5,"Sa",0,null,0]
["2023-10-15",{"$f":"INDIRECT(ADDRESS(MATCH($B$1,Calendrier!$A$15:$A$59,0)+14,ROW()-17,3,1,\"Calendrier\"),1)","v":"Di"},null,null,null,null,{"$f":"IF(AND(C33<>0,D33<>0,E33<>0,F33<>0),F33-E33+D33-C33-M33-IF(E33-D33<Calendrier!$AT$10,Calendrier!$AT$10,0),IF(AND(C33<>0,D33<>0,E33=0,F33=0),D33-C33-M33,IF(AND(C33=0,D33=0,E33<>0,F33<>0),F33-E33-M33,IF(AND(C33>20,D33=0,E33=0,F33<>0),24-C33+F33-M33,IF(AND(C33<>0,D33=0,E33=0,F33<>0),F33-C33-M33,0)))))","v":0},{"$f":"IF(G33=0,0,IF(K33=0.5,0,G33-Calendrier!$AT$9))","v":0},4.5,"Di",0,null,0]
["2023-10-16",{"$f":"INDIRECT(ADDRESS(MATCH($B$1,Calendrier!$A$15:$A$59,0)+14,ROW()-17,3,1,\"Calendrier\"),1)","v":"T"},null,null,null,null,{"$f":"IF(AND(C34<>0,D34<>0,E34<>0,F34<>0),F34-E34+D34-C34-M34-IF(E34-D34<Calendrier!$AT$10,Calendrier!$AT$10,0),IF(AND(C34<>0,D34<>0,E34=0,F34=0),D34-C34-M34,IF(AND(C34=0,D34=0,E34<>0,F34<>0),F34-E34-M34,IF(AND(C34>20,D34=0,E34=0,F34<>0),24-C34+F34-M34,IF(AND(C34<>0,D34=0,E34=0,F34<>0),F34-C34-M34,0)))))","v":0},{"$f":"IF(G34=0,0,IF(K34=0.5,0,G34-Calendrier!$AT$9))","v":0},4.5,{"$f":"IF(AND(COUNTA(C34:F34)=0,OR(B34=\"F\",WEEKDAY(A34,2)>5,B34=\"T\",B34=\"RTT\",B34=\"CA\")),B34,IF(AND(COUNTA(C34:F34)>=2,OR(B34=\"F\",B34=\"RTT\",B34=\"CA\",B34=\"Sa\",B34=\"Di\")),\"calendrier\",IF(AND(COUNTA(C34)+COUNTA(F34)=2,OR(COUNTA(C34:D34)<1,COUNTA(E34:F34)<1)),\"erreur\",IF(COUNTA(C34:F34)=3,\"en cours\",IF(COUNTA(C34:F34)=4,B34,IF(OR(AND(C34<>0,D34<>0),AND(E34<>0,F34<>0)),$F$12,IF(AND(C34<>0,D34=0,E34=0,F34<>0,WEEKDAY(A34,2)>5),\"calendrier\",IF(AND(C34<>0,D34=0,E34=0,F34<>0),$B34,\"\"))))))))","v":"T"},0,null,0]
["2023-10-17",{"$f":"INDIRECT(ADDRESS(MATCH($B$1,Calendrier!$A$15:$A$59,0)+14,ROW()-17,3,1,\"Calendrier\"),1)","v":"T"},null,null,null,null,{"$f":"IF(AND(C35<>0,D35<>0,E35<>0,F35<>0),F35-E35+D35-C35-M35-IF(E35-D35<Calendrier!$AT$10,Calendrier!$AT$10,0),IF(AND(C35<>0,D35<>0,E35=0,F35=0),D35-C35-M35,IF(AND(C35=0,D35=0,E35<>0,F35<>0),F35-E35-M35,IF(AND(C35>20,D35=0,E35=0,F35<>0),24-C35+F35-M35,IF(AND(C35<>0,D35=0,E35=0,F35<>0),F35-C35-M35,0)))))","v":0},{"$f":"IF(G35=0,0,IF(K35=0.5,0,G35-Calendrier!$AT$9))","v":0},4.5,"T",0,null,0]
["2023-10-18",{"$f":"INDIRECT(ADDRESS(MATCH($B$1,Calendrier!$A$15:$A$59,0)+14,ROW()-17,3,1,\"Calendrier\"),1)","v":"RTT"},null,null,null,null,{"$f":"IF(AND(C36<>0,D36<>0,E36<>0,F36<>0),F36-E36+D36-C36-M36-IF(E36-D36<Calendrier!$AT$10,Calendrier!$AT$10,0),IF(AND(C36<>0,D36<>0,E36=0,F36=0),D36-C36-M36,IF(AND(C36=0,D36=0,E36<>0,F36<>0),F36-E36-M36,IF(AND(C36>20,D36=0,E36=0,F36<>0),24-C36+F36-M36,IF(AND(C36<>0,D36=0,E36=0,F36<>0),F36-C36-M36,0)))))","v":0},{"$f":"IF(G36=0,0,IF(K36=0.5,0,G36-Calendrier!$AT$9))","v":0},4.5,"RTT",0,null,0]
["2023-10-19",{"$f":"INDIRECT(ADDRESS(MATCH($B$1,Calendrier!$A$15:$A$59,0)+14,ROW()-17,3,1,\"Calendrier\"),1)","v":"T"},null,null,null,null,{"$f":"IF(AND(C37<>0,D37<>0,E37<>0,F37<>0),F37-E37+D37-C37-M37-IF(E37-D37<Calendrier!$AT$10,Calendrier!$AT$10,0),IF(AND(C37<>0,D37<>0,E37=0,F37=0),D37-C37-M37,IF(AND(C37=0,D37=0,E37<>0,F37<>0),F37-E37-M37,IF(AND(C37>20,D37=0,E37=0,F37<>0),24-C37+F37-M37,IF(AND(C37<>0,D37=0,E37=0,F37<>0),F37-C37-M37,0)))))","v":0},{"$f":"IF(G37=0,0,IF(K37=0.5,0,G37-Calendrier!$AT$9))","v":0},4.5,"T",0,null,0]
["2023-10-20",{"$f":"INDIRECT(ADDRESS(MATCH($B$1,Calendrier!$A$15:$A$59,0)+14,ROW()-17,3,1,\"Calendrier\"),1)","v":"T"},null,null,null,null,{"$f":"IF(AND(C38<>0,D38<>0,E38<>0,F38<>0),F38-E38+D38-C38-M38-IF(E38-D38<Calendrier!$AT$10,Calendrier!$AT$10,0),IF(AND(C38<>0,D38<>0,E38=0,F38=0),D38-C38-M38,IF(AND(C38=0,D38=0,E38<>0,F38<>0),F38-E38-M38,IF(AND(C38>20,D38=0,E38=0,F38<>0),24-C38+F38-M38,IF(AND(C38<>0,D38=0,E38=0,F38<>0),F38-C38-M38,0)))))","v":0},{"$f":"IF(G38=0,0,IF(K38=0.5,0,G38-Calendrier!$AT$9))","v":0},4.5,"T",0,null,0]
["2023-10-21",{"$f":"INDIRECT(ADDRESS(MATCH($B$1,Calendrier!$A$15:$A$59,0)+14,ROW()-17,3,1,\"Calendrier\"),1)","v":"Sa"},null,null,null,null,{"$f":"IF(AND(C39<>0,D39<>0,E39<>0,F39<>0),F39-E39+D39-C39-M39-IF(E39-D39<Calendrier!$AT$10,Calendrier!$AT$10,0),IF(AND(C39<>0,D39<>0,E39=0,F39=0),D39-C39-M39,IF(AND(C39=0,D39=0,E39<>0,F39<>0),F39-E39-M39,IF(AND(C39>20,D39=0,E39=0,F39<>0),24-C39+F39-M39,IF(AND(C39<>0,D39=0,E39=0,F39<>0),F39-C39-M39,0)))))","v":0},{"$f":"IF(G39=0,0,IF(K39=0.5,0,G39-Calendrier!$AT$9))","v":0},4.5,"Sa",0,null,0]
["2023-10-22",{"$f":"INDIRECT(ADDRESS(MATCH($B$1,Calendrier!$A$15:$A$59,0)+14,ROW()-17,3,1,\"Calendrier\"),1)","v":"Di"},null,null,null,null,{"$f":"IF(AND(C40<>0,D40<>0,E40<>0,F40<>0),F40-E40+D40-C40-M40-IF(E40-D40<Calendrier!$AT$10,Calendrier!$AT$10,0),IF(AND(C40<>0,D40<>0,E40=0,F40=0),D40-C40-M40,IF(AND(C40=0,D40=0,E40<>0,F40<>0),F40-E40-M40,IF(AND(C40>20,D40=0,E40=0,F40<>0),24-C40+F40-M40,IF(AND(C40<>0,D40=0,E40=0,F40<>0),F40-C40-M40,0)))))","v":0},{"$f":"IF(G40=0,0,IF(K40=0.5,0,G40-Calendrier!$AT$9))","v":0},4.5,"Di",0,null,0]
["2023-10-23",{"$f":"INDIRECT(ADDRESS(MATCH($B$1,Calendrier!$A$15:$A$59,0)+14,ROW()-17,3,1,\"Calendrier\"),1)","v":"T"},null,null,null,null,{"$f":"IF(AND(C41<>0,D41<>0,E41<>0,F41<>0),F41-E41+D41-C41-M41-IF(E41-D41<Calendrier!$AT$10,Calendrier!$AT$10,0),IF(AND(C41<>0,D41<>0,E41=0,F41=0),D41-C41-M41,IF(AND(C41=0,D41=0,E41<>0,F41<>0),F41-E41-M41,IF(AND(C41>20,D41=0,E41=0,F41<>0),24-C41+F41-M41,IF(AND(C41<>0,D41=0,E41=0,F41<>0),F41-C41-M41,0)))))","v":0},{"$f":"IF(G41=0,0,IF(K41=0.5,0,G41-Calendrier!$AT$9))","v":0},4.5,"T",0,null,0]
["2023-10-24",{"$f":"INDIRECT(ADDRESS(MATCH($B$1,Calendrier!$A$15:$A$59,0)+14,ROW()-17,3,1,\"Calendrier\"),1)","v":"T"},null,null,null,null,{"$f":"IF(AND(C42<>0,D42<>0,E42<>0,F42<>0),F42-E42+D42-C42-M42-IF(E42-D42<Calendrier!$AT$10,Calendrier!$AT$10,0),IF(AND(C42<>0,D42<>0,E42=0,F42=0),D42-C42-M42,IF(AND(C42=0,D42=0,E42<>0,F42<>0),F42-E42-M42,IF(AND(C42>20,D42=0,E42=0,F42<>0),24-C42+F42-M42,IF(AND(C42<>0,D42=0,E42=0,F42<>0),F42-C42-M42,0)))))","v":0},{"$f":"IF(G42=0,0,IF(K42=0.5,0,G42-Calendrier!$AT$9))","v":0},4.5,"T",0,null,0]
["2023-10-25",{"$f":"INDIRECT(ADDRESS(MATCH($B$1,Calendrier!$A$15:$A$59,0)+14,ROW()-17,3,1,\"Calendrier\"),1)","v":"T"},null,null,null,null,{"$f":"IF(AND(C43<>0,D43<>0,E43<>0,F43<>0),F43-E43+D43-C43-M43-IF(E43-D43<Calendrier!$AT$10,Calendrier!$AT$10,0),IF(AND(C43<>0,D43<>0,E43=0,F43=0),D43-C43-M43,IF(AND(C43=0,D43=0,E43<>0,F43<>0),F43-E43-M43,IF(AND(C43>20,D43=0,E43=0,F43<>0),24-C43+F43-M43,IF(AND(C43<>0,D43=0,E43=0,F43<>0),F43-C43-M43,0)))))","v":0},{"$f":"IF(G43=0,0,IF(K43=0.5,0,G43-Calendrier!$AT$9))","v":0},4.5,"T",0,null,0]
["2023-10-26",{"$f":"INDIRECT(ADDRESS(MATCH($B$1,Calendrier!$A$15:$A$59,0)+14,ROW()-17,3,1,\"Calendrier\"),1)","v":"T"},null,null,null,null,{"$f":"IF(AND(C44<>0,D44<>0,E44<>0,F44<>0),F44-E44+D44-C44-M44-IF(E44-D44<Calendrier!$AT$10,Calendrier!$AT$10,0),IF(AND(C44<>0,D44<>0,E44=0,F44=0),D44-C44-M44,IF(AND(C44=0,D44=0,E44<>0,F44<>0),F44-E44-M44,IF(AND(C44>20,D44=0,E44=0,F44<>0),24-C44+F44-M44,IF(AND(C44<>0,D44=0,E44=0,F44<>0),F44-C44-M44,0)))))","v":0},{"$f":"IF(G44=0,0,IF(K44=0.5,0,G44-Calendrier!$AT$9))","v":0},4.5,"T",0,null,0]
["2023-10-27",{"$f":"INDIRECT(ADDRESS(MATCH($B$1,Calendrier!$A$15:$A$59,0)+14,ROW()-17,3,1,\"Calendrier\"),1)","v":"T"},null,null,null,null,{"$f":"IF(AND(C45<>0,D45<>0,E45<>0,F45<>0),F45-E45+D45-C45-M45-IF(E45-D45<Calendrier!$AT$10,Calendrier!$AT$10,0),IF(AND(C45<>0,D45<>0,E45=0,F45=0),D45-C45-M45,IF(AND(C45=0,D45=0,E45<>0,F45<>0),F45-E45-M45,IF(AND(C45>20,D45=0,E45=0,F45<>0),24-C45+F45-M45,IF(AND(C45<>0,D45=0,E45=0,F45<>0),F45-C45-M45,0)))))","v":0},{"$f":"IF(G45=0,0,IF(K45=0.5,0,G45-Calendrier!$AT$9))","v":0},4.5,"T",0,null,0]
["2023-10-28",{"$f":"INDIRECT(ADDRESS(MATCH($B$1,Calendrier!$A$15:$A$59,0)+14,ROW()-17,3,1,\"Calendrier\"),1)","v":"Sa"},null,null,null,null,{"$f":"IF(AND(C46<>0,D46<>0,E46<>0,F46<>0),F46-E46+D46-C46-M46-IF(E46-D46<Calendrier!$AT$10,Calendrier!$AT$10,0),IF(AND(C46<>0,D46<>0,E46=0,F46=0),D46-C46-M46,IF(AND(C46=0,D46=0,E46<>0,F46<>0),F46-E46-M46,IF(AND(C46>20,D46=0,E46=0,F46<>0),24-C46+F46-M46,IF(AND(C46<>0,D46=0,E46=0,F46<>0),F46-C46-M46,0)))))","v":0},{"$f":"IF(G46=0,0,IF(K46=0.5,0,G46-Calendrier!$AT$9))","v":0},4.5,"Sa",0,null,0]
["2023-10-29",{"$f":"INDIRECT(ADDRESS(MATCH($B$1,Calendrier!$A$15:$A$59,0)+14,ROW()-17,3,1,\"Calendrier\"),1)","v":"Di"},null,null,null,null,{"$f":"IF(AND(C47<>0,D47<>0,E47<>0,F47<>0),F47-E47+D47-C47-M47-IF(E47-D47<Calendrier!$AT$10,Calendrier!$AT$10,0),IF(AND(C47<>0,D47<>0,E47=0,F47=0),D47-C47-M47,IF(AND(C47=0,D47=0,E47<>0,F47<>0),F47-E47-M47,IF(AND(C47>20,D47=0,E47=0,F47<>0),24-C47+F47-M47,IF(AND(C47<>0,D47=0,E47=0,F47<>0),F47-C47-M47,0)))))","v":0},{"$f":"IF(G47=0,0,IF(K47=0.5,0,G47-Calendrier!$AT$9))","v":0},4.5,"Di",0,null,0]
["2023-10-30",{"$f":"INDIRECT(ADDRESS(MATCH($B$1,Calendrier!$A$15:$A$59,0)+14,ROW()-17,3,1,\"Calendrier\"),1)","v":"T"},null,null,null,null,{"$f":"IF(AND(C48<>0,D48<>0,E48<>0,F48<>0),F48-E48+D48-C48-M48-IF(E48-D48<Calendrier!$AT$10,Calendrier!$AT$10,0),IF(AND(C48<>0,D48<>0,E48=0,F48=0),D48-C48-M48,IF(AND(C48=0,D48=0,E48<>0,F48<>0),F48-E48-M48,IF(AND(C48>20,D48=0,E48=0,F48<>0),24-C48+F48-M48,IF(AND(C48<>0,D48=0,E48=0,F48<>0),F48-C48-M48,0)))))","v":0},{"$f":"IF(G48=0,0,IF(K48=0.5,0,G48-Calendrier!$AT$9))","v":0},4.5,"T",0,null,0]
["2023-10-31",{"$f":"INDIRECT(ADDRESS(MATCH($B$1,Calendrier!$A$15:$A$59,0)+14,ROW()-17,3,1,\"Calendrier\"),1)","v":"T"},null,null,null,null,{"$f":"IF(AND(C49<>0,D49<>0,E49<>0,F49<>0),F49-E49+D49-C49-M49-IF(E49-D49<Calendrier!$AT$10,Calendrier!$AT$10,0),IF(AND(C49<>0,D49<>0,E49=0,F49=0),D49-C49-M49,IF(AND(C49=0,D49=0,E49<>0,F49<>0),F49-E49-M49,IF(AND(C49>20,D49=0,E49=0,F49<>0),24-C49+F49-M49,IF(AND(C49<>0,D49=0,E49=0,F49<>0),F49-C49-M49,0)))))","v":0},{"$f":"IF(G49=0,0,IF(K49=0.5,0,G49-Calendrier!$AT$9))","v":0},4.5,"T",0,null,0]
[null,null,null,null,null,null,{"$f":"SUM(G19:G49)","v":0},null,{"$f":"I49","v":4.5}]

{"sheet":"NOV","index":13,"n_rows":50,"n_cols":15,"rows_kept":50,"cut":false,"hidden":false,"merged":[]}
[null,{"$f":"RIGHT(CELL(\"nomfichier\",$A$1),3)","v":"NOV"},"FICHE DE SUIVI HORAIRE"]
[]
[null,"mois :","NOVEMBRE",null,null,"année ",{"$f":"VLOOKUP(C3,Fériés!$I$1:$J$12,2,FALSE)","v":2023},null,null,"service",{"$f":"Calendrier!F4","v":"Administratif"}]
[]
[null,"nom :",{"$f":"Calendrier!F2","v":"Isq"},null,null," prénom ",{"$f":"Calendrier!F3","v":"Philippe"},null,null,"N° Ident",{"$f":"Calendrier!F1","v":"T506489"}]
[null,null,null,null,null,null,null,"à réaliser","cumul","en cours","reste",null,"N.cumul"]
[null,null,null,"Nb J",{"$f":"Calendrier!$AT$11","v":218},{"$f":"+$H$10","v":0},{"$f":"E7-F7","v":218},{"$f":"Calendrier!N1","v":365},{"$f":"OCT!M7","v":266.5},{"$f":"SUM(J8:J15)","v":30},{"$f":"H7-(I7+J7)","v":68.5},null,{"$f":"SUM(M8:M15)","v":296.5}]
[null,null,null,null,null,"1/2CA","CA",{"$f":"Calendrier!N5","v":25},{"$f":"OCT!M8","v":19},{"$f":"COUNTIF($J$19:$J$49,G8)+COUNTIF($J$19:$J$49,F8)/2","v":0},{"$f":"+H8-(I8+J8)","v":6},"J",{"$f":"+I8+J8","v":19}]
[null,null,null,null,null,"1/2RTT","RTT",{"$f":"Calendrier!N8","v":9},{"$f":"OCT!M9","v":5},{"$f":"COUNTIF($J$19:$J$49,G9)+COUNTIF($J$19:$J$49,F9)/2","v":1},{"$f":"+H9-(I9+J9)","v":3},"J",6]
[null,null,null,null,null,"1/2CS","CS",{"$f":"Calendrier!N9","v":0},{"$f":"OCT!M10","v":0},0,{"$f":"H10-(I10+J10)","v":0},"J",0]
[null,null,null,null,null,"1/2CP","CP",{"$f":"Calendrier!N6","v":0},{"$f":"OCT!M11","v":0},0,{"$f":"H11-(I11+J11)","v":0},"J",0]
[null,null,null,null,null,"1/2T","T",{"$f":"Calendrier!N7","v":218},{"$f":"OCT!M12","v":162.5},20,{"$f":"+H12-(I12+J12)","v":35.5},"J",182.5]
[null,null,null,null,null,0,"Sa",{"$f":"Calendrier!N4","v":51},{"$f":"OCT!M13","v":37},{"$f":"COUNTIF($J$19:$J$49,G13)","v":3},{"$f":"+H13-(I13+J13)","v":11},"J",40]
[null,null,null,null,null,0,"Di",{"$f":"Calendrier!N3","v":50},{"$f":"OCT!M14","v":38},{"$f":"COUNTIF($J$19:$J$49,G14)","v":4},{"$f":"+H14-(I14+J14)","v":8},"J",42]
[null,null,null,null,null,0,"F",{"$f":"Calendrier!N2","v":12},{"$f":"OCT!M15","v":5},{"$f":"COUNTIF($J$19:$J$49,G15)","v":2},{"$f":"+H15-(I15+J15)","v":5},"J",7]
[null,null,null,null,null,null,"heure/avance fin mois",null,{"$f":"OCT!I50","v":4.5},null,null,null,{"$f":"I50","v":4.5},"avec bon"]
[null,"Prévu","Entrée","Sortie","Entrée","Sortie","total","variation","cumul","Type","nb J/T",null,"divers E/S","Sortie","Retour"]
[null,null,null,null,null,null,null,null,{"$f":"OCT!$I$50","v":4.5}]
[{"$f":"VALUE(\"01/11/\"&G3)","v":"2023-11-01"},{"$f":"INDIRECT(ADDRESS(MATCH($B$1,Calendrier!$A$15:$A$59,0)+14,ROW()-17,3,1,\"Calendrier\"),1)","v":"F"},null,null,null,null,{"$f":"IF(AND(C19<>0,D19<>0,E19<>0,F19<>0),F19-E19+D19-C19-K19-IF(E19-D19<Calendrier!$AT$10,Calendrier!$AT$10,0),IF(AND(C19<>0,D19<>0,E19=0,F19=0),D19-C19-K19,IF(AND(C19=0,D19=0,E19<>0,F19<>0),F19-E19-K19,IF(AND(C19>20,D19=0,E19=0,F19<>0),24-C19+F19-K19,IF(AND(C19<>0,D19=0,E19=0,F19<>0),F19-C19-K19,0)))))","v":0},{"$f":"IF(G19=0,0,IF(K19=0.5,0,G19-Calendrier!$AT$9))","v":0},{"$f":"I18+H19","v":4.5},{"$f":"IF(AND(COUNTA(C19:F19)=0,OR(B19=\"F\",WEEKDAY(A19,2)>5,B19=\"T\",B19=\"RTT\",B19=\"CA\")),B19,IF(AND(COUNTA(C19:F19)>=2,OR(B19=\"F\",B19=\"RTT\",B19=\"CA\",B19=\"Sa\",B19=\"Di\")),\"calendrier\",IF(AND(COUNTA(C19)+COUNTA(F19)=2,OR(COUNTA(C19:D19)<1,COUNTA(E19:F19)<1)),\"erreur\",IF(COUNTA(C19:F19)=3,\"en cours\",IF(COUNTA(C19:F19)=4,B19,IF(OR(AND(C19<>0,D19<>0),AND(E19<>0,F19<>0)),$F$12,IF(AND(C19<>0,D19=0,E19=0,F19<>0,WEEKDAY(A19,2)>5),\"calendrier\",IF(AND(C19<>0,D19=0,E19=0,F19<>0),$B19,\"\"))))))))","v":"F"},{"$f":"IF(COUNTA(C19:F19)=4,1,IF(OR(AND(C19<>0,D19<>0),AND(E19<>0,F19<>0)),0.5,IF(AND(C19<>0,F19<>0,D19=0,E19=0,B19=\"T\"),1,0)))","v":0},null,{"$f":"IF(OR(N19=0,O19=0),0,O19-N19)","v":0}]
[{"$f":"A19+1","v":"2023-11-02"},{"$f":"INDIRECT(ADDRESS(MATCH($B$1,Calendrier!$A$15:$A$59,0)+14,ROW()-17,3,1,\"Calendrier\"),1)","v":"T"},null,null,null,null,{"$f":"IF(AND(C20<>0,D20<>0,E20<>0,F20<>0),F20-E20+D20-C20-K20-IF(E20-D20<Calendrier!$AT$10,Calendrier!$AT$10,0),IF(AND(C20<>0,D20<>0,E20=0,F20=0),D20-C20-K20,IF(AND(C20=0,D20=0,E20<>0,F20<>0),F20-E20-K20,IF(AND(C20>20,D20=0,E20=0,F20<>0),24-C20+F20-K20,IF(AND(C20<>0,D20=0,E20=0,F20<>0),F20-C20-K20,0)))))","v":0},{"$f":"IF(G20=0,0,IF(K20=0.5,0,G20-Calendrier!$AT$9))","v":0},4.5,"T",0,null,0]
[{"$f":"A20+1","v":"2023-11-03"},{"$f":"INDIRECT(ADDRESS(MATCH($B$1,Calendrier!$A$15:$A$59,0)+14,ROW()-17,3,1,\"Calendrier\"),1)","v":"T"},null,null,null,null,{"$f":"IF(AND(C21<>0,D21<>0,E21<>0,F21<>0),F21-E21+D21-C21-M21-IF(E21-D21<Calendrier!$AT$10,Calendrier!$AT$10,0),IF(AND(C21<>0,D21<>0,E21=0,F21=0),D21-C21-M21,IF(AND(C21=0,D21=0,E21<>0,F21<>0),F21-E21-M21,IF(AND(C21>20,D21=0,E21=0,F21<>0),24-C21+F21-M21,IF(AND(C21<>0,D21=0,E21=0,F21<>0),F21-C21-M21,0)))))","v":0},{"$f":"IF(G21=0,0,IF(K21=0.5,0,G21-Calendrier!$AT$9))","v":0},{"$f":"I20+H21","v":4.5},"T",0,null,0]
["2023-11-04",{"$f":"INDIRECT(ADDRESS(MATCH($B$1,Calendrier!$A$15:$A$59,0)+14,ROW()-17,3,1,\"Calendrier\"),1)","v":"Sa"},null,null,null,null,{"$f":"IF(AND(C22<>0,D22<>0,E22<>0,F22<>0),F22-E22+D22-C22-M22-IF(E22-D22<Calendrier!$AT$10,Calendrier!$AT$10,0),IF(AND(C22<>0,D22<>0,E22=0,F22=0),D22-C22-M22,IF(AND(C22=0,D22=0,E22<>0,F22<>0),F22-E22-M22,IF(AND(C22>20,D22=0,E22=0,F22<>0),24-C22+F22-M22,IF(AND(C22<>0,D22=0,E22=0,F22<>0),F22-C22-M22,0)))))","v":0},{"$f":"IF(G22=0,0,IF(K22=0.5,0,G22-Calendrier!$AT$9))","v":0},4.5,"Sa",0,null,0]
["2023-11-05",{"$f":"INDIRECT(ADDRESS(MATCH($B$1,Calendrier!$A$15:$A$59,0)+14,ROW()-17,3,1,\"Calendrier\"),1)","v":"Di"},null,null,null,null,{"$f":"IF(AND(C23<>0,D23<>0,E23<>0,F23<>0),F23-E23+D23-C23-M23-IF(E23-D23<Calendrier!$AT$10,Calendrier!$AT$10,0),IF(AND(C23<>0,D23<>0,E23=0,F23=0),D23-C23-M23,IF(AND(C23=0,D23=0,E23<>0,F23<>0),F23-E23-M23,IF(AND(C23>20,D23=0,E23=0,F23<>0),24-C23+F23-M23,IF(AND(C23<>0,D23=0,E23=0,F23<>0),F23-C23-M23,0)))))","v":0},{"$f":"IF(G23=0,0,IF(K23=0.5,0,G23-Calendrier!$AT$9))","v":0},4.5,"Di",0,null,0]
["2023-11-06",{"$f":"INDIRECT(ADDRESS(MATCH($B$1,Calendrier!$A$15:$A$59,0)+14,ROW()-17,3,1,\"Calendrier\"),1)","v":"T"},null,null,null,null,{"$f":"IF(AND(C24<>0,D24<>0,E24<>0,F24<>0),F24-E24+D24-C24-M24-IF(E24-D24<Calendrier!$AT$10,Calendrier!$AT$10,0),IF(AND(C24<>0,D24<>0,E24=0,F24=0),D24-C24-M24,IF(AND(C24=0,D24=0,E24<>0,F24<>0),F24-E24-M24,IF(AND(C24>20,D24=0,E24=0,F24<>0),24-C24+F24-M24,IF(AND(C24<>0,D24=0,E24=0,F24<>0),F24-C24-M24,0)))))","v":0},{"$f":"IF(G24=0,0,IF(K24=0.5,0,G24-Calendrier!$AT$9))","v":0},4.5,"T",0,null,{"$f":"IF(OR(N24=0,O24=0),0,O24-N24)","v":0}]
["2023-11-07",{"$f":"INDIRECT(ADDRESS(MATCH($B$1,Calendrier!$A$15:$A$59,0)+14,ROW()-17,3,1,\"Calendrier\"),1)","v":"T"},null,null,null,null,{"$f":"IF(AND(C25<>0,D25<>0,E25<>0,F25<>0),F25-E25+D25-C25-M25-IF(E25-D25<Calendrier!$AT$10,Calendrier!$AT$10,0),IF(AND(C25<>0,D25<>0,E25=0,F25=0),D25-C25-M25,IF(AND(C25=0,D25=0,E25<>0,F25<>0),F25-E25-M25,IF(AND(C25>20,D25=0,E25=0,F25<>0),24-C25+F25-M25,IF(AND(C25<>0,D25=0,E25=0,F25<>0),F25-C25-M25,0)))))","v":0},{"$f":"IF(G25=0,0,IF(K25=0.5,0,G25-Calendrier!$AT$9))","v":0},4.5,"T",0,null,{"$f":"IF(OR(N25=0,O25=0),0,O25-N25)","v":0}]
["2023-11-08",{"$f":"INDIRECT(ADDRESS(MATCH($B$1,Calendrier!$A$15:$A$59,0)+14,ROW()-17,3,1,\"Calendrier\"),1)","v":"T"},null,null,null,null,{"$f":"IF(AND(C26<>0,D26<>0,E26<>0,F26<>0),F26-E26+D26-C26-M26-IF(E26-D26<Calendrier!$AT$10,Calendrier!$AT$10,0),IF(AND(C26<>0,D26<>0,E26=0,F26=0),D26-C26-M26,IF(AND(C26=0,D26=0,E26<>0,F26<>0),F26-E26-M26,IF(AND(C26>20,D26=0,E26=0,F26<>0),24-C26+F26-M26,IF(AND(C26<>0,D26=0,E26=0,F26<>0),F26-C26-M26,0)))))","v":0},{"$f":"IF(G26=0,0,IF(K26=0.5,0,G26-Calendrier!$AT$9))","v":0},4.5,"T",0,null,0]
["2023-11-09",{"$f":"INDIRECT(ADDRESS(MATCH($B$1,Calendrier!$A$15:$A$59,0)+14,ROW()-17,3,1,\"Calendrier\"),1)","v":"T"},null,null,null,null,{"$f":"IF(AND(C27<>0,D27<>0,E27<>0,F27<>0),F27-E27+D27-C27-M27-IF(E27-D27<Calendrier!$AT$10,Calendrier!$AT$10,0),IF(AND(C27<>0,D27<>0,E27=0,F27=0),D27-C27-M27,IF(AND(C27=0,D27=0,E27<>0,F27<>0),F27-E27-M27,IF(AND(C27>20,D27=0,E27=0,F27<>0),24-C27+F27-M27,IF(AND(C27<>0,D27=0,E27=0,F27<>0),F27-C27-M27,0)))))","v":0},{"$f":"IF(G27=0,0,IF(K27=0.5,0,G27-Calendrier!$AT$9))","v":0},4.5,"T",0,null,0]
["2023-11-10",{"$f":"INDIRECT(ADDRESS(MATCH($B$1,Calendrier!$A$15:$A$59,0)+14,ROW()-17,3,1,\"Calendrier\"),1)","v":"T"},null,null,null,null,{"$f":"IF(AND(C28<>0,D28<>0,E28<>0,F28<>0),F28-E28+D28-C28-M28-IF(E28-D28<Calendrier!$AT$10,Calendrier!$AT$10,0),IF(AND(C28<>0,D28<>0,E28=0,F28=0),D28-C28-M28,IF(AND(C28=0,D28=0,E28<>0,F28<>0),F28-E28-M28,IF(AND(C28>20,D28=0,E28=0,F28<>0),24-C28+F28-M28,IF(AND(C28<>0,D28=0,E28=0,F28<>0),F28-C28-M28,0)))))","v":0},{"$f":"IF(G28=0,0,IF(K28=0.5,0,G28-Calendrier!$AT$9))","v":0},4.5,"T",0,null,0]
["2023-11-11",{"$f":"INDIRECT(ADDRESS(MATCH($B$1,Calendrier!$A$15:$A$59,0)+14,ROW()-17,3,1,\"Calendrier\"),1)","v":"F"},null,null,null,null,{"$f":"IF(AND(C29<>0,D29<>0,E29<>0,F29<>0),F29-E29+D29-C29-M29-IF(E29-D29<Calendrier!$AT$10,Calendrier!$AT$10,0),IF(AND(C29<>0,D29<>0,E29=0,F29=0),D29-C29-M29,IF(AND(C29=0,D29=0,E29<>0,F29<>0),F29-E29-M29,IF(AND(C29>20,D29=0,E29=0,F29<>0),24-C29+F29-M29,IF(AND(C29<>0,D29=0,E29=0,F29<>0),F29-C29-M29,0)))))","v":0},{"$f":"IF(G29=0,0,IF(K29=0.5,0,G29-Calendrier!$AT$9))","v":0},4.5,"F",0,null,0]
["2023-11-12",{"$f":"INDIRECT(ADDRESS(MATCH($B$1,Calendrier!$A$15:$A$59,0)+14,ROW()-17,3,1,\"Calendrier\"),1)","v":"Di"},null,null,null,null,{"$f":"IF(AND(C30<>0,D30<>0,E30<>0,F30<>0),F30-E30+D30-C30-M30-IF(E30-D30<Calendrier!$AT$10,Calendrier!$AT$10,0),IF(AND(C30<>0,D30<>0,E30=0,F30=0),D30-C30-M30,IF(AND(C30=0,D30=0,E30<>0,F30<>0),F30-E30-M30,IF(AND(C30>20,D30=0,E30=0,F30<>0),24-C30+F30-M30,IF(AND(C30<>0,D30=0,E30=0,F30<>0),F30-C30-M30,0)))))","v":0},{"$f":"IF(G30=0,0,IF(K30=0.5,0,G30-Calendrier!$AT$9))","v":0},4.5,"Di",0,null,0]
["2023-11-13",{"$f":"INDIRECT(ADDRESS(MATCH($B$1,Calendrier!$A$15:$A$59,0)+14,ROW()-17,3,1,\"Calendrier\"),1)","v":"T"},null,null,null,null,{"$f":"IF(AND(C31<>0,D31<>0,E31<>0,F31<>0),F31-E31+D31-C31-M31-IF(E31-D31<Calendrier!$AT$10,Calendrier!$AT$10,0),IF(AND(C31<>0,D31<>0,E31=0,F31=0),D31-C31-M31,IF(AND(C31=0,D31=0,E31<>0,F31<>0),F31-E31-M31,IF(AND(C31>20,D31=0,E31=0,F31<>0),24-C31+F31-M31,IF(AND(C31<>0,D31=0,E31=0,F31<>0),F31-C31-M31,0)))))","v":0},{"$f":"IF(G31=0,0,IF(K31=0.5,0,G31-Calendrier!$AT$9))","v":0},4.5,"T",0,null,0]
["2023-11-14",{"$f":"INDIRECT(ADDRESS(MATCH($B$1,Calendrier!$A$15:$A$59,0)+14,ROW()-17,3,1,\"Calendrier\"),1)","v":"T"},null,null,null,null,{"$f":"IF(AND(C32<>0,D32<>0,E32<>0,F32<>0),F32-E32+D32-C32-M32-IF(E32-D32<Calendrier!$AT$10,Calendrier!$AT$10,0),IF(AND(C32<>0,D32<>0,E32=0,F32=0),D32-C32-M32,IF(AND(C32=0,D32=0,E32<>0,F32<>0),F32-E32-M32,IF(AND(C32>20,D32=0,E32=0,F32<>0),24-C32+F32-M32,IF(AND(C32<>0,D32=0,E32=0,F32<>0),F32-C32-M32,0)))))","v":0},{"$f":"IF(G32=0,0,IF(K32=0.5,0,G32-Calendrier!$AT$9))","v":0},4.5,"T",0,null,0]
["2023-11-15",{"$f":"INDIRECT(ADDRESS(MATCH($B$1,Calendrier!$A$15:$A$59,0)+14,ROW()-17,3,1,\"Calendrier\"),1)","v":"T"},null,null,null,null,{"$f":"IF(AND(C33<>0,D33<>0,E33<>0,F33<>0),F33-E33+D33-C33-M33-IF(E33-D33<Calendrier!$AT$10,Calendrier!$AT$10,0),IF(AND(C33<>0,D33<>0,E33=0,F33=0),D33-C33-M33,IF(AND(C33=0,D33=0,E33<>0,F33<>0),F33-E33-M33,IF(AND(C33>20,D33=0,E33=0,F33<>0),24-C33+F33-M33,IF(AND(C33<>0,D33=0,E33=0,F33<>0),F33-C33-M33,0)))))","v":0},{"$f":"IF(G33=0,0,IF(K33=0.5,0,G33-Calendrier!$AT$9))","v":0},4.5,"T",0,null,0]
["2023-11-16",{"$f":"INDIRECT(ADDRESS(MATCH($B$1,Calendrier!$A$15:$A$59,0)+14,ROW()-17,3,1,\"Calendrier\"),1)","v":"T"},null,null,null,null,{"$f":"IF(AND(C34<>0,D34<>0,E34<>0,F34<>0),F34-E34+D34-C34-M34-IF(E34-D34<Calendrier!$AT$10,Calendrier!$AT$10,0),IF(AND(C34<>0,D34<>0,E34=0,F34=0),D34-C34-M34,IF(AND(C34=0,D34=0,E34<>0,F34<>0),F34-E34-M34,IF(AND(C34>20,D34=0,E34=0,F34<>0),24-C34+F34-M34,IF(AND(C34<>0,D34=0,E34=0,F34<>0),F34-C34-M34,0)))))","v":0},{"$f":"IF(G34=0,0,IF(K34=0.5,0,G34-Calendrier!$AT$9))","v":0},4.5,{"$f":"IF(AND(COUNTA(C34:F34)=0,OR(B34=\"F\",WEEKDAY(A34,2)>5,B34=\"T\",B34=\"RTT\",B34=\"CA\")),B34,IF(AND(COUNTA(C34:F34)>=2,OR(B34=\"F\",B34=\"RTT\",B34=\"CA\",B34=\"Sa\",B34=\"Di\")),\"calendrier\",IF(AND(COUNTA(C34)+COUNTA(F34)=2,OR(COUNTA(C34:D34)<1,COUNTA(E34:F34)<1)),\"erreur\",IF(COUNTA(C34:F34)=3,\"en cours\",IF(COUNTA(C34:F34)=4,B34,IF(OR(AND(C34<>0,D34<>0),AND(E34<>0,F34<>0)),$F$12,IF(AND(C34<>0,D34=0,E34=0,F34<>0,WEEKDAY(A34,2)>5),\"calendrier\",IF(AND(C34<>0,D34=0,E34=0,F34<>0),$B34,\"\"))))))))","v":"T"},0,null,0]
["2023-11-17",{"$f":"INDIRECT(ADDRESS(MATCH($B$1,Calendrier!$A$15:$A$59,0)+14,ROW()-17,3,1,\"Calendrier\"),1)","v":"T"},null,null,null,null,{"$f":"IF(AND(C35<>0,D35<>0,E35<>0,F35<>0),F35-E35+D35-C35-M35-IF(E35-D35<Calendrier!$AT$10,Calendrier!$AT$10,0),IF(AND(C35<>0,D35<>0,E35=0,F35=0),D35-C35-M35,IF(AND(C35=0,D35=0,E35<>0,F35<>0),F35-E35-M35,IF(AND(C35>20,D35=0,E35=0,F35<>0),24-C35+F35-M35,IF(AND(C35<>0,D35=0,E35=0,F35<>0),F35-C35-M35,0)))))","v":0},{"$f":"IF(G35=0,0,IF(K35=0.5,0,G35-Calendrier!$AT$9))","v":0},4.5,"T",0,null,0]
["2023-11-18",{"$f":"INDIRECT(ADDRESS(MATCH($B$1,Calendrier!$A$15:$A$59,0)+14,ROW()-17,3,1,\"Calendrier\"),1)","v":"Sa"},null,null,null,null,{"$f":"IF(AND(C36<>0,D36<>0,E36<>0,F36<>0),F36-E36+D36-C36-M36-IF(E36-D36<Calendrier!$AT$10,Calendrier!$AT$10,0),IF(AND(C36<>0,D36<>0,E36=0,F36=0),D36-C36-M36,IF(AND(C36=0,D36=0,E36<>0,F36<>0),F36-E36-M36,IF(AND(C36>20,D36=0,E36=0,F36<>0),24-C36+F36-M36,IF(AND(C36<>0,D36=0,E36=0,F36<>0),F36-C36-M36,0)))))","v":0},{"$f":"IF(G36=0,0,IF(K36=0.5,0,G36-Calendrier!$AT$9))","v":0},4.5,"Sa",0,null,0]
["2023-11-19",{"$f":"INDIRECT(ADDRESS(MATCH($B$1,Calendrier!$A$15:$A$59,0)+14,ROW()-17,3,1,\"Calendrier\"),1)","v":"Di"},null,null,null,null,{"$f":"IF(AND(C37<>0,D37<>0,E37<>0,F37<>0),F37-E37+D37-C37-M37-IF(E37-D37<Calendrier!$AT$10,Calendrier!$AT$10,0),IF(AND(C37<>0,D37<>0,E37=0,F37=0),D37-C37-M37,IF(AND(C37=0,D37=0,E37<>0,F37<>0),F37-E37-M37,IF(AND(C37>20,D37=0,E37=0,F37<>0),24-C37+F37-M37,IF(AND(C37<>0,D37=0,E37=0,F37<>0),F37-C37-M37,0)))))","v":0},{"$f":"IF(G37=0,0,IF(K37=0.5,0,G37-Calendrier!$AT$9))","v":0},4.5,"Di",0,null,0]
["2023-11-20",{"$f":"INDIRECT(ADDRESS(MATCH($B$1,Calendrier!$A$15:$A$59,0)+14,ROW()-17,3,1,\"Calendrier\"),1)","v":"T"},null,null,null,null,{"$f":"IF(AND(C38<>0,D38<>0,E38<>0,F38<>0),F38-E38+D38-C38-M38-IF(E38-D38<Calendrier!$AT$10,Calendrier!$AT$10,0),IF(AND(C38<>0,D38<>0,E38=0,F38=0),D38-C38-M38,IF(AND(C38=0,D38=0,E38<>0,F38<>0),F38-E38-M38,IF(AND(C38>20,D38=0,E38=0,F38<>0),24-C38+F38-M38,IF(AND(C38<>0,D38=0,E38=0,F38<>0),F38-C38-M38,0)))))","v":0},{"$f":"IF(G38=0,0,IF(K38=0.5,0,G38-Calendrier!$AT$9))","v":0},4.5,"T",0,null,0]
["2023-11-21",{"$f":"INDIRECT(ADDRESS(MATCH($B$1,Calendrier!$A$15:$A$59,0)+14,ROW()-17,3,1,\"Calendrier\"),1)","v":"T"},null,null,null,null,{"$f":"IF(AND(C39<>0,D39<>0,E39<>0,F39<>0),F39-E39+D39-C39-M39-IF(E39-D39<Calendrier!$AT$10,Calendrier!$AT$10,0),IF(AND(C39<>0,D39<>0,E39=0,F39=0),D39-C39-M39,IF(AND(C39=0,D39=0,E39<>0,F39<>0),F39-E39-M39,IF(AND(C39>20,D39=0,E39=0,F39<>0),24-C39+F39-M39,IF(AND(C39<>0,D39=0,E39=0,F39<>0),F39-C39-M39,0)))))","v":0},{"$f":"IF(G39=0,0,IF(K39=0.5,0,G39-Calendrier!$AT$9))","v":0},4.5,"T",0,null,0]
["2023-11-22",{"$f":"INDIRECT(ADDRESS(MATCH($B$1,Calendrier!$A$15:$A$59,0)+14,ROW()-17,3,1,\"Calendrier\"),1)","v":"RTT"},null,null,null,null,{"$f":"IF(AND(C40<>0,D40<>0,E40<>0,F40<>0),F40-E40+D40-C40-M40-IF(E40-D40<Calendrier!$AT$10,Calendrier!$AT$10,0),IF(AND(C40<>0,D40<>0,E40=0,F40=0),D40-C40-M40,IF(AND(C40=0,D40=0,E40<>0,F40<>0),F40-E40-M40,IF(AND(C40>20,D40=0,E40=0,F40<>0),24-C40+F40-M40,IF(AND(C40<>0,D40=0,E40=0,F40<>0),F40-C40-M40,0)))))","v":0},{"$f":"IF(G40=0,0,IF(K40=0.5,0,G40-Calendrier!$AT$9))","v":0},4.5,"RTT",0,null,0]
["2023-11-23",{"$f":"INDIRECT(ADDRESS(MATCH($B$1,Calendrier!$A$15:$A$59,0)+14,ROW()-17,3,1,\"Calendrier\"),1)","v":"T"},null,null,null,null,{"$f":"IF(AND(C41<>0,D41<>0,E41<>0,F41<>0),F41-E41+D41-C41-M41-IF(E41-D41<Calendrier!$AT$10,Calendrier!$AT$10,0),IF(AND(C41<>0,D41<>0,E41=0,F41=0),D41-C41-M41,IF(AND(C41=0,D41=0,E41<>0,F41<>0),F41-E41-M41,IF(AND(C41>20,D41=0,E41=0,F41<>0),24-C41+F41-M41,IF(AND(C41<>0,D41=0,E41=0,F41<>0),F41-C41-M41,0)))))","v":0},{"$f":"IF(G41=0,0,IF(K41=0.5,0,G41-Calendrier!$AT$9))","v":0},4.5,"T",0,null,0]
["2023-11-24",{"$f":"INDIRECT(ADDRESS(MATCH($B$1,Calendrier!$A$15:$A$59,0)+14,ROW()-17,3,1,\"Calendrier\"),1)","v":"T"},null,null,null,null,{"$f":"IF(AND(C42<>0,D42<>0,E42<>0,F42<>0),F42-E42+D42-C42-M42-IF(E42-D42<Calendrier!$AT$10,Calendrier!$AT$10,0),IF(AND(C42<>0,D42<>0,E42=0,F42=0),D42-C42-M42,IF(AND(C42=0,D42=0,E42<>0,F42<>0),F42-E42-M42,IF(AND(C42>20,D42=0,E42=0,F42<>0),24-C42+F42-M42,IF(AND(C42<>0,D42=0,E42=0,F42<>0),F42-C42-M42,0)))))","v":0},{"$f":"IF(G42=0,0,IF(K42=0.5,0,G42-Calendrier!$AT$9))","v":0},4.5,"T",0,null,0]
["2023-11-25",{"$f":"INDIRECT(ADDRESS(MATCH($B$1,Calendrier!$A$15:$A$59,0)+14,ROW()-17,3,1,\"Calendrier\"),1)","v":"Sa"},null,null,null,null,{"$f":"IF(AND(C43<>0,D43<>0,E43<>0,F43<>0),F43-E43+D43-C43-M43-IF(E43-D43<Calendrier!$AT$10,Calendrier!$AT$10,0),IF(AND(C43<>0,D43<>0,E43=0,F43=0),D43-C43-M43,IF(AND(C43=0,D43=0,E43<>0,F43<>0),F43-E43-M43,IF(AND(C43>20,D43=0,E43=0,F43<>0),24-C43+F43-M43,IF(AND(C43<>0,D43=0,E43=0,F43<>0),F43-C43-M43,0)))))","v":0},{"$f":"IF(G43=0,0,IF(K43=0.5,0,G43-Calendrier!$AT$9))","v":0},4.5,"Sa",0,null,0]
["2023-11-26",{"$f":"INDIRECT(ADDRESS(MATCH($B$1,Calendrier!$A$15:$A$59,0)+14,ROW()-17,3,1,\"Calendrier\"),1)","v":"Di"},null,null,null,null,{"$f":"IF(AND(C44<>0,D44<>0,E44<>0,F44<>0),F44-E44+D44-C44-M44-IF(E44-D44<Calendrier!$AT$10,Calendrier!$AT$10,0),IF(AND(C44<>0,D44<>0,E44=0,F44=0),D44-C44-M44,IF(AND(C44=0,D44=0,E44<>0,F44<>0),F44-E44-M44,IF(AND(C44>20,D44=0,E44=0,F44<>0),24-C44+F44-M44,IF(AND(C44<>0,D44=0,E44=0,F44<>0),F44-C44-M44,0)))))","v":0},{"$f":"IF(G44=0,0,IF(K44=0.5,0,G44-Calendrier!$AT$9))","v":0},4.5,"Di",0,null,0]
["2023-11-27",{"$f":"INDIRECT(ADDRESS(MATCH($B$1,Calendrier!$A$15:$A$59,0)+14,ROW()-17,3,1,\"Calendrier\"),1)","v":"T"},null,null,null,null,{"$f":"IF(AND(C45<>0,D45<>0,E45<>0,F45<>0),F45-E45+D45-C45-M45-IF(E45-D45<Calendrier!$AT$10,Calendrier!$AT$10,0),IF(AND(C45<>0,D45<>0,E45=0,F45=0),D45-C45-M45,IF(AND(C45=0,D45=0,E45<>0,F45<>0),F45-E45-M45,IF(AND(C45>20,D45=0,E45=0,F45<>0),24-C45+F45-M45,IF(AND(C45<>0,D45=0,E45=0,F45<>0),F45-C45-M45,0)))))","v":0},{"$f":"IF(G45=0,0,IF(K45=0.5,0,G45-Calendrier!$AT$9))","v":0},4.5,"T",0,null,0]
["2023-11-28",{"$f":"INDIRECT(ADDRESS(MATCH($B$1,Calendrier!$A$15:$A$59,0)+14,ROW()-17,3,1,\"Calendrier\"),1)","v":"T"},null,null,null,null,{"$f":"IF(AND(C46<>0,D46<>0,E46<>0,F46<>0),F46-E46+D46-C46-M46-IF(E46-D46<Calendrier!$AT$10,Calendrier!$AT$10,0),IF(AND(C46<>0,D46<>0,E46=0,F46=0),D46-C46-M46,IF(AND(C46=0,D46=0,E46<>0,F46<>0),F46-E46-M46,IF(AND(C46>20,D46=0,E46=0,F46<>0),24-C46+F46-M46,IF(AND(C46<>0,D46=0,E46=0,F46<>0),F46-C46-M46,0)))))","v":0},{"$f":"IF(G46=0,0,IF(K46=0.5,0,G46-Calendrier!$AT$9))","v":0},4.5,"T",0,null,0]
["2023-11-29",{"$f":"INDIRECT(ADDRESS(MATCH($B$1,Calendrier!$A$15:$A$59,0)+14,ROW()-17,3,1,\"Calendrier\"),1)","v":"T"},null,null,null,null,{"$f":"IF(AND(C47<>0,D47<>0,E47<>0,F47<>0),F47-E47+D47-C47-M47-IF(E47-D47<Calendrier!$AT$10,Calendrier!$AT$10,0),IF(AND(C47<>0,D47<>0,E47=0,F47=0),D47-C47-M47,IF(AND(C47=0,D47=0,E47<>0,F47<>0),F47-E47-M47,IF(AND(C47>20,D47=0,E47=0,F47<>0),24-C47+F47-M47,IF(AND(C47<>0,D47=0,E47=0,F47<>0),F47-C47-M47,0)))))","v":0},{"$f":"IF(G47=0,0,IF(K47=0.5,0,G47-Calendrier!$AT$9))","v":0},4.5,"T",0,null,0]
["2023-11-30",{"$f":"INDIRECT(ADDRESS(MATCH($B$1,Calendrier!$A$15:$A$59,0)+14,ROW()-17,3,1,\"Calendrier\"),1)","v":"T"},null,null,null,null,{"$f":"IF(AND(C48<>0,D48<>0,E48<>0,F48<>0),F48-E48+D48-C48-M48-IF(E48-D48<Calendrier!$AT$10,Calendrier!$AT$10,0),IF(AND(C48<>0,D48<>0,E48=0,F48=0),D48-C48-M48,IF(AND(C48=0,D48=0,E48<>0,F48<>0),F48-E48-M48,IF(AND(C48>20,D48=0,E48=0,F48<>0),24-C48+F48-M48,IF(AND(C48<>0,D48=0,E48=0,F48<>0),F48-C48-M48,0)))))","v":0},{"$f":"IF(G48=0,0,IF(K48=0.5,0,G48-Calendrier!$AT$9))","v":0},4.5,"T",0,null,0]
[{"$f":"IF(MONTH(A48+1)>11,0,A48+1)","v":"00:00:00"},{"$f":"INDIRECT(ADDRESS(MATCH($B$1,Calendrier!$A$15:$A$59,0)+14,ROW()-17,3,1,\"Calendrier\"),1)","v":0},null,null,null,null,{"$f":"IF(AND(C49<>0,D49<>0,E49<>0,F49<>0),F49-E49+D49-C49-M49-IF(E49-D49<Calendrier!$AT$10,Calendrier!$AT$10,0),IF(AND(C49<>0,D49<>0,E49=0,F49=0),D49-C49-M49,IF(AND(C49=0,D49=0,E49<>0,F49<>0),F49-E49-M49,IF(AND(C49>20,D49=0,E49=0,F49<>0),24-C49+F49-M49,IF(AND(C49<>0,D49=0,E49=0,F49<>0),F49-C49-M49,0)))))","v":0},{"$f":"IF(G49=0,0,IF(K49=0.5,0,G49-Calendrier!$AT$9))","v":0},4.5,{"$f":"IF(AND(COUNTA(C49:F49)=0,B49=\"F\"),B49,IF(AND(COUNTA(C49:F49)=0,WEEKDAY(A49,2)>5),B49,IF(AND(COUNTA(C49:F49)=0,B49=\"T\"),\"\",IF(AND(COUNTA(C49:F49)=0,B49=\"RTT\"),B49,IF(AND(COUNTA(D49:F49)=0,C49<>0),\"erreur\",IF(AND(COUNTA(C49:F49)=4,B49=\"RTT\"),\"Erreur RTT\",IF(AND(COUNTA(C49:F49)=4,B49=\"F\"),\"fériés\",IF(COUNTA(C49:F49)=4,B49,IF(COUNTA(C49:F49)=3,\"Erreur\",IF(AND(C49<>0,D49<>0),$F$12,IF(AND(E49<>0,F49<>0),$F$12,IF(AND(C49<>0,D49=0,E49=0,F49<>0,WEEKDAY(A49,2)>5),\"Modif  calendrier\",IF(AND(C49<>0,D49=0,E49=0,F49<>0),$B49)))))))))))))","v":0},0,null,0]
[null,null,null,null,null,null,{"$f":"SUM(G19:G49)","v":0},null,{"$f":"I49","v":4.5}]

{"sheet":"DEC","index":14,"n_rows":50,"n_cols":17,"rows_kept":50,"cut":false,"hidden":false,"merged":[]}
[null,{"$f":"RIGHT(CELL(\"nomfichier\",$A$1),3)","v":"DEC"},"FICHE DE SUIVI HORAIRE"]
[]
[null,"mois :","DECEMBRE",null,null,"année ",{"$f":"VLOOKUP(C3,Fériés!$I$1:$J$12,2,FALSE)","v":2023},null,null,"service",{"$f":"Calendrier!F4","v":"Administratif"}]
[]
[null,"nom :",{"$f":"Calendrier!F2","v":"Isq"},null,null," prénom ",{"$f":"Calendrier!F3","v":"Philippe"},null,null,"N° Ident",{"$f":"Calendrier!F1","v":"T506489"}]
[null,null,null,null,null,null,null,"à réaliser","cumul","en cours","reste",null,"N.cumul"]
[null,null,null,"Nb J",{"$f":"Calendrier!$AT$11","v":218},{"$f":"+$H$10","v":0},{"$f":"E7-F7","v":218},{"$f":"Calendrier!N1","v":365},{"$f":"NOV!M7","v":296.5},{"$f":"SUM(J8:J15)","v":31},{"$f":"H7-(I7+J7)","v":37.5},null,{"$f":"SUM(M8:M15)","v":327.5}]
[null,null,null,null,null,"1/2CA","CA",{"$f":"Calendrier!N5","v":25},{"$f":"NOV!M8","v":19},{"$f":"COUNTIF($J$19:$J$49,G8)+COUNTIF($J$19:$J$49,F8)/2","v":5},{"$f":"+H8-(I8+J8)","v":1},"J",{"$f":"+I8+J8","v":24}]
[null,null,null,null,null,"1/2RTT","RTT",{"$f":"Calendrier!N8","v":9},{"$f":"NOV!M9","v":6},{"$f":"COUNTIF($J$19:$J$49,G9)+COUNTIF($J$19:$J$49,F9)/2","v":1},{"$f":"+H9-(I9+J9)","v":2},"J",7]
[null,null,null,null,null,"1/2CS","CS",{"$f":"Calendrier!N9","v":0},{"$f":"NOV!M10","v":0},0,{"$f":"H10-(I10+J10)","v":0},"J",0]
[null,null,null,null,null,"1/2CP","CP",{"$f":"Calendrier!N6","v":0},{"$f":"NOV!M11","v":0},0,{"$f":"H11-(I11+J11)","v":0},"J",0]
[null,null,null,null,null,"1/2T","T",{"$f":"Calendrier!N7","v":218},{"$f":"NOV!M12","v":182.5},14,{"$f":"+H12-(I12+J12)","v":21.5},"J",196.5]
[null,null,null,null,null,0,"Sa",{"$f":"Calendrier!N4","v":51},{"$f":"NOV!M13","v":40},{"$f":"COUNTIF($J$19:$J$49,G13)","v":5},{"$f":"+H13-(I13+J13)","v":6},"J",45]
[null,null,null,null,null,0,"Di",{"$f":"Calendrier!N3","v":50},{"$f":"NOV!M14","v":42},{"$f":"COUNTIF($J$19:$J$49,G14)","v":5},{"$f":"+H14-(I14+J14)","v":3},"J",47]
[null,null,null,null,null,0,"F",{"$f":"Calendrier!N2","v":12},{"$f":"NOV!M15","v":7},{"$f":"COUNTIF($J$19:$J$49,G15)","v":1},{"$f":"+H15-(I15+J15)","v":4},"J",8]
[null,null,null,null,null,null,"heure/avance fin mois",null,{"$f":"NOV!I50","v":4.5},null,null,null,{"$f":"I50","v":4.5},"avec bon"]
[null,"Prévu","Entrée","Sortie","Entrée","Sortie","total","variation","cumul","Type","nb J/T",null,"divers E/S","Sortie","Retour"]
[null,null,null,null,null,null,null,null,{"$f":"NOV!$I$50","v":4.5}]
[{"$f":"VALUE(\"01/12/\"&G3)","v":"2023-12-01"},{"$f":"INDIRECT(ADDRESS(MATCH($B$1,Calendrier!$A$15:$A$59,0)+14,ROW()-17,3,1,\"Calendrier\"),1)","v":"T"},null,null,null,null,{"$f":"IF(AND(C19<>0,D19<>0,E19<>0,F19<>0),F19-E19+D19-C19-K19-IF(E19-D19<Calendrier!$AT$10,Calendrier!$AT$10,0),IF(AND(C19<>0,D19<>0,E19=0,F19=0),D19-C19-K19,IF(AND(C19=0,D19=0,E19<>0,F19<>0),F19-E19-K19,IF(AND(C19>20,D19=0,E19=0,F19<>0),24-C19+F19-K19,IF(AND(C19<>0,D19=0,E19=0,F19<>0),F19-C19-K19,0)))))","v":0},{"$f":"IF(G19=0,0,IF(K19=0.5,0,G19-Calendrier!$AT$9))","v":0},{"$f":"I18+H19","v":4.5},{"$f":"IF(AND(COUNTA(C19:F19)=0,OR(B19=\"F\",WEEKDAY(A19,2)>5,B19=\"T\",B19=\"RTT\",B19=\"CA\")),B19,IF(AND(COUNTA(C19:F19)>=2,OR(B19=\"F\",B19=\"RTT\",B19=\"CA\",B19=\"Sa\",B19=\"Di\")),\"calendrier\",IF(AND(COUNTA(C19)+COUNTA(F19)=2,OR(COUNTA(C19:D19)<1,COUNTA(E19:F19)<1)),\"erreur\",IF(COUNTA(C19:F19)=3,\"en cours\",IF(COUNTA(C19:F19)=4,B19,IF(OR(AND(C19<>0,D19<>0),AND(E19<>0,F19<>0)),$F$12,IF(AND(C19<>0,D19=0,E19=0,F19<>0,WEEKDAY(A19,2)>5),\"calendrier\",IF(AND(C19<>0,D19=0,E19=0,F19<>0),$B19,\"\"))))))))","v":"T"},{"$f":"IF(COUNTA(C19:F19)=4,1,IF(OR(AND(C19<>0,D19<>0),AND(E19<>0,F19<>0)),0.5,IF(AND(C19<>0,F19<>0,D19=0,E19=0,B19=\"T\"),1,0)))","v":0},null,{"$f":"IF(OR(N19=0,O19=0),0,O19-N19)","v":0}]
[{"$f":"A19+1","v":"2023-12-02"},{"$f":"INDIRECT(ADDRESS(MATCH($B$1,Calendrier!$A$15:$A$59,0)+14,ROW()-17,3,1,\"Calendrier\"),1)","v":"Sa"},null,null,null,null,{"$f":"IF(AND(C20<>0,D20<>0,E20<>0,F20<>0),F20-E20+D20-C20-K20-IF(E20-D20<Calendrier!$AT$10,Calendrier!$AT$10,0),IF(AND(C20<>0,D20<>0,E20=0,F20=0),D20-C20-K20,IF(AND(C20=0,D20=0,E20<>0,F20<>0),F20-E20-K20,IF(AND(C20>20,D20=0,E20=0,F20<>0),24-C20+F20-K20,IF(AND(C20<>0,D20=0,E20=0,F20<>0),F20-C20-K20,0)))))","v":0},{"$f":"IF(G20=0,0,IF(K20=0.5,0,G20-Calendrier!$AT$9))","v":0},4.5,"Sa",0,null,0]
[{"$f":"A20+1","v":"2023-12-03"},{"$f":"INDIRECT(ADDRESS(MATCH($B$1,Calendrier!$A$15:$A$59,0)+14,ROW()-17,3,1,\"Calendrier\"),1)","v":"Di"},null,null,null,null,{"$f":"IF(AND(C21<>0,D21<>0,E21<>0,F21<>0),F21-E21+D21-C21-M21-IF(E21-D21<Calendrier!$AT$10,Calendrier!$AT$10,0),IF(AND(C21<>0,D21<>0,E21=0,F21=0),D21-C21-M21,IF(AND(C21=0,D21=0,E21<>0,F21<>0),F21-E21-M21,IF(AND(C21>20,D21=0,E21=0,F21<>0),24-C21+F21-M21,IF(AND(C21<>0,D21=0,E21=0,F21<>0),F21-C21-M21,0)))))","v":0},{"$f":"IF(G21=0,0,IF(K21=0.5,0,G21-Calendrier!$AT$9))","v":0},{"$f":"I20+H21","v":4.5},"Di",0,null,0]
["2023-12-04",{"$f":"INDIRECT(ADDRESS(MATCH($B$1,Calendrier!$A$15:$A$59,0)+14,ROW()-17,3,1,\"Calendrier\"),1)","v":"T"},null,null,null,null,{"$f":"IF(AND(C22<>0,D22<>0,E22<>0,F22<>0),F22-E22+D22-C22-M22-IF(E22-D22<Calendrier!$AT$10,Calendrier!$AT$10,0),IF(AND(C22<>0,D22<>0,E22=0,F22=0),D22-C22-M22,IF(AND(C22=0,D22=0,E22<>0,F22<>0),F22-E22-M22,IF(AND(C22>20,D22=0,E22=0,F22<>0),24-C22+F22-M22,IF(AND(C22<>0,D22=0,E22=0,F22<>0),F22-C22-M22,0)))))","v":0},{"$f":"IF(G22=0,0,IF(K22=0.5,0,G22-Calendrier!$AT$9))","v":0},4.5,"T",0,null,0]
["2023-12-05",{"$f":"INDIRECT(ADDRESS(MATCH($B$1,Calendrier!$A$15:$A$59,0)+14,ROW()-17,3,1,\"Calendrier\"),1)","v":"T"},null,null,null,null,{"$f":"IF(AND(C23<>0,D23<>0,E23<>0,F23<>0),F23-E23+D23-C23-M23-IF(E23-D23<Calendrier!$AT$10,Calendrier!$AT$10,0),IF(AND(C23<>0,D23<>0,E23=0,F23=0),D23-C23-M23,IF(AND(C23=0,D23=0,E23<>0,F23<>0),F23-E23-M23,IF(AND(C23>20,D23=0,E23=0,F23<>0),24-C23+F23-M23,IF(AND(C23<>0,D23=0,E23=0,F23<>0),F23-C23-M23,0)))))","v":0},{"$f":"IF(G23=0,0,IF(K23=0.5,0,G23-Calendrier!$AT$9))","v":0},4.5,"T",0,null,0]
["2023-12-06",{"$f":"INDIRECT(ADDRESS(MATCH($B$1,Calendrier!$A$15:$A$59,0)+14,ROW()-17,3,1,\"Calendrier\"),1)","v":"T"},null,null,null,null,{"$f":"IF(AND(C24<>0,D24<>0,E24<>0,F24<>0),F24-E24+D24-C24-M24-IF(E24-D24<Calendrier!$AT$10,Calendrier!$AT$10,0),IF(AND(C24<>0,D24<>0,E24=0,F24=0),D24-C24-M24,IF(AND(C24=0,D24=0,E24<>0,F24<>0),F24-E24-M24,IF(AND(C24>20,D24=0,E24=0,F24<>0),24-C24+F24-M24,IF(AND(C24<>0,D24=0,E24=0,F24<>0),F24-C24-M24,0)))))","v":0},{"$f":"IF(G24=0,0,IF(K24=0.5,0,G24-Calendrier!$AT$9))","v":0},4.5,"T",0,null,{"$f":"IF(OR(N24=0,O24=0),0,O24-N24)","v":0}]
["2023-12-07",{"$f":"INDIRECT(ADDRESS(MATCH($B$1,Calendrier!$A$15:$A$59,0)+14,ROW()-17,3,1,\"Calendrier\"),1)","v":"T"},null,null,null,null,{"$f":"IF(AND(C25<>0,D25<>0,E25<>0,F25<>0),F25-E25+D25-C25-M25-IF(E25-D25<Calendrier!$AT$10,Calendrier!$AT$10,0),IF(AND(C25<>0,D25<>0,E25=0,F25=0),D25-C25-M25,IF(AND(C25=0,D25=0,E25<>0,F25<>0),F25-E25-M25,IF(AND(C25>20,D25=0,E25=0,F25<>0),24-C25+F25-M25,IF(AND(C25<>0,D25=0,E25=0,F25<>0),F25-C25-M25,0)))))","v":0},{"$f":"IF(G25=0,0,IF(K25=0.5,0,G25-Calendrier!$AT$9))","v":0},4.5,"T",0,null,{"$f":"IF(OR(N25=0,O25=0),0,O25-N25)","v":0}]
["2023-12-08",{"$f":"INDIRECT(ADDRESS(MATCH($B$1,Calendrier!$A$15:$A$59,0)+14,ROW()-17,3,1,\"Calendrier\"),1)","v":"T"},null,null,null,null,{"$f":"IF(AND(C26<>0,D26<>0,E26<>0,F26<>0),F26-E26+D26-C26-M26-IF(E26-D26<Calendrier!$AT$10,Calendrier!$AT$10,0),IF(AND(C26<>0,D26<>0,E26=0,F26=0),D26-C26-M26,IF(AND(C26=0,D26=0,E26<>0,F26<>0),F26-E26-M26,IF(AND(C26>20,D26=0,E26=0,F26<>0),24-C26+F26-M26,IF(AND(C26<>0,D26=0,E26=0,F26<>0),F26-C26-M26,0)))))","v":0},{"$f":"IF(G26=0,0,IF(K26=0.5,0,G26-Calendrier!$AT$9))","v":0},4.5,"T",0,null,0]
["2023-12-09",{"$f":"INDIRECT(ADDRESS(MATCH($B$1,Calendrier!$A$15:$A$59,0)+14,ROW()-17,3,1,\"Calendrier\"),1)","v":"Sa"},null,null,null,null,{"$f":"IF(AND(C27<>0,D27<>0,E27<>0,F27<>0),F27-E27+D27-C27-M27-IF(E27-D27<Calendrier!$AT$10,Calendrier!$AT$10,0),IF(AND(C27<>0,D27<>0,E27=0,F27=0),D27-C27-M27,IF(AND(C27=0,D27=0,E27<>0,F27<>0),F27-E27-M27,IF(AND(C27>20,D27=0,E27=0,F27<>0),24-C27+F27-M27,IF(AND(C27<>0,D27=0,E27=0,F27<>0),F27-C27-M27,0)))))","v":0},{"$f":"IF(G27=0,0,IF(K27=0.5,0,G27-Calendrier!$AT$9))","v":0},4.5,"Sa",0,null,0]
["2023-12-10",{"$f":"INDIRECT(ADDRESS(MATCH($B$1,Calendrier!$A$15:$A$59,0)+14,ROW()-17,3,1,\"Calendrier\"),1)","v":"Di"},null,null,null,null,{"$f":"IF(AND(C28<>0,D28<>0,E28<>0,F28<>0),F28-E28+D28-C28-M28-IF(E28-D28<Calendrier!$AT$10,Calendrier!$AT$10,0),IF(AND(C28<>0,D28<>0,E28=0,F28=0),D28-C28-M28,IF(AND(C28=0,D28=0,E28<>0,F28<>0),F28-E28-M28,IF(AND(C28>20,D28=0,E28=0,F28<>0),24-C28+F28-M28,IF(AND(C28<>0,D28=0,E28=0,F28<>0),F28-C28-M28,0)))))","v":0},{"$f":"IF(G28=0,0,IF(K28=0.5,0,G28-Calendrier!$AT$9))","v":0},4.5,"Di",0,null,0,null,null,null,{"$f":"WEEKDAY(A25,2)","v":4}]
["2023-12-11",{"$f":"INDIRECT(ADDRESS(MATCH($B$1,Calendrier!$A$15:$A$59,0)+14,ROW()-17,3,1,\"Calendrier\"),1)","v":"T"},null,null,null,null,{"$f":"IF(AND(C29<>0,D29<>0,E29<>0,F29<>0),F29-E29+D29-C29-M29-IF(E29-D29<Calendrier!$AT$10,Calendrier!$AT$10,0),IF(AND(C29<>0,D29<>0,E29=0,F29=0),D29-C29-M29,IF(AND(C29=0,D29=0,E29<>0,F29<>0),F29-E29-M29,IF(AND(C29>20,D29=0,E29=0,F29<>0),24-C29+F29-M29,IF(AND(C29<>0,D29=0,E29=0,F29<>0),F29-C29-M29,0)))))","v":0},{"$f":"IF(G29=0,0,IF(K29=0.5,0,G29-Calendrier!$AT$9))","v":0},4.5,"T",0,null,0]
["2023-12-12",{"$f":"INDIRECT(ADDRESS(MATCH($B$1,Calendrier!$A$15:$A$59,0)+14,ROW()-17,3,1,\"Calendrier\"),1)","v":"T"},null,null,null,null,{"$f":"IF(AND(C30<>0,D30<>0,E30<>0,F30<>0),F30-E30+D30-C30-M30-IF(E30-D30<Calendrier!$AT$10,Calendrier!$AT$10,0),IF(AND(C30<>0,D30<>0,E30=0,F30=0),D30-C30-M30,IF(AND(C30=0,D30=0,E30<>0,F30<>0),F30-E30-M30,IF(AND(C30>20,D30=0,E30=0,F30<>0),24-C30+F30-M30,IF(AND(C30<>0,D30=0,E30=0,F30<>0),F30-C30-M30,0)))))","v":0},{"$f":"IF(G30=0,0,IF(K30=0.5,0,G30-Calendrier!$AT$9))","v":0},4.5,"T",0,null,0]
["2023-12-13",{"$f":"INDIRECT(ADDRESS(MATCH($B$1,Calendrier!$A$15:$A$59,0)+14,ROW()-17,3,1,\"Calendrier\"),1)","v":"T"},null,null,null,null,{"$f":"IF(AND(C31<>0,D31<>0,E31<>0,F31<>0),F31-E31+D31-C31-M31-IF(E31-D31<Calendrier!$AT$10,Calendrier!$AT$10,0),IF(AND(C31<>0,D31<>0,E31=0,F31=0),D31-C31-M31,IF(AND(C31=0,D31=0,E31<>0,F31<>0),F31-E31-M31,IF(AND(C31>20,D31=0,E31=0,F31<>0),24-C31+F31-M31,IF(AND(C31<>0,D31=0,E31=0,F31<>0),F31-C31-M31,0)))))","v":0},{"$f":"IF(G31=0,0,IF(K31=0.5,0,G31-Calendrier!$AT$9))","v":0},4.5,"T",0,null,0]
["2023-12-14",{"$f":"INDIRECT(ADDRESS(MATCH($B$1,Calendrier!$A$15:$A$59,0)+14,ROW()-17,3,1,\"Calendrier\"),1)","v":"T"},null,null,null,null,{"$f":"IF(AND(C32<>0,D32<>0,E32<>0,F32<>0),F32-E32+D32-C32-M32-IF(E32-D32<Calendrier!$AT$10,Calendrier!$AT$10,0),IF(AND(C32<>0,D32<>0,E32=0,F32=0),D32-C32-M32,IF(AND(C32=0,D32=0,E32<>0,F32<>0),F32-E32-M32,IF(AND(C32>20,D32=0,E32=0,F32<>0),24-C32+F32-M32,IF(AND(C32<>0,D32=0,E32=0,F32<>0),F32-C32-M32,0)))))","v":0},{"$f":"IF(G32=0,0,IF(K32=0.5,0,G32-Calendrier!$AT$9))","v":0},4.5,"T",0,null,0]
["2023-12-15",{"$f":"INDIRECT(ADDRESS(MATCH($B$1,Calendrier!$A$15:$A$59,0)+14,ROW()-17,3,1,\"Calendrier\"),1)","v":"T"},null,null,null,null,{"$f":"IF(AND(C33<>0,D33<>0,E33<>0,F33<>0),F33-E33+D33-C33-M33-IF(E33-D33<Calendrier!$AT$10,Calendrier!$AT$10,0),IF(AND(C33<>0,D33<>0,E33=0,F33=0),D33-C33-M33,IF(AND(C33=0,D33=0,E33<>0,F33<>0),F33-E33-M33,IF(AND(C33>20,D33=0,E33=0,F33<>0),24-C33+F33-M33,IF(AND(C33<>0,D33=0,E33=0,F33<>0),F33-C33-M33,0)))))","v":0},{"$f":"IF(G33=0,0,IF(K33=0.5,0,G33-Calendrier!$AT$9))","v":0},4.5,"T",0,null,0]
["2023-12-16",{"$f":"INDIRECT(ADDRESS(MATCH($B$1,Calendrier!$A$15:$A$59,0)+14,ROW()-17,3,1,\"Calendrier\"),1)","v":"Sa"},null,null,null,null,{"$f":"IF(AND(C34<>0,D34<>0,E34<>0,F34<>0),F34-E34+D34-C34-M34-IF(E34-D34<Calendrier!$AT$10,Calendrier!$AT$10,0),IF(AND(C34<>0,D34<>0,E34=0,F34=0),D34-C34-M34,IF(AND(C34=0,D34=0,E34<>0,F34<>0),F34-E34-M34,IF(AND(C34>20,D34=0,E34=0,F34<>0),24-C34+F34-M34,IF(AND(C34<>0,D34=0,E34=0,F34<>0),F34-C34-M34,0)))))","v":0},{"$f":"IF(G34=0,0,IF(K34=0.5,0,G34-Calendrier!$AT$9))","v":0},4.5,{"$f":"IF(AND(COUNTA(C34:F34)=0,OR(B34=\"F\",WEEKDAY(A34,2)>5,B34=\"T\",B34=\"RTT\",B34=\"CA\")),B34,IF(AND(COUNTA(C34:F34)>=2,OR(B34=\"F\",B34=\"RTT\",B34=\"CA\",B34=\"Sa\",B34=\"Di\")),\"calendrier\",IF(AND(COUNTA(C34)+COUNTA(F34)=2,OR(COUNTA(C34:D34)<1,COUNTA(E34:F34)<1)),\"erreur\",IF(COUNTA(C34:F34)=3,\"en cours\",IF(COUNTA(C34:F34)=4,B34,IF(OR(AND(C34<>0,D34<>0),AND(E34<>0,F34<>0)),$F$12,IF(AND(C34<>0,D34=0,E34=0,F34<>0,WEEKDAY(A34,2)>5),\"calendrier\",IF(AND(C34<>0,D34=0,E34=0,F34<>0),$B34,\"\"))))))))","v":"Sa"},0,null,0]
["2023-12-17",{"$f":"INDIRECT(ADDRESS(MATCH($B$1,Calendrier!$A$15:$A$59,0)+14,ROW()-17,3,1,\"Calendrier\"),1)","v":"Di"},null,null,null,null,{"$f":"IF(AND(C35<>0,D35<>0,E35<>0,F35<>0),F35-E35+D35-C35-M35-IF(E35-D35<Calendrier!$AT$10,Calendrier!$AT$10,0),IF(AND(C35<>0,D35<>0,E35=0,F35=0),D35-C35-M35,IF(AND(C35=0,D35=0,E35<>0,F35<>0),F35-E35-M35,IF(AND(C35>20,D35=0,E35=0,F35<>0),24-C35+F35-M35,IF(AND(C35<>0,D35=0,E35=0,F35<>0),F35-C35-M35,0)))))","v":0},{"$f":"IF(G35=0,0,IF(K35=0.5,0,G35-Calendrier!$AT$9))","v":0},4.5,"Di",0,null,0]
["2023-12-18",{"$f":"INDIRECT(ADDRESS(MATCH($B$1,Calendrier!$A$15:$A$59,0)+14,ROW()-17,3,1,\"Calendrier\"),1)","v":"T"},null,null,null,null,{"$f":"IF(AND(C36<>0,D36<>0,E36<>0,F36<>0),F36-E36+D36-C36-M36-IF(E36-D36<Calendrier!$AT$10,Calendrier!$AT$10,0),IF(AND(C36<>0,D36<>0,E36=0,F36=0),D36-C36-M36,IF(AND(C36=0,D36=0,E36<>0,F36<>0),F36-E36-M36,IF(AND(C36>20,D36=0,E36=0,F36<>0),24-C36+F36-M36,IF(AND(C36<>0,D36=0,E36=0,F36<>0),F36-C36-M36,0)))))","v":0},{"$f":"IF(G36=0,0,IF(K36=0.5,0,G36-Calendrier!$AT$9))","v":0},4.5,"T",0,null,0]
["2023-12-19",{"$f":"INDIRECT(ADDRESS(MATCH($B$1,Calendrier!$A$15:$A$59,0)+14,ROW()-17,3,1,\"Calendrier\"),1)","v":"RTT"},null,null,null,null,{"$f":"IF(AND(C37<>0,D37<>0,E37<>0,F37<>0),F37-E37+D37-C37-M37-IF(E37-D37<Calendrier!$AT$10,Calendrier!$AT$10,0),IF(AND(C37<>0,D37<>0,E37=0,F37=0),D37-C37-M37,IF(AND(C37=0,D37=0,E37<>0,F37<>0),F37-E37-M37,IF(AND(C37>20,D37=0,E37=0,F37<>0),24-C37+F37-M37,IF(AND(C37<>0,D37=0,E37=0,F37<>0),F37-C37-M37,0)))))","v":0},{"$f":"IF(G37=0,0,IF(K37=0.5,0,G37-Calendrier!$AT$9))","v":0},4.5,"RTT",0,null,0]
["2023-12-20",{"$f":"INDIRECT(ADDRESS(MATCH($B$1,Calendrier!$A$15:$A$59,0)+14,ROW()-17,3,1,\"Calendrier\"),1)","v":"T"},null,null,null,null,{"$f":"IF(AND(C38<>0,D38<>0,E38<>0,F38<>0),F38-E38+D38-C38-M38-IF(E38-D38<Calendrier!$AT$10,Calendrier!$AT$10,0),IF(AND(C38<>0,D38<>0,E38=0,F38=0),D38-C38-M38,IF(AND(C38=0,D38=0,E38<>0,F38<>0),F38-E38-M38,IF(AND(C38>20,D38=0,E38=0,F38<>0),24-C38+F38-M38,IF(AND(C38<>0,D38=0,E38=0,F38<>0),F38-C38-M38,0)))))","v":0},{"$f":"IF(G38=0,0,IF(K38=0.5,0,G38-Calendrier!$AT$9))","v":0},4.5,"T",0,null,0]
["2023-12-21",{"$f":"INDIRECT(ADDRESS(MATCH($B$1,Calendrier!$A$15:$A$59,0)+14,ROW()-17,3,1,\"Calendrier\"),1)","v":"T"},null,null,null,null,{"$f":"IF(AND(C39<>0,D39<>0,E39<>0,F39<>0),F39-E39+D39-C39-M39-IF(E39-D39<Calendrier!$AT$10,Calendrier!$AT$10,0),IF(AND(C39<>0,D39<>0,E39=0,F39=0),D39-C39-M39,IF(AND(C39=0,D39=0,E39<>0,F39<>0),F39-E39-M39,IF(AND(C39>20,D39=0,E39=0,F39<>0),24-C39+F39-M39,IF(AND(C39<>0,D39=0,E39=0,F39<>0),F39-C39-M39,0)))))","v":0},{"$f":"IF(G39=0,0,IF(K39=0.5,0,G39-Calendrier!$AT$9))","v":0},4.5,"T",0,null,0]
["2023-12-22",{"$f":"INDIRECT(ADDRESS(MATCH($B$1,Calendrier!$A$15:$A$59,0)+14,ROW()-17,3,1,\"Calendrier\"),1)","v":"CA"},null,null,null,null,{"$f":"IF(AND(C40<>0,D40<>0,E40<>0,F40<>0),F40-E40+D40-C40-M40-IF(E40-D40<Calendrier!$AT$10,Calendrier!$AT$10,0),IF(AND(C40<>0,D40<>0,E40=0,F40=0),D40-C40-M40,IF(AND(C40=0,D40=0,E40<>0,F40<>0),F40-E40-M40,IF(AND(C40>20,D40=0,E40=0,F40<>0),24-C40+F40-M40,IF(AND(C40<>0,D40=0,E40=0,F40<>0),F40-C40-M40,0)))))","v":0},{"$f":"IF(G40=0,0,IF(K40=0.5,0,G40-Calendrier!$AT$9))","v":0},4.5,"CA",0,null,0]
["2023-12-23",{"$f":"INDIRECT(ADDRESS(MATCH($B$1,Calendrier!$A$15:$A$59,0)+14,ROW()-17,3,1,\"Calendrier\"),1)","v":"Sa"},null,null,null,null,{"$f":"IF(AND(C41<>0,D41<>0,E41<>0,F41<>0),F41-E41+D41-C41-M41-IF(E41-D41<Calendrier!$AT$10,Calendrier!$AT$10,0),IF(AND(C41<>0,D41<>0,E41=0,F41=0),D41-C41-M41,IF(AND(C41=0,D41=0,E41<>0,F41<>0),F41-E41-M41,IF(AND(C41>20,D41=0,E41=0,F41<>0),24-C41+F41-M41,IF(AND(C41<>0,D41=0,E41=0,F41<>0),F41-C41-M41,0)))))","v":0},{"$f":"IF(G41=0,0,IF(K41=0.5,0,G41-Calendrier!$AT$9))","v":0},4.5,"Sa",0,null,0]
["2023-12-24",{"$f":"INDIRECT(ADDRESS(MATCH($B$1,Calendrier!$A$15:$A$59,0)+14,ROW()-17,3,1,\"Calendrier\"),1)","v":"Di"},null,null,null,null,{"$f":"IF(AND(C42<>0,D42<>0,E42<>0,F42<>0),F42-E42+D42-C42-M42-IF(E42-D42<Calendrier!$AT$10,Calendrier!$AT$10,0),IF(AND(C42<>0,D42<>0,E42=0,F42=0),D42-C42-M42,IF(AND(C42=0,D42=0,E42<>0,F42<>0),F42-E42-M42,IF(AND(C42>20,D42=0,E42=0,F42<>0),24-C42+F42-M42,IF(AND(C42<>0,D42=0,E42=0,F42<>0),F42-C42-M42,0)))))","v":0},{"$f":"IF(G42=0,0,IF(K42=0.5,0,G42-Calendrier!$AT$9))","v":0},4.5,"Di",0,null,0]
["2023-12-25",{"$f":"INDIRECT(ADDRESS(MATCH($B$1,Calendrier!$A$15:$A$59,0)+14,ROW()-17,3,1,\"Calendrier\"),1)","v":"F"},null,null,null,null,{"$f":"IF(AND(C43<>0,D43<>0,E43<>0,F43<>0),F43-E43+D43-C43-M43-IF(E43-D43<Calendrier!$AT$10,Calendrier!$AT$10,0),IF(AND(C43<>0,D43<>0,E43=0,F43=0),D43-C43-M43,IF(AND(C43=0,D43=0,E43<>0,F43<>0),F43-E43-M43,IF(AND(C43>20,D43=0,E43=0,F43<>0),24-C43+F43-M43,IF(AND(C43<>0,D43=0,E43=0,F43<>0),F43-C43-M43,0)))))","v":0},{"$f":"IF(G43=0,0,IF(K43=0.5,0,G43-Calendrier!$AT$9))","v":0},4.5,"F",0,null,0]
["2023-12-26",{"$f":"INDIRECT(ADDRESS(MATCH($B$1,Calendrier!$A$15:$A$59,0)+14,ROW()-17,3,1,\"Calendrier\"),1)","v":"CA"},null,null,null,null,{"$f":"IF(AND(C44<>0,D44<>0,E44<>0,F44<>0),F44-E44+D44-C44-M44-IF(E44-D44<Calendrier!$AT$10,Calendrier!$AT$10,0),IF(AND(C44<>0,D44<>0,E44=0,F44=0),D44-C44-M44,IF(AND(C44=0,D44=0,E44<>0,F44<>0),F44-E44-M44,IF(AND(C44>20,D44=0,E44=0,F44<>0),24-C44+F44-M44,IF(AND(C44<>0,D44=0,E44=0,F44<>0),F44-C44-M44,0)))))","v":0},{"$f":"IF(G44=0,0,IF(K44=0.5,0,G44-Calendrier!$AT$9))","v":0},4.5,"CA",0,null,0]
["2023-12-27",{"$f":"INDIRECT(ADDRESS(MATCH($B$1,Calendrier!$A$15:$A$59,0)+14,ROW()-17,3,1,\"Calendrier\"),1)","v":"CA"},null,null,null,null,{"$f":"IF(AND(C45<>0,D45<>0,E45<>0,F45<>0),F45-E45+D45-C45-M45-IF(E45-D45<Calendrier!$AT$10,Calendrier!$AT$10,0),IF(AND(C45<>0,D45<>0,E45=0,F45=0),D45-C45-M45,IF(AND(C45=0,D45=0,E45<>0,F45<>0),F45-E45-M45,IF(AND(C45>20,D45=0,E45=0,F45<>0),24-C45+F45-M45,IF(AND(C45<>0,D45=0,E45=0,F45<>0),F45-C45-M45,0)))))","v":0},{"$f":"IF(G45=0,0,IF(K45=0.5,0,G45-Calendrier!$AT$9))","v":0},4.5,"CA",0,null,0]
["2023-12-28",{"$f":"INDIRECT(ADDRESS(MATCH($B$1,Calendrier!$A$15:$A$59,0)+14,ROW()-17,3,1,\"Calendrier\"),1)","v":"CA"},null,null,null,null,{"$f":"IF(AND(C46<>0,D46<>0,E46<>0,F46<>0),F46-E46+D46-C46-M46-IF(E46-D46<Calendrier!$AT$10,Calendrier!$AT$10,0),IF(AND(C46<>0,D46<>0,E46=0,F46=0),D46-C46-M46,IF(AND(C46=0,D46=0,E46<>0,F46<>0),F46-E46-M46,IF(AND(C46>20,D46=0,E46=0,F46<>0),24-C46+F46-M46,IF(AND(C46<>0,D46=0,E46=0,F46<>0),F46-C46-M46,0)))))","v":0},{"$f":"IF(G46=0,0,IF(K46=0.5,0,G46-Calendrier!$AT$9))","v":0},4.5,"CA",0,null,0]
["2023-12-29",{"$f":"INDIRECT(ADDRESS(MATCH($B$1,Calendrier!$A$15:$A$59,0)+14,ROW()-17,3,1,\"Calendrier\"),1)","v":"CA"},null,null,null,null,{"$f":"IF(AND(C47<>0,D47<>0,E47<>0,F47<>0),F47-E47+D47-C47-M47-IF(E47-D47<Calendrier!$AT$10,Calendrier!$AT$10,0),IF(AND(C47<>0,D47<>0,E47=0,F47=0),D47-C47-M47,IF(AND(C47=0,D47=0,E47<>0,F47<>0),F47-E47-M47,IF(AND(C47>20,D47=0,E47=0,F47<>0),24-C47+F47-M47,IF(AND(C47<>0,D47=0,E47=0,F47<>0),F47-C47-M47,0)))))","v":0},{"$f":"IF(G47=0,0,IF(K47=0.5,0,G47-Calendrier!$AT$9))","v":0},4.5,"CA",0,null,0]
["2023-12-30",{"$f":"INDIRECT(ADDRESS(MATCH($B$1,Calendrier!$A$15:$A$59,0)+14,ROW()-17,3,1,\"Calendrier\"),1)","v":"Sa"},null,null,null,null,{"$f":"IF(AND(C48<>0,D48<>0,E48<>0,F48<>0),F48-E48+D48-C48-M48-IF(E48-D48<Calendrier!$AT$10,Calendrier!$AT$10,0),IF(AND(C48<>0,D48<>0,E48=0,F48=0),D48-C48-M48,IF(AND(C48=0,D48=0,E48<>0,F48<>0),F48-E48-M48,IF(AND(C48>20,D48=0,E48=0,F48<>0),24-C48+F48-M48,IF(AND(C48<>0,D48=0,E48=0,F48<>0),F48-C48-M48,0)))))","v":0},{"$f":"IF(G48=0,0,IF(K48=0.5,0,G48-Calendrier!$AT$9))","v":0},4.5,"Sa",0,null,0]
["2023-12-31",{"$f":"INDIRECT(ADDRESS(MATCH($B$1,Calendrier!$A$15:$A$59,0)+14,ROW()-17,3,1,\"Calendrier\"),1)","v":"Di"},null,null,null,null,{"$f":"IF(AND(C49<>0,D49<>0,E49<>0,F49<>0),F49-E49+D49-C49-M49-IF(E49-D49<Calendrier!$AT$10,Calendrier!$AT$10,0),IF(AND(C49<>0,D49<>0,E49=0,F49=0),D49-C49-M49,IF(AND(C49=0,D49=0,E49<>0,F49<>0),F49-E49-M49,IF(AND(C49>20,D49=0,E49=0,F49<>0),24-C49+F49-M49,IF(AND(C49<>0,D49=0,E49=0,F49<>0),F49-C49-M49,0)))))","v":0},{"$f":"IF(G49=0,0,IF(K49=0.5,0,G49-Calendrier!$AT$9))","v":0},4.5,"Di",0,null,0]
[null,null,null,null,null,null,{"$f":"SUM(G19:G49)","v":0},null,{"$f":"I49","v":4.5}]

{"sheet":"Fériés","index":15,"n_rows":32,"n_cols":13,"rows_kept":32,"cut":false,"hidden":false,"merged":[]}
[{"$f":"Calendrier!A1","v":2023},{"$f":"A1+1","v":2024},null,null,null,null,1,{"$f":"IF(MONTH(Calendrier!$B$13)<10,0&MONTH(Calendrier!$B$13),MONTH(Calendrier!$B$13))","v":"01"},{"$f":"CHOOSE(H1,\"Janvier\",\"Fevrier\",\"Mars\",\"Avril\",\"Mai\",\"Juin\",\"Juillet\",\"Aout\",\"septembre\",\"Octobre\",\"Novembre\",\"Decembre\")","v":"Janvier"},{"$f":"AN_1","v":2023},"01","janvier",{"$f":"DAY(EOMONTH(DATE(AN_1,G1,1),0))","v":31}]
[{"$f":"VALUE(\"01/01/\"&AN_1)","v":"2023-01-01"},"Jour de l'an",null,null,null,null,2,{"$f":"IF(H1+1>12,\"01\",IF(H1+1<10,\"0\"&H1+1,H1+1))","v":"02"},{"$f":"CHOOSE(H2,\"Janvier\",\"Fevrier\",\"Mars\",\"Avril\",\"Mai\",\"Juin\",\"Juillet\",\"Aout\",\"septembre\",\"Octobre\",\"Novembre\",\"Decembre\")","v":"Fevrier"},{"$f":"IF(CHOOSE(VALUE(H2),1,2,3,4,5,6,7,8,9,10,11,12)>=CHOOSE(VALUE($H$1),1,2,3,4,5,6,7,8,9,10,11,12),AN_1,AN_2)","v":2023},"02","fevrier",28]
[null,"Vendredi saint",{"$f":"$A$4-2","v":45023},null,null,null,3,"03","Mars",2023,"03","mars",31]
[{"$f":"ROUND((\"4/\"&AN_1)/7+MOD(19*MOD(AN_1,19)-7,30)*14%,)*7-6","v":"2023-04-09"},"Pâques",null,null,null,null,4,"04","Avril",2023,"04","avril",30]
[{"$f":"A4+1","v":"2023-04-10"},"lundi Pâques",null,null,null,null,5,"05","Mai",2023,"05","mai",31]
[{"$f":"VALUE(\"01/05/\"&AN_1)","v":"2023-05-01"},"Fête du travail",null,null,null,null,6,"06","Juin",2023,"06","juin",30]
[{"$f":"VALUE(\"08/05/\"&AN_1)","v":"2023-05-08"},"Victoire 1945",null,null,null,null,7,"07",{"$f":"CHOOSE(H7,\"Janvier\",\"Fevrier\",\"Mars\",\"Avril\",\"Mai\",\"Juin\",\"Juillet\",\"Aout\",\"septembre\",\"Octobre\",\"Novembre\",\"Decembre\")","v":"Juillet"},2023,"07","juillet",31]
[{"$f":"A4+39","v":"2023-05-18"},"jeudi ascension",null,null,null,null,8,{"$f":"IF(H7+1>12,\"01\",IF(H7+1<10,\"0\"&H7+1,H7+1))","v":"08"},{"$f":"CHOOSE(H8,\"Janvier\",\"Fevrier\",\"Mars\",\"Avril\",\"Mai\",\"Juin\",\"Juillet\",\"Aout\",\"septembre\",\"Octobre\",\"Novembre\",\"Decembre\")","v":"Aout"},2023,"08","août",31]
[{"$f":"A4+49","v":"2023-05-28"},"Pentecôte",null,null,null,null,9,{"$f":"IF(H8+1>12,\"01\",IF(H8+1<10,\"0\"&H8+1,H8+1))","v":"09"},"septembre",2023,"09","septembre",30]
[null,"lundi de Pentecôte",null,null,null,null,10,10,"Octobre",2023,"10","octobre",31]
[{"$f":"VALUE(\"14/07/\"&AN_1)","v":"2023-07-14"},"Fête Nationale",null,null,null,null,11,11,"Novembre",2023,"11'","novembre",30]
[{"$f":"VALUE(\"15/08/\"&AN_1)","v":"2023-08-15"},"Assomption",null,null,null,null,12,12,"Decembre",2023,"12","Decembre",31]
[{"$f":"VALUE(\"01/11/\"&AN_1)","v":"2023-11-01"},"Toussaint"]
[{"$f":"VALUE(\"11/11/\"&AN_1)","v":"2023-11-11"},"Armistice"]
[{"$f":"VALUE(\"25/12/\"&AN_1)","v":"2023-12-25"},"Noël"]
[null,"Saint-Etienne",{"$f":"$A$15+1","v":45286}]
[{"$f":"A15+7","v":"2024-01-01"},"Jour de l'an"]
[null,"Vendredi saint",{"$f":"$A$19-2","v":45380}]
[{"$f":"ROUND((\"4/\"&AN_2)/7+MOD(19*MOD(AN_2,19)-7,30)*14%,)*7-6","v":"2024-03-31"},"Pâques"]
[{"$f":"A19+1","v":"2024-04-01"},"lundi Pâques"]
[{"$f":"VALUE(\"01/05/\"&AN_2)","v":"2024-05-01"},"Fête du travail"]
[{"$f":"VALUE(\"08/05/\"&AN_2)","v":"2024-05-08"},"Victoire 1945"]
[{"$f":"A19+39","v":"2024-05-09"},"jeudi ascension"]
[{"$f":"A19+49","v":"2024-05-19"},"Pentecôte"]
[null,"lundi de Pentecôte"]
[{"$f":"VALUE(\"14/07/\"&AN_2)","v":"2024-07-14"},"Fête Nationale"]
[{"$f":"VALUE(\"15/08/\"&AN_2)","v":"2024-08-15"},"Assomption"]
[{"$f":"VALUE(\"01/11/\"&AN_2)","v":"2024-11-01"},"Toussaint"]
[{"$f":"VALUE(\"11/11/\"&AN_2)","v":"2024-11-11"},"Armistice"]
[{"$f":"VALUE(\"25/12/\"&AN_2)","v":"2024-12-25"},"Noël"]
[null,"Saint-Etienne",{"$f":"$A$30+1","v":45652}]
[{"$f":"A30+7","v":"2025-01-01"},"Jour de l'an"]

{"sheet":"Lisez_moi","index":16,"n_rows":0,"n_cols":0,"rows_kept":0,"cut":false,"hidden":false,"merged":[]}