{"text_format":"1","workbook":"xlsx","n_sheets":17,"sheets":["Calendrier","Feuil2","Module1","JAN","FEV","MAR","AVR","MAI","JUN","JUL","AOU","SEP","OCT","NOV","DEC","Fériés","Lisez_moi"],"not_rendered":{"charts":0,"images":0,"macros":1,"external_links":0,"defined_names":80,"comments":0,"pivot_tables":0},"unopened":[{"sheet":"Module1","index":2,"reason":"part_missing"}],"bounds":{"document_bytes":16777216,"sheet_cells":100000,"rows_first":2000,"rows_last":500,"rows_between":2000,"halvings":0,"cell_chars":16384,"cell_head_chars":4096},"cells_cut":0,"cells_raw":0,"read":"whole","date_system":"1900"}

{"sheet":"Calendrier","index":0,"n_rows":59,"n_cols":49,"rows_kept":59,"cut":false,"hidden":false,"merged":[[4,9,4,10],[0,13,0,14],[0,20,0,21],[1,11,1,12],[1,13,1,14],[2,11,2,12],[2,13,2,14],[3,11,3,12],[3,13,3,14],[4,11,4,12],[4,13,4,14],[4,15,4,21],[3,9,3,10],[2,9,2,10],[5,11,5,12],[5,13,5,14],[6,11,6,12],[6,13,6,14],[6,15,6,20],[7,1,7,5],[7,9,7,10],[7,11,7,12],[7,13,7,14],[7,15,7,20],[6,9,6,10],[8,9,8,10],[8,11,8,12],[8,13,8,14],[8,15,8,20]]}
[2023,null,null,null,"N° ident.","T506489",null,null,null,null,null,"année",null,{"$f":"IF(ISERROR(VALUE(\"29/02/\"&VLOOKUP(\"Février\",Fériés!$I$1:$J$12,2,FALSE))),365,366)","v":365},null,"jours",null,null,"contrôle",null,{"$f":"SUM(AH11:AP11)","v":365},null,null,null,null,null,null,null,null,null,null,null,null,null,null,null,null,null,null,null,null,null,null,null,"Sa","Samedi"]
[null,null,null,null,"nom","Isq",null,null,null,null,null,{"$f":"$AS$3","v":"F"},null,{"$f":"COUNTIF($B$12:$AF$59,L2)/2","v":12},null,"férié",null,null,null,null,null,null,null,null,null,null,null,null,null,null,null,null,null,null,null,null,null,null,null,null,null,null,null,null,"Di","Dimanche",null,null,{"$f":"CHAR(189)","v":"½"}]
[null,null,null,null,"prénom","Philippe",null,null,null,{"$f":"CHAR(189)&\" \"&$AS$2","v":"½ Di"},null,{"$f":"$AS$2","v":"Di"},null,{"$f":"AJ11","v":50},null,"dimanche",null,null,null,null,null,null,null,null,null,null,null,null,null,null,null,null,null,null,null,null,null,null,null,null,null,null,null,null,"F","Férié",null,null,{"$f":"CODE(\"1/2\")","v":49}]
[null,null,null,null,"service","Administratif",null,null,null,"½ Sa",null,{"$f":"$AS$1","v":"Sa"},null,{"$f":"AI11","v":51},null,"samedi",null,null,null,{"$f":"$AO$11","v":0},{"$f":"$AS$7","v":"Ma"},null,null,null,null,null,null,null,null,null,null,null,null,null,null,null,null,null,null,null,null,null,null,null,"CA","Congés annuel"]
[null,null,null,null,null,null,null,null,null,"½ CA",null,{"$f":"$AS$4","v":"CA"},null,{"$f":"COUNTIF($B$12:$AF$59,L5)-COUNTIF(copie_cal_aou,\"CA\")","v":25},null,{"$f":"IF($AL$11>$N$5,\"nombre de CA dépassé\",\"reste \"&25-$N$5)","v":"reste 0"},null,null,null,null,null,null,null,null,null,null,null,null,null,null,null,null,null,null,null,null,null,null,null,null,null,null,null,null,"CP","Chômage partiel"]
[null,null,null,null,null,null,null,null,null,null,null,{"$f":"$AS$5","v":"CP"},null,{"$f":"AM11","v":0},null,null,null,null,null,null,null,null,null,null,null,null,null,null,null,null,null,null,null,null,null,null,null,null,null,null,null,null,null,null,"RTT","Recupération temps travail"]
[null,null,null,null,null,null,null,null,null,{"$f":"CHAR(189)&\" \"&$AS$11","v":"½ T"},null,{"$f":"$AS$11","v":"T"},null,{"$f":"$AT$11-(AM11+AP11+V4)","v":218},null,{"$f":"IF(SUM($AH$15:$AH$59)>$N$7,\"trop de jour travaillés\",IF((SUM($AH$15:$AH$59)+AM11)=$N$7,\"Nb jour travailler bon\",\"reste à travailler\"))","v":"Nb jour travailler bon"},null,null,null,null,null,{"$f":"IF($AH$11+$T$4<=$N$7,$N$7-(AH11+T4),$N$7-AH11)","v":0},null,null,null,null,null,null,null,null,null,null,null,null,null,null,null,null,null,null,null,null,null,null,"Ma","Maladie"]
[null,"HORAIRE 2 X 4",null,null,null,null,null,null,null,"½ RTT",null,{"$f":"$AS$6","v":"RTT"},null,{"$f":"N1-(N2+N3+N4+N5+AM11+AT11+N9)","v":9},null,{"$f":"IF($AN$11>$N$8,\"Nb de RTT dépassé\",\"reste \"&+$N$8-$AN$11)","v":"reste 0"},null,null,null,null,null,null,null,null,null,null,null,null,null,null,null,null,null,{"$f":"SUM(AH11:AP11)","v":365},null,null,null,null,null,null,null,null,null,null,"CS","Congés suplémentaires (ancienneté)"]
[null,null,null,null,null,null,null,null,null,"½ CS",null,{"$f":"$AS$8","v":"CS"},null,null,null,{"$f":"IF($AP$11>$N$9,\"Nb CS dépassé\",\"reste \"&+$N$9-$AP$11&\" CS \")","v":"reste 0 CS "},null,null,null,null,null,null,null,null,null,null,null,null,null,null,null,null,null,{"$f":"CHAR(189)&$AS$11","v":"½T"},{"$f":"CHAR(189)&\" \"&$AS$1","v":"½ Sa"},{"$f":"CHAR(189)&\" \"&$AS$2","v":"½ Di"},null,{"$f":"CHAR(189)&\" \"&$AS$4","v":"½ CA"},null,{"$f":"CHAR(189)&\" \"&$AS$6","v":"½ RTT"},null,{"$f":"CHAR(189)&\" \"&$AS$8","v":"½ CS"},null,null,"H",8,"horaire journalier"]
[{"$f":"$AT$11&\" Jours de travail d'une durée de \"&AT9&\" heures soit \"&AT11*AT9&\" heures / an y compris les 7 Heures de la journée de solidaritée\"","v":"218 Jours de travail d'une durée de 8 heures soit 1744 heures / an y compris les 7 Heures de la journée de solidaritée"},null,null,null,null,null,null,null,null,null,null,null,null,null,null,null,null,null,null,null,null,null,null,null,null,null,null,null,null,null,null,null,null,{"$f":"$AS$11","v":"T"},{"$f":"$AS$1","v":"Sa"},{"$f":"$AS$2","v":"Di"},{"$f":"$AS$3","v":"F"},{"$f":"$AS$4","v":"CA"},{"$f":"$AS$5","v":"CP"},{"$f":"$AS$6","v":"RTT"},{"$f":"$AS$7","v":"Ma"},{"$f":"$AS$8","v":"CS"},null,null,"Pause",0.75,"pause mi-journée"]
{"$rows_left_out":50}
{"sheet":"Feuil2","index":1,"n_rows":255,"n_cols":1,"rows_kept":255,"cut":false,"hidden":false,"merged":[]}
[{"$f":"CHAR(ROW())","v":"\u0001"}]
[{"$f":"CHAR(ROW())","v":"\u0002"}]
["\u0003"]
["\u0004"]
["\u0005"]
["\u0006"]
["\u0007"]
["\b"]
["\t"]
["\n"]
{"$rows_left_out":246}
{"sheet":"JAN","index":3,"n_rows":50,"n_cols":17,"rows_kept":50,"cut":false,"hidden":false,"merged":[]}
[null,{"$f":"RIGHT(CELL(\"nomfichier\",$A$1),3)","v":"JAN"},"FICHE DE SUIVI HORAIRE"]
[]
[null,"mois :","JANVIER",null,null,"année ",{"$f":"VLOOKUP(C3,Fériés!$I$1:$J$12,2,FALSE)","v":2023},null,null,"service",{"$f":"Calendrier!F4","v":"Administratif"}]
[]
[null,"nom :",{"$f":"Calendrier!F2","v":"Isq"},null,null," prénom ",{"$f":"Calendrier!F3","v":"Philippe"},null,null,"N° Ident",{"$f":"Calendrier!F1","v":"T506489"}]
[null,null,null,null,null,null,null,"à réaliser","cumul","en cours","reste",null,"N.cumul"]
[null,null,null,"Nb J",{"$f":"Calendrier!$AT11","v":218},{"$f":"$H$10","v":0},{"$f":"E7-F7","v":218},{"$f":"Calendrier!N1","v":365},null,{"$f":"SUM(J8:J15)","v":27.5},{"$f":"H7-(I7+J7)","v":337.5},null,{"$f":"SUM(M8:M15)","v":27.5},null,null,null,{"$f":"MAI!M7","v":147.5}]
[null,null,null,null,null,"1/2CA","CA",{"$f":"Calendrier!N5","v":25},null,{"$f":"COUNTIF($J$19:$J$49,G8)+COUNTIF($J$19:$J$49,F8)/2","v":0},{"$f":"+H8-(I8+J8)","v":25},"J",{"$f":"I8+J8","v":0},null,null,null,{"$f":"MAI!M8","v":1}]
[null,null,null,null,null,"1/2RTT","RTT",{"$f":"Calendrier!N8","v":9},null,{"$f":"COUNTIF($J$19:$J$49,G9)+COUNTIF($J$19:$J$49,F9)/2","v":0},{"$f":"+H9-(I9+J9)","v":9},"J",{"$f":"I9+J9","v":0},null,null,null,{"$f":"MAI!M9","v":3}]
[null,null,null,null,null,"1/2CS","CS",{"$f":"Calendrier!N9","v":0},null,0,{"$f":"H10-(I10+J10)","v":0},"J",0,null,null,null,{"$f":"MAI!M10","v":0}]
{"$rows_left_out":41}
{"sheet":"FEV","index":4,"n_rows":50,"n_cols":17,"rows_kept":50,"cut":false,"hidden":false,"merged":[]}
[null,{"$f":"RIGHT(CELL(\"nomfichier\",$A$1),3)","v":"FEV"},"FICHE DE SUIVI HORAIRE"]
[]
[null,"mois :","FEVRIER",null,null,"année ",{"$f":"VLOOKUP(C3,Fériés!$I$1:$J$12,2,FALSE)","v":2023},null,null,"service",{"$f":"Calendrier!F4","v":"Administratif"}]
[]
[null,"nom :",{"$f":"Calendrier!F2","v":"Isq"},null,null," prénom ",{"$f":"Calendrier!F3","v":"Philippe"},null,null,"N° Ident",{"$f":"Calendrier!F1","v":"T506489"}]
[null,null,null,null,null,null,null,"à réaliser","cumul","en cours","reste",null,"N.cumul"]
[null,null,null,"Nb J",{"$f":"Calendrier!$AT$11","v":218},{"$f":"+$H$10","v":0},{"$f":"E7-F7","v":218},{"$f":"Calendrier!N1","v":365},{"$f":"JAN!M7","v":27.5},{"$f":"SUM(J8:J15)","v":28},{"$f":"H7-(I7+J7)","v":309.5},null,{"$f":"SUM(M8:M15)","v":55.5}]
[null,null,null,null,null,"1/2CA","CA",{"$f":"Calendrier!N5","v":25},{"$f":"JAN!M8","v":0},{"$f":"COUNTIF($J$19:$J$49,G8)","v":0},{"$f":"+H8-(I8+J8)","v":25},"J",{"$f":"+I8+J8","v":0}]
[null,null,null,null,null,"1/2RTT","RTT",{"$f":"Calendrier!N8","v":9},{"$f":"JAN!M9","v":0},{"$f":"COUNTIF($J$19:$J$49,G9)+COUNTIF($J$19:$J$49,F9)/2","v":2},{"$f":"+H9-(I9+J9)","v":7},"J",2]
[null,null,null,null,null,"1/2CS","CS",{"$f":"Calendrier!N9","v":0},{"$f":"JAN!M10","v":0},0,{"$f":"H10-(I10+J10)","v":0},"J",0]
{"$rows_left_out":41}
{"sheet":"MAR","index":5,"n_rows":50,"n_cols":15,"rows_kept":50,"cut":false,"hidden":false,"merged":[]}
[null,{"$f":"RIGHT(CELL(\"nomfichier\",$A$1),3)","v":"MAR"},"FICHE DE SUIVI HORAIRE"]
[]
[null,"mois :","MARS",null,null,"année ",{"$f":"VLOOKUP(C3,Fériés!$I$1:$J$12,2,FALSE)","v":2023},null,null,"service",{"$f":"Calendrier!F4","v":"Administratif"}]
[]
[null,"nom :",{"$f":"Calendrier!F2","v":"Isq"},null,null," prénom ",{"$f":"Calendrier!F3","v":"Philippe"},null,null,"N° Ident",{"$f":"Calendrier!F1","v":"T506489"}]
[null,null,null,null,null,null,null,"à réaliser","cumul","en cours","reste",null,"N.cumul"]
[null,null,null,"Nb J",{"$f":"Calendrier!$AT$11","v":218},{"$f":"+$H$10","v":0},{"$f":"E7-F7","v":218},{"$f":"Calendrier!N1","v":365},{"$f":"FEV!M7","v":55.5},{"$f":"SUM(J8:J15)","v":31},{"$f":"H7-(I7+J7)","v":278.5},null,{"$f":"SUM(M8:M15)","v":86.5}]
[null,null,null,null,null,"1/2CA","CA",{"$f":"Calendrier!N5","v":25},{"$f":"FEV!M8","v":0},{"$f":"COUNTIF($J$19:$J$49,G8)+COUNTIF($J$19:$J$49,F8)/2","v":0},{"$f":"+H8-(I8+J8)","v":25},"J",{"$f":"+I8+J8","v":0}]
[null,null,null,null,null,"1/2RTT","RTT",{"$f":"Calendrier!N8","v":9},{"$f":"FEV!M9","v":2},{"$f":"COUNTIF($J$19:$J$49,G9)+COUNTIF($J$19:$J$49,F9)/2","v":0},{"$f":"+H9-(I9+J9)","v":7},"J",2]
[null,null,null,null,null,"1/2CS","CS",{"$f":"Calendrier!N9","v":0},{"$f":"FEV!M10","v":0},0,{"$f":"H10-(I10+J10)","v":0},"J",0]
{"$rows_left_out":41}
{"sheet":"AVR","index":6,"n_rows":52,"n_cols":15,"rows_kept":52,"cut":false,"hidden":false,"merged":[]}
[null,{"$f":"RIGHT(CELL(\"nomfichier\",$A$1),3)","v":"AVR"},"FICHE DE SUIVI HORAIRE"]
[]
[null,"mois :","AVRIL",null,null,"année ",{"$f":"VLOOKUP(C3,Fériés!$I$1:$J$12,2,FALSE)","v":2023},null,null,"service",{"$f":"Calendrier!F4","v":"Administratif"}]
[]
[null,"nom :",{"$f":"Calendrier!F2","v":"Isq"},null,null," prénom ",{"$f":"Calendrier!F3","v":"Philippe"},null,null,"N° Ident",{"$f":"Calendrier!F1","v":"T506489"}]
[null,null,null,null,null,null,null,"à réaliser","cumul","en cours","reste",null,"N.cumul"]
[null,null,null,"Nb J",{"$f":"Calendrier!$AT$11","v":218},{"$f":"+$H$10","v":0},{"$f":"E7-F7","v":218},{"$f":"Calendrier!N1","v":365},{"$f":"MAR!M7","v":86.5},{"$f":"SUM(J8:J15)","v":30},{"$f":"H7-(I7+J7)","v":248.5},null,{"$f":"SUM(M8:M15)","v":116.5}]
[null,null,null,null,null,"1/2CA","CA",{"$f":"Calendrier!N5","v":25},{"$f":"MAR!M8","v":0},{"$f":"COUNTIF($J$19:$J$49,G8)+COUNTIF($J$19:$J$49,F8)/2","v":0},{"$f":"+H8-(I8+J8)","v":25},"J",{"$f":"+I8+J8","v":0}]
[null,null,null,null,null,"1/2RTT","RTT",{"$f":"Calendrier!N8","v":9},{"$f":"MAR!M9","v":2},{"$f":"COUNTIF($J$19:$J$49,G9)+COUNTIF($J$19:$J$49,F9)/2","v":1},{"$f":"+H9-(I9+J9)","v":6},"J",3]
[null,null,null,null,null,"1/2CS","CS",{"$f":"Calendrier!N9","v":0},{"$f":"MAR!M10","v":0},0,{"$f":"H10-(I10+J10)","v":0},"J",0]
{"$rows_left_out":43}
{"sheet":"MAI","index":7,"n_rows":50,"n_cols":15,"rows_kept":50,"cut":false,"hidden":false,"merged":[]}
[null,{"$f":"RIGHT(CELL(\"nomfichier\",$A$1),3)","v":"MAI"},"FICHE DE SUIVI HORAIRE"]
[]
[null,"mois :","MAI",null,null,"année ",{"$f":"VLOOKUP(C3,Fériés!$I$1:$J$12,2,FALSE)","v":2023},null,null,"service",{"$f":"Calendrier!F4","v":"Administratif"}]
[]
[null,"nom :",{"$f":"Calendrier!F2","v":"Isq"},null,null," prénom ",{"$f":"Calendrier!F3","v":"Philippe"},null,null,"N° Ident",{"$f":"Calendrier!F1","v":"T506489"}]
[null,null,null,null,null,null,null,"à réaliser","cumul","en cours","reste",null,"N.cumul"]
[null,null,null,"Nb J",{"$f":"Calendrier!$AT$11","v":218},{"$f":"+$H$10","v":0},{"$f":"E7-F7","v":218},{"$f":"Calendrier!N1","v":365},{"$f":"AVR!M7","v":116.5},{"$f":"SUM(J8:J15)","v":31},{"$f":"H7-(I7+J7)","v":217.5},null,{"$f":"SUM(M8:M15)","v":147.5}]
[null,null,null,null,null,"1/2CA","CA",{"$f":"Calendrier!N5","v":25},{"$f":"AVR!M8","v":0},{"$f":"COUNTIF($J$19:$J$49,G8)+COUNTIF($J$19:$J$49,F8)/2","v":1},{"$f":"+H8-(I8+J8)","v":24},"J",{"$f":"+I8+J8","v":1}]
[null,null,null,null,null,"1/2RTT","RTT",{"$f":"Calendrier!N8","v":9},{"$f":"AVR!M9","v":3},{"$f":"COUNTIF($J$19:$J$49,G9)+COUNTIF($J$19:$J$49,F9)/2","v":0},{"$f":"+H9-(I9+J9)","v":6},"J",3]
[null,null,null,null,null,"1/2CS","CS",{"$f":"Calendrier!N9","v":0},{"$f":"AVR!M10","v":0},0,{"$f":"H10-(I10+J10)","v":0},"J",0]
{"$rows_left_out":41}
{"sheet":"JUN","index":8,"n_rows":50,"n_cols":18,"rows_kept":50,"cut":false,"hidden":false,"merged":[]}
[null,{"$f":"RIGHT(CELL(\"nomfichier\",$A$1),3)","v":"JUN"},"FICHE DE SUIVI HORAIRE"]
[]
[null,"mois :","JUIN",null,null,"année ",{"$f":"VLOOKUP(C3,Fériés!$I$1:$J$12,2,FALSE)","v":2023},null,null,"service",{"$f":"Calendrier!F4","v":"Administratif"}]
[]
[null,"nom :",{"$f":"Calendrier!F2","v":"Isq"},null,null," prénom ",{"$f":"Calendrier!F3","v":"Philippe"},null,null,"N° Ident",{"$f":"Calendrier!F1","v":"T506489"}]
[null,null,null,null,null,null,null,"à réaliser","cumul","en cours","reste",null,"N.cumul"]
[null,null,null,"Nb J",{"$f":"Calendrier!$AT$11","v":218},{"$f":"$H$10","v":0},{"$f":"E7-F7","v":218},{"$f":"Calendrier!N1","v":365},{"$f":"MAI!I7","v":116.5},{"$f":"SUM(J8:J15)","v":27},{"$f":"H7-(I7+J7)","v":221.5},null,{"$f":"SUM(M8:M15)","v":143.5},null,null,null,{"$f":"MAI!M7","v":147.5}]
[null,null,null,null,null,"1/2CA","CA",{"$f":"Calendrier!N5","v":25},{"$f":"MAI!I8","v":0},{"$f":"COUNTIF($J$19:$J$49,G8)+COUNTIF($J$19:$J$49,F8)/2","v":0},{"$f":"+H8-(I8+J8)","v":25},"J",{"$f":"+I8+J8","v":0},null,null,null,{"$f":"MAI!M8","v":1}]
[null,null,null,null,null,"1/2RTT","RTT",{"$f":"Calendrier!N8","v":9},{"$f":"MAI!I9","v":3},{"$f":"COUNTIF($J$19:$J$49,G9)+COUNTIF($J$19:$J$49,F9)/2","v":0},{"$f":"+H9-(I9+J9)","v":6},"J",3,null,null,null,{"$f":"MAI!M9","v":3},{"$f":"IF(COUNTA($C$27:$F$27)=0,0,\"suite\")","v":0}]
[null,null,null,null,null,"1/2CS","CS",{"$f":"Calendrier!N9","v":0},{"$f":"MAI!I10","v":0},0,{"$f":"H10-(I10+J10)","v":0},"J",0,null,null,null,{"$f":"MAI!M10","v":0},{"$f":"IF(AND(C27<>0,D27=0,E27=0,F27<>0),F27-C27-M27-IF(OR(AND(C27=5,F27=13),AND(C27=13,F27=21),AND(C27=21,F27=5)),0,Calendrier!$AT$10),\"suite\")","v":"suite"}]
{"$rows_left_out":41}
{"sheet":"JUL","index":9,"n_rows":50,"n_cols":15,"rows_kept":50,"cut":false,"hidden":false,"merged":[]}
[null,{"$f":"RIGHT(CELL(\"nomfichier\",$A$1),3)","v":"JUL"},"FICHE DE SUIVI HORAIRE"]
[]
[null,"mois :","JUILLET",null,null,"année ",{"$f":"VLOOKUP(C3,Fériés!$I$1:$J$12,2,FALSE)","v":2023},null,null,"service",{"$f":"Calendrier!F4","v":"Administratif"}]
[]
[null,"nom :",{"$f":"Calendrier!F2","v":"Isq"},null,null," prénom ",{"$f":"Calendrier!F3","v":"Philippe"},null,null,"N° Ident",{"$f":"Calendrier!F1","v":"T506489"}]
[null,null,null,null,null,null,null,"à réaliser","cumul","en cours","reste",null,"N.cumul"]
[null,null,null,"Nb J",{"$f":"Calendrier!$AT$11","v":218},{"$f":"+$H$10","v":0},{"$f":"E7-F7","v":218},{"$f":"Calendrier!N1","v":365},{"$f":"JUN!M7","v":143.5},{"$f":"SUM(J8:J15)","v":31},{"$f":"H7-(I7+J7)","v":190.5},null,{"$f":"SUM(M8:M15)","v":174.5}]
[null,null,null,null,null,"1/2CA","CA",{"$f":"Calendrier!N5","v":25},{"$f":"JUN!M8","v":0},{"$f":"COUNTIF($J$19:$J$49,G8)+COUNTIF($J$19:$J$49,F8)/2","v":1},{"$f":"+H8-(I8+J8)","v":24},"J",{"$f":"+I8+J8","v":1}]
[null,null,null,null,null,"1/2RTT","RTT",{"$f":"Calendrier!N8","v":9},{"$f":"JUN!M9","v":3},{"$f":"COUNTIF($J$19:$J$49,G9)+COUNTIF($J$19:$J$49,F9)/2","v":0},{"$f":"+H9-(I9+J9)","v":6},"J",3]
[null,null,null,null,null,"1/2CS","CS",{"$f":"Calendrier!N9","v":0},{"$f":"JUN!M10","v":0},0,{"$f":"H10-(I10+J10)","v":0},"J",0]
{"$rows_left_out":41}
{"sheet":"AOU","index":10,"n_rows":50,"n_cols":15,"rows_kept":50,"cut":false,"hidden":false,"merged":[]}
[null,{"$f":"RIGHT(CELL(\"nomfichier\",$A$1),3)","v":"AOU"},"FICHE DE SUIVI HORAIRE"]
[]
[null,"mois :","AOUT",null,null,"année ",{"$f":"VLOOKUP(C3,Fériés!$I$1:$J$12,2,FALSE)","v":2023},null,null,"service",{"$f":"Calendrier!F4","v":"Administratif"}]
[]
[null,"nom :",{"$f":"Calendrier!F2","v":"Isq"},null,null," prénom ",{"$f":"Calendrier!F3","v":"Philippe"},null,null,"N° Ident",{"$f":"Calendrier!F1","v":"T506489"}]
[null,null,null,null,null,null,null,"à réaliser","cumul","en cours","reste",null,"N.cumul"]
[null,null,null,"Nb J",{"$f":"Calendrier!$AT$11","v":218},{"$f":"+$H$10","v":0},{"$f":"E7-F7","v":218},{"$f":"Calendrier!N1","v":365},{"$f":"JUL!M7","v":174.5},{"$f":"SUM(J8:J15)","v":31},{"$f":"H7-(I7+J7)","v":159.5},null,{"$f":"SUM(M8:M15)","v":205.5}]
[null,null,null,null,null,"1/2CA","CA",{"$f":"Calendrier!N5","v":25},{"$f":"JUL!M8","v":1},{"$f":"COUNTIF($J$19:$J$49,G8)+COUNTIF($J$19:$J$49,F8)/2","v":18},{"$f":"+H8-(I8+J8)","v":6},"J",{"$f":"+I8+J8","v":19}]
[null,null,null,null,null,"1/2RTT","RTT",{"$f":"Calendrier!N8","v":9},{"$f":"JUL!M9","v":3},{"$f":"COUNTIF($J$19:$J$49,G9)+COUNTIF($J$19:$J$49,F9)/2","v":0},{"$f":"+H9-(I9+J9)","v":6},"J",3]
[null,null,null,null,null,"1/2CS","CS",{"$f":"Calendrier!N9","v":0},{"$f":"JUL!M10","v":0},0,{"$f":"H10-(I10+J10)","v":0},"J",0]
{"$rows_left_out":41}
{"sheet":"SEP","index":11,"n_rows":50,"n_cols":15,"rows_kept":50,"cut":false,"hidden":false,"merged":[]}
[null,{"$f":"RIGHT(CELL(\"nomfichier\",$A$1),3)","v":"SEP"},"FICHE DE SUIVI HORAIRE"]
[]
[null,"mois :","SEPTEMBRE",null,null,"année ",{"$f":"VLOOKUP(C3,Fériés!$I$1:$J$12,2,FALSE)","v":2023},null,null,"service",{"$f":"Calendrier!F4","v":"Administratif"}]
[]
[null,"nom :",{"$f":"Calendrier!F2","v":"Isq"},null,null," prénom ",{"$f":"Calendrier!F3","v":"Philippe"},null,null,"N° Ident",{"$f":"Calendrier!F1","v":"T506489"}]
[null,null,null,null,null,null,null,"à réaliser","cumul","en cours","reste",null,"N.cumul"]
[null,null,null,"Nb J",{"$f":"Calendrier!$AT$11","v":218},{"$f":"+$H$10","v":0},{"$f":"E7-F7","v":218},{"$f":"Calendrier!N1","v":365},{"$f":"AOU!M7","v":205.5},{"$f":"SUM(J8:J15)","v":30},{"$f":"H7-(I7+J7)","v":129.5},null,{"$f":"SUM(M8:M15)","v":235.5}]
[null,null,null,null,null,"1/2CA","CA",{"$f":"Calendrier!N5","v":25},{"$f":"AOU!M8","v":19},{"$f":"COUNTIF($J$19:$J$49,G8)+COUNTIF($J$19:$J$49,F8)/2","v":0},{"$f":"+H8-(I8+J8)","v":6},"J",{"$f":"+I8+J8","v":19}]
[null,null,null,null,null,"1/2RTT","RTT",{"$f":"Calendrier!N8","v":9},{"$f":"AOU!M9","v":3},{"$f":"COUNTIF($J$19:$J$49,G9)+COUNTIF($J$19:$J$49,F9)/2","v":1},{"$f":"+H9-(I9+J9)","v":5},"J",4]
[null,null,null,null,null,"1/2CS","CS",{"$f":"Calendrier!N9","v":0},{"$f":"AOU!M10","v":0},0,{"$f":"H10-(I10+J10)","v":0},"J",0]
{"$rows_left_out":41}
{"sheet":"OCT","index":12,"n_rows":50,"n_cols":15,"rows_kept":50,"cut":false,"hidden":false,"merged":[]}
[null,{"$f":"RIGHT(CELL(\"nomfichier\",$A$1),3)","v":"OCT"},"FICHE DE SUIVI HORAIRE"]
[]
[null,"mois :","OCTOBRE",null,null,"année ",{"$f":"VLOOKUP(C3,Fériés!$I$1:$J$12,2,FALSE)","v":2023},null,null,"service",{"$f":"Calendrier!F4","v":"Administratif"}]
[]
[null,"nom :",{"$f":"Calendrier!F2","v":"Isq"},null,null," prénom ",{"$f":"Calendrier!F3","v":"Philippe"},null,null,"N° Ident",{"$f":"Calendrier!F1","v":"T506489"}]
[null,null,null,null,null,null,"type","à réaliser","cumul","en cours","reste",null,"N.cumul"]
[null,null,null,"Nb J",{"$f":"Calendrier!$AT$11","v":218},{"$f":"+$H$10","v":0},{"$f":"E7-F7","v":218},{"$f":"Calendrier!N1","v":365},{"$f":"SEP!M7","v":235.5},{"$f":"SUM(J8:J15)","v":31},{"$f":"H7-(I7+J7)","v":98.5},null,{"$f":"SUM(M8:M15)","v":266.5}]
[null,null,null,null,null,"1/2CA","CA",{"$f":"Calendrier!N5","v":25},{"$f":"SEP!M8","v":19},{"$f":"COUNTIF($J$19:$J$49,G8)+COUNTIF($J$19:$J$49,F8)/2","v":0},{"$f":"+H8-(I8+J8)","v":6},"J",{"$f":"+I8+J8","v":19}]
[null,null,null,null,null,"1/2RTT","RTT",{"$f":"Calendrier!N8","v":9},{"$f":"SEP!M9","v":4},{"$f":"COUNTIF($J$19:$J$49,G9)+COUNTIF($J$19:$J$49,F9)/2","v":1},{"$f":"+H9-(I9+J9)","v":4},"J",5]
[null,null,null,null,null,"1/2CS","CS",{"$f":"Calendrier!N9","v":0},{"$f":"SEP!M10","v":0},0,{"$f":"H10-(I10+J10)","v":0},"J",0]
{"$rows_left_out":41}
{"sheet":"NOV","index":13,"n_rows":50,"n_cols":15,"rows_kept":50,"cut":false,"hidden":false,"merged":[]}
[null,{"$f":"RIGHT(CELL(\"nomfichier\",$A$1),3)","v":"NOV"},"FICHE DE SUIVI HORAIRE"]
[]
[null,"mois :","NOVEMBRE",null,null,"année ",{"$f":"VLOOKUP(C3,Fériés!$I$1:$J$12,2,FALSE)","v":2023},null,null,"service",{"$f":"Calendrier!F4","v":"Administratif"}]
[]
[null,"nom :",{"$f":"Calendrier!F2","v":"Isq"},null,null," prénom ",{"$f":"Calendrier!F3","v":"Philippe"},null,null,"N° Ident",{"$f":"Calendrier!F1","v":"T506489"}]
[null,null,null,null,null,null,null,"à réaliser","cumul","en cours","reste",null,"N.cumul"]
[null,null,null,"Nb J",{"$f":"Calendrier!$AT$11","v":218},{"$f":"+$H$10","v":0},{"$f":"E7-F7","v":218},{"$f":"Calendrier!N1","v":365},{"$f":"OCT!M7","v":266.5},{"$f":"SUM(J8:J15)","v":30},{"$f":"H7-(I7+J7)","v":68.5},null,{"$f":"SUM(M8:M15)","v":296.5}]
[null,null,null,null,null,"1/2CA","CA",{"$f":"Calendrier!N5","v":25},{"$f":"OCT!M8","v":19},{"$f":"COUNTIF($J$19:$J$49,G8)+COUNTIF($J$19:$J$49,F8)/2","v":0},{"$f":"+H8-(I8+J8)","v":6},"J",{"$f":"+I8+J8","v":19}]
[null,null,null,null,null,"1/2RTT","RTT",{"$f":"Calendrier!N8","v":9},{"$f":"OCT!M9","v":5},{"$f":"COUNTIF($J$19:$J$49,G9)+COUNTIF($J$19:$J$49,F9)/2","v":1},{"$f":"+H9-(I9+J9)","v":3},"J",6]
[null,null,null,null,null,"1/2CS","CS",{"$f":"Calendrier!N9","v":0},{"$f":"OCT!M10","v":0},0,{"$f":"H10-(I10+J10)","v":0},"J",0]
{"$rows_left_out":41}
{"sheet":"DEC","index":14,"n_rows":50,"n_cols":17,"rows_kept":50,"cut":false,"hidden":false,"merged":[]}
[null,{"$f":"RIGHT(CELL(\"nomfichier\",$A$1),3)","v":"DEC"},"FICHE DE SUIVI HORAIRE"]
[]
[null,"mois :","DECEMBRE",null,null,"année ",{"$f":"VLOOKUP(C3,Fériés!$I$1:$J$12,2,FALSE)","v":2023},null,null,"service",{"$f":"Calendrier!F4","v":"Administratif"}]
[]
[null,"nom :",{"$f":"Calendrier!F2","v":"Isq"},null,null," prénom ",{"$f":"Calendrier!F3","v":"Philippe"},null,null,"N° Ident",{"$f":"Calendrier!F1","v":"T506489"}]
[null,null,null,null,null,null,null,"à réaliser","cumul","en cours","reste",null,"N.cumul"]
[null,null,null,"Nb J",{"$f":"Calendrier!$AT$11","v":218},{"$f":"+$H$10","v":0},{"$f":"E7-F7","v":218},{"$f":"Calendrier!N1","v":365},{"$f":"NOV!M7","v":296.5},{"$f":"SUM(J8:J15)","v":31},{"$f":"H7-(I7+J7)","v":37.5},null,{"$f":"SUM(M8:M15)","v":327.5}]
[null,null,null,null,null,"1/2CA","CA",{"$f":"Calendrier!N5","v":25},{"$f":"NOV!M8","v":19},{"$f":"COUNTIF($J$19:$J$49,G8)+COUNTIF($J$19:$J$49,F8)/2","v":5},{"$f":"+H8-(I8+J8)","v":1},"J",{"$f":"+I8+J8","v":24}]
[null,null,null,null,null,"1/2RTT","RTT",{"$f":"Calendrier!N8","v":9},{"$f":"NOV!M9","v":6},{"$f":"COUNTIF($J$19:$J$49,G9)+COUNTIF($J$19:$J$49,F9)/2","v":1},{"$f":"+H9-(I9+J9)","v":2},"J",7]
[null,null,null,null,null,"1/2CS","CS",{"$f":"Calendrier!N9","v":0},{"$f":"NOV!M10","v":0},0,{"$f":"H10-(I10+J10)","v":0},"J",0]
{"$rows_left_out":41}
{"sheet":"Fériés","index":15,"n_rows":32,"n_cols":13,"rows_kept":32,"cut":false,"hidden":false,"merged":[]}
[{"$f":"Calendrier!A1","v":2023},{"$f":"A1+1","v":2024},null,null,null,null,1,{"$f":"IF(MONTH(Calendrier!$B$13)<10,0&MONTH(Calendrier!$B$13),MONTH(Calendrier!$B$13))","v":"01"},{"$f":"CHOOSE(H1,\"Janvier\",\"Fevrier\",\"Mars\",\"Avril\",\"Mai\",\"Juin\",\"Juillet\",\"Aout\",\"septembre\",\"Octobre\",\"Novembre\",\"Decembre\")","v":"Janvier"},{"$f":"AN_1","v":2023},"01","janvier",{"$f":"DAY(EOMONTH(DATE(AN_1,G1,1),0))","v":31}]
[{"$f":"VALUE(\"01/01/\"&AN_1)","v":"2023-01-01"},"Jour de l'an",null,null,null,null,2,{"$f":"IF(H1+1>12,\"01\",IF(H1+1<10,\"0\"&H1+1,H1+1))","v":"02"},{"$f":"CHOOSE(H2,\"Janvier\",\"Fevrier\",\"Mars\",\"Avril\",\"Mai\",\"Juin\",\"Juillet\",\"Aout\",\"septembre\",\"Octobre\",\"Novembre\",\"Decembre\")","v":"Fevrier"},{"$f":"IF(CHOOSE(VALUE(H2),1,2,3,4,5,6,7,8,9,10,11,12)>=CHOOSE(VALUE($H$1),1,2,3,4,5,6,7,8,9,10,11,12),AN_1,AN_2)","v":2023},"02","fevrier",28]
[null,"Vendredi saint",{"$f":"$A$4-2","v":45023},null,null,null,3,"03","Mars",2023,"03","mars",31]
[{"$f":"ROUND((\"4/\"&AN_1)/7+MOD(19*MOD(AN_1,19)-7,30)*14%,)*7-6","v":"2023-04-09"},"Pâques",null,null,null,null,4,"04","Avril",2023,"04","avril",30]
[{"$f":"A4+1","v":"2023-04-10"},"lundi Pâques",null,null,null,null,5,"05","Mai",2023,"05","mai",31]
[{"$f":"VALUE(\"01/05/\"&AN_1)","v":"2023-05-01"},"Fête du travail",null,null,null,null,6,"06","Juin",2023,"06","juin",30]
[{"$f":"VALUE(\"08/05/\"&AN_1)","v":"2023-05-08"},"Victoire 1945",null,null,null,null,7,"07",{"$f":"CHOOSE(H7,\"Janvier\",\"Fevrier\",\"Mars\",\"Avril\",\"Mai\",\"Juin\",\"Juillet\",\"Aout\",\"septembre\",\"Octobre\",\"Novembre\",\"Decembre\")","v":"Juillet"},2023,"07","juillet",31]
[{"$f":"A4+39","v":"2023-05-18"},"jeudi ascension",null,null,null,null,8,{"$f":"IF(H7+1>12,\"01\",IF(H7+1<10,\"0\"&H7+1,H7+1))","v":"08"},{"$f":"CHOOSE(H8,\"Janvier\",\"Fevrier\",\"Mars\",\"Avril\",\"Mai\",\"Juin\",\"Juillet\",\"Aout\",\"septembre\",\"Octobre\",\"Novembre\",\"Decembre\")","v":"Aout"},2023,"08","août",31]
[{"$f":"A4+49","v":"2023-05-28"},"Pentecôte",null,null,null,null,9,{"$f":"IF(H8+1>12,\"01\",IF(H8+1<10,\"0\"&H8+1,H8+1))","v":"09"},"septembre",2023,"09","septembre",30]
[null,"lundi de Pentecôte",null,null,null,null,10,10,"Octobre",2023,"10","octobre",31]
{"$rows_left_out":23}
{"sheet":"Lisez_moi","index":16,"n_rows":0,"n_cols":0,"rows_kept":0,"cut":false,"hidden":false,"merged":[]}