{"text_format":"1","workbook":"xlsx","n_sheets":8,"sheets":["Feuil1","Étape 1","Fin","Mes Jeux","Feuil2","Feuil3","Feuil4","TEST"],"not_rendered":{"charts":0,"images":24,"macros":1,"external_links":1,"defined_names":2,"comments":0,"pivot_tables":0},"unopened":[],"bounds":{"document_bytes":16777216,"sheet_cells":100000,"rows_first":2000,"rows_last":500,"rows_between":2000,"halvings":0,"cell_chars":16384,"cell_head_chars":4096},"cells_cut":0,"cells_raw":0,"read":"whole","date_system":"1900"}

{"sheet":"Feuil1","index":0,"n_rows":0,"n_cols":0,"rows_kept":0,"cut":false,"hidden":false,"merged":[]}

{"sheet":"Étape 1","index":1,"n_rows":18,"n_cols":9,"rows_kept":18,"cut":false,"hidden":false,"merged":[]}
[]
[]
[]
[null,"RxCx","Heure","Reunion","Course 2022","Partant","Distance","Allocation","Type"]
[null,"R2C2","12H30","TONGRES","PRIX-L-HELICONIA-BELGIQUE",10,"2650m",2500,"Attelé"]
[null,"R3C1","12H45","NANTES","PRIX-FAUCHELEVENT",10,"1400m",18000,"Plat"]
[null,"R3C2","13H15","NANTES","PRIX-DE-SAINTE-ANNE",8,"1400m",18000,"Plat"]
[null,"R4C1","14H07","LISIEUX","PRIX-DE-PONT-L-EVEQUE",12,"2675m",6000,"Attelé"]
[null,"R3C4","14H24","NANTES","PRIX-JULES-VERNE",8,"1600m",18000,"Plat"]
[null,"R4C3","15H15","LISIEUX","PRIX-DES-VANS-BARBOT",12,"2725m",20000,"Monté"]
[null,"R6C3","15H25","NEWMARKET-JULY","CLOSE-BROTHERS-JULY-STAKES-(CLASS-1)-(GROUP-2)",8,"1200m",100000,"Plat"]
[null,"R4C4","15H49","LISIEUX","PRIX-DE-BLANGY-LE-CHATEAU",11,"2725m",19000,"Attelé"]
[null,"R3C8","16H40","NANTES","PRIX-ELM-PARK",10,"3100m",17000,"Plat"]
[null,"R4C7","17H32","LISIEUX","PRIX-LES-BRUYERES-CARRE",12,"2675m",28000,"Attelé"]
[null,"R1C2","17H50","PARISLONGCHAMP","PRIX-DU-JARDIN-DE-L-AVRE (Pick5)",11,"1850m",28000,"Plat"]
[null,"R5C1","18H42","VICHY","PRIX-HOTEL-DES-PRINCES",10,"1609m",22000,"Attelé"]
[null,"R5C3","19H50","VICHY","PRIX-CENTRE-FRANCE-LA-MONTAGNE",8,"1609m",22000,"Attelé"]
[null,"R5C4","20H32","VICHY","KRAFFT-SPEED-CUP",11,"1609m",36000,"Attelé"]

{"sheet":"Fin","index":2,"n_rows":39,"n_cols":21,"rows_kept":39,"cut":false,"hidden":false,"merged":[]}
[]
[]
[null,null,"RCRX","HIPPODROME","DÉPART","DISC","PART","CHEVAL","POSITION","MUSIQUE","MUSIQUE","MUSIQUE","RÉSULTAT",null,null,null,null,null,null,1,2]
[null,null,null,null,null,null,null,null,null,null,null,null,null,null,null,null,null,null,null,2,3]
[null,null,"R2C2","TONGRES","12H30","Attelé",10,null,3,null,null,null,{"$f":"IF(COUNTIF(J5:L5,1)+COUNTIF(J5:L5,2)+COUNTIF(J5:L5,3)>=2,\"J\",\"L\")","v":"L"},null,null,null,null,null,null,3,2]
[null,null,"R3C1","NANTES","12H45","Plat",10,null,2,null,null,null,{"$f":"IF(COUNTIF(J6:L6,1)+COUNTIF(J6:L6,2)+COUNTIF(J6:L6,3)>=2,\"J\",\"L\")","v":"L"},null,null,null,null,null,null,4,2]
[null,null,"R3C2","NANTES","13H15","Plat",8,null,3,null,null,null,"L",null,null,null,null,null,null,5,1]
[null,null,"R4C1","LISIEUX","14H07","Attelé",12,null,2,null,null,null,"L",null,null,null,null,null,null,6,1]
[null,null,"R3C4","NANTES","14H24","Plat",8,null,2,null,null,null,"L",null,null,null,null,null,null,7,2]
[null,null,"R4C3","LISIEUX","15H15","Monté",12,null,2,null,null,null,"L",null,null,null,null,null,null,8,1]
[null,null,"R6C3","NEWMARKET-JULY","15H25","Plat",8,null,2,null,null,null,"L"]
[null,null,"R4C4","LISIEUX","15H49","Attelé",11,null,2,null,null,null,"L"]
[null,null,"R3C8","NANTES","16H40","Plat",10,null,1,null,null,null,"L"]
[null,null,"R4C7","LISIEUX","17H32","Attelé",12,null,2,null,null,null,"L"]
[null,null,"R1C2","PARISLONGCHAMP","17H50","Plat",11,null,3,null,null,null,"L"]
[null,null,"R5C1","VICHY","18H42","Attelé",10,null,2,null,null,null,"L"]
[null,null,"R5C3","VICHY","19H50","Attelé",8,null,2,null,null,null,"L"]
[null,null,"R5C4","VICHY","20H32","Attelé",11,null,2,null,null,null,"L"]
[null,null,null,null,null,null,null,null,null,null,null,null,"L"]
[null,null,null,null,null,null,null,null,null,null,null,null,"L"]
[null,null,null,null,null,null,null,null,null,null,null,null,"L"]
[null,null,null,null,null,null,null,null,null,null,null,null,"L"]
[null,null,null,null,null,null,null,null,null,null,null,null,"L"]
[null,null,null,null,null,null,null,null,null,null,null,null,"L"]
[null,null,null,null,null,null,null,null,null,null,null,null,"L"]
[null,null,null,null,null,null,null,null,null,null,null,null,"L"]
[null,null,null,null,null,null,null,null,null,null,null,null,"L"]
[null,null,null,null,null,null,null,null,null,null,null,null,"L"]
[null,null,null,null,null,null,null,null,null,null,null,null,"L"]
[null,null,null,null,null,null,null,null,null,null,null,null,"L"]
[null,null,null,null,null,null,null,null,null,null,null,null,"L"]
[null,null,null,null,null,null,null,null,null,null,null,null,"L"]
[null,null,null,null,null,null,null,null,null,null,null,null,"L"]
[null,null,null,null,null,null,null,null,null,null,null,null,"L"]
[null,null,null,null,null,null,null,null,null,null,null,null,"L"]
[null,null,null,null,null,null,null,null,null,null,null,null,"L"]
[null,null,null,null,null,null,null,null,null,null,null,null,"L"]
[null,null,null,null,null,null,null,null,null,null,null,null,"L"]
[null,null,null,null,null,null,null,null,null,null,null,null,"L"]

{"sheet":"Mes Jeux","index":3,"n_rows":37,"n_cols":13,"rows_kept":37,"cut":false,"hidden":false,"merged":[]}
[]
[null,null,"RCRX","HIPPODROME","DÉPART","DISC","PART","CHEVAL",null,"RCRX","HIPPODROME","DÉPART","CHEVAL"]
[]
[null,null,"R3C2","LA-TESTE","12H15","Haies",8,3,null,{"$f":"Fin!C5","v":"R2C2"},{"$f":"Fin!D5","v":"TONGRES"},{"$f":"Fin!E5","v":"12H30"},{"$f":"Fin!H5","v":0}]
[null,null,"R2C5","SENONNES-POUANCE","14H02","Plat",9,6,null,{"$f":"Fin!C6","v":"R3C1"},{"$f":"Fin!D6","v":"NANTES"},{"$f":"Fin!E6","v":"12H45"},{"$f":"Fin!H6","v":0}]
[null,null,"R3C8","LA-TESTE","15H30","Plat",12,3,null,{"$f":"Fin!C7","v":"R3C2"},{"$f":"Fin!D7","v":"NANTES"},{"$f":"Fin!E7","v":"13H15"},{"$f":"Fin!H7","v":0}]
[null,null,"R5C7","HAPPY-VALLEY","15H45","Plat",12,7,null,{"$f":"Fin!C8","v":"R4C1"},{"$f":"Fin!D8","v":"LISIEUX"},{"$f":"Fin!E8","v":"14H07"},{"$f":"Fin!H8","v":0}]
[null,null,"R1C1","ENGHIEN","16H40","Attelé",8,2,null,{"$f":"Fin!C9","v":"R3C4"},{"$f":"Fin!D9","v":"NANTES"},{"$f":"Fin!E9","v":"14H24"},{"$f":"Fin!H9","v":0}]
[null,null,"R4C2","HYERES","16H57","Attelé",9,3,null,{"$f":"Fin!C10","v":"R4C3"},{"$f":"Fin!D10","v":"LISIEUX"},{"$f":"Fin!E10","v":"15H15"},{"$f":"Fin!H10","v":0}]
[null,null,"R4C3","HYERES","17H32","Attelé",12,3,null,{"$f":"Fin!C11","v":"R6C3"},{"$f":"Fin!D11","v":"NEWMARKET-JULY"},{"$f":"Fin!E11","v":"15H25"},{"$f":"Fin!H11","v":0}]
[null,null,"R1C3","ENGHIEN","17H50","Attelé",10,4,null,{"$f":"Fin!C12","v":"R4C4"},{"$f":"Fin!D12","v":"LISIEUX"},{"$f":"Fin!E12","v":"15H49"},{"$f":"Fin!H12","v":0}]
[null,null,"R4C7","HYERES","19H50","Attelé",11,5,null,{"$f":"Fin!C13","v":"R3C8"},{"$f":"Fin!D13","v":"NANTES"},{"$f":"Fin!E13","v":"16H40"},{"$f":"Fin!H13","v":0}]
[null,null,"R1C8","ENGHIEN","20H45","Attelé",9,2,null,{"$f":"Fin!C14","v":"R4C7"},{"$f":"Fin!D14","v":"LISIEUX"},{"$f":"Fin!E14","v":"17H32"},{"$f":"Fin!H14","v":0}]
[null,null,null,null,null,null,null,null,null,{"$f":"Fin!C15","v":"R1C2"},{"$f":"Fin!D15","v":"PARISLONGCHAMP"},{"$f":"Fin!E15","v":"17H50"},{"$f":"Fin!H15","v":0}]
[null,null,null,null,null,null,null,null,null,{"$f":"Fin!C16","v":"R5C1"},{"$f":"Fin!D16","v":"VICHY"},{"$f":"Fin!E16","v":"18H42"},{"$f":"Fin!H16","v":0}]
[null,null,null,null,null,null,null,null,null,{"$f":"Fin!C17","v":"R5C3"},{"$f":"Fin!D17","v":"VICHY"},{"$f":"Fin!E17","v":"19H50"},{"$f":"Fin!H17","v":0}]
[null,null,null,null,null,null,null,null,null,{"$f":"Fin!C18","v":"R5C4"},{"$f":"Fin!D18","v":"VICHY"},{"$f":"Fin!E18","v":"20H32"},{"$f":"Fin!H18","v":0}]
[null,null,null,null,null,null,null,null,null,{"$f":"Fin!C19","v":0},{"$f":"Fin!D19","v":0},{"$f":"Fin!E19","v":0},{"$f":"Fin!H19","v":0}]
[null,null,null,null,null,null,null,null,null,{"$f":"Fin!C20","v":0},{"$f":"Fin!D20","v":0},{"$f":"Fin!E20","v":0},{"$f":"Fin!H20","v":0}]
[null,null,null,null,null,null,null,null,null,{"$f":"Fin!C21","v":0},{"$f":"Fin!D21","v":0},{"$f":"Fin!E21","v":0},{"$f":"Fin!H21","v":0}]
[null,null,null,null,null,null,null,null,null,{"$f":"Fin!C22","v":0},{"$f":"Fin!D22","v":0},{"$f":"Fin!E22","v":0},{"$f":"Fin!H22","v":0}]
[null,null,null,null,null,null,null,null,null,{"$f":"Fin!C23","v":0},{"$f":"Fin!D23","v":0},{"$f":"Fin!E23","v":0},{"$f":"Fin!H23","v":0}]
[null,null,null,null,null,null,null,null,null,{"$f":"Fin!C24","v":0},{"$f":"Fin!D24","v":0},{"$f":"Fin!E24","v":0},{"$f":"Fin!H24","v":0}]
[null,null,null,null,null,null,null,null,null,{"$f":"Fin!C25","v":0},{"$f":"Fin!D25","v":0},{"$f":"Fin!E25","v":0},{"$f":"Fin!H25","v":0}]
[null,null,null,null,null,null,null,null,null,{"$f":"Fin!C26","v":0},{"$f":"Fin!D26","v":0},{"$f":"Fin!E26","v":0},{"$f":"Fin!H26","v":0}]
[null,null,null,null,null,null,null,null,null,{"$f":"Fin!C27","v":0},{"$f":"Fin!D27","v":0},{"$f":"Fin!E27","v":0},{"$f":"Fin!H27","v":0}]
[null,null,null,null,null,null,null,null,null,{"$f":"Fin!C28","v":0},{"$f":"Fin!D28","v":0},{"$f":"Fin!E28","v":0},{"$f":"Fin!H28","v":0}]
[null,null,null,null,null,null,null,null,null,{"$f":"Fin!C29","v":0},{"$f":"Fin!D29","v":0},{"$f":"Fin!E29","v":0},{"$f":"Fin!H29","v":0}]
[null,null,null,null,null,null,null,null,null,{"$f":"Fin!C30","v":0},{"$f":"Fin!D30","v":0},{"$f":"Fin!E30","v":0},{"$f":"Fin!H30","v":0}]
[null,null,null,null,null,null,null,null,null,{"$f":"Fin!C31","v":0},{"$f":"Fin!D31","v":0},{"$f":"Fin!E31","v":0},{"$f":"Fin!H31","v":0}]
[null,null,null,null,null,null,null,null,null,{"$f":"Fin!C32","v":0},{"$f":"Fin!D32","v":0},{"$f":"Fin!E32","v":0},{"$f":"Fin!H32","v":0}]
[null,null,null,null,null,null,null,null,null,{"$f":"Fin!C33","v":0},{"$f":"Fin!D33","v":0},{"$f":"Fin!E33","v":0},{"$f":"Fin!H33","v":0}]
[null,null,null,null,null,null,null,null,null,{"$f":"Fin!C34","v":0},{"$f":"Fin!D34","v":0},{"$f":"Fin!E34","v":0},{"$f":"Fin!H34","v":0}]
[null,null,null,null,null,null,null,null,null,{"$f":"Fin!C35","v":0},{"$f":"Fin!D35","v":0},{"$f":"Fin!E35","v":0},{"$f":"Fin!H35","v":0}]
[null,null,null,null,null,null,null,null,null,{"$f":"Fin!C36","v":0},{"$f":"Fin!D36","v":0},{"$f":"Fin!E36","v":0},{"$f":"Fin!H36","v":0}]
[null,null,null,null,null,null,null,null,null,{"$f":"Fin!C37","v":0},{"$f":"Fin!D37","v":0},{"$f":"Fin!E37","v":0},{"$f":"Fin!H37","v":0}]
[null,null,null,null,null,null,null,null,null,{"$f":"Fin!C38","v":0},{"$f":"Fin!D38","v":0},{"$f":"Fin!E38","v":0},{"$f":"Fin!H38","v":0}]

{"sheet":"Feuil2","index":4,"n_rows":38,"n_cols":30,"rows_kept":38,"cut":false,"hidden":false,"merged":[]}
[]
[]
[]
[null,null,null,null,null,null,null,null,null,null,null,null,null,null,null,null,null,null,null,null,null,null,{"$f":"SUM(V9:V39)","v":0}]
[]
[null,null,null,null,null,null,null,null,null,null,null,null,null,null,null,null,null,null,null,null,null,null,null,null,{"$f":"100%-N28","v":{"$error":"#DIV/0!"}},{"$f":"N28","v":{"$error":"#DIV/0!"}}]
[null,null,null,null,null,null,null,null,null,null,null,null,null,null,null,null,null,"JOUR","GAIN"]
[null,null,null,null,null,null,null,null,null,null,null,null,null,null,null,null,null,1,240,null,{"$f":"SUM(S8:S38)","v":780},null,null,null,null,null,null,null,null,{"$f":"SUM(S8:S38)","v":780}]
[null,null,null,null,null,null,null,null,null,null,null,null,null,null,null,null,null,2]
[null,null,"Course","Favoris",null,null,null,null,null,null,null,null,null,null,null,null,null,3]
[null,null,null,null,null,null,null,null,null,null,null,null,null,null,null,null,null,4,180]
[null,null,8,{"$f":"Feuil3!R30","v":1},{"$f":"Feuil3!S30","v":4},{"$f":"Feuil3!T30","v":3},null,null,null,null,null,null,null,null,null,null,null,5,120]
[null,null,null,null,null,null,null,null,null,null,null,null,null,null,null,null,null,6,240]
[null,null,null,null,null,null,null,null,null,null,null,null,null,null,null,null,null,7]
[null,null,null,null,null,null,null,null,null,null,null,null,null,null,null,null,null,8]
[null,null,null,null,null,null,null,null,null,null,null,null,null,null,null,null,null,9]
[null,null,null,null,null,null,null,null,null,null,null,null,null,null,null,null,null,10]
[null,null,null,null,null,null,{"$f":"INDEX(Total,MATCH(D12,Feuil3!$R$30:$T$30,0))","v":31.000399999999999},{"$f":"INDEX(Total,MATCH(E12,Feuil3!$R$30:$T$30,0))","v":30.000699999999998},{"$f":"INDEX(Total,MATCH(F12,Feuil3!$R$30:$T$30,0))","v":25.000599999999999},null,null,null,null,null,null,null,null,11]
[null,null,null,null,null,null,null,null,null,null,null,null,null,null,null,null,null,12]
[null,null,null,null,null,null,null,null,null,null,null,null,null,null,null,null,null,13]
[null,null,null,null,null,null,null,null,null,null,null,null,null,null,null,null,null,14]
[null,null,null,null,null,null,null,null,null,null,null,null,null,null,null,null,null,15]
[null,null,null,null,null,null,null,null,null,null,null,null,null,null,null,null,null,16]
[null,null,null,null,null,null,null,null,null,null,null,null,null,null,null,null,null,17]
[null,null,null,null,null,null,null,null,null,null,null,null,null,null,null,null,null,18]
[null,null,null,null,null,null,null,null,null,null,null,null,null,null,null,null,null,19]
[null,null,null,null,null,null,null,null,null,null,null,null,null,null,null,null,null,20]
[null,null,null,null,null,null,null,null,null,null,null,null,null,{"$f":"(W4)/(I11)","v":{"$error":"#DIV/0!"}},null,null,null,21]
[null,null,null,null,null,null,null,null,null,null,null,null,null,null,null,null,null,22]
[null,null,null,null,null,null,null,null,null,null,null,null,null,null,null,null,null,23]
[null,null,null,null,null,null,null,null,null,null,null,null,null,null,null,null,null,24]
[null,null,null,null,null,null,null,null,null,null,null,null,null,null,null,null,null,25]
[null,null,null,null,null,null,null,null,null,null,null,null,null,null,null,null,null,26]
[null,null,null,null,null,null,null,null,null,null,null,null,null,null,null,null,null,27]
[null,null,null,null,null,null,null,null,null,null,null,null,null,null,null,null,null,28]
[null,null,null,null,null,null,null,null,null,null,null,null,null,null,null,null,null,29]
[null,null,null,null,null,null,null,null,null,null,null,null,null,null,null,null,null,30]
[null,null,null,null,null,null,null,null,null,null,null,null,null,null,null,null,null,31]

{"sheet":"Feuil3","index":5,"n_rows":390,"n_cols":33,"rows_kept":390,"cut":false,"hidden":false,"merged":[[357,2,357,10],[0,2,0,10],[34,2,34,10],[64,2,64,10],[97,2,97,10],[129,2,129,10],[162,2,162,10],[194,2,194,10],[227,2,227,10],[260,2,260,10],[292,2,292,10],[325,2,325,10]]}
[null,null,"JANVIER"]
[null,null,"JOUR",1,2,3,4,5,6,7,8]
[null,null,null,null,null,null,null,null,null,null,null,null,null,null,"TOTAL",1,2,3,4,5,6,7,8]
[null,null,1,2,"P",2,1,2,1,"P",null,null,null,null,1,{"$f":"IF(COUNTIFS(D:D,$O4,$C:$C,\"<>JOUR\")=0,\"\",COUNTIFS(D:D,$O4,$C:$C,\"<>JOUR\")+ROW()/10000)","v":31.000399999999999},{"$f":"IF(COUNTIFS(E:E,$O4,$C:$C,\"<>JOUR\")=0,\"\",COUNTIFS(E:E,$O4,$C:$C,\"<>JOUR\")+ROW()/10000)","v":36.000399999999999},29.000399999999999,31.000399999999999,35.000399999999999,36.000399999999999,40.000399999999999,31.000399999999999]
[null,null,2,1,3,2,1,1,1,1,4,null,null,null,2,{"$f":"IF(COUNTIFS(D:D,$O5,$C:$C,\"<>JOUR\")=0,\"\",COUNTIFS(D:D,$O5,$C:$C,\"<>JOUR\")+ROW()/10000)","v":32.000500000000002},25.000499999999999,36.000500000000002,38.000500000000002,27.000499999999999,28.000499999999999,41.000500000000002,21.000499999999999]
[null,null,3,"P",1,"P",2,"P",1,4,null,null,null,null,3,30.000599999999999,36.000599999999999,29.000599999999999,18.000599999999999,29.000599999999999,33.000599999999999,20.000599999999999,25.000599999999999]
[null,null,4,3,2,2,3,3,"P",2,3,null,null,null,4,19.000699999999998,27.000699999999998,21.000699999999998,32.000700000000002,23.000699999999998,22.000699999999998,14.0007,30.000699999999998]
[null,null,5,"P",3,"P",1,1,1,"P",1,null,null,null,5,17.000800000000002,12.0008,19.000800000000002,13.0008,18.000800000000002,22.000800000000002,16.000800000000002,14.0008]
[null,null,6,2,"P",6,6,5,5,2,4,null,null,null,6,11.0009,15.0009,15.0009,13.0009,13.0009,7.0008999999999997,12.0009,10.0009]
[null,null,7,1,4,3,6,5,3,"P",2,null,null,null,7,"","","","","","","",""]
[null,null,8,1,4,"P",2,5,1,5,4,null,null,null,8,"","","","","","","",""]
[null,null,9,"P","P",6,4,"P",6,2,1,null,null,null,9,"","","","","","","",""]
[null,null,10,5,"P",5,2,6,4,1,"rem",null,null,null,10,"","","","","","","",""]
[null,null,11,"P",4,4,1,2,3,6,1,null,null,null,11,"","","","","","","",""]
[null,null,12,1,5,"P",4,1,5,"P",4,null,null,null,12,"","","","","","","",""]
[null,null,13,"P",1,1,2,1,1,6,2,null,null,null,13,"","","","","","","",""]
[null,null,14,6,4,5,2,3,null,5,6,null,null,null,14,"","","","","","","",""]
[null,null,15,4,2,3,6,6,2,2,2,null,null,null,15,"","","","","","","",""]
[null,null,16,2,1,"P",5,5,4,2,4,null,null,null,16,"","","","","","","",""]
[null,null,17,1,"P",6,2,6,"P",1,"P",null,null,null,17,"","","","","","","",""]
[null,null,18,1,1,3,1,6,2,4,null,null,null,null,18,"","","","","","","",""]
[null,null,19,3,2,2,6,6,3,1]
[null,null,20,5,1,3,4,4,3,2]
[null,null,21,6,"P",4,"P",6,3,"P",null,null,null,null,"Course ",1,{"$f":"P24+1","v":2},{"$f":"Q24+1","v":3},4,5,6,7,8,null,"Course ",1,{"$f":"Z24+1","v":2},{"$f":"AA24+1","v":3},{"$f":"AB24+1","v":4},{"$f":"AC24+1","v":5},{"$f":"AD24+1","v":6},{"$f":"AE24+1","v":7},{"$f":"AF24+1","v":8}]
[null,null,22,1,2,"P",4,3,4,2,1,null,null,null,1,{"$f":"INDEX($O$4:$O$21,MATCH(LARGE(P$4:P$21,$O25),P$4:P$21,0))","v":2},{"$f":"INDEX($O$4:$O$21,MATCH(LARGE(Q$4:Q$21,$O25),Q$4:Q$21,0))","v":3},2,2,1,1,2,1,null,1,2,null,2,null,1,null,2]
[null,null,23,5,4,1,2,5,4,2,null,null,null,null,2,{"$f":"INDEX($O$4:$O$21,MATCH(LARGE(P$4:P$21,$O26),P$4:P$21,0))","v":1},1,3,4,3,3,1,4,null,2,null,1,null,4,null,3,null,1]
[null,null,24,3,6,"P",3,1,1,1,1,null,null,null,3,3,4,1,1,2,2,3,3,null,3]
[null,null,25,4,2,2,5,4,6,2,1]
[null,null,26,"P",2,4,6,6,4,2,2,null,null,null,null,null,null,null,null,null,null,null,null,null,"Course ",1,{"$f":"Z29+1","v":2},{"$f":"AA29+1","v":3},{"$f":"AB29+1","v":4},{"$f":"AC29+1","v":5},{"$f":"AD29+1","v":6},{"$f":"AE29+1","v":7},{"$f":"AF29+1","v":8}]
[null,null,27,1,3,1,2,"P",6,"P",3,null,null,null,"Course",{"$f":"Feuil2!C12","v":8},null,{"$f":"INDEX(P25:W25,$P$30)","v":1},{"$f":"INDEX(P26:W26,$P$30)","v":4},{"$f":"INDEX(P27:W27,$P$30)","v":3},null,null,null,null,1]
[null,null,28,3,6,1,"P",2,"P","P",6,null,null,null,"Total",null,null,{"$f":"INDEX($P$4:$W$21,R30,$P$30)","v":31.000399999999999},{"$f":"INDEX($P$4:$W$21,S30,$P$30)","v":30.000699999999998},25.000599999999999,null,null,null,null,2,3,null,3,null,3,null,1]
[null,null,29,3,2,6,6,"P",4,2,null,null,null,null,null,null,null,null,null,null,null,null,null,null,3,null,2,null,1,null,2,null,3]
[null,null,30,2,4,"P",3,6,"P","P",5]
[null,null,31,2,4,2,4,"P","P","P",3,null,null,null,null,null,null,null,null,null,null,null,null,null,"Course ",1,{"$f":"Z34+1","v":2},{"$f":"AA34+1","v":3},{"$f":"AB34+1","v":4},{"$f":"AC34+1","v":5},{"$f":"AD34+1","v":6},{"$f":"AE34+1","v":7},{"$f":"AF34+1","v":8}]
[null,null,"FEVRIER",null,null,null,null,null,null,null,null,null,null,null,null,null,null,null,null,null,null,null,null,null,1,2,null,null,null,1,null,null,4]
[null,null,"JOUR",1,2,3,4,5,6,7,8,null,null,null,null,null,null,null,null,null,null,null,null,null,2,null,1,null,4,null,3]
[null,"FEVRIER",1,2,"P",2,2,1,5,null,null,null,null,null,null,null,null,null,null,null,null,null,null,null,3,null,null,1,null,null,null,3]
[null,"FEVRIER",2,1,"P",4,3,1,2,"P",3]
[null,"FEVRIER",3,"P",6,1,2,6,"P",3,4]
[null,"FEVRIER",4,"p",3,3,4,3,5,1,4,null,null,null,null,null,null,null,null,null,null,null,null,null,"Course ",1,{"$f":"Z40+1","v":2},{"$f":"AA40+1","v":3},{"$f":"AB40+1","v":4},{"$f":"AC40+1","v":5},{"$f":"AD40+1","v":6},{"$f":"AE40+1","v":7},{"$f":"AF40+1","v":8}]
{"$rows_left_out":351}
{"sheet":"Feuil4","index":6,"n_rows":27,"n_cols":17,"rows_kept":27,"cut":false,"hidden":false,"merged":[[31,12,36,12],[1,9,2,10],[1,11,2,11],[16,9,17,10],[16,11,17,11],[19,12,26,12],[1,16,2,17],[3,16,9,17],[4,12,11,12],[14,9,15,10],[14,11,15,11]]}
[]
[null,null,null,null,null,null,null,null,null,"Définition Points",null,100,null,null,null,null,"GAIN DU JOUR"]
[]
[null,"Course","Chevaux","Mises Points","Mises Euros","Cotes SP","Résultat","Balance Point SG",null,"Point","Euros","résultats","GAIN",null,null,null,{"$f":"SUM(M5+M18+M32)","v":0}]
[null,1,null,2,{"$f":"L2*D5","v":200},null,{"$f":"IF(ISBLANK(F5),((D5)-(D5+D5)),(D5*F5))","v":-2},{"$f":"IF(C5=\"\",\"\",G5)","v":""},null,{"$f":"H5","v":""},{"$f":"L2","v":100},{"$f":"IF(H5=\"\",\"\",F5*E5-E5)","v":""},{"$f":"SUM(L5:L12)","v":0}]
[null,2,null,{"$f":"IF(AND(F5=0,D5=2),4,IF(AND(F5=0,D5=4),7,IF(AND(F5=0,D5=7),11,IF(AND(F5=0,D5=11),16,IF(AND(F5=0,D5=16),23,2)))))","v":4},{"$f":"L2*D6","v":400},null,{"$f":"IF(ISBLANK(F6),((D6)-(D6+D6)),(D6*F6))","v":-4},{"$f":"IF(C6=\"\",\"\",G6)","v":""},null,"",{"$f":"L2","v":100},""]
[null,3,null,{"$f":"IF(AND(F6=0,D6=2),4,IF(AND(F6=0,D6=4),7,IF(AND(F6=0,D6=7),11,IF(AND(F6=0,D6=11),16,IF(AND(F6=0,D6=16),23,2)))))","v":7},{"$f":"L2*D7","v":700},null,-7,"",null,"",{"$f":"L2","v":100},""]
[null,4,null,{"$f":"IF(AND(F7=0,D7=2),4,IF(AND(F7=0,D7=4),7,IF(AND(F7=0,D7=7),11,IF(AND(F7=0,D7=11),16,IF(AND(F7=0,D7=16),23,2)))))","v":11},{"$f":"L2*D8","v":1100},null,-11,"",null,"",{"$f":"L2","v":100},""]
[null,5,null,{"$f":"IF(AND(F8=0,D8=2),4,IF(AND(F8=0,D8=4),7,IF(AND(F8=0,D8=7),11,IF(AND(F8=0,D8=11),16,IF(AND(F8=0,D8=16),23,2)))))","v":16},{"$f":"L2*D9","v":1600},null,-16,"",null,"",{"$f":"L2","v":100},""]
[null,6,null,{"$f":"IF(AND(F9=0,D9=2),4,IF(AND(F9=0,D9=4),7,IF(AND(F9=0,D9=7),11,IF(AND(F9=0,D9=11),16,IF(AND(F9=0,D9=16),23,2)))))","v":23},{"$f":"L2*D10","v":2300},null,-23,"",null,"",{"$f":"L2","v":100},""]
[null,7,null,{"$f":"IF(AND(F10=0,D10=2),4,IF(AND(F10=0,D10=4),7,IF(AND(F10=0,D10=7),11,IF(AND(F10=0,D10=11),16,IF(AND(F10=0,D10=16),23,2)))))","v":2},{"$f":"L2*D11","v":200},null,-2,"",null,"",{"$f":"L2","v":100},""]
[null,8,null,4,{"$f":"L2*D12","v":400},null,-4,"",null,"",{"$f":"L2","v":100},""]
[]
[]
[]
[]
[null,null,null,null,null,null,null,null,null,"Définition Points",null,100]
[]
[null,"Course","Chevaux","Mises Points","Mises Euros","Cotes SG","Résultat","Balance Point SG",null,"Point","Euros","résultats","GAIN"]
[null,1,1,2,{"$f":"L17*D20","v":200},null,{"$f":"IF(ISBLANK(F20),((D20)-(D20+D20)),(D20*F20))","v":-2},{"$f":"IF(C20=\"\",\"\",G20)","v":-2},null,{"$f":"H20","v":-2},{"$f":"L17","v":100},{"$f":"IF(H20=\"\",\"\",F20*E20-E20)","v":-200},{"$f":"SUM(L20:L27)","v":-200}]
[null,2,null,{"$f":"IF(AND(F20=0,D20=2),4,IF(AND(F20=0,D20=4),7,IF(AND(F20=0,D20=7),11,IF(AND(F20=0,D20=11),16,IF(AND(F20=0,D20=16),23,2)))))","v":4},{"$f":"L17*D21","v":400},null,{"$f":"IF(ISBLANK(F21),((D21)-(D21+D21)),(D21*F21))","v":-4},{"$f":"IF(C21=\"\",\"\",G21)","v":""},null,"",{"$f":"L17","v":100},""]
[null,3,null,{"$f":"IF(AND(F21=0,D21=2),4,IF(AND(F21=0,D21=4),7,IF(AND(F21=0,D21=7),11,IF(AND(F21=0,D21=11),16,IF(AND(F21=0,D21=16),23,2)))))","v":7},{"$f":"L17*D22","v":700},null,-7,"",null,"",{"$f":"L17","v":100},""]
[null,4,null,{"$f":"IF(AND(F22=0,D22=2),4,IF(AND(F22=0,D22=4),7,IF(AND(F22=0,D22=7),11,IF(AND(F22=0,D22=11),16,IF(AND(F22=0,D22=16),23,2)))))","v":11},{"$f":"L17*D23","v":1100},null,-11,"",null,"",{"$f":"L17","v":100},""]
[null,5,null,{"$f":"IF(AND(F23=0,D23=2),4,IF(AND(F23=0,D23=4),7,IF(AND(F23=0,D23=7),11,IF(AND(F23=0,D23=11),16,IF(AND(F23=0,D23=16),23,2)))))","v":16},{"$f":"L17*D24","v":1600},null,-16,"",null,"",{"$f":"L17","v":100},""]
[null,6,null,{"$f":"IF(AND(F24=0,D24=2),4,IF(AND(F24=0,D24=4),7,IF(AND(F24=0,D24=7),11,IF(AND(F24=0,D24=11),16,IF(AND(F24=0,D24=16),23,2)))))","v":23},{"$f":"L17*D25","v":2300},null,-23,"",null,"",{"$f":"L17","v":100},""]
[null,7,null,{"$f":"IF(AND(F25=0,D25=2),4,IF(AND(F25=0,D25=4),7,IF(AND(F25=0,D25=7),11,IF(AND(F25=0,D25=11),16,IF(AND(F25=0,D25=16),23,2)))))","v":2},{"$f":"L17*D26","v":200},null,-2,"",null,"",{"$f":"L17","v":100},""]
[null,8,null,4,{"$f":"L17*D27","v":400},null,-4,"",null,"",{"$f":"L17","v":100},""]

{"sheet":"TEST","index":7,"n_rows":17,"n_cols":13,"rows_kept":17,"cut":false,"hidden":false,"merged":[]}
[]
[]
[]
[]
[]
[]
[]
[]
[]
[]
[]
[]
[null,null,"RCRX","HIPPODROME","DÉPART","DISC","PART","CHEVAL",null,"RCRX","HIPPODROME","DÉPART","CHEVAL"]
[null,null,{"$f":"'Mes Jeux'!C4","v":"R3C2"},{"$f":"'Mes Jeux'!D4","v":"LA-TESTE"},{"$f":"'Mes Jeux'!E4","v":"12H15"},{"$f":"'Mes Jeux'!F4","v":"Haies"},{"$f":"'Mes Jeux'!G4","v":8},{"$f":"'Mes Jeux'!H4","v":3}]
[null,null,{"$f":"'Mes Jeux'!C5","v":"R2C5"},{"$f":"'Mes Jeux'!D5","v":"SENONNES-POUANCE"},{"$f":"'Mes Jeux'!E5","v":"14H02"},{"$f":"'Mes Jeux'!F5","v":"Plat"},{"$f":"'Mes Jeux'!G5","v":9},{"$f":"'Mes Jeux'!H5","v":6},null,{"$f":"'Mes Jeux'!J4","v":"R2C2"},{"$f":"'Mes Jeux'!K4","v":"TONGRES"},{"$f":"'Mes Jeux'!L4","v":"12H30"},{"$f":"'Mes Jeux'!M4","v":0}]
[null,null,null,null,null,null,null,null,null,{"$f":"'Mes Jeux'!J5","v":"R3C1"},{"$f":"'Mes Jeux'!K5","v":"NANTES"},{"$f":"'Mes Jeux'!L5","v":"12H45"},{"$f":"'Mes Jeux'!M5","v":0}]
[null,null,null,null,null,null,null,null,null,{"$f":"'Mes Jeux'!J6","v":"R3C2"},{"$f":"'Mes Jeux'!K6","v":"NANTES"},{"$f":"'Mes Jeux'!L6","v":"13H15"},{"$f":"'Mes Jeux'!M6","v":0}]