{"text_format":"1","workbook":"xlsx","n_sheets":6,"sheets":["Gestion des Livres","Science 1-23","Histoire 1-30","Histoire 31-40","Géographie 1-13","Ordre de sortie"],"not_rendered":{"charts":0,"images":0,"macros":1,"external_links":0,"defined_names":2,"comments":0,"pivot_tables":0},"unopened":[],"bounds":{"document_bytes":16777216,"sheet_cells":100000,"rows_first":2000,"rows_last":500,"rows_between":2000,"halvings":0,"cell_chars":16384,"cell_head_chars":4096},"cells_cut":0,"cells_raw":0,"read":"whole","date_system":"1900"}

{"sheet":"Gestion des Livres","index":0,"n_rows":790,"n_cols":16,"rows_kept":790,"cut":false,"hidden":false,"merged":[[3,12,428,12],[0,8,0,10],[3,20,3,21],[0,0,0,1],[0,14,2,14],[3,0,25,0],[28,0,67,0],[68,0,80,0],[83,0,86,0],[113,0,164,0],[168,0,173,0],[178,0,194,0],[98,0,109,0],[93,0,95,0],[198,0,209,0],[213,0,219,0],[430,6,431,7],[223,0,232,0],[233,0,241,0],[243,0,254,0],[258,0,262,0],[263,0,288,0],[430,1,431,1],[430,0,434,0],[430,4,431,4],[430,3,431,3],[430,5,431,5]]}
["ANNEE 2021   DATE DU JOUR",null,null,{"$f":"NOW()","v":"2022-07-04T16:31:59.890"},{"$f":"NOW()","v":"2022-07-04T16:31:59.890"},null,null,null,"c",null,null,null,null,null,"Nombre d'Emprunteurs"]
[]
[null,"TE","Territ","Nom","Entrée","sortie","Code","Alerte à J+115","A faire rentrer","Rendre à J+130","Urgent","Ecart de jours",null,null,null,{"$f":"IF(COUNTA(P194)=0,\"\",SUM(P194))","v":6}]
["SCIENCE","Science 1","Livre 1","Paul",null,"2022-05-18","s",{"$f":"IF(F4=\"\",\"\",F4+115)","v":"2022-09-10"},{"$f":"IF(AND(L4>=115,L4<=129),\"A faire rentrer\",\"\")","v":""},{"$f":"IF(F4=\"\",\"\",F4+130)","v":"2022-09-25"},{"$f":"IF(L4>=130,\"Urgent\",\"\")","v":""},{"$f":"IF(F4=\"\",0,DATEDIF(F4,$D$1,\"D\"))","v":47},null,{"$f":"IFERROR(IF('Gestion des Livres'!B4=\"\",\"\",IF('Gestion des Livres'!E4>0,RANK(E4,E:E,1)+COUNTIF($E$3:E3,E4)/1000,COUNTIF($E$3:E3,\"\")/1000)),\"\")","v":0},"Paul",{"$f":"IF(COUNTA(O4)=0,\"\",1)","v":1}]
[null,"Science 2","Livre 2","Pierre",null,"2022-05-14","s",{"$f":"IF(F5=\"\",\"\",F5+115)","v":"2022-09-06"},{"$f":"IF(AND(L5>=115,L5<=129),\"A faire rentrer\",\"\")","v":""},{"$f":"IF(F5=\"\",\"\",F5+130)","v":"2022-09-21"},{"$f":"IF(L5>=130,\"Urgent\",\"\")","v":""},{"$f":"IF(F5=\"\",0,DATEDIF(F5,$D$1,\"D\"))","v":51},null,{"$f":"IFERROR(IF('Gestion des Livres'!B5=\"\",\"\",IF('Gestion des Livres'!E5>0,RANK(E5,E:E,1)+COUNTIF($E$3:E4,E5)/1000,COUNTIF($E$3:E4,\"\")/1000)),\"\")","v":1E-3},"Pierre",1]
[null,"Science 3","Livre 3",null,null,null,null,"","","","",0,null,{"$f":"IFERROR(IF('Gestion des Livres'!B6=\"\",\"\",IF('Gestion des Livres'!E6>0,RANK(E6,E:E,1)+COUNTIF($E$3:E5,E6)/1000,COUNTIF($E$3:E5,\"\")/1000)),\"\")","v":2E-3},"Ruduolf",1]
[null,"Science 4","Livre 4",null,null,null,null,"","","","",0,null,{"$f":"IFERROR(IF('Gestion des Livres'!B7=\"\",\"\",IF('Gestion des Livres'!E7>0,RANK(E7,E:E,1)+COUNTIF($E$3:E6,E7)/1000,COUNTIF($E$3:E6,\"\")/1000)),\"\")","v":3.0000000000000001E-3},"André",1]
[null,"Science 5","Livre 5",null,null,null,null,"","","","",0,null,{"$f":"IFERROR(IF('Gestion des Livres'!B8=\"\",\"\",IF('Gestion des Livres'!E8>0,RANK(E8,E:E,1)+COUNTIF($E$3:E7,E8)/1000,COUNTIF($E$3:E7,\"\")/1000)),\"\")","v":4.0000000000000001E-3},"Gisèle",1]
[null,"Science 6","Livre 6",null,null,null,null,{"$f":"IF(F9=\"\",\"\",F9+115)","v":""},{"$f":"IF(AND(L9>=115,L9<=129),\"A faire rentrer\",\"\")","v":""},{"$f":"IF(F9=\"\",\"\",F9+130)","v":""},{"$f":"IF(L9>=130,\"Urgent\",\"\")","v":""},{"$f":"IF(F9=\"\",0,DATEDIF(F9,$D$1,\"D\"))","v":0},null,{"$f":"IFERROR(IF('Gestion des Livres'!B9=\"\",\"\",IF('Gestion des Livres'!E9>0,RANK(E9,E:E,1)+COUNTIF($E$3:E8,E9)/1000,COUNTIF($E$3:E8,\"\")/1000)),\"\")","v":5.0000000000000001E-3},"Bernadette",1]
[null,"Science 7","Livre 7",null,null,null,null,"","","","",0,null,{"$f":"IFERROR(IF('Gestion des Livres'!B10=\"\",\"\",IF('Gestion des Livres'!E10>0,RANK(E10,E:E,1)+COUNTIF($E$3:E9,E10)/1000,COUNTIF($E$3:E9,\"\")/1000)),\"\")","v":6.0000000000000001E-3},null,{"$f":"IF(COUNTA(O10)=0,\"\",1)","v":""}]
[null,"Science 8","Livre 8",null,null,null,null,"","","","",0,null,{"$f":"IFERROR(IF('Gestion des Livres'!B11=\"\",\"\",IF('Gestion des Livres'!E11>0,RANK(E11,E:E,1)+COUNTIF($E$3:E10,E11)/1000,COUNTIF($E$3:E10,\"\")/1000)),\"\")","v":7.0000000000000001E-3},null,""]
[null,"Science 9","Livre 9",null,null,null,null,"","","","",0,null,{"$f":"IFERROR(IF('Gestion des Livres'!B12=\"\",\"\",IF('Gestion des Livres'!E12>0,RANK(E12,E:E,1)+COUNTIF($E$3:E11,E12)/1000,COUNTIF($E$3:E11,\"\")/1000)),\"\")","v":8.0000000000000002E-3},null,""]
[null,"Science 10","Livre 10",null,null,null,null,"","","","",0,null,{"$f":"IFERROR(IF('Gestion des Livres'!B13=\"\",\"\",IF('Gestion des Livres'!E13>0,RANK(E13,E:E,1)+COUNTIF($E$3:E12,E13)/1000,COUNTIF($E$3:E12,\"\")/1000)),\"\")","v":8.9999999999999993E-3},null,""]
[null,"Science 11","Livre 11",null,null,null,null,{"$f":"IF(F14=\"\",\"\",F14+115)","v":""},{"$f":"IF(AND(L14>=115,L14<=129),\"A faire rentrer\",\"\")","v":""},{"$f":"IF(F14=\"\",\"\",F14+130)","v":""},"",{"$f":"IF(F14=\"\",0,DATEDIF(F14,$D$1,\"D\"))","v":0},null,{"$f":"IFERROR(IF('Gestion des Livres'!B14=\"\",\"\",IF('Gestion des Livres'!E14>0,RANK(E14,E:E,1)+COUNTIF($E$3:E13,E14)/1000,COUNTIF($E$3:E13,\"\")/1000)),\"\")","v":0.01},null,""]
[null,"Science 12","Livre 12",null,null,null,null,"","","","",0,null,{"$f":"IFERROR(IF('Gestion des Livres'!B15=\"\",\"\",IF('Gestion des Livres'!E15>0,RANK(E15,E:E,1)+COUNTIF($E$3:E14,E15)/1000,COUNTIF($E$3:E14,\"\")/1000)),\"\")","v":1.0999999999999999E-2},null,""]
[null,"Science 13","Livre 13",null,null,null,null,"","","","",0,null,{"$f":"IFERROR(IF('Gestion des Livres'!B16=\"\",\"\",IF('Gestion des Livres'!E16>0,RANK(E16,E:E,1)+COUNTIF($E$3:E15,E16)/1000,COUNTIF($E$3:E15,\"\")/1000)),\"\")","v":1.2E-2},null,""]
[null,"Science 14","Livre 14",null,null,null,null,"","","","",0,null,{"$f":"IFERROR(IF('Gestion des Livres'!B17=\"\",\"\",IF('Gestion des Livres'!E17>0,RANK(E17,E:E,1)+COUNTIF($E$3:E16,E17)/1000,COUNTIF($E$3:E16,\"\")/1000)),\"\")","v":1.2999999999999999E-2},null,""]
[null,"Science 15","Livre 15",null,null,null,null,"","","","",0,null,{"$f":"IFERROR(IF('Gestion des Livres'!B18=\"\",\"\",IF('Gestion des Livres'!E18>0,RANK(E18,E:E,1)+COUNTIF($E$3:E17,E18)/1000,COUNTIF($E$3:E17,\"\")/1000)),\"\")","v":1.4E-2},null,""]
[null,"Science 16","Livre 16",null,null,null,null,"","","","",0,null,{"$f":"IFERROR(IF('Gestion des Livres'!B19=\"\",\"\",IF('Gestion des Livres'!E19>0,RANK(E19,E:E,1)+COUNTIF($E$3:E18,E19)/1000,COUNTIF($E$3:E18,\"\")/1000)),\"\")","v":1.4999999999999999E-2},null,""]
[null,"Science 17","Livre 17",null,null,null,null,"","","","",0,null,{"$f":"IFERROR(IF('Gestion des Livres'!B20=\"\",\"\",IF('Gestion des Livres'!E20>0,RANK(E20,E:E,1)+COUNTIF($E$3:E19,E20)/1000,COUNTIF($E$3:E19,\"\")/1000)),\"\")","v":1.6E-2},null,""]
{"$rows_left_out":771}
{"sheet":"Science 1-23","index":1,"n_rows":52,"n_cols":10,"rows_kept":52,"cut":false,"hidden":false,"merged":[[69,8,69,9],[69,0,70,0],[69,1,70,1],[69,2,69,3],[69,4,69,5],[69,6,69,7],[65,8,65,9],[67,0,68,0],[67,1,68,1],[67,2,67,3],[67,4,67,5],[67,6,67,7],[67,8,67,9],[65,0,66,0],[65,1,66,1],[65,2,65,3],[65,4,65,5],[65,6,65,7],[61,8,61,9],[63,0,64,0],[63,1,64,1],[63,2,63,3],[63,4,63,5],[63,6,63,7],[63,8,63,9],[61,0,62,0],[61,1,62,1],[61,2,61,3],[61,4,61,5],[61,6,61,7],[57,8,57,9],[59,0,60,0],[59,1,60,1],[59,2,59,3],[59,4,59,5],[59,6,59,7],[59,8,59,9],[57,0,58,0],[57,1,58,1],[57,2,57,3],[57,4,57,5],[57,6,57,7],[53,8,53,9],[55,0,56,0],[55,1,56,1],[55,2,55,3],[55,4,55,5],[55,6,55,7],[55,8,55,9],[53,0,54,0],[53,1,54,1],[53,2,53,3],[53,4,53,5],[53,6,53,7],[49,8,49,9],[51,0,52,0],[51,1,52,1],[51,2,51,3],[51,4,51,5],[51,6,51,7],[51,8,51,9],[49,0,50,0],[49,1,50,1],[49,2,49,3],[49,4,49,5],[49,6,49,7],[45,8,45,9],[47,0,48,0],[47,1,48,1],[47,2,47,3],[47,4,47,5],[47,6,47,7],[47,8,47,9],[45,0,46,0],[45,1,46,1],[45,2,45,3],[45,4,45,5],[45,6,45,7],[41,8,41,9],[43,0,44,0],[43,1,44,1],[43,2,43,3],[43,4,43,5],[43,6,43,7],[43,8,43,9],[41,0,42,0],[41,1,42,1],[41,2,41,3],[41,4,41,5],[41,6,41,7],[37,8,37,9],[39,0,40,0],[39,1,40,1],[39,2,39,3],[39,4,39,5],[39,6,39,7],[39,8,39,9],[37,0,38,0],[37,1,38,1],[37,2,37,3],[37,4,37,5],[37,6,37,7],[33,8,33,9],[35,0,36,0],[35,1,36,1],[35,2,35,3],[35,4,35,5],[35,6,35,7],[35,8,35,9],[33,0,34,0],[33,1,34,1],[33,2,33,3],[33,4,33,5],[33,6,33,7],[29,8,29,9],[31,0,32,0],[31,1,32,1],[31,2,31,3],[31,4,31,5],[31,6,31,7],[31,8,31,9],[29,0,30,0],[29,1,30,1],[29,2,29,3],[29,4,29,5],[29,6,29,7],[25,8,25,9],[27,0,28,0],[27,1,28,1],[27,2,27,3],[27,4,27,5],[27,6,27,7],[27,8,27,9],[25,0,26,0],[25,1,26,1],[25,2,25,3],[25,4,25,5],[25,6,25,7],[21,8,21,9],[23,0,24,0],[23,1,24,1],[23,2,23,3],[23,4,23,5],[23,6,23,7],[23,8,23,9],[21,0,22,0],[21,1,22,1],[21,2,21,3],[21,4,21,5],[21,6,21,7],[17,8,17,9],[19,0,20,0],[19,1,20,1],[19,2,19,3],[19,4,19,5],[19,6,19,7],[19,8,19,9],[17,0,18,0],[17,1,18,1],[17,2,17,3],[17,4,17,5],[17,6,17,7],[13,8,13,9],[15,0,16,0],[15,1,16,1],[15,2,15,3],[15,4,15,5],[15,6,15,7],[15,8,15,9],[13,0,14,0],[13,1,14,1],[13,2,13,3],[13,4,13,5],[13,6,13,7],[9,8,9,9],[11,0,12,0],[11,1,12,1],[11,2,11,3],[11,4,11,5],[11,6,11,7],[11,8,11,9],[9,0,10,0],[9,1,10,1],[9,2,9,3],[9,4,9,5],[9,6,9,7],[2,0,3,2],[2,7,2,8],[0,0,1,9],[2,3,3,6],[5,8,5,9],[7,0,8,0],[7,1,8,1],[7,2,7,3],[7,4,7,5],[7,6,7,7],[7,8,7,9],[5,0,6,0],[5,1,6,1],[5,2,5,3],[5,4,5,5],[5,6,5,7]]}
["Relevé d'Attribution des Livres"]
[]
["Science",null,null,"Année  2022"]
[]
[]
["Terr.N°","Parcouru pour la dernière fois le*","Attribué  à",null,"Attribué  à",null,"Attribué  à",null,"Attribué  à"]
[null,null,"Attribué le ","Entièrement parcouru le","Attribué le ","Entièrement parcouru le","Attribué le ","Entièrement parcouru le","Attribué le ","Entièrement parcouru le"]
[1,"2021-10-10","Paul",null,"Paul"]
[null,null,"2022-04-25","2022-05-06","2022-05-18"]
[2,"Pierre","Pierre"]
[null,null,"2022-05-14"]
[3]
[]
[4]
[]
[5]
[]
[6]
[]
[7]
{"$rows_left_out":33}
{"sheet":"Histoire 1-30","index":2,"n_rows":66,"n_cols":10,"rows_kept":66,"cut":false,"hidden":false,"merged":[[65,8,65,9],[65,0,66,0],[65,1,66,1],[65,2,65,3],[65,4,65,5],[65,6,65,7],[61,8,61,9],[63,0,64,0],[63,1,64,1],[63,2,63,3],[63,4,63,5],[63,6,63,7],[63,8,63,9],[61,0,62,0],[61,1,62,1],[61,2,61,3],[61,4,61,5],[61,6,61,7],[57,8,57,9],[59,0,60,0],[59,1,60,1],[59,2,59,3],[59,4,59,5],[59,6,59,7],[59,8,59,9],[57,0,58,0],[57,1,58,1],[57,2,57,3],[57,4,57,5],[57,6,57,7],[53,8,53,9],[55,0,56,0],[55,1,56,1],[55,2,55,3],[55,4,55,5],[55,6,55,7],[55,8,55,9],[53,0,54,0],[53,1,54,1],[53,2,53,3],[53,4,53,5],[53,6,53,7],[49,8,49,9],[51,0,52,0],[51,1,52,1],[51,2,51,3],[51,4,51,5],[51,6,51,7],[51,8,51,9],[49,0,50,0],[49,1,50,1],[49,2,49,3],[49,4,49,5],[49,6,49,7],[45,8,45,9],[47,0,48,0],[47,1,48,1],[47,2,47,3],[47,4,47,5],[47,6,47,7],[47,8,47,9],[45,0,46,0],[45,1,46,1],[45,2,45,3],[45,4,45,5],[45,6,45,7],[41,8,41,9],[43,0,44,0],[43,1,44,1],[43,2,43,3],[43,4,43,5],[43,6,43,7],[43,8,43,9],[41,0,42,0],[41,1,42,1],[41,2,41,3],[41,4,41,5],[41,6,41,7],[37,8,37,9],[39,0,40,0],[39,1,40,1],[39,2,39,3],[39,4,39,5],[39,6,39,7],[39,8,39,9],[37,0,38,0],[37,1,38,1],[37,2,37,3],[37,4,37,5],[37,6,37,7],[33,8,33,9],[35,0,36,0],[35,1,36,1],[35,2,35,3],[35,4,35,5],[35,6,35,7],[35,8,35,9],[33,0,34,0],[33,1,34,1],[33,2,33,3],[33,4,33,5],[33,6,33,7],[29,8,29,9],[31,0,32,0],[31,1,32,1],[31,2,31,3],[31,4,31,5],[31,6,31,7],[31,8,31,9],[29,0,30,0],[29,1,30,1],[29,2,29,3],[29,4,29,5],[29,6,29,7],[25,8,25,9],[27,0,28,0],[27,1,28,1],[27,2,27,3],[27,4,27,5],[27,6,27,7],[27,8,27,9],[25,0,26,0],[25,1,26,1],[25,2,25,3],[25,4,25,5],[25,6,25,7],[21,8,21,9],[23,0,24,0],[23,1,24,1],[23,2,23,3],[23,4,23,5],[23,6,23,7],[23,8,23,9],[21,0,22,0],[21,1,22,1],[21,2,21,3],[21,4,21,5],[21,6,21,7],[17,8,17,9],[19,0,20,0],[19,1,20,1],[19,2,19,3],[19,4,19,5],[19,6,19,7],[19,8,19,9],[17,0,18,0],[17,1,18,1],[17,2,17,3],[17,4,17,5],[17,6,17,7],[13,8,13,9],[15,0,16,0],[15,1,16,1],[15,2,15,3],[15,4,15,5],[15,6,15,7],[15,8,15,9],[13,0,14,0],[13,1,14,1],[13,2,13,3],[13,4,13,5],[13,6,13,7],[9,8,9,9],[11,0,12,0],[11,1,12,1],[11,2,11,3],[11,4,11,5],[11,6,11,7],[11,8,11,9],[9,0,10,0],[9,1,10,1],[9,2,9,3],[9,4,9,5],[9,6,9,7],[2,0,3,2],[2,7,2,8],[0,0,1,9],[2,3,3,6],[5,8,5,9],[7,0,8,0],[7,1,8,1],[7,2,7,3],[7,4,7,5],[7,6,7,7],[7,8,7,9],[5,0,6,0],[5,1,6,1],[5,2,5,3],[5,4,5,5],[5,6,5,7]]}
["Relevé d'Attribution des territoires"]
[]
["Histoire",null,null,"Année de Service 2022"]
[]
[]
["Terr.N°","Parcouru pour la dernière fois le*","Attribué  à",null,"Attribué  à",null,"Attribué  à",null,"Attribué  à"]
[null,null,"Attribué le ","Entièrement parcouru le","Attribué le ","Entièrement parcouru le","Attribué le ","Entièrement parcouru le","Attribué le ","Entièrement parcouru le"]
[1,"2021-10-10","André"]
[null,null,"2022-05-05","2022-05-06"]
[2]
[]
[3]
[]
[4]
[]
[5]
[]
[6]
[]
[7]
{"$rows_left_out":47}
{"sheet":"Histoire 31-40","index":3,"n_rows":26,"n_cols":10,"rows_kept":26,"cut":false,"hidden":false,"merged":[[57,8,57,9],[59,0,60,0],[59,1,60,1],[59,2,59,3],[59,4,59,5],[59,6,59,7],[59,8,59,9],[57,0,58,0],[57,1,58,1],[57,2,57,3],[57,4,57,5],[57,6,57,7],[53,8,53,9],[55,0,56,0],[55,1,56,1],[55,2,55,3],[55,4,55,5],[55,6,55,7],[55,8,55,9],[53,0,54,0],[53,1,54,1],[53,2,53,3],[53,4,53,5],[53,6,53,7],[49,8,49,9],[51,0,52,0],[51,1,52,1],[51,2,51,3],[51,4,51,5],[51,6,51,7],[51,8,51,9],[49,0,50,0],[49,1,50,1],[49,2,49,3],[49,4,49,5],[49,6,49,7],[45,8,45,9],[47,0,48,0],[47,1,48,1],[47,2,47,3],[47,4,47,5],[47,6,47,7],[47,8,47,9],[45,0,46,0],[45,1,46,1],[45,2,45,3],[45,4,45,5],[45,6,45,7],[41,8,41,9],[43,0,44,0],[43,1,44,1],[43,2,43,3],[43,4,43,5],[43,6,43,7],[43,8,43,9],[41,0,42,0],[41,1,42,1],[41,2,41,3],[41,4,41,5],[41,6,41,7],[37,8,37,9],[39,0,40,0],[39,1,40,1],[39,2,39,3],[39,4,39,5],[39,6,39,7],[39,8,39,9],[37,0,38,0],[37,1,38,1],[37,2,37,3],[37,4,37,5],[37,6,37,7],[33,8,33,9],[35,0,36,0],[35,1,36,1],[35,2,35,3],[35,4,35,5],[35,6,35,7],[35,8,35,9],[33,0,34,0],[33,1,34,1],[33,2,33,3],[33,4,33,5],[33,6,33,7],[29,8,29,9],[31,0,32,0],[31,1,32,1],[31,2,31,3],[31,4,31,5],[31,6,31,7],[31,8,31,9],[29,0,30,0],[29,1,30,1],[29,2,29,3],[29,4,29,5],[29,6,29,7],[25,8,25,9],[27,0,28,0],[27,1,28,1],[27,2,27,3],[27,4,27,5],[27,6,27,7],[27,8,27,9],[25,0,26,0],[25,1,26,1],[25,2,25,3],[25,4,25,5],[25,6,25,7],[21,8,21,9],[23,0,24,0],[23,1,24,1],[23,2,23,3],[23,4,23,5],[23,6,23,7],[23,8,23,9],[21,0,22,0],[21,1,22,1],[21,2,21,3],[21,4,21,5],[21,6,21,7],[17,8,17,9],[19,0,20,0],[19,1,20,1],[19,2,19,3],[19,4,19,5],[19,6,19,7],[19,8,19,9],[17,0,18,0],[17,1,18,1],[17,2,17,3],[17,4,17,5],[17,6,17,7],[13,8,13,9],[15,0,16,0],[15,1,16,1],[15,2,15,3],[15,4,15,5],[15,6,15,7],[15,8,15,9],[13,0,14,0],[13,1,14,1],[13,2,13,3],[13,4,13,5],[13,6,13,7],[9,8,9,9],[11,0,12,0],[11,1,12,1],[11,2,11,3],[11,4,11,5],[11,6,11,7],[11,8,11,9],[9,0,10,0],[9,1,10,1],[9,2,9,3],[9,4,9,5],[9,6,9,7],[2,0,3,2],[2,7,2,8],[0,0,1,9],[2,3,3,6],[5,8,5,9],[7,0,8,0],[7,1,8,1],[7,2,7,3],[7,4,7,5],[7,6,7,7],[7,8,7,9],[5,0,6,0],[5,1,6,1],[5,2,5,3],[5,4,5,5],[5,6,5,7]]}
["Relevé d'Attribution des territoires"]
[]
["Histoire",null,null,"Année de Service 2022"]
[]
[]
["Terr.N°","Parcouru pour la dernière fois le*","Attribué  à",null,"Attribué  à",null,"Attribué  à",null,"Attribué  à"]
[null,null,"Attribué le ","Entièrement parcouru le","Attribué le ","Entièrement parcouru le","Attribué le ","Entièrement parcouru le","Attribué le ","Entièrement parcouru le"]
[31,"2021-10-10"]
[]
[32]
[]
[33]
[]
[34]
[]
[35]
[]
[36]
[]
[37]
{"$rows_left_out":7}
{"sheet":"Géographie 1-13","index":4,"n_rows":32,"n_cols":10,"rows_kept":32,"cut":false,"hidden":false,"merged":[[57,8,57,9],[59,0,60,0],[59,1,60,1],[59,2,59,3],[59,4,59,5],[59,6,59,7],[59,8,59,9],[57,0,58,0],[57,1,58,1],[57,2,57,3],[57,4,57,5],[57,6,57,7],[53,8,53,9],[55,0,56,0],[55,1,56,1],[55,2,55,3],[55,4,55,5],[55,6,55,7],[55,8,55,9],[53,0,54,0],[53,1,54,1],[53,2,53,3],[53,4,53,5],[53,6,53,7],[49,8,49,9],[51,0,52,0],[51,1,52,1],[51,2,51,3],[51,4,51,5],[51,6,51,7],[51,8,51,9],[49,0,50,0],[49,1,50,1],[49,2,49,3],[49,4,49,5],[49,6,49,7],[45,8,45,9],[47,0,48,0],[47,1,48,1],[47,2,47,3],[47,4,47,5],[47,6,47,7],[47,8,47,9],[45,0,46,0],[45,1,46,1],[45,2,45,3],[45,4,45,5],[45,6,45,7],[41,8,41,9],[43,0,44,0],[43,1,44,1],[43,2,43,3],[43,4,43,5],[43,6,43,7],[43,8,43,9],[41,0,42,0],[41,1,42,1],[41,2,41,3],[41,4,41,5],[41,6,41,7],[37,8,37,9],[39,0,40,0],[39,1,40,1],[39,2,39,3],[39,4,39,5],[39,6,39,7],[39,8,39,9],[37,0,38,0],[37,1,38,1],[37,2,37,3],[37,4,37,5],[37,6,37,7],[33,8,33,9],[35,0,36,0],[35,1,36,1],[35,2,35,3],[35,4,35,5],[35,6,35,7],[35,8,35,9],[33,0,34,0],[33,1,34,1],[33,2,33,3],[33,4,33,5],[33,6,33,7],[29,8,29,9],[31,0,32,0],[31,1,32,1],[31,2,31,3],[31,4,31,5],[31,6,31,7],[31,8,31,9],[29,0,30,0],[29,1,30,1],[29,2,29,3],[29,4,29,5],[29,6,29,7],[25,8,25,9],[27,0,28,0],[27,1,28,1],[27,2,27,3],[27,4,27,5],[27,6,27,7],[27,8,27,9],[25,0,26,0],[25,1,26,1],[25,2,25,3],[25,4,25,5],[25,6,25,7],[21,8,21,9],[23,0,24,0],[23,1,24,1],[23,2,23,3],[23,4,23,5],[23,6,23,7],[23,8,23,9],[21,0,22,0],[21,1,22,1],[21,2,21,3],[21,4,21,5],[21,6,21,7],[17,8,17,9],[19,0,20,0],[19,1,20,1],[19,2,19,3],[19,4,19,5],[19,6,19,7],[19,8,19,9],[17,0,18,0],[17,1,18,1],[17,2,17,3],[17,4,17,5],[17,6,17,7],[13,8,13,9],[15,0,16,0],[15,1,16,1],[15,2,15,3],[15,4,15,5],[15,6,15,7],[15,8,15,9],[13,0,14,0],[13,1,14,1],[13,2,13,3],[13,4,13,5],[13,6,13,7],[9,8,9,9],[11,0,12,0],[11,1,12,1],[11,2,11,3],[11,4,11,5],[11,6,11,7],[11,8,11,9],[9,0,10,0],[9,1,10,1],[9,2,9,3],[9,4,9,5],[9,6,9,7],[2,0,3,2],[2,7,2,8],[0,0,1,9],[2,3,3,6],[5,8,5,9],[7,0,8,0],[7,1,8,1],[7,2,7,3],[7,4,7,5],[7,6,7,7],[7,8,7,9],[5,0,6,0],[5,1,6,1],[5,2,5,3],[5,4,5,5],[5,6,5,7]]}
["Relevé d'Attribution des territoires"]
[]
["Géographie",null,null,"Année de Service 2022"]
[]
[]
["Terr.N°","Parcouru pour la dernière fois le*","Attribué  à",null,"Attribué  à",null,"Attribué  à",null,"Attribué  à"]
[null,null,"Attribué le ","Entièrement parcouru le","Attribué le ","Entièrement parcouru le","Attribué le ","Entièrement parcouru le","Attribué le ","Entièrement parcouru le"]
[1,"2021-10-10"]
[]
[2]
[]
[3]
[]
[4]
[]
[5]
[]
[6]
[]
[7]
{"$rows_left_out":13}
{"sheet":"Ordre de sortie","index":5,"n_rows":429,"n_cols":10,"rows_kept":429,"cut":false,"hidden":true,"merged":[[0,0,0,1],[67,4,67,6],[68,7,68,8],[68,9,68,11],[69,4,69,6]]}
[2021]
["Territoires","Dates  rentrés"]
[{"$f":"IFERROR(INDEX('Gestion des Livres'!B:L,MATCH(SMALL('Gestion des Livres'!N:N,ROW(A1)),'Gestion des Livres'!N:N,0),1),\"\")","v":"Science 1"},{"$f":"IFERROR(INDEX('Gestion des Livres'!B:L,MATCH(SMALL('Gestion des Livres'!N:N,ROW(B1)),'Gestion des Livres'!N:N,0),4),\"\")","v":"00:00:00"},null,{"$f":"IF((B3)=0,\"\",1)","v":""}]
[{"$f":"IFERROR(INDEX('Gestion des Livres'!B:L,MATCH(SMALL('Gestion des Livres'!N:N,ROW(A2)),'Gestion des Livres'!N:N,0),1),\"\")","v":"Science 2"},{"$f":"IFERROR(INDEX('Gestion des Livres'!B:L,MATCH(SMALL('Gestion des Livres'!N:N,ROW(B2)),'Gestion des Livres'!N:N,0),4),\"\")","v":"00:00:00"},null,""]
[{"$f":"IFERROR(INDEX('Gestion des Livres'!B:L,MATCH(SMALL('Gestion des Livres'!N:N,ROW(A3)),'Gestion des Livres'!N:N,0),1),\"\")","v":"Science 3"},{"$f":"IFERROR(INDEX('Gestion des Livres'!B:L,MATCH(SMALL('Gestion des Livres'!N:N,ROW(B3)),'Gestion des Livres'!N:N,0),4),\"\")","v":"00:00:00"},null,""]
[{"$f":"IFERROR(INDEX('Gestion des Livres'!B:L,MATCH(SMALL('Gestion des Livres'!N:N,ROW(A4)),'Gestion des Livres'!N:N,0),1),\"\")","v":"Science 4"},{"$f":"IFERROR(INDEX('Gestion des Livres'!B:L,MATCH(SMALL('Gestion des Livres'!N:N,ROW(B4)),'Gestion des Livres'!N:N,0),4),\"\")","v":"00:00:00"},null,""]
[{"$f":"IFERROR(INDEX('Gestion des Livres'!B:L,MATCH(SMALL('Gestion des Livres'!N:N,ROW(A5)),'Gestion des Livres'!N:N,0),1),\"\")","v":"Science 5"},{"$f":"IFERROR(INDEX('Gestion des Livres'!B:L,MATCH(SMALL('Gestion des Livres'!N:N,ROW(B5)),'Gestion des Livres'!N:N,0),4),\"\")","v":"00:00:00"},null,""]
[{"$f":"IFERROR(INDEX('Gestion des Livres'!B:L,MATCH(SMALL('Gestion des Livres'!N:N,ROW(A6)),'Gestion des Livres'!N:N,0),1),\"\")","v":"Science 6"},{"$f":"IFERROR(INDEX('Gestion des Livres'!B:L,MATCH(SMALL('Gestion des Livres'!N:N,ROW(B6)),'Gestion des Livres'!N:N,0),4),\"\")","v":"00:00:00"},null,""]
[{"$f":"IFERROR(INDEX('Gestion des Livres'!B:L,MATCH(SMALL('Gestion des Livres'!N:N,ROW(A7)),'Gestion des Livres'!N:N,0),1),\"\")","v":"Science 7"},{"$f":"IFERROR(INDEX('Gestion des Livres'!B:L,MATCH(SMALL('Gestion des Livres'!N:N,ROW(B7)),'Gestion des Livres'!N:N,0),4),\"\")","v":"00:00:00"},null,""]
[{"$f":"IFERROR(INDEX('Gestion des Livres'!B:L,MATCH(SMALL('Gestion des Livres'!N:N,ROW(A8)),'Gestion des Livres'!N:N,0),1),\"\")","v":"Science 8"},{"$f":"IFERROR(INDEX('Gestion des Livres'!B:L,MATCH(SMALL('Gestion des Livres'!N:N,ROW(B8)),'Gestion des Livres'!N:N,0),4),\"\")","v":"00:00:00"},null,""]
[{"$f":"IFERROR(INDEX('Gestion des Livres'!B:L,MATCH(SMALL('Gestion des Livres'!N:N,ROW(A9)),'Gestion des Livres'!N:N,0),1),\"\")","v":"Science 9"},{"$f":"IFERROR(INDEX('Gestion des Livres'!B:L,MATCH(SMALL('Gestion des Livres'!N:N,ROW(B9)),'Gestion des Livres'!N:N,0),4),\"\")","v":"00:00:00"},null,""]
[{"$f":"IFERROR(INDEX('Gestion des Livres'!B:L,MATCH(SMALL('Gestion des Livres'!N:N,ROW(A10)),'Gestion des Livres'!N:N,0),1),\"\")","v":"Science 10"},{"$f":"IFERROR(INDEX('Gestion des Livres'!B:L,MATCH(SMALL('Gestion des Livres'!N:N,ROW(B10)),'Gestion des Livres'!N:N,0),4),\"\")","v":"00:00:00"},null,""]
[{"$f":"IFERROR(INDEX('Gestion des Livres'!B:L,MATCH(SMALL('Gestion des Livres'!N:N,ROW(A11)),'Gestion des Livres'!N:N,0),1),\"\")","v":"Science 11"},{"$f":"IFERROR(INDEX('Gestion des Livres'!B:L,MATCH(SMALL('Gestion des Livres'!N:N,ROW(B11)),'Gestion des Livres'!N:N,0),4),\"\")","v":"00:00:00"},null,""]
[{"$f":"IFERROR(INDEX('Gestion des Livres'!B:L,MATCH(SMALL('Gestion des Livres'!N:N,ROW(A12)),'Gestion des Livres'!N:N,0),1),\"\")","v":"Science 12"},{"$f":"IFERROR(INDEX('Gestion des Livres'!B:L,MATCH(SMALL('Gestion des Livres'!N:N,ROW(B12)),'Gestion des Livres'!N:N,0),4),\"\")","v":"00:00:00"},null,""]
[{"$f":"IFERROR(INDEX('Gestion des Livres'!B:L,MATCH(SMALL('Gestion des Livres'!N:N,ROW(A13)),'Gestion des Livres'!N:N,0),1),\"\")","v":"Science 13"},{"$f":"IFERROR(INDEX('Gestion des Livres'!B:L,MATCH(SMALL('Gestion des Livres'!N:N,ROW(B13)),'Gestion des Livres'!N:N,0),4),\"\")","v":"00:00:00"},null,""]
[{"$f":"IFERROR(INDEX('Gestion des Livres'!B:L,MATCH(SMALL('Gestion des Livres'!N:N,ROW(A14)),'Gestion des Livres'!N:N,0),1),\"\")","v":"Science 14"},{"$f":"IFERROR(INDEX('Gestion des Livres'!B:L,MATCH(SMALL('Gestion des Livres'!N:N,ROW(B14)),'Gestion des Livres'!N:N,0),4),\"\")","v":"00:00:00"},null,""]
[{"$f":"IFERROR(INDEX('Gestion des Livres'!B:L,MATCH(SMALL('Gestion des Livres'!N:N,ROW(A15)),'Gestion des Livres'!N:N,0),1),\"\")","v":"Science 15"},{"$f":"IFERROR(INDEX('Gestion des Livres'!B:L,MATCH(SMALL('Gestion des Livres'!N:N,ROW(B15)),'Gestion des Livres'!N:N,0),4),\"\")","v":"00:00:00"},null,""]
[{"$f":"IFERROR(INDEX('Gestion des Livres'!B:L,MATCH(SMALL('Gestion des Livres'!N:N,ROW(A16)),'Gestion des Livres'!N:N,0),1),\"\")","v":"Science 16"},{"$f":"IFERROR(INDEX('Gestion des Livres'!B:L,MATCH(SMALL('Gestion des Livres'!N:N,ROW(B16)),'Gestion des Livres'!N:N,0),4),\"\")","v":"00:00:00"},null,""]
[{"$f":"IFERROR(INDEX('Gestion des Livres'!B:L,MATCH(SMALL('Gestion des Livres'!N:N,ROW(A17)),'Gestion des Livres'!N:N,0),1),\"\")","v":"Science 17"},{"$f":"IFERROR(INDEX('Gestion des Livres'!B:L,MATCH(SMALL('Gestion des Livres'!N:N,ROW(B17)),'Gestion des Livres'!N:N,0),4),\"\")","v":"00:00:00"},null,""]
[{"$f":"IFERROR(INDEX('Gestion des Livres'!B:L,MATCH(SMALL('Gestion des Livres'!N:N,ROW(A18)),'Gestion des Livres'!N:N,0),1),\"\")","v":"Science 18"},{"$f":"IFERROR(INDEX('Gestion des Livres'!B:L,MATCH(SMALL('Gestion des Livres'!N:N,ROW(B18)),'Gestion des Livres'!N:N,0),4),\"\")","v":"00:00:00"},null,""]
{"$rows_left_out":409}