{"text_format":"1","workbook":"xlsx","n_sheets":9,"sheets":["P1","P2","P3","P4","P5","P6","P7","P8","Résultats Poules"],"not_rendered":{"charts":0,"images":0,"macros":1,"external_links":0,"defined_names":5,"comments":0,"pivot_tables":0},"unopened":[],"bounds":{"document_bytes":16777216,"sheet_cells":100000,"rows_first":2000,"rows_last":500,"rows_between":2000,"halvings":0,"cell_chars":16384,"cell_head_chars":4096},"cells_cut":0,"cells_raw":0,"read":"whole","date_system":"1900"}

{"sheet":"P1","index":0,"n_rows":103,"n_cols":27,"rows_kept":103,"cut":false,"hidden":false,"merged":[[0,0,0,5],[1,0,1,5],[2,0,2,5],[3,0,3,5],[23,6,24,6],[69,7,69,25],[69,2,69,5],[69,6,70,6],[3,8,3,10],[15,6,16,6],[63,6,64,6],[31,6,32,6],[39,6,40,6],[47,6,48,6],[55,6,56,6]]}
[null,null,null,null,null,null,3,null,null,null,null,null,null,null,null,null,null,null,null,null,null,null,null,null,null,null,"marcel1924"]
["CHAMPIONNAT DES CLUBS"]
[]
["POULE 1"]
["EQUIPES",null,"POINTS","Pour","Contre","Diff"]
["Club Abeille","1A",{"$f":"SUMIF($A$18:$A$69,A6,$E$18:$E$69)+SUMIF($C$18:$C$69,A6,$F$18:$F$69)","v":15},{"$f":"SUMIF($A$18:$A$69,$A6,$B$18:$B$69)+SUMIF($C$18:$C$69,$A6,$D$18:$D$69)","v":134},{"$f":"SUMIF($C$18:$C$69,$A6,$B$18:$B$69)+SUMIF($A$18:$A$69,$A6,$D$18:$D$69)","v":118},{"$f":"D6-E6","v":16}]
["Club Baleine","1B",{"$f":"SUMIF($A$18:$A$69,A7,$E$18:$E$69)+SUMIF($C$18:$C$69,A7,$F$18:$F$69)","v":17},{"$f":"SUMIF($A$18:$A$69,$A7,$B$18:$B$69)+SUMIF($C$18:$C$69,$A7,$D$18:$D$69)","v":141},{"$f":"SUMIF($C$18:$C$69,$A7,$B$18:$B$69)+SUMIF($A$18:$A$69,$A7,$D$18:$D$69)","v":111},30]
["Club Chat","1C",{"$f":"SUMIF($A$18:$A$69,A8,$E$18:$E$69)+SUMIF($C$18:$C$69,A8,$F$18:$F$69)","v":15},147,105,42]
["Club Dauphin","1D",15,123,129,-6]
["Club Elephant","1E",13,118,134,-16]
["Club Fourmi","1F",9,81,171,-90]
["Club Girafe","1G",11,124,128,{"$f":"D12-E12","v":-4}]
["Club Hirondelle","1H",17,{"$f":"SUMIF($A$18:$A$69,$A13,$B$18:$B$69)+SUMIF($C$18:$C$69,$A13,$D$18:$D$69)","v":140},112,{"$f":"D13-E13","v":28}]
[]
["1er MATCH le ","à",{"$f":"A6","v":"Club Abeille"}]
[null,null,null,null,null,null,"SI forfait éq recevante"]
["Equipes","score","Equipes","score","Points","Points"]
[{"$f":"A6","v":"Club Abeille"},12,{"$f":"A7","v":"Club Baleine"},{"$f":"IF(G18=19,19,IF(ISBLANK(B18),\"\",IF(B18=19,0,36-B18)))","v":24},{"$f":"IF(G18=19,0,IF(ISBLANK(B18),\"\",IF(B18<18,1,IF(B18=18,2,IF(B18>18,3)))))","v":1},{"$f":"IF(G18=19,3,IF(ISBLANK(B18),\"\",IF(B18=19,0,IF(D18<18,1,IF(D18=18,2,IF(D18>=20,3))))))","v":3},null,null,null,null,null,{"$f":"IF(B18>D18,A18&C18,IF(D18>B18,C18&A18,\"/\"))","v":"Club BaleineClub Abeille"},null,{"$f":"A18&C18","v":"Club AbeilleClub Baleine"},{"$f":"E18","v":1},{"$f":"C18&A18","v":"Club BaleineClub Abeille"},{"$f":"F18","v":3},{"$f":"B18","v":12},{"$f":"D18","v":24}]
[{"$f":"A8","v":"Club Chat"},24,{"$f":"A9","v":"Club Dauphin"},{"$f":"IF(G19=19,19,IF(ISBLANK(B19),\"\",IF(B19=19,0,36-B19)))","v":12},{"$f":"IF(G19=19,0,IF(ISBLANK(B19),\"\",IF(B19<18,1,IF(B19=18,2,IF(B19>18,3)))))","v":3},{"$f":"IF(G19=19,3,IF(ISBLANK(B19),\"\",IF(B19=19,0,IF(D19<18,1,IF(D19=18,2,IF(D19>=20,3))))))","v":1},null,null,null,null,null,{"$f":"IF(B19>D19,A19&C19,IF(D19>B19,C19&A19,\"/\"))","v":"Club ChatClub Dauphin"},null,{"$f":"A19&C19","v":"Club ChatClub Dauphin"},{"$f":"E19","v":3},{"$f":"C19&A19","v":"Club DauphinClub Chat"},{"$f":"F19","v":1},{"$f":"B19","v":24},{"$f":"D19","v":12}]
[{"$f":"A10","v":"Club Elephant"},30,{"$f":"A11","v":"Club Fourmi"},{"$f":"IF(G20=19,19,IF(ISBLANK(B20),\"\",IF(B20=19,0,36-B20)))","v":6},{"$f":"IF(G20=19,0,IF(ISBLANK(B20),\"\",IF(B20<18,1,IF(B20=18,2,IF(B20>18,3)))))","v":3},{"$f":"IF(G20=19,3,IF(ISBLANK(B20),\"\",IF(B20=19,0,IF(D20<18,1,IF(D20=18,2,IF(D20>=20,3))))))","v":1},null,null,null,null,null,{"$f":"IF(B20>D20,A20&C20,IF(D20>B20,C20&A20,\"/\"))","v":"Club ElephantClub Fourmi"},null,{"$f":"A20&C20","v":"Club ElephantClub Fourmi"},{"$f":"E20","v":3},{"$f":"C20&A20","v":"Club FourmiClub Elephant"},{"$f":"F20","v":1},{"$f":"B20","v":30},{"$f":"D20","v":6}]
[{"$f":"A12","v":"Club Girafe"},9,{"$f":"A13","v":"Club Hirondelle"},{"$f":"IF(G21=19,19,IF(ISBLANK(B21),\"\",IF(B21=19,0,36-B21)))","v":27},{"$f":"IF(G21=19,0,IF(ISBLANK(B21),\"\",IF(B21<18,1,IF(B21=18,2,IF(B21>18,3)))))","v":1},{"$f":"IF(G21=19,3,IF(ISBLANK(B21),\"\",IF(B21=19,0,IF(D21<18,1,IF(D21=18,2,IF(D21>=20,3))))))","v":3},null,null,null,null,null,{"$f":"IF(B21>D21,A21&C21,IF(D21>B21,C21&A21,\"/\"))","v":"Club HirondelleClub Girafe"},null,{"$f":"A21&C21","v":"Club GirafeClub Hirondelle"},{"$f":"E21","v":1},{"$f":"C21&A21","v":"Club HirondelleClub Girafe"},{"$f":"F21","v":3},{"$f":"B21","v":9},{"$f":"D21","v":27}]
[]
["2 éme MATCH le ","à",{"$f":"A7","v":"Club Baleine"}]
[null,null,null,null,null,null,"SI forfait éq recevante"]
["Equipes","score","Equipes","score","Points","Points"]
[{"$f":"A6","v":"Club Abeille"},22,{"$f":"A8","v":"Club Chat"},{"$f":"IF(G26=19,19,IF(ISBLANK(B26),\"\",IF(B26=19,0,36-B26)))","v":14},{"$f":"IF(G26=19,0,IF(ISBLANK(B26),\"\",IF(B26<18,1,IF(B26=18,2,IF(B26>18,3)))))","v":3},{"$f":"IF(G26=19,3,IF(ISBLANK(B26),\"\",IF(B26=19,0,IF(D26<18,1,IF(D26=18,2,IF(D26>=20,3))))))","v":1},null,null,null,null,null,{"$f":"IF(B26>D26,A26&C26,IF(D26>B26,C26&A26,\"/\"))","v":"Club AbeilleClub Chat"},null,{"$f":"A26&C26","v":"Club AbeilleClub Chat"},{"$f":"E26","v":3},{"$f":"C26&A26","v":"Club ChatClub Abeille"},{"$f":"F26","v":1},{"$f":"B26","v":22},{"$f":"D26","v":14}]
[{"$f":"A7","v":"Club Baleine"},10,{"$f":"A13","v":"Club Hirondelle"},{"$f":"IF(G27=19,19,IF(ISBLANK(B27),\"\",IF(B27=19,0,36-B27)))","v":26},{"$f":"IF(G27=19,0,IF(ISBLANK(B27),\"\",IF(B27<18,1,IF(B27=18,2,IF(B27>18,3)))))","v":1},{"$f":"IF(G27=19,3,IF(ISBLANK(B27),\"\",IF(B27=19,0,IF(D27<18,1,IF(D27=18,2,IF(D27>=20,3))))))","v":3},null,null,null,null,null,{"$f":"IF(B27>D27,A27&C27,IF(D27>B27,C27&A27,\"/\"))","v":"Club HirondelleClub Baleine"},null,{"$f":"A27&C27","v":"Club BaleineClub Hirondelle"},{"$f":"E27","v":1},{"$f":"C27&A27","v":"Club HirondelleClub Baleine"},{"$f":"F27","v":3},{"$f":"B27","v":10},{"$f":"D27","v":26}]
[{"$f":"A9","v":"Club Dauphin"},7,{"$f":"A11","v":"Club Fourmi"},{"$f":"IF(G28=19,19,IF(ISBLANK(B28),\"\",IF(B28=19,0,36-B28)))","v":29},{"$f":"IF(G28=19,0,IF(ISBLANK(B28),\"\",IF(B28<18,1,IF(B28=18,2,IF(B28>18,3)))))","v":1},{"$f":"IF(G28=19,3,IF(ISBLANK(B28),\"\",IF(B28=19,0,IF(D28<18,1,IF(D28=18,2,IF(D28>=20,3))))))","v":3},null,null,null,null,null,{"$f":"IF(B28>D28,A28&C28,IF(D28>B28,C28&A28,\"/\"))","v":"Club FourmiClub Dauphin"},null,{"$f":"A28&C28","v":"Club DauphinClub Fourmi"},{"$f":"E28","v":1},{"$f":"C28&A28","v":"Club FourmiClub Dauphin"},{"$f":"F28","v":3},{"$f":"B28","v":7},{"$f":"D28","v":29}]
[{"$f":"A10","v":"Club Elephant"},2,{"$f":"A12","v":"Club Girafe"},{"$f":"IF(G29=19,19,IF(ISBLANK(B29),\"\",IF(B29=19,0,36-B29)))","v":34},{"$f":"IF(G29=19,0,IF(ISBLANK(B29),\"\",IF(B29<18,1,IF(B29=18,2,IF(B29>18,3)))))","v":1},{"$f":"IF(G29=19,3,IF(ISBLANK(B29),\"\",IF(B29=19,0,IF(D29<18,1,IF(D29=18,2,IF(D29>=20,3))))))","v":3},null,null,null,null,null,{"$f":"IF(B29>D29,A29&C29,IF(D29>B29,C29&A29,\"/\"))","v":"Club GirafeClub Elephant"},null,{"$f":"A29&C29","v":"Club ElephantClub Girafe"},{"$f":"E29","v":1},{"$f":"C29&A29","v":"Club GirafeClub Elephant"},{"$f":"F29","v":3},{"$f":"B29","v":2},{"$f":"D29","v":34}]
[]
["3 éme MATCH le ","à",{"$f":"A8","v":"Club Chat"}]
[null,null,null,null,null,null,"SI forfait éq recevante"]
["Equipes","score","Equipes","score","Points","Points"]
[{"$f":"A6","v":"Club Abeille"},14,{"$f":"A13","v":"Club Hirondelle"},{"$f":"IF(G34=19,19,IF(ISBLANK(B34),\"\",IF(B34=19,0,36-B34)))","v":22},{"$f":"IF(G34=19,0,IF(ISBLANK(B34),\"\",IF(B34<18,1,IF(B34=18,2,IF(B34>18,3)))))","v":1},{"$f":"IF(G34=19,3,IF(ISBLANK(B34),\"\",IF(B34=19,0,IF(D34<18,1,IF(D34=18,2,IF(D34>=20,3))))))","v":3},null,null,null,null,null,{"$f":"IF(B34>D34,A34&C34,IF(D34>B34,C34&A34,\"/\"))","v":"Club HirondelleClub Abeille"},null,{"$f":"A34&C34","v":"Club AbeilleClub Hirondelle"},{"$f":"E34","v":1},{"$f":"C34&A34","v":"Club HirondelleClub Abeille"},{"$f":"F34","v":3},{"$f":"B34","v":14},{"$f":"D34","v":22}]
[{"$f":"A7","v":"Club Baleine"},26,{"$f":"A10","v":"Club Elephant"},{"$f":"IF(G35=19,19,IF(ISBLANK(B35),\"\",IF(B35=19,0,36-B35)))","v":10},{"$f":"IF(G35=19,0,IF(ISBLANK(B35),\"\",IF(B35<18,1,IF(B35=18,2,IF(B35>18,3)))))","v":3},{"$f":"IF(G35=19,3,IF(ISBLANK(B35),\"\",IF(B35=19,0,IF(D35<18,1,IF(D35=18,2,IF(D35>=20,3))))))","v":1},null,null,null,null,null,{"$f":"IF(B35>D35,A35&C35,IF(D35>B35,C35&A35,\"/\"))","v":"Club BaleineClub Elephant"},null,{"$f":"A35&C35","v":"Club BaleineClub Elephant"},{"$f":"E35","v":3},{"$f":"C35&A35","v":"Club ElephantClub Baleine"},{"$f":"F35","v":1},{"$f":"B35","v":26},{"$f":"D35","v":10}]
[{"$f":"A8","v":"Club Chat"},32,{"$f":"A11","v":"Club Fourmi"},{"$f":"IF(G36=19,19,IF(ISBLANK(B36),\"\",IF(B36=19,0,36-B36)))","v":4},{"$f":"IF(G36=19,0,IF(ISBLANK(B36),\"\",IF(B36<18,1,IF(B36=18,2,IF(B36>18,3)))))","v":3},{"$f":"IF(G36=19,3,IF(ISBLANK(B36),\"\",IF(B36=19,0,IF(D36<18,1,IF(D36=18,2,IF(D36>=20,3))))))","v":1},null,null,null,null,null,{"$f":"IF(B36>D36,A36&C36,IF(D36>B36,C36&A36,\"/\"))","v":"Club ChatClub Fourmi"},null,{"$f":"A36&C36","v":"Club ChatClub Fourmi"},{"$f":"E36","v":3},{"$f":"C36&A36","v":"Club FourmiClub Chat"},{"$f":"F36","v":1},{"$f":"B36","v":32},{"$f":"D36","v":4}]
[{"$f":"A9","v":"Club Dauphin"},21,{"$f":"A12","v":"Club Girafe"},{"$f":"IF(G37=19,19,IF(ISBLANK(B37),\"\",IF(B37=19,0,36-B37)))","v":15},{"$f":"IF(G37=19,0,IF(ISBLANK(B37),\"\",IF(B37<18,1,IF(B37=18,2,IF(B37>18,3)))))","v":3},{"$f":"IF(G37=19,3,IF(ISBLANK(B37),\"\",IF(B37=19,0,IF(D37<18,1,IF(D37=18,2,IF(D37>=20,3))))))","v":1},null,null,null,null,null,{"$f":"IF(B37>D37,A37&C37,IF(D37>B37,C37&A37,\"/\"))","v":"Club DauphinClub Girafe"},null,{"$f":"A37&C37","v":"Club DauphinClub Girafe"},{"$f":"E37","v":3},{"$f":"C37&A37","v":"Club GirafeClub Dauphin"},{"$f":"F37","v":1},{"$f":"B37","v":21},{"$f":"D37","v":15}]
[]
["4 éme MATCH le ","à",{"$f":"A9","v":"Club Dauphin"}]
[null,null,null,null,null,null,"SI forfait éq recevante"]
["Equipes","score","Equipes","score","Points","Points"]
[{"$f":"A6","v":"Club Abeille"},14,{"$f":"A9","v":"Club Dauphin"},{"$f":"IF(G42=19,19,IF(ISBLANK(B42),\"\",IF(B42=19,0,36-B42)))","v":22},{"$f":"IF(G42=19,0,IF(ISBLANK(B42),\"\",IF(B42<18,1,IF(B42=18,2,IF(B42>18,3)))))","v":1},{"$f":"IF(G42=19,3,IF(ISBLANK(B42),\"\",IF(B42=19,0,IF(D42<18,1,IF(D42=18,2,IF(D42>=20,3))))))","v":3},null,null,null,null,null,{"$f":"IF(B42>D42,A42&C42,IF(D42>B42,C42&A42,\"/\"))","v":"Club DauphinClub Abeille"},null,{"$f":"A42&C42","v":"Club AbeilleClub Dauphin"},{"$f":"E42","v":1},{"$f":"C42&A42","v":"Club DauphinClub Abeille"},{"$f":"F42","v":3},{"$f":"B42","v":14},{"$f":"D42","v":22}]
[{"$f":"A11","v":"Club Fourmi"},5,{"$f":"A12","v":"Club Girafe"},{"$f":"IF(G43=19,19,IF(ISBLANK(B43),\"\",IF(B43=19,0,36-B43)))","v":31},{"$f":"IF(G43=19,0,IF(ISBLANK(B43),\"\",IF(B43<18,1,IF(B43=18,2,IF(B43>18,3)))))","v":1},{"$f":"IF(G43=19,3,IF(ISBLANK(B43),\"\",IF(B43=19,0,IF(D43<18,1,IF(D43=18,2,IF(D43>=20,3))))))","v":3},null,null,null,null,null,{"$f":"IF(B43>D43,A43&C43,IF(D43>B43,C43&A43,\"/\"))","v":"Club GirafeClub Fourmi"},null,{"$f":"A43&C43","v":"Club FourmiClub Girafe"},{"$f":"E43","v":1},{"$f":"C43&A43","v":"Club GirafeClub Fourmi"},{"$f":"F43","v":3},{"$f":"B43","v":5},{"$f":"D43","v":31}]
[{"$f":"A7","v":"Club Baleine"},21,{"$f":"A8","v":"Club Chat"},{"$f":"IF(G44=19,19,IF(ISBLANK(B44),\"\",IF(B44=19,0,36-B44)))","v":15},{"$f":"IF(G44=19,0,IF(ISBLANK(B44),\"\",IF(B44<18,1,IF(B44=18,2,IF(B44>18,3)))))","v":3},{"$f":"IF(G44=19,3,IF(ISBLANK(B44),\"\",IF(B44=19,0,IF(D44<18,1,IF(D44=18,2,IF(D44>=20,3))))))","v":1},null,null,null,null,null,{"$f":"IF(B44>D44,A44&C44,IF(D44>B44,C44&A44,\"/\"))","v":"Club BaleineClub Chat"},null,{"$f":"A44&C44","v":"Club BaleineClub Chat"},{"$f":"E44","v":3},{"$f":"C44&A44","v":"Club ChatClub Baleine"},{"$f":"F44","v":1},{"$f":"B44","v":21},{"$f":"D44","v":15}]
[{"$f":"A10","v":"Club Elephant"},30,{"$f":"A13","v":"Club Hirondelle"},{"$f":"IF(G45=19,19,IF(ISBLANK(B45),\"\",IF(B45=19,0,36-B45)))","v":6},{"$f":"IF(G45=19,0,IF(ISBLANK(B45),\"\",IF(B45<18,1,IF(B45=18,2,IF(B45>18,3)))))","v":3},{"$f":"IF(G45=19,3,IF(ISBLANK(B45),\"\",IF(B45=19,0,IF(D45<18,1,IF(D45=18,2,IF(D45>=20,3))))))","v":1},null,null,null,null,null,{"$f":"IF(B45>D45,A45&C45,IF(D45>B45,C45&A45,\"/\"))","v":"Club ElephantClub Hirondelle"},null,{"$f":"A45&C45","v":"Club ElephantClub Hirondelle"},{"$f":"E45","v":3},{"$f":"C45&A45","v":"Club HirondelleClub Elephant"},{"$f":"F45","v":1},{"$f":"B45","v":30},{"$f":"D45","v":6}]
[]
["5 éme MATCH le ","à",{"$f":"A10","v":"Club Elephant"}]
[null,null,null,null,null,null,"SI forfait éq recevante"]
["Equipes","score","Equipes","score","Points","Points"]
[{"$f":"A6","v":"Club Abeille"},22,{"$f":"A11","v":"Club Fourmi"},{"$f":"IF(G50=19,19,IF(ISBLANK(B50),\"\",IF(B50=19,0,36-B50)))","v":14},{"$f":"IF(G50=19,0,IF(ISBLANK(B50),\"\",IF(B50<18,1,IF(B50=18,2,IF(B50>18,3)))))","v":3},{"$f":"IF(G50=19,3,IF(ISBLANK(B50),\"\",IF(B50=19,0,IF(D50<18,1,IF(D50=18,2,IF(D50>=20,3))))))","v":1},null,null,null,null,null,{"$f":"IF(B50>D50,A50&C50,IF(D50>B50,C50&A50,\"/\"))","v":"Club AbeilleClub Fourmi"},null,{"$f":"A50&C50","v":"Club AbeilleClub Fourmi"},{"$f":"E50","v":3},{"$f":"C50&A50","v":"Club FourmiClub Abeille"},{"$f":"F50","v":1},{"$f":"B50","v":22},{"$f":"D50","v":14}]
[{"$f":"A9","v":"Club Dauphin"},23,{"$f":"A13","v":"Club Hirondelle"},{"$f":"IF(G51=19,19,IF(ISBLANK(B51),\"\",IF(B51=19,0,36-B51)))","v":13},{"$f":"IF(G51=19,0,IF(ISBLANK(B51),\"\",IF(B51<18,1,IF(B51=18,2,IF(B51>18,3)))))","v":3},{"$f":"IF(G51=19,3,IF(ISBLANK(B51),\"\",IF(B51=19,0,IF(D51<18,1,IF(D51=18,2,IF(D51>=20,3))))))","v":1},null,null,null,null,null,{"$f":"IF(B51>D51,A51&C51,IF(D51>B51,C51&A51,\"/\"))","v":"Club DauphinClub Hirondelle"},null,{"$f":"A51&C51","v":"Club DauphinClub Hirondelle"},{"$f":"E51","v":3},{"$f":"C51&A51","v":"Club HirondelleClub Dauphin"},{"$f":"F51","v":1},{"$f":"B51","v":23},{"$f":"D51","v":13}]
[{"$f":"A7","v":"Club Baleine"},24,{"$f":"A12","v":"Club Girafe"},{"$f":"IF(G52=19,19,IF(ISBLANK(B52),\"\",IF(B52=19,0,36-B52)))","v":12},{"$f":"IF(G52=19,0,IF(ISBLANK(B52),\"\",IF(B52<18,1,IF(B52=18,2,IF(B52>18,3)))))","v":3},{"$f":"IF(G52=19,3,IF(ISBLANK(B52),\"\",IF(B52=19,0,IF(D52<18,1,IF(D52=18,2,IF(D52>=20,3))))))","v":1},null,null,null,null,null,{"$f":"IF(B52>D52,A52&C52,IF(D52>B52,C52&A52,\"/\"))","v":"Club BaleineClub Girafe"},null,{"$f":"A52&C52","v":"Club BaleineClub Girafe"},{"$f":"E52","v":3},{"$f":"C52&A52","v":"Club GirafeClub Baleine"},{"$f":"F52","v":1},{"$f":"B52","v":24},{"$f":"D52","v":12}]
[{"$f":"A8","v":"Club Chat"},25,{"$f":"A10","v":"Club Elephant"},{"$f":"IF(G53=19,19,IF(ISBLANK(B53),\"\",IF(B53=19,0,36-B53)))","v":11},{"$f":"IF(G53=19,0,IF(ISBLANK(B53),\"\",IF(B53<18,1,IF(B53=18,2,IF(B53>18,3)))))","v":3},{"$f":"IF(G53=19,3,IF(ISBLANK(B53),\"\",IF(B53=19,0,IF(D53<18,1,IF(D53=18,2,IF(D53>=20,3))))))","v":1},null,null,null,null,null,{"$f":"IF(B53>D53,A53&C53,IF(D53>B53,C53&A53,\"/\"))","v":"Club ChatClub Elephant"},null,{"$f":"A53&C53","v":"Club ChatClub Elephant"},{"$f":"E53","v":3},{"$f":"C53&A53","v":"Club ElephantClub Chat"},{"$f":"F53","v":1},{"$f":"B53","v":25},{"$f":"D53","v":11}]
[]
["6 éme MATCH le ","à",{"$f":"A11","v":"Club Fourmi"}]
[null,null,null,null,null,null,"SI forfait éq recevante"]
["Equipes","score","Equipes","score","Points","Points"]
[{"$f":"A7","v":"Club Baleine"},10,{"$f":"A9","v":"Club Dauphin"},{"$f":"IF(G58=19,19,IF(ISBLANK(B58),\"\",IF(B58=19,0,36-B58)))","v":26},{"$f":"IF(G58=19,0,IF(ISBLANK(B58),\"\",IF(B58<18,1,IF(B58=18,2,IF(B58>18,3)))))","v":1},{"$f":"IF(G58=19,3,IF(ISBLANK(B58),\"\",IF(B58=19,0,IF(D58<18,1,IF(D58=18,2,IF(D58>=20,3))))))","v":3},null,null,null,null,null,{"$f":"IF(B58>D58,A58&C58,IF(D58>B58,C58&A58,\"/\"))","v":"Club DauphinClub Baleine"},null,{"$f":"A58&C58","v":"Club BaleineClub Dauphin"},{"$f":"E58","v":1},{"$f":"C58&A58","v":"Club DauphinClub Baleine"},{"$f":"F58","v":3},{"$f":"B58","v":10},{"$f":"D58","v":26}]
[{"$f":"A10","v":"Club Elephant"},11,{"$f":"A6","v":"Club Abeille"},{"$f":"IF(G59=19,19,IF(ISBLANK(B59),\"\",IF(B59=19,0,36-B59)))","v":25},{"$f":"IF(G59=19,0,IF(ISBLANK(B59),\"\",IF(B59<18,1,IF(B59=18,2,IF(B59>18,3)))))","v":1},{"$f":"IF(G59=19,3,IF(ISBLANK(B59),\"\",IF(B59=19,0,IF(D59<18,1,IF(D59=18,2,IF(D59>=20,3))))))","v":3},null,null,null,null,null,{"$f":"IF(B59>D59,A59&C59,IF(D59>B59,C59&A59,\"/\"))","v":"Club AbeilleClub Elephant"},null,{"$f":"A59&C59","v":"Club ElephantClub Abeille"},{"$f":"E59","v":1},{"$f":"C59&A59","v":"Club AbeilleClub Elephant"},{"$f":"F59","v":3},{"$f":"B59","v":11},{"$f":"D59","v":25}]
[{"$f":"A12","v":"Club Girafe"},12,{"$f":"A8","v":"Club Chat"},{"$f":"IF(G60=19,19,IF(ISBLANK(B60),\"\",IF(B60=19,0,36-B60)))","v":24},{"$f":"IF(G60=19,0,IF(ISBLANK(B60),\"\",IF(B60<18,1,IF(B60=18,2,IF(B60>18,3)))))","v":1},{"$f":"IF(G60=19,3,IF(ISBLANK(B60),\"\",IF(B60=19,0,IF(D60<18,1,IF(D60=18,2,IF(D60>=20,3))))))","v":3},null,null,null,null,null,{"$f":"IF(B60>D60,A60&C60,IF(D60>B60,C60&A60,\"/\"))","v":"Club ChatClub Girafe"},null,{"$f":"A60&C60","v":"Club GirafeClub Chat"},{"$f":"E60","v":1},{"$f":"C60&A60","v":"Club ChatClub Girafe"},{"$f":"F60","v":3},{"$f":"B60","v":12},{"$f":"D60","v":24}]
[{"$f":"A11","v":"Club Fourmi"},13,{"$f":"A13","v":"Club Hirondelle"},{"$f":"IF(G61=19,19,IF(ISBLANK(B61),\"\",IF(B61=19,0,36-B61)))","v":23},{"$f":"IF(G61=19,0,IF(ISBLANK(B61),\"\",IF(B61<18,1,IF(B61=18,2,IF(B61>18,3)))))","v":1},{"$f":"IF(G61=19,3,IF(ISBLANK(B61),\"\",IF(B61=19,0,IF(D61<18,1,IF(D61=18,2,IF(D61>=20,3))))))","v":3},null,null,null,null,null,{"$f":"IF(B61>D61,A61&C61,IF(D61>B61,C61&A61,\"/\"))","v":"Club HirondelleClub Fourmi"},null,{"$f":"A61&C61","v":"Club FourmiClub Hirondelle"},{"$f":"E61","v":1},{"$f":"C61&A61","v":"Club HirondelleClub Fourmi"},{"$f":"F61","v":3},{"$f":"B61","v":13},{"$f":"D61","v":23}]
[]
["7 éme MATCH le","à",{"$f":"A12","v":"Club Girafe"}]
[null,null,null,null,null,null,"SI forfait éq recevante",null," "]
["Equipes","score","Equipes","score","Points","Points"]
[{"$f":"A6","v":"Club Abeille"},25,{"$f":"A12","v":"Club Girafe"},{"$f":"IF(G66=19,19,IF(ISBLANK(B66),\"\",IF(B66=19,0,36-B66)))","v":11},{"$f":"IF(G66=19,0,IF(ISBLANK(B66),\"\",IF(B66<18,1,IF(B66=18,2,IF(B66>18,3)))))","v":3},{"$f":"IF(G66=19,3,IF(ISBLANK(B66),\"\",IF(B66=19,0,IF(D66<18,1,IF(D66=18,2,IF(D66>=20,3))))))","v":1},null,null,null,null,null,{"$f":"IF(B66>D66,A66&C66,IF(D66>B66,C66&A66,\"/\"))","v":"Club AbeilleClub Girafe"},null,{"$f":"A66&C66","v":"Club AbeilleClub Girafe"},{"$f":"E66","v":3},{"$f":"C66&A66","v":"Club GirafeClub Abeille"},{"$f":"F66","v":1},{"$f":"B66","v":25},{"$f":"D66","v":11}]
[{"$f":"A7","v":"Club Baleine"},26,{"$f":"A11","v":"Club Fourmi"},{"$f":"IF(G67=19,19,IF(ISBLANK(B67),\"\",IF(B67=19,0,36-B67)))","v":10},{"$f":"IF(G67=19,0,IF(ISBLANK(B67),\"\",IF(B67<18,1,IF(B67=18,2,IF(B67>18,3)))))","v":3},{"$f":"IF(G67=19,3,IF(ISBLANK(B67),\"\",IF(B67=19,0,IF(D67<18,1,IF(D67=18,2,IF(D67>=20,3))))))","v":1},null,null,null,null,null,{"$f":"IF(B67>D67,A67&C67,IF(D67>B67,C67&A67,\"/\"))","v":"Club BaleineClub Fourmi"},null,{"$f":"A67&C67","v":"Club BaleineClub Fourmi"},{"$f":"E67","v":3},{"$f":"C67&A67","v":"Club FourmiClub Baleine"},{"$f":"F67","v":1},{"$f":"B67","v":26},{"$f":"D67","v":10}]
[{"$f":"A10","v":"Club Elephant"},24,{"$f":"A9","v":"Club Dauphin"},{"$f":"IF(G68=19,19,IF(ISBLANK(B68),\"\",IF(B68=19,0,36-B68)))","v":12},{"$f":"IF(G68=19,0,IF(ISBLANK(B68),\"\",IF(B68<18,1,IF(B68=18,2,IF(B68>18,3)))))","v":3},{"$f":"IF(G68=19,3,IF(ISBLANK(B68),\"\",IF(B68=19,0,IF(D68<18,1,IF(D68=18,2,IF(D68>=20,3))))))","v":1},null,null,null,null,null,{"$f":"IF(B68>D68,A68&C68,IF(D68>B68,C68&A68,\"/\"))","v":"Club ElephantClub Dauphin"},null,{"$f":"A68&C68","v":"Club ElephantClub Dauphin"},{"$f":"E68","v":3},{"$f":"C68&A68","v":"Club DauphinClub Elephant"},{"$f":"F68","v":1},{"$f":"B68","v":24},{"$f":"D68","v":12}]
[{"$f":"A8","v":"Club Chat"},13,{"$f":"A13","v":"Club Hirondelle"},{"$f":"IF(G69=19,19,IF(ISBLANK(B69),\"\",IF(B69=19,0,36-B69)))","v":23},{"$f":"IF(G69=19,0,IF(ISBLANK(B69),\"\",IF(B69<18,1,IF(B69=18,2,IF(B69>18,3)))))","v":1},{"$f":"IF(G69=19,3,IF(ISBLANK(B69),\"\",IF(B69=19,0,IF(D69<18,1,IF(D69=18,2,IF(D69>=20,3))))))","v":3},null,null,null,null,null,{"$f":"IF(B69>D69,A69&C69,IF(D69>B69,C69&A69,\"/\"))","v":"Club HirondelleClub Chat"},null,{"$f":"A69&C69","v":"Club ChatClub Hirondelle"},{"$f":"E69","v":1},{"$f":"C69&A69","v":"Club HirondelleClub Chat"},{"$f":"F69","v":3},{"$f":"B69","v":13},{"$f":"D69","v":23}]
[null,null,"CLASSEMENT",null,null,null,"Classt        Final","Rencontres entre exaequos"]
["EQUIPES",null,"POINTS","POUR","CONTRE","DIFF",null,"POINTS Exaequos","Exaq","n°",{"$f":"A6","v":"Club Abeille"},{"$f":"A7","v":"Club Baleine"},{"$f":"A8","v":"Club Chat"},{"$f":"A9","v":"Club Dauphin"},{"$f":"A10","v":"Club Elephant"},{"$f":"A11","v":"Club Fourmi"},{"$f":"A12","v":"Club Girafe"},{"$f":"A13","v":"Club Hirondelle"},"Pts matchs",null,null,null,"1000000*Pts matchs +1000 (Diff +  abs(diff mini) )+Pour ","RANG","DIFF Exaequos","POUR Exaequos"]
["Club Hirondelle","1H",17,140,112,28,1,{"$f":"IF(S72>0,S72,\"\")","v":3},{"$f":"COUNTIF($C$72:$C$79,C72)","v":2},{"$f":"IF(AND(I72>1,COUNTIFS(I$72:I72,I72,C$72:C72,C72)=1),MAX(J$71:J71)+1,\"\")","v":1},{"$f":"IF($A72=K$71,\"\",IF(INDEX($C$72:$C$79,MATCH(K$71,$A$72:$A$79,0))=$C72,IFERROR(VLOOKUP($A72&K$71,$N$18:$O$69,2,0),  VLOOKUP(K$71&$A72,$N$18:$Q$69,4,0)),          \"\"))","v":""},3,"","","","","","",{"$f":"SUM(K72:R72)","v":3},null,null,null,{"$f":"IF(I72<3,S72*1000000+(F72+ABS(MIN($F$72:$F$79)))*1000+D72,S72*1000000+U96*1000+Z72)","v":3118140},{"$f":"IF(I72>2,RANK(W72,OFFSET(W$71,MATCH(I72,$I$72:$I$79,0),,I72)))","v":false},{"$f":"IF(S96=0,\"\",S96)","v":16},{"$f":"IF(S80=0,\"\",S80)","v":26}]
["Club Baleine","1B",17,141,111,30,2,{"$f":"IF(S73>0,S73,\"\")","v":1},2,{"$f":"IF(AND(I73>1,COUNTIFS(I$72:I73,I73,C$72:C73,C73)=1),MAX(J$71:J72)+1,\"\")","v":""},"","","","","","","",1,{"$f":"SUM(K73:R73)","v":1},null,null,null,{"$f":"IF(I73<3,S73*1000000+(F73+ABS(MIN($F$72:$F$79)))*1000+D73,S73*1000000+U97*1000+Z73)","v":1120141},{"$f":"IF(I73>2,RANK(W73,OFFSET(W$71,MATCH(I73,$I$72:$I$79,0),,I73)))","v":false},-16,10]
["Club Chat","1C",15,147,105,42,3,{"$f":"IF(S74>0,S74,\"\")","v":4},3,{"$f":"IF(AND(I74>1,COUNTIFS(I$72:I74,I74,C$72:C74,C74)=1),MAX(J$71:J73)+1,\"\")","v":2},1,"","",3,"","","","",4,null,null,null,4020038,1,4,38]
["Club Abeille","1A",15,134,118,16,4,{"$f":"IF(S75>0,S75,\"\")","v":4},3,{"$f":"IF(AND(I75>1,COUNTIFS(I$72:I75,I75,C$72:C75,C75)=1),MAX(J$71:J74)+1,\"\")","v":""},"","",3,1,"","","","",4,null,null,null,4016036,2,"",36]
["Club Dauphin","1D",15,123,129,-6,5,{"$f":"IF(S76>0,S76,\"\")","v":4},3,{"$f":"IF(AND(I76>1,COUNTIFS(I$72:I76,I76,C$72:C76,C76)=1),MAX(J$71:J75)+1,\"\")","v":""},3,"",1,"","","","","",4,null,null,null,4012034,3,-4,34]
["Club Elephant","1E",13,118,134,-16,6,{"$f":"IF(S77>0,S77,\"\")","v":""},1,{"$f":"IF(AND(I77>1,COUNTIFS(I$72:I77,I77,C$72:C77,C77)=1),MAX(J$71:J76)+1,\"\")","v":""},"","","","","","","","",0,null,null,null,74118,false,"",""]
["Club Girafe","1G",11,124,128,-4,7,{"$f":"IF(S78>0,S78,\"\")","v":""},1,{"$f":"IF(AND(I78>1,COUNTIFS(I$72:I78,I78,C$72:C78,C78)=1),MAX(J$71:J77)+1,\"\")","v":""},"","","","","","","","",0,null,null,null,86124,false,"",""]
["Club Fourmi","1F",9,81,171,-90,8,{"$f":"IF(S79>0,S79,\"\")","v":""},1,{"$f":"IF(AND(I79>1,COUNTIFS(I$72:I79,I79,C$72:C79,C79)=1),MAX(J$71:J78)+1,\"\")","v":""},"","","","","","","","",0,null,null,null,81,false,"",""]
[null,null,null,null,null,null,null,null,"POUR",{"$f":"A72","v":"Club Hirondelle"},{"$f":"IF($A72=K$71,\"\",IF(INDEX($C$72:$C$79,MATCH(K$71,$A$72:$A$79,0))=$C72,IFERROR(VLOOKUP($A72&K$71,$N$18:$R$69,5,0),  VLOOKUP(K$71&$A72,$N$18:$S$69,6,0)),          \"\"))","v":""},26,"","","","","","",26]
[null,null,null,null,null,null,null,null,null,"Club Baleine","","","","","","","",10,10]
[null,null,null,null,null,null,null,null,null,"Club Chat",14,"","",24,"","","","",38]
[null,null,null,null,null,null,null,null,null,"Club Abeille","","",22,14,"","","","",36]
[null,null,null,null,null,null,null,null,null,"Club Dauphin",22,"",12,"","","","","",34,null,null,null,null,null,"  "]
[null,null,null,null,null,null,null,null,null,"Club Elephant","","","","","","","","",0]
[null,null,null,null,null,null,null,null,null,"Club Girafe","","","","","","","","",0]
[null,null,null,null,null,null,null,null,null,"Club Fourmi","","","","","","","","",0]
[null,null,null,null,null,null,null,null,"CONTRE",{"$f":"J80","v":"Club Hirondelle"},{"$f":"INDEX($K$80:$R$87,MATCH(K$71,$J$80:$J$87,0),MATCH($J80,$K$71:$R$71,0))","v":""},{"$f":"INDEX($K$80:$R$87,MATCH(L$71,$J$80:$J$87,0),MATCH($J80,$K$71:$R$71,0))","v":10},"","","","","","",10]
[null,null,null,null,null,null,null,null,null,{"$f":"J81","v":"Club Baleine"},{"$f":"INDEX($K$80:$R$87,MATCH(K$71,$J$80:$J$87,0),MATCH($J81,$K$71:$R$71,0))","v":""},"","","","","","",26,26]
[null,null,null,null,null,null,null,null,null,"Club Chat",22,"","",12,"","","","",34]
[null,null,null,null,null,null,null,null,null,"Club Abeille","","",14,22,"","","","",36]
[null,null,null,null,null,null,null,null,null,"Club Dauphin",14,"",24,"","","","","",38]
[null,null,null,null,null,null,null,null,null,"Club Elephant","","","","","","","","",0]
[null,null,null,null,null,null,null,null,null,"Club Girafe","","","","","","","","",0]
[null,null,null,null,null,null,null,null,null,"Club Fourmi","","","","","","","","",0,null,"Diff pondérée"]
[null,null,null,null,null,null,null,null,"DIFF",{"$f":"J88","v":"Club Hirondelle"},null,null,null,null,null,null,null,null,{"$f":"S80-S88","v":16},null,{"$f":"S96+ABS(MIN($S$96:$S$103))","v":32}]
[null,null,null,null,null,null,null,null,null,{"$f":"J89","v":"Club Baleine"},null,null,null,null,null,null,null,null,{"$f":"S81-S89","v":-16},null,0]
[null,null,null,null,null,null,null,null,null,"Club Chat",null,null,null,null,null,null,null,null,4,null,20]
[null,null,null,null,null,null,null,null,null,"Club Abeille",null,null,null,null,null,null,null,null,0,null,16]
[null,null,null,null,null,null,null,null,null,"Club Dauphin",null,null,null,null,null,null,null,null,-4,null,12]
[null,null,null,null,null,null,null,null,null,"Club Elephant",null,null,null,null,null,null,null,null,0,null,16]
[null,null,null,null,null,null,null,null,null,"Club Girafe",null,null,null,null,null,null,null,null,0,null,{"$f":"S102+ABS(MIN($S$96:$S$103))","v":16}]
[null,null,null,null,null,null,null,null,null,"Club Fourmi",null,null,null,null,null,null,null,null,0,null,{"$f":"S103+ABS(MIN($S$96:$S$103))","v":16}]

{"sheet":"P2","index":1,"n_rows":103,"n_cols":26,"rows_kept":103,"cut":false,"hidden":false,"merged":[[0,0,0,5],[1,0,1,5],[2,0,2,5],[3,0,3,5],[3,8,3,10],[15,6,16,6],[69,2,69,5],[69,6,70,6],[69,7,69,25],[23,6,24,6],[31,6,32,6],[39,6,40,6],[47,6,48,6],[55,6,56,6],[63,6,64,6]]}
[null,null,null,null,null,null,3]
["CHAMPIONNAT DES CLUBS"]
[]
["POULE 2"]
["EQUIPES",null,"POINTS","Pour","Contre","Diff"]
["Club Iguane","1A",{"$f":"SUMIF($A$18:$A$69,A6,$E$18:$E$69)+SUMIF($C$18:$C$69,A6,$F$18:$F$69)","v":13},{"$f":"SUMIF($A$18:$A$69,$A6,$B$18:$B$69)+SUMIF($C$18:$C$69,$A6,$D$18:$D$69)","v":120},{"$f":"SUMIF($C$18:$C$69,$A6,$B$18:$B$69)+SUMIF($A$18:$A$69,$A6,$D$18:$D$69)","v":132},{"$f":"D6-E6","v":-12}]
["Club Jaguar","1B",{"$f":"SUMIF($A$18:$A$69,A7,$E$18:$E$69)+SUMIF($C$18:$C$69,A7,$F$18:$F$69)","v":17},{"$f":"SUMIF($A$18:$A$69,$A7,$B$18:$B$69)+SUMIF($C$18:$C$69,$A7,$D$18:$D$69)","v":135},{"$f":"SUMIF($C$18:$C$69,$A7,$B$18:$B$69)+SUMIF($A$18:$A$69,$A7,$D$18:$D$69)","v":117},18]
["Club Koala","1C",{"$f":"SUMIF($A$18:$A$69,A8,$E$18:$E$69)+SUMIF($C$18:$C$69,A8,$F$18:$F$69)","v":15},144,108,36]
["Club Leopard","1D",11,94,158,-64]
["Club Marsouin","1E",19,172,80,92]
["Club Narval","1F",13,122,130,-8]
["Club Otarie","1G",15,134,118,{"$f":"D12-E12","v":16}]
["Club Panthere","1H",9,{"$f":"SUMIF($A$18:$A$69,$A13,$B$18:$B$69)+SUMIF($C$18:$C$69,$A13,$D$18:$D$69)","v":87},165,{"$f":"D13-E13","v":-78}]
[]
["1er MATCH le ","à",{"$f":"A6","v":"Club Iguane"}]
[null,null,null,null,null,null,"SI forfait éq recevante"]
["Equipes","score","Equipes","score","Points","Points"]
[{"$f":"A6","v":"Club Iguane"},32,{"$f":"A7","v":"Club Jaguar"},{"$f":"IF(G18=19,19,IF(ISBLANK(B18),\"\",IF(B18=19,0,36-B18)))","v":4},{"$f":"IF(G18=19,0,IF(ISBLANK(B18),\"\",IF(B18<18,1,IF(B18=18,2,IF(B18>18,3)))))","v":3},{"$f":"IF(G18=19,3,IF(ISBLANK(B18),\"\",IF(B18=19,0,IF(D18<18,1,IF(D18=18,2,IF(D18>=20,3))))))","v":1},null,null,null,null,null,{"$f":"IF(B18>D18,A18&C18,IF(D18>B18,C18&A18,\"/\"))","v":"Club IguaneClub Jaguar"},null,{"$f":"A18&C18","v":"Club IguaneClub Jaguar"},{"$f":"E18","v":3},{"$f":"C18&A18","v":"Club JaguarClub Iguane"},{"$f":"F18","v":1},{"$f":"B18","v":32},{"$f":"D18","v":4}]
[{"$f":"A8","v":"Club Koala"},30,{"$f":"A9","v":"Club Leopard"},{"$f":"IF(G19=19,19,IF(ISBLANK(B19),\"\",IF(B19=19,0,36-B19)))","v":6},{"$f":"IF(G19=19,0,IF(ISBLANK(B19),\"\",IF(B19<18,1,IF(B19=18,2,IF(B19>18,3)))))","v":3},{"$f":"IF(G19=19,3,IF(ISBLANK(B19),\"\",IF(B19=19,0,IF(D19<18,1,IF(D19=18,2,IF(D19>=20,3))))))","v":1},null,null,null,null,null,{"$f":"IF(B19>D19,A19&C19,IF(D19>B19,C19&A19,\"/\"))","v":"Club KoalaClub Leopard"},null,{"$f":"A19&C19","v":"Club KoalaClub Leopard"},{"$f":"E19","v":3},{"$f":"C19&A19","v":"Club LeopardClub Koala"},{"$f":"F19","v":1},{"$f":"B19","v":30},{"$f":"D19","v":6}]
[{"$f":"A10","v":"Club Marsouin"},28,{"$f":"A11","v":"Club Narval"},{"$f":"IF(G20=19,19,IF(ISBLANK(B20),\"\",IF(B20=19,0,36-B20)))","v":8},{"$f":"IF(G20=19,0,IF(ISBLANK(B20),\"\",IF(B20<18,1,IF(B20=18,2,IF(B20>18,3)))))","v":3},{"$f":"IF(G20=19,3,IF(ISBLANK(B20),\"\",IF(B20=19,0,IF(D20<18,1,IF(D20=18,2,IF(D20>=20,3))))))","v":1},null,null,null,null,null,{"$f":"IF(B20>D20,A20&C20,IF(D20>B20,C20&A20,\"/\"))","v":"Club MarsouinClub Narval"},null,{"$f":"A20&C20","v":"Club MarsouinClub Narval"},{"$f":"E20","v":3},{"$f":"C20&A20","v":"Club NarvalClub Marsouin"},{"$f":"F20","v":1},{"$f":"B20","v":28},{"$f":"D20","v":8}]
[{"$f":"A12","v":"Club Otarie"},25,{"$f":"A13","v":"Club Panthere"},{"$f":"IF(G21=19,19,IF(ISBLANK(B21),\"\",IF(B21=19,0,36-B21)))","v":11},{"$f":"IF(G21=19,0,IF(ISBLANK(B21),\"\",IF(B21<18,1,IF(B21=18,2,IF(B21>18,3)))))","v":3},{"$f":"IF(G21=19,3,IF(ISBLANK(B21),\"\",IF(B21=19,0,IF(D21<18,1,IF(D21=18,2,IF(D21>=20,3))))))","v":1},null,null,null,null,null,{"$f":"IF(B21>D21,A21&C21,IF(D21>B21,C21&A21,\"/\"))","v":"Club OtarieClub Panthere"},null,{"$f":"A21&C21","v":"Club OtarieClub Panthere"},{"$f":"E21","v":3},{"$f":"C21&A21","v":"Club PanthereClub Otarie"},{"$f":"F21","v":1},{"$f":"B21","v":25},{"$f":"D21","v":11}]
[]
["2 éme MATCH le ","à",{"$f":"A7","v":"Club Jaguar"}]
[null,null,null,null,null,null,"SI forfait éq recevante"]
["Equipes","score","Equipes","score","Points","Points"]
[{"$f":"A6","v":"Club Iguane"},15,{"$f":"A8","v":"Club Koala"},{"$f":"IF(G26=19,19,IF(ISBLANK(B26),\"\",IF(B26=19,0,36-B26)))","v":21},{"$f":"IF(G26=19,0,IF(ISBLANK(B26),\"\",IF(B26<18,1,IF(B26=18,2,IF(B26>18,3)))))","v":1},{"$f":"IF(G26=19,3,IF(ISBLANK(B26),\"\",IF(B26=19,0,IF(D26<18,1,IF(D26=18,2,IF(D26>=20,3))))))","v":3},null,null,null,null,null,{"$f":"IF(B26>D26,A26&C26,IF(D26>B26,C26&A26,\"/\"))","v":"Club KoalaClub Iguane"},null,{"$f":"A26&C26","v":"Club IguaneClub Koala"},{"$f":"E26","v":1},{"$f":"C26&A26","v":"Club KoalaClub Iguane"},{"$f":"F26","v":3},{"$f":"B26","v":15},{"$f":"D26","v":21}]
[{"$f":"A7","v":"Club Jaguar"},20,{"$f":"A13","v":"Club Panthere"},{"$f":"IF(G27=19,19,IF(ISBLANK(B27),\"\",IF(B27=19,0,36-B27)))","v":16},{"$f":"IF(G27=19,0,IF(ISBLANK(B27),\"\",IF(B27<18,1,IF(B27=18,2,IF(B27>18,3)))))","v":3},{"$f":"IF(G27=19,3,IF(ISBLANK(B27),\"\",IF(B27=19,0,IF(D27<18,1,IF(D27=18,2,IF(D27>=20,3))))))","v":1},null,null,null,null,null,{"$f":"IF(B27>D27,A27&C27,IF(D27>B27,C27&A27,\"/\"))","v":"Club JaguarClub Panthere"},null,{"$f":"A27&C27","v":"Club JaguarClub Panthere"},{"$f":"E27","v":3},{"$f":"C27&A27","v":"Club PanthereClub Jaguar"},{"$f":"F27","v":1},{"$f":"B27","v":20},{"$f":"D27","v":16}]
[{"$f":"A9","v":"Club Leopard"},25,{"$f":"A11","v":"Club Narval"},{"$f":"IF(G28=19,19,IF(ISBLANK(B28),\"\",IF(B28=19,0,36-B28)))","v":11},{"$f":"IF(G28=19,0,IF(ISBLANK(B28),\"\",IF(B28<18,1,IF(B28=18,2,IF(B28>18,3)))))","v":3},{"$f":"IF(G28=19,3,IF(ISBLANK(B28),\"\",IF(B28=19,0,IF(D28<18,1,IF(D28=18,2,IF(D28>=20,3))))))","v":1},null,null,null,null,null,{"$f":"IF(B28>D28,A28&C28,IF(D28>B28,C28&A28,\"/\"))","v":"Club LeopardClub Narval"},null,{"$f":"A28&C28","v":"Club LeopardClub Narval"},{"$f":"E28","v":3},{"$f":"C28&A28","v":"Club NarvalClub Leopard"},{"$f":"F28","v":1},{"$f":"B28","v":25},{"$f":"D28","v":11}]
[{"$f":"A10","v":"Club Marsouin"},30,{"$f":"A12","v":"Club Otarie"},{"$f":"IF(G29=19,19,IF(ISBLANK(B29),\"\",IF(B29=19,0,36-B29)))","v":6},{"$f":"IF(G29=19,0,IF(ISBLANK(B29),\"\",IF(B29<18,1,IF(B29=18,2,IF(B29>18,3)))))","v":3},{"$f":"IF(G29=19,3,IF(ISBLANK(B29),\"\",IF(B29=19,0,IF(D29<18,1,IF(D29=18,2,IF(D29>=20,3))))))","v":1},null,null,null,null,null,{"$f":"IF(B29>D29,A29&C29,IF(D29>B29,C29&A29,\"/\"))","v":"Club MarsouinClub Otarie"},null,{"$f":"A29&C29","v":"Club MarsouinClub Otarie"},{"$f":"E29","v":3},{"$f":"C29&A29","v":"Club OtarieClub Marsouin"},{"$f":"F29","v":1},{"$f":"B29","v":30},{"$f":"D29","v":6}]
[]
["3 éme MATCH le ","à",{"$f":"A8","v":"Club Koala"}]
[null,null,null,null,null,null,"SI forfait éq recevante"]
["Equipes","score","Equipes","score","Points","Points"]
[{"$f":"A6","v":"Club Iguane"},29,{"$f":"A13","v":"Club Panthere"},{"$f":"IF(G34=19,19,IF(ISBLANK(B34),\"\",IF(B34=19,0,36-B34)))","v":7},{"$f":"IF(G34=19,0,IF(ISBLANK(B34),\"\",IF(B34<18,1,IF(B34=18,2,IF(B34>18,3)))))","v":3},{"$f":"IF(G34=19,3,IF(ISBLANK(B34),\"\",IF(B34=19,0,IF(D34<18,1,IF(D34=18,2,IF(D34>=20,3))))))","v":1},null,null,null,null,null,{"$f":"IF(B34>D34,A34&C34,IF(D34>B34,C34&A34,\"/\"))","v":"Club IguaneClub Panthere"},null,{"$f":"A34&C34","v":"Club IguaneClub Panthere"},{"$f":"E34","v":3},{"$f":"C34&A34","v":"Club PanthereClub Iguane"},{"$f":"F34","v":1},{"$f":"B34","v":29},{"$f":"D34","v":7}]
[{"$f":"A7","v":"Club Jaguar"},28,{"$f":"A10","v":"Club Marsouin"},{"$f":"IF(G35=19,19,IF(ISBLANK(B35),\"\",IF(B35=19,0,36-B35)))","v":8},{"$f":"IF(G35=19,0,IF(ISBLANK(B35),\"\",IF(B35<18,1,IF(B35=18,2,IF(B35>18,3)))))","v":3},{"$f":"IF(G35=19,3,IF(ISBLANK(B35),\"\",IF(B35=19,0,IF(D35<18,1,IF(D35=18,2,IF(D35>=20,3))))))","v":1},null,null,null,null,null,{"$f":"IF(B35>D35,A35&C35,IF(D35>B35,C35&A35,\"/\"))","v":"Club JaguarClub Marsouin"},null,{"$f":"A35&C35","v":"Club JaguarClub Marsouin"},{"$f":"E35","v":3},{"$f":"C35&A35","v":"Club MarsouinClub Jaguar"},{"$f":"F35","v":1},{"$f":"B35","v":28},{"$f":"D35","v":8}]
[{"$f":"A8","v":"Club Koala"},27,{"$f":"A11","v":"Club Narval"},{"$f":"IF(G36=19,19,IF(ISBLANK(B36),\"\",IF(B36=19,0,36-B36)))","v":9},{"$f":"IF(G36=19,0,IF(ISBLANK(B36),\"\",IF(B36<18,1,IF(B36=18,2,IF(B36>18,3)))))","v":3},{"$f":"IF(G36=19,3,IF(ISBLANK(B36),\"\",IF(B36=19,0,IF(D36<18,1,IF(D36=18,2,IF(D36>=20,3))))))","v":1},null,null,null,null,null,{"$f":"IF(B36>D36,A36&C36,IF(D36>B36,C36&A36,\"/\"))","v":"Club KoalaClub Narval"},null,{"$f":"A36&C36","v":"Club KoalaClub Narval"},{"$f":"E36","v":3},{"$f":"C36&A36","v":"Club NarvalClub Koala"},{"$f":"F36","v":1},{"$f":"B36","v":27},{"$f":"D36","v":9}]
[{"$f":"A9","v":"Club Leopard"},26,{"$f":"A12","v":"Club Otarie"},{"$f":"IF(G37=19,19,IF(ISBLANK(B37),\"\",IF(B37=19,0,36-B37)))","v":10},{"$f":"IF(G37=19,0,IF(ISBLANK(B37),\"\",IF(B37<18,1,IF(B37=18,2,IF(B37>18,3)))))","v":3},{"$f":"IF(G37=19,3,IF(ISBLANK(B37),\"\",IF(B37=19,0,IF(D37<18,1,IF(D37=18,2,IF(D37>=20,3))))))","v":1},null,null,null,null,null,{"$f":"IF(B37>D37,A37&C37,IF(D37>B37,C37&A37,\"/\"))","v":"Club LeopardClub Otarie"},null,{"$f":"A37&C37","v":"Club LeopardClub Otarie"},{"$f":"E37","v":3},{"$f":"C37&A37","v":"Club OtarieClub Leopard"},{"$f":"F37","v":1},{"$f":"B37","v":26},{"$f":"D37","v":10}]
[]
["4 éme MATCH le ","à",{"$f":"A9","v":"Club Leopard"}]
[null,null,null,null,null,null,"SI forfait éq recevante"]
["Equipes","score","Equipes","score","Points","Points"]
[{"$f":"A6","v":"Club Iguane"},20,{"$f":"A9","v":"Club Leopard"},{"$f":"IF(G42=19,19,IF(ISBLANK(B42),\"\",IF(B42=19,0,36-B42)))","v":16},{"$f":"IF(G42=19,0,IF(ISBLANK(B42),\"\",IF(B42<18,1,IF(B42=18,2,IF(B42>18,3)))))","v":3},{"$f":"IF(G42=19,3,IF(ISBLANK(B42),\"\",IF(B42=19,0,IF(D42<18,1,IF(D42=18,2,IF(D42>=20,3))))))","v":1},null,null,null,null,null,{"$f":"IF(B42>D42,A42&C42,IF(D42>B42,C42&A42,\"/\"))","v":"Club IguaneClub Leopard"},null,{"$f":"A42&C42","v":"Club IguaneClub Leopard"},{"$f":"E42","v":3},{"$f":"C42&A42","v":"Club LeopardClub Iguane"},{"$f":"F42","v":1},{"$f":"B42","v":20},{"$f":"D42","v":16}]
[{"$f":"A11","v":"Club Narval"},22,{"$f":"A12","v":"Club Otarie"},{"$f":"IF(G43=19,19,IF(ISBLANK(B43),\"\",IF(B43=19,0,36-B43)))","v":14},{"$f":"IF(G43=19,0,IF(ISBLANK(B43),\"\",IF(B43<18,1,IF(B43=18,2,IF(B43>18,3)))))","v":3},{"$f":"IF(G43=19,3,IF(ISBLANK(B43),\"\",IF(B43=19,0,IF(D43<18,1,IF(D43=18,2,IF(D43>=20,3))))))","v":1},null,null,null,null,null,{"$f":"IF(B43>D43,A43&C43,IF(D43>B43,C43&A43,\"/\"))","v":"Club NarvalClub Otarie"},null,{"$f":"A43&C43","v":"Club NarvalClub Otarie"},{"$f":"E43","v":3},{"$f":"C43&A43","v":"Club OtarieClub Narval"},{"$f":"F43","v":1},{"$f":"B43","v":22},{"$f":"D43","v":14}]
[{"$f":"A7","v":"Club Jaguar"},24,{"$f":"A8","v":"Club Koala"},{"$f":"IF(G44=19,19,IF(ISBLANK(B44),\"\",IF(B44=19,0,36-B44)))","v":12},{"$f":"IF(G44=19,0,IF(ISBLANK(B44),\"\",IF(B44<18,1,IF(B44=18,2,IF(B44>18,3)))))","v":3},{"$f":"IF(G44=19,3,IF(ISBLANK(B44),\"\",IF(B44=19,0,IF(D44<18,1,IF(D44=18,2,IF(D44>=20,3))))))","v":1},null,null,null,null,null,{"$f":"IF(B44>D44,A44&C44,IF(D44>B44,C44&A44,\"/\"))","v":"Club JaguarClub Koala"},null,{"$f":"A44&C44","v":"Club JaguarClub Koala"},{"$f":"E44","v":3},{"$f":"C44&A44","v":"Club KoalaClub Jaguar"},{"$f":"F44","v":1},{"$f":"B44","v":24},{"$f":"D44","v":12}]
[{"$f":"A10","v":"Club Marsouin"},26,{"$f":"A13","v":"Club Panthere"},{"$f":"IF(G45=19,19,IF(ISBLANK(B45),\"\",IF(B45=19,0,36-B45)))","v":10},{"$f":"IF(G45=19,0,IF(ISBLANK(B45),\"\",IF(B45<18,1,IF(B45=18,2,IF(B45>18,3)))))","v":3},{"$f":"IF(G45=19,3,IF(ISBLANK(B45),\"\",IF(B45=19,0,IF(D45<18,1,IF(D45=18,2,IF(D45>=20,3))))))","v":1},null,null,null,null,null,{"$f":"IF(B45>D45,A45&C45,IF(D45>B45,C45&A45,\"/\"))","v":"Club MarsouinClub Panthere"},null,{"$f":"A45&C45","v":"Club MarsouinClub Panthere"},{"$f":"E45","v":3},{"$f":"C45&A45","v":"Club PanthereClub Marsouin"},{"$f":"F45","v":1},{"$f":"B45","v":26},{"$f":"D45","v":10}]
[]
["5 éme MATCH le ","à",{"$f":"A10","v":"Club Marsouin"}]
[null,null,null,null,null,null,"SI forfait éq recevante"]
["Equipes","score","Equipes","score","Points","Points"]
[{"$f":"A6","v":"Club Iguane"},4,{"$f":"A11","v":"Club Narval"},{"$f":"IF(G50=19,19,IF(ISBLANK(B50),\"\",IF(B50=19,0,36-B50)))","v":32},{"$f":"IF(G50=19,0,IF(ISBLANK(B50),\"\",IF(B50<18,1,IF(B50=18,2,IF(B50>18,3)))))","v":1},{"$f":"IF(G50=19,3,IF(ISBLANK(B50),\"\",IF(B50=19,0,IF(D50<18,1,IF(D50=18,2,IF(D50>=20,3))))))","v":3},null,null,null,null,null,{"$f":"IF(B50>D50,A50&C50,IF(D50>B50,C50&A50,\"/\"))","v":"Club NarvalClub Iguane"},null,{"$f":"A50&C50","v":"Club IguaneClub Narval"},{"$f":"E50","v":1},{"$f":"C50&A50","v":"Club NarvalClub Iguane"},{"$f":"F50","v":3},{"$f":"B50","v":4},{"$f":"D50","v":32}]
[{"$f":"A9","v":"Club Leopard"},6,{"$f":"A13","v":"Club Panthere"},{"$f":"IF(G51=19,19,IF(ISBLANK(B51),\"\",IF(B51=19,0,36-B51)))","v":30},{"$f":"IF(G51=19,0,IF(ISBLANK(B51),\"\",IF(B51<18,1,IF(B51=18,2,IF(B51>18,3)))))","v":1},{"$f":"IF(G51=19,3,IF(ISBLANK(B51),\"\",IF(B51=19,0,IF(D51<18,1,IF(D51=18,2,IF(D51>=20,3))))))","v":3},null,null,null,null,null,{"$f":"IF(B51>D51,A51&C51,IF(D51>B51,C51&A51,\"/\"))","v":"Club PanthereClub Leopard"},null,{"$f":"A51&C51","v":"Club LeopardClub Panthere"},{"$f":"E51","v":1},{"$f":"C51&A51","v":"Club PanthereClub Leopard"},{"$f":"F51","v":3},{"$f":"B51","v":6},{"$f":"D51","v":30}]
[{"$f":"A7","v":"Club Jaguar"},10,{"$f":"A12","v":"Club Otarie"},{"$f":"IF(G52=19,19,IF(ISBLANK(B52),\"\",IF(B52=19,0,36-B52)))","v":26},{"$f":"IF(G52=19,0,IF(ISBLANK(B52),\"\",IF(B52<18,1,IF(B52=18,2,IF(B52>18,3)))))","v":1},{"$f":"IF(G52=19,3,IF(ISBLANK(B52),\"\",IF(B52=19,0,IF(D52<18,1,IF(D52=18,2,IF(D52>=20,3))))))","v":3},null,null,null,null,null,{"$f":"IF(B52>D52,A52&C52,IF(D52>B52,C52&A52,\"/\"))","v":"Club OtarieClub Jaguar"},null,{"$f":"A52&C52","v":"Club JaguarClub Otarie"},{"$f":"E52","v":1},{"$f":"C52&A52","v":"Club OtarieClub Jaguar"},{"$f":"F52","v":3},{"$f":"B52","v":10},{"$f":"D52","v":26}]
[{"$f":"A8","v":"Club Koala"},14,{"$f":"A10","v":"Club Marsouin"},{"$f":"IF(G53=19,19,IF(ISBLANK(B53),\"\",IF(B53=19,0,36-B53)))","v":22},{"$f":"IF(G53=19,0,IF(ISBLANK(B53),\"\",IF(B53<18,1,IF(B53=18,2,IF(B53>18,3)))))","v":1},{"$f":"IF(G53=19,3,IF(ISBLANK(B53),\"\",IF(B53=19,0,IF(D53<18,1,IF(D53=18,2,IF(D53>=20,3))))))","v":3},null,null,null,null,null,{"$f":"IF(B53>D53,A53&C53,IF(D53>B53,C53&A53,\"/\"))","v":"Club MarsouinClub Koala"},null,{"$f":"A53&C53","v":"Club KoalaClub Marsouin"},{"$f":"E53","v":1},{"$f":"C53&A53","v":"Club MarsouinClub Koala"},{"$f":"F53","v":3},{"$f":"B53","v":14},{"$f":"D53","v":22}]
[]
["6 éme MATCH le ","à",{"$f":"A11","v":"Club Narval"}]
[null,null,null,null,null,null,"SI forfait éq recevante"]
["Equipes","score","Equipes","score","Points","Points"]
[{"$f":"A7","v":"Club Jaguar"},25,{"$f":"A9","v":"Club Leopard"},{"$f":"IF(G58=19,19,IF(ISBLANK(B58),\"\",IF(B58=19,0,36-B58)))","v":11},{"$f":"IF(G58=19,0,IF(ISBLANK(B58),\"\",IF(B58<18,1,IF(B58=18,2,IF(B58>18,3)))))","v":3},{"$f":"IF(G58=19,3,IF(ISBLANK(B58),\"\",IF(B58=19,0,IF(D58<18,1,IF(D58=18,2,IF(D58>=20,3))))))","v":1},null,null,null,null,null,{"$f":"IF(B58>D58,A58&C58,IF(D58>B58,C58&A58,\"/\"))","v":"Club JaguarClub Leopard"},null,{"$f":"A58&C58","v":"Club JaguarClub Leopard"},{"$f":"E58","v":3},{"$f":"C58&A58","v":"Club LeopardClub Jaguar"},{"$f":"F58","v":1},{"$f":"B58","v":25},{"$f":"D58","v":11}]
[{"$f":"A10","v":"Club Marsouin"},26,{"$f":"A6","v":"Club Iguane"},{"$f":"IF(G59=19,19,IF(ISBLANK(B59),\"\",IF(B59=19,0,36-B59)))","v":10},{"$f":"IF(G59=19,0,IF(ISBLANK(B59),\"\",IF(B59<18,1,IF(B59=18,2,IF(B59>18,3)))))","v":3},{"$f":"IF(G59=19,3,IF(ISBLANK(B59),\"\",IF(B59=19,0,IF(D59<18,1,IF(D59=18,2,IF(D59>=20,3))))))","v":1},null,null,null,null,null,{"$f":"IF(B59>D59,A59&C59,IF(D59>B59,C59&A59,\"/\"))","v":"Club MarsouinClub Iguane"},null,{"$f":"A59&C59","v":"Club MarsouinClub Iguane"},{"$f":"E59","v":3},{"$f":"C59&A59","v":"Club IguaneClub Marsouin"},{"$f":"F59","v":1},{"$f":"B59","v":26},{"$f":"D59","v":10}]
[{"$f":"A12","v":"Club Otarie"},27,{"$f":"A8","v":"Club Koala"},{"$f":"IF(G60=19,19,IF(ISBLANK(B60),\"\",IF(B60=19,0,36-B60)))","v":9},{"$f":"IF(G60=19,0,IF(ISBLANK(B60),\"\",IF(B60<18,1,IF(B60=18,2,IF(B60>18,3)))))","v":3},{"$f":"IF(G60=19,3,IF(ISBLANK(B60),\"\",IF(B60=19,0,IF(D60<18,1,IF(D60=18,2,IF(D60>=20,3))))))","v":1},null,null,null,null,null,{"$f":"IF(B60>D60,A60&C60,IF(D60>B60,C60&A60,\"/\"))","v":"Club OtarieClub Koala"},null,{"$f":"A60&C60","v":"Club OtarieClub Koala"},{"$f":"E60","v":3},{"$f":"C60&A60","v":"Club KoalaClub Otarie"},{"$f":"F60","v":1},{"$f":"B60","v":27},{"$f":"D60","v":9}]
[{"$f":"A11","v":"Club Narval"},28,{"$f":"A13","v":"Club Panthere"},{"$f":"IF(G61=19,19,IF(ISBLANK(B61),\"\",IF(B61=19,0,36-B61)))","v":8},{"$f":"IF(G61=19,0,IF(ISBLANK(B61),\"\",IF(B61<18,1,IF(B61=18,2,IF(B61>18,3)))))","v":3},{"$f":"IF(G61=19,3,IF(ISBLANK(B61),\"\",IF(B61=19,0,IF(D61<18,1,IF(D61=18,2,IF(D61>=20,3))))))","v":1},null,null,null,null,null,{"$f":"IF(B61>D61,A61&C61,IF(D61>B61,C61&A61,\"/\"))","v":"Club NarvalClub Panthere"},null,{"$f":"A61&C61","v":"Club NarvalClub Panthere"},{"$f":"E61","v":3},{"$f":"C61&A61","v":"Club PanthereClub Narval"},{"$f":"F61","v":1},{"$f":"B61","v":28},{"$f":"D61","v":8}]
[]
["7 éme MATCH le","à",{"$f":"A12","v":"Club Otarie"}]
[null,null,null,null,null,null,"SI forfait éq recevante",null," "]
["Equipes","score","Equipes","score","Points","Points"]
[{"$f":"A6","v":"Club Iguane"},10,{"$f":"A12","v":"Club Otarie"},{"$f":"IF(G66=19,19,IF(ISBLANK(B66),\"\",IF(B66=19,0,36-B66)))","v":26},{"$f":"IF(G66=19,0,IF(ISBLANK(B66),\"\",IF(B66<18,1,IF(B66=18,2,IF(B66>18,3)))))","v":1},{"$f":"IF(G66=19,3,IF(ISBLANK(B66),\"\",IF(B66=19,0,IF(D66<18,1,IF(D66=18,2,IF(D66>=20,3))))))","v":3},null,null,null,null,null,{"$f":"IF(B66>D66,A66&C66,IF(D66>B66,C66&A66,\"/\"))","v":"Club OtarieClub Iguane"},null,{"$f":"A66&C66","v":"Club IguaneClub Otarie"},{"$f":"E66","v":1},{"$f":"C66&A66","v":"Club OtarieClub Iguane"},{"$f":"F66","v":3},{"$f":"B66","v":10},{"$f":"D66","v":26}]
[{"$f":"A7","v":"Club Jaguar"},24,{"$f":"A11","v":"Club Narval"},{"$f":"IF(G67=19,19,IF(ISBLANK(B67),\"\",IF(B67=19,0,36-B67)))","v":12},{"$f":"IF(G67=19,0,IF(ISBLANK(B67),\"\",IF(B67<18,1,IF(B67=18,2,IF(B67>18,3)))))","v":3},{"$f":"IF(G67=19,3,IF(ISBLANK(B67),\"\",IF(B67=19,0,IF(D67<18,1,IF(D67=18,2,IF(D67>=20,3))))))","v":1},null,null,null,null,null,{"$f":"IF(B67>D67,A67&C67,IF(D67>B67,C67&A67,\"/\"))","v":"Club JaguarClub Narval"},null,{"$f":"A67&C67","v":"Club JaguarClub Narval"},{"$f":"E67","v":3},{"$f":"C67&A67","v":"Club NarvalClub Jaguar"},{"$f":"F67","v":1},{"$f":"B67","v":24},{"$f":"D67","v":12}]
[{"$f":"A10","v":"Club Marsouin"},32,{"$f":"A9","v":"Club Leopard"},{"$f":"IF(G68=19,19,IF(ISBLANK(B68),\"\",IF(B68=19,0,36-B68)))","v":4},{"$f":"IF(G68=19,0,IF(ISBLANK(B68),\"\",IF(B68<18,1,IF(B68=18,2,IF(B68>18,3)))))","v":3},{"$f":"IF(G68=19,3,IF(ISBLANK(B68),\"\",IF(B68=19,0,IF(D68<18,1,IF(D68=18,2,IF(D68>=20,3))))))","v":1},null,null,null,null,null,{"$f":"IF(B68>D68,A68&C68,IF(D68>B68,C68&A68,\"/\"))","v":"Club MarsouinClub Leopard"},null,{"$f":"A68&C68","v":"Club MarsouinClub Leopard"},{"$f":"E68","v":3},{"$f":"C68&A68","v":"Club LeopardClub Marsouin"},{"$f":"F68","v":1},{"$f":"B68","v":32},{"$f":"D68","v":4}]
[{"$f":"A8","v":"Club Koala"},31,{"$f":"A13","v":"Club Panthere"},{"$f":"IF(G69=19,19,IF(ISBLANK(B69),\"\",IF(B69=19,0,36-B69)))","v":5},{"$f":"IF(G69=19,0,IF(ISBLANK(B69),\"\",IF(B69<18,1,IF(B69=18,2,IF(B69>18,3)))))","v":3},{"$f":"IF(G69=19,3,IF(ISBLANK(B69),\"\",IF(B69=19,0,IF(D69<18,1,IF(D69=18,2,IF(D69>=20,3))))))","v":1},null,null,null,null,null,{"$f":"IF(B69>D69,A69&C69,IF(D69>B69,C69&A69,\"/\"))","v":"Club KoalaClub Panthere"},null,{"$f":"A69&C69","v":"Club KoalaClub Panthere"},{"$f":"E69","v":3},{"$f":"C69&A69","v":"Club PanthereClub Koala"},{"$f":"F69","v":1},{"$f":"B69","v":31},{"$f":"D69","v":5}]
[null,null,"CLASSEMENT",null,null,null,"Classt        Final","Rencontres entre exaequos"]
["EQUIPES",null,"POINTS","POUR","CONTRE","DIFF",null,"POINTS Exaequos","Exaq","n°",{"$f":"A6","v":"Club Iguane"},{"$f":"A7","v":"Club Jaguar"},{"$f":"A8","v":"Club Koala"},{"$f":"A9","v":"Club Leopard"},{"$f":"A10","v":"Club Marsouin"},{"$f":"A11","v":"Club Narval"},{"$f":"A12","v":"Club Otarie"},{"$f":"A13","v":"Club Panthere"},"Pts matchs",null,null,null,"1000000*Pts matchs +1000 (Diff +  abs(diff mini) )+Pour ","RANG","DIFF Exaequos","POUR Exaequos"]
["Club Marsouin","1E",19,172,80,92,1,{"$f":"IF(S72>0,S72,\"\")","v":""},{"$f":"COUNTIF($C$72:$C$79,C72)","v":1},{"$f":"IF(AND(I72>1,COUNTIFS(I$72:I72,I72,C$72:C72,C72)=1),MAX(J$71:J71)+1,\"\")","v":""},{"$f":"IF($A72=K$71,\"\",IF(INDEX($C$72:$C$79,MATCH(K$71,$A$72:$A$79,0))=$C72,IFERROR(VLOOKUP($A72&K$71,$N$18:$O$69,2,0),  VLOOKUP(K$71&$A72,$N$18:$Q$69,4,0)),          \"\"))","v":""},"","","","","","","",{"$f":"SUM(K72:R72)","v":0},null,null,null,{"$f":"IF(I72<3,S72*1000000+(F72+ABS(MIN($F$72:$F$79)))*1000+D72,S72*1000000+U96*1000+Z72)","v":170172},{"$f":"IF(I72>2,RANK(W72,OFFSET(W$71,MATCH(I72,$I$72:$I$79,0),,I72)))","v":false},{"$f":"IF(S96=0,\"\",S96)","v":""},{"$f":"IF(S80=0,\"\",S80)","v":""}]
["Club Jaguar","1B",17,135,117,18,2,{"$f":"IF(S73>0,S73,\"\")","v":""},1,{"$f":"IF(AND(I73>1,COUNTIFS(I$72:I73,I73,C$72:C73,C73)=1),MAX(J$71:J72)+1,\"\")","v":""},"","","","","","","","",{"$f":"SUM(K73:R73)","v":0},null,null,null,{"$f":"IF(I73<3,S73*1000000+(F73+ABS(MIN($F$72:$F$79)))*1000+D73,S73*1000000+U97*1000+Z73)","v":96135},{"$f":"IF(I73>2,RANK(W73,OFFSET(W$71,MATCH(I73,$I$72:$I$79,0),,I73)))","v":false},"",""]
["Club Otarie","1G",15,134,118,16,3,{"$f":"IF(S74>0,S74,\"\")","v":3},2,{"$f":"IF(AND(I74>1,COUNTIFS(I$72:I74,I74,C$72:C74,C74)=1),MAX(J$71:J73)+1,\"\")","v":1},"","",3,"","","","","",3,null,null,null,3094134,false,18,27]
["Club Koala","1C",15,144,108,36,4,{"$f":"IF(S75>0,S75,\"\")","v":1},2,{"$f":"IF(AND(I75>1,COUNTIFS(I$72:I75,I75,C$72:C75,C75)=1),MAX(J$71:J74)+1,\"\")","v":""},"","","","","","",1,"",1,null,null,null,1114144,false,-18,9]
["Club Narval","1F",13,122,130,-8,5,{"$f":"IF(S76>0,S76,\"\")","v":3},2,{"$f":"IF(AND(I76>1,COUNTIFS(I$72:I76,I76,C$72:C76,C76)=1),MAX(J$71:J75)+1,\"\")","v":2},3,"","","","","","","",3,null,null,null,3070122,false,28,32]
["Club Iguane","1A",13,120,132,-12,6,{"$f":"IF(S77>0,S77,\"\")","v":1},2,{"$f":"IF(AND(I77>1,COUNTIFS(I$72:I77,I77,C$72:C77,C77)=1),MAX(J$71:J76)+1,\"\")","v":""},"","","","","",1,"","",1,null,null,null,1066120,false,-28,4]
["Club Leopard","1D",11,94,158,-64,7,{"$f":"IF(S78>0,S78,\"\")","v":""},1,{"$f":"IF(AND(I78>1,COUNTIFS(I$72:I78,I78,C$72:C78,C78)=1),MAX(J$71:J77)+1,\"\")","v":""},"","","","","","","","",0,null,null,null,14094,false,"",""]
["Club Panthere","1H",9,87,165,-78,8,{"$f":"IF(S79>0,S79,\"\")","v":""},1,{"$f":"IF(AND(I79>1,COUNTIFS(I$72:I79,I79,C$72:C79,C79)=1),MAX(J$71:J78)+1,\"\")","v":""},"","","","","","","","",0,null,null,null,87,false,"",""]
[null,null,null,null,null,null,null,null,"POUR",{"$f":"A72","v":"Club Marsouin"},{"$f":"IF($A72=K$71,\"\",IF(INDEX($C$72:$C$79,MATCH(K$71,$A$72:$A$79,0))=$C72,IFERROR(VLOOKUP($A72&K$71,$N$18:$R$69,5,0),  VLOOKUP(K$71&$A72,$N$18:$S$69,6,0)),          \"\"))","v":""},"","","","","","","",0]
[null,null,null,null,null,null,null,null,null,"Club Jaguar","","","","","","","","",0]
[null,null,null,null,null,null,null,null,null,"Club Otarie","","",27,"","","","","",27]
[null,null,null,null,null,null,null,null,null,"Club Koala","","","","","","",9,"",9]
[null,null,null,null,null,null,null,null,null,"Club Narval",32,"","","","","","","",32,null,null,null,null,null,"  "]
[null,null,null,null,null,null,null,null,null,"Club Iguane","","","","","",4,"","",4]
[null,null,null,null,null,null,null,null,null,"Club Leopard","","","","","","","","",0]
[null,null,null,null,null,null,null,null,null,"Club Panthere","","","","","","","","",0]
[null,null,null,null,null,null,null,null,"CONTRE",{"$f":"J80","v":"Club Marsouin"},{"$f":"INDEX($K$80:$R$87,MATCH(K$71,$J$80:$J$87,0),MATCH($J80,$K$71:$R$71,0))","v":""},{"$f":"INDEX($K$80:$R$87,MATCH(L$71,$J$80:$J$87,0),MATCH($J80,$K$71:$R$71,0))","v":""},"","","","","","",0]
[null,null,null,null,null,null,null,null,null,{"$f":"J81","v":"Club Jaguar"},{"$f":"INDEX($K$80:$R$87,MATCH(K$71,$J$80:$J$87,0),MATCH($J81,$K$71:$R$71,0))","v":""},"","","","","","","",0]
[null,null,null,null,null,null,null,null,null,"Club Otarie","","",9,"","","","","",9]
[null,null,null,null,null,null,null,null,null,"Club Koala","","","","","","",27,"",27]
[null,null,null,null,null,null,null,null,null,"Club Narval",4,"","","","","","","",4]
[null,null,null,null,null,null,null,null,null,"Club Iguane","","","","","",32,"","",32]
[null,null,null,null,null,null,null,null,null,"Club Leopard","","","","","","","","",0]
[null,null,null,null,null,null,null,null,null,"Club Panthere","","","","","","","","",0,null,"Diff pondérée"]
[null,null,null,null,null,null,null,null,"DIFF",{"$f":"J88","v":"Club Marsouin"},null,null,null,null,null,null,null,null,{"$f":"S80-S88","v":0},null,{"$f":"S96+ABS(MIN($S$96:$S$103))","v":28}]
[null,null,null,null,null,null,null,null,null,{"$f":"J89","v":"Club Jaguar"},null,null,null,null,null,null,null,null,{"$f":"S81-S89","v":0},null,28]
[null,null,null,null,null,null,null,null,null,"Club Otarie",null,null,null,null,null,null,null,null,18,null,46]
[null,null,null,null,null,null,null,null,null,"Club Koala",null,null,null,null,null,null,null,null,-18,null,10]
[null,null,null,null,null,null,null,null,null,"Club Narval",null,null,null,null,null,null,null,null,28,null,56]
[null,null,null,null,null,null,null,null,null,"Club Iguane",null,null,null,null,null,null,null,null,-28,null,0]
[null,null,null,null,null,null,null,null,null,"Club Leopard",null,null,null,null,null,null,null,null,0,null,{"$f":"S102+ABS(MIN($S$96:$S$103))","v":28}]
[null,null,null,null,null,null,null,null,null,"Club Panthere",null,null,null,null,null,null,null,null,0,null,{"$f":"S103+ABS(MIN($S$96:$S$103))","v":28}]

{"sheet":"P3","index":2,"n_rows":103,"n_cols":26,"rows_kept":103,"cut":false,"hidden":false,"merged":[[0,0,0,5],[1,0,1,5],[2,0,2,5],[3,0,3,5],[3,8,3,10],[15,6,16,6],[69,2,69,5],[69,6,70,6],[69,7,69,25],[23,6,24,6],[31,6,32,6],[39,6,40,6],[47,6,48,6],[55,6,56,6],[63,6,64,6]]}
[null,null,null,null,null,null,3]
["CHAMPIONNAT DES CLUBS"]
[]
["POULE 3"]
["EQUIPES",null,"POINTS","Pour","Contre","Diff"]
["AA","1A",{"$f":"SUMIF($A$18:$A$69,A6,$E$18:$E$69)+SUMIF($C$18:$C$69,A6,$F$18:$F$69)","v":0},{"$f":"SUMIF($A$18:$A$69,$A6,$B$18:$B$69)+SUMIF($C$18:$C$69,$A6,$D$18:$D$69)","v":0},{"$f":"SUMIF($C$18:$C$69,$A6,$B$18:$B$69)+SUMIF($A$18:$A$69,$A6,$D$18:$D$69)","v":0},{"$f":"D6-E6","v":0}]
["AB","1B",{"$f":"SUMIF($A$18:$A$69,A7,$E$18:$E$69)+SUMIF($C$18:$C$69,A7,$F$18:$F$69)","v":0},{"$f":"SUMIF($A$18:$A$69,$A7,$B$18:$B$69)+SUMIF($C$18:$C$69,$A7,$D$18:$D$69)","v":0},{"$f":"SUMIF($C$18:$C$69,$A7,$B$18:$B$69)+SUMIF($A$18:$A$69,$A7,$D$18:$D$69)","v":0},0]
["AC","1C",{"$f":"SUMIF($A$18:$A$69,A8,$E$18:$E$69)+SUMIF($C$18:$C$69,A8,$F$18:$F$69)","v":0},0,0,0]
["AD","1D",0,0,0,0]
["AE","1E",0,0,0,0]
["AF","1F",0,0,0,0]
["AG","1G",0,0,0,{"$f":"D12-E12","v":0}]
["AH","1H",0,{"$f":"SUMIF($A$18:$A$69,$A13,$B$18:$B$69)+SUMIF($C$18:$C$69,$A13,$D$18:$D$69)","v":0},0,{"$f":"D13-E13","v":0}]
[]
["1er MATCH le ","à",{"$f":"A6","v":"AA"}]
[null,null,null,null,null,null,"SI forfait éq recevante"]
["Equipes","score","Equipes","score","Points","Points"]
[{"$f":"A6","v":"AA"},null,{"$f":"A7","v":"AB"},{"$f":"IF(G18=19,19,IF(ISBLANK(B18),\"\",IF(B18=19,0,36-B18)))","v":""},{"$f":"IF(G18=19,0,IF(ISBLANK(B18),\"\",IF(B18<18,1,IF(B18=18,2,IF(B18>18,3)))))","v":""},{"$f":"IF(G18=19,3,IF(ISBLANK(B18),\"\",IF(B18=19,0,IF(D18<18,1,IF(D18=18,2,IF(D18>=20,3))))))","v":""},null,null,null,null,null,{"$f":"IF(B18>D18,A18&C18,IF(D18>B18,C18&A18,\"/\"))","v":"/"},null,{"$f":"A18&C18","v":"AAAB"},{"$f":"E18","v":""},{"$f":"C18&A18","v":"ABAA"},{"$f":"F18","v":""},{"$f":"B18","v":0},{"$f":"D18","v":""}]
[{"$f":"A8","v":"AC"},null,{"$f":"A9","v":"AD"},{"$f":"IF(G19=19,19,IF(ISBLANK(B19),\"\",IF(B19=19,0,36-B19)))","v":""},{"$f":"IF(G19=19,0,IF(ISBLANK(B19),\"\",IF(B19<18,1,IF(B19=18,2,IF(B19>18,3)))))","v":""},{"$f":"IF(G19=19,3,IF(ISBLANK(B19),\"\",IF(B19=19,0,IF(D19<18,1,IF(D19=18,2,IF(D19>=20,3))))))","v":""},null,null,null,null,null,{"$f":"IF(B19>D19,A19&C19,IF(D19>B19,C19&A19,\"/\"))","v":"/"},null,{"$f":"A19&C19","v":"ACAD"},{"$f":"E19","v":""},{"$f":"C19&A19","v":"ADAC"},{"$f":"F19","v":""},{"$f":"B19","v":0},{"$f":"D19","v":""}]
[{"$f":"A10","v":"AE"},null,{"$f":"A11","v":"AF"},{"$f":"IF(G20=19,19,IF(ISBLANK(B20),\"\",IF(B20=19,0,36-B20)))","v":""},{"$f":"IF(G20=19,0,IF(ISBLANK(B20),\"\",IF(B20<18,1,IF(B20=18,2,IF(B20>18,3)))))","v":""},{"$f":"IF(G20=19,3,IF(ISBLANK(B20),\"\",IF(B20=19,0,IF(D20<18,1,IF(D20=18,2,IF(D20>=20,3))))))","v":""},null,null,null,null,null,{"$f":"IF(B20>D20,A20&C20,IF(D20>B20,C20&A20,\"/\"))","v":"/"},null,{"$f":"A20&C20","v":"AEAF"},{"$f":"E20","v":""},{"$f":"C20&A20","v":"AFAE"},{"$f":"F20","v":""},{"$f":"B20","v":0},{"$f":"D20","v":""}]
[{"$f":"A12","v":"AG"},null,{"$f":"A13","v":"AH"},{"$f":"IF(G21=19,19,IF(ISBLANK(B21),\"\",IF(B21=19,0,36-B21)))","v":""},{"$f":"IF(G21=19,0,IF(ISBLANK(B21),\"\",IF(B21<18,1,IF(B21=18,2,IF(B21>18,3)))))","v":""},{"$f":"IF(G21=19,3,IF(ISBLANK(B21),\"\",IF(B21=19,0,IF(D21<18,1,IF(D21=18,2,IF(D21>=20,3))))))","v":""},null,null,null,null,null,{"$f":"IF(B21>D21,A21&C21,IF(D21>B21,C21&A21,\"/\"))","v":"/"},null,{"$f":"A21&C21","v":"AGAH"},{"$f":"E21","v":""},{"$f":"C21&A21","v":"AHAG"},{"$f":"F21","v":""},{"$f":"B21","v":0},{"$f":"D21","v":""}]
[]
["2 éme MATCH le ","à",{"$f":"A7","v":"AB"}]
[null,null,null,null,null,null,"SI forfait éq recevante"]
["Equipes","score","Equipes","score","Points","Points"]
[{"$f":"A6","v":"AA"},null,{"$f":"A8","v":"AC"},{"$f":"IF(G26=19,19,IF(ISBLANK(B26),\"\",IF(B26=19,0,36-B26)))","v":""},{"$f":"IF(G26=19,0,IF(ISBLANK(B26),\"\",IF(B26<18,1,IF(B26=18,2,IF(B26>18,3)))))","v":""},{"$f":"IF(G26=19,3,IF(ISBLANK(B26),\"\",IF(B26=19,0,IF(D26<18,1,IF(D26=18,2,IF(D26>=20,3))))))","v":""},null,null,null,null,null,{"$f":"IF(B26>D26,A26&C26,IF(D26>B26,C26&A26,\"/\"))","v":"/"},null,{"$f":"A26&C26","v":"AAAC"},{"$f":"E26","v":""},{"$f":"C26&A26","v":"ACAA"},{"$f":"F26","v":""},{"$f":"B26","v":0},{"$f":"D26","v":""}]
[{"$f":"A7","v":"AB"},null,{"$f":"A13","v":"AH"},{"$f":"IF(G27=19,19,IF(ISBLANK(B27),\"\",IF(B27=19,0,36-B27)))","v":""},{"$f":"IF(G27=19,0,IF(ISBLANK(B27),\"\",IF(B27<18,1,IF(B27=18,2,IF(B27>18,3)))))","v":""},{"$f":"IF(G27=19,3,IF(ISBLANK(B27),\"\",IF(B27=19,0,IF(D27<18,1,IF(D27=18,2,IF(D27>=20,3))))))","v":""},null,null,null,null,null,{"$f":"IF(B27>D27,A27&C27,IF(D27>B27,C27&A27,\"/\"))","v":"/"},null,{"$f":"A27&C27","v":"ABAH"},{"$f":"E27","v":""},{"$f":"C27&A27","v":"AHAB"},{"$f":"F27","v":""},{"$f":"B27","v":0},{"$f":"D27","v":""}]
[{"$f":"A9","v":"AD"},null,{"$f":"A11","v":"AF"},{"$f":"IF(G28=19,19,IF(ISBLANK(B28),\"\",IF(B28=19,0,36-B28)))","v":""},{"$f":"IF(G28=19,0,IF(ISBLANK(B28),\"\",IF(B28<18,1,IF(B28=18,2,IF(B28>18,3)))))","v":""},{"$f":"IF(G28=19,3,IF(ISBLANK(B28),\"\",IF(B28=19,0,IF(D28<18,1,IF(D28=18,2,IF(D28>=20,3))))))","v":""},null,null,null,null,null,{"$f":"IF(B28>D28,A28&C28,IF(D28>B28,C28&A28,\"/\"))","v":"/"},null,{"$f":"A28&C28","v":"ADAF"},{"$f":"E28","v":""},{"$f":"C28&A28","v":"AFAD"},{"$f":"F28","v":""},{"$f":"B28","v":0},{"$f":"D28","v":""}]
[{"$f":"A10","v":"AE"},null,{"$f":"A12","v":"AG"},{"$f":"IF(G29=19,19,IF(ISBLANK(B29),\"\",IF(B29=19,0,36-B29)))","v":""},{"$f":"IF(G29=19,0,IF(ISBLANK(B29),\"\",IF(B29<18,1,IF(B29=18,2,IF(B29>18,3)))))","v":""},{"$f":"IF(G29=19,3,IF(ISBLANK(B29),\"\",IF(B29=19,0,IF(D29<18,1,IF(D29=18,2,IF(D29>=20,3))))))","v":""},null,null,null,null,null,{"$f":"IF(B29>D29,A29&C29,IF(D29>B29,C29&A29,\"/\"))","v":"/"},null,{"$f":"A29&C29","v":"AEAG"},{"$f":"E29","v":""},{"$f":"C29&A29","v":"AGAE"},{"$f":"F29","v":""},{"$f":"B29","v":0},{"$f":"D29","v":""}]
[]
["3 éme MATCH le ","à",{"$f":"A8","v":"AC"}]
[null,null,null,null,null,null,"SI forfait éq recevante"]
["Equipes","score","Equipes","score","Points","Points"]
[{"$f":"A6","v":"AA"},null,{"$f":"A13","v":"AH"},{"$f":"IF(G34=19,19,IF(ISBLANK(B34),\"\",IF(B34=19,0,36-B34)))","v":""},{"$f":"IF(G34=19,0,IF(ISBLANK(B34),\"\",IF(B34<18,1,IF(B34=18,2,IF(B34>18,3)))))","v":""},{"$f":"IF(G34=19,3,IF(ISBLANK(B34),\"\",IF(B34=19,0,IF(D34<18,1,IF(D34=18,2,IF(D34>=20,3))))))","v":""},null,null,null,null,null,{"$f":"IF(B34>D34,A34&C34,IF(D34>B34,C34&A34,\"/\"))","v":"/"},null,{"$f":"A34&C34","v":"AAAH"},{"$f":"E34","v":""},{"$f":"C34&A34","v":"AHAA"},{"$f":"F34","v":""},{"$f":"B34","v":0},{"$f":"D34","v":""}]
[{"$f":"A7","v":"AB"},null,{"$f":"A10","v":"AE"},{"$f":"IF(G35=19,19,IF(ISBLANK(B35),\"\",IF(B35=19,0,36-B35)))","v":""},{"$f":"IF(G35=19,0,IF(ISBLANK(B35),\"\",IF(B35<18,1,IF(B35=18,2,IF(B35>18,3)))))","v":""},{"$f":"IF(G35=19,3,IF(ISBLANK(B35),\"\",IF(B35=19,0,IF(D35<18,1,IF(D35=18,2,IF(D35>=20,3))))))","v":""},null,null,null,null,null,{"$f":"IF(B35>D35,A35&C35,IF(D35>B35,C35&A35,\"/\"))","v":"/"},null,{"$f":"A35&C35","v":"ABAE"},{"$f":"E35","v":""},{"$f":"C35&A35","v":"AEAB"},{"$f":"F35","v":""},{"$f":"B35","v":0},{"$f":"D35","v":""}]
[{"$f":"A8","v":"AC"},null,{"$f":"A11","v":"AF"},{"$f":"IF(G36=19,19,IF(ISBLANK(B36),\"\",IF(B36=19,0,36-B36)))","v":""},{"$f":"IF(G36=19,0,IF(ISBLANK(B36),\"\",IF(B36<18,1,IF(B36=18,2,IF(B36>18,3)))))","v":""},{"$f":"IF(G36=19,3,IF(ISBLANK(B36),\"\",IF(B36=19,0,IF(D36<18,1,IF(D36=18,2,IF(D36>=20,3))))))","v":""},null,null,null,null,null,{"$f":"IF(B36>D36,A36&C36,IF(D36>B36,C36&A36,\"/\"))","v":"/"},null,{"$f":"A36&C36","v":"ACAF"},{"$f":"E36","v":""},{"$f":"C36&A36","v":"AFAC"},{"$f":"F36","v":""},{"$f":"B36","v":0},{"$f":"D36","v":""}]
[{"$f":"A9","v":"AD"},null,{"$f":"A12","v":"AG"},{"$f":"IF(G37=19,19,IF(ISBLANK(B37),\"\",IF(B37=19,0,36-B37)))","v":""},{"$f":"IF(G37=19,0,IF(ISBLANK(B37),\"\",IF(B37<18,1,IF(B37=18,2,IF(B37>18,3)))))","v":""},{"$f":"IF(G37=19,3,IF(ISBLANK(B37),\"\",IF(B37=19,0,IF(D37<18,1,IF(D37=18,2,IF(D37>=20,3))))))","v":""},null,null,null,null,null,{"$f":"IF(B37>D37,A37&C37,IF(D37>B37,C37&A37,\"/\"))","v":"/"},null,{"$f":"A37&C37","v":"ADAG"},{"$f":"E37","v":""},{"$f":"C37&A37","v":"AGAD"},{"$f":"F37","v":""},{"$f":"B37","v":0},{"$f":"D37","v":""}]
[]
["4 éme MATCH le ","à",{"$f":"A9","v":"AD"}]
[null,null,null,null,null,null,"SI forfait éq recevante"]
["Equipes","score","Equipes","score","Points","Points"]
[{"$f":"A6","v":"AA"},null,{"$f":"A9","v":"AD"},{"$f":"IF(G42=19,19,IF(ISBLANK(B42),\"\",IF(B42=19,0,36-B42)))","v":""},{"$f":"IF(G42=19,0,IF(ISBLANK(B42),\"\",IF(B42<18,1,IF(B42=18,2,IF(B42>18,3)))))","v":""},{"$f":"IF(G42=19,3,IF(ISBLANK(B42),\"\",IF(B42=19,0,IF(D42<18,1,IF(D42=18,2,IF(D42>=20,3))))))","v":""},null,null,null,null,null,{"$f":"IF(B42>D42,A42&C42,IF(D42>B42,C42&A42,\"/\"))","v":"/"},null,{"$f":"A42&C42","v":"AAAD"},{"$f":"E42","v":""},{"$f":"C42&A42","v":"ADAA"},{"$f":"F42","v":""},{"$f":"B42","v":0},{"$f":"D42","v":""}]
[{"$f":"A11","v":"AF"},null,{"$f":"A12","v":"AG"},{"$f":"IF(G43=19,19,IF(ISBLANK(B43),\"\",IF(B43=19,0,36-B43)))","v":""},{"$f":"IF(G43=19,0,IF(ISBLANK(B43),\"\",IF(B43<18,1,IF(B43=18,2,IF(B43>18,3)))))","v":""},{"$f":"IF(G43=19,3,IF(ISBLANK(B43),\"\",IF(B43=19,0,IF(D43<18,1,IF(D43=18,2,IF(D43>=20,3))))))","v":""},null,null,null,null,null,{"$f":"IF(B43>D43,A43&C43,IF(D43>B43,C43&A43,\"/\"))","v":"/"},null,{"$f":"A43&C43","v":"AFAG"},{"$f":"E43","v":""},{"$f":"C43&A43","v":"AGAF"},{"$f":"F43","v":""},{"$f":"B43","v":0},{"$f":"D43","v":""}]
[{"$f":"A7","v":"AB"},null,{"$f":"A8","v":"AC"},{"$f":"IF(G44=19,19,IF(ISBLANK(B44),\"\",IF(B44=19,0,36-B44)))","v":""},{"$f":"IF(G44=19,0,IF(ISBLANK(B44),\"\",IF(B44<18,1,IF(B44=18,2,IF(B44>18,3)))))","v":""},{"$f":"IF(G44=19,3,IF(ISBLANK(B44),\"\",IF(B44=19,0,IF(D44<18,1,IF(D44=18,2,IF(D44>=20,3))))))","v":""},null,null,null,null,null,{"$f":"IF(B44>D44,A44&C44,IF(D44>B44,C44&A44,\"/\"))","v":"/"},null,{"$f":"A44&C44","v":"ABAC"},{"$f":"E44","v":""},{"$f":"C44&A44","v":"ACAB"},{"$f":"F44","v":""},{"$f":"B44","v":0},{"$f":"D44","v":""}]
[{"$f":"A10","v":"AE"},null,{"$f":"A13","v":"AH"},{"$f":"IF(G45=19,19,IF(ISBLANK(B45),\"\",IF(B45=19,0,36-B45)))","v":""},{"$f":"IF(G45=19,0,IF(ISBLANK(B45),\"\",IF(B45<18,1,IF(B45=18,2,IF(B45>18,3)))))","v":""},{"$f":"IF(G45=19,3,IF(ISBLANK(B45),\"\",IF(B45=19,0,IF(D45<18,1,IF(D45=18,2,IF(D45>=20,3))))))","v":""},null,null,null,null,null,{"$f":"IF(B45>D45,A45&C45,IF(D45>B45,C45&A45,\"/\"))","v":"/"},null,{"$f":"A45&C45","v":"AEAH"},{"$f":"E45","v":""},{"$f":"C45&A45","v":"AHAE"},{"$f":"F45","v":""},{"$f":"B45","v":0},{"$f":"D45","v":""}]
[]
["5 éme MATCH le ","à",{"$f":"A10","v":"AE"}]
[null,null,null,null,null,null,"SI forfait éq recevante"]
["Equipes","score","Equipes","score","Points","Points"]
[{"$f":"A6","v":"AA"},null,{"$f":"A11","v":"AF"},{"$f":"IF(G50=19,19,IF(ISBLANK(B50),\"\",IF(B50=19,0,36-B50)))","v":""},{"$f":"IF(G50=19,0,IF(ISBLANK(B50),\"\",IF(B50<18,1,IF(B50=18,2,IF(B50>18,3)))))","v":""},{"$f":"IF(G50=19,3,IF(ISBLANK(B50),\"\",IF(B50=19,0,IF(D50<18,1,IF(D50=18,2,IF(D50>=20,3))))))","v":""},null,null,null,null,null,{"$f":"IF(B50>D50,A50&C50,IF(D50>B50,C50&A50,\"/\"))","v":"/"},null,{"$f":"A50&C50","v":"AAAF"},{"$f":"E50","v":""},{"$f":"C50&A50","v":"AFAA"},{"$f":"F50","v":""},{"$f":"B50","v":0},{"$f":"D50","v":""}]
[{"$f":"A9","v":"AD"},null,{"$f":"A13","v":"AH"},{"$f":"IF(G51=19,19,IF(ISBLANK(B51),\"\",IF(B51=19,0,36-B51)))","v":""},{"$f":"IF(G51=19,0,IF(ISBLANK(B51),\"\",IF(B51<18,1,IF(B51=18,2,IF(B51>18,3)))))","v":""},{"$f":"IF(G51=19,3,IF(ISBLANK(B51),\"\",IF(B51=19,0,IF(D51<18,1,IF(D51=18,2,IF(D51>=20,3))))))","v":""},null,null,null,null,null,{"$f":"IF(B51>D51,A51&C51,IF(D51>B51,C51&A51,\"/\"))","v":"/"},null,{"$f":"A51&C51","v":"ADAH"},{"$f":"E51","v":""},{"$f":"C51&A51","v":"AHAD"},{"$f":"F51","v":""},{"$f":"B51","v":0},{"$f":"D51","v":""}]
[{"$f":"A7","v":"AB"},null,{"$f":"A12","v":"AG"},{"$f":"IF(G52=19,19,IF(ISBLANK(B52),\"\",IF(B52=19,0,36-B52)))","v":""},{"$f":"IF(G52=19,0,IF(ISBLANK(B52),\"\",IF(B52<18,1,IF(B52=18,2,IF(B52>18,3)))))","v":""},{"$f":"IF(G52=19,3,IF(ISBLANK(B52),\"\",IF(B52=19,0,IF(D52<18,1,IF(D52=18,2,IF(D52>=20,3))))))","v":""},null,null,null,null,null,{"$f":"IF(B52>D52,A52&C52,IF(D52>B52,C52&A52,\"/\"))","v":"/"},null,{"$f":"A52&C52","v":"ABAG"},{"$f":"E52","v":""},{"$f":"C52&A52","v":"AGAB"},{"$f":"F52","v":""},{"$f":"B52","v":0},{"$f":"D52","v":""}]
[{"$f":"A8","v":"AC"},null,{"$f":"A10","v":"AE"},{"$f":"IF(G53=19,19,IF(ISBLANK(B53),\"\",IF(B53=19,0,36-B53)))","v":""},{"$f":"IF(G53=19,0,IF(ISBLANK(B53),\"\",IF(B53<18,1,IF(B53=18,2,IF(B53>18,3)))))","v":""},{"$f":"IF(G53=19,3,IF(ISBLANK(B53),\"\",IF(B53=19,0,IF(D53<18,1,IF(D53=18,2,IF(D53>=20,3))))))","v":""},null,null,null,null,null,{"$f":"IF(B53>D53,A53&C53,IF(D53>B53,C53&A53,\"/\"))","v":"/"},null,{"$f":"A53&C53","v":"ACAE"},{"$f":"E53","v":""},{"$f":"C53&A53","v":"AEAC"},{"$f":"F53","v":""},{"$f":"B53","v":0},{"$f":"D53","v":""}]
[]
["6 éme MATCH le ","à",{"$f":"A11","v":"AF"}]
[null,null,null,null,null,null,"SI forfait éq recevante"]
["Equipes","score","Equipes","score","Points","Points"]
[{"$f":"A7","v":"AB"},null,{"$f":"A9","v":"AD"},{"$f":"IF(G58=19,19,IF(ISBLANK(B58),\"\",IF(B58=19,0,36-B58)))","v":""},{"$f":"IF(G58=19,0,IF(ISBLANK(B58),\"\",IF(B58<18,1,IF(B58=18,2,IF(B58>18,3)))))","v":""},{"$f":"IF(G58=19,3,IF(ISBLANK(B58),\"\",IF(B58=19,0,IF(D58<18,1,IF(D58=18,2,IF(D58>=20,3))))))","v":""},null,null,null,null,null,{"$f":"IF(B58>D58,A58&C58,IF(D58>B58,C58&A58,\"/\"))","v":"/"},null,{"$f":"A58&C58","v":"ABAD"},{"$f":"E58","v":""},{"$f":"C58&A58","v":"ADAB"},{"$f":"F58","v":""},{"$f":"B58","v":0},{"$f":"D58","v":""}]
[{"$f":"A10","v":"AE"},null,{"$f":"A6","v":"AA"},{"$f":"IF(G59=19,19,IF(ISBLANK(B59),\"\",IF(B59=19,0,36-B59)))","v":""},{"$f":"IF(G59=19,0,IF(ISBLANK(B59),\"\",IF(B59<18,1,IF(B59=18,2,IF(B59>18,3)))))","v":""},{"$f":"IF(G59=19,3,IF(ISBLANK(B59),\"\",IF(B59=19,0,IF(D59<18,1,IF(D59=18,2,IF(D59>=20,3))))))","v":""},null,null,null,null,null,{"$f":"IF(B59>D59,A59&C59,IF(D59>B59,C59&A59,\"/\"))","v":"/"},null,{"$f":"A59&C59","v":"AEAA"},{"$f":"E59","v":""},{"$f":"C59&A59","v":"AAAE"},{"$f":"F59","v":""},{"$f":"B59","v":0},{"$f":"D59","v":""}]
[{"$f":"A12","v":"AG"},null,{"$f":"A8","v":"AC"},{"$f":"IF(G60=19,19,IF(ISBLANK(B60),\"\",IF(B60=19,0,36-B60)))","v":""},{"$f":"IF(G60=19,0,IF(ISBLANK(B60),\"\",IF(B60<18,1,IF(B60=18,2,IF(B60>18,3)))))","v":""},{"$f":"IF(G60=19,3,IF(ISBLANK(B60),\"\",IF(B60=19,0,IF(D60<18,1,IF(D60=18,2,IF(D60>=20,3))))))","v":""},null,null,null,null,null,{"$f":"IF(B60>D60,A60&C60,IF(D60>B60,C60&A60,\"/\"))","v":"/"},null,{"$f":"A60&C60","v":"AGAC"},{"$f":"E60","v":""},{"$f":"C60&A60","v":"ACAG"},{"$f":"F60","v":""},{"$f":"B60","v":0},{"$f":"D60","v":""}]
[{"$f":"A11","v":"AF"},null,{"$f":"A13","v":"AH"},{"$f":"IF(G61=19,19,IF(ISBLANK(B61),\"\",IF(B61=19,0,36-B61)))","v":""},{"$f":"IF(G61=19,0,IF(ISBLANK(B61),\"\",IF(B61<18,1,IF(B61=18,2,IF(B61>18,3)))))","v":""},{"$f":"IF(G61=19,3,IF(ISBLANK(B61),\"\",IF(B61=19,0,IF(D61<18,1,IF(D61=18,2,IF(D61>=20,3))))))","v":""},null,null,null,null,null,{"$f":"IF(B61>D61,A61&C61,IF(D61>B61,C61&A61,\"/\"))","v":"/"},null,{"$f":"A61&C61","v":"AFAH"},{"$f":"E61","v":""},{"$f":"C61&A61","v":"AHAF"},{"$f":"F61","v":""},{"$f":"B61","v":0},{"$f":"D61","v":""}]
[]
["7 éme MATCH le","à",{"$f":"A12","v":"AG"}]
[null,null,null,null,null,null,"SI forfait éq recevante",null," "]
["Equipes","score","Equipes","score","Points","Points"]
[{"$f":"A6","v":"AA"},null,{"$f":"A12","v":"AG"},{"$f":"IF(G66=19,19,IF(ISBLANK(B66),\"\",IF(B66=19,0,36-B66)))","v":""},{"$f":"IF(G66=19,0,IF(ISBLANK(B66),\"\",IF(B66<18,1,IF(B66=18,2,IF(B66>18,3)))))","v":""},{"$f":"IF(G66=19,3,IF(ISBLANK(B66),\"\",IF(B66=19,0,IF(D66<18,1,IF(D66=18,2,IF(D66>=20,3))))))","v":""},null,null,null,null,null,{"$f":"IF(B66>D66,A66&C66,IF(D66>B66,C66&A66,\"/\"))","v":"/"},null,{"$f":"A66&C66","v":"AAAG"},{"$f":"E66","v":""},{"$f":"C66&A66","v":"AGAA"},{"$f":"F66","v":""},{"$f":"B66","v":0},{"$f":"D66","v":""}]
[{"$f":"A7","v":"AB"},null,{"$f":"A11","v":"AF"},{"$f":"IF(G67=19,19,IF(ISBLANK(B67),\"\",IF(B67=19,0,36-B67)))","v":""},{"$f":"IF(G67=19,0,IF(ISBLANK(B67),\"\",IF(B67<18,1,IF(B67=18,2,IF(B67>18,3)))))","v":""},{"$f":"IF(G67=19,3,IF(ISBLANK(B67),\"\",IF(B67=19,0,IF(D67<18,1,IF(D67=18,2,IF(D67>=20,3))))))","v":""},null,null,null,null,null,{"$f":"IF(B67>D67,A67&C67,IF(D67>B67,C67&A67,\"/\"))","v":"/"},null,{"$f":"A67&C67","v":"ABAF"},{"$f":"E67","v":""},{"$f":"C67&A67","v":"AFAB"},{"$f":"F67","v":""},{"$f":"B67","v":0},{"$f":"D67","v":""}]
[{"$f":"A10","v":"AE"},null,{"$f":"A9","v":"AD"},{"$f":"IF(G68=19,19,IF(ISBLANK(B68),\"\",IF(B68=19,0,36-B68)))","v":""},{"$f":"IF(G68=19,0,IF(ISBLANK(B68),\"\",IF(B68<18,1,IF(B68=18,2,IF(B68>18,3)))))","v":""},{"$f":"IF(G68=19,3,IF(ISBLANK(B68),\"\",IF(B68=19,0,IF(D68<18,1,IF(D68=18,2,IF(D68>=20,3))))))","v":""},null,null,null,null,null,{"$f":"IF(B68>D68,A68&C68,IF(D68>B68,C68&A68,\"/\"))","v":"/"},null,{"$f":"A68&C68","v":"AEAD"},{"$f":"E68","v":""},{"$f":"C68&A68","v":"ADAE"},{"$f":"F68","v":""},{"$f":"B68","v":0},{"$f":"D68","v":""}]
[{"$f":"A8","v":"AC"},null,{"$f":"A13","v":"AH"},{"$f":"IF(G69=19,19,IF(ISBLANK(B69),\"\",IF(B69=19,0,36-B69)))","v":""},{"$f":"IF(G69=19,0,IF(ISBLANK(B69),\"\",IF(B69<18,1,IF(B69=18,2,IF(B69>18,3)))))","v":""},{"$f":"IF(G69=19,3,IF(ISBLANK(B69),\"\",IF(B69=19,0,IF(D69<18,1,IF(D69=18,2,IF(D69>=20,3))))))","v":""},null,null,null,null,null,{"$f":"IF(B69>D69,A69&C69,IF(D69>B69,C69&A69,\"/\"))","v":"/"},null,{"$f":"A69&C69","v":"ACAH"},{"$f":"E69","v":""},{"$f":"C69&A69","v":"AHAC"},{"$f":"F69","v":""},{"$f":"B69","v":0},{"$f":"D69","v":""}]
[null,null,"CLASSEMENT",null,null,null,"Classt        Final","Rencontres entre exaequos"]
["EQUIPES",null,"POINTS","POUR","CONTRE","DIFF",null,"POINTS Exaequos","Exaq","n°",{"$f":"A6","v":"AA"},{"$f":"A7","v":"AB"},{"$f":"A8","v":"AC"},{"$f":"A9","v":"AD"},{"$f":"A10","v":"AE"},{"$f":"A11","v":"AF"},{"$f":"A12","v":"AG"},{"$f":"A13","v":"AH"},"Pts matchs",null,null,null,"1000000*Pts matchs +1000 (Diff +  abs(diff mini) )+Pour ","RANG","DIFF Exaequos","POUR Exaequos"]
[null,"1A",0,0,0,0,1,{"$f":"IF(S72>0,S72,\"\")","v":{"$error":"#N/A"}},{"$f":"COUNTIF($C$72:$C$79,C72)","v":8},{"$f":"IF(AND(I72>1,COUNTIFS(I$72:I72,I72,C$72:C72,C72)=1),MAX(J$71:J71)+1,\"\")","v":1},{"$f":"IF($A72=K$71,\"\",IF(INDEX($C$72:$C$79,MATCH(K$71,$A$72:$A$79,0))=$C72,IFERROR(VLOOKUP($A72&K$71,$N$18:$O$69,2,0),  VLOOKUP(K$71&$A72,$N$18:$Q$69,4,0)),          \"\"))","v":{"$error":"#N/A"}},{"$error":"#N/A"},{"$error":"#N/A"},{"$error":"#N/A"},{"$error":"#N/A"},{"$error":"#N/A"},{"$error":"#N/A"},{"$error":"#N/A"},{"$f":"SUM(K72:R72)","v":{"$error":"#N/A"}},null,null,null,{"$f":"IF(I72<3,S72*1000000+(F72+ABS(MIN($F$72:$F$79)))*1000+D72,S72*1000000+U96*1000+Z72)","v":{"$error":"#N/A"}},{"$f":"IF(I72>2,RANK(W72,OFFSET(W$71,MATCH(I72,$I$72:$I$79,0),,I72)))","v":{"$error":"#N/A"}},{"$f":"IF(S96=0,\"\",S96)","v":{"$error":"#N/A"}},{"$f":"IF(S80=0,\"\",S80)","v":{"$error":"#N/A"}}]
[null,"1B",0,0,0,0,2,{"$error":"#N/A"},8,{"$f":"IF(AND(I73>1,COUNTIFS(I$72:I73,I73,C$72:C73,C73)=1),MAX(J$71:J72)+1,\"\")","v":""},{"$error":"#N/A"},{"$error":"#N/A"},{"$error":"#N/A"},{"$error":"#N/A"},{"$error":"#N/A"},{"$error":"#N/A"},{"$error":"#N/A"},{"$error":"#N/A"},{"$f":"SUM(K73:R73)","v":{"$error":"#N/A"}},null,null,null,{"$f":"IF(I73<3,S73*1000000+(F73+ABS(MIN($F$72:$F$79)))*1000+D73,S73*1000000+U97*1000+Z73)","v":{"$error":"#N/A"}},{"$f":"IF(I73>2,RANK(W73,OFFSET(W$71,MATCH(I73,$I$72:$I$79,0),,I73)))","v":{"$error":"#N/A"}},{"$error":"#N/A"},{"$error":"#N/A"}]
[null,"1C",0,0,0,0,3,{"$error":"#N/A"},8,{"$f":"IF(AND(I74>1,COUNTIFS(I$72:I74,I74,C$72:C74,C74)=1),MAX(J$71:J73)+1,\"\")","v":""},{"$error":"#N/A"},{"$error":"#N/A"},{"$error":"#N/A"},{"$error":"#N/A"},{"$error":"#N/A"},{"$error":"#N/A"},{"$error":"#N/A"},{"$error":"#N/A"},{"$error":"#N/A"},null,null,null,{"$error":"#N/A"},{"$error":"#N/A"},{"$error":"#N/A"},{"$error":"#N/A"}]
[null,"1D",0,0,0,0,4,{"$error":"#N/A"},8,{"$f":"IF(AND(I75>1,COUNTIFS(I$72:I75,I75,C$72:C75,C75)=1),MAX(J$71:J74)+1,\"\")","v":""},{"$error":"#N/A"},{"$error":"#N/A"},{"$error":"#N/A"},{"$error":"#N/A"},{"$error":"#N/A"},{"$error":"#N/A"},{"$error":"#N/A"},{"$error":"#N/A"},{"$error":"#N/A"},null,null,null,{"$error":"#N/A"},{"$error":"#N/A"},{"$error":"#N/A"},{"$error":"#N/A"}]
[null,"1E",0,0,0,0,5,{"$error":"#N/A"},8,{"$f":"IF(AND(I76>1,COUNTIFS(I$72:I76,I76,C$72:C76,C76)=1),MAX(J$71:J75)+1,\"\")","v":""},{"$error":"#N/A"},{"$error":"#N/A"},{"$error":"#N/A"},{"$error":"#N/A"},{"$error":"#N/A"},{"$error":"#N/A"},{"$error":"#N/A"},{"$error":"#N/A"},{"$error":"#N/A"},null,null,null,{"$error":"#N/A"},{"$error":"#N/A"},{"$error":"#N/A"},{"$error":"#N/A"}]
[null,"1F",0,0,0,0,6,{"$error":"#N/A"},8,{"$f":"IF(AND(I77>1,COUNTIFS(I$72:I77,I77,C$72:C77,C77)=1),MAX(J$71:J76)+1,\"\")","v":""},{"$error":"#N/A"},{"$error":"#N/A"},{"$error":"#N/A"},{"$error":"#N/A"},{"$error":"#N/A"},{"$error":"#N/A"},{"$error":"#N/A"},{"$error":"#N/A"},{"$error":"#N/A"},null,null,null,{"$error":"#N/A"},{"$error":"#N/A"},{"$error":"#N/A"},{"$error":"#N/A"}]
[null,"1G",0,0,0,0,7,{"$error":"#N/A"},8,{"$f":"IF(AND(I78>1,COUNTIFS(I$72:I78,I78,C$72:C78,C78)=1),MAX(J$71:J77)+1,\"\")","v":""},{"$error":"#N/A"},{"$error":"#N/A"},{"$error":"#N/A"},{"$error":"#N/A"},{"$error":"#N/A"},{"$error":"#N/A"},{"$error":"#N/A"},{"$error":"#N/A"},{"$error":"#N/A"},null,null,null,{"$error":"#N/A"},{"$error":"#N/A"},{"$error":"#N/A"},{"$error":"#N/A"}]
[null,"1H",0,0,0,0,8,{"$error":"#N/A"},8,{"$f":"IF(AND(I79>1,COUNTIFS(I$72:I79,I79,C$72:C79,C79)=1),MAX(J$71:J78)+1,\"\")","v":""},{"$error":"#N/A"},{"$error":"#N/A"},{"$error":"#N/A"},{"$error":"#N/A"},{"$error":"#N/A"},{"$error":"#N/A"},{"$error":"#N/A"},{"$error":"#N/A"},{"$error":"#N/A"},null,null,null,{"$error":"#N/A"},{"$error":"#N/A"},{"$error":"#N/A"},{"$error":"#N/A"}]
[null,null,null,null,null,null,null,null,"POUR",{"$f":"A72","v":0},{"$f":"IF($A72=K$71,\"\",IF(INDEX($C$72:$C$79,MATCH(K$71,$A$72:$A$79,0))=$C72,IFERROR(VLOOKUP($A72&K$71,$N$18:$R$69,5,0),  VLOOKUP(K$71&$A72,$N$18:$S$69,6,0)),          \"\"))","v":{"$error":"#N/A"}},{"$error":"#N/A"},{"$error":"#N/A"},{"$error":"#N/A"},{"$error":"#N/A"},{"$error":"#N/A"},{"$error":"#N/A"},{"$error":"#N/A"},{"$error":"#N/A"}]
[null,null,null,null,null,null,null,null,null,0,{"$error":"#N/A"},{"$error":"#N/A"},{"$error":"#N/A"},{"$error":"#N/A"},{"$error":"#N/A"},{"$error":"#N/A"},{"$error":"#N/A"},{"$error":"#N/A"},{"$error":"#N/A"}]
[null,null,null,null,null,null,null,null,null,0,{"$error":"#N/A"},{"$error":"#N/A"},{"$error":"#N/A"},{"$error":"#N/A"},{"$error":"#N/A"},{"$error":"#N/A"},{"$error":"#N/A"},{"$error":"#N/A"},{"$error":"#N/A"}]
[null,null,null,null,null,null,null,null,null,0,{"$error":"#N/A"},{"$error":"#N/A"},{"$error":"#N/A"},{"$error":"#N/A"},{"$error":"#N/A"},{"$error":"#N/A"},{"$error":"#N/A"},{"$error":"#N/A"},{"$error":"#N/A"}]
[null,null,null,null,null,null,null,null,null,0,{"$error":"#N/A"},{"$error":"#N/A"},{"$error":"#N/A"},{"$error":"#N/A"},{"$error":"#N/A"},{"$error":"#N/A"},{"$error":"#N/A"},{"$error":"#N/A"},{"$error":"#N/A"},null,null,null,null,null,"  "]
[null,null,null,null,null,null,null,null,null,0,{"$error":"#N/A"},{"$error":"#N/A"},{"$error":"#N/A"},{"$error":"#N/A"},{"$error":"#N/A"},{"$error":"#N/A"},{"$error":"#N/A"},{"$error":"#N/A"},{"$error":"#N/A"}]
[null,null,null,null,null,null,null,null,null,0,{"$error":"#N/A"},{"$error":"#N/A"},{"$error":"#N/A"},{"$error":"#N/A"},{"$error":"#N/A"},{"$error":"#N/A"},{"$error":"#N/A"},{"$error":"#N/A"},{"$error":"#N/A"}]
[null,null,null,null,null,null,null,null,null,0,{"$error":"#N/A"},{"$error":"#N/A"},{"$error":"#N/A"},{"$error":"#N/A"},{"$error":"#N/A"},{"$error":"#N/A"},{"$error":"#N/A"},{"$error":"#N/A"},{"$error":"#N/A"}]
[null,null,null,null,null,null,null,null,"CONTRE",{"$f":"J80","v":0},{"$f":"INDEX($K$80:$R$87,MATCH(K$71,$J$80:$J$87,0),MATCH($J80,$K$71:$R$71,0))","v":{"$error":"#N/A"}},{"$f":"INDEX($K$80:$R$87,MATCH(L$71,$J$80:$J$87,0),MATCH($J80,$K$71:$R$71,0))","v":{"$error":"#N/A"}},{"$error":"#N/A"},{"$error":"#N/A"},{"$error":"#N/A"},{"$error":"#N/A"},{"$error":"#N/A"},{"$error":"#N/A"},{"$error":"#N/A"}]
[null,null,null,null,null,null,null,null,null,{"$f":"J81","v":0},{"$f":"INDEX($K$80:$R$87,MATCH(K$71,$J$80:$J$87,0),MATCH($J81,$K$71:$R$71,0))","v":{"$error":"#N/A"}},{"$error":"#N/A"},{"$error":"#N/A"},{"$error":"#N/A"},{"$error":"#N/A"},{"$error":"#N/A"},{"$error":"#N/A"},{"$error":"#N/A"},{"$error":"#N/A"}]
[null,null,null,null,null,null,null,null,null,0,{"$error":"#N/A"},{"$error":"#N/A"},{"$error":"#N/A"},{"$error":"#N/A"},{"$error":"#N/A"},{"$error":"#N/A"},{"$error":"#N/A"},{"$error":"#N/A"},{"$error":"#N/A"}]
[null,null,null,null,null,null,null,null,null,0,{"$error":"#N/A"},{"$error":"#N/A"},{"$error":"#N/A"},{"$error":"#N/A"},{"$error":"#N/A"},{"$error":"#N/A"},{"$error":"#N/A"},{"$error":"#N/A"},{"$error":"#N/A"}]
[null,null,null,null,null,null,null,null,null,0,{"$error":"#N/A"},{"$error":"#N/A"},{"$error":"#N/A"},{"$error":"#N/A"},{"$error":"#N/A"},{"$error":"#N/A"},{"$error":"#N/A"},{"$error":"#N/A"},{"$error":"#N/A"}]
[null,null,null,null,null,null,null,null,null,0,{"$error":"#N/A"},{"$error":"#N/A"},{"$error":"#N/A"},{"$error":"#N/A"},{"$error":"#N/A"},{"$error":"#N/A"},{"$error":"#N/A"},{"$error":"#N/A"},{"$error":"#N/A"}]
[null,null,null,null,null,null,null,null,null,0,{"$error":"#N/A"},{"$error":"#N/A"},{"$error":"#N/A"},{"$error":"#N/A"},{"$error":"#N/A"},{"$error":"#N/A"},{"$error":"#N/A"},{"$error":"#N/A"},{"$error":"#N/A"}]
[null,null,null,null,null,null,null,null,null,0,{"$error":"#N/A"},{"$error":"#N/A"},{"$error":"#N/A"},{"$error":"#N/A"},{"$error":"#N/A"},{"$error":"#N/A"},{"$error":"#N/A"},{"$error":"#N/A"},{"$error":"#N/A"},null,"Diff pondérée"]
[null,null,null,null,null,null,null,null,"DIFF",{"$f":"J88","v":0},null,null,null,null,null,null,null,null,{"$f":"S80-S88","v":{"$error":"#N/A"}},null,{"$f":"S96+ABS(MIN($S$96:$S$103))","v":{"$error":"#N/A"}}]
[null,null,null,null,null,null,null,null,null,{"$f":"J89","v":0},null,null,null,null,null,null,null,null,{"$f":"S81-S89","v":{"$error":"#N/A"}},null,{"$error":"#N/A"}]
[null,null,null,null,null,null,null,null,null,0,null,null,null,null,null,null,null,null,{"$error":"#N/A"},null,{"$error":"#N/A"}]
[null,null,null,null,null,null,null,null,null,0,null,null,null,null,null,null,null,null,{"$error":"#N/A"},null,{"$error":"#N/A"}]
[null,null,null,null,null,null,null,null,null,0,null,null,null,null,null,null,null,null,{"$error":"#N/A"},null,{"$error":"#N/A"}]
[null,null,null,null,null,null,null,null,null,0,null,null,null,null,null,null,null,null,{"$error":"#N/A"},null,{"$error":"#N/A"}]
[null,null,null,null,null,null,null,null,null,0,null,null,null,null,null,null,null,null,{"$error":"#N/A"},null,{"$f":"S102+ABS(MIN($S$96:$S$103))","v":{"$error":"#N/A"}}]
[null,null,null,null,null,null,null,null,null,0,null,null,null,null,null,null,null,null,{"$error":"#N/A"},null,{"$f":"S103+ABS(MIN($S$96:$S$103))","v":{"$error":"#N/A"}}]

{"sheet":"P4","index":3,"n_rows":103,"n_cols":26,"rows_kept":103,"cut":false,"hidden":false,"merged":[[0,0,0,5],[1,0,1,5],[2,0,2,5],[3,0,3,5],[3,8,3,10],[15,6,16,6],[69,2,69,5],[69,6,70,6],[69,7,69,25],[23,6,24,6],[31,6,32,6],[39,6,40,6],[47,6,48,6],[55,6,56,6],[63,6,64,6]]}
[null,null,null,null,null,null,3]
["CHAMPIONNAT DES CLUBS"]
[]
["POULE 4"]
["EQUIPES",null,"POINTS","Pour","Contre","Diff"]
["AA","1A",{"$f":"SUMIF($A$18:$A$69,A6,$E$18:$E$69)+SUMIF($C$18:$C$69,A6,$F$18:$F$69)","v":0},{"$f":"SUMIF($A$18:$A$69,$A6,$B$18:$B$69)+SUMIF($C$18:$C$69,$A6,$D$18:$D$69)","v":0},{"$f":"SUMIF($C$18:$C$69,$A6,$B$18:$B$69)+SUMIF($A$18:$A$69,$A6,$D$18:$D$69)","v":0},{"$f":"D6-E6","v":0}]
["AB","1B",{"$f":"SUMIF($A$18:$A$69,A7,$E$18:$E$69)+SUMIF($C$18:$C$69,A7,$F$18:$F$69)","v":0},{"$f":"SUMIF($A$18:$A$69,$A7,$B$18:$B$69)+SUMIF($C$18:$C$69,$A7,$D$18:$D$69)","v":0},{"$f":"SUMIF($C$18:$C$69,$A7,$B$18:$B$69)+SUMIF($A$18:$A$69,$A7,$D$18:$D$69)","v":0},0]
["AC","1C",{"$f":"SUMIF($A$18:$A$69,A8,$E$18:$E$69)+SUMIF($C$18:$C$69,A8,$F$18:$F$69)","v":0},0,0,0]
["AD","1D",0,0,0,0]
["AE","1E",0,0,0,0]
["AF","1F",0,0,0,0]
["AG","1G",0,0,0,{"$f":"D12-E12","v":0}]
["AH","1H",0,{"$f":"SUMIF($A$18:$A$69,$A13,$B$18:$B$69)+SUMIF($C$18:$C$69,$A13,$D$18:$D$69)","v":0},0,{"$f":"D13-E13","v":0}]
[]
["1er MATCH le ","à",{"$f":"A6","v":"AA"}]
[null,null,null,null,null,null,"SI forfait éq recevante"]
["Equipes","score","Equipes","score","Points","Points"]
[{"$f":"A6","v":"AA"},null,{"$f":"A7","v":"AB"},{"$f":"IF(G18=19,19,IF(ISBLANK(B18),\"\",IF(B18=19,0,36-B18)))","v":""},{"$f":"IF(G18=19,0,IF(ISBLANK(B18),\"\",IF(B18<18,1,IF(B18=18,2,IF(B18>18,3)))))","v":""},{"$f":"IF(G18=19,3,IF(ISBLANK(B18),\"\",IF(B18=19,0,IF(D18<18,1,IF(D18=18,2,IF(D18>=20,3))))))","v":""},null,null,null,null,null,{"$f":"IF(B18>D18,A18&C18,IF(D18>B18,C18&A18,\"/\"))","v":"/"},null,{"$f":"A18&C18","v":"AAAB"},{"$f":"E18","v":""},{"$f":"C18&A18","v":"ABAA"},{"$f":"F18","v":""},{"$f":"B18","v":0},{"$f":"D18","v":""}]
[{"$f":"A8","v":"AC"},null,{"$f":"A9","v":"AD"},{"$f":"IF(G19=19,19,IF(ISBLANK(B19),\"\",IF(B19=19,0,36-B19)))","v":""},{"$f":"IF(G19=19,0,IF(ISBLANK(B19),\"\",IF(B19<18,1,IF(B19=18,2,IF(B19>18,3)))))","v":""},{"$f":"IF(G19=19,3,IF(ISBLANK(B19),\"\",IF(B19=19,0,IF(D19<18,1,IF(D19=18,2,IF(D19>=20,3))))))","v":""},null,null,null,null,null,{"$f":"IF(B19>D19,A19&C19,IF(D19>B19,C19&A19,\"/\"))","v":"/"},null,{"$f":"A19&C19","v":"ACAD"},{"$f":"E19","v":""},{"$f":"C19&A19","v":"ADAC"},{"$f":"F19","v":""},{"$f":"B19","v":0},{"$f":"D19","v":""}]
[{"$f":"A10","v":"AE"},null,{"$f":"A11","v":"AF"},{"$f":"IF(G20=19,19,IF(ISBLANK(B20),\"\",IF(B20=19,0,36-B20)))","v":""},{"$f":"IF(G20=19,0,IF(ISBLANK(B20),\"\",IF(B20<18,1,IF(B20=18,2,IF(B20>18,3)))))","v":""},{"$f":"IF(G20=19,3,IF(ISBLANK(B20),\"\",IF(B20=19,0,IF(D20<18,1,IF(D20=18,2,IF(D20>=20,3))))))","v":""},null,null,null,null,null,{"$f":"IF(B20>D20,A20&C20,IF(D20>B20,C20&A20,\"/\"))","v":"/"},null,{"$f":"A20&C20","v":"AEAF"},{"$f":"E20","v":""},{"$f":"C20&A20","v":"AFAE"},{"$f":"F20","v":""},{"$f":"B20","v":0},{"$f":"D20","v":""}]
[{"$f":"A12","v":"AG"},null,{"$f":"A13","v":"AH"},{"$f":"IF(G21=19,19,IF(ISBLANK(B21),\"\",IF(B21=19,0,36-B21)))","v":""},{"$f":"IF(G21=19,0,IF(ISBLANK(B21),\"\",IF(B21<18,1,IF(B21=18,2,IF(B21>18,3)))))","v":""},{"$f":"IF(G21=19,3,IF(ISBLANK(B21),\"\",IF(B21=19,0,IF(D21<18,1,IF(D21=18,2,IF(D21>=20,3))))))","v":""},null,null,null,null,null,{"$f":"IF(B21>D21,A21&C21,IF(D21>B21,C21&A21,\"/\"))","v":"/"},null,{"$f":"A21&C21","v":"AGAH"},{"$f":"E21","v":""},{"$f":"C21&A21","v":"AHAG"},{"$f":"F21","v":""},{"$f":"B21","v":0},{"$f":"D21","v":""}]
[]
["2 éme MATCH le ","à",{"$f":"A7","v":"AB"}]
[null,null,null,null,null,null,"SI forfait éq recevante"]
["Equipes","score","Equipes","score","Points","Points"]
[{"$f":"A6","v":"AA"},null,{"$f":"A8","v":"AC"},{"$f":"IF(G26=19,19,IF(ISBLANK(B26),\"\",IF(B26=19,0,36-B26)))","v":""},{"$f":"IF(G26=19,0,IF(ISBLANK(B26),\"\",IF(B26<18,1,IF(B26=18,2,IF(B26>18,3)))))","v":""},{"$f":"IF(G26=19,3,IF(ISBLANK(B26),\"\",IF(B26=19,0,IF(D26<18,1,IF(D26=18,2,IF(D26>=20,3))))))","v":""},null,null,null,null,null,{"$f":"IF(B26>D26,A26&C26,IF(D26>B26,C26&A26,\"/\"))","v":"/"},null,{"$f":"A26&C26","v":"AAAC"},{"$f":"E26","v":""},{"$f":"C26&A26","v":"ACAA"},{"$f":"F26","v":""},{"$f":"B26","v":0},{"$f":"D26","v":""}]
[{"$f":"A7","v":"AB"},null,{"$f":"A13","v":"AH"},{"$f":"IF(G27=19,19,IF(ISBLANK(B27),\"\",IF(B27=19,0,36-B27)))","v":""},{"$f":"IF(G27=19,0,IF(ISBLANK(B27),\"\",IF(B27<18,1,IF(B27=18,2,IF(B27>18,3)))))","v":""},{"$f":"IF(G27=19,3,IF(ISBLANK(B27),\"\",IF(B27=19,0,IF(D27<18,1,IF(D27=18,2,IF(D27>=20,3))))))","v":""},null,null,null,null,null,{"$f":"IF(B27>D27,A27&C27,IF(D27>B27,C27&A27,\"/\"))","v":"/"},null,{"$f":"A27&C27","v":"ABAH"},{"$f":"E27","v":""},{"$f":"C27&A27","v":"AHAB"},{"$f":"F27","v":""},{"$f":"B27","v":0},{"$f":"D27","v":""}]
[{"$f":"A9","v":"AD"},null,{"$f":"A11","v":"AF"},{"$f":"IF(G28=19,19,IF(ISBLANK(B28),\"\",IF(B28=19,0,36-B28)))","v":""},{"$f":"IF(G28=19,0,IF(ISBLANK(B28),\"\",IF(B28<18,1,IF(B28=18,2,IF(B28>18,3)))))","v":""},{"$f":"IF(G28=19,3,IF(ISBLANK(B28),\"\",IF(B28=19,0,IF(D28<18,1,IF(D28=18,2,IF(D28>=20,3))))))","v":""},null,null,null,null,null,{"$f":"IF(B28>D28,A28&C28,IF(D28>B28,C28&A28,\"/\"))","v":"/"},null,{"$f":"A28&C28","v":"ADAF"},{"$f":"E28","v":""},{"$f":"C28&A28","v":"AFAD"},{"$f":"F28","v":""},{"$f":"B28","v":0},{"$f":"D28","v":""}]
[{"$f":"A10","v":"AE"},null,{"$f":"A12","v":"AG"},{"$f":"IF(G29=19,19,IF(ISBLANK(B29),\"\",IF(B29=19,0,36-B29)))","v":""},{"$f":"IF(G29=19,0,IF(ISBLANK(B29),\"\",IF(B29<18,1,IF(B29=18,2,IF(B29>18,3)))))","v":""},{"$f":"IF(G29=19,3,IF(ISBLANK(B29),\"\",IF(B29=19,0,IF(D29<18,1,IF(D29=18,2,IF(D29>=20,3))))))","v":""},null,null,null,null,null,{"$f":"IF(B29>D29,A29&C29,IF(D29>B29,C29&A29,\"/\"))","v":"/"},null,{"$f":"A29&C29","v":"AEAG"},{"$f":"E29","v":""},{"$f":"C29&A29","v":"AGAE"},{"$f":"F29","v":""},{"$f":"B29","v":0},{"$f":"D29","v":""}]
[]
["3 éme MATCH le ","à",{"$f":"A8","v":"AC"}]
[null,null,null,null,null,null,"SI forfait éq recevante"]
["Equipes","score","Equipes","score","Points","Points"]
[{"$f":"A6","v":"AA"},null,{"$f":"A13","v":"AH"},{"$f":"IF(G34=19,19,IF(ISBLANK(B34),\"\",IF(B34=19,0,36-B34)))","v":""},{"$f":"IF(G34=19,0,IF(ISBLANK(B34),\"\",IF(B34<18,1,IF(B34=18,2,IF(B34>18,3)))))","v":""},{"$f":"IF(G34=19,3,IF(ISBLANK(B34),\"\",IF(B34=19,0,IF(D34<18,1,IF(D34=18,2,IF(D34>=20,3))))))","v":""},null,null,null,null,null,{"$f":"IF(B34>D34,A34&C34,IF(D34>B34,C34&A34,\"/\"))","v":"/"},null,{"$f":"A34&C34","v":"AAAH"},{"$f":"E34","v":""},{"$f":"C34&A34","v":"AHAA"},{"$f":"F34","v":""},{"$f":"B34","v":0},{"$f":"D34","v":""}]
[{"$f":"A7","v":"AB"},null,{"$f":"A10","v":"AE"},{"$f":"IF(G35=19,19,IF(ISBLANK(B35),\"\",IF(B35=19,0,36-B35)))","v":""},{"$f":"IF(G35=19,0,IF(ISBLANK(B35),\"\",IF(B35<18,1,IF(B35=18,2,IF(B35>18,3)))))","v":""},{"$f":"IF(G35=19,3,IF(ISBLANK(B35),\"\",IF(B35=19,0,IF(D35<18,1,IF(D35=18,2,IF(D35>=20,3))))))","v":""},null,null,null,null,null,{"$f":"IF(B35>D35,A35&C35,IF(D35>B35,C35&A35,\"/\"))","v":"/"},null,{"$f":"A35&C35","v":"ABAE"},{"$f":"E35","v":""},{"$f":"C35&A35","v":"AEAB"},{"$f":"F35","v":""},{"$f":"B35","v":0},{"$f":"D35","v":""}]
[{"$f":"A8","v":"AC"},null,{"$f":"A11","v":"AF"},{"$f":"IF(G36=19,19,IF(ISBLANK(B36),\"\",IF(B36=19,0,36-B36)))","v":""},{"$f":"IF(G36=19,0,IF(ISBLANK(B36),\"\",IF(B36<18,1,IF(B36=18,2,IF(B36>18,3)))))","v":""},{"$f":"IF(G36=19,3,IF(ISBLANK(B36),\"\",IF(B36=19,0,IF(D36<18,1,IF(D36=18,2,IF(D36>=20,3))))))","v":""},null,null,null,null,null,{"$f":"IF(B36>D36,A36&C36,IF(D36>B36,C36&A36,\"/\"))","v":"/"},null,{"$f":"A36&C36","v":"ACAF"},{"$f":"E36","v":""},{"$f":"C36&A36","v":"AFAC"},{"$f":"F36","v":""},{"$f":"B36","v":0},{"$f":"D36","v":""}]
[{"$f":"A9","v":"AD"},null,{"$f":"A12","v":"AG"},{"$f":"IF(G37=19,19,IF(ISBLANK(B37),\"\",IF(B37=19,0,36-B37)))","v":""},{"$f":"IF(G37=19,0,IF(ISBLANK(B37),\"\",IF(B37<18,1,IF(B37=18,2,IF(B37>18,3)))))","v":""},{"$f":"IF(G37=19,3,IF(ISBLANK(B37),\"\",IF(B37=19,0,IF(D37<18,1,IF(D37=18,2,IF(D37>=20,3))))))","v":""},null,null,null,null,null,{"$f":"IF(B37>D37,A37&C37,IF(D37>B37,C37&A37,\"/\"))","v":"/"},null,{"$f":"A37&C37","v":"ADAG"},{"$f":"E37","v":""},{"$f":"C37&A37","v":"AGAD"},{"$f":"F37","v":""},{"$f":"B37","v":0},{"$f":"D37","v":""}]
[]
["4 éme MATCH le ","à",{"$f":"A9","v":"AD"}]
[null,null,null,null,null,null,"SI forfait éq recevante"]
["Equipes","score","Equipes","score","Points","Points"]
[{"$f":"A6","v":"AA"},null,{"$f":"A9","v":"AD"},{"$f":"IF(G42=19,19,IF(ISBLANK(B42),\"\",IF(B42=19,0,36-B42)))","v":""},{"$f":"IF(G42=19,0,IF(ISBLANK(B42),\"\",IF(B42<18,1,IF(B42=18,2,IF(B42>18,3)))))","v":""},{"$f":"IF(G42=19,3,IF(ISBLANK(B42),\"\",IF(B42=19,0,IF(D42<18,1,IF(D42=18,2,IF(D42>=20,3))))))","v":""},null,null,null,null,null,{"$f":"IF(B42>D42,A42&C42,IF(D42>B42,C42&A42,\"/\"))","v":"/"},null,{"$f":"A42&C42","v":"AAAD"},{"$f":"E42","v":""},{"$f":"C42&A42","v":"ADAA"},{"$f":"F42","v":""},{"$f":"B42","v":0},{"$f":"D42","v":""}]
[{"$f":"A11","v":"AF"},null,{"$f":"A12","v":"AG"},{"$f":"IF(G43=19,19,IF(ISBLANK(B43),\"\",IF(B43=19,0,36-B43)))","v":""},{"$f":"IF(G43=19,0,IF(ISBLANK(B43),\"\",IF(B43<18,1,IF(B43=18,2,IF(B43>18,3)))))","v":""},{"$f":"IF(G43=19,3,IF(ISBLANK(B43),\"\",IF(B43=19,0,IF(D43<18,1,IF(D43=18,2,IF(D43>=20,3))))))","v":""},null,null,null,null,null,{"$f":"IF(B43>D43,A43&C43,IF(D43>B43,C43&A43,\"/\"))","v":"/"},null,{"$f":"A43&C43","v":"AFAG"},{"$f":"E43","v":""},{"$f":"C43&A43","v":"AGAF"},{"$f":"F43","v":""},{"$f":"B43","v":0},{"$f":"D43","v":""}]
[{"$f":"A7","v":"AB"},null,{"$f":"A8","v":"AC"},{"$f":"IF(G44=19,19,IF(ISBLANK(B44),\"\",IF(B44=19,0,36-B44)))","v":""},{"$f":"IF(G44=19,0,IF(ISBLANK(B44),\"\",IF(B44<18,1,IF(B44=18,2,IF(B44>18,3)))))","v":""},{"$f":"IF(G44=19,3,IF(ISBLANK(B44),\"\",IF(B44=19,0,IF(D44<18,1,IF(D44=18,2,IF(D44>=20,3))))))","v":""},null,null,null,null,null,{"$f":"IF(B44>D44,A44&C44,IF(D44>B44,C44&A44,\"/\"))","v":"/"},null,{"$f":"A44&C44","v":"ABAC"},{"$f":"E44","v":""},{"$f":"C44&A44","v":"ACAB"},{"$f":"F44","v":""},{"$f":"B44","v":0},{"$f":"D44","v":""}]
[{"$f":"A10","v":"AE"},null,{"$f":"A13","v":"AH"},{"$f":"IF(G45=19,19,IF(ISBLANK(B45),\"\",IF(B45=19,0,36-B45)))","v":""},{"$f":"IF(G45=19,0,IF(ISBLANK(B45),\"\",IF(B45<18,1,IF(B45=18,2,IF(B45>18,3)))))","v":""},{"$f":"IF(G45=19,3,IF(ISBLANK(B45),\"\",IF(B45=19,0,IF(D45<18,1,IF(D45=18,2,IF(D45>=20,3))))))","v":""},null,null,null,null,null,{"$f":"IF(B45>D45,A45&C45,IF(D45>B45,C45&A45,\"/\"))","v":"/"},null,{"$f":"A45&C45","v":"AEAH"},{"$f":"E45","v":""},{"$f":"C45&A45","v":"AHAE"},{"$f":"F45","v":""},{"$f":"B45","v":0},{"$f":"D45","v":""}]
[]
["5 éme MATCH le ","à",{"$f":"A10","v":"AE"}]
[null,null,null,null,null,null,"SI forfait éq recevante"]
["Equipes","score","Equipes","score","Points","Points"]
[{"$f":"A6","v":"AA"},null,{"$f":"A11","v":"AF"},{"$f":"IF(G50=19,19,IF(ISBLANK(B50),\"\",IF(B50=19,0,36-B50)))","v":""},{"$f":"IF(G50=19,0,IF(ISBLANK(B50),\"\",IF(B50<18,1,IF(B50=18,2,IF(B50>18,3)))))","v":""},{"$f":"IF(G50=19,3,IF(ISBLANK(B50),\"\",IF(B50=19,0,IF(D50<18,1,IF(D50=18,2,IF(D50>=20,3))))))","v":""},null,null,null,null,null,{"$f":"IF(B50>D50,A50&C50,IF(D50>B50,C50&A50,\"/\"))","v":"/"},null,{"$f":"A50&C50","v":"AAAF"},{"$f":"E50","v":""},{"$f":"C50&A50","v":"AFAA"},{"$f":"F50","v":""},{"$f":"B50","v":0},{"$f":"D50","v":""}]
[{"$f":"A9","v":"AD"},null,{"$f":"A13","v":"AH"},{"$f":"IF(G51=19,19,IF(ISBLANK(B51),\"\",IF(B51=19,0,36-B51)))","v":""},{"$f":"IF(G51=19,0,IF(ISBLANK(B51),\"\",IF(B51<18,1,IF(B51=18,2,IF(B51>18,3)))))","v":""},{"$f":"IF(G51=19,3,IF(ISBLANK(B51),\"\",IF(B51=19,0,IF(D51<18,1,IF(D51=18,2,IF(D51>=20,3))))))","v":""},null,null,null,null,null,{"$f":"IF(B51>D51,A51&C51,IF(D51>B51,C51&A51,\"/\"))","v":"/"},null,{"$f":"A51&C51","v":"ADAH"},{"$f":"E51","v":""},{"$f":"C51&A51","v":"AHAD"},{"$f":"F51","v":""},{"$f":"B51","v":0},{"$f":"D51","v":""}]
[{"$f":"A7","v":"AB"},null,{"$f":"A12","v":"AG"},{"$f":"IF(G52=19,19,IF(ISBLANK(B52),\"\",IF(B52=19,0,36-B52)))","v":""},{"$f":"IF(G52=19,0,IF(ISBLANK(B52),\"\",IF(B52<18,1,IF(B52=18,2,IF(B52>18,3)))))","v":""},{"$f":"IF(G52=19,3,IF(ISBLANK(B52),\"\",IF(B52=19,0,IF(D52<18,1,IF(D52=18,2,IF(D52>=20,3))))))","v":""},null,null,null,null,null,{"$f":"IF(B52>D52,A52&C52,IF(D52>B52,C52&A52,\"/\"))","v":"/"},null,{"$f":"A52&C52","v":"ABAG"},{"$f":"E52","v":""},{"$f":"C52&A52","v":"AGAB"},{"$f":"F52","v":""},{"$f":"B52","v":0},{"$f":"D52","v":""}]
[{"$f":"A8","v":"AC"},null,{"$f":"A10","v":"AE"},{"$f":"IF(G53=19,19,IF(ISBLANK(B53),\"\",IF(B53=19,0,36-B53)))","v":""},{"$f":"IF(G53=19,0,IF(ISBLANK(B53),\"\",IF(B53<18,1,IF(B53=18,2,IF(B53>18,3)))))","v":""},{"$f":"IF(G53=19,3,IF(ISBLANK(B53),\"\",IF(B53=19,0,IF(D53<18,1,IF(D53=18,2,IF(D53>=20,3))))))","v":""},null,null,null,null,null,{"$f":"IF(B53>D53,A53&C53,IF(D53>B53,C53&A53,\"/\"))","v":"/"},null,{"$f":"A53&C53","v":"ACAE"},{"$f":"E53","v":""},{"$f":"C53&A53","v":"AEAC"},{"$f":"F53","v":""},{"$f":"B53","v":0},{"$f":"D53","v":""}]
[]
["6 éme MATCH le ","à",{"$f":"A11","v":"AF"}]
[null,null,null,null,null,null,"SI forfait éq recevante"]
["Equipes","score","Equipes","score","Points","Points"]
[{"$f":"A7","v":"AB"},null,{"$f":"A9","v":"AD"},{"$f":"IF(G58=19,19,IF(ISBLANK(B58),\"\",IF(B58=19,0,36-B58)))","v":""},{"$f":"IF(G58=19,0,IF(ISBLANK(B58),\"\",IF(B58<18,1,IF(B58=18,2,IF(B58>18,3)))))","v":""},{"$f":"IF(G58=19,3,IF(ISBLANK(B58),\"\",IF(B58=19,0,IF(D58<18,1,IF(D58=18,2,IF(D58>=20,3))))))","v":""},null,null,null,null,null,{"$f":"IF(B58>D58,A58&C58,IF(D58>B58,C58&A58,\"/\"))","v":"/"},null,{"$f":"A58&C58","v":"ABAD"},{"$f":"E58","v":""},{"$f":"C58&A58","v":"ADAB"},{"$f":"F58","v":""},{"$f":"B58","v":0},{"$f":"D58","v":""}]
[{"$f":"A10","v":"AE"},null,{"$f":"A6","v":"AA"},{"$f":"IF(G59=19,19,IF(ISBLANK(B59),\"\",IF(B59=19,0,36-B59)))","v":""},{"$f":"IF(G59=19,0,IF(ISBLANK(B59),\"\",IF(B59<18,1,IF(B59=18,2,IF(B59>18,3)))))","v":""},{"$f":"IF(G59=19,3,IF(ISBLANK(B59),\"\",IF(B59=19,0,IF(D59<18,1,IF(D59=18,2,IF(D59>=20,3))))))","v":""},null,null,null,null,null,{"$f":"IF(B59>D59,A59&C59,IF(D59>B59,C59&A59,\"/\"))","v":"/"},null,{"$f":"A59&C59","v":"AEAA"},{"$f":"E59","v":""},{"$f":"C59&A59","v":"AAAE"},{"$f":"F59","v":""},{"$f":"B59","v":0},{"$f":"D59","v":""}]
[{"$f":"A12","v":"AG"},null,{"$f":"A8","v":"AC"},{"$f":"IF(G60=19,19,IF(ISBLANK(B60),\"\",IF(B60=19,0,36-B60)))","v":""},{"$f":"IF(G60=19,0,IF(ISBLANK(B60),\"\",IF(B60<18,1,IF(B60=18,2,IF(B60>18,3)))))","v":""},{"$f":"IF(G60=19,3,IF(ISBLANK(B60),\"\",IF(B60=19,0,IF(D60<18,1,IF(D60=18,2,IF(D60>=20,3))))))","v":""},null,null,null,null,null,{"$f":"IF(B60>D60,A60&C60,IF(D60>B60,C60&A60,\"/\"))","v":"/"},null,{"$f":"A60&C60","v":"AGAC"},{"$f":"E60","v":""},{"$f":"C60&A60","v":"ACAG"},{"$f":"F60","v":""},{"$f":"B60","v":0},{"$f":"D60","v":""}]
[{"$f":"A11","v":"AF"},null,{"$f":"A13","v":"AH"},{"$f":"IF(G61=19,19,IF(ISBLANK(B61),\"\",IF(B61=19,0,36-B61)))","v":""},{"$f":"IF(G61=19,0,IF(ISBLANK(B61),\"\",IF(B61<18,1,IF(B61=18,2,IF(B61>18,3)))))","v":""},{"$f":"IF(G61=19,3,IF(ISBLANK(B61),\"\",IF(B61=19,0,IF(D61<18,1,IF(D61=18,2,IF(D61>=20,3))))))","v":""},null,null,null,null,null,{"$f":"IF(B61>D61,A61&C61,IF(D61>B61,C61&A61,\"/\"))","v":"/"},null,{"$f":"A61&C61","v":"AFAH"},{"$f":"E61","v":""},{"$f":"C61&A61","v":"AHAF"},{"$f":"F61","v":""},{"$f":"B61","v":0},{"$f":"D61","v":""}]
[]
["7 éme MATCH le","à",{"$f":"A12","v":"AG"}]
[null,null,null,null,null,null,"SI forfait éq recevante",null," "]
["Equipes","score","Equipes","score","Points","Points"]
[{"$f":"A6","v":"AA"},null,{"$f":"A12","v":"AG"},{"$f":"IF(G66=19,19,IF(ISBLANK(B66),\"\",IF(B66=19,0,36-B66)))","v":""},{"$f":"IF(G66=19,0,IF(ISBLANK(B66),\"\",IF(B66<18,1,IF(B66=18,2,IF(B66>18,3)))))","v":""},{"$f":"IF(G66=19,3,IF(ISBLANK(B66),\"\",IF(B66=19,0,IF(D66<18,1,IF(D66=18,2,IF(D66>=20,3))))))","v":""},null,null,null,null,null,{"$f":"IF(B66>D66,A66&C66,IF(D66>B66,C66&A66,\"/\"))","v":"/"},null,{"$f":"A66&C66","v":"AAAG"},{"$f":"E66","v":""},{"$f":"C66&A66","v":"AGAA"},{"$f":"F66","v":""},{"$f":"B66","v":0},{"$f":"D66","v":""}]
[{"$f":"A7","v":"AB"},null,{"$f":"A11","v":"AF"},{"$f":"IF(G67=19,19,IF(ISBLANK(B67),\"\",IF(B67=19,0,36-B67)))","v":""},{"$f":"IF(G67=19,0,IF(ISBLANK(B67),\"\",IF(B67<18,1,IF(B67=18,2,IF(B67>18,3)))))","v":""},{"$f":"IF(G67=19,3,IF(ISBLANK(B67),\"\",IF(B67=19,0,IF(D67<18,1,IF(D67=18,2,IF(D67>=20,3))))))","v":""},null,null,null,null,null,{"$f":"IF(B67>D67,A67&C67,IF(D67>B67,C67&A67,\"/\"))","v":"/"},null,{"$f":"A67&C67","v":"ABAF"},{"$f":"E67","v":""},{"$f":"C67&A67","v":"AFAB"},{"$f":"F67","v":""},{"$f":"B67","v":0},{"$f":"D67","v":""}]
[{"$f":"A10","v":"AE"},null,{"$f":"A9","v":"AD"},{"$f":"IF(G68=19,19,IF(ISBLANK(B68),\"\",IF(B68=19,0,36-B68)))","v":""},{"$f":"IF(G68=19,0,IF(ISBLANK(B68),\"\",IF(B68<18,1,IF(B68=18,2,IF(B68>18,3)))))","v":""},{"$f":"IF(G68=19,3,IF(ISBLANK(B68),\"\",IF(B68=19,0,IF(D68<18,1,IF(D68=18,2,IF(D68>=20,3))))))","v":""},null,null,null,null,null,{"$f":"IF(B68>D68,A68&C68,IF(D68>B68,C68&A68,\"/\"))","v":"/"},null,{"$f":"A68&C68","v":"AEAD"},{"$f":"E68","v":""},{"$f":"C68&A68","v":"ADAE"},{"$f":"F68","v":""},{"$f":"B68","v":0},{"$f":"D68","v":""}]
[{"$f":"A8","v":"AC"},null,{"$f":"A13","v":"AH"},{"$f":"IF(G69=19,19,IF(ISBLANK(B69),\"\",IF(B69=19,0,36-B69)))","v":""},{"$f":"IF(G69=19,0,IF(ISBLANK(B69),\"\",IF(B69<18,1,IF(B69=18,2,IF(B69>18,3)))))","v":""},{"$f":"IF(G69=19,3,IF(ISBLANK(B69),\"\",IF(B69=19,0,IF(D69<18,1,IF(D69=18,2,IF(D69>=20,3))))))","v":""},null,null,null,null,null,{"$f":"IF(B69>D69,A69&C69,IF(D69>B69,C69&A69,\"/\"))","v":"/"},null,{"$f":"A69&C69","v":"ACAH"},{"$f":"E69","v":""},{"$f":"C69&A69","v":"AHAC"},{"$f":"F69","v":""},{"$f":"B69","v":0},{"$f":"D69","v":""}]
[null,null,"CLASSEMENT",null,null,null,"Classt        Final","Rencontres entre exaequos"]
["EQUIPES",null,"POINTS","POUR","CONTRE","DIFF",null,"POINTS Exaequos","Exaq","n°",{"$f":"A6","v":"AA"},{"$f":"A7","v":"AB"},{"$f":"A8","v":"AC"},{"$f":"A9","v":"AD"},{"$f":"A10","v":"AE"},{"$f":"A11","v":"AF"},{"$f":"A12","v":"AG"},{"$f":"A13","v":"AH"},"Pts matchs",null,null,null,"1000000*Pts matchs +1000 (Diff +  abs(diff mini) )+Pour ","RANG","DIFF Exaequos","POUR Exaequos"]
[null,"1A",0,0,0,0,1,{"$f":"IF(S72>0,S72,\"\")","v":{"$error":"#N/A"}},{"$f":"COUNTIF($C$72:$C$79,C72)","v":8},{"$f":"IF(AND(I72>1,COUNTIFS(I$72:I72,I72,C$72:C72,C72)=1),MAX(J$71:J71)+1,\"\")","v":1},{"$f":"IF($A72=K$71,\"\",IF(INDEX($C$72:$C$79,MATCH(K$71,$A$72:$A$79,0))=$C72,IFERROR(VLOOKUP($A72&K$71,$N$18:$O$69,2,0),  VLOOKUP(K$71&$A72,$N$18:$Q$69,4,0)),          \"\"))","v":{"$error":"#N/A"}},{"$error":"#N/A"},{"$error":"#N/A"},{"$error":"#N/A"},{"$error":"#N/A"},{"$error":"#N/A"},{"$error":"#N/A"},{"$error":"#N/A"},{"$f":"SUM(K72:R72)","v":{"$error":"#N/A"}},null,null,null,{"$f":"IF(I72<3,S72*1000000+(F72+ABS(MIN($F$72:$F$79)))*1000+D72,S72*1000000+U96*1000+Z72)","v":{"$error":"#N/A"}},{"$f":"IF(I72>2,RANK(W72,OFFSET(W$71,MATCH(I72,$I$72:$I$79,0),,I72)))","v":{"$error":"#N/A"}},{"$f":"IF(S96=0,\"\",S96)","v":{"$error":"#N/A"}},{"$f":"IF(S80=0,\"\",S80)","v":{"$error":"#N/A"}}]
[null,"1B",0,0,0,0,2,{"$error":"#N/A"},8,{"$f":"IF(AND(I73>1,COUNTIFS(I$72:I73,I73,C$72:C73,C73)=1),MAX(J$71:J72)+1,\"\")","v":""},{"$error":"#N/A"},{"$error":"#N/A"},{"$error":"#N/A"},{"$error":"#N/A"},{"$error":"#N/A"},{"$error":"#N/A"},{"$error":"#N/A"},{"$error":"#N/A"},{"$f":"SUM(K73:R73)","v":{"$error":"#N/A"}},null,null,null,{"$f":"IF(I73<3,S73*1000000+(F73+ABS(MIN($F$72:$F$79)))*1000+D73,S73*1000000+U97*1000+Z73)","v":{"$error":"#N/A"}},{"$f":"IF(I73>2,RANK(W73,OFFSET(W$71,MATCH(I73,$I$72:$I$79,0),,I73)))","v":{"$error":"#N/A"}},{"$error":"#N/A"},{"$error":"#N/A"}]
[null,"1C",0,0,0,0,3,{"$error":"#N/A"},8,{"$f":"IF(AND(I74>1,COUNTIFS(I$72:I74,I74,C$72:C74,C74)=1),MAX(J$71:J73)+1,\"\")","v":""},{"$error":"#N/A"},{"$error":"#N/A"},{"$error":"#N/A"},{"$error":"#N/A"},{"$error":"#N/A"},{"$error":"#N/A"},{"$error":"#N/A"},{"$error":"#N/A"},{"$error":"#N/A"},null,null,null,{"$error":"#N/A"},{"$error":"#N/A"},{"$error":"#N/A"},{"$error":"#N/A"}]
[null,"1D",0,0,0,0,4,{"$error":"#N/A"},8,{"$f":"IF(AND(I75>1,COUNTIFS(I$72:I75,I75,C$72:C75,C75)=1),MAX(J$71:J74)+1,\"\")","v":""},{"$error":"#N/A"},{"$error":"#N/A"},{"$error":"#N/A"},{"$error":"#N/A"},{"$error":"#N/A"},{"$error":"#N/A"},{"$error":"#N/A"},{"$error":"#N/A"},{"$error":"#N/A"},null,null,null,{"$error":"#N/A"},{"$error":"#N/A"},{"$error":"#N/A"},{"$error":"#N/A"}]
[null,"1E",0,0,0,0,5,{"$error":"#N/A"},8,{"$f":"IF(AND(I76>1,COUNTIFS(I$72:I76,I76,C$72:C76,C76)=1),MAX(J$71:J75)+1,\"\")","v":""},{"$error":"#N/A"},{"$error":"#N/A"},{"$error":"#N/A"},{"$error":"#N/A"},{"$error":"#N/A"},{"$error":"#N/A"},{"$error":"#N/A"},{"$error":"#N/A"},{"$error":"#N/A"},null,null,null,{"$error":"#N/A"},{"$error":"#N/A"},{"$error":"#N/A"},{"$error":"#N/A"}]
[null,"1F",0,0,0,0,6,{"$error":"#N/A"},8,{"$f":"IF(AND(I77>1,COUNTIFS(I$72:I77,I77,C$72:C77,C77)=1),MAX(J$71:J76)+1,\"\")","v":""},{"$error":"#N/A"},{"$error":"#N/A"},{"$error":"#N/A"},{"$error":"#N/A"},{"$error":"#N/A"},{"$error":"#N/A"},{"$error":"#N/A"},{"$error":"#N/A"},{"$error":"#N/A"},null,null,null,{"$error":"#N/A"},{"$error":"#N/A"},{"$error":"#N/A"},{"$error":"#N/A"}]
[null,"1G",0,0,0,0,7,{"$error":"#N/A"},8,{"$f":"IF(AND(I78>1,COUNTIFS(I$72:I78,I78,C$72:C78,C78)=1),MAX(J$71:J77)+1,\"\")","v":""},{"$error":"#N/A"},{"$error":"#N/A"},{"$error":"#N/A"},{"$error":"#N/A"},{"$error":"#N/A"},{"$error":"#N/A"},{"$error":"#N/A"},{"$error":"#N/A"},{"$error":"#N/A"},null,null,null,{"$error":"#N/A"},{"$error":"#N/A"},{"$error":"#N/A"},{"$error":"#N/A"}]
[null,"1H",0,0,0,0,8,{"$error":"#N/A"},8,{"$f":"IF(AND(I79>1,COUNTIFS(I$72:I79,I79,C$72:C79,C79)=1),MAX(J$71:J78)+1,\"\")","v":""},{"$error":"#N/A"},{"$error":"#N/A"},{"$error":"#N/A"},{"$error":"#N/A"},{"$error":"#N/A"},{"$error":"#N/A"},{"$error":"#N/A"},{"$error":"#N/A"},{"$error":"#N/A"},null,null,null,{"$error":"#N/A"},{"$error":"#N/A"},{"$error":"#N/A"},{"$error":"#N/A"}]
[null,null,null,null,null,null,null,null,"POUR",{"$f":"A72","v":0},{"$f":"IF($A72=K$71,\"\",IF(INDEX($C$72:$C$79,MATCH(K$71,$A$72:$A$79,0))=$C72,IFERROR(VLOOKUP($A72&K$71,$N$18:$R$69,5,0),  VLOOKUP(K$71&$A72,$N$18:$S$69,6,0)),          \"\"))","v":{"$error":"#N/A"}},{"$error":"#N/A"},{"$error":"#N/A"},{"$error":"#N/A"},{"$error":"#N/A"},{"$error":"#N/A"},{"$error":"#N/A"},{"$error":"#N/A"},{"$error":"#N/A"}]
[null,null,null,null,null,null,null,null,null,0,{"$error":"#N/A"},{"$error":"#N/A"},{"$error":"#N/A"},{"$error":"#N/A"},{"$error":"#N/A"},{"$error":"#N/A"},{"$error":"#N/A"},{"$error":"#N/A"},{"$error":"#N/A"}]
[null,null,null,null,null,null,null,null,null,0,{"$error":"#N/A"},{"$error":"#N/A"},{"$error":"#N/A"},{"$error":"#N/A"},{"$error":"#N/A"},{"$error":"#N/A"},{"$error":"#N/A"},{"$error":"#N/A"},{"$error":"#N/A"}]
[null,null,null,null,null,null,null,null,null,0,{"$error":"#N/A"},{"$error":"#N/A"},{"$error":"#N/A"},{"$error":"#N/A"},{"$error":"#N/A"},{"$error":"#N/A"},{"$error":"#N/A"},{"$error":"#N/A"},{"$error":"#N/A"}]
[null,null,null,null,null,null,null,null,null,0,{"$error":"#N/A"},{"$error":"#N/A"},{"$error":"#N/A"},{"$error":"#N/A"},{"$error":"#N/A"},{"$error":"#N/A"},{"$error":"#N/A"},{"$error":"#N/A"},{"$error":"#N/A"},null,null,null,null,null,"  "]
[null,null,null,null,null,null,null,null,null,0,{"$error":"#N/A"},{"$error":"#N/A"},{"$error":"#N/A"},{"$error":"#N/A"},{"$error":"#N/A"},{"$error":"#N/A"},{"$error":"#N/A"},{"$error":"#N/A"},{"$error":"#N/A"}]
[null,null,null,null,null,null,null,null,null,0,{"$error":"#N/A"},{"$error":"#N/A"},{"$error":"#N/A"},{"$error":"#N/A"},{"$error":"#N/A"},{"$error":"#N/A"},{"$error":"#N/A"},{"$error":"#N/A"},{"$error":"#N/A"}]
[null,null,null,null,null,null,null,null,null,0,{"$error":"#N/A"},{"$error":"#N/A"},{"$error":"#N/A"},{"$error":"#N/A"},{"$error":"#N/A"},{"$error":"#N/A"},{"$error":"#N/A"},{"$error":"#N/A"},{"$error":"#N/A"}]
[null,null,null,null,null,null,null,null,"CONTRE",{"$f":"J80","v":0},{"$f":"INDEX($K$80:$R$87,MATCH(K$71,$J$80:$J$87,0),MATCH($J80,$K$71:$R$71,0))","v":{"$error":"#N/A"}},{"$f":"INDEX($K$80:$R$87,MATCH(L$71,$J$80:$J$87,0),MATCH($J80,$K$71:$R$71,0))","v":{"$error":"#N/A"}},{"$error":"#N/A"},{"$error":"#N/A"},{"$error":"#N/A"},{"$error":"#N/A"},{"$error":"#N/A"},{"$error":"#N/A"},{"$error":"#N/A"}]
[null,null,null,null,null,null,null,null,null,{"$f":"J81","v":0},{"$f":"INDEX($K$80:$R$87,MATCH(K$71,$J$80:$J$87,0),MATCH($J81,$K$71:$R$71,0))","v":{"$error":"#N/A"}},{"$error":"#N/A"},{"$error":"#N/A"},{"$error":"#N/A"},{"$error":"#N/A"},{"$error":"#N/A"},{"$error":"#N/A"},{"$error":"#N/A"},{"$error":"#N/A"}]
[null,null,null,null,null,null,null,null,null,0,{"$error":"#N/A"},{"$error":"#N/A"},{"$error":"#N/A"},{"$error":"#N/A"},{"$error":"#N/A"},{"$error":"#N/A"},{"$error":"#N/A"},{"$error":"#N/A"},{"$error":"#N/A"}]
[null,null,null,null,null,null,null,null,null,0,{"$error":"#N/A"},{"$error":"#N/A"},{"$error":"#N/A"},{"$error":"#N/A"},{"$error":"#N/A"},{"$error":"#N/A"},{"$error":"#N/A"},{"$error":"#N/A"},{"$error":"#N/A"}]
[null,null,null,null,null,null,null,null,null,0,{"$error":"#N/A"},{"$error":"#N/A"},{"$error":"#N/A"},{"$error":"#N/A"},{"$error":"#N/A"},{"$error":"#N/A"},{"$error":"#N/A"},{"$error":"#N/A"},{"$error":"#N/A"}]
[null,null,null,null,null,null,null,null,null,0,{"$error":"#N/A"},{"$error":"#N/A"},{"$error":"#N/A"},{"$error":"#N/A"},{"$error":"#N/A"},{"$error":"#N/A"},{"$error":"#N/A"},{"$error":"#N/A"},{"$error":"#N/A"}]
[null,null,null,null,null,null,null,null,null,0,{"$error":"#N/A"},{"$error":"#N/A"},{"$error":"#N/A"},{"$error":"#N/A"},{"$error":"#N/A"},{"$error":"#N/A"},{"$error":"#N/A"},{"$error":"#N/A"},{"$error":"#N/A"}]
[null,null,null,null,null,null,null,null,null,0,{"$error":"#N/A"},{"$error":"#N/A"},{"$error":"#N/A"},{"$error":"#N/A"},{"$error":"#N/A"},{"$error":"#N/A"},{"$error":"#N/A"},{"$error":"#N/A"},{"$error":"#N/A"},null,"Diff pondérée"]
[null,null,null,null,null,null,null,null,"DIFF",{"$f":"J88","v":0},null,null,null,null,null,null,null,null,{"$f":"S80-S88","v":{"$error":"#N/A"}},null,{"$f":"S96+ABS(MIN($S$96:$S$103))","v":{"$error":"#N/A"}}]
[null,null,null,null,null,null,null,null,null,{"$f":"J89","v":0},null,null,null,null,null,null,null,null,{"$f":"S81-S89","v":{"$error":"#N/A"}},null,{"$error":"#N/A"}]
[null,null,null,null,null,null,null,null,null,0,null,null,null,null,null,null,null,null,{"$error":"#N/A"},null,{"$error":"#N/A"}]
[null,null,null,null,null,null,null,null,null,0,null,null,null,null,null,null,null,null,{"$error":"#N/A"},null,{"$error":"#N/A"}]
[null,null,null,null,null,null,null,null,null,0,null,null,null,null,null,null,null,null,{"$error":"#N/A"},null,{"$error":"#N/A"}]
[null,null,null,null,null,null,null,null,null,0,null,null,null,null,null,null,null,null,{"$error":"#N/A"},null,{"$error":"#N/A"}]
[null,null,null,null,null,null,null,null,null,0,null,null,null,null,null,null,null,null,{"$error":"#N/A"},null,{"$f":"S102+ABS(MIN($S$96:$S$103))","v":{"$error":"#N/A"}}]
[null,null,null,null,null,null,null,null,null,0,null,null,null,null,null,null,null,null,{"$error":"#N/A"},null,{"$f":"S103+ABS(MIN($S$96:$S$103))","v":{"$error":"#N/A"}}]

{"sheet":"P5","index":4,"n_rows":103,"n_cols":26,"rows_kept":103,"cut":false,"hidden":false,"merged":[[0,0,0,5],[1,0,1,5],[2,0,2,5],[3,0,3,5],[3,8,3,10],[15,6,16,6],[69,2,69,5],[69,6,70,6],[69,7,69,25],[23,6,24,6],[31,6,32,6],[39,6,40,6],[47,6,48,6],[55,6,56,6],[63,6,64,6]]}
[null,null,null,null,null,null,3]
["CHAMPIONNAT DES CLUBS"]
[]
["POULE 5"]
["EQUIPES",null,"POINTS","Pour","Contre","Diff"]
["AA","1A",{"$f":"SUMIF($A$18:$A$69,A6,$E$18:$E$69)+SUMIF($C$18:$C$69,A6,$F$18:$F$69)","v":0},{"$f":"SUMIF($A$18:$A$69,$A6,$B$18:$B$69)+SUMIF($C$18:$C$69,$A6,$D$18:$D$69)","v":0},{"$f":"SUMIF($C$18:$C$69,$A6,$B$18:$B$69)+SUMIF($A$18:$A$69,$A6,$D$18:$D$69)","v":0},{"$f":"D6-E6","v":0}]
["AB","1B",{"$f":"SUMIF($A$18:$A$69,A7,$E$18:$E$69)+SUMIF($C$18:$C$69,A7,$F$18:$F$69)","v":0},{"$f":"SUMIF($A$18:$A$69,$A7,$B$18:$B$69)+SUMIF($C$18:$C$69,$A7,$D$18:$D$69)","v":0},{"$f":"SUMIF($C$18:$C$69,$A7,$B$18:$B$69)+SUMIF($A$18:$A$69,$A7,$D$18:$D$69)","v":0},0]
["AC","1C",{"$f":"SUMIF($A$18:$A$69,A8,$E$18:$E$69)+SUMIF($C$18:$C$69,A8,$F$18:$F$69)","v":0},0,0,0]
["AD","1D",0,0,0,0]
["AE","1E",0,0,0,0]
["AF","1F",0,0,0,0]
["AG","1G",0,0,0,{"$f":"D12-E12","v":0}]
["AH","1H",0,{"$f":"SUMIF($A$18:$A$69,$A13,$B$18:$B$69)+SUMIF($C$18:$C$69,$A13,$D$18:$D$69)","v":0},0,{"$f":"D13-E13","v":0}]
[]
["1er MATCH le ","à",{"$f":"A6","v":"AA"}]
[null,null,null,null,null,null,"SI forfait éq recevante"]
["Equipes","score","Equipes","score","Points","Points"]
[{"$f":"A6","v":"AA"},null,{"$f":"A7","v":"AB"},{"$f":"IF(G18=19,19,IF(ISBLANK(B18),\"\",IF(B18=19,0,36-B18)))","v":""},{"$f":"IF(G18=19,0,IF(ISBLANK(B18),\"\",IF(B18<18,1,IF(B18=18,2,IF(B18>18,3)))))","v":""},{"$f":"IF(G18=19,3,IF(ISBLANK(B18),\"\",IF(B18=19,0,IF(D18<18,1,IF(D18=18,2,IF(D18>=20,3))))))","v":""},null,null,null,null,null,{"$f":"IF(B18>D18,A18&C18,IF(D18>B18,C18&A18,\"/\"))","v":"/"},null,{"$f":"A18&C18","v":"AAAB"},{"$f":"E18","v":""},{"$f":"C18&A18","v":"ABAA"},{"$f":"F18","v":""},{"$f":"B18","v":0},{"$f":"D18","v":""}]
[{"$f":"A8","v":"AC"},null,{"$f":"A9","v":"AD"},{"$f":"IF(G19=19,19,IF(ISBLANK(B19),\"\",IF(B19=19,0,36-B19)))","v":""},{"$f":"IF(G19=19,0,IF(ISBLANK(B19),\"\",IF(B19<18,1,IF(B19=18,2,IF(B19>18,3)))))","v":""},{"$f":"IF(G19=19,3,IF(ISBLANK(B19),\"\",IF(B19=19,0,IF(D19<18,1,IF(D19=18,2,IF(D19>=20,3))))))","v":""},null,null,null,null,null,{"$f":"IF(B19>D19,A19&C19,IF(D19>B19,C19&A19,\"/\"))","v":"/"},null,{"$f":"A19&C19","v":"ACAD"},{"$f":"E19","v":""},{"$f":"C19&A19","v":"ADAC"},{"$f":"F19","v":""},{"$f":"B19","v":0},{"$f":"D19","v":""}]
[{"$f":"A10","v":"AE"},null,{"$f":"A11","v":"AF"},{"$f":"IF(G20=19,19,IF(ISBLANK(B20),\"\",IF(B20=19,0,36-B20)))","v":""},{"$f":"IF(G20=19,0,IF(ISBLANK(B20),\"\",IF(B20<18,1,IF(B20=18,2,IF(B20>18,3)))))","v":""},{"$f":"IF(G20=19,3,IF(ISBLANK(B20),\"\",IF(B20=19,0,IF(D20<18,1,IF(D20=18,2,IF(D20>=20,3))))))","v":""},null,null,null,null,null,{"$f":"IF(B20>D20,A20&C20,IF(D20>B20,C20&A20,\"/\"))","v":"/"},null,{"$f":"A20&C20","v":"AEAF"},{"$f":"E20","v":""},{"$f":"C20&A20","v":"AFAE"},{"$f":"F20","v":""},{"$f":"B20","v":0},{"$f":"D20","v":""}]
[{"$f":"A12","v":"AG"},null,{"$f":"A13","v":"AH"},{"$f":"IF(G21=19,19,IF(ISBLANK(B21),\"\",IF(B21=19,0,36-B21)))","v":""},{"$f":"IF(G21=19,0,IF(ISBLANK(B21),\"\",IF(B21<18,1,IF(B21=18,2,IF(B21>18,3)))))","v":""},{"$f":"IF(G21=19,3,IF(ISBLANK(B21),\"\",IF(B21=19,0,IF(D21<18,1,IF(D21=18,2,IF(D21>=20,3))))))","v":""},null,null,null,null,null,{"$f":"IF(B21>D21,A21&C21,IF(D21>B21,C21&A21,\"/\"))","v":"/"},null,{"$f":"A21&C21","v":"AGAH"},{"$f":"E21","v":""},{"$f":"C21&A21","v":"AHAG"},{"$f":"F21","v":""},{"$f":"B21","v":0},{"$f":"D21","v":""}]
[]
["2 éme MATCH le ","à",{"$f":"A7","v":"AB"}]
[null,null,null,null,null,null,"SI forfait éq recevante"]
["Equipes","score","Equipes","score","Points","Points"]
[{"$f":"A6","v":"AA"},null,{"$f":"A8","v":"AC"},{"$f":"IF(G26=19,19,IF(ISBLANK(B26),\"\",IF(B26=19,0,36-B26)))","v":""},{"$f":"IF(G26=19,0,IF(ISBLANK(B26),\"\",IF(B26<18,1,IF(B26=18,2,IF(B26>18,3)))))","v":""},{"$f":"IF(G26=19,3,IF(ISBLANK(B26),\"\",IF(B26=19,0,IF(D26<18,1,IF(D26=18,2,IF(D26>=20,3))))))","v":""},null,null,null,null,null,{"$f":"IF(B26>D26,A26&C26,IF(D26>B26,C26&A26,\"/\"))","v":"/"},null,{"$f":"A26&C26","v":"AAAC"},{"$f":"E26","v":""},{"$f":"C26&A26","v":"ACAA"},{"$f":"F26","v":""},{"$f":"B26","v":0},{"$f":"D26","v":""}]
[{"$f":"A7","v":"AB"},null,{"$f":"A13","v":"AH"},{"$f":"IF(G27=19,19,IF(ISBLANK(B27),\"\",IF(B27=19,0,36-B27)))","v":""},{"$f":"IF(G27=19,0,IF(ISBLANK(B27),\"\",IF(B27<18,1,IF(B27=18,2,IF(B27>18,3)))))","v":""},{"$f":"IF(G27=19,3,IF(ISBLANK(B27),\"\",IF(B27=19,0,IF(D27<18,1,IF(D27=18,2,IF(D27>=20,3))))))","v":""},null,null,null,null,null,{"$f":"IF(B27>D27,A27&C27,IF(D27>B27,C27&A27,\"/\"))","v":"/"},null,{"$f":"A27&C27","v":"ABAH"},{"$f":"E27","v":""},{"$f":"C27&A27","v":"AHAB"},{"$f":"F27","v":""},{"$f":"B27","v":0},{"$f":"D27","v":""}]
[{"$f":"A9","v":"AD"},null,{"$f":"A11","v":"AF"},{"$f":"IF(G28=19,19,IF(ISBLANK(B28),\"\",IF(B28=19,0,36-B28)))","v":""},{"$f":"IF(G28=19,0,IF(ISBLANK(B28),\"\",IF(B28<18,1,IF(B28=18,2,IF(B28>18,3)))))","v":""},{"$f":"IF(G28=19,3,IF(ISBLANK(B28),\"\",IF(B28=19,0,IF(D28<18,1,IF(D28=18,2,IF(D28>=20,3))))))","v":""},null,null,null,null,null,{"$f":"IF(B28>D28,A28&C28,IF(D28>B28,C28&A28,\"/\"))","v":"/"},null,{"$f":"A28&C28","v":"ADAF"},{"$f":"E28","v":""},{"$f":"C28&A28","v":"AFAD"},{"$f":"F28","v":""},{"$f":"B28","v":0},{"$f":"D28","v":""}]
[{"$f":"A10","v":"AE"},null,{"$f":"A12","v":"AG"},{"$f":"IF(G29=19,19,IF(ISBLANK(B29),\"\",IF(B29=19,0,36-B29)))","v":""},{"$f":"IF(G29=19,0,IF(ISBLANK(B29),\"\",IF(B29<18,1,IF(B29=18,2,IF(B29>18,3)))))","v":""},{"$f":"IF(G29=19,3,IF(ISBLANK(B29),\"\",IF(B29=19,0,IF(D29<18,1,IF(D29=18,2,IF(D29>=20,3))))))","v":""},null,null,null,null,null,{"$f":"IF(B29>D29,A29&C29,IF(D29>B29,C29&A29,\"/\"))","v":"/"},null,{"$f":"A29&C29","v":"AEAG"},{"$f":"E29","v":""},{"$f":"C29&A29","v":"AGAE"},{"$f":"F29","v":""},{"$f":"B29","v":0},{"$f":"D29","v":""}]
[]
["3 éme MATCH le ","à",{"$f":"A8","v":"AC"}]
[null,null,null,null,null,null,"SI forfait éq recevante"]
["Equipes","score","Equipes","score","Points","Points"]
[{"$f":"A6","v":"AA"},null,{"$f":"A13","v":"AH"},{"$f":"IF(G34=19,19,IF(ISBLANK(B34),\"\",IF(B34=19,0,36-B34)))","v":""},{"$f":"IF(G34=19,0,IF(ISBLANK(B34),\"\",IF(B34<18,1,IF(B34=18,2,IF(B34>18,3)))))","v":""},{"$f":"IF(G34=19,3,IF(ISBLANK(B34),\"\",IF(B34=19,0,IF(D34<18,1,IF(D34=18,2,IF(D34>=20,3))))))","v":""},null,null,null,null,null,{"$f":"IF(B34>D34,A34&C34,IF(D34>B34,C34&A34,\"/\"))","v":"/"},null,{"$f":"A34&C34","v":"AAAH"},{"$f":"E34","v":""},{"$f":"C34&A34","v":"AHAA"},{"$f":"F34","v":""},{"$f":"B34","v":0},{"$f":"D34","v":""}]
[{"$f":"A7","v":"AB"},null,{"$f":"A10","v":"AE"},{"$f":"IF(G35=19,19,IF(ISBLANK(B35),\"\",IF(B35=19,0,36-B35)))","v":""},{"$f":"IF(G35=19,0,IF(ISBLANK(B35),\"\",IF(B35<18,1,IF(B35=18,2,IF(B35>18,3)))))","v":""},{"$f":"IF(G35=19,3,IF(ISBLANK(B35),\"\",IF(B35=19,0,IF(D35<18,1,IF(D35=18,2,IF(D35>=20,3))))))","v":""},null,null,null,null,null,{"$f":"IF(B35>D35,A35&C35,IF(D35>B35,C35&A35,\"/\"))","v":"/"},null,{"$f":"A35&C35","v":"ABAE"},{"$f":"E35","v":""},{"$f":"C35&A35","v":"AEAB"},{"$f":"F35","v":""},{"$f":"B35","v":0},{"$f":"D35","v":""}]
[{"$f":"A8","v":"AC"},null,{"$f":"A11","v":"AF"},{"$f":"IF(G36=19,19,IF(ISBLANK(B36),\"\",IF(B36=19,0,36-B36)))","v":""},{"$f":"IF(G36=19,0,IF(ISBLANK(B36),\"\",IF(B36<18,1,IF(B36=18,2,IF(B36>18,3)))))","v":""},{"$f":"IF(G36=19,3,IF(ISBLANK(B36),\"\",IF(B36=19,0,IF(D36<18,1,IF(D36=18,2,IF(D36>=20,3))))))","v":""},null,null,null,null,null,{"$f":"IF(B36>D36,A36&C36,IF(D36>B36,C36&A36,\"/\"))","v":"/"},null,{"$f":"A36&C36","v":"ACAF"},{"$f":"E36","v":""},{"$f":"C36&A36","v":"AFAC"},{"$f":"F36","v":""},{"$f":"B36","v":0},{"$f":"D36","v":""}]
[{"$f":"A9","v":"AD"},null,{"$f":"A12","v":"AG"},{"$f":"IF(G37=19,19,IF(ISBLANK(B37),\"\",IF(B37=19,0,36-B37)))","v":""},{"$f":"IF(G37=19,0,IF(ISBLANK(B37),\"\",IF(B37<18,1,IF(B37=18,2,IF(B37>18,3)))))","v":""},{"$f":"IF(G37=19,3,IF(ISBLANK(B37),\"\",IF(B37=19,0,IF(D37<18,1,IF(D37=18,2,IF(D37>=20,3))))))","v":""},null,null,null,null,null,{"$f":"IF(B37>D37,A37&C37,IF(D37>B37,C37&A37,\"/\"))","v":"/"},null,{"$f":"A37&C37","v":"ADAG"},{"$f":"E37","v":""},{"$f":"C37&A37","v":"AGAD"},{"$f":"F37","v":""},{"$f":"B37","v":0},{"$f":"D37","v":""}]
[]
["4 éme MATCH le ","à",{"$f":"A9","v":"AD"}]
[null,null,null,null,null,null,"SI forfait éq recevante"]
["Equipes","score","Equipes","score","Points","Points"]
[{"$f":"A6","v":"AA"},null,{"$f":"A9","v":"AD"},{"$f":"IF(G42=19,19,IF(ISBLANK(B42),\"\",IF(B42=19,0,36-B42)))","v":""},{"$f":"IF(G42=19,0,IF(ISBLANK(B42),\"\",IF(B42<18,1,IF(B42=18,2,IF(B42>18,3)))))","v":""},{"$f":"IF(G42=19,3,IF(ISBLANK(B42),\"\",IF(B42=19,0,IF(D42<18,1,IF(D42=18,2,IF(D42>=20,3))))))","v":""},null,null,null,null,null,{"$f":"IF(B42>D42,A42&C42,IF(D42>B42,C42&A42,\"/\"))","v":"/"},null,{"$f":"A42&C42","v":"AAAD"},{"$f":"E42","v":""},{"$f":"C42&A42","v":"ADAA"},{"$f":"F42","v":""},{"$f":"B42","v":0},{"$f":"D42","v":""}]
[{"$f":"A11","v":"AF"},null,{"$f":"A12","v":"AG"},{"$f":"IF(G43=19,19,IF(ISBLANK(B43),\"\",IF(B43=19,0,36-B43)))","v":""},{"$f":"IF(G43=19,0,IF(ISBLANK(B43),\"\",IF(B43<18,1,IF(B43=18,2,IF(B43>18,3)))))","v":""},{"$f":"IF(G43=19,3,IF(ISBLANK(B43),\"\",IF(B43=19,0,IF(D43<18,1,IF(D43=18,2,IF(D43>=20,3))))))","v":""},null,null,null,null,null,{"$f":"IF(B43>D43,A43&C43,IF(D43>B43,C43&A43,\"/\"))","v":"/"},null,{"$f":"A43&C43","v":"AFAG"},{"$f":"E43","v":""},{"$f":"C43&A43","v":"AGAF"},{"$f":"F43","v":""},{"$f":"B43","v":0},{"$f":"D43","v":""}]
[{"$f":"A7","v":"AB"},null,{"$f":"A8","v":"AC"},{"$f":"IF(G44=19,19,IF(ISBLANK(B44),\"\",IF(B44=19,0,36-B44)))","v":""},{"$f":"IF(G44=19,0,IF(ISBLANK(B44),\"\",IF(B44<18,1,IF(B44=18,2,IF(B44>18,3)))))","v":""},{"$f":"IF(G44=19,3,IF(ISBLANK(B44),\"\",IF(B44=19,0,IF(D44<18,1,IF(D44=18,2,IF(D44>=20,3))))))","v":""},null,null,null,null,null,{"$f":"IF(B44>D44,A44&C44,IF(D44>B44,C44&A44,\"/\"))","v":"/"},null,{"$f":"A44&C44","v":"ABAC"},{"$f":"E44","v":""},{"$f":"C44&A44","v":"ACAB"},{"$f":"F44","v":""},{"$f":"B44","v":0},{"$f":"D44","v":""}]
[{"$f":"A10","v":"AE"},null,{"$f":"A13","v":"AH"},{"$f":"IF(G45=19,19,IF(ISBLANK(B45),\"\",IF(B45=19,0,36-B45)))","v":""},{"$f":"IF(G45=19,0,IF(ISBLANK(B45),\"\",IF(B45<18,1,IF(B45=18,2,IF(B45>18,3)))))","v":""},{"$f":"IF(G45=19,3,IF(ISBLANK(B45),\"\",IF(B45=19,0,IF(D45<18,1,IF(D45=18,2,IF(D45>=20,3))))))","v":""},null,null,null,null,null,{"$f":"IF(B45>D45,A45&C45,IF(D45>B45,C45&A45,\"/\"))","v":"/"},null,{"$f":"A45&C45","v":"AEAH"},{"$f":"E45","v":""},{"$f":"C45&A45","v":"AHAE"},{"$f":"F45","v":""},{"$f":"B45","v":0},{"$f":"D45","v":""}]
[]
["5 éme MATCH le ","à",{"$f":"A10","v":"AE"}]
[null,null,null,null,null,null,"SI forfait éq recevante"]
["Equipes","score","Equipes","score","Points","Points"]
[{"$f":"A6","v":"AA"},null,{"$f":"A11","v":"AF"},{"$f":"IF(G50=19,19,IF(ISBLANK(B50),\"\",IF(B50=19,0,36-B50)))","v":""},{"$f":"IF(G50=19,0,IF(ISBLANK(B50),\"\",IF(B50<18,1,IF(B50=18,2,IF(B50>18,3)))))","v":""},{"$f":"IF(G50=19,3,IF(ISBLANK(B50),\"\",IF(B50=19,0,IF(D50<18,1,IF(D50=18,2,IF(D50>=20,3))))))","v":""},null,null,null,null,null,{"$f":"IF(B50>D50,A50&C50,IF(D50>B50,C50&A50,\"/\"))","v":"/"},null,{"$f":"A50&C50","v":"AAAF"},{"$f":"E50","v":""},{"$f":"C50&A50","v":"AFAA"},{"$f":"F50","v":""},{"$f":"B50","v":0},{"$f":"D50","v":""}]
[{"$f":"A9","v":"AD"},null,{"$f":"A13","v":"AH"},{"$f":"IF(G51=19,19,IF(ISBLANK(B51),\"\",IF(B51=19,0,36-B51)))","v":""},{"$f":"IF(G51=19,0,IF(ISBLANK(B51),\"\",IF(B51<18,1,IF(B51=18,2,IF(B51>18,3)))))","v":""},{"$f":"IF(G51=19,3,IF(ISBLANK(B51),\"\",IF(B51=19,0,IF(D51<18,1,IF(D51=18,2,IF(D51>=20,3))))))","v":""},null,null,null,null,null,{"$f":"IF(B51>D51,A51&C51,IF(D51>B51,C51&A51,\"/\"))","v":"/"},null,{"$f":"A51&C51","v":"ADAH"},{"$f":"E51","v":""},{"$f":"C51&A51","v":"AHAD"},{"$f":"F51","v":""},{"$f":"B51","v":0},{"$f":"D51","v":""}]
[{"$f":"A7","v":"AB"},null,{"$f":"A12","v":"AG"},{"$f":"IF(G52=19,19,IF(ISBLANK(B52),\"\",IF(B52=19,0,36-B52)))","v":""},{"$f":"IF(G52=19,0,IF(ISBLANK(B52),\"\",IF(B52<18,1,IF(B52=18,2,IF(B52>18,3)))))","v":""},{"$f":"IF(G52=19,3,IF(ISBLANK(B52),\"\",IF(B52=19,0,IF(D52<18,1,IF(D52=18,2,IF(D52>=20,3))))))","v":""},null,null,null,null,null,{"$f":"IF(B52>D52,A52&C52,IF(D52>B52,C52&A52,\"/\"))","v":"/"},null,{"$f":"A52&C52","v":"ABAG"},{"$f":"E52","v":""},{"$f":"C52&A52","v":"AGAB"},{"$f":"F52","v":""},{"$f":"B52","v":0},{"$f":"D52","v":""}]
[{"$f":"A8","v":"AC"},null,{"$f":"A10","v":"AE"},{"$f":"IF(G53=19,19,IF(ISBLANK(B53),\"\",IF(B53=19,0,36-B53)))","v":""},{"$f":"IF(G53=19,0,IF(ISBLANK(B53),\"\",IF(B53<18,1,IF(B53=18,2,IF(B53>18,3)))))","v":""},{"$f":"IF(G53=19,3,IF(ISBLANK(B53),\"\",IF(B53=19,0,IF(D53<18,1,IF(D53=18,2,IF(D53>=20,3))))))","v":""},null,null,null,null,null,{"$f":"IF(B53>D53,A53&C53,IF(D53>B53,C53&A53,\"/\"))","v":"/"},null,{"$f":"A53&C53","v":"ACAE"},{"$f":"E53","v":""},{"$f":"C53&A53","v":"AEAC"},{"$f":"F53","v":""},{"$f":"B53","v":0},{"$f":"D53","v":""}]
[]
["6 éme MATCH le ","à",{"$f":"A11","v":"AF"}]
[null,null,null,null,null,null,"SI forfait éq recevante"]
["Equipes","score","Equipes","score","Points","Points"]
[{"$f":"A7","v":"AB"},null,{"$f":"A9","v":"AD"},{"$f":"IF(G58=19,19,IF(ISBLANK(B58),\"\",IF(B58=19,0,36-B58)))","v":""},{"$f":"IF(G58=19,0,IF(ISBLANK(B58),\"\",IF(B58<18,1,IF(B58=18,2,IF(B58>18,3)))))","v":""},{"$f":"IF(G58=19,3,IF(ISBLANK(B58),\"\",IF(B58=19,0,IF(D58<18,1,IF(D58=18,2,IF(D58>=20,3))))))","v":""},null,null,null,null,null,{"$f":"IF(B58>D58,A58&C58,IF(D58>B58,C58&A58,\"/\"))","v":"/"},null,{"$f":"A58&C58","v":"ABAD"},{"$f":"E58","v":""},{"$f":"C58&A58","v":"ADAB"},{"$f":"F58","v":""},{"$f":"B58","v":0},{"$f":"D58","v":""}]
[{"$f":"A10","v":"AE"},null,{"$f":"A6","v":"AA"},{"$f":"IF(G59=19,19,IF(ISBLANK(B59),\"\",IF(B59=19,0,36-B59)))","v":""},{"$f":"IF(G59=19,0,IF(ISBLANK(B59),\"\",IF(B59<18,1,IF(B59=18,2,IF(B59>18,3)))))","v":""},{"$f":"IF(G59=19,3,IF(ISBLANK(B59),\"\",IF(B59=19,0,IF(D59<18,1,IF(D59=18,2,IF(D59>=20,3))))))","v":""},null,null,null,null,null,{"$f":"IF(B59>D59,A59&C59,IF(D59>B59,C59&A59,\"/\"))","v":"/"},null,{"$f":"A59&C59","v":"AEAA"},{"$f":"E59","v":""},{"$f":"C59&A59","v":"AAAE"},{"$f":"F59","v":""},{"$f":"B59","v":0},{"$f":"D59","v":""}]
[{"$f":"A12","v":"AG"},null,{"$f":"A8","v":"AC"},{"$f":"IF(G60=19,19,IF(ISBLANK(B60),\"\",IF(B60=19,0,36-B60)))","v":""},{"$f":"IF(G60=19,0,IF(ISBLANK(B60),\"\",IF(B60<18,1,IF(B60=18,2,IF(B60>18,3)))))","v":""},{"$f":"IF(G60=19,3,IF(ISBLANK(B60),\"\",IF(B60=19,0,IF(D60<18,1,IF(D60=18,2,IF(D60>=20,3))))))","v":""},null,null,null,null,null,{"$f":"IF(B60>D60,A60&C60,IF(D60>B60,C60&A60,\"/\"))","v":"/"},null,{"$f":"A60&C60","v":"AGAC"},{"$f":"E60","v":""},{"$f":"C60&A60","v":"ACAG"},{"$f":"F60","v":""},{"$f":"B60","v":0},{"$f":"D60","v":""}]
[{"$f":"A11","v":"AF"},null,{"$f":"A13","v":"AH"},{"$f":"IF(G61=19,19,IF(ISBLANK(B61),\"\",IF(B61=19,0,36-B61)))","v":""},{"$f":"IF(G61=19,0,IF(ISBLANK(B61),\"\",IF(B61<18,1,IF(B61=18,2,IF(B61>18,3)))))","v":""},{"$f":"IF(G61=19,3,IF(ISBLANK(B61),\"\",IF(B61=19,0,IF(D61<18,1,IF(D61=18,2,IF(D61>=20,3))))))","v":""},null,null,null,null,null,{"$f":"IF(B61>D61,A61&C61,IF(D61>B61,C61&A61,\"/\"))","v":"/"},null,{"$f":"A61&C61","v":"AFAH"},{"$f":"E61","v":""},{"$f":"C61&A61","v":"AHAF"},{"$f":"F61","v":""},{"$f":"B61","v":0},{"$f":"D61","v":""}]
[]
["7 éme MATCH le","à",{"$f":"A12","v":"AG"}]
[null,null,null,null,null,null,"SI forfait éq recevante",null," "]
["Equipes","score","Equipes","score","Points","Points"]
[{"$f":"A6","v":"AA"},null,{"$f":"A12","v":"AG"},{"$f":"IF(G66=19,19,IF(ISBLANK(B66),\"\",IF(B66=19,0,36-B66)))","v":""},{"$f":"IF(G66=19,0,IF(ISBLANK(B66),\"\",IF(B66<18,1,IF(B66=18,2,IF(B66>18,3)))))","v":""},{"$f":"IF(G66=19,3,IF(ISBLANK(B66),\"\",IF(B66=19,0,IF(D66<18,1,IF(D66=18,2,IF(D66>=20,3))))))","v":""},null,null,null,null,null,{"$f":"IF(B66>D66,A66&C66,IF(D66>B66,C66&A66,\"/\"))","v":"/"},null,{"$f":"A66&C66","v":"AAAG"},{"$f":"E66","v":""},{"$f":"C66&A66","v":"AGAA"},{"$f":"F66","v":""},{"$f":"B66","v":0},{"$f":"D66","v":""}]
[{"$f":"A7","v":"AB"},null,{"$f":"A11","v":"AF"},{"$f":"IF(G67=19,19,IF(ISBLANK(B67),\"\",IF(B67=19,0,36-B67)))","v":""},{"$f":"IF(G67=19,0,IF(ISBLANK(B67),\"\",IF(B67<18,1,IF(B67=18,2,IF(B67>18,3)))))","v":""},{"$f":"IF(G67=19,3,IF(ISBLANK(B67),\"\",IF(B67=19,0,IF(D67<18,1,IF(D67=18,2,IF(D67>=20,3))))))","v":""},null,null,null,null,null,{"$f":"IF(B67>D67,A67&C67,IF(D67>B67,C67&A67,\"/\"))","v":"/"},null,{"$f":"A67&C67","v":"ABAF"},{"$f":"E67","v":""},{"$f":"C67&A67","v":"AFAB"},{"$f":"F67","v":""},{"$f":"B67","v":0},{"$f":"D67","v":""}]
[{"$f":"A10","v":"AE"},null,{"$f":"A9","v":"AD"},{"$f":"IF(G68=19,19,IF(ISBLANK(B68),\"\",IF(B68=19,0,36-B68)))","v":""},{"$f":"IF(G68=19,0,IF(ISBLANK(B68),\"\",IF(B68<18,1,IF(B68=18,2,IF(B68>18,3)))))","v":""},{"$f":"IF(G68=19,3,IF(ISBLANK(B68),\"\",IF(B68=19,0,IF(D68<18,1,IF(D68=18,2,IF(D68>=20,3))))))","v":""},null,null,null,null,null,{"$f":"IF(B68>D68,A68&C68,IF(D68>B68,C68&A68,\"/\"))","v":"/"},null,{"$f":"A68&C68","v":"AEAD"},{"$f":"E68","v":""},{"$f":"C68&A68","v":"ADAE"},{"$f":"F68","v":""},{"$f":"B68","v":0},{"$f":"D68","v":""}]
[{"$f":"A8","v":"AC"},null,{"$f":"A13","v":"AH"},{"$f":"IF(G69=19,19,IF(ISBLANK(B69),\"\",IF(B69=19,0,36-B69)))","v":""},{"$f":"IF(G69=19,0,IF(ISBLANK(B69),\"\",IF(B69<18,1,IF(B69=18,2,IF(B69>18,3)))))","v":""},{"$f":"IF(G69=19,3,IF(ISBLANK(B69),\"\",IF(B69=19,0,IF(D69<18,1,IF(D69=18,2,IF(D69>=20,3))))))","v":""},null,null,null,null,null,{"$f":"IF(B69>D69,A69&C69,IF(D69>B69,C69&A69,\"/\"))","v":"/"},null,{"$f":"A69&C69","v":"ACAH"},{"$f":"E69","v":""},{"$f":"C69&A69","v":"AHAC"},{"$f":"F69","v":""},{"$f":"B69","v":0},{"$f":"D69","v":""}]
[null,null,"CLASSEMENT",null,null,null,"Classt        Final","Rencontres entre exaequos"]
["EQUIPES",null,"POINTS","POUR","CONTRE","DIFF",null,"POINTS Exaequos","Exaq","n°",{"$f":"A6","v":"AA"},{"$f":"A7","v":"AB"},{"$f":"A8","v":"AC"},{"$f":"A9","v":"AD"},{"$f":"A10","v":"AE"},{"$f":"A11","v":"AF"},{"$f":"A12","v":"AG"},{"$f":"A13","v":"AH"},"Pts matchs",null,null,null,"1000000*Pts matchs +1000 (Diff +  abs(diff mini) )+Pour ","RANG","DIFF Exaequos","POUR Exaequos"]
[null,"1A",0,0,0,0,1,{"$f":"IF(S72>0,S72,\"\")","v":{"$error":"#N/A"}},{"$f":"COUNTIF($C$72:$C$79,C72)","v":8},{"$f":"IF(AND(I72>1,COUNTIFS(I$72:I72,I72,C$72:C72,C72)=1),MAX(J$71:J71)+1,\"\")","v":1},{"$f":"IF($A72=K$71,\"\",IF(INDEX($C$72:$C$79,MATCH(K$71,$A$72:$A$79,0))=$C72,IFERROR(VLOOKUP($A72&K$71,$N$18:$O$69,2,0),  VLOOKUP(K$71&$A72,$N$18:$Q$69,4,0)),          \"\"))","v":{"$error":"#N/A"}},{"$error":"#N/A"},{"$error":"#N/A"},{"$error":"#N/A"},{"$error":"#N/A"},{"$error":"#N/A"},{"$error":"#N/A"},{"$error":"#N/A"},{"$f":"SUM(K72:R72)","v":{"$error":"#N/A"}},null,null,null,{"$f":"IF(I72<3,S72*1000000+(F72+ABS(MIN($F$72:$F$79)))*1000+D72,S72*1000000+U96*1000+Z72)","v":{"$error":"#N/A"}},{"$f":"IF(I72>2,RANK(W72,OFFSET(W$71,MATCH(I72,$I$72:$I$79,0),,I72)))","v":{"$error":"#N/A"}},{"$f":"IF(S96=0,\"\",S96)","v":{"$error":"#N/A"}},{"$f":"IF(S80=0,\"\",S80)","v":{"$error":"#N/A"}}]
[null,"1B",0,0,0,0,2,{"$error":"#N/A"},8,{"$f":"IF(AND(I73>1,COUNTIFS(I$72:I73,I73,C$72:C73,C73)=1),MAX(J$71:J72)+1,\"\")","v":""},{"$error":"#N/A"},{"$error":"#N/A"},{"$error":"#N/A"},{"$error":"#N/A"},{"$error":"#N/A"},{"$error":"#N/A"},{"$error":"#N/A"},{"$error":"#N/A"},{"$f":"SUM(K73:R73)","v":{"$error":"#N/A"}},null,null,null,{"$f":"IF(I73<3,S73*1000000+(F73+ABS(MIN($F$72:$F$79)))*1000+D73,S73*1000000+U97*1000+Z73)","v":{"$error":"#N/A"}},{"$f":"IF(I73>2,RANK(W73,OFFSET(W$71,MATCH(I73,$I$72:$I$79,0),,I73)))","v":{"$error":"#N/A"}},{"$error":"#N/A"},{"$error":"#N/A"}]
[null,"1C",0,0,0,0,3,{"$error":"#N/A"},8,{"$f":"IF(AND(I74>1,COUNTIFS(I$72:I74,I74,C$72:C74,C74)=1),MAX(J$71:J73)+1,\"\")","v":""},{"$error":"#N/A"},{"$error":"#N/A"},{"$error":"#N/A"},{"$error":"#N/A"},{"$error":"#N/A"},{"$error":"#N/A"},{"$error":"#N/A"},{"$error":"#N/A"},{"$error":"#N/A"},null,null,null,{"$error":"#N/A"},{"$error":"#N/A"},{"$error":"#N/A"},{"$error":"#N/A"}]
[null,"1D",0,0,0,0,4,{"$error":"#N/A"},8,{"$f":"IF(AND(I75>1,COUNTIFS(I$72:I75,I75,C$72:C75,C75)=1),MAX(J$71:J74)+1,\"\")","v":""},{"$error":"#N/A"},{"$error":"#N/A"},{"$error":"#N/A"},{"$error":"#N/A"},{"$error":"#N/A"},{"$error":"#N/A"},{"$error":"#N/A"},{"$error":"#N/A"},{"$error":"#N/A"},null,null,null,{"$error":"#N/A"},{"$error":"#N/A"},{"$error":"#N/A"},{"$error":"#N/A"}]
[null,"1E",0,0,0,0,5,{"$error":"#N/A"},8,{"$f":"IF(AND(I76>1,COUNTIFS(I$72:I76,I76,C$72:C76,C76)=1),MAX(J$71:J75)+1,\"\")","v":""},{"$error":"#N/A"},{"$error":"#N/A"},{"$error":"#N/A"},{"$error":"#N/A"},{"$error":"#N/A"},{"$error":"#N/A"},{"$error":"#N/A"},{"$error":"#N/A"},{"$error":"#N/A"},null,null,null,{"$error":"#N/A"},{"$error":"#N/A"},{"$error":"#N/A"},{"$error":"#N/A"}]
[null,"1F",0,0,0,0,6,{"$error":"#N/A"},8,{"$f":"IF(AND(I77>1,COUNTIFS(I$72:I77,I77,C$72:C77,C77)=1),MAX(J$71:J76)+1,\"\")","v":""},{"$error":"#N/A"},{"$error":"#N/A"},{"$error":"#N/A"},{"$error":"#N/A"},{"$error":"#N/A"},{"$error":"#N/A"},{"$error":"#N/A"},{"$error":"#N/A"},{"$error":"#N/A"},null,null,null,{"$error":"#N/A"},{"$error":"#N/A"},{"$error":"#N/A"},{"$error":"#N/A"}]
[null,"1G",0,0,0,0,7,{"$error":"#N/A"},8,{"$f":"IF(AND(I78>1,COUNTIFS(I$72:I78,I78,C$72:C78,C78)=1),MAX(J$71:J77)+1,\"\")","v":""},{"$error":"#N/A"},{"$error":"#N/A"},{"$error":"#N/A"},{"$error":"#N/A"},{"$error":"#N/A"},{"$error":"#N/A"},{"$error":"#N/A"},{"$error":"#N/A"},{"$error":"#N/A"},null,null,null,{"$error":"#N/A"},{"$error":"#N/A"},{"$error":"#N/A"},{"$error":"#N/A"}]
[null,"1H",0,0,0,0,8,{"$error":"#N/A"},8,{"$f":"IF(AND(I79>1,COUNTIFS(I$72:I79,I79,C$72:C79,C79)=1),MAX(J$71:J78)+1,\"\")","v":""},{"$error":"#N/A"},{"$error":"#N/A"},{"$error":"#N/A"},{"$error":"#N/A"},{"$error":"#N/A"},{"$error":"#N/A"},{"$error":"#N/A"},{"$error":"#N/A"},{"$error":"#N/A"},null,null,null,{"$error":"#N/A"},{"$error":"#N/A"},{"$error":"#N/A"},{"$error":"#N/A"}]
[null,null,null,null,null,null,null,null,"POUR",{"$f":"A72","v":0},{"$f":"IF($A72=K$71,\"\",IF(INDEX($C$72:$C$79,MATCH(K$71,$A$72:$A$79,0))=$C72,IFERROR(VLOOKUP($A72&K$71,$N$18:$R$69,5,0),  VLOOKUP(K$71&$A72,$N$18:$S$69,6,0)),          \"\"))","v":{"$error":"#N/A"}},{"$error":"#N/A"},{"$error":"#N/A"},{"$error":"#N/A"},{"$error":"#N/A"},{"$error":"#N/A"},{"$error":"#N/A"},{"$error":"#N/A"},{"$error":"#N/A"}]
[null,null,null,null,null,null,null,null,null,0,{"$error":"#N/A"},{"$error":"#N/A"},{"$error":"#N/A"},{"$error":"#N/A"},{"$error":"#N/A"},{"$error":"#N/A"},{"$error":"#N/A"},{"$error":"#N/A"},{"$error":"#N/A"}]
[null,null,null,null,null,null,null,null,null,0,{"$error":"#N/A"},{"$error":"#N/A"},{"$error":"#N/A"},{"$error":"#N/A"},{"$error":"#N/A"},{"$error":"#N/A"},{"$error":"#N/A"},{"$error":"#N/A"},{"$error":"#N/A"}]
[null,null,null,null,null,null,null,null,null,0,{"$error":"#N/A"},{"$error":"#N/A"},{"$error":"#N/A"},{"$error":"#N/A"},{"$error":"#N/A"},{"$error":"#N/A"},{"$error":"#N/A"},{"$error":"#N/A"},{"$error":"#N/A"}]
[null,null,null,null,null,null,null,null,null,0,{"$error":"#N/A"},{"$error":"#N/A"},{"$error":"#N/A"},{"$error":"#N/A"},{"$error":"#N/A"},{"$error":"#N/A"},{"$error":"#N/A"},{"$error":"#N/A"},{"$error":"#N/A"},null,null,null,null,null,"  "]
[null,null,null,null,null,null,null,null,null,0,{"$error":"#N/A"},{"$error":"#N/A"},{"$error":"#N/A"},{"$error":"#N/A"},{"$error":"#N/A"},{"$error":"#N/A"},{"$error":"#N/A"},{"$error":"#N/A"},{"$error":"#N/A"}]
[null,null,null,null,null,null,null,null,null,0,{"$error":"#N/A"},{"$error":"#N/A"},{"$error":"#N/A"},{"$error":"#N/A"},{"$error":"#N/A"},{"$error":"#N/A"},{"$error":"#N/A"},{"$error":"#N/A"},{"$error":"#N/A"}]
[null,null,null,null,null,null,null,null,null,0,{"$error":"#N/A"},{"$error":"#N/A"},{"$error":"#N/A"},{"$error":"#N/A"},{"$error":"#N/A"},{"$error":"#N/A"},{"$error":"#N/A"},{"$error":"#N/A"},{"$error":"#N/A"}]
[null,null,null,null,null,null,null,null,"CONTRE",{"$f":"J80","v":0},{"$f":"INDEX($K$80:$R$87,MATCH(K$71,$J$80:$J$87,0),MATCH($J80,$K$71:$R$71,0))","v":{"$error":"#N/A"}},{"$f":"INDEX($K$80:$R$87,MATCH(L$71,$J$80:$J$87,0),MATCH($J80,$K$71:$R$71,0))","v":{"$error":"#N/A"}},{"$error":"#N/A"},{"$error":"#N/A"},{"$error":"#N/A"},{"$error":"#N/A"},{"$error":"#N/A"},{"$error":"#N/A"},{"$error":"#N/A"}]
[null,null,null,null,null,null,null,null,null,{"$f":"J81","v":0},{"$f":"INDEX($K$80:$R$87,MATCH(K$71,$J$80:$J$87,0),MATCH($J81,$K$71:$R$71,0))","v":{"$error":"#N/A"}},{"$error":"#N/A"},{"$error":"#N/A"},{"$error":"#N/A"},{"$error":"#N/A"},{"$error":"#N/A"},{"$error":"#N/A"},{"$error":"#N/A"},{"$error":"#N/A"}]
[null,null,null,null,null,null,null,null,null,0,{"$error":"#N/A"},{"$error":"#N/A"},{"$error":"#N/A"},{"$error":"#N/A"},{"$error":"#N/A"},{"$error":"#N/A"},{"$error":"#N/A"},{"$error":"#N/A"},{"$error":"#N/A"}]
[null,null,null,null,null,null,null,null,null,0,{"$error":"#N/A"},{"$error":"#N/A"},{"$error":"#N/A"},{"$error":"#N/A"},{"$error":"#N/A"},{"$error":"#N/A"},{"$error":"#N/A"},{"$error":"#N/A"},{"$error":"#N/A"}]
[null,null,null,null,null,null,null,null,null,0,{"$error":"#N/A"},{"$error":"#N/A"},{"$error":"#N/A"},{"$error":"#N/A"},{"$error":"#N/A"},{"$error":"#N/A"},{"$error":"#N/A"},{"$error":"#N/A"},{"$error":"#N/A"}]
[null,null,null,null,null,null,null,null,null,0,{"$error":"#N/A"},{"$error":"#N/A"},{"$error":"#N/A"},{"$error":"#N/A"},{"$error":"#N/A"},{"$error":"#N/A"},{"$error":"#N/A"},{"$error":"#N/A"},{"$error":"#N/A"}]
[null,null,null,null,null,null,null,null,null,0,{"$error":"#N/A"},{"$error":"#N/A"},{"$error":"#N/A"},{"$error":"#N/A"},{"$error":"#N/A"},{"$error":"#N/A"},{"$error":"#N/A"},{"$error":"#N/A"},{"$error":"#N/A"}]
[null,null,null,null,null,null,null,null,null,0,{"$error":"#N/A"},{"$error":"#N/A"},{"$error":"#N/A"},{"$error":"#N/A"},{"$error":"#N/A"},{"$error":"#N/A"},{"$error":"#N/A"},{"$error":"#N/A"},{"$error":"#N/A"},null,"Diff pondérée"]
[null,null,null,null,null,null,null,null,"DIFF",{"$f":"J88","v":0},null,null,null,null,null,null,null,null,{"$f":"S80-S88","v":{"$error":"#N/A"}},null,{"$f":"S96+ABS(MIN($S$96:$S$103))","v":{"$error":"#N/A"}}]
[null,null,null,null,null,null,null,null,null,{"$f":"J89","v":0},null,null,null,null,null,null,null,null,{"$f":"S81-S89","v":{"$error":"#N/A"}},null,{"$error":"#N/A"}]
[null,null,null,null,null,null,null,null,null,0,null,null,null,null,null,null,null,null,{"$error":"#N/A"},null,{"$error":"#N/A"}]
[null,null,null,null,null,null,null,null,null,0,null,null,null,null,null,null,null,null,{"$error":"#N/A"},null,{"$error":"#N/A"}]
[null,null,null,null,null,null,null,null,null,0,null,null,null,null,null,null,null,null,{"$error":"#N/A"},null,{"$error":"#N/A"}]
[null,null,null,null,null,null,null,null,null,0,null,null,null,null,null,null,null,null,{"$error":"#N/A"},null,{"$error":"#N/A"}]
[null,null,null,null,null,null,null,null,null,0,null,null,null,null,null,null,null,null,{"$error":"#N/A"},null,{"$f":"S102+ABS(MIN($S$96:$S$103))","v":{"$error":"#N/A"}}]
[null,null,null,null,null,null,null,null,null,0,null,null,null,null,null,null,null,null,{"$error":"#N/A"},null,{"$f":"S103+ABS(MIN($S$96:$S$103))","v":{"$error":"#N/A"}}]

{"sheet":"P6","index":5,"n_rows":103,"n_cols":26,"rows_kept":103,"cut":false,"hidden":false,"merged":[[0,0,0,5],[1,0,1,5],[2,0,2,5],[3,0,3,5],[3,8,3,10],[15,6,16,6],[69,2,69,5],[69,6,70,6],[69,7,69,25],[23,6,24,6],[31,6,32,6],[39,6,40,6],[47,6,48,6],[55,6,56,6],[63,6,64,6]]}
[null,null,null,null,null,null,3]
["CHAMPIONNAT DES CLUBS"]
[]
["POULE 6"]
["EQUIPES",null,"POINTS","Pour","Contre","Diff"]
["AA","1A",{"$f":"SUMIF($A$18:$A$69,A6,$E$18:$E$69)+SUMIF($C$18:$C$69,A6,$F$18:$F$69)","v":0},{"$f":"SUMIF($A$18:$A$69,$A6,$B$18:$B$69)+SUMIF($C$18:$C$69,$A6,$D$18:$D$69)","v":0},{"$f":"SUMIF($C$18:$C$69,$A6,$B$18:$B$69)+SUMIF($A$18:$A$69,$A6,$D$18:$D$69)","v":0},{"$f":"D6-E6","v":0}]
["AB","1B",{"$f":"SUMIF($A$18:$A$69,A7,$E$18:$E$69)+SUMIF($C$18:$C$69,A7,$F$18:$F$69)","v":0},{"$f":"SUMIF($A$18:$A$69,$A7,$B$18:$B$69)+SUMIF($C$18:$C$69,$A7,$D$18:$D$69)","v":0},{"$f":"SUMIF($C$18:$C$69,$A7,$B$18:$B$69)+SUMIF($A$18:$A$69,$A7,$D$18:$D$69)","v":0},0]
["AC","1C",{"$f":"SUMIF($A$18:$A$69,A8,$E$18:$E$69)+SUMIF($C$18:$C$69,A8,$F$18:$F$69)","v":0},0,0,0]
["AD","1D",0,0,0,0]
["AE","1E",0,0,0,0]
["AF","1F",0,0,0,0]
["AG","1G",0,0,0,{"$f":"D12-E12","v":0}]
["AH","1H",0,{"$f":"SUMIF($A$18:$A$69,$A13,$B$18:$B$69)+SUMIF($C$18:$C$69,$A13,$D$18:$D$69)","v":0},0,{"$f":"D13-E13","v":0}]
[]
["1er MATCH le ","à",{"$f":"A6","v":"AA"}]
[null,null,null,null,null,null,"SI forfait éq recevante"]
["Equipes","score","Equipes","score","Points","Points"]
[{"$f":"A6","v":"AA"},null,{"$f":"A7","v":"AB"},{"$f":"IF(G18=19,19,IF(ISBLANK(B18),\"\",IF(B18=19,0,36-B18)))","v":""},{"$f":"IF(G18=19,0,IF(ISBLANK(B18),\"\",IF(B18<18,1,IF(B18=18,2,IF(B18>18,3)))))","v":""},{"$f":"IF(G18=19,3,IF(ISBLANK(B18),\"\",IF(B18=19,0,IF(D18<18,1,IF(D18=18,2,IF(D18>=20,3))))))","v":""},null,null,null,null,null,{"$f":"IF(B18>D18,A18&C18,IF(D18>B18,C18&A18,\"/\"))","v":"/"},null,{"$f":"A18&C18","v":"AAAB"},{"$f":"E18","v":""},{"$f":"C18&A18","v":"ABAA"},{"$f":"F18","v":""},{"$f":"B18","v":0},{"$f":"D18","v":""}]
[{"$f":"A8","v":"AC"},null,{"$f":"A9","v":"AD"},{"$f":"IF(G19=19,19,IF(ISBLANK(B19),\"\",IF(B19=19,0,36-B19)))","v":""},{"$f":"IF(G19=19,0,IF(ISBLANK(B19),\"\",IF(B19<18,1,IF(B19=18,2,IF(B19>18,3)))))","v":""},{"$f":"IF(G19=19,3,IF(ISBLANK(B19),\"\",IF(B19=19,0,IF(D19<18,1,IF(D19=18,2,IF(D19>=20,3))))))","v":""},null,null,null,null,null,{"$f":"IF(B19>D19,A19&C19,IF(D19>B19,C19&A19,\"/\"))","v":"/"},null,{"$f":"A19&C19","v":"ACAD"},{"$f":"E19","v":""},{"$f":"C19&A19","v":"ADAC"},{"$f":"F19","v":""},{"$f":"B19","v":0},{"$f":"D19","v":""}]
[{"$f":"A10","v":"AE"},null,{"$f":"A11","v":"AF"},{"$f":"IF(G20=19,19,IF(ISBLANK(B20),\"\",IF(B20=19,0,36-B20)))","v":""},{"$f":"IF(G20=19,0,IF(ISBLANK(B20),\"\",IF(B20<18,1,IF(B20=18,2,IF(B20>18,3)))))","v":""},{"$f":"IF(G20=19,3,IF(ISBLANK(B20),\"\",IF(B20=19,0,IF(D20<18,1,IF(D20=18,2,IF(D20>=20,3))))))","v":""},null,null,null,null,null,{"$f":"IF(B20>D20,A20&C20,IF(D20>B20,C20&A20,\"/\"))","v":"/"},null,{"$f":"A20&C20","v":"AEAF"},{"$f":"E20","v":""},{"$f":"C20&A20","v":"AFAE"},{"$f":"F20","v":""},{"$f":"B20","v":0},{"$f":"D20","v":""}]
[{"$f":"A12","v":"AG"},null,{"$f":"A13","v":"AH"},{"$f":"IF(G21=19,19,IF(ISBLANK(B21),\"\",IF(B21=19,0,36-B21)))","v":""},{"$f":"IF(G21=19,0,IF(ISBLANK(B21),\"\",IF(B21<18,1,IF(B21=18,2,IF(B21>18,3)))))","v":""},{"$f":"IF(G21=19,3,IF(ISBLANK(B21),\"\",IF(B21=19,0,IF(D21<18,1,IF(D21=18,2,IF(D21>=20,3))))))","v":""},null,null,null,null,null,{"$f":"IF(B21>D21,A21&C21,IF(D21>B21,C21&A21,\"/\"))","v":"/"},null,{"$f":"A21&C21","v":"AGAH"},{"$f":"E21","v":""},{"$f":"C21&A21","v":"AHAG"},{"$f":"F21","v":""},{"$f":"B21","v":0},{"$f":"D21","v":""}]
[]
["2 éme MATCH le ","à",{"$f":"A7","v":"AB"}]
[null,null,null,null,null,null,"SI forfait éq recevante"]
["Equipes","score","Equipes","score","Points","Points"]
[{"$f":"A6","v":"AA"},null,{"$f":"A8","v":"AC"},{"$f":"IF(G26=19,19,IF(ISBLANK(B26),\"\",IF(B26=19,0,36-B26)))","v":""},{"$f":"IF(G26=19,0,IF(ISBLANK(B26),\"\",IF(B26<18,1,IF(B26=18,2,IF(B26>18,3)))))","v":""},{"$f":"IF(G26=19,3,IF(ISBLANK(B26),\"\",IF(B26=19,0,IF(D26<18,1,IF(D26=18,2,IF(D26>=20,3))))))","v":""},null,null,null,null,null,{"$f":"IF(B26>D26,A26&C26,IF(D26>B26,C26&A26,\"/\"))","v":"/"},null,{"$f":"A26&C26","v":"AAAC"},{"$f":"E26","v":""},{"$f":"C26&A26","v":"ACAA"},{"$f":"F26","v":""},{"$f":"B26","v":0},{"$f":"D26","v":""}]
[{"$f":"A7","v":"AB"},null,{"$f":"A13","v":"AH"},{"$f":"IF(G27=19,19,IF(ISBLANK(B27),\"\",IF(B27=19,0,36-B27)))","v":""},{"$f":"IF(G27=19,0,IF(ISBLANK(B27),\"\",IF(B27<18,1,IF(B27=18,2,IF(B27>18,3)))))","v":""},{"$f":"IF(G27=19,3,IF(ISBLANK(B27),\"\",IF(B27=19,0,IF(D27<18,1,IF(D27=18,2,IF(D27>=20,3))))))","v":""},null,null,null,null,null,{"$f":"IF(B27>D27,A27&C27,IF(D27>B27,C27&A27,\"/\"))","v":"/"},null,{"$f":"A27&C27","v":"ABAH"},{"$f":"E27","v":""},{"$f":"C27&A27","v":"AHAB"},{"$f":"F27","v":""},{"$f":"B27","v":0},{"$f":"D27","v":""}]
[{"$f":"A9","v":"AD"},null,{"$f":"A11","v":"AF"},{"$f":"IF(G28=19,19,IF(ISBLANK(B28),\"\",IF(B28=19,0,36-B28)))","v":""},{"$f":"IF(G28=19,0,IF(ISBLANK(B28),\"\",IF(B28<18,1,IF(B28=18,2,IF(B28>18,3)))))","v":""},{"$f":"IF(G28=19,3,IF(ISBLANK(B28),\"\",IF(B28=19,0,IF(D28<18,1,IF(D28=18,2,IF(D28>=20,3))))))","v":""},null,null,null,null,null,{"$f":"IF(B28>D28,A28&C28,IF(D28>B28,C28&A28,\"/\"))","v":"/"},null,{"$f":"A28&C28","v":"ADAF"},{"$f":"E28","v":""},{"$f":"C28&A28","v":"AFAD"},{"$f":"F28","v":""},{"$f":"B28","v":0},{"$f":"D28","v":""}]
[{"$f":"A10","v":"AE"},null,{"$f":"A12","v":"AG"},{"$f":"IF(G29=19,19,IF(ISBLANK(B29),\"\",IF(B29=19,0,36-B29)))","v":""},{"$f":"IF(G29=19,0,IF(ISBLANK(B29),\"\",IF(B29<18,1,IF(B29=18,2,IF(B29>18,3)))))","v":""},{"$f":"IF(G29=19,3,IF(ISBLANK(B29),\"\",IF(B29=19,0,IF(D29<18,1,IF(D29=18,2,IF(D29>=20,3))))))","v":""},null,null,null,null,null,{"$f":"IF(B29>D29,A29&C29,IF(D29>B29,C29&A29,\"/\"))","v":"/"},null,{"$f":"A29&C29","v":"AEAG"},{"$f":"E29","v":""},{"$f":"C29&A29","v":"AGAE"},{"$f":"F29","v":""},{"$f":"B29","v":0},{"$f":"D29","v":""}]
[]
["3 éme MATCH le ","à",{"$f":"A8","v":"AC"}]
[null,null,null,null,null,null,"SI forfait éq recevante"]
["Equipes","score","Equipes","score","Points","Points"]
[{"$f":"A6","v":"AA"},null,{"$f":"A13","v":"AH"},{"$f":"IF(G34=19,19,IF(ISBLANK(B34),\"\",IF(B34=19,0,36-B34)))","v":""},{"$f":"IF(G34=19,0,IF(ISBLANK(B34),\"\",IF(B34<18,1,IF(B34=18,2,IF(B34>18,3)))))","v":""},{"$f":"IF(G34=19,3,IF(ISBLANK(B34),\"\",IF(B34=19,0,IF(D34<18,1,IF(D34=18,2,IF(D34>=20,3))))))","v":""},null,null,null,null,null,{"$f":"IF(B34>D34,A34&C34,IF(D34>B34,C34&A34,\"/\"))","v":"/"},null,{"$f":"A34&C34","v":"AAAH"},{"$f":"E34","v":""},{"$f":"C34&A34","v":"AHAA"},{"$f":"F34","v":""},{"$f":"B34","v":0},{"$f":"D34","v":""}]
[{"$f":"A7","v":"AB"},null,{"$f":"A10","v":"AE"},{"$f":"IF(G35=19,19,IF(ISBLANK(B35),\"\",IF(B35=19,0,36-B35)))","v":""},{"$f":"IF(G35=19,0,IF(ISBLANK(B35),\"\",IF(B35<18,1,IF(B35=18,2,IF(B35>18,3)))))","v":""},{"$f":"IF(G35=19,3,IF(ISBLANK(B35),\"\",IF(B35=19,0,IF(D35<18,1,IF(D35=18,2,IF(D35>=20,3))))))","v":""},null,null,null,null,null,{"$f":"IF(B35>D35,A35&C35,IF(D35>B35,C35&A35,\"/\"))","v":"/"},null,{"$f":"A35&C35","v":"ABAE"},{"$f":"E35","v":""},{"$f":"C35&A35","v":"AEAB"},{"$f":"F35","v":""},{"$f":"B35","v":0},{"$f":"D35","v":""}]
[{"$f":"A8","v":"AC"},null,{"$f":"A11","v":"AF"},{"$f":"IF(G36=19,19,IF(ISBLANK(B36),\"\",IF(B36=19,0,36-B36)))","v":""},{"$f":"IF(G36=19,0,IF(ISBLANK(B36),\"\",IF(B36<18,1,IF(B36=18,2,IF(B36>18,3)))))","v":""},{"$f":"IF(G36=19,3,IF(ISBLANK(B36),\"\",IF(B36=19,0,IF(D36<18,1,IF(D36=18,2,IF(D36>=20,3))))))","v":""},null,null,null,null,null,{"$f":"IF(B36>D36,A36&C36,IF(D36>B36,C36&A36,\"/\"))","v":"/"},null,{"$f":"A36&C36","v":"ACAF"},{"$f":"E36","v":""},{"$f":"C36&A36","v":"AFAC"},{"$f":"F36","v":""},{"$f":"B36","v":0},{"$f":"D36","v":""}]
[{"$f":"A9","v":"AD"},null,{"$f":"A12","v":"AG"},{"$f":"IF(G37=19,19,IF(ISBLANK(B37),\"\",IF(B37=19,0,36-B37)))","v":""},{"$f":"IF(G37=19,0,IF(ISBLANK(B37),\"\",IF(B37<18,1,IF(B37=18,2,IF(B37>18,3)))))","v":""},{"$f":"IF(G37=19,3,IF(ISBLANK(B37),\"\",IF(B37=19,0,IF(D37<18,1,IF(D37=18,2,IF(D37>=20,3))))))","v":""},null,null,null,null,null,{"$f":"IF(B37>D37,A37&C37,IF(D37>B37,C37&A37,\"/\"))","v":"/"},null,{"$f":"A37&C37","v":"ADAG"},{"$f":"E37","v":""},{"$f":"C37&A37","v":"AGAD"},{"$f":"F37","v":""},{"$f":"B37","v":0},{"$f":"D37","v":""}]
[]
["4 éme MATCH le ","à",{"$f":"A9","v":"AD"}]
[null,null,null,null,null,null,"SI forfait éq recevante"]
["Equipes","score","Equipes","score","Points","Points"]
[{"$f":"A6","v":"AA"},null,{"$f":"A9","v":"AD"},{"$f":"IF(G42=19,19,IF(ISBLANK(B42),\"\",IF(B42=19,0,36-B42)))","v":""},{"$f":"IF(G42=19,0,IF(ISBLANK(B42),\"\",IF(B42<18,1,IF(B42=18,2,IF(B42>18,3)))))","v":""},{"$f":"IF(G42=19,3,IF(ISBLANK(B42),\"\",IF(B42=19,0,IF(D42<18,1,IF(D42=18,2,IF(D42>=20,3))))))","v":""},null,null,null,null,null,{"$f":"IF(B42>D42,A42&C42,IF(D42>B42,C42&A42,\"/\"))","v":"/"},null,{"$f":"A42&C42","v":"AAAD"},{"$f":"E42","v":""},{"$f":"C42&A42","v":"ADAA"},{"$f":"F42","v":""},{"$f":"B42","v":0},{"$f":"D42","v":""}]
[{"$f":"A11","v":"AF"},null,{"$f":"A12","v":"AG"},{"$f":"IF(G43=19,19,IF(ISBLANK(B43),\"\",IF(B43=19,0,36-B43)))","v":""},{"$f":"IF(G43=19,0,IF(ISBLANK(B43),\"\",IF(B43<18,1,IF(B43=18,2,IF(B43>18,3)))))","v":""},{"$f":"IF(G43=19,3,IF(ISBLANK(B43),\"\",IF(B43=19,0,IF(D43<18,1,IF(D43=18,2,IF(D43>=20,3))))))","v":""},null,null,null,null,null,{"$f":"IF(B43>D43,A43&C43,IF(D43>B43,C43&A43,\"/\"))","v":"/"},null,{"$f":"A43&C43","v":"AFAG"},{"$f":"E43","v":""},{"$f":"C43&A43","v":"AGAF"},{"$f":"F43","v":""},{"$f":"B43","v":0},{"$f":"D43","v":""}]
[{"$f":"A7","v":"AB"},null,{"$f":"A8","v":"AC"},{"$f":"IF(G44=19,19,IF(ISBLANK(B44),\"\",IF(B44=19,0,36-B44)))","v":""},{"$f":"IF(G44=19,0,IF(ISBLANK(B44),\"\",IF(B44<18,1,IF(B44=18,2,IF(B44>18,3)))))","v":""},{"$f":"IF(G44=19,3,IF(ISBLANK(B44),\"\",IF(B44=19,0,IF(D44<18,1,IF(D44=18,2,IF(D44>=20,3))))))","v":""},null,null,null,null,null,{"$f":"IF(B44>D44,A44&C44,IF(D44>B44,C44&A44,\"/\"))","v":"/"},null,{"$f":"A44&C44","v":"ABAC"},{"$f":"E44","v":""},{"$f":"C44&A44","v":"ACAB"},{"$f":"F44","v":""},{"$f":"B44","v":0},{"$f":"D44","v":""}]
[{"$f":"A10","v":"AE"},null,{"$f":"A13","v":"AH"},{"$f":"IF(G45=19,19,IF(ISBLANK(B45),\"\",IF(B45=19,0,36-B45)))","v":""},{"$f":"IF(G45=19,0,IF(ISBLANK(B45),\"\",IF(B45<18,1,IF(B45=18,2,IF(B45>18,3)))))","v":""},{"$f":"IF(G45=19,3,IF(ISBLANK(B45),\"\",IF(B45=19,0,IF(D45<18,1,IF(D45=18,2,IF(D45>=20,3))))))","v":""},null,null,null,null,null,{"$f":"IF(B45>D45,A45&C45,IF(D45>B45,C45&A45,\"/\"))","v":"/"},null,{"$f":"A45&C45","v":"AEAH"},{"$f":"E45","v":""},{"$f":"C45&A45","v":"AHAE"},{"$f":"F45","v":""},{"$f":"B45","v":0},{"$f":"D45","v":""}]
[]
["5 éme MATCH le ","à",{"$f":"A10","v":"AE"}]
[null,null,null,null,null,null,"SI forfait éq recevante"]
["Equipes","score","Equipes","score","Points","Points"]
[{"$f":"A6","v":"AA"},null,{"$f":"A11","v":"AF"},{"$f":"IF(G50=19,19,IF(ISBLANK(B50),\"\",IF(B50=19,0,36-B50)))","v":""},{"$f":"IF(G50=19,0,IF(ISBLANK(B50),\"\",IF(B50<18,1,IF(B50=18,2,IF(B50>18,3)))))","v":""},{"$f":"IF(G50=19,3,IF(ISBLANK(B50),\"\",IF(B50=19,0,IF(D50<18,1,IF(D50=18,2,IF(D50>=20,3))))))","v":""},null,null,null,null,null,{"$f":"IF(B50>D50,A50&C50,IF(D50>B50,C50&A50,\"/\"))","v":"/"},null,{"$f":"A50&C50","v":"AAAF"},{"$f":"E50","v":""},{"$f":"C50&A50","v":"AFAA"},{"$f":"F50","v":""},{"$f":"B50","v":0},{"$f":"D50","v":""}]
[{"$f":"A9","v":"AD"},null,{"$f":"A13","v":"AH"},{"$f":"IF(G51=19,19,IF(ISBLANK(B51),\"\",IF(B51=19,0,36-B51)))","v":""},{"$f":"IF(G51=19,0,IF(ISBLANK(B51),\"\",IF(B51<18,1,IF(B51=18,2,IF(B51>18,3)))))","v":""},{"$f":"IF(G51=19,3,IF(ISBLANK(B51),\"\",IF(B51=19,0,IF(D51<18,1,IF(D51=18,2,IF(D51>=20,3))))))","v":""},null,null,null,null,null,{"$f":"IF(B51>D51,A51&C51,IF(D51>B51,C51&A51,\"/\"))","v":"/"},null,{"$f":"A51&C51","v":"ADAH"},{"$f":"E51","v":""},{"$f":"C51&A51","v":"AHAD"},{"$f":"F51","v":""},{"$f":"B51","v":0},{"$f":"D51","v":""}]
[{"$f":"A7","v":"AB"},null,{"$f":"A12","v":"AG"},{"$f":"IF(G52=19,19,IF(ISBLANK(B52),\"\",IF(B52=19,0,36-B52)))","v":""},{"$f":"IF(G52=19,0,IF(ISBLANK(B52),\"\",IF(B52<18,1,IF(B52=18,2,IF(B52>18,3)))))","v":""},{"$f":"IF(G52=19,3,IF(ISBLANK(B52),\"\",IF(B52=19,0,IF(D52<18,1,IF(D52=18,2,IF(D52>=20,3))))))","v":""},null,null,null,null,null,{"$f":"IF(B52>D52,A52&C52,IF(D52>B52,C52&A52,\"/\"))","v":"/"},null,{"$f":"A52&C52","v":"ABAG"},{"$f":"E52","v":""},{"$f":"C52&A52","v":"AGAB"},{"$f":"F52","v":""},{"$f":"B52","v":0},{"$f":"D52","v":""}]
[{"$f":"A8","v":"AC"},null,{"$f":"A10","v":"AE"},{"$f":"IF(G53=19,19,IF(ISBLANK(B53),\"\",IF(B53=19,0,36-B53)))","v":""},{"$f":"IF(G53=19,0,IF(ISBLANK(B53),\"\",IF(B53<18,1,IF(B53=18,2,IF(B53>18,3)))))","v":""},{"$f":"IF(G53=19,3,IF(ISBLANK(B53),\"\",IF(B53=19,0,IF(D53<18,1,IF(D53=18,2,IF(D53>=20,3))))))","v":""},null,null,null,null,null,{"$f":"IF(B53>D53,A53&C53,IF(D53>B53,C53&A53,\"/\"))","v":"/"},null,{"$f":"A53&C53","v":"ACAE"},{"$f":"E53","v":""},{"$f":"C53&A53","v":"AEAC"},{"$f":"F53","v":""},{"$f":"B53","v":0},{"$f":"D53","v":""}]
[]
["6 éme MATCH le ","à",{"$f":"A11","v":"AF"}]
[null,null,null,null,null,null,"SI forfait éq recevante"]
["Equipes","score","Equipes","score","Points","Points"]
[{"$f":"A7","v":"AB"},null,{"$f":"A9","v":"AD"},{"$f":"IF(G58=19,19,IF(ISBLANK(B58),\"\",IF(B58=19,0,36-B58)))","v":""},{"$f":"IF(G58=19,0,IF(ISBLANK(B58),\"\",IF(B58<18,1,IF(B58=18,2,IF(B58>18,3)))))","v":""},{"$f":"IF(G58=19,3,IF(ISBLANK(B58),\"\",IF(B58=19,0,IF(D58<18,1,IF(D58=18,2,IF(D58>=20,3))))))","v":""},null,null,null,null,null,{"$f":"IF(B58>D58,A58&C58,IF(D58>B58,C58&A58,\"/\"))","v":"/"},null,{"$f":"A58&C58","v":"ABAD"},{"$f":"E58","v":""},{"$f":"C58&A58","v":"ADAB"},{"$f":"F58","v":""},{"$f":"B58","v":0},{"$f":"D58","v":""}]
[{"$f":"A10","v":"AE"},null,{"$f":"A6","v":"AA"},{"$f":"IF(G59=19,19,IF(ISBLANK(B59),\"\",IF(B59=19,0,36-B59)))","v":""},{"$f":"IF(G59=19,0,IF(ISBLANK(B59),\"\",IF(B59<18,1,IF(B59=18,2,IF(B59>18,3)))))","v":""},{"$f":"IF(G59=19,3,IF(ISBLANK(B59),\"\",IF(B59=19,0,IF(D59<18,1,IF(D59=18,2,IF(D59>=20,3))))))","v":""},null,null,null,null,null,{"$f":"IF(B59>D59,A59&C59,IF(D59>B59,C59&A59,\"/\"))","v":"/"},null,{"$f":"A59&C59","v":"AEAA"},{"$f":"E59","v":""},{"$f":"C59&A59","v":"AAAE"},{"$f":"F59","v":""},{"$f":"B59","v":0},{"$f":"D59","v":""}]
[{"$f":"A12","v":"AG"},null,{"$f":"A8","v":"AC"},{"$f":"IF(G60=19,19,IF(ISBLANK(B60),\"\",IF(B60=19,0,36-B60)))","v":""},{"$f":"IF(G60=19,0,IF(ISBLANK(B60),\"\",IF(B60<18,1,IF(B60=18,2,IF(B60>18,3)))))","v":""},{"$f":"IF(G60=19,3,IF(ISBLANK(B60),\"\",IF(B60=19,0,IF(D60<18,1,IF(D60=18,2,IF(D60>=20,3))))))","v":""},null,null,null,null,null,{"$f":"IF(B60>D60,A60&C60,IF(D60>B60,C60&A60,\"/\"))","v":"/"},null,{"$f":"A60&C60","v":"AGAC"},{"$f":"E60","v":""},{"$f":"C60&A60","v":"ACAG"},{"$f":"F60","v":""},{"$f":"B60","v":0},{"$f":"D60","v":""}]
[{"$f":"A11","v":"AF"},null,{"$f":"A13","v":"AH"},{"$f":"IF(G61=19,19,IF(ISBLANK(B61),\"\",IF(B61=19,0,36-B61)))","v":""},{"$f":"IF(G61=19,0,IF(ISBLANK(B61),\"\",IF(B61<18,1,IF(B61=18,2,IF(B61>18,3)))))","v":""},{"$f":"IF(G61=19,3,IF(ISBLANK(B61),\"\",IF(B61=19,0,IF(D61<18,1,IF(D61=18,2,IF(D61>=20,3))))))","v":""},null,null,null,null,null,{"$f":"IF(B61>D61,A61&C61,IF(D61>B61,C61&A61,\"/\"))","v":"/"},null,{"$f":"A61&C61","v":"AFAH"},{"$f":"E61","v":""},{"$f":"C61&A61","v":"AHAF"},{"$f":"F61","v":""},{"$f":"B61","v":0},{"$f":"D61","v":""}]
[]
["7 éme MATCH le","à",{"$f":"A12","v":"AG"}]
[null,null,null,null,null,null,"SI forfait éq recevante",null," "]
["Equipes","score","Equipes","score","Points","Points"]
[{"$f":"A6","v":"AA"},null,{"$f":"A12","v":"AG"},{"$f":"IF(G66=19,19,IF(ISBLANK(B66),\"\",IF(B66=19,0,36-B66)))","v":""},{"$f":"IF(G66=19,0,IF(ISBLANK(B66),\"\",IF(B66<18,1,IF(B66=18,2,IF(B66>18,3)))))","v":""},{"$f":"IF(G66=19,3,IF(ISBLANK(B66),\"\",IF(B66=19,0,IF(D66<18,1,IF(D66=18,2,IF(D66>=20,3))))))","v":""},null,null,null,null,null,{"$f":"IF(B66>D66,A66&C66,IF(D66>B66,C66&A66,\"/\"))","v":"/"},null,{"$f":"A66&C66","v":"AAAG"},{"$f":"E66","v":""},{"$f":"C66&A66","v":"AGAA"},{"$f":"F66","v":""},{"$f":"B66","v":0},{"$f":"D66","v":""}]
[{"$f":"A7","v":"AB"},null,{"$f":"A11","v":"AF"},{"$f":"IF(G67=19,19,IF(ISBLANK(B67),\"\",IF(B67=19,0,36-B67)))","v":""},{"$f":"IF(G67=19,0,IF(ISBLANK(B67),\"\",IF(B67<18,1,IF(B67=18,2,IF(B67>18,3)))))","v":""},{"$f":"IF(G67=19,3,IF(ISBLANK(B67),\"\",IF(B67=19,0,IF(D67<18,1,IF(D67=18,2,IF(D67>=20,3))))))","v":""},null,null,null,null,null,{"$f":"IF(B67>D67,A67&C67,IF(D67>B67,C67&A67,\"/\"))","v":"/"},null,{"$f":"A67&C67","v":"ABAF"},{"$f":"E67","v":""},{"$f":"C67&A67","v":"AFAB"},{"$f":"F67","v":""},{"$f":"B67","v":0},{"$f":"D67","v":""}]
[{"$f":"A10","v":"AE"},null,{"$f":"A9","v":"AD"},{"$f":"IF(G68=19,19,IF(ISBLANK(B68),\"\",IF(B68=19,0,36-B68)))","v":""},{"$f":"IF(G68=19,0,IF(ISBLANK(B68),\"\",IF(B68<18,1,IF(B68=18,2,IF(B68>18,3)))))","v":""},{"$f":"IF(G68=19,3,IF(ISBLANK(B68),\"\",IF(B68=19,0,IF(D68<18,1,IF(D68=18,2,IF(D68>=20,3))))))","v":""},null,null,null,null,null,{"$f":"IF(B68>D68,A68&C68,IF(D68>B68,C68&A68,\"/\"))","v":"/"},null,{"$f":"A68&C68","v":"AEAD"},{"$f":"E68","v":""},{"$f":"C68&A68","v":"ADAE"},{"$f":"F68","v":""},{"$f":"B68","v":0},{"$f":"D68","v":""}]
[{"$f":"A8","v":"AC"},null,{"$f":"A13","v":"AH"},{"$f":"IF(G69=19,19,IF(ISBLANK(B69),\"\",IF(B69=19,0,36-B69)))","v":""},{"$f":"IF(G69=19,0,IF(ISBLANK(B69),\"\",IF(B69<18,1,IF(B69=18,2,IF(B69>18,3)))))","v":""},{"$f":"IF(G69=19,3,IF(ISBLANK(B69),\"\",IF(B69=19,0,IF(D69<18,1,IF(D69=18,2,IF(D69>=20,3))))))","v":""},null,null,null,null,null,{"$f":"IF(B69>D69,A69&C69,IF(D69>B69,C69&A69,\"/\"))","v":"/"},null,{"$f":"A69&C69","v":"ACAH"},{"$f":"E69","v":""},{"$f":"C69&A69","v":"AHAC"},{"$f":"F69","v":""},{"$f":"B69","v":0},{"$f":"D69","v":""}]
[null,null,"CLASSEMENT",null,null,null,"Classt        Final","Rencontres entre exaequos"]
["EQUIPES",null,"POINTS","POUR","CONTRE","DIFF",null,"POINTS Exaequos","Exaq","n°",{"$f":"A6","v":"AA"},{"$f":"A7","v":"AB"},{"$f":"A8","v":"AC"},{"$f":"A9","v":"AD"},{"$f":"A10","v":"AE"},{"$f":"A11","v":"AF"},{"$f":"A12","v":"AG"},{"$f":"A13","v":"AH"},"Pts matchs",null,null,null,"1000000*Pts matchs +1000 (Diff +  abs(diff mini) )+Pour ","RANG","DIFF Exaequos","POUR Exaequos"]
[null,"1A",0,0,0,0,1,{"$f":"IF(S72>0,S72,\"\")","v":{"$error":"#N/A"}},{"$f":"COUNTIF($C$72:$C$79,C72)","v":8},{"$f":"IF(AND(I72>1,COUNTIFS(I$72:I72,I72,C$72:C72,C72)=1),MAX(J$71:J71)+1,\"\")","v":1},{"$f":"IF($A72=K$71,\"\",IF(INDEX($C$72:$C$79,MATCH(K$71,$A$72:$A$79,0))=$C72,IFERROR(VLOOKUP($A72&K$71,$N$18:$O$69,2,0),  VLOOKUP(K$71&$A72,$N$18:$Q$69,4,0)),          \"\"))","v":{"$error":"#N/A"}},{"$error":"#N/A"},{"$error":"#N/A"},{"$error":"#N/A"},{"$error":"#N/A"},{"$error":"#N/A"},{"$error":"#N/A"},{"$error":"#N/A"},{"$f":"SUM(K72:R72)","v":{"$error":"#N/A"}},null,null,null,{"$f":"IF(I72<3,S72*1000000+(F72+ABS(MIN($F$72:$F$79)))*1000+D72,S72*1000000+U96*1000+Z72)","v":{"$error":"#N/A"}},{"$f":"IF(I72>2,RANK(W72,OFFSET(W$71,MATCH(I72,$I$72:$I$79,0),,I72)))","v":{"$error":"#N/A"}},{"$f":"IF(S96=0,\"\",S96)","v":{"$error":"#N/A"}},{"$f":"IF(S80=0,\"\",S80)","v":{"$error":"#N/A"}}]
[null,"1B",0,0,0,0,2,{"$error":"#N/A"},8,{"$f":"IF(AND(I73>1,COUNTIFS(I$72:I73,I73,C$72:C73,C73)=1),MAX(J$71:J72)+1,\"\")","v":""},{"$error":"#N/A"},{"$error":"#N/A"},{"$error":"#N/A"},{"$error":"#N/A"},{"$error":"#N/A"},{"$error":"#N/A"},{"$error":"#N/A"},{"$error":"#N/A"},{"$f":"SUM(K73:R73)","v":{"$error":"#N/A"}},null,null,null,{"$f":"IF(I73<3,S73*1000000+(F73+ABS(MIN($F$72:$F$79)))*1000+D73,S73*1000000+U97*1000+Z73)","v":{"$error":"#N/A"}},{"$f":"IF(I73>2,RANK(W73,OFFSET(W$71,MATCH(I73,$I$72:$I$79,0),,I73)))","v":{"$error":"#N/A"}},{"$error":"#N/A"},{"$error":"#N/A"}]
[null,"1C",0,0,0,0,3,{"$error":"#N/A"},8,{"$f":"IF(AND(I74>1,COUNTIFS(I$72:I74,I74,C$72:C74,C74)=1),MAX(J$71:J73)+1,\"\")","v":""},{"$error":"#N/A"},{"$error":"#N/A"},{"$error":"#N/A"},{"$error":"#N/A"},{"$error":"#N/A"},{"$error":"#N/A"},{"$error":"#N/A"},{"$error":"#N/A"},{"$error":"#N/A"},null,null,null,{"$error":"#N/A"},{"$error":"#N/A"},{"$error":"#N/A"},{"$error":"#N/A"}]
[null,"1D",0,0,0,0,4,{"$error":"#N/A"},8,{"$f":"IF(AND(I75>1,COUNTIFS(I$72:I75,I75,C$72:C75,C75)=1),MAX(J$71:J74)+1,\"\")","v":""},{"$error":"#N/A"},{"$error":"#N/A"},{"$error":"#N/A"},{"$error":"#N/A"},{"$error":"#N/A"},{"$error":"#N/A"},{"$error":"#N/A"},{"$error":"#N/A"},{"$error":"#N/A"},null,null,null,{"$error":"#N/A"},{"$error":"#N/A"},{"$error":"#N/A"},{"$error":"#N/A"}]
[null,"1E",0,0,0,0,5,{"$error":"#N/A"},8,{"$f":"IF(AND(I76>1,COUNTIFS(I$72:I76,I76,C$72:C76,C76)=1),MAX(J$71:J75)+1,\"\")","v":""},{"$error":"#N/A"},{"$error":"#N/A"},{"$error":"#N/A"},{"$error":"#N/A"},{"$error":"#N/A"},{"$error":"#N/A"},{"$error":"#N/A"},{"$error":"#N/A"},{"$error":"#N/A"},null,null,null,{"$error":"#N/A"},{"$error":"#N/A"},{"$error":"#N/A"},{"$error":"#N/A"}]
[null,"1F",0,0,0,0,6,{"$error":"#N/A"},8,{"$f":"IF(AND(I77>1,COUNTIFS(I$72:I77,I77,C$72:C77,C77)=1),MAX(J$71:J76)+1,\"\")","v":""},{"$error":"#N/A"},{"$error":"#N/A"},{"$error":"#N/A"},{"$error":"#N/A"},{"$error":"#N/A"},{"$error":"#N/A"},{"$error":"#N/A"},{"$error":"#N/A"},{"$error":"#N/A"},null,null,null,{"$error":"#N/A"},{"$error":"#N/A"},{"$error":"#N/A"},{"$error":"#N/A"}]
[null,"1G",0,0,0,0,7,{"$error":"#N/A"},8,{"$f":"IF(AND(I78>1,COUNTIFS(I$72:I78,I78,C$72:C78,C78)=1),MAX(J$71:J77)+1,\"\")","v":""},{"$error":"#N/A"},{"$error":"#N/A"},{"$error":"#N/A"},{"$error":"#N/A"},{"$error":"#N/A"},{"$error":"#N/A"},{"$error":"#N/A"},{"$error":"#N/A"},{"$error":"#N/A"},null,null,null,{"$error":"#N/A"},{"$error":"#N/A"},{"$error":"#N/A"},{"$error":"#N/A"}]
[null,"1H",0,0,0,0,8,{"$error":"#N/A"},8,{"$f":"IF(AND(I79>1,COUNTIFS(I$72:I79,I79,C$72:C79,C79)=1),MAX(J$71:J78)+1,\"\")","v":""},{"$error":"#N/A"},{"$error":"#N/A"},{"$error":"#N/A"},{"$error":"#N/A"},{"$error":"#N/A"},{"$error":"#N/A"},{"$error":"#N/A"},{"$error":"#N/A"},{"$error":"#N/A"},null,null,null,{"$error":"#N/A"},{"$error":"#N/A"},{"$error":"#N/A"},{"$error":"#N/A"}]
[null,null,null,null,null,null,null,null,"POUR",{"$f":"A72","v":0},{"$f":"IF($A72=K$71,\"\",IF(INDEX($C$72:$C$79,MATCH(K$71,$A$72:$A$79,0))=$C72,IFERROR(VLOOKUP($A72&K$71,$N$18:$R$69,5,0),  VLOOKUP(K$71&$A72,$N$18:$S$69,6,0)),          \"\"))","v":{"$error":"#N/A"}},{"$error":"#N/A"},{"$error":"#N/A"},{"$error":"#N/A"},{"$error":"#N/A"},{"$error":"#N/A"},{"$error":"#N/A"},{"$error":"#N/A"},{"$error":"#N/A"}]
[null,null,null,null,null,null,null,null,null,0,{"$error":"#N/A"},{"$error":"#N/A"},{"$error":"#N/A"},{"$error":"#N/A"},{"$error":"#N/A"},{"$error":"#N/A"},{"$error":"#N/A"},{"$error":"#N/A"},{"$error":"#N/A"}]
[null,null,null,null,null,null,null,null,null,0,{"$error":"#N/A"},{"$error":"#N/A"},{"$error":"#N/A"},{"$error":"#N/A"},{"$error":"#N/A"},{"$error":"#N/A"},{"$error":"#N/A"},{"$error":"#N/A"},{"$error":"#N/A"}]
[null,null,null,null,null,null,null,null,null,0,{"$error":"#N/A"},{"$error":"#N/A"},{"$error":"#N/A"},{"$error":"#N/A"},{"$error":"#N/A"},{"$error":"#N/A"},{"$error":"#N/A"},{"$error":"#N/A"},{"$error":"#N/A"}]
[null,null,null,null,null,null,null,null,null,0,{"$error":"#N/A"},{"$error":"#N/A"},{"$error":"#N/A"},{"$error":"#N/A"},{"$error":"#N/A"},{"$error":"#N/A"},{"$error":"#N/A"},{"$error":"#N/A"},{"$error":"#N/A"},null,null,null,null,null,"  "]
[null,null,null,null,null,null,null,null,null,0,{"$error":"#N/A"},{"$error":"#N/A"},{"$error":"#N/A"},{"$error":"#N/A"},{"$error":"#N/A"},{"$error":"#N/A"},{"$error":"#N/A"},{"$error":"#N/A"},{"$error":"#N/A"}]
[null,null,null,null,null,null,null,null,null,0,{"$error":"#N/A"},{"$error":"#N/A"},{"$error":"#N/A"},{"$error":"#N/A"},{"$error":"#N/A"},{"$error":"#N/A"},{"$error":"#N/A"},{"$error":"#N/A"},{"$error":"#N/A"}]
[null,null,null,null,null,null,null,null,null,0,{"$error":"#N/A"},{"$error":"#N/A"},{"$error":"#N/A"},{"$error":"#N/A"},{"$error":"#N/A"},{"$error":"#N/A"},{"$error":"#N/A"},{"$error":"#N/A"},{"$error":"#N/A"}]
[null,null,null,null,null,null,null,null,"CONTRE",{"$f":"J80","v":0},{"$f":"INDEX($K$80:$R$87,MATCH(K$71,$J$80:$J$87,0),MATCH($J80,$K$71:$R$71,0))","v":{"$error":"#N/A"}},{"$f":"INDEX($K$80:$R$87,MATCH(L$71,$J$80:$J$87,0),MATCH($J80,$K$71:$R$71,0))","v":{"$error":"#N/A"}},{"$error":"#N/A"},{"$error":"#N/A"},{"$error":"#N/A"},{"$error":"#N/A"},{"$error":"#N/A"},{"$error":"#N/A"},{"$error":"#N/A"}]
[null,null,null,null,null,null,null,null,null,{"$f":"J81","v":0},{"$f":"INDEX($K$80:$R$87,MATCH(K$71,$J$80:$J$87,0),MATCH($J81,$K$71:$R$71,0))","v":{"$error":"#N/A"}},{"$error":"#N/A"},{"$error":"#N/A"},{"$error":"#N/A"},{"$error":"#N/A"},{"$error":"#N/A"},{"$error":"#N/A"},{"$error":"#N/A"},{"$error":"#N/A"}]
[null,null,null,null,null,null,null,null,null,0,{"$error":"#N/A"},{"$error":"#N/A"},{"$error":"#N/A"},{"$error":"#N/A"},{"$error":"#N/A"},{"$error":"#N/A"},{"$error":"#N/A"},{"$error":"#N/A"},{"$error":"#N/A"}]
[null,null,null,null,null,null,null,null,null,0,{"$error":"#N/A"},{"$error":"#N/A"},{"$error":"#N/A"},{"$error":"#N/A"},{"$error":"#N/A"},{"$error":"#N/A"},{"$error":"#N/A"},{"$error":"#N/A"},{"$error":"#N/A"}]
[null,null,null,null,null,null,null,null,null,0,{"$error":"#N/A"},{"$error":"#N/A"},{"$error":"#N/A"},{"$error":"#N/A"},{"$error":"#N/A"},{"$error":"#N/A"},{"$error":"#N/A"},{"$error":"#N/A"},{"$error":"#N/A"}]
[null,null,null,null,null,null,null,null,null,0,{"$error":"#N/A"},{"$error":"#N/A"},{"$error":"#N/A"},{"$error":"#N/A"},{"$error":"#N/A"},{"$error":"#N/A"},{"$error":"#N/A"},{"$error":"#N/A"},{"$error":"#N/A"}]
[null,null,null,null,null,null,null,null,null,0,{"$error":"#N/A"},{"$error":"#N/A"},{"$error":"#N/A"},{"$error":"#N/A"},{"$error":"#N/A"},{"$error":"#N/A"},{"$error":"#N/A"},{"$error":"#N/A"},{"$error":"#N/A"}]
[null,null,null,null,null,null,null,null,null,0,{"$error":"#N/A"},{"$error":"#N/A"},{"$error":"#N/A"},{"$error":"#N/A"},{"$error":"#N/A"},{"$error":"#N/A"},{"$error":"#N/A"},{"$error":"#N/A"},{"$error":"#N/A"},null,"Diff pondérée"]
[null,null,null,null,null,null,null,null,"DIFF",{"$f":"J88","v":0},null,null,null,null,null,null,null,null,{"$f":"S80-S88","v":{"$error":"#N/A"}},null,{"$f":"S96+ABS(MIN($S$96:$S$103))","v":{"$error":"#N/A"}}]
[null,null,null,null,null,null,null,null,null,{"$f":"J89","v":0},null,null,null,null,null,null,null,null,{"$f":"S81-S89","v":{"$error":"#N/A"}},null,{"$error":"#N/A"}]
[null,null,null,null,null,null,null,null,null,0,null,null,null,null,null,null,null,null,{"$error":"#N/A"},null,{"$error":"#N/A"}]
[null,null,null,null,null,null,null,null,null,0,null,null,null,null,null,null,null,null,{"$error":"#N/A"},null,{"$error":"#N/A"}]
[null,null,null,null,null,null,null,null,null,0,null,null,null,null,null,null,null,null,{"$error":"#N/A"},null,{"$error":"#N/A"}]
[null,null,null,null,null,null,null,null,null,0,null,null,null,null,null,null,null,null,{"$error":"#N/A"},null,{"$error":"#N/A"}]
[null,null,null,null,null,null,null,null,null,0,null,null,null,null,null,null,null,null,{"$error":"#N/A"},null,{"$f":"S102+ABS(MIN($S$96:$S$103))","v":{"$error":"#N/A"}}]
[null,null,null,null,null,null,null,null,null,0,null,null,null,null,null,null,null,null,{"$error":"#N/A"},null,{"$f":"S103+ABS(MIN($S$96:$S$103))","v":{"$error":"#N/A"}}]

{"sheet":"P7","index":6,"n_rows":103,"n_cols":26,"rows_kept":103,"cut":false,"hidden":false,"merged":[[0,0,0,5],[1,0,1,5],[2,0,2,5],[3,0,3,5],[3,8,3,10],[15,6,16,6],[69,2,69,5],[69,6,70,6],[69,7,69,25],[23,6,24,6],[31,6,32,6],[39,6,40,6],[47,6,48,6],[55,6,56,6],[63,6,64,6]]}
[null,null,null,null,null,null,3]
["CHAMPIONNAT DES CLUBS"]
[]
["POULE 7"]
["EQUIPES",null,"POINTS","Pour","Contre","Diff"]
["AA","1A",{"$f":"SUMIF($A$18:$A$69,A6,$E$18:$E$69)+SUMIF($C$18:$C$69,A6,$F$18:$F$69)","v":0},{"$f":"SUMIF($A$18:$A$69,$A6,$B$18:$B$69)+SUMIF($C$18:$C$69,$A6,$D$18:$D$69)","v":0},{"$f":"SUMIF($C$18:$C$69,$A6,$B$18:$B$69)+SUMIF($A$18:$A$69,$A6,$D$18:$D$69)","v":0},{"$f":"D6-E6","v":0}]
["AB","1B",{"$f":"SUMIF($A$18:$A$69,A7,$E$18:$E$69)+SUMIF($C$18:$C$69,A7,$F$18:$F$69)","v":0},{"$f":"SUMIF($A$18:$A$69,$A7,$B$18:$B$69)+SUMIF($C$18:$C$69,$A7,$D$18:$D$69)","v":0},{"$f":"SUMIF($C$18:$C$69,$A7,$B$18:$B$69)+SUMIF($A$18:$A$69,$A7,$D$18:$D$69)","v":0},0]
["AC","1C",{"$f":"SUMIF($A$18:$A$69,A8,$E$18:$E$69)+SUMIF($C$18:$C$69,A8,$F$18:$F$69)","v":0},0,0,0]
["AD","1D",0,0,0,0]
["AE","1E",0,0,0,0]
["AF","1F",0,0,0,0]
["AG","1G",0,0,0,{"$f":"D12-E12","v":0}]
["AH","1H",0,{"$f":"SUMIF($A$18:$A$69,$A13,$B$18:$B$69)+SUMIF($C$18:$C$69,$A13,$D$18:$D$69)","v":0},0,{"$f":"D13-E13","v":0}]
[]
["1er MATCH le ","à",{"$f":"A6","v":"AA"}]
[null,null,null,null,null,null,"SI forfait éq recevante"]
["Equipes","score","Equipes","score","Points","Points"]
[{"$f":"A6","v":"AA"},null,{"$f":"A7","v":"AB"},{"$f":"IF(G18=19,19,IF(ISBLANK(B18),\"\",IF(B18=19,0,36-B18)))","v":""},{"$f":"IF(G18=19,0,IF(ISBLANK(B18),\"\",IF(B18<18,1,IF(B18=18,2,IF(B18>18,3)))))","v":""},{"$f":"IF(G18=19,3,IF(ISBLANK(B18),\"\",IF(B18=19,0,IF(D18<18,1,IF(D18=18,2,IF(D18>=20,3))))))","v":""},null,null,null,null,null,{"$f":"IF(B18>D18,A18&C18,IF(D18>B18,C18&A18,\"/\"))","v":"/"},null,{"$f":"A18&C18","v":"AAAB"},{"$f":"E18","v":""},{"$f":"C18&A18","v":"ABAA"},{"$f":"F18","v":""},{"$f":"B18","v":0},{"$f":"D18","v":""}]
[{"$f":"A8","v":"AC"},null,{"$f":"A9","v":"AD"},{"$f":"IF(G19=19,19,IF(ISBLANK(B19),\"\",IF(B19=19,0,36-B19)))","v":""},{"$f":"IF(G19=19,0,IF(ISBLANK(B19),\"\",IF(B19<18,1,IF(B19=18,2,IF(B19>18,3)))))","v":""},{"$f":"IF(G19=19,3,IF(ISBLANK(B19),\"\",IF(B19=19,0,IF(D19<18,1,IF(D19=18,2,IF(D19>=20,3))))))","v":""},null,null,null,null,null,{"$f":"IF(B19>D19,A19&C19,IF(D19>B19,C19&A19,\"/\"))","v":"/"},null,{"$f":"A19&C19","v":"ACAD"},{"$f":"E19","v":""},{"$f":"C19&A19","v":"ADAC"},{"$f":"F19","v":""},{"$f":"B19","v":0},{"$f":"D19","v":""}]
[{"$f":"A10","v":"AE"},null,{"$f":"A11","v":"AF"},{"$f":"IF(G20=19,19,IF(ISBLANK(B20),\"\",IF(B20=19,0,36-B20)))","v":""},{"$f":"IF(G20=19,0,IF(ISBLANK(B20),\"\",IF(B20<18,1,IF(B20=18,2,IF(B20>18,3)))))","v":""},{"$f":"IF(G20=19,3,IF(ISBLANK(B20),\"\",IF(B20=19,0,IF(D20<18,1,IF(D20=18,2,IF(D20>=20,3))))))","v":""},null,null,null,null,null,{"$f":"IF(B20>D20,A20&C20,IF(D20>B20,C20&A20,\"/\"))","v":"/"},null,{"$f":"A20&C20","v":"AEAF"},{"$f":"E20","v":""},{"$f":"C20&A20","v":"AFAE"},{"$f":"F20","v":""},{"$f":"B20","v":0},{"$f":"D20","v":""}]
[{"$f":"A12","v":"AG"},null,{"$f":"A13","v":"AH"},{"$f":"IF(G21=19,19,IF(ISBLANK(B21),\"\",IF(B21=19,0,36-B21)))","v":""},{"$f":"IF(G21=19,0,IF(ISBLANK(B21),\"\",IF(B21<18,1,IF(B21=18,2,IF(B21>18,3)))))","v":""},{"$f":"IF(G21=19,3,IF(ISBLANK(B21),\"\",IF(B21=19,0,IF(D21<18,1,IF(D21=18,2,IF(D21>=20,3))))))","v":""},null,null,null,null,null,{"$f":"IF(B21>D21,A21&C21,IF(D21>B21,C21&A21,\"/\"))","v":"/"},null,{"$f":"A21&C21","v":"AGAH"},{"$f":"E21","v":""},{"$f":"C21&A21","v":"AHAG"},{"$f":"F21","v":""},{"$f":"B21","v":0},{"$f":"D21","v":""}]
[]
["2 éme MATCH le ","à",{"$f":"A7","v":"AB"}]
[null,null,null,null,null,null,"SI forfait éq recevante"]
["Equipes","score","Equipes","score","Points","Points"]
[{"$f":"A6","v":"AA"},null,{"$f":"A8","v":"AC"},{"$f":"IF(G26=19,19,IF(ISBLANK(B26),\"\",IF(B26=19,0,36-B26)))","v":""},{"$f":"IF(G26=19,0,IF(ISBLANK(B26),\"\",IF(B26<18,1,IF(B26=18,2,IF(B26>18,3)))))","v":""},{"$f":"IF(G26=19,3,IF(ISBLANK(B26),\"\",IF(B26=19,0,IF(D26<18,1,IF(D26=18,2,IF(D26>=20,3))))))","v":""},null,null,null,null,null,{"$f":"IF(B26>D26,A26&C26,IF(D26>B26,C26&A26,\"/\"))","v":"/"},null,{"$f":"A26&C26","v":"AAAC"},{"$f":"E26","v":""},{"$f":"C26&A26","v":"ACAA"},{"$f":"F26","v":""},{"$f":"B26","v":0},{"$f":"D26","v":""}]
[{"$f":"A7","v":"AB"},null,{"$f":"A13","v":"AH"},{"$f":"IF(G27=19,19,IF(ISBLANK(B27),\"\",IF(B27=19,0,36-B27)))","v":""},{"$f":"IF(G27=19,0,IF(ISBLANK(B27),\"\",IF(B27<18,1,IF(B27=18,2,IF(B27>18,3)))))","v":""},{"$f":"IF(G27=19,3,IF(ISBLANK(B27),\"\",IF(B27=19,0,IF(D27<18,1,IF(D27=18,2,IF(D27>=20,3))))))","v":""},null,null,null,null,null,{"$f":"IF(B27>D27,A27&C27,IF(D27>B27,C27&A27,\"/\"))","v":"/"},null,{"$f":"A27&C27","v":"ABAH"},{"$f":"E27","v":""},{"$f":"C27&A27","v":"AHAB"},{"$f":"F27","v":""},{"$f":"B27","v":0},{"$f":"D27","v":""}]
[{"$f":"A9","v":"AD"},null,{"$f":"A11","v":"AF"},{"$f":"IF(G28=19,19,IF(ISBLANK(B28),\"\",IF(B28=19,0,36-B28)))","v":""},{"$f":"IF(G28=19,0,IF(ISBLANK(B28),\"\",IF(B28<18,1,IF(B28=18,2,IF(B28>18,3)))))","v":""},{"$f":"IF(G28=19,3,IF(ISBLANK(B28),\"\",IF(B28=19,0,IF(D28<18,1,IF(D28=18,2,IF(D28>=20,3))))))","v":""},null,null,null,null,null,{"$f":"IF(B28>D28,A28&C28,IF(D28>B28,C28&A28,\"/\"))","v":"/"},null,{"$f":"A28&C28","v":"ADAF"},{"$f":"E28","v":""},{"$f":"C28&A28","v":"AFAD"},{"$f":"F28","v":""},{"$f":"B28","v":0},{"$f":"D28","v":""}]
[{"$f":"A10","v":"AE"},null,{"$f":"A12","v":"AG"},{"$f":"IF(G29=19,19,IF(ISBLANK(B29),\"\",IF(B29=19,0,36-B29)))","v":""},{"$f":"IF(G29=19,0,IF(ISBLANK(B29),\"\",IF(B29<18,1,IF(B29=18,2,IF(B29>18,3)))))","v":""},{"$f":"IF(G29=19,3,IF(ISBLANK(B29),\"\",IF(B29=19,0,IF(D29<18,1,IF(D29=18,2,IF(D29>=20,3))))))","v":""},null,null,null,null,null,{"$f":"IF(B29>D29,A29&C29,IF(D29>B29,C29&A29,\"/\"))","v":"/"},null,{"$f":"A29&C29","v":"AEAG"},{"$f":"E29","v":""},{"$f":"C29&A29","v":"AGAE"},{"$f":"F29","v":""},{"$f":"B29","v":0},{"$f":"D29","v":""}]
[]
["3 éme MATCH le ","à",{"$f":"A8","v":"AC"}]
[null,null,null,null,null,null,"SI forfait éq recevante"]
["Equipes","score","Equipes","score","Points","Points"]
[{"$f":"A6","v":"AA"},null,{"$f":"A13","v":"AH"},{"$f":"IF(G34=19,19,IF(ISBLANK(B34),\"\",IF(B34=19,0,36-B34)))","v":""},{"$f":"IF(G34=19,0,IF(ISBLANK(B34),\"\",IF(B34<18,1,IF(B34=18,2,IF(B34>18,3)))))","v":""},{"$f":"IF(G34=19,3,IF(ISBLANK(B34),\"\",IF(B34=19,0,IF(D34<18,1,IF(D34=18,2,IF(D34>=20,3))))))","v":""},null,null,null,null,null,{"$f":"IF(B34>D34,A34&C34,IF(D34>B34,C34&A34,\"/\"))","v":"/"},null,{"$f":"A34&C34","v":"AAAH"},{"$f":"E34","v":""},{"$f":"C34&A34","v":"AHAA"},{"$f":"F34","v":""},{"$f":"B34","v":0},{"$f":"D34","v":""}]
[{"$f":"A7","v":"AB"},null,{"$f":"A10","v":"AE"},{"$f":"IF(G35=19,19,IF(ISBLANK(B35),\"\",IF(B35=19,0,36-B35)))","v":""},{"$f":"IF(G35=19,0,IF(ISBLANK(B35),\"\",IF(B35<18,1,IF(B35=18,2,IF(B35>18,3)))))","v":""},{"$f":"IF(G35=19,3,IF(ISBLANK(B35),\"\",IF(B35=19,0,IF(D35<18,1,IF(D35=18,2,IF(D35>=20,3))))))","v":""},null,null,null,null,null,{"$f":"IF(B35>D35,A35&C35,IF(D35>B35,C35&A35,\"/\"))","v":"/"},null,{"$f":"A35&C35","v":"ABAE"},{"$f":"E35","v":""},{"$f":"C35&A35","v":"AEAB"},{"$f":"F35","v":""},{"$f":"B35","v":0},{"$f":"D35","v":""}]
[{"$f":"A8","v":"AC"},null,{"$f":"A11","v":"AF"},{"$f":"IF(G36=19,19,IF(ISBLANK(B36),\"\",IF(B36=19,0,36-B36)))","v":""},{"$f":"IF(G36=19,0,IF(ISBLANK(B36),\"\",IF(B36<18,1,IF(B36=18,2,IF(B36>18,3)))))","v":""},{"$f":"IF(G36=19,3,IF(ISBLANK(B36),\"\",IF(B36=19,0,IF(D36<18,1,IF(D36=18,2,IF(D36>=20,3))))))","v":""},null,null,null,null,null,{"$f":"IF(B36>D36,A36&C36,IF(D36>B36,C36&A36,\"/\"))","v":"/"},null,{"$f":"A36&C36","v":"ACAF"},{"$f":"E36","v":""},{"$f":"C36&A36","v":"AFAC"},{"$f":"F36","v":""},{"$f":"B36","v":0},{"$f":"D36","v":""}]
[{"$f":"A9","v":"AD"},null,{"$f":"A12","v":"AG"},{"$f":"IF(G37=19,19,IF(ISBLANK(B37),\"\",IF(B37=19,0,36-B37)))","v":""},{"$f":"IF(G37=19,0,IF(ISBLANK(B37),\"\",IF(B37<18,1,IF(B37=18,2,IF(B37>18,3)))))","v":""},{"$f":"IF(G37=19,3,IF(ISBLANK(B37),\"\",IF(B37=19,0,IF(D37<18,1,IF(D37=18,2,IF(D37>=20,3))))))","v":""},null,null,null,null,null,{"$f":"IF(B37>D37,A37&C37,IF(D37>B37,C37&A37,\"/\"))","v":"/"},null,{"$f":"A37&C37","v":"ADAG"},{"$f":"E37","v":""},{"$f":"C37&A37","v":"AGAD"},{"$f":"F37","v":""},{"$f":"B37","v":0},{"$f":"D37","v":""}]
[]
["4 éme MATCH le ","à",{"$f":"A9","v":"AD"}]
[null,null,null,null,null,null,"SI forfait éq recevante"]
["Equipes","score","Equipes","score","Points","Points"]
[{"$f":"A6","v":"AA"},null,{"$f":"A9","v":"AD"},{"$f":"IF(G42=19,19,IF(ISBLANK(B42),\"\",IF(B42=19,0,36-B42)))","v":""},{"$f":"IF(G42=19,0,IF(ISBLANK(B42),\"\",IF(B42<18,1,IF(B42=18,2,IF(B42>18,3)))))","v":""},{"$f":"IF(G42=19,3,IF(ISBLANK(B42),\"\",IF(B42=19,0,IF(D42<18,1,IF(D42=18,2,IF(D42>=20,3))))))","v":""},null,null,null,null,null,{"$f":"IF(B42>D42,A42&C42,IF(D42>B42,C42&A42,\"/\"))","v":"/"},null,{"$f":"A42&C42","v":"AAAD"},{"$f":"E42","v":""},{"$f":"C42&A42","v":"ADAA"},{"$f":"F42","v":""},{"$f":"B42","v":0},{"$f":"D42","v":""}]
[{"$f":"A11","v":"AF"},null,{"$f":"A12","v":"AG"},{"$f":"IF(G43=19,19,IF(ISBLANK(B43),\"\",IF(B43=19,0,36-B43)))","v":""},{"$f":"IF(G43=19,0,IF(ISBLANK(B43),\"\",IF(B43<18,1,IF(B43=18,2,IF(B43>18,3)))))","v":""},{"$f":"IF(G43=19,3,IF(ISBLANK(B43),\"\",IF(B43=19,0,IF(D43<18,1,IF(D43=18,2,IF(D43>=20,3))))))","v":""},null,null,null,null,null,{"$f":"IF(B43>D43,A43&C43,IF(D43>B43,C43&A43,\"/\"))","v":"/"},null,{"$f":"A43&C43","v":"AFAG"},{"$f":"E43","v":""},{"$f":"C43&A43","v":"AGAF"},{"$f":"F43","v":""},{"$f":"B43","v":0},{"$f":"D43","v":""}]
[{"$f":"A7","v":"AB"},null,{"$f":"A8","v":"AC"},{"$f":"IF(G44=19,19,IF(ISBLANK(B44),\"\",IF(B44=19,0,36-B44)))","v":""},{"$f":"IF(G44=19,0,IF(ISBLANK(B44),\"\",IF(B44<18,1,IF(B44=18,2,IF(B44>18,3)))))","v":""},{"$f":"IF(G44=19,3,IF(ISBLANK(B44),\"\",IF(B44=19,0,IF(D44<18,1,IF(D44=18,2,IF(D44>=20,3))))))","v":""},null,null,null,null,null,{"$f":"IF(B44>D44,A44&C44,IF(D44>B44,C44&A44,\"/\"))","v":"/"},null,{"$f":"A44&C44","v":"ABAC"},{"$f":"E44","v":""},{"$f":"C44&A44","v":"ACAB"},{"$f":"F44","v":""},{"$f":"B44","v":0},{"$f":"D44","v":""}]
[{"$f":"A10","v":"AE"},null,{"$f":"A13","v":"AH"},{"$f":"IF(G45=19,19,IF(ISBLANK(B45),\"\",IF(B45=19,0,36-B45)))","v":""},{"$f":"IF(G45=19,0,IF(ISBLANK(B45),\"\",IF(B45<18,1,IF(B45=18,2,IF(B45>18,3)))))","v":""},{"$f":"IF(G45=19,3,IF(ISBLANK(B45),\"\",IF(B45=19,0,IF(D45<18,1,IF(D45=18,2,IF(D45>=20,3))))))","v":""},null,null,null,null,null,{"$f":"IF(B45>D45,A45&C45,IF(D45>B45,C45&A45,\"/\"))","v":"/"},null,{"$f":"A45&C45","v":"AEAH"},{"$f":"E45","v":""},{"$f":"C45&A45","v":"AHAE"},{"$f":"F45","v":""},{"$f":"B45","v":0},{"$f":"D45","v":""}]
[]
["5 éme MATCH le ","à",{"$f":"A10","v":"AE"}]
[null,null,null,null,null,null,"SI forfait éq recevante"]
["Equipes","score","Equipes","score","Points","Points"]
[{"$f":"A6","v":"AA"},null,{"$f":"A11","v":"AF"},{"$f":"IF(G50=19,19,IF(ISBLANK(B50),\"\",IF(B50=19,0,36-B50)))","v":""},{"$f":"IF(G50=19,0,IF(ISBLANK(B50),\"\",IF(B50<18,1,IF(B50=18,2,IF(B50>18,3)))))","v":""},{"$f":"IF(G50=19,3,IF(ISBLANK(B50),\"\",IF(B50=19,0,IF(D50<18,1,IF(D50=18,2,IF(D50>=20,3))))))","v":""},null,null,null,null,null,{"$f":"IF(B50>D50,A50&C50,IF(D50>B50,C50&A50,\"/\"))","v":"/"},null,{"$f":"A50&C50","v":"AAAF"},{"$f":"E50","v":""},{"$f":"C50&A50","v":"AFAA"},{"$f":"F50","v":""},{"$f":"B50","v":0},{"$f":"D50","v":""}]
[{"$f":"A9","v":"AD"},null,{"$f":"A13","v":"AH"},{"$f":"IF(G51=19,19,IF(ISBLANK(B51),\"\",IF(B51=19,0,36-B51)))","v":""},{"$f":"IF(G51=19,0,IF(ISBLANK(B51),\"\",IF(B51<18,1,IF(B51=18,2,IF(B51>18,3)))))","v":""},{"$f":"IF(G51=19,3,IF(ISBLANK(B51),\"\",IF(B51=19,0,IF(D51<18,1,IF(D51=18,2,IF(D51>=20,3))))))","v":""},null,null,null,null,null,{"$f":"IF(B51>D51,A51&C51,IF(D51>B51,C51&A51,\"/\"))","v":"/"},null,{"$f":"A51&C51","v":"ADAH"},{"$f":"E51","v":""},{"$f":"C51&A51","v":"AHAD"},{"$f":"F51","v":""},{"$f":"B51","v":0},{"$f":"D51","v":""}]
[{"$f":"A7","v":"AB"},null,{"$f":"A12","v":"AG"},{"$f":"IF(G52=19,19,IF(ISBLANK(B52),\"\",IF(B52=19,0,36-B52)))","v":""},{"$f":"IF(G52=19,0,IF(ISBLANK(B52),\"\",IF(B52<18,1,IF(B52=18,2,IF(B52>18,3)))))","v":""},{"$f":"IF(G52=19,3,IF(ISBLANK(B52),\"\",IF(B52=19,0,IF(D52<18,1,IF(D52=18,2,IF(D52>=20,3))))))","v":""},null,null,null,null,null,{"$f":"IF(B52>D52,A52&C52,IF(D52>B52,C52&A52,\"/\"))","v":"/"},null,{"$f":"A52&C52","v":"ABAG"},{"$f":"E52","v":""},{"$f":"C52&A52","v":"AGAB"},{"$f":"F52","v":""},{"$f":"B52","v":0},{"$f":"D52","v":""}]
[{"$f":"A8","v":"AC"},null,{"$f":"A10","v":"AE"},{"$f":"IF(G53=19,19,IF(ISBLANK(B53),\"\",IF(B53=19,0,36-B53)))","v":""},{"$f":"IF(G53=19,0,IF(ISBLANK(B53),\"\",IF(B53<18,1,IF(B53=18,2,IF(B53>18,3)))))","v":""},{"$f":"IF(G53=19,3,IF(ISBLANK(B53),\"\",IF(B53=19,0,IF(D53<18,1,IF(D53=18,2,IF(D53>=20,3))))))","v":""},null,null,null,null,null,{"$f":"IF(B53>D53,A53&C53,IF(D53>B53,C53&A53,\"/\"))","v":"/"},null,{"$f":"A53&C53","v":"ACAE"},{"$f":"E53","v":""},{"$f":"C53&A53","v":"AEAC"},{"$f":"F53","v":""},{"$f":"B53","v":0},{"$f":"D53","v":""}]
[]
["6 éme MATCH le ","à",{"$f":"A11","v":"AF"}]
[null,null,null,null,null,null,"SI forfait éq recevante"]
["Equipes","score","Equipes","score","Points","Points"]
[{"$f":"A7","v":"AB"},null,{"$f":"A9","v":"AD"},{"$f":"IF(G58=19,19,IF(ISBLANK(B58),\"\",IF(B58=19,0,36-B58)))","v":""},{"$f":"IF(G58=19,0,IF(ISBLANK(B58),\"\",IF(B58<18,1,IF(B58=18,2,IF(B58>18,3)))))","v":""},{"$f":"IF(G58=19,3,IF(ISBLANK(B58),\"\",IF(B58=19,0,IF(D58<18,1,IF(D58=18,2,IF(D58>=20,3))))))","v":""},null,null,null,null,null,{"$f":"IF(B58>D58,A58&C58,IF(D58>B58,C58&A58,\"/\"))","v":"/"},null,{"$f":"A58&C58","v":"ABAD"},{"$f":"E58","v":""},{"$f":"C58&A58","v":"ADAB"},{"$f":"F58","v":""},{"$f":"B58","v":0},{"$f":"D58","v":""}]
[{"$f":"A10","v":"AE"},null,{"$f":"A6","v":"AA"},{"$f":"IF(G59=19,19,IF(ISBLANK(B59),\"\",IF(B59=19,0,36-B59)))","v":""},{"$f":"IF(G59=19,0,IF(ISBLANK(B59),\"\",IF(B59<18,1,IF(B59=18,2,IF(B59>18,3)))))","v":""},{"$f":"IF(G59=19,3,IF(ISBLANK(B59),\"\",IF(B59=19,0,IF(D59<18,1,IF(D59=18,2,IF(D59>=20,3))))))","v":""},null,null,null,null,null,{"$f":"IF(B59>D59,A59&C59,IF(D59>B59,C59&A59,\"/\"))","v":"/"},null,{"$f":"A59&C59","v":"AEAA"},{"$f":"E59","v":""},{"$f":"C59&A59","v":"AAAE"},{"$f":"F59","v":""},{"$f":"B59","v":0},{"$f":"D59","v":""}]
[{"$f":"A12","v":"AG"},null,{"$f":"A8","v":"AC"},{"$f":"IF(G60=19,19,IF(ISBLANK(B60),\"\",IF(B60=19,0,36-B60)))","v":""},{"$f":"IF(G60=19,0,IF(ISBLANK(B60),\"\",IF(B60<18,1,IF(B60=18,2,IF(B60>18,3)))))","v":""},{"$f":"IF(G60=19,3,IF(ISBLANK(B60),\"\",IF(B60=19,0,IF(D60<18,1,IF(D60=18,2,IF(D60>=20,3))))))","v":""},null,null,null,null,null,{"$f":"IF(B60>D60,A60&C60,IF(D60>B60,C60&A60,\"/\"))","v":"/"},null,{"$f":"A60&C60","v":"AGAC"},{"$f":"E60","v":""},{"$f":"C60&A60","v":"ACAG"},{"$f":"F60","v":""},{"$f":"B60","v":0},{"$f":"D60","v":""}]
[{"$f":"A11","v":"AF"},null,{"$f":"A13","v":"AH"},{"$f":"IF(G61=19,19,IF(ISBLANK(B61),\"\",IF(B61=19,0,36-B61)))","v":""},{"$f":"IF(G61=19,0,IF(ISBLANK(B61),\"\",IF(B61<18,1,IF(B61=18,2,IF(B61>18,3)))))","v":""},{"$f":"IF(G61=19,3,IF(ISBLANK(B61),\"\",IF(B61=19,0,IF(D61<18,1,IF(D61=18,2,IF(D61>=20,3))))))","v":""},null,null,null,null,null,{"$f":"IF(B61>D61,A61&C61,IF(D61>B61,C61&A61,\"/\"))","v":"/"},null,{"$f":"A61&C61","v":"AFAH"},{"$f":"E61","v":""},{"$f":"C61&A61","v":"AHAF"},{"$f":"F61","v":""},{"$f":"B61","v":0},{"$f":"D61","v":""}]
[]
["7 éme MATCH le","à",{"$f":"A12","v":"AG"}]
[null,null,null,null,null,null,"SI forfait éq recevante",null," "]
["Equipes","score","Equipes","score","Points","Points"]
[{"$f":"A6","v":"AA"},null,{"$f":"A12","v":"AG"},{"$f":"IF(G66=19,19,IF(ISBLANK(B66),\"\",IF(B66=19,0,36-B66)))","v":""},{"$f":"IF(G66=19,0,IF(ISBLANK(B66),\"\",IF(B66<18,1,IF(B66=18,2,IF(B66>18,3)))))","v":""},{"$f":"IF(G66=19,3,IF(ISBLANK(B66),\"\",IF(B66=19,0,IF(D66<18,1,IF(D66=18,2,IF(D66>=20,3))))))","v":""},null,null,null,null,null,{"$f":"IF(B66>D66,A66&C66,IF(D66>B66,C66&A66,\"/\"))","v":"/"},null,{"$f":"A66&C66","v":"AAAG"},{"$f":"E66","v":""},{"$f":"C66&A66","v":"AGAA"},{"$f":"F66","v":""},{"$f":"B66","v":0},{"$f":"D66","v":""}]
[{"$f":"A7","v":"AB"},null,{"$f":"A11","v":"AF"},{"$f":"IF(G67=19,19,IF(ISBLANK(B67),\"\",IF(B67=19,0,36-B67)))","v":""},{"$f":"IF(G67=19,0,IF(ISBLANK(B67),\"\",IF(B67<18,1,IF(B67=18,2,IF(B67>18,3)))))","v":""},{"$f":"IF(G67=19,3,IF(ISBLANK(B67),\"\",IF(B67=19,0,IF(D67<18,1,IF(D67=18,2,IF(D67>=20,3))))))","v":""},null,null,null,null,null,{"$f":"IF(B67>D67,A67&C67,IF(D67>B67,C67&A67,\"/\"))","v":"/"},null,{"$f":"A67&C67","v":"ABAF"},{"$f":"E67","v":""},{"$f":"C67&A67","v":"AFAB"},{"$f":"F67","v":""},{"$f":"B67","v":0},{"$f":"D67","v":""}]
[{"$f":"A10","v":"AE"},null,{"$f":"A9","v":"AD"},{"$f":"IF(G68=19,19,IF(ISBLANK(B68),\"\",IF(B68=19,0,36-B68)))","v":""},{"$f":"IF(G68=19,0,IF(ISBLANK(B68),\"\",IF(B68<18,1,IF(B68=18,2,IF(B68>18,3)))))","v":""},{"$f":"IF(G68=19,3,IF(ISBLANK(B68),\"\",IF(B68=19,0,IF(D68<18,1,IF(D68=18,2,IF(D68>=20,3))))))","v":""},null,null,null,null,null,{"$f":"IF(B68>D68,A68&C68,IF(D68>B68,C68&A68,\"/\"))","v":"/"},null,{"$f":"A68&C68","v":"AEAD"},{"$f":"E68","v":""},{"$f":"C68&A68","v":"ADAE"},{"$f":"F68","v":""},{"$f":"B68","v":0},{"$f":"D68","v":""}]
[{"$f":"A8","v":"AC"},null,{"$f":"A13","v":"AH"},{"$f":"IF(G69=19,19,IF(ISBLANK(B69),\"\",IF(B69=19,0,36-B69)))","v":""},{"$f":"IF(G69=19,0,IF(ISBLANK(B69),\"\",IF(B69<18,1,IF(B69=18,2,IF(B69>18,3)))))","v":""},{"$f":"IF(G69=19,3,IF(ISBLANK(B69),\"\",IF(B69=19,0,IF(D69<18,1,IF(D69=18,2,IF(D69>=20,3))))))","v":""},null,null,null,null,null,{"$f":"IF(B69>D69,A69&C69,IF(D69>B69,C69&A69,\"/\"))","v":"/"},null,{"$f":"A69&C69","v":"ACAH"},{"$f":"E69","v":""},{"$f":"C69&A69","v":"AHAC"},{"$f":"F69","v":""},{"$f":"B69","v":0},{"$f":"D69","v":""}]
[null,null,"CLASSEMENT",null,null,null,"Classt        Final","Rencontres entre exaequos"]
["EQUIPES",null,"POINTS","POUR","CONTRE","DIFF",null,"POINTS Exaequos","Exaq","n°",{"$f":"A6","v":"AA"},{"$f":"A7","v":"AB"},{"$f":"A8","v":"AC"},{"$f":"A9","v":"AD"},{"$f":"A10","v":"AE"},{"$f":"A11","v":"AF"},{"$f":"A12","v":"AG"},{"$f":"A13","v":"AH"},"Pts matchs",null,null,null,"1000000*Pts matchs +1000 (Diff +  abs(diff mini) )+Pour ","RANG","DIFF Exaequos","POUR Exaequos"]
[null,"1A",0,0,0,0,1,{"$f":"IF(S72>0,S72,\"\")","v":{"$error":"#N/A"}},{"$f":"COUNTIF($C$72:$C$79,C72)","v":8},{"$f":"IF(AND(I72>1,COUNTIFS(I$72:I72,I72,C$72:C72,C72)=1),MAX(J$71:J71)+1,\"\")","v":1},{"$f":"IF($A72=K$71,\"\",IF(INDEX($C$72:$C$79,MATCH(K$71,$A$72:$A$79,0))=$C72,IFERROR(VLOOKUP($A72&K$71,$N$18:$O$69,2,0),  VLOOKUP(K$71&$A72,$N$18:$Q$69,4,0)),          \"\"))","v":{"$error":"#N/A"}},{"$error":"#N/A"},{"$error":"#N/A"},{"$error":"#N/A"},{"$error":"#N/A"},{"$error":"#N/A"},{"$error":"#N/A"},{"$error":"#N/A"},{"$f":"SUM(K72:R72)","v":{"$error":"#N/A"}},null,null,null,{"$f":"IF(I72<3,S72*1000000+(F72+ABS(MIN($F$72:$F$79)))*1000+D72,S72*1000000+U96*1000+Z72)","v":{"$error":"#N/A"}},{"$f":"IF(I72>2,RANK(W72,OFFSET(W$71,MATCH(I72,$I$72:$I$79,0),,I72)))","v":{"$error":"#N/A"}},{"$f":"IF(S96=0,\"\",S96)","v":{"$error":"#N/A"}},{"$f":"IF(S80=0,\"\",S80)","v":{"$error":"#N/A"}}]
[null,"1B",0,0,0,0,2,{"$error":"#N/A"},8,{"$f":"IF(AND(I73>1,COUNTIFS(I$72:I73,I73,C$72:C73,C73)=1),MAX(J$71:J72)+1,\"\")","v":""},{"$error":"#N/A"},{"$error":"#N/A"},{"$error":"#N/A"},{"$error":"#N/A"},{"$error":"#N/A"},{"$error":"#N/A"},{"$error":"#N/A"},{"$error":"#N/A"},{"$f":"SUM(K73:R73)","v":{"$error":"#N/A"}},null,null,null,{"$f":"IF(I73<3,S73*1000000+(F73+ABS(MIN($F$72:$F$79)))*1000+D73,S73*1000000+U97*1000+Z73)","v":{"$error":"#N/A"}},{"$f":"IF(I73>2,RANK(W73,OFFSET(W$71,MATCH(I73,$I$72:$I$79,0),,I73)))","v":{"$error":"#N/A"}},{"$error":"#N/A"},{"$error":"#N/A"}]
[null,"1C",0,0,0,0,3,{"$error":"#N/A"},8,{"$f":"IF(AND(I74>1,COUNTIFS(I$72:I74,I74,C$72:C74,C74)=1),MAX(J$71:J73)+1,\"\")","v":""},{"$error":"#N/A"},{"$error":"#N/A"},{"$error":"#N/A"},{"$error":"#N/A"},{"$error":"#N/A"},{"$error":"#N/A"},{"$error":"#N/A"},{"$error":"#N/A"},{"$error":"#N/A"},null,null,null,{"$error":"#N/A"},{"$error":"#N/A"},{"$error":"#N/A"},{"$error":"#N/A"}]
[null,"1D",0,0,0,0,4,{"$error":"#N/A"},8,{"$f":"IF(AND(I75>1,COUNTIFS(I$72:I75,I75,C$72:C75,C75)=1),MAX(J$71:J74)+1,\"\")","v":""},{"$error":"#N/A"},{"$error":"#N/A"},{"$error":"#N/A"},{"$error":"#N/A"},{"$error":"#N/A"},{"$error":"#N/A"},{"$error":"#N/A"},{"$error":"#N/A"},{"$error":"#N/A"},null,null,null,{"$error":"#N/A"},{"$error":"#N/A"},{"$error":"#N/A"},{"$error":"#N/A"}]
[null,"1E",0,0,0,0,5,{"$error":"#N/A"},8,{"$f":"IF(AND(I76>1,COUNTIFS(I$72:I76,I76,C$72:C76,C76)=1),MAX(J$71:J75)+1,\"\")","v":""},{"$error":"#N/A"},{"$error":"#N/A"},{"$error":"#N/A"},{"$error":"#N/A"},{"$error":"#N/A"},{"$error":"#N/A"},{"$error":"#N/A"},{"$error":"#N/A"},{"$error":"#N/A"},null,null,null,{"$error":"#N/A"},{"$error":"#N/A"},{"$error":"#N/A"},{"$error":"#N/A"}]
[null,"1F",0,0,0,0,6,{"$error":"#N/A"},8,{"$f":"IF(AND(I77>1,COUNTIFS(I$72:I77,I77,C$72:C77,C77)=1),MAX(J$71:J76)+1,\"\")","v":""},{"$error":"#N/A"},{"$error":"#N/A"},{"$error":"#N/A"},{"$error":"#N/A"},{"$error":"#N/A"},{"$error":"#N/A"},{"$error":"#N/A"},{"$error":"#N/A"},{"$error":"#N/A"},null,null,null,{"$error":"#N/A"},{"$error":"#N/A"},{"$error":"#N/A"},{"$error":"#N/A"}]
[null,"1G",0,0,0,0,7,{"$error":"#N/A"},8,{"$f":"IF(AND(I78>1,COUNTIFS(I$72:I78,I78,C$72:C78,C78)=1),MAX(J$71:J77)+1,\"\")","v":""},{"$error":"#N/A"},{"$error":"#N/A"},{"$error":"#N/A"},{"$error":"#N/A"},{"$error":"#N/A"},{"$error":"#N/A"},{"$error":"#N/A"},{"$error":"#N/A"},{"$error":"#N/A"},null,null,null,{"$error":"#N/A"},{"$error":"#N/A"},{"$error":"#N/A"},{"$error":"#N/A"}]
[null,"1H",0,0,0,0,8,{"$error":"#N/A"},8,{"$f":"IF(AND(I79>1,COUNTIFS(I$72:I79,I79,C$72:C79,C79)=1),MAX(J$71:J78)+1,\"\")","v":""},{"$error":"#N/A"},{"$error":"#N/A"},{"$error":"#N/A"},{"$error":"#N/A"},{"$error":"#N/A"},{"$error":"#N/A"},{"$error":"#N/A"},{"$error":"#N/A"},{"$error":"#N/A"},null,null,null,{"$error":"#N/A"},{"$error":"#N/A"},{"$error":"#N/A"},{"$error":"#N/A"}]
[null,null,null,null,null,null,null,null,"POUR",{"$f":"A72","v":0},{"$f":"IF($A72=K$71,\"\",IF(INDEX($C$72:$C$79,MATCH(K$71,$A$72:$A$79,0))=$C72,IFERROR(VLOOKUP($A72&K$71,$N$18:$R$69,5,0),  VLOOKUP(K$71&$A72,$N$18:$S$69,6,0)),          \"\"))","v":{"$error":"#N/A"}},{"$error":"#N/A"},{"$error":"#N/A"},{"$error":"#N/A"},{"$error":"#N/A"},{"$error":"#N/A"},{"$error":"#N/A"},{"$error":"#N/A"},{"$error":"#N/A"}]
[null,null,null,null,null,null,null,null,null,0,{"$error":"#N/A"},{"$error":"#N/A"},{"$error":"#N/A"},{"$error":"#N/A"},{"$error":"#N/A"},{"$error":"#N/A"},{"$error":"#N/A"},{"$error":"#N/A"},{"$error":"#N/A"}]
[null,null,null,null,null,null,null,null,null,0,{"$error":"#N/A"},{"$error":"#N/A"},{"$error":"#N/A"},{"$error":"#N/A"},{"$error":"#N/A"},{"$error":"#N/A"},{"$error":"#N/A"},{"$error":"#N/A"},{"$error":"#N/A"}]
[null,null,null,null,null,null,null,null,null,0,{"$error":"#N/A"},{"$error":"#N/A"},{"$error":"#N/A"},{"$error":"#N/A"},{"$error":"#N/A"},{"$error":"#N/A"},{"$error":"#N/A"},{"$error":"#N/A"},{"$error":"#N/A"}]
[null,null,null,null,null,null,null,null,null,0,{"$error":"#N/A"},{"$error":"#N/A"},{"$error":"#N/A"},{"$error":"#N/A"},{"$error":"#N/A"},{"$error":"#N/A"},{"$error":"#N/A"},{"$error":"#N/A"},{"$error":"#N/A"},null,null,null,null,null,"  "]
[null,null,null,null,null,null,null,null,null,0,{"$error":"#N/A"},{"$error":"#N/A"},{"$error":"#N/A"},{"$error":"#N/A"},{"$error":"#N/A"},{"$error":"#N/A"},{"$error":"#N/A"},{"$error":"#N/A"},{"$error":"#N/A"}]
[null,null,null,null,null,null,null,null,null,0,{"$error":"#N/A"},{"$error":"#N/A"},{"$error":"#N/A"},{"$error":"#N/A"},{"$error":"#N/A"},{"$error":"#N/A"},{"$error":"#N/A"},{"$error":"#N/A"},{"$error":"#N/A"}]
[null,null,null,null,null,null,null,null,null,0,{"$error":"#N/A"},{"$error":"#N/A"},{"$error":"#N/A"},{"$error":"#N/A"},{"$error":"#N/A"},{"$error":"#N/A"},{"$error":"#N/A"},{"$error":"#N/A"},{"$error":"#N/A"}]
[null,null,null,null,null,null,null,null,"CONTRE",{"$f":"J80","v":0},{"$f":"INDEX($K$80:$R$87,MATCH(K$71,$J$80:$J$87,0),MATCH($J80,$K$71:$R$71,0))","v":{"$error":"#N/A"}},{"$f":"INDEX($K$80:$R$87,MATCH(L$71,$J$80:$J$87,0),MATCH($J80,$K$71:$R$71,0))","v":{"$error":"#N/A"}},{"$error":"#N/A"},{"$error":"#N/A"},{"$error":"#N/A"},{"$error":"#N/A"},{"$error":"#N/A"},{"$error":"#N/A"},{"$error":"#N/A"}]
[null,null,null,null,null,null,null,null,null,{"$f":"J81","v":0},{"$f":"INDEX($K$80:$R$87,MATCH(K$71,$J$80:$J$87,0),MATCH($J81,$K$71:$R$71,0))","v":{"$error":"#N/A"}},{"$error":"#N/A"},{"$error":"#N/A"},{"$error":"#N/A"},{"$error":"#N/A"},{"$error":"#N/A"},{"$error":"#N/A"},{"$error":"#N/A"},{"$error":"#N/A"}]
[null,null,null,null,null,null,null,null,null,0,{"$error":"#N/A"},{"$error":"#N/A"},{"$error":"#N/A"},{"$error":"#N/A"},{"$error":"#N/A"},{"$error":"#N/A"},{"$error":"#N/A"},{"$error":"#N/A"},{"$error":"#N/A"}]
[null,null,null,null,null,null,null,null,null,0,{"$error":"#N/A"},{"$error":"#N/A"},{"$error":"#N/A"},{"$error":"#N/A"},{"$error":"#N/A"},{"$error":"#N/A"},{"$error":"#N/A"},{"$error":"#N/A"},{"$error":"#N/A"}]
[null,null,null,null,null,null,null,null,null,0,{"$error":"#N/A"},{"$error":"#N/A"},{"$error":"#N/A"},{"$error":"#N/A"},{"$error":"#N/A"},{"$error":"#N/A"},{"$error":"#N/A"},{"$error":"#N/A"},{"$error":"#N/A"}]
[null,null,null,null,null,null,null,null,null,0,{"$error":"#N/A"},{"$error":"#N/A"},{"$error":"#N/A"},{"$error":"#N/A"},{"$error":"#N/A"},{"$error":"#N/A"},{"$error":"#N/A"},{"$error":"#N/A"},{"$error":"#N/A"}]
[null,null,null,null,null,null,null,null,null,0,{"$error":"#N/A"},{"$error":"#N/A"},{"$error":"#N/A"},{"$error":"#N/A"},{"$error":"#N/A"},{"$error":"#N/A"},{"$error":"#N/A"},{"$error":"#N/A"},{"$error":"#N/A"}]
[null,null,null,null,null,null,null,null,null,0,{"$error":"#N/A"},{"$error":"#N/A"},{"$error":"#N/A"},{"$error":"#N/A"},{"$error":"#N/A"},{"$error":"#N/A"},{"$error":"#N/A"},{"$error":"#N/A"},{"$error":"#N/A"},null,"Diff pondérée"]
[null,null,null,null,null,null,null,null,"DIFF",{"$f":"J88","v":0},null,null,null,null,null,null,null,null,{"$f":"S80-S88","v":{"$error":"#N/A"}},null,{"$f":"S96+ABS(MIN($S$96:$S$103))","v":{"$error":"#N/A"}}]
[null,null,null,null,null,null,null,null,null,{"$f":"J89","v":0},null,null,null,null,null,null,null,null,{"$f":"S81-S89","v":{"$error":"#N/A"}},null,{"$error":"#N/A"}]
[null,null,null,null,null,null,null,null,null,0,null,null,null,null,null,null,null,null,{"$error":"#N/A"},null,{"$error":"#N/A"}]
[null,null,null,null,null,null,null,null,null,0,null,null,null,null,null,null,null,null,{"$error":"#N/A"},null,{"$error":"#N/A"}]
[null,null,null,null,null,null,null,null,null,0,null,null,null,null,null,null,null,null,{"$error":"#N/A"},null,{"$error":"#N/A"}]
[null,null,null,null,null,null,null,null,null,0,null,null,null,null,null,null,null,null,{"$error":"#N/A"},null,{"$error":"#N/A"}]
[null,null,null,null,null,null,null,null,null,0,null,null,null,null,null,null,null,null,{"$error":"#N/A"},null,{"$f":"S102+ABS(MIN($S$96:$S$103))","v":{"$error":"#N/A"}}]
[null,null,null,null,null,null,null,null,null,0,null,null,null,null,null,null,null,null,{"$error":"#N/A"},null,{"$f":"S103+ABS(MIN($S$96:$S$103))","v":{"$error":"#N/A"}}]

{"sheet":"P8","index":7,"n_rows":103,"n_cols":26,"rows_kept":103,"cut":false,"hidden":false,"merged":[[0,0,0,5],[1,0,1,5],[2,0,2,5],[3,0,3,5],[3,8,3,10],[15,6,16,6],[69,2,69,5],[69,6,70,6],[69,7,69,25],[23,6,24,6],[31,6,32,6],[39,6,40,6],[47,6,48,6],[55,6,56,6],[63,6,64,6]]}
[null,null,null,null,null,null,3]
["CHAMPIONNAT DES CLUBS"]
[]
["POULE 8"]
["EQUIPES",null,"POINTS","Pour","Contre","Diff"]
["AA","1A",{"$f":"SUMIF($A$18:$A$69,A6,$E$18:$E$69)+SUMIF($C$18:$C$69,A6,$F$18:$F$69)","v":0},{"$f":"SUMIF($A$18:$A$69,$A6,$B$18:$B$69)+SUMIF($C$18:$C$69,$A6,$D$18:$D$69)","v":0},{"$f":"SUMIF($C$18:$C$69,$A6,$B$18:$B$69)+SUMIF($A$18:$A$69,$A6,$D$18:$D$69)","v":0},{"$f":"D6-E6","v":0}]
["AB","1B",{"$f":"SUMIF($A$18:$A$69,A7,$E$18:$E$69)+SUMIF($C$18:$C$69,A7,$F$18:$F$69)","v":0},{"$f":"SUMIF($A$18:$A$69,$A7,$B$18:$B$69)+SUMIF($C$18:$C$69,$A7,$D$18:$D$69)","v":0},{"$f":"SUMIF($C$18:$C$69,$A7,$B$18:$B$69)+SUMIF($A$18:$A$69,$A7,$D$18:$D$69)","v":0},0]
["AC","1C",{"$f":"SUMIF($A$18:$A$69,A8,$E$18:$E$69)+SUMIF($C$18:$C$69,A8,$F$18:$F$69)","v":0},0,0,0]
["AD","1D",0,0,0,0]
["AE","1E",0,0,0,0]
["AF","1F",0,0,0,0]
["AG","1G",0,0,0,{"$f":"D12-E12","v":0}]
["AH","1H",0,{"$f":"SUMIF($A$18:$A$69,$A13,$B$18:$B$69)+SUMIF($C$18:$C$69,$A13,$D$18:$D$69)","v":0},0,{"$f":"D13-E13","v":0}]
[]
["1er MATCH le ","à",{"$f":"A6","v":"AA"}]
[null,null,null,null,null,null,"SI forfait éq recevante"]
["Equipes","score","Equipes","score","Points","Points"]
[{"$f":"A6","v":"AA"},null,{"$f":"A7","v":"AB"},{"$f":"IF(G18=19,19,IF(ISBLANK(B18),\"\",IF(B18=19,0,36-B18)))","v":""},{"$f":"IF(G18=19,0,IF(ISBLANK(B18),\"\",IF(B18<18,1,IF(B18=18,2,IF(B18>18,3)))))","v":""},{"$f":"IF(G18=19,3,IF(ISBLANK(B18),\"\",IF(B18=19,0,IF(D18<18,1,IF(D18=18,2,IF(D18>=20,3))))))","v":""},null,null,null,null,null,{"$f":"IF(B18>D18,A18&C18,IF(D18>B18,C18&A18,\"/\"))","v":"/"},null,{"$f":"A18&C18","v":"AAAB"},{"$f":"E18","v":""},{"$f":"C18&A18","v":"ABAA"},{"$f":"F18","v":""},{"$f":"B18","v":0},{"$f":"D18","v":""}]
[{"$f":"A8","v":"AC"},null,{"$f":"A9","v":"AD"},{"$f":"IF(G19=19,19,IF(ISBLANK(B19),\"\",IF(B19=19,0,36-B19)))","v":""},{"$f":"IF(G19=19,0,IF(ISBLANK(B19),\"\",IF(B19<18,1,IF(B19=18,2,IF(B19>18,3)))))","v":""},{"$f":"IF(G19=19,3,IF(ISBLANK(B19),\"\",IF(B19=19,0,IF(D19<18,1,IF(D19=18,2,IF(D19>=20,3))))))","v":""},null,null,null,null,null,{"$f":"IF(B19>D19,A19&C19,IF(D19>B19,C19&A19,\"/\"))","v":"/"},null,{"$f":"A19&C19","v":"ACAD"},{"$f":"E19","v":""},{"$f":"C19&A19","v":"ADAC"},{"$f":"F19","v":""},{"$f":"B19","v":0},{"$f":"D19","v":""}]
[{"$f":"A10","v":"AE"},null,{"$f":"A11","v":"AF"},{"$f":"IF(G20=19,19,IF(ISBLANK(B20),\"\",IF(B20=19,0,36-B20)))","v":""},{"$f":"IF(G20=19,0,IF(ISBLANK(B20),\"\",IF(B20<18,1,IF(B20=18,2,IF(B20>18,3)))))","v":""},{"$f":"IF(G20=19,3,IF(ISBLANK(B20),\"\",IF(B20=19,0,IF(D20<18,1,IF(D20=18,2,IF(D20>=20,3))))))","v":""},null,null,null,null,null,{"$f":"IF(B20>D20,A20&C20,IF(D20>B20,C20&A20,\"/\"))","v":"/"},null,{"$f":"A20&C20","v":"AEAF"},{"$f":"E20","v":""},{"$f":"C20&A20","v":"AFAE"},{"$f":"F20","v":""},{"$f":"B20","v":0},{"$f":"D20","v":""}]
[{"$f":"A12","v":"AG"},null,{"$f":"A13","v":"AH"},{"$f":"IF(G21=19,19,IF(ISBLANK(B21),\"\",IF(B21=19,0,36-B21)))","v":""},{"$f":"IF(G21=19,0,IF(ISBLANK(B21),\"\",IF(B21<18,1,IF(B21=18,2,IF(B21>18,3)))))","v":""},{"$f":"IF(G21=19,3,IF(ISBLANK(B21),\"\",IF(B21=19,0,IF(D21<18,1,IF(D21=18,2,IF(D21>=20,3))))))","v":""},null,null,null,null,null,{"$f":"IF(B21>D21,A21&C21,IF(D21>B21,C21&A21,\"/\"))","v":"/"},null,{"$f":"A21&C21","v":"AGAH"},{"$f":"E21","v":""},{"$f":"C21&A21","v":"AHAG"},{"$f":"F21","v":""},{"$f":"B21","v":0},{"$f":"D21","v":""}]
[]
["2 éme MATCH le ","à",{"$f":"A7","v":"AB"}]
[null,null,null,null,null,null,"SI forfait éq recevante"]
["Equipes","score","Equipes","score","Points","Points"]
[{"$f":"A6","v":"AA"},null,{"$f":"A8","v":"AC"},{"$f":"IF(G26=19,19,IF(ISBLANK(B26),\"\",IF(B26=19,0,36-B26)))","v":""},{"$f":"IF(G26=19,0,IF(ISBLANK(B26),\"\",IF(B26<18,1,IF(B26=18,2,IF(B26>18,3)))))","v":""},{"$f":"IF(G26=19,3,IF(ISBLANK(B26),\"\",IF(B26=19,0,IF(D26<18,1,IF(D26=18,2,IF(D26>=20,3))))))","v":""},null,null,null,null,null,{"$f":"IF(B26>D26,A26&C26,IF(D26>B26,C26&A26,\"/\"))","v":"/"},null,{"$f":"A26&C26","v":"AAAC"},{"$f":"E26","v":""},{"$f":"C26&A26","v":"ACAA"},{"$f":"F26","v":""},{"$f":"B26","v":0},{"$f":"D26","v":""}]
[{"$f":"A7","v":"AB"},null,{"$f":"A13","v":"AH"},{"$f":"IF(G27=19,19,IF(ISBLANK(B27),\"\",IF(B27=19,0,36-B27)))","v":""},{"$f":"IF(G27=19,0,IF(ISBLANK(B27),\"\",IF(B27<18,1,IF(B27=18,2,IF(B27>18,3)))))","v":""},{"$f":"IF(G27=19,3,IF(ISBLANK(B27),\"\",IF(B27=19,0,IF(D27<18,1,IF(D27=18,2,IF(D27>=20,3))))))","v":""},null,null,null,null,null,{"$f":"IF(B27>D27,A27&C27,IF(D27>B27,C27&A27,\"/\"))","v":"/"},null,{"$f":"A27&C27","v":"ABAH"},{"$f":"E27","v":""},{"$f":"C27&A27","v":"AHAB"},{"$f":"F27","v":""},{"$f":"B27","v":0},{"$f":"D27","v":""}]
[{"$f":"A9","v":"AD"},null,{"$f":"A11","v":"AF"},{"$f":"IF(G28=19,19,IF(ISBLANK(B28),\"\",IF(B28=19,0,36-B28)))","v":""},{"$f":"IF(G28=19,0,IF(ISBLANK(B28),\"\",IF(B28<18,1,IF(B28=18,2,IF(B28>18,3)))))","v":""},{"$f":"IF(G28=19,3,IF(ISBLANK(B28),\"\",IF(B28=19,0,IF(D28<18,1,IF(D28=18,2,IF(D28>=20,3))))))","v":""},null,null,null,null,null,{"$f":"IF(B28>D28,A28&C28,IF(D28>B28,C28&A28,\"/\"))","v":"/"},null,{"$f":"A28&C28","v":"ADAF"},{"$f":"E28","v":""},{"$f":"C28&A28","v":"AFAD"},{"$f":"F28","v":""},{"$f":"B28","v":0},{"$f":"D28","v":""}]
[{"$f":"A10","v":"AE"},null,{"$f":"A12","v":"AG"},{"$f":"IF(G29=19,19,IF(ISBLANK(B29),\"\",IF(B29=19,0,36-B29)))","v":""},{"$f":"IF(G29=19,0,IF(ISBLANK(B29),\"\",IF(B29<18,1,IF(B29=18,2,IF(B29>18,3)))))","v":""},{"$f":"IF(G29=19,3,IF(ISBLANK(B29),\"\",IF(B29=19,0,IF(D29<18,1,IF(D29=18,2,IF(D29>=20,3))))))","v":""},null,null,null,null,null,{"$f":"IF(B29>D29,A29&C29,IF(D29>B29,C29&A29,\"/\"))","v":"/"},null,{"$f":"A29&C29","v":"AEAG"},{"$f":"E29","v":""},{"$f":"C29&A29","v":"AGAE"},{"$f":"F29","v":""},{"$f":"B29","v":0},{"$f":"D29","v":""}]
[]
["3 éme MATCH le ","à",{"$f":"A8","v":"AC"}]
[null,null,null,null,null,null,"SI forfait éq recevante"]
["Equipes","score","Equipes","score","Points","Points"]
[{"$f":"A6","v":"AA"},null,{"$f":"A13","v":"AH"},{"$f":"IF(G34=19,19,IF(ISBLANK(B34),\"\",IF(B34=19,0,36-B34)))","v":""},{"$f":"IF(G34=19,0,IF(ISBLANK(B34),\"\",IF(B34<18,1,IF(B34=18,2,IF(B34>18,3)))))","v":""},{"$f":"IF(G34=19,3,IF(ISBLANK(B34),\"\",IF(B34=19,0,IF(D34<18,1,IF(D34=18,2,IF(D34>=20,3))))))","v":""},null,null,null,null,null,{"$f":"IF(B34>D34,A34&C34,IF(D34>B34,C34&A34,\"/\"))","v":"/"},null,{"$f":"A34&C34","v":"AAAH"},{"$f":"E34","v":""},{"$f":"C34&A34","v":"AHAA"},{"$f":"F34","v":""},{"$f":"B34","v":0},{"$f":"D34","v":""}]
[{"$f":"A7","v":"AB"},null,{"$f":"A10","v":"AE"},{"$f":"IF(G35=19,19,IF(ISBLANK(B35),\"\",IF(B35=19,0,36-B35)))","v":""},{"$f":"IF(G35=19,0,IF(ISBLANK(B35),\"\",IF(B35<18,1,IF(B35=18,2,IF(B35>18,3)))))","v":""},{"$f":"IF(G35=19,3,IF(ISBLANK(B35),\"\",IF(B35=19,0,IF(D35<18,1,IF(D35=18,2,IF(D35>=20,3))))))","v":""},null,null,null,null,null,{"$f":"IF(B35>D35,A35&C35,IF(D35>B35,C35&A35,\"/\"))","v":"/"},null,{"$f":"A35&C35","v":"ABAE"},{"$f":"E35","v":""},{"$f":"C35&A35","v":"AEAB"},{"$f":"F35","v":""},{"$f":"B35","v":0},{"$f":"D35","v":""}]
[{"$f":"A8","v":"AC"},null,{"$f":"A11","v":"AF"},{"$f":"IF(G36=19,19,IF(ISBLANK(B36),\"\",IF(B36=19,0,36-B36)))","v":""},{"$f":"IF(G36=19,0,IF(ISBLANK(B36),\"\",IF(B36<18,1,IF(B36=18,2,IF(B36>18,3)))))","v":""},{"$f":"IF(G36=19,3,IF(ISBLANK(B36),\"\",IF(B36=19,0,IF(D36<18,1,IF(D36=18,2,IF(D36>=20,3))))))","v":""},null,null,null,null,null,{"$f":"IF(B36>D36,A36&C36,IF(D36>B36,C36&A36,\"/\"))","v":"/"},null,{"$f":"A36&C36","v":"ACAF"},{"$f":"E36","v":""},{"$f":"C36&A36","v":"AFAC"},{"$f":"F36","v":""},{"$f":"B36","v":0},{"$f":"D36","v":""}]
[{"$f":"A9","v":"AD"},null,{"$f":"A12","v":"AG"},{"$f":"IF(G37=19,19,IF(ISBLANK(B37),\"\",IF(B37=19,0,36-B37)))","v":""},{"$f":"IF(G37=19,0,IF(ISBLANK(B37),\"\",IF(B37<18,1,IF(B37=18,2,IF(B37>18,3)))))","v":""},{"$f":"IF(G37=19,3,IF(ISBLANK(B37),\"\",IF(B37=19,0,IF(D37<18,1,IF(D37=18,2,IF(D37>=20,3))))))","v":""},null,null,null,null,null,{"$f":"IF(B37>D37,A37&C37,IF(D37>B37,C37&A37,\"/\"))","v":"/"},null,{"$f":"A37&C37","v":"ADAG"},{"$f":"E37","v":""},{"$f":"C37&A37","v":"AGAD"},{"$f":"F37","v":""},{"$f":"B37","v":0},{"$f":"D37","v":""}]
[]
["4 éme MATCH le ","à",{"$f":"A9","v":"AD"}]
[null,null,null,null,null,null,"SI forfait éq recevante"]
["Equipes","score","Equipes","score","Points","Points"]
[{"$f":"A6","v":"AA"},null,{"$f":"A9","v":"AD"},{"$f":"IF(G42=19,19,IF(ISBLANK(B42),\"\",IF(B42=19,0,36-B42)))","v":""},{"$f":"IF(G42=19,0,IF(ISBLANK(B42),\"\",IF(B42<18,1,IF(B42=18,2,IF(B42>18,3)))))","v":""},{"$f":"IF(G42=19,3,IF(ISBLANK(B42),\"\",IF(B42=19,0,IF(D42<18,1,IF(D42=18,2,IF(D42>=20,3))))))","v":""},null,null,null,null,null,{"$f":"IF(B42>D42,A42&C42,IF(D42>B42,C42&A42,\"/\"))","v":"/"},null,{"$f":"A42&C42","v":"AAAD"},{"$f":"E42","v":""},{"$f":"C42&A42","v":"ADAA"},{"$f":"F42","v":""},{"$f":"B42","v":0},{"$f":"D42","v":""}]
[{"$f":"A11","v":"AF"},null,{"$f":"A12","v":"AG"},{"$f":"IF(G43=19,19,IF(ISBLANK(B43),\"\",IF(B43=19,0,36-B43)))","v":""},{"$f":"IF(G43=19,0,IF(ISBLANK(B43),\"\",IF(B43<18,1,IF(B43=18,2,IF(B43>18,3)))))","v":""},{"$f":"IF(G43=19,3,IF(ISBLANK(B43),\"\",IF(B43=19,0,IF(D43<18,1,IF(D43=18,2,IF(D43>=20,3))))))","v":""},null,null,null,null,null,{"$f":"IF(B43>D43,A43&C43,IF(D43>B43,C43&A43,\"/\"))","v":"/"},null,{"$f":"A43&C43","v":"AFAG"},{"$f":"E43","v":""},{"$f":"C43&A43","v":"AGAF"},{"$f":"F43","v":""},{"$f":"B43","v":0},{"$f":"D43","v":""}]
[{"$f":"A7","v":"AB"},null,{"$f":"A8","v":"AC"},{"$f":"IF(G44=19,19,IF(ISBLANK(B44),\"\",IF(B44=19,0,36-B44)))","v":""},{"$f":"IF(G44=19,0,IF(ISBLANK(B44),\"\",IF(B44<18,1,IF(B44=18,2,IF(B44>18,3)))))","v":""},{"$f":"IF(G44=19,3,IF(ISBLANK(B44),\"\",IF(B44=19,0,IF(D44<18,1,IF(D44=18,2,IF(D44>=20,3))))))","v":""},null,null,null,null,null,{"$f":"IF(B44>D44,A44&C44,IF(D44>B44,C44&A44,\"/\"))","v":"/"},null,{"$f":"A44&C44","v":"ABAC"},{"$f":"E44","v":""},{"$f":"C44&A44","v":"ACAB"},{"$f":"F44","v":""},{"$f":"B44","v":0},{"$f":"D44","v":""}]
[{"$f":"A10","v":"AE"},null,{"$f":"A13","v":"AH"},{"$f":"IF(G45=19,19,IF(ISBLANK(B45),\"\",IF(B45=19,0,36-B45)))","v":""},{"$f":"IF(G45=19,0,IF(ISBLANK(B45),\"\",IF(B45<18,1,IF(B45=18,2,IF(B45>18,3)))))","v":""},{"$f":"IF(G45=19,3,IF(ISBLANK(B45),\"\",IF(B45=19,0,IF(D45<18,1,IF(D45=18,2,IF(D45>=20,3))))))","v":""},null,null,null,null,null,{"$f":"IF(B45>D45,A45&C45,IF(D45>B45,C45&A45,\"/\"))","v":"/"},null,{"$f":"A45&C45","v":"AEAH"},{"$f":"E45","v":""},{"$f":"C45&A45","v":"AHAE"},{"$f":"F45","v":""},{"$f":"B45","v":0},{"$f":"D45","v":""}]
[]
["5 éme MATCH le ","à",{"$f":"A10","v":"AE"}]
[null,null,null,null,null,null,"SI forfait éq recevante"]
["Equipes","score","Equipes","score","Points","Points"]
[{"$f":"A6","v":"AA"},null,{"$f":"A11","v":"AF"},{"$f":"IF(G50=19,19,IF(ISBLANK(B50),\"\",IF(B50=19,0,36-B50)))","v":""},{"$f":"IF(G50=19,0,IF(ISBLANK(B50),\"\",IF(B50<18,1,IF(B50=18,2,IF(B50>18,3)))))","v":""},{"$f":"IF(G50=19,3,IF(ISBLANK(B50),\"\",IF(B50=19,0,IF(D50<18,1,IF(D50=18,2,IF(D50>=20,3))))))","v":""},null,null,null,null,null,{"$f":"IF(B50>D50,A50&C50,IF(D50>B50,C50&A50,\"/\"))","v":"/"},null,{"$f":"A50&C50","v":"AAAF"},{"$f":"E50","v":""},{"$f":"C50&A50","v":"AFAA"},{"$f":"F50","v":""},{"$f":"B50","v":0},{"$f":"D50","v":""}]
[{"$f":"A9","v":"AD"},null,{"$f":"A13","v":"AH"},{"$f":"IF(G51=19,19,IF(ISBLANK(B51),\"\",IF(B51=19,0,36-B51)))","v":""},{"$f":"IF(G51=19,0,IF(ISBLANK(B51),\"\",IF(B51<18,1,IF(B51=18,2,IF(B51>18,3)))))","v":""},{"$f":"IF(G51=19,3,IF(ISBLANK(B51),\"\",IF(B51=19,0,IF(D51<18,1,IF(D51=18,2,IF(D51>=20,3))))))","v":""},null,null,null,null,null,{"$f":"IF(B51>D51,A51&C51,IF(D51>B51,C51&A51,\"/\"))","v":"/"},null,{"$f":"A51&C51","v":"ADAH"},{"$f":"E51","v":""},{"$f":"C51&A51","v":"AHAD"},{"$f":"F51","v":""},{"$f":"B51","v":0},{"$f":"D51","v":""}]
[{"$f":"A7","v":"AB"},null,{"$f":"A12","v":"AG"},{"$f":"IF(G52=19,19,IF(ISBLANK(B52),\"\",IF(B52=19,0,36-B52)))","v":""},{"$f":"IF(G52=19,0,IF(ISBLANK(B52),\"\",IF(B52<18,1,IF(B52=18,2,IF(B52>18,3)))))","v":""},{"$f":"IF(G52=19,3,IF(ISBLANK(B52),\"\",IF(B52=19,0,IF(D52<18,1,IF(D52=18,2,IF(D52>=20,3))))))","v":""},null,null,null,null,null,{"$f":"IF(B52>D52,A52&C52,IF(D52>B52,C52&A52,\"/\"))","v":"/"},null,{"$f":"A52&C52","v":"ABAG"},{"$f":"E52","v":""},{"$f":"C52&A52","v":"AGAB"},{"$f":"F52","v":""},{"$f":"B52","v":0},{"$f":"D52","v":""}]
[{"$f":"A8","v":"AC"},null,{"$f":"A10","v":"AE"},{"$f":"IF(G53=19,19,IF(ISBLANK(B53),\"\",IF(B53=19,0,36-B53)))","v":""},{"$f":"IF(G53=19,0,IF(ISBLANK(B53),\"\",IF(B53<18,1,IF(B53=18,2,IF(B53>18,3)))))","v":""},{"$f":"IF(G53=19,3,IF(ISBLANK(B53),\"\",IF(B53=19,0,IF(D53<18,1,IF(D53=18,2,IF(D53>=20,3))))))","v":""},null,null,null,null,null,{"$f":"IF(B53>D53,A53&C53,IF(D53>B53,C53&A53,\"/\"))","v":"/"},null,{"$f":"A53&C53","v":"ACAE"},{"$f":"E53","v":""},{"$f":"C53&A53","v":"AEAC"},{"$f":"F53","v":""},{"$f":"B53","v":0},{"$f":"D53","v":""}]
[]
["6 éme MATCH le ","à",{"$f":"A11","v":"AF"}]
[null,null,null,null,null,null,"SI forfait éq recevante"]
["Equipes","score","Equipes","score","Points","Points"]
[{"$f":"A7","v":"AB"},null,{"$f":"A9","v":"AD"},{"$f":"IF(G58=19,19,IF(ISBLANK(B58),\"\",IF(B58=19,0,36-B58)))","v":""},{"$f":"IF(G58=19,0,IF(ISBLANK(B58),\"\",IF(B58<18,1,IF(B58=18,2,IF(B58>18,3)))))","v":""},{"$f":"IF(G58=19,3,IF(ISBLANK(B58),\"\",IF(B58=19,0,IF(D58<18,1,IF(D58=18,2,IF(D58>=20,3))))))","v":""},null,null,null,null,null,{"$f":"IF(B58>D58,A58&C58,IF(D58>B58,C58&A58,\"/\"))","v":"/"},null,{"$f":"A58&C58","v":"ABAD"},{"$f":"E58","v":""},{"$f":"C58&A58","v":"ADAB"},{"$f":"F58","v":""},{"$f":"B58","v":0},{"$f":"D58","v":""}]
[{"$f":"A10","v":"AE"},null,{"$f":"A6","v":"AA"},{"$f":"IF(G59=19,19,IF(ISBLANK(B59),\"\",IF(B59=19,0,36-B59)))","v":""},{"$f":"IF(G59=19,0,IF(ISBLANK(B59),\"\",IF(B59<18,1,IF(B59=18,2,IF(B59>18,3)))))","v":""},{"$f":"IF(G59=19,3,IF(ISBLANK(B59),\"\",IF(B59=19,0,IF(D59<18,1,IF(D59=18,2,IF(D59>=20,3))))))","v":""},null,null,null,null,null,{"$f":"IF(B59>D59,A59&C59,IF(D59>B59,C59&A59,\"/\"))","v":"/"},null,{"$f":"A59&C59","v":"AEAA"},{"$f":"E59","v":""},{"$f":"C59&A59","v":"AAAE"},{"$f":"F59","v":""},{"$f":"B59","v":0},{"$f":"D59","v":""}]
[{"$f":"A12","v":"AG"},null,{"$f":"A8","v":"AC"},{"$f":"IF(G60=19,19,IF(ISBLANK(B60),\"\",IF(B60=19,0,36-B60)))","v":""},{"$f":"IF(G60=19,0,IF(ISBLANK(B60),\"\",IF(B60<18,1,IF(B60=18,2,IF(B60>18,3)))))","v":""},{"$f":"IF(G60=19,3,IF(ISBLANK(B60),\"\",IF(B60=19,0,IF(D60<18,1,IF(D60=18,2,IF(D60>=20,3))))))","v":""},null,null,null,null,null,{"$f":"IF(B60>D60,A60&C60,IF(D60>B60,C60&A60,\"/\"))","v":"/"},null,{"$f":"A60&C60","v":"AGAC"},{"$f":"E60","v":""},{"$f":"C60&A60","v":"ACAG"},{"$f":"F60","v":""},{"$f":"B60","v":0},{"$f":"D60","v":""}]
[{"$f":"A11","v":"AF"},null,{"$f":"A13","v":"AH"},{"$f":"IF(G61=19,19,IF(ISBLANK(B61),\"\",IF(B61=19,0,36-B61)))","v":""},{"$f":"IF(G61=19,0,IF(ISBLANK(B61),\"\",IF(B61<18,1,IF(B61=18,2,IF(B61>18,3)))))","v":""},{"$f":"IF(G61=19,3,IF(ISBLANK(B61),\"\",IF(B61=19,0,IF(D61<18,1,IF(D61=18,2,IF(D61>=20,3))))))","v":""},null,null,null,null,null,{"$f":"IF(B61>D61,A61&C61,IF(D61>B61,C61&A61,\"/\"))","v":"/"},null,{"$f":"A61&C61","v":"AFAH"},{"$f":"E61","v":""},{"$f":"C61&A61","v":"AHAF"},{"$f":"F61","v":""},{"$f":"B61","v":0},{"$f":"D61","v":""}]
[]
["7 éme MATCH le","à",{"$f":"A12","v":"AG"}]
[null,null,null,null,null,null,"SI forfait éq recevante",null," "]
["Equipes","score","Equipes","score","Points","Points"]
[{"$f":"A6","v":"AA"},null,{"$f":"A12","v":"AG"},{"$f":"IF(G66=19,19,IF(ISBLANK(B66),\"\",IF(B66=19,0,36-B66)))","v":""},{"$f":"IF(G66=19,0,IF(ISBLANK(B66),\"\",IF(B66<18,1,IF(B66=18,2,IF(B66>18,3)))))","v":""},{"$f":"IF(G66=19,3,IF(ISBLANK(B66),\"\",IF(B66=19,0,IF(D66<18,1,IF(D66=18,2,IF(D66>=20,3))))))","v":""},null,null,null,null,null,{"$f":"IF(B66>D66,A66&C66,IF(D66>B66,C66&A66,\"/\"))","v":"/"},null,{"$f":"A66&C66","v":"AAAG"},{"$f":"E66","v":""},{"$f":"C66&A66","v":"AGAA"},{"$f":"F66","v":""},{"$f":"B66","v":0},{"$f":"D66","v":""}]
[{"$f":"A7","v":"AB"},null,{"$f":"A11","v":"AF"},{"$f":"IF(G67=19,19,IF(ISBLANK(B67),\"\",IF(B67=19,0,36-B67)))","v":""},{"$f":"IF(G67=19,0,IF(ISBLANK(B67),\"\",IF(B67<18,1,IF(B67=18,2,IF(B67>18,3)))))","v":""},{"$f":"IF(G67=19,3,IF(ISBLANK(B67),\"\",IF(B67=19,0,IF(D67<18,1,IF(D67=18,2,IF(D67>=20,3))))))","v":""},null,null,null,null,null,{"$f":"IF(B67>D67,A67&C67,IF(D67>B67,C67&A67,\"/\"))","v":"/"},null,{"$f":"A67&C67","v":"ABAF"},{"$f":"E67","v":""},{"$f":"C67&A67","v":"AFAB"},{"$f":"F67","v":""},{"$f":"B67","v":0},{"$f":"D67","v":""}]
[{"$f":"A10","v":"AE"},null,{"$f":"A9","v":"AD"},{"$f":"IF(G68=19,19,IF(ISBLANK(B68),\"\",IF(B68=19,0,36-B68)))","v":""},{"$f":"IF(G68=19,0,IF(ISBLANK(B68),\"\",IF(B68<18,1,IF(B68=18,2,IF(B68>18,3)))))","v":""},{"$f":"IF(G68=19,3,IF(ISBLANK(B68),\"\",IF(B68=19,0,IF(D68<18,1,IF(D68=18,2,IF(D68>=20,3))))))","v":""},null,null,null,null,null,{"$f":"IF(B68>D68,A68&C68,IF(D68>B68,C68&A68,\"/\"))","v":"/"},null,{"$f":"A68&C68","v":"AEAD"},{"$f":"E68","v":""},{"$f":"C68&A68","v":"ADAE"},{"$f":"F68","v":""},{"$f":"B68","v":0},{"$f":"D68","v":""}]
[{"$f":"A8","v":"AC"},null,{"$f":"A13","v":"AH"},{"$f":"IF(G69=19,19,IF(ISBLANK(B69),\"\",IF(B69=19,0,36-B69)))","v":""},{"$f":"IF(G69=19,0,IF(ISBLANK(B69),\"\",IF(B69<18,1,IF(B69=18,2,IF(B69>18,3)))))","v":""},{"$f":"IF(G69=19,3,IF(ISBLANK(B69),\"\",IF(B69=19,0,IF(D69<18,1,IF(D69=18,2,IF(D69>=20,3))))))","v":""},null,null,null,null,null,{"$f":"IF(B69>D69,A69&C69,IF(D69>B69,C69&A69,\"/\"))","v":"/"},null,{"$f":"A69&C69","v":"ACAH"},{"$f":"E69","v":""},{"$f":"C69&A69","v":"AHAC"},{"$f":"F69","v":""},{"$f":"B69","v":0},{"$f":"D69","v":""}]
[null,null,"CLASSEMENT",null,null,null,"Classt        Final","Rencontres entre exaequos"]
["EQUIPES",null,"POINTS","POUR","CONTRE","DIFF",null,"POINTS Exaequos","Exaq","n°",{"$f":"A6","v":"AA"},{"$f":"A7","v":"AB"},{"$f":"A8","v":"AC"},{"$f":"A9","v":"AD"},{"$f":"A10","v":"AE"},{"$f":"A11","v":"AF"},{"$f":"A12","v":"AG"},{"$f":"A13","v":"AH"},"Pts matchs",null,null,null,"1000000*Pts matchs +1000 (Diff +  abs(diff mini) )+Pour ","RANG","DIFF Exaequos","POUR Exaequos"]
[null,"1A",0,0,0,0,1,{"$f":"IF(S72>0,S72,\"\")","v":{"$error":"#N/A"}},{"$f":"COUNTIF($C$72:$C$79,C72)","v":8},{"$f":"IF(AND(I72>1,COUNTIFS(I$72:I72,I72,C$72:C72,C72)=1),MAX(J$71:J71)+1,\"\")","v":1},{"$f":"IF($A72=K$71,\"\",IF(INDEX($C$72:$C$79,MATCH(K$71,$A$72:$A$79,0))=$C72,IFERROR(VLOOKUP($A72&K$71,$N$18:$O$69,2,0),  VLOOKUP(K$71&$A72,$N$18:$Q$69,4,0)),          \"\"))","v":{"$error":"#N/A"}},{"$error":"#N/A"},{"$error":"#N/A"},{"$error":"#N/A"},{"$error":"#N/A"},{"$error":"#N/A"},{"$error":"#N/A"},{"$error":"#N/A"},{"$f":"SUM(K72:R72)","v":{"$error":"#N/A"}},null,null,null,{"$f":"IF(I72<3,S72*1000000+(F72+ABS(MIN($F$72:$F$79)))*1000+D72,S72*1000000+U96*1000+Z72)","v":{"$error":"#N/A"}},{"$f":"IF(I72>2,RANK(W72,OFFSET(W$71,MATCH(I72,$I$72:$I$79,0),,I72)))","v":{"$error":"#N/A"}},{"$f":"IF(S96=0,\"\",S96)","v":{"$error":"#N/A"}},{"$f":"IF(S80=0,\"\",S80)","v":{"$error":"#N/A"}}]
[null,"1B",0,0,0,0,2,{"$error":"#N/A"},8,{"$f":"IF(AND(I73>1,COUNTIFS(I$72:I73,I73,C$72:C73,C73)=1),MAX(J$71:J72)+1,\"\")","v":""},{"$error":"#N/A"},{"$error":"#N/A"},{"$error":"#N/A"},{"$error":"#N/A"},{"$error":"#N/A"},{"$error":"#N/A"},{"$error":"#N/A"},{"$error":"#N/A"},{"$f":"SUM(K73:R73)","v":{"$error":"#N/A"}},null,null,null,{"$f":"IF(I73<3,S73*1000000+(F73+ABS(MIN($F$72:$F$79)))*1000+D73,S73*1000000+U97*1000+Z73)","v":{"$error":"#N/A"}},{"$f":"IF(I73>2,RANK(W73,OFFSET(W$71,MATCH(I73,$I$72:$I$79,0),,I73)))","v":{"$error":"#N/A"}},{"$error":"#N/A"},{"$error":"#N/A"}]
[null,"1C",0,0,0,0,3,{"$error":"#N/A"},8,{"$f":"IF(AND(I74>1,COUNTIFS(I$72:I74,I74,C$72:C74,C74)=1),MAX(J$71:J73)+1,\"\")","v":""},{"$error":"#N/A"},{"$error":"#N/A"},{"$error":"#N/A"},{"$error":"#N/A"},{"$error":"#N/A"},{"$error":"#N/A"},{"$error":"#N/A"},{"$error":"#N/A"},{"$error":"#N/A"},null,null,null,{"$error":"#N/A"},{"$error":"#N/A"},{"$error":"#N/A"},{"$error":"#N/A"}]
[null,"1D",0,0,0,0,4,{"$error":"#N/A"},8,{"$f":"IF(AND(I75>1,COUNTIFS(I$72:I75,I75,C$72:C75,C75)=1),MAX(J$71:J74)+1,\"\")","v":""},{"$error":"#N/A"},{"$error":"#N/A"},{"$error":"#N/A"},{"$error":"#N/A"},{"$error":"#N/A"},{"$error":"#N/A"},{"$error":"#N/A"},{"$error":"#N/A"},{"$error":"#N/A"},null,null,null,{"$error":"#N/A"},{"$error":"#N/A"},{"$error":"#N/A"},{"$error":"#N/A"}]
[null,"1E",0,0,0,0,5,{"$error":"#N/A"},8,{"$f":"IF(AND(I76>1,COUNTIFS(I$72:I76,I76,C$72:C76,C76)=1),MAX(J$71:J75)+1,\"\")","v":""},{"$error":"#N/A"},{"$error":"#N/A"},{"$error":"#N/A"},{"$error":"#N/A"},{"$error":"#N/A"},{"$error":"#N/A"},{"$error":"#N/A"},{"$error":"#N/A"},{"$error":"#N/A"},null,null,null,{"$error":"#N/A"},{"$error":"#N/A"},{"$error":"#N/A"},{"$error":"#N/A"}]
[null,"1F",0,0,0,0,6,{"$error":"#N/A"},8,{"$f":"IF(AND(I77>1,COUNTIFS(I$72:I77,I77,C$72:C77,C77)=1),MAX(J$71:J76)+1,\"\")","v":""},{"$error":"#N/A"},{"$error":"#N/A"},{"$error":"#N/A"},{"$error":"#N/A"},{"$error":"#N/A"},{"$error":"#N/A"},{"$error":"#N/A"},{"$error":"#N/A"},{"$error":"#N/A"},null,null,null,{"$error":"#N/A"},{"$error":"#N/A"},{"$error":"#N/A"},{"$error":"#N/A"}]
[null,"1G",0,0,0,0,7,{"$error":"#N/A"},8,{"$f":"IF(AND(I78>1,COUNTIFS(I$72:I78,I78,C$72:C78,C78)=1),MAX(J$71:J77)+1,\"\")","v":""},{"$error":"#N/A"},{"$error":"#N/A"},{"$error":"#N/A"},{"$error":"#N/A"},{"$error":"#N/A"},{"$error":"#N/A"},{"$error":"#N/A"},{"$error":"#N/A"},{"$error":"#N/A"},null,null,null,{"$error":"#N/A"},{"$error":"#N/A"},{"$error":"#N/A"},{"$error":"#N/A"}]
[null,"1H",0,0,0,0,8,{"$error":"#N/A"},8,{"$f":"IF(AND(I79>1,COUNTIFS(I$72:I79,I79,C$72:C79,C79)=1),MAX(J$71:J78)+1,\"\")","v":""},{"$error":"#N/A"},{"$error":"#N/A"},{"$error":"#N/A"},{"$error":"#N/A"},{"$error":"#N/A"},{"$error":"#N/A"},{"$error":"#N/A"},{"$error":"#N/A"},{"$error":"#N/A"},null,null,null,{"$error":"#N/A"},{"$error":"#N/A"},{"$error":"#N/A"},{"$error":"#N/A"}]
[null,null,null,null,null,null,null,null,"POUR",{"$f":"A72","v":0},{"$f":"IF($A72=K$71,\"\",IF(INDEX($C$72:$C$79,MATCH(K$71,$A$72:$A$79,0))=$C72,IFERROR(VLOOKUP($A72&K$71,$N$18:$R$69,5,0),  VLOOKUP(K$71&$A72,$N$18:$S$69,6,0)),          \"\"))","v":{"$error":"#N/A"}},{"$error":"#N/A"},{"$error":"#N/A"},{"$error":"#N/A"},{"$error":"#N/A"},{"$error":"#N/A"},{"$error":"#N/A"},{"$error":"#N/A"},{"$error":"#N/A"}]
[null,null,null,null,null,null,null,null,null,0,{"$error":"#N/A"},{"$error":"#N/A"},{"$error":"#N/A"},{"$error":"#N/A"},{"$error":"#N/A"},{"$error":"#N/A"},{"$error":"#N/A"},{"$error":"#N/A"},{"$error":"#N/A"}]
[null,null,null,null,null,null,null,null,null,0,{"$error":"#N/A"},{"$error":"#N/A"},{"$error":"#N/A"},{"$error":"#N/A"},{"$error":"#N/A"},{"$error":"#N/A"},{"$error":"#N/A"},{"$error":"#N/A"},{"$error":"#N/A"}]
[null,null,null,null,null,null,null,null,null,0,{"$error":"#N/A"},{"$error":"#N/A"},{"$error":"#N/A"},{"$error":"#N/A"},{"$error":"#N/A"},{"$error":"#N/A"},{"$error":"#N/A"},{"$error":"#N/A"},{"$error":"#N/A"}]
[null,null,null,null,null,null,null,null,null,0,{"$error":"#N/A"},{"$error":"#N/A"},{"$error":"#N/A"},{"$error":"#N/A"},{"$error":"#N/A"},{"$error":"#N/A"},{"$error":"#N/A"},{"$error":"#N/A"},{"$error":"#N/A"},null,null,null,null,null,"  "]
[null,null,null,null,null,null,null,null,null,0,{"$error":"#N/A"},{"$error":"#N/A"},{"$error":"#N/A"},{"$error":"#N/A"},{"$error":"#N/A"},{"$error":"#N/A"},{"$error":"#N/A"},{"$error":"#N/A"},{"$error":"#N/A"}]
[null,null,null,null,null,null,null,null,null,0,{"$error":"#N/A"},{"$error":"#N/A"},{"$error":"#N/A"},{"$error":"#N/A"},{"$error":"#N/A"},{"$error":"#N/A"},{"$error":"#N/A"},{"$error":"#N/A"},{"$error":"#N/A"}]
[null,null,null,null,null,null,null,null,null,0,{"$error":"#N/A"},{"$error":"#N/A"},{"$error":"#N/A"},{"$error":"#N/A"},{"$error":"#N/A"},{"$error":"#N/A"},{"$error":"#N/A"},{"$error":"#N/A"},{"$error":"#N/A"}]
[null,null,null,null,null,null,null,null,"CONTRE",{"$f":"J80","v":0},{"$f":"INDEX($K$80:$R$87,MATCH(K$71,$J$80:$J$87,0),MATCH($J80,$K$71:$R$71,0))","v":{"$error":"#N/A"}},{"$f":"INDEX($K$80:$R$87,MATCH(L$71,$J$80:$J$87,0),MATCH($J80,$K$71:$R$71,0))","v":{"$error":"#N/A"}},{"$error":"#N/A"},{"$error":"#N/A"},{"$error":"#N/A"},{"$error":"#N/A"},{"$error":"#N/A"},{"$error":"#N/A"},{"$error":"#N/A"}]
[null,null,null,null,null,null,null,null,null,{"$f":"J81","v":0},{"$f":"INDEX($K$80:$R$87,MATCH(K$71,$J$80:$J$87,0),MATCH($J81,$K$71:$R$71,0))","v":{"$error":"#N/A"}},{"$error":"#N/A"},{"$error":"#N/A"},{"$error":"#N/A"},{"$error":"#N/A"},{"$error":"#N/A"},{"$error":"#N/A"},{"$error":"#N/A"},{"$error":"#N/A"}]
[null,null,null,null,null,null,null,null,null,0,{"$error":"#N/A"},{"$error":"#N/A"},{"$error":"#N/A"},{"$error":"#N/A"},{"$error":"#N/A"},{"$error":"#N/A"},{"$error":"#N/A"},{"$error":"#N/A"},{"$error":"#N/A"}]
[null,null,null,null,null,null,null,null,null,0,{"$error":"#N/A"},{"$error":"#N/A"},{"$error":"#N/A"},{"$error":"#N/A"},{"$error":"#N/A"},{"$error":"#N/A"},{"$error":"#N/A"},{"$error":"#N/A"},{"$error":"#N/A"}]
[null,null,null,null,null,null,null,null,null,0,{"$error":"#N/A"},{"$error":"#N/A"},{"$error":"#N/A"},{"$error":"#N/A"},{"$error":"#N/A"},{"$error":"#N/A"},{"$error":"#N/A"},{"$error":"#N/A"},{"$error":"#N/A"}]
[null,null,null,null,null,null,null,null,null,0,{"$error":"#N/A"},{"$error":"#N/A"},{"$error":"#N/A"},{"$error":"#N/A"},{"$error":"#N/A"},{"$error":"#N/A"},{"$error":"#N/A"},{"$error":"#N/A"},{"$error":"#N/A"}]
[null,null,null,null,null,null,null,null,null,0,{"$error":"#N/A"},{"$error":"#N/A"},{"$error":"#N/A"},{"$error":"#N/A"},{"$error":"#N/A"},{"$error":"#N/A"},{"$error":"#N/A"},{"$error":"#N/A"},{"$error":"#N/A"}]
[null,null,null,null,null,null,null,null,null,0,{"$error":"#N/A"},{"$error":"#N/A"},{"$error":"#N/A"},{"$error":"#N/A"},{"$error":"#N/A"},{"$error":"#N/A"},{"$error":"#N/A"},{"$error":"#N/A"},{"$error":"#N/A"},null,"Diff pondérée"]
[null,null,null,null,null,null,null,null,"DIFF",{"$f":"J88","v":0},null,null,null,null,null,null,null,null,{"$f":"S80-S88","v":{"$error":"#N/A"}},null,{"$f":"S96+ABS(MIN($S$96:$S$103))","v":{"$error":"#N/A"}}]
[null,null,null,null,null,null,null,null,null,{"$f":"J89","v":0},null,null,null,null,null,null,null,null,{"$f":"S81-S89","v":{"$error":"#N/A"}},null,{"$error":"#N/A"}]
[null,null,null,null,null,null,null,null,null,0,null,null,null,null,null,null,null,null,{"$error":"#N/A"},null,{"$error":"#N/A"}]
[null,null,null,null,null,null,null,null,null,0,null,null,null,null,null,null,null,null,{"$error":"#N/A"},null,{"$error":"#N/A"}]
[null,null,null,null,null,null,null,null,null,0,null,null,null,null,null,null,null,null,{"$error":"#N/A"},null,{"$error":"#N/A"}]
[null,null,null,null,null,null,null,null,null,0,null,null,null,null,null,null,null,null,{"$error":"#N/A"},null,{"$error":"#N/A"}]
[null,null,null,null,null,null,null,null,null,0,null,null,null,null,null,null,null,null,{"$error":"#N/A"},null,{"$f":"S102+ABS(MIN($S$96:$S$103))","v":{"$error":"#N/A"}}]
[null,null,null,null,null,null,null,null,null,0,null,null,null,null,null,null,null,null,{"$error":"#N/A"},null,{"$f":"S103+ABS(MIN($S$96:$S$103))","v":{"$error":"#N/A"}}]

{"sheet":"Résultats Poules","index":8,"n_rows":11,"n_cols":9,"rows_kept":11,"cut":false,"hidden":false,"merged":[[1,2,2,2],[1,4,2,4]]}
[]
[null,null,"POULES","1er","POINTS","1 er exaequo","2 ème","7 ème","7 ème exaequo                    ou 8 ème"]
[null,null,null,"EQUIPES",null,"EQUIPES","EQUIPES","EQUIPES","EQUIPES"]
[null,null,1,{"$f":"IF('P1'!A$72=\"\",\"\",'P1'!A$72)","v":"Club Hirondelle"},{"$f":"IF('P1'!C$72=\"\",\"\",'P1'!C$72)","v":17},{"$f":"IF('P1'!G$73=1,'P1'!A$73,\"\")","v":""},{"$f":"IF('P1'!A$73=\"\",\"\",'P1'!A$73)","v":"Club Baleine"},{"$f":"IF('P1'!A$78=\"\",\"\",'P1'!A$78)","v":"Club Girafe"},{"$f":"IF('P1'!A$79=\"\",\"\",'P1'!A$79)","v":"Club Fourmi"}]
[null,null,2,{"$f":"IF('P2'!A$72=\"\",\"\",'P2'!A$72)","v":"Club Marsouin"},{"$f":"IF('P2'!C$72=\"\",\"\",'P2'!C$72)","v":19},{"$f":"IF('P2'!G$73=1,'P2'!A$73,\"\")","v":""},{"$f":"IF('P2'!A$73=\"\",\"\",'P2'!A$73)","v":"Club Jaguar"},{"$f":"IF('P2'!A$78=\"\",\"\",'P2'!A$78)","v":"Club Leopard"},{"$f":"IF('P2'!A$79=\"\",\"\",'P2'!A$79)","v":"Club Panthere"}]
[null,null,3,{"$f":"IF('P3'!A$72=\"\",\"\",'P3'!A$72)","v":""},{"$f":"IF('P3'!C$72=\"\",\"\",'P3'!C$72)","v":0},{"$f":"IF('P3'!G$73=1,'P3'!A$73,\"\")","v":""},{"$f":"IF('P3'!A$73=\"\",\"\",'P3'!A$73)","v":""},{"$f":"IF('P3'!A$78=\"\",\"\",'P3'!A$78)","v":""},{"$f":"IF('P3'!A$79=\"\",\"\",'P3'!A$79)","v":""}]
[null,null,4,{"$f":"IF('P4'!A$72=\"\",\"\",'P4'!A$72)","v":""},{"$f":"IF('P4'!C$72=\"\",\"\",'P4'!C$72)","v":0},{"$f":"IF('P4'!G$73=1,'P4'!A$73,\"\")","v":""},{"$f":"IF('P4'!A$73=\"\",\"\",'P4'!A$73)","v":""},{"$f":"IF('P4'!A$78=\"\",\"\",'P4'!A$78)","v":""},{"$f":"IF('P4'!A$79=\"\",\"\",'P4'!A$79)","v":""}]
[null,null,5,{"$f":"IF('P5'!A$72=\"\",\"\",'P5'!A$72)","v":""},{"$f":"IF('P5'!C$72=\"\",\"\",'P5'!C$72)","v":0},{"$f":"IF('P5'!G$73=1,'P5'!A$73,\"\")","v":""},{"$f":"IF('P5'!A$73=\"\",\"\",'P5'!A$73)","v":""},{"$f":"IF('P5'!A$78=\"\",\"\",'P5'!A$78)","v":""},{"$f":"IF('P5'!A$79=\"\",\"\",'P5'!A$79)","v":""}]
[null,null,6,{"$f":"IF('P6'!A$72=\"\",\"\",'P6'!A$72)","v":""},{"$f":"IF('P6'!C$72=\"\",\"\",'P6'!C$72)","v":0},{"$f":"IF('P6'!G$73=1,'P6'!A$73,\"\")","v":""},{"$f":"IF('P6'!A$73=\"\",\"\",'P6'!A$73)","v":""},{"$f":"IF('P6'!A$78=\"\",\"\",'P6'!A$78)","v":""},{"$f":"IF('P6'!A$79=\"\",\"\",'P6'!A$79)","v":""}]
[null,null,7,{"$f":"IF('P7'!A$72=\"\",\"\",'P7'!A$72)","v":""},{"$f":"IF('P7'!C$72=\"\",\"\",'P7'!C$72)","v":0},{"$f":"IF('P7'!G$73=1,'P7'!A$73,\"\")","v":""},{"$f":"IF('P7'!A$73=\"\",\"\",'P7'!A$73)","v":""},{"$f":"IF('P7'!A$78=\"\",\"\",'P7'!A$78)","v":""},{"$f":"IF('P7'!A$79=\"\",\"\",'P7'!A$79)","v":""}]
[null,null,8,{"$f":"IF('P8'!A$72=\"\",\"\",'P8'!A$72)","v":""},{"$f":"IF('P8'!C$72=\"\",\"\",'P8'!C$72)","v":0},{"$f":"IF('P8'!G$73=1,'P8'!A$73,\"\")","v":""},{"$f":"IF('P8'!A$73=\"\",\"\",'P8'!A$73)","v":""},{"$f":"IF('P8'!A$78=\"\",\"\",'P8'!A$78)","v":""},{"$f":"IF('P8'!A$79=\"\",\"\",'P8'!A$79)","v":""}]