{"text_format":"1","workbook":"xlsx","n_sheets":12,"sheets":["Acceuil","TCD2","TCD1","data","Base_données","Base_Parrain","Base_Filleul","Stastisque","SaveData","Grand_Est","Feuil1","Feuil2"],"not_rendered":{"charts":0,"images":0,"macros":1,"external_links":1,"defined_names":111,"comments":0,"pivot_tables":2},"unopened":[],"bounds":{"document_bytes":16777216,"sheet_cells":100000,"rows_first":2000,"rows_last":500,"rows_between":2000,"halvings":0,"cell_chars":16384,"cell_head_chars":4096},"cells_cut":0,"cells_raw":0,"read":"whole","date_system":"1900"}

{"sheet":"Acceuil","index":0,"n_rows":0,"n_cols":0,"rows_kept":0,"cut":false,"hidden":false,"merged":[]}

{"sheet":"TCD2","index":1,"n_rows":88,"n_cols":3,"rows_kept":88,"cut":false,"hidden":false,"merged":[]}
["MOIS",2]
["Sem",8]
["Commercial","(Tous)"]
["nom\nParrain","(Plusieurs éléments)"]
["prénom\nParrain","(Tous)"]
[]
["Étiquettes de lignes","Nb pose effectue","Somme en M²"]
["client 112 Nom",1,204]
["client 112 Prénom",1,204]
["client 126 Nom",1,201]
{"$rows_left_out":79}
{"sheet":"TCD1","index":2,"n_rows":9,"n_cols":3,"rows_kept":9,"cut":false,"hidden":false,"merged":[]}
[]
[]
["Commercial","ANTOINE"]
["MOIS",2]
["Sem",5]
[]
["Étiquettes de lignes","Nb pose effectue","Somme en M²"]
["client 94 Nom",7,1120]
["Total général",7,1120]

{"sheet":"data","index":3,"n_rows":209,"n_cols":31,"rows_kept":209,"cut":false,"hidden":true,"merged":[]}
["Code","Nom Parrain\nFilleul ","Année","MOIS","Sem","N°-Parrain","N°- filleul","Couple P & F","Parrain\nNb. filleul","Parrain\nfilleul","Date","Commercial","nom\nParrain","prénom\nParrain","Téléphone\nParrain","nom\nFilleul","Prénom\nFilleul","Téléphone\nFilleul","N°- Rue","Nom Rue","CP","Commune","Date\n Phonning","relance1","relance2","Résultat\nPhonning","date/rdv client","Vente","date de pose","Pose en M²","pose effectue"]
["2022_5_C1_P_1-000","Parrain client 139 Nom client 139 Prénom",2022,2,5,1,0,"P1_000",5,"P","2022-02-01","JEAN","client 139 Nom","client 139 Prénom",660546033,null,null,null,38,"Rue du village BU",10500,"LASSICOURT","2022-01-15","Ok","Ok","Ok","2022-03-02","Ok","2022-03-06",160,"Ok"]
["2022_5_C1_P_1-F-16","Parrain client 139 Nom client 139 Prénom Filleul client 81 Nom client 81 Prénom",2022,2,5,1,1,"P-1_000_F-1",0,"F","2022-02-01","JEAN","client 139 Nom","client 139 Prénom",660546033,"client 81 Nom","client 81 Prénom",620781576,146,"Rue du village CB",10500,"PERTHES LES BRIENNE","2022-01-15","Ok","Ok","Ok","2022-03-02","Ok","2022-03-06",160,"Ok"]
["2022_5_C1_P_1-F-15","Parrain client 139 Nom client 139 Prénom Filleul client 63 Nom client 63 Prénom",2022,2,5,1,2,"P-1_000_F-2",0,"F","2022-02-01","JEAN","client 139 Nom","client 139 Prénom",660546033,"client 63 Nom","client 63 Prénom",626583590,136,"Rue du village BJ",10500,"CHAUMESNIL","2022-01-15","Ok","Ok","Ok","2022-03-02","Ok","2022-03-06",160,"Ok"]
["2022_5_C1_P_1-F-14","Parrain client 139 Nom client 139 Prénom Filleul client 86 Nom client 86 Prénom",2022,2,5,1,3,"P-1_000_F-3",0,"F","2022-02-01","JEAN","client 139 Nom","client 139 Prénom",660546033,"client 86 Nom","client 86 Prénom",673909860,213,"Rue du village CG",10500,"RANCES","2022-01-15","Ok","Ok","Ok","2022-03-02","Ok","2022-03-06",160,"Ok"]
["2022_5_C1_P_1-F-13","Parrain client 139 Nom client 139 Prénom Filleul client 92 Nom client 92 Prénom",2022,2,5,1,4,"P-1_000_F-4",0,"F","2022-02-01","JEAN","client 139 Nom","client 139 Prénom",660546033,"client 92 Nom","client 92 Prénom",688315052,79,"Rue du village CM",10400,"AVANT LES MARCILLY","2022-01-15","Ok","nok","nok",null,"nok",null,null,"NoK"]
["2022_5_C1_P_1-F-12","Parrain client 139 Nom client 139 Prénom Filleul client 35 Nom client 35 Prénom",2022,2,5,1,5,"P-1_000_F-5",0,"F","2022-02-01","JEAN","client 139 Nom","client 139 Prénom",660546033,"client 35 Nom","client 35 Prénom",648803279,179,"Rue du village AH",10340,"BAGNEUX LA FOSSE","2022-01-15","Ok","Ok","Ok","2022-03-02","Ok","2022-03-06",160,"Ok"]
["2022_5_C1_P_1-F-11","Parrain client 139 Nom client 139 Prénom Filleul client 98 Nom client 98 Prénom",2022,2,5,1,6,"P-1_000_F-6",0,"F","2022-02-01","JEAN","client 139 Nom","client 139 Prénom",660546033,"client 98 Nom","client 98 Prénom",677819310,166,"Rue du village CS",10400,"FONTAINE MACON","2022-01-15","Ok","Ok","Ok","2022-03-02","Ok","2022-03-06",160,"Ok"]
["2022_5_C2_P_2-000","Parrain client 54 Nom client 54 Prénom",2022,2,5,2,0,"P2_000",5,"P","2022-02-01","PASCAL","client 54 Nom","client 54 Prénom",619306489,null,null,null,114,"Rue du village BO",10500,"EPOTHEMONT","2022-01-15","Ok","Ok","Ok","2022-03-02","Ok","2022-03-06",200,"Ok"]
["2022_5_C2_P_2-F-10","Parrain client 54 Nom client 54 Prénom Filleul client 89 Nom client 89 Prénom",2022,2,5,2,7,"P-2_000_F-7",0,"F","2022-02-01","PASCAL","client 54 Nom","client 54 Prénom",619306489,"client 89 Nom","client 89 Prénom",671364202,133,"Rue du village CJ",10500,"ST LEGER SOUS BRIENNE","2022-01-15","Ok","Ok","Ok","2022-03-02","Ok","2022-03-06",160,"Ok"]
{"$rows_left_out":200}
{"sheet":"Base_données","index":4,"n_rows":44,"n_cols":12,"rows_kept":44,"cut":false,"hidden":false,"merged":[]}
["Code","Date","Commercial","Date\n Phonning","relance1","relance2","Résultat\nPhonning","date/rdv client","Vente","date de pose","Pose en M²","pose effectue"]
["2022_04_17_C1-P-34-000","2022-04-26","JEAN","20/05/2022","Oui","Oui","Oui","31/05/2022","Oui","31/05/2022","562","Oui"]
["2022_04_17_C1-P-34-F-186","2022-04-26","JEAN","21/05/2022","Oui","Oui","Oui","01/06/2022","Oui","31/05/2022","500","Oui"]
["2022_04_17_C1-P-35-000","2022-04-29","JEAN","22/05/2022","Oui","Oui","Non","02/06/2022","Oui","31/05/2022","597","Oui"]
["2022_04_17_C1-P-35-F-187","2022-04-29","JEAN","23/05/2022","Oui","Oui","Oui","03/06/2022","Non","31/05/2022","654","Non"]
["2022_04_17_C1-P-35-F-188","2022-04-29","JEAN","24/05/2022","Oui","Non","Non","04/06/2022","Oui","31/05/2022","789","Oui"]
["2022_04_17_C1-P-35-F-189","2022-04-29","JEAN","25/05/2022","Oui","Oui","Oui","05/06/2022","Non","31/05/2022","357","Non"]
["2022_04_17_C1-P-35-F-190","2022-04-29","JEAN","26/05/2022","23/05/2022","Non","Non","06/06/2022","Oui","31/05/2022","258","26/05/2022"]
["2022_04_17_C3-P-37-000","2022-04-29","THIERRY","27/05/2022","Oui","Oui","Oui","07/06/2022","Non","31/05/2022","693","Non"]
["2022_04_17_C3-P-37-F-192","2022-04-29","THIERRY","28/05/2022","Oui","Non","Non","08/06/2022","Oui","31/05/2022","250","Oui"]
{"$rows_left_out":35}
{"sheet":"Base_Parrain","index":5,"n_rows":18,"n_cols":11,"rows_kept":18,"cut":false,"hidden":false,"merged":[]}
["Code","Date","Nom","Prénom","Téléphone","N°- Rue","Nom Rue","Departement","Code Postal","Nb Filleul","Numero Parrain"]
["2022_04_17_C1-P-34-000","2022-05-09","Macheprot","Achille","02 02 02 02 02",4661,"gvezVGZgvzGVZEZVRRSBSR","08","8000","MINAUCOURT LE MESNIL LES HURL",13]
["2022_04_17_C1-P-35-000","2022-04-29","Exrctvybuni,","Wzexrctvybuni,","99 99 99 99 99",555,"chez nous","55","77777","XERCTVBYUN,IO"]
["2022_04_17_C3-P-37-000","2022-04-29","Jghfgd F","Ghs Fgdfs","44 44 44 44 44",5555,"lykujrht","67","67113","BLAESHEIM"]
["2022_04_17_C3-P-38-000","2022-04-29","Zqeg<srwxt","Zfqe<gsrwdtx","11 11 11 11 11",1111,"1111111111111","68","68120","RICHWILLER"]
["2022_04_17_C5-P-39-000","2022-04-29","Qzfsedgwr","Fffffffffffffffffff","44 44 44 44 44",4444,"444444444444444444","54","54110","DOMBASLE SUR MEURTHE"]
["2022_05_18_C4-P-40-000","2022-05-05","Wxctvybu","Sdfègh","55 55 55 55 55",5555,"rxtcybu",24,"55555","5555555555"]
["2022_05_18_C4-P-41-000","2022-05-08","Zdesft","Sqzdsertfg","44 44 44 44 44",4444,"dzrdfgfzadfetrdthg","55","55555","FERDHRR"]
["2022_05_19_C4-P-2-000","2022-05-11","Riviere","Jean","22 22 22 22 22",2222,"222222222222222222222","67","67000","ASCFTY"]
["2022_05_19_C4-P-6-000","2022-05-12","Riviere","Jean","22 22 22 22 22",2222,"222222222222222222222","67","67777","ASCFTY"]
{"$rows_left_out":9}
{"sheet":"Base_Filleul","index":6,"n_rows":27,"n_cols":11,"rows_kept":27,"cut":false,"hidden":false,"merged":[]}
["Code","Date","Nom","Prénom","Téléphone","N°- Rue","Nom Rue","Departement","Code Postal","Commune","Numero Filleul"]
["2022_04_17_C1-P-34-F-186","2022-04-26","Aegzhret","Zfaerhtj","2 02 02 02 02",999,",yfrntdebr","88","3030","YRSRRNR",30]
["2022_04_17_C1-P-35-F-187","2022-04-29","Exrctvybuni,","Wzexrctvybuni,","99 99 99 99 99",111,"tyrhe","51","51110","ISLES SUR SUIPPE"]
["2022_04_17_C1-P-35-F-188","2022-04-29","Exrctvybuni,","Wzexrctvybuni,","99 99 99 99 99",0,";yu,nrtber",12,"44444","YURHTE"]
["2022_04_17_C1-P-35-F-189","2022-04-29","Exrctvybuni,","Wzexrctvybuni,","99 99 99 99 99",888,"y,utnrbt","51","33333","UYNHTBGR"]
["2022_04_17_C1-P-35-F-190","2022-04-29","Exrctvybuni,","Wzexrctvybuni,","99 99 99 99 99",222,"_mrèi;uyjrther","88","88888","T,YRNTEBR"]
["2022_04_17_C3-P-37-F-192","2022-04-29","Jghfgd F","Ghs Fgdfs","44 44 44 44 44",2222,"sdfghcg",16,"22222","DGSFGHGC"]
["2022_04_17_C3-P-38-F-193","2022-04-29","Durand","Loiu","44 44 44 44 44",7777,"77777777777777777","55","55130","DELOUZE ROSIERES"]
["2022_04_17_C3-P-38-F-194","2022-04-29","Zqeg<srwxt","Zfqe<gsrwdtx","11 11 11 11 11",4444,"444444444444444444444444",19,"","4444444"]
["2022_04_17_C5-P-39-F-195","2022-04-29","Tttttttttttttttt","Zwexrty","44 44 44 44 44",7777,"4444444444444","88","88170","COURCELLES SOUS CHATENOIS"]
{"$rows_left_out":18}
{"sheet":"Stastisque","index":7,"n_rows":62,"n_cols":24,"rows_kept":62,"cut":false,"hidden":true,"merged":[]}
[]
[null,null,null,null,null,"M² du mois",null,null,null,null,null,null,null,null,"Relance 1"]
[null,null,null,null,null,"Année",{"$f":"YEAR($H$4)","v":{"$error":"#REF!"}},null,null,null,null,"Total",null,null,"Année",{"$f":"YEAR($H$4)","v":{"$error":"#REF!"}},null,"NoK"]
[null,null,null,null,null,"Mois",2,{"$f":"CHOOSE(WEEKDAY(DATE(YEAR(#REF!),$G$4,1),2),0,-1,-2,-3,3,2,1)+DATE(YEAR(#REF!),$G$4,1)","v":{"$error":"#REF!"}},null,null,null,"M² mois",null,null,"Mois",2,{"$f":"CHOOSE(WEEKDAY(DATE(YEAR(#REF!),$G$4,1),2),0,-1,-2,-3,3,2,1)+DATE(YEAR(#REF!),$G$4,1)","v":{"$error":"#REF!"}}]
[null,null,null,null,null,"Semaine",{"$f":"WEEKNUM(H4,21)","v":{"$error":"#REF!"}},{"$f":"G5+1","v":{"$error":"#REF!"}},{"$f":"H5+1","v":{"$error":"#REF!"}},{"$f":"I5+1","v":{"$error":"#REF!"}},{"$f":"J5+1","v":{"$error":"#REF!"}},{"$f":"SUM(L6:L11)","v":{"$error":"#REF!"}},null,null,"Semaine",{"$f":"WEEKNUM(Q4,21)","v":{"$error":"#REF!"}},{"$f":"P5+1","v":{"$error":"#REF!"}},{"$f":"Q5+1","v":{"$error":"#REF!"}},{"$f":"R5+1","v":{"$error":"#REF!"}},{"$f":"S5+1","v":{"$error":"#REF!"}},"Total"]
[null,null,null,null,1,"JEAN",{"$f":"SUMIFS(#REF!,#REF!,G$5,#REF!,$F6)","v":{"$error":"#REF!"}},{"$f":"SUMIFS(#REF!,#REF!,H$5,#REF!,$F6)","v":{"$error":"#REF!"}},{"$f":"SUMIFS(#REF!,#REF!,I$5,#REF!,$F6)","v":{"$error":"#REF!"}},{"$f":"SUMIFS(#REF!,#REF!,J$5,#REF!,$F6)","v":{"$error":"#REF!"}},{"$f":"SUMIFS(#REF!,#REF!,K$5,#REF!,$F6)","v":{"$error":"#REF!"}},{"$f":"SUMIFS(#REF!,#REF!,$G$4,#REF!,$F6)","v":{"$error":"#REF!"}},null,1,"JEAN",{"$f":"COUNTIFS(#REF!,$O6,#REF!,P$5,#REF!,$R$3)","v":{"$error":"#REF!"}},{"$f":"COUNTIFS(#REF!,$O6,#REF!,Q$5,#REF!,$R$3)","v":{"$error":"#REF!"}},{"$f":"COUNTIFS(#REF!,$O6,#REF!,R$5,#REF!,$R$3)","v":{"$error":"#REF!"}},{"$f":"COUNTIFS(#REF!,$O6,#REF!,S$5,#REF!,$R$3)","v":{"$error":"#REF!"}},{"$f":"COUNTIFS(#REF!,$O6,#REF!,T$5,#REF!,$R$3)","v":{"$error":"#REF!"}},{"$f":"SUM(P6:T6)","v":{"$error":"#REF!"}}]
[null,null,null,null,2,"PASCAL",{"$f":"SUMIFS(#REF!,#REF!,G$5,#REF!,$F7)","v":{"$error":"#REF!"}},{"$f":"SUMIFS(#REF!,#REF!,H$5,#REF!,$F7)","v":{"$error":"#REF!"}},{"$f":"SUMIFS(#REF!,#REF!,I$5,#REF!,$F7)","v":{"$error":"#REF!"}},{"$f":"SUMIFS(#REF!,#REF!,J$5,#REF!,$F7)","v":{"$error":"#REF!"}},{"$f":"SUMIFS(#REF!,#REF!,K$5,#REF!,$F7)","v":{"$error":"#REF!"}},{"$f":"SUMIFS(#REF!,#REF!,$G$4,#REF!,$F7)","v":{"$error":"#REF!"}},null,2,"PASCAL",{"$f":"COUNTIFS(#REF!,$O7,#REF!,P$5,#REF!,$R$3)","v":{"$error":"#REF!"}},{"$f":"COUNTIFS(#REF!,$O7,#REF!,Q$5,#REF!,$R$3)","v":{"$error":"#REF!"}},{"$f":"COUNTIFS(#REF!,$O7,#REF!,R$5,#REF!,$R$3)","v":{"$error":"#REF!"}},{"$f":"COUNTIFS(#REF!,$O7,#REF!,S$5,#REF!,$R$3)","v":{"$error":"#REF!"}},{"$f":"COUNTIFS(#REF!,$O7,#REF!,T$5,#REF!,$R$3)","v":{"$error":"#REF!"}},{"$f":"SUM(P7:T7)","v":{"$error":"#REF!"}}]
[null,null,null,null,3,"THIERRY",{"$f":"SUMIFS(#REF!,#REF!,G$5,#REF!,$F8)","v":{"$error":"#REF!"}},{"$f":"SUMIFS(#REF!,#REF!,H$5,#REF!,$F8)","v":{"$error":"#REF!"}},{"$f":"SUMIFS(#REF!,#REF!,I$5,#REF!,$F8)","v":{"$error":"#REF!"}},{"$f":"SUMIFS(#REF!,#REF!,J$5,#REF!,$F8)","v":{"$error":"#REF!"}},{"$f":"SUMIFS(#REF!,#REF!,K$5,#REF!,$F8)","v":{"$error":"#REF!"}},{"$f":"SUMIFS(#REF!,#REF!,$G$4,#REF!,$F8)","v":{"$error":"#REF!"}},null,3,"THIERRY",{"$f":"COUNTIFS(#REF!,$O8,#REF!,P$5,#REF!,$R$3)","v":{"$error":"#REF!"}},{"$f":"COUNTIFS(#REF!,$O8,#REF!,Q$5,#REF!,$R$3)","v":{"$error":"#REF!"}},{"$f":"COUNTIFS(#REF!,$O8,#REF!,R$5,#REF!,$R$3)","v":{"$error":"#REF!"}},{"$f":"COUNTIFS(#REF!,$O8,#REF!,S$5,#REF!,$R$3)","v":{"$error":"#REF!"}},{"$f":"COUNTIFS(#REF!,$O8,#REF!,T$5,#REF!,$R$3)","v":{"$error":"#REF!"}},{"$error":"#REF!"}]
[null,null,null,null,4,"SILVAIN",{"$f":"SUMIFS(#REF!,#REF!,G$5,#REF!,$F9)","v":{"$error":"#REF!"}},{"$f":"SUMIFS(#REF!,#REF!,H$5,#REF!,$F9)","v":{"$error":"#REF!"}},{"$f":"SUMIFS(#REF!,#REF!,I$5,#REF!,$F9)","v":{"$error":"#REF!"}},{"$f":"SUMIFS(#REF!,#REF!,J$5,#REF!,$F9)","v":{"$error":"#REF!"}},{"$f":"SUMIFS(#REF!,#REF!,K$5,#REF!,$F9)","v":{"$error":"#REF!"}},{"$f":"SUMIFS(#REF!,#REF!,$G$4,#REF!,$F9)","v":{"$error":"#REF!"}},null,4,"SILVAIN",{"$f":"COUNTIFS(#REF!,$O9,#REF!,P$5,#REF!,$R$3)","v":{"$error":"#REF!"}},{"$f":"COUNTIFS(#REF!,$O9,#REF!,Q$5,#REF!,$R$3)","v":{"$error":"#REF!"}},{"$f":"COUNTIFS(#REF!,$O9,#REF!,R$5,#REF!,$R$3)","v":{"$error":"#REF!"}},{"$f":"COUNTIFS(#REF!,$O9,#REF!,S$5,#REF!,$R$3)","v":{"$error":"#REF!"}},{"$f":"COUNTIFS(#REF!,$O9,#REF!,T$5,#REF!,$R$3)","v":{"$error":"#REF!"}},{"$error":"#REF!"}]
[null,null,null,null,5,"ANTOINE",{"$f":"SUMIFS(#REF!,#REF!,G$5,#REF!,$F10)","v":{"$error":"#REF!"}},{"$f":"SUMIFS(#REF!,#REF!,H$5,#REF!,$F10)","v":{"$error":"#REF!"}},{"$f":"SUMIFS(#REF!,#REF!,I$5,#REF!,$F10)","v":{"$error":"#REF!"}},{"$f":"SUMIFS(#REF!,#REF!,J$5,#REF!,$F10)","v":{"$error":"#REF!"}},{"$f":"SUMIFS(#REF!,#REF!,K$5,#REF!,$F10)","v":{"$error":"#REF!"}},{"$f":"SUMIFS(#REF!,#REF!,$G$4,#REF!,$F10)","v":{"$error":"#REF!"}},null,5,"ANTOINE",{"$f":"COUNTIFS(#REF!,$O10,#REF!,P$5,#REF!,$R$3)","v":{"$error":"#REF!"}},{"$f":"COUNTIFS(#REF!,$O10,#REF!,Q$5,#REF!,$R$3)","v":{"$error":"#REF!"}},{"$f":"COUNTIFS(#REF!,$O10,#REF!,R$5,#REF!,$R$3)","v":{"$error":"#REF!"}},{"$f":"COUNTIFS(#REF!,$O10,#REF!,S$5,#REF!,$R$3)","v":{"$error":"#REF!"}},{"$f":"COUNTIFS(#REF!,$O10,#REF!,T$5,#REF!,$R$3)","v":{"$error":"#REF!"}},{"$error":"#REF!"}]
{"$rows_left_out":53}
{"sheet":"SaveData","index":8,"n_rows":3,"n_cols":31,"rows_kept":3,"cut":false,"hidden":true,"merged":[]}
["Code","Nom Parrain\nFilleul ","Année","MOIS","Sem","N°-Parrain","N°- filleul","Couple P & F","Parrain\nNb. filleul","Parrain\nfilleul","Date","Commercial","nom\nParrain","prénom\nParrain","Téléphone\nParrain","nom\nFilleul","Prénom\nFilleul","Téléphone\nFilleul","N°- Rue","Nom Rue","CP","Commune","Date\n Phonning","relance1","relance2","Résultat\nPhonning","date/rdv client","Vente","date de pose","Pose en M²","pose effectue"]
["2022_5_C1-P-1-000","Parrain client 139 Nom client 139 Prénom",2022,2,5,1,0,"P1",6,"P","2022-01-02","JEAN","client 139 Nom","client 139 Prénom",660546033,null,null,null,38,"Rue du village BU",10500,"LASSICOURT","15/01/2022","Nok","nok","ok","2022-02-03","ok","2022-06-03",160,"Ok"]
["2022_5_C1-P-1-000","Parrain client 139 Nom client 139 Prénom",2022,2,5,1,0,"P1",5,"P","2022-01-02","JEAN","client 139 Nom","client 139 Prénom",660546033,null,null,null,38,"Rue du village BU",10500,"LASSICOURT","15/01/2022","Nok","nok","ok","2022-02-03","ok","2022-06-03",160,"Ok"]

{"sheet":"Grand_Est","index":9,"n_rows":5669,"n_cols":12,"rows_kept":5669,"cut":false,"hidden":false,"merged":[]}
["cp","cp","villes",{"$f":"MAX(D2:D5669)","v":46}]
[8000,"08000","CHARLEVILLE MEZIERES",{"$f":"COUNTIF($B$2:$B$5669,B2)","v":5},null,"N°","Département","REGION","Villes",null,null,"Liste_Mois"]
[8000,"08000","LES AYVELLES",5,null,"08","Ardennes","Grand_Est","Charleville-Mézières",8,null,1]
[8000,"08000","PRIX LES MEZIERES",5,null,10,"Aube","Grand_Est","Troyes",10,null,2]
[8000,"08000","VILLERS SEMEUSE",5,null,51,"Marne","Grand_Est","Châlons-en-Champagne",51,null,3]
[8000,"08000","WARCQ",5,null,52,"Haute-Marne","Grand_Est","Chaumont",52,null,4]
[8090,"08090","AIGLEMONT",17,null,54,"Meurthe-et-Moselle","Grand_Est","Nancy",54,null,5]
[8090,"08090","ARREUX",17,null,55,"Meuse","Grand_Est","Bar-le-Duc",55,null,6]
[8090,"08090","BELVAL",17,null,57,"Moselle","Grand_Est","Metz",57,null,7]
[8090,"08090","CLIRON",17,null,67,"Bas-Rhin","Grand_Est","Strasbourg",67,null,8]
{"$rows_left_out":5660}
{"sheet":"Feuil1","index":10,"n_rows":31,"n_cols":9,"rows_kept":31,"cut":false,"hidden":false,"merged":[[0,4,0,7]]}
["Code","a Calcul","2022_14_C2-P-30-F-186",1,".TextB_Date_Jour Annee_.TextB_Date_Jour Semaine_CCmB_Commercial.listx,1)-Id max P- si F:-F-Id max filleul",null,null,null,"=SI(Base_données!$B$12=\"\";0;Base_données!$B$3&\"_\"&C5&\"_C\"&RECHERCHEV(Base_données!$B$12;Grand_Est!$I$20:$J$34;2;0)&\"-P-\"&NB.SI(Base_données!$B$10:$IP$10;\"P\")&\"-\"&SI(Base_données!$B$10=\"F\";\"F-\"&NB.SI(Base_données!$B$10:$IP$10;\"F\");\"000\"))"]
["Nom Parrain Filleul ","B","Parrain:  Macheprot Achille -- Filleul:   ",{"$f":"D1+1","v":2},null,null,2,null,"=SI($B$10=\"vide\";0;SI($B$10=\"P\";\"Parrain: \"&\" \"&$B$13&\" \"&$B$14;SI($B$10=\"F\";\"Parrain: \"&\" \"&$B$13&\" \"&$B$14&\" -- Filleul: \"&\" \"&$B$16&\" \"&$B$17)))"]
["Année","C",2022,3,null,".TextB_Date_Jour Annee",{"$f":"G2+1","v":3},null,"=ANNEE(C$11)"]
["MOIS","D",4,4,null,".TextB_Date_Jour Mois",4,null,"=MOIS(C$11)"]
["Sem","E",14,5,null,".TextB_Date_Jour Semaine",5,null,"=NO.SEMAINE(C$11;21)"]
["N°-Parrain","F",29,6,"Colonne F: Id max+1 Parrain  a la creation Col J",null,6,null,"=SI(C10=\"F\";MAX($G20:$G$250);MAX($G20:$G$250)+1)"]
["N°- filleul","G",185,7,null,null,7,"Colonne G: Id max+1 Filleul  a la creation Col J","=SI(C10=\"P\";0;MAX($H20:$H$250)+1)"]
["Couple P & F","H","P-29_000_F-185",8,null,"=SI(J2=\"P\";\"P\"&F2&\"_000\";\"P-\"&F2&\"_000_F-\"&G2)",8,null,"=SI(C10=\"P\";\"P\"&C6&\"_000\";\"P-\"&C6&\"_000_F-\"&C7)"]
["Parrain/\nNb. filleul","I",0,9,null,null,9,null,"=SI(C$10=\"P\";NB.SI.ENS($AF$20:$AF$250;\"ok\";$N$20:$N$250;$N3;$O$20:$O$250;$O3)-1;0)"]
["Parrain/\nfilleul","J","F",10,"        .OptB_Parrain  \"P\"",null,10,"        .OptB_Filleul  \"F\"","F"]
{"$rows_left_out":22}
{"sheet":"Feuil2","index":11,"n_rows":16,"n_cols":17,"rows_kept":16,"cut":false,"hidden":false,"merged":[]}
[8,13,14,15,19,20,21,22,null,8,16,17,18,19,20,21,22]
["N°-Parrain\nN°- filleul","nom\nParrain","prénom\nParrain","Téléphone\nParrain","N°- Rue","Nom Rue","CP","Commune",null,"N°-Parrain\nN°- filleul","nom\nFilleul","Prénom\nFilleul","Téléphone\nFilleul","N°- Rue","Nom Rue","CP","Commune"]
["P-1_000","Azer","Azs","02 02 02 02 02",999,"ici","01000","LA BAS",null,"P-1_000_F-1","Fgh","Fgb","20 20 20 20 20",777,"chez lui","02000","CHEZ EUX"]
["P-2_000","Wxc","Wxd","04 04 04 04 04",656,"zegzgz","05000","AEGZQRESTR",null,"P-1_000_F-2","Fre","Frd","30 30 30 30 30",897,"la","30000","OUT"]
[]
[]
[]
[]
[null,null,null,null,1,1]
[null,null,null,null,2,2]
{"$rows_left_out":6}