{"text_format":"1","workbook":"xlsx","n_sheets":5,"sheets":["Frais annuel 22","REV DEP","DATA","Prévisionnel","Notice"],"not_rendered":{"charts":0,"images":1,"macros":1,"external_links":0,"defined_names":11,"comments":0,"pivot_tables":0},"unopened":[],"bounds":{"document_bytes":16777216,"sheet_cells":100000,"rows_first":2000,"rows_last":500,"rows_between":2000,"halvings":0,"cell_chars":16384,"cell_head_chars":4096},"cells_cut":0,"cells_raw":0,"read":"whole","date_system":"1900"}

{"sheet":"Frais annuel 22","index":0,"n_rows":440,"n_cols":155,"rows_kept":440,"cut":false,"hidden":false,"merged":[[39,20,39,21],[75,20,75,21],[111,20,111,21],[147,20,147,21],[183,20,183,21],[219,20,219,21],[255,20,255,21],[291,20,291,21],[327,20,327,21],[254,20,254,21],[73,20,73,21],[109,20,109,21],[110,16,110,17],[397,14,397,17],[293,15,294,15],[292,14,292,15],[327,7,327,10],[328,14,328,15],[363,7,363,10],[364,14,364,15],[254,9,254,10],[290,9,290,10],[329,15,330,15],[293,10,294,10],[397,7,397,9],[293,16,294,16],[293,14,294,14],[361,7,361,9],[365,15,366,15],[290,16,290,17],[326,16,326,17],[362,16,362,17],[365,3,366,3],[365,4,366,4],[77,21,78,21],[221,14,222,14],[325,20,325,21],[253,14,253,17],[293,21,294,21],[183,15,183,17],[111,15,111,17],[149,14,150,14],[185,15,186,15],[77,16,78,16],[293,6,294,6],[365,16,366,16],[329,14,330,14],[365,14,366,14],[329,16,330,16],[181,20,181,21],[365,6,366,6],[365,7,366,7],[185,6,186,6],[146,16,146,17],[325,14,325,17],[361,14,361,17],[400,0,400,2],[400,11,400,13],[401,0,431,0],[401,9,402,9],[401,6,402,6],[437,17,437,19],[437,5,437,7],[433,14,433,16],[398,2,398,4],[399,7,399,10],[400,14,400,15],[398,9,398,10],[398,16,398,17],[434,8,434,13],[437,20,437,21],[361,20,361,21],[365,21,366,21],[398,20,398,21],[289,20,289,21],[438,20,438,21],[436,22,436,23],[438,22,438,23],[401,22,402,23],[401,21,402,21],[433,20,433,22],[434,20,434,22],[365,22,366,23],[329,21,330,21],[329,22,330,23],[362,20,362,21],[326,20,326,21],[363,20,363,21],[399,20,399,21],[293,22,294,23],[397,20,397,21],[439,0,439,3],[438,18,438,19],[438,15,438,17],[401,1,402,2],[401,3,402,3],[401,4,402,4],[436,7,436,9],[439,5,439,7],[401,10,402,10],[438,5,438,6],[438,0,438,1],[433,7,433,9],[438,2,438,3],[437,9,437,11],[436,15,436,17],[401,15,402,15],[401,16,402,16],[437,3,437,4],[401,14,402,14],[401,7,402,7],[401,8,402,8],[439,17,439,18],[185,22,186,23],[290,2,290,4],[221,22,222,23],[257,14,258,14],[257,21,258,21],[257,16,258,16],[185,3,186,3],[185,4,186,4],[221,1,222,2],[221,21,222,21],[217,7,217,9],[218,2,218,4],[220,0,220,2],[217,20,217,21],[221,3,222,3],[221,15,222,15],[221,16,222,16],[221,10,222,10],[257,3,258,3],[257,4,258,4],[257,22,258,23],[257,1,258,2],[253,20,253,21],[257,6,258,6],[77,22,78,23],[110,2,110,4],[113,1,114,2],[113,22,114,23],[148,0,148,2],[113,7,114,7],[149,7,150,7],[149,16,150,16],[77,4,78,4],[77,9,78,9],[113,3,114,3],[149,22,150,23],[149,6,150,6],[109,14,109,17],[113,4,114,4],[113,6,114,6],[113,14,114,14],[109,7,109,9],[113,10,114,10],[77,3,78,3],[149,9,150,9],[113,15,114,15],[145,14,145,17],[110,20,110,21],[5,22,5,23],[5,1,5,2],[41,14,42,14],[4,14,4,17],[37,14,37,17],[4,0,4,2],[41,10,42,10],[4,7,4,10],[37,20,37,21],[41,16,42,16],[41,6,42,6],[41,7,42,7],[41,8,42,8],[41,9,42,9],[41,4,42,4],[41,1,42,2],[41,22,42,23],[41,15,42,15],[38,20,38,21],[41,21,42,21],[38,9,38,10],[39,7,39,10],[38,16,38,17],[40,14,40,15],[73,7,73,9],[112,11,112,13],[185,10,186,10],[184,11,184,13],[113,8,114,8],[113,9,114,9],[113,21,114,21],[181,7,181,9],[148,11,148,13],[145,20,145,21],[77,8,78,8],[185,8,186,8],[76,14,76,15],[185,14,186,14],[75,7,75,10],[111,7,111,10],[147,7,147,10],[183,7,183,10],[184,14,184,15],[148,14,148,15],[112,14,112,15],[146,9,146,10],[110,9,110,10],[74,9,74,10],[292,11,292,13],[325,7,325,9],[293,9,294,9],[221,7,222,7],[257,15,258,15],[289,7,289,9],[329,9,330,9],[74,20,74,21],[185,7,186,7],[113,16,114,16],[149,15,150,15],[217,14,217,17],[185,21,186,21],[149,21,150,21],[219,7,219,10],[220,14,220,15],[255,7,255,10],[256,14,256,15],[289,14,289,17],[74,16,74,17],[182,16,182,17],[218,16,218,17],[254,16,254,17],[257,10,258,10],[220,11,220,13],[256,11,256,13],[253,7,253,9],[182,9,182,10],[218,9,218,10],[362,2,362,4],[292,0,292,2],[329,0,359,0],[365,0,395,0],[364,0,364,2],[365,1,366,2],[364,11,364,13],[329,10,330,10],[257,0,287,0],[328,0,328,2],[329,1,330,2],[293,0,323,0],[293,1,294,2],[365,8,366,8],[365,9,366,9],[326,9,326,10],[362,9,362,10],[291,7,291,10],[365,10,366,10],[328,11,328,13],[329,8,330,8],[221,8,222,8],[185,16,186,16],[181,14,181,17],[257,7,258,7],[257,8,258,8],[256,0,256,2],[74,2,74,4],[76,11,76,13],[76,0,76,2],[77,7,78,7],[149,1,150,2],[146,2,146,4],[145,7,145,9],[149,8,150,8],[149,10,150,10],[77,6,78,6],[112,0,112,2],[113,0,143,0],[149,0,179,0],[221,0,251,0],[185,0,215,0],[221,6,222,6],[149,3,150,3],[185,9,186,9],[221,9,222,9],[221,4,222,4],[329,4,330,4],[149,4,150,4],[326,2,326,4],[293,3,294,3],[293,4,294,4],[254,2,254,4],[185,1,186,2],[329,3,330,3],[257,9,258,9],[329,6,330,6],[329,7,330,7],[182,2,182,4],[184,0,184,2],[293,7,294,7],[293,8,294,8],[1,0,2,1],[1,13,1,16],[1,17,1,19],[2,13,2,16],[2,17,2,19],[77,0,107,0],[77,1,78,2],[4,11,4,13],[4,3,4,4],[40,0,40,2],[5,0,35,0],[41,0,71,0],[77,10,78,10],[77,14,78,14],[77,15,78,15],[40,11,40,13],[37,7,37,9],[38,2,38,4],[41,3,42,3],[1,5,1,9],[2,5,2,9],[1,10,1,12],[2,10,2,12],[73,14,73,17]]}
[]
["KIKO",null,null,null,null,null,null,null,null,null,null,null,null,null,null,null,null,null,null,null,null,"Couleur"]
[null,null,null,null,null,null,null,null,null,null,null,null,null,null,null,null,null,null,null,null,null,"choisie"]
[]
["KIKO",null,null,"22 D SC CON Bas Don V.19.1 Format MOI",null,null,null,"SOLDE",null,null,null,null,null,null,{"$f":"A6","v":"JANVIER"},null,null,null,null,null,"Frais Annuel   ",null,null,null,null,"CAR"]
["JANVIER","Date",null,"Commentaire","Désignation",null,"Crédit","   V","Code","S/C","CH","Valeur","Solde","Valeur","CH","Code","S/C","V/D","Débit",null,"Désignation","Commentaire","Date",null,null,null,35]
[null,null,null,null,null,null,null,null,null,null,"COU","1389,79   Débit 577,57",{"$f":"L5-N7","v":0},{"$f":"(SUMIFS(S7,Q7,\"V\"))","v":0},"COU","COU","V","V",null,null,"Cartes Mois précédent",null,null,null,null,"CH",34,null,null,null,null,null,null,null,null,null,null,null,null,null,null,null,null,null,null,null,null,null,null,null,null,null,null,null,null,null,null,null,null,null,null,null,null,null,null,null,null,null,null,null,null,null,null,null,null,null,null,null,null,null,null,null,null,null,null,null,null,null,null,null,null,null,null,null,null,null,null,null,null,null,null,null,null,null,null,null,null,null,null,null,null,null,null,null,null,null,null,null,null,null,null,null,null,null,null,null,null,null,null,null,null,null,null,null,null,null,null,null,null,null,null,null,null,null,null,null,null,null,null,null,null,null,null,null,"S"]
[null,{"$f":"IF(C8=\"\",\"\",IF(C8>DAY(EOMONTH(DATE(2022,A$37,1),0)),\"\",C8&\"/\"&A$37))","v":""},null,null,{"$f":"IF(I8=\"\",\"\",VLOOKUP(J8,OFFSET(departRV,,MATCH(I8,SCcredits,0)),2,0))","v":""},null,null,null,null,null,null,{"$f":"SUMIFS(G8,H8,\"V\")","v":0},{"$f":"IF(L8<>\"\",L8+M7-N8)","v":0},{"$f":"(SUMIFS(S8,R8,\"V\"))","v":0},null,null,null,null,null,null,{"$f":"IF(P8=\"\",\"\",VLOOKUP(Q8,OFFSET(departRV,,MATCH(P8,SCdebits,0)),2,0))","v":""},null,null,{"$f":"IF(W8=\"\",\"\",IF(W8>DAY(EOMONTH(DATE(2022,A$37,1),0)),\"\",W8&\"/\"&A$37))","v":""},1,"ESP",33]
[null,"",null,null,"",null,null,null,null,null,null,0,{"$f":"IF(L9<>\"\",L9+M8-N9)","v":0},{"$f":"(SUMIFS(S9,R9,\"V\"))","v":0},null,null,null,null,null,null,"",null,null,"",2,null,32]
[null,"",null,null,"",null,null,null,null,null,null,0,0,0,null,null,null,null,null,null,"",null,null,"",3,"D",31]
[null,"",null,null,"",null,null,null,null,null,null,0,0,0,null,null,null,null,null,null,"",null,null,"",4,"V",30]
[null,"",null,null,"",null,null,null,null,null,null,0,0,0,null,null,null,null,null,null,"",null,null,"",5,null,29]
[null,"",null,null,"",null,null,null,null,null,null,0,0,0,null,null,null,null,null,null,"",null,null,"",6,"V",28]
[null,"",null,null,"",null,null,null,null,null,null,0,0,0,null,null,null,null,null,null,"",null,null,"",7,null,27]
[null,"",null,null,"",null,null,null,null,null,null,0,0,0,null,null,null,null,null,null,"",null,null,"",8,null,26]
[null,"",null,null,"",null,null,null,null,null,null,0,0,0,null,null,null,null,null,null,"",null,null,"",9,null,25]
[null,"",null,null,"",null,null,null,null,null,null,0,0,0,null,null,null,null,null,null,"",null,null,"",10,null,24]
[null,"",null,null,"",null,null,null,null,null,null,0,0,0,null,null,null,null,null,null,"",null,null,"",11,null,23]
[null,"",null,null,"",null,null,null,null,null,null,0,0,0,null,null,null,null,null,null,"",null,null,"",12,"KIKO",22]
[null,"",null,null,"",null,null,null,null,null,null,0,0,0,null,null,null,null,null,null,"",null,null,"",13,"VALIDE",21]
[null,"",null,null,"",null,null,null,null,null,null,0,0,0,null,null,null,null,null,null,{"$f":"IF(P21=\"\",\"\",VLOOKUP(Q21,OFFSET(departRV,,MATCH(P21,SCdebits,0)),2,0))","v":""},null,null,"",14,null,20]
[null,"",null,null,"",null,null,null,null,null,null,0,0,0,null,null,null,null,null,null,"",null,null,"",15,"STOP",19]
[null,"",null,null,"",null,null,null,null,null,null,0,0,0,null,null,null,null,null,null,"",null,null,"",16,"Couleur",18]
[null,"",null,null,"",null,null,null,null,null,null,0,0,0,null,null,null,null,null,null,"",null,null,"",17,null,17]
[null,"",null,null,"",null,null,null,null,null,null,0,0,0,null,null,null,null,null,null,"",null,null,"",18,"VIR",16]
[null,"",null,null,"",null,null,null,null,null,null,0,0,0,null,null,null,null,null,null,"",null,null,"",19,null,15]
[null,"",null,null,"",null,null,null,null,null,null,0,0,0,null,null,null,null,null,null,"",null,null,"",20,"CH",14]
[null,"",null,null,"",null,null,null,null,null,null,0,0,0,null,null,null,null,null,null,"",null,null,"",21,"ESP",13]
[null,"",null,null,"",null,null,null,null,null,null,0,0,0,null,null,null,null,null,null,"",null,null,"",22,null,12]
[null,"",null,null,"",null,null,null,null,null,null,0,0,0,null,null,null,null,null,null,"",null,null,"",23,null,11]
[null,"",null,null,"",null,null,null,null,null,null,0,0,0,null,null,null,null,null,null,"",null,null,"",24,null,10]
[null,"",null,null,"",null,null,null,null,null,null,0,0,0,null,null,null,null,null,null,"",null,null,"",25,null,9]
[null,"",null,null,"",null,null,null,null,null,null,0,0,0,null,null,null,null,null,null,"",null,null,"",26,null,8]
[null,"",null,null,"",null,null,null,null,null,null,0,0,0,null,null,null,null,null,null,"",null,null,"",27,null,7]
[null,"",null,null,"",null,null,null,null,null,null,0,0,0,null,null,null,null,null,null,"",null,null,"",28,null,6]
[null,"",null,null,"",null,null,null,null,null,null,0,0,0,null,null,null,null,null,null,"",null,null,"",29,null,5]
[1,"",null,null,"",null,null,null,null,null,null,0,0,0,null,null,null,null,null,null,"",null,null,"",30,null,4]
[null,null,null,null,"Crédit non Validé",null,{"$f":"SUM(G8:G37)","v":0},"CREDIT",null,null,null,{"$f":"SUMIFS(L8:L37,H8:H37,\"V\")","v":0},{"$f":"L38-N38","v":0},{"$f":"SUMIFS(N7:N37,R7:R37,\"V\")","v":0},"DEBIT",null,null,null,{"$f":"SUM(S7:S37)-S43","v":0},null," Débit non Validé moins Différé",null,null,null,null,null,3]
[null,null,"Possibilité investissement sur  NON Validé",null,null,null,{"$f":"IF(I39>11,A439,0)","v":0},"SUR",{"$f":"F439","v":12},"MOIS",null,null,null,null,"SUR",{"$f":"S439","v":12},"MOIS",null,{"$f":"IF(P39>11,A439,0)","v":0},null,"Possibilité investissement SUR Validé",null,null,null,null,null,2]
[null,null,null,null,null,null,"12 /Mois",{"$f":"A6","v":"JANVIER"},null,null,null,null,{"$f":"VLOOKUP(9^9,M$7:M$37,1)","v":0},null,null,null,null,null,null,null,{"$f":"D5","v":"22 D SC CON Bas Don V.19.1 Format MOI"},null,null,null,null,null,1]
["KIKO",null,null,null,null,null,null,null,null,null,null,{"$f":"A42","v":"FEVRIER"},null,null,"11 /Mois"]
["FEVRIER","Date",null,"Commentaire","Désignation",null,"Crédit","   V","Code","S/C","C H","Valeur","Solde","Valeur","C H","Code","S/C","V/D","Débit",null,"Désignation","Commentaire","Date",null,null,1]
[null,null,null,null,null,null,null,null,null,null,null,null,{"$f":"M40-N43","v":0},{"$f":"(SUMIFS(S43,R43,\"V\"))","v":0},null,null,null,"V",{"$f":"SUMIFS(S8:S37,R8:R37,\"D\")","v":0},null,"Cartes Mois précédent",null,null,null,null,2,null,null,null,null,null,null,null,null,null,null,null,null,null,null,null,null,null,null,null,null,null,null,null,null,null,null,null,null,null,null,null,null,null,null,null,null,null,null,null,null,null,null,null,null,null,null,null,null,null,null,null,null,null,null,null,null,null,null,null,null,null,null,null,null,null,null,null,null,null,null,null,null,null,null,null,null,null,null,null,null,null,null,null,null,null,null,null,null,null,null,null,null,null,null,null,null,null,null,null,null,null,null,null,null,null,null,null,null,null,null,null,null,null,null,null,null,null,null,null,null,null,null,null,null,null,null,null,null,"S"]
[null,{"$f":"IF(C44=\"\",\"\",IF(C44>DAY(EOMONTH(DATE(2022,A$73,1),0)),\"\",C44&\"/\"&A$73))","v":""},null,null,{"$f":"IF(I44=\"\",\"\",VLOOKUP(J44,OFFSET(departRV,,MATCH(I44,SCcredits,0)),2,0))","v":""},null,null,null,null,null,null,{"$f":"SUMIFS(G44,H44,\"V\")","v":0},{"$f":"IF(L44<>\"\",L44+M43-N44)","v":0},{"$f":"(SUMIFS(S44,R44,\"V\"))","v":0},null,null,null,null,null,null,{"$f":"IF(P44=\"\",\"\",VLOOKUP(Q44,OFFSET(departRV,,MATCH(P44,SCdebits,0)),2,0))","v":""},null,null,{"$f":"IF(W44=\"\",\"\",IF(W44>DAY(EOMONTH(DATE(2022,A$73,1),0)),\"\",W44&\"/\"&A$73))","v":""},1,3]
[null,"",null,null,"",null,null,null,null,null,null,0,{"$f":"IF(L45<>\"\",L45+M44-N45)","v":0},{"$f":"(SUMIFS(S45,R45,\"V\"))","v":0},null,null,null,null,null,null,"",null,null,"",2,4]
[null,"",null,null,"",null,null,null,null,null,null,0,0,0,null,null,null,null,null,null,"",null,null,"",3,5]
[null,"",null,null,"",null,null,null,null,null,null,0,0,0,null,null,null,null,null,null,"",null,null,"",4,6]
[null,"",null,null,"",null,null,null,null,null,null,0,0,0,null,null,null,null,null,null,"",null,null,"",5,7]
[null,"",null,null,"",null,null,null,null,null,null,0,0,0,null,null,null,null,null,null,"",null,null,"",6,8]
[null,"",null,null,"",null,null,null,null,null,null,0,0,0,null,null,null,null,null,null,"",null,null,"",7,9]
[null,"",null,null,"",null,null,null,null,null,null,0,0,0,null,null,null,null,null,null,"",null,null,"",8,10]
[null,"",null,null,"",null,null,null,null,null,null,0,0,0,null,null,null,null,null,null,"",null,null,"",9,11]
[null,"",null,null,"",null,null,null,null,null,null,0,0,0,null,null,null,null,null,null,"",null,null,"",10,12]
[null,"",null,null,"",null,null,null,null,null,null,0,0,0,null,null,null,null,null,null,"",null,null,"",11,13]
[null,"",null,null,"",null,null,null,null,null,null,0,0,0,null,null,null,null,null,null,"",null,null,"",12,14]
[null,"",null,null,"",null,null,null,null,null,null,0,0,0,null,null,null,null,null,null,"",null,null,"",13,15]
[null,"",null,null,"",null,null,null,null,null,null,0,0,0,null,null,null,null,null,null,"",null,null,"",14,16]
[null,"",null,null,"",null,null,null,null,null,null,0,0,0,null,null,null,null,null,null,"",null,null,"",15,17]
[null,"",null,null,"",null,null,null,null,null,null,0,0,0,null,null,null,null,null,null,"",null,null,"",16,18]
[null,"",null,null,"",null,null,null,null,null,null,0,0,0,null,null,null,null,null,null,"",null,null,"",17,19]
[null,"",null,null,"",null,null,null,null,null,null,0,0,0,null,null,null,null,null,null,"",null,null,"",18,20]
[null,"",null,null,"",null,null,null,null,null,null,0,0,0,null,null,null,null,null,null,"",null,null,"",19,21]
[null,"",null,null,"",null,null,null,null,null,null,0,0,0,null,null,null,null,null,null,"",null,null,"",20,22]
[null,"",null,null,"",null,null,null,null,null,null,0,0,0,null,null,null,null,null,null,"",null,null,"",21,23]
[null,"",null,null,"",null,null,null,null,null,null,0,0,0,null,null,null,null,null,null,"",null,null,"",22,24]
[null,"",null,null,"",null,null,null,null,null,null,0,0,0,null,null,null,null,null,null,"",null,null,"",23,25]
[null,"",null,null,"",null,null,null,null,null,null,0,0,0,null,null,null,null,null,null,"",null,null,"",24,26]
[null,"",null,null,"",null,null,null,null,null,null,0,0,0,null,null,null,null,null,null,"",null,null,"",25,27]
[null,"",null,null,"",null,null,null,null,null,null,0,0,0,null,null,null,null,null,null,"",null,null,"",26,28]
[null,"",null,null,"",null,null,null,null,null,null,0,0,0,null,null,null,null,null,null,"",null,null,"",27,29]
[null,"",null,null,"",null,null,null,null,null,null,0,0,0,null,null,null,null,null,null,"",null,null,"",28,30]
[null,"",null,null,"",null,null,null,null,null,null,0,0,0,null,null,null,null,null,null,"",null,null,"",29,31]
[2,"",null,null,"",null,null,null,null,null,null,0,0,0,null,null,null,null,null,null,"",null,null,"",30,32]
[null,null,null,null,"Crédit non Validé",null,{"$f":"SUM(G44:G73)","v":0},"CREDIT",null,null,null,{"$f":"SUMIFS(L44:L73,H44:H73,\"V\")","v":0},{"$f":"L74-N74","v":0},{"$f":"SUMIFS(N43:N73,R43:R73,\"V\")","v":0},"DEBIT",null,null,null,{"$f":"SUM(S43:S73)-S79","v":0},null," Débit non Validé moins Différé",null,null,null,null,33]
[null,null,"Possibilité investissement sur  NON Validé",null,null,null,{"$f":"IF(I75>10,A439,0)","v":0},"SUR",{"$f":"F439","v":12},"MOIS",null,null,null,null,"SUR",{"$f":"S439","v":12},"MOIS",null,{"$f":"IF(P75>10,A439,0)","v":0},null,"Possibilité investissement SUR Validé",null,null,null,null,34]
["P",null,null,null,null,null,"11 /Mois",{"$f":"A42","v":"FEVRIER"},null,null,null,null,{"$f":"VLOOKUP(9^9,M$43:M$73,1)","v":0},null,null,null,null,null,null,null,{"$f":"U40","v":"22 D SC CON Bas Don V.19.1 Format MOI"},null,null,null,null,35]
["KIKO",null,null,null,null,null,null,null,null,null,null,{"$f":"A78","v":"MARS"},null,null,"10 /Mois"]
["MARS","Date",null,"Commentaire","Désignation",null,"Crédit","   V","Code","S/C","C H","Valeur","Solde","Valeur","C H","Code","S/C","V/D","Débit",null,"Désignation","Commentaire","Date"]
[null,null,null,null,null,null,null,null,null,null,null,null,{"$f":"M76-N79","v":0},{"$f":"(SUMIFS(S79,R79,\"V\"))","v":0},null,null,null,"V",{"$f":"SUMIFS(S44:S73,R44:R73,\"D\")","v":0},null,"Cartes Mois précédent"]
[null,{"$f":"IF(C80=\"\",\"\",IF(C80>DAY(EOMONTH(DATE(2022,A$109,1),0)),\"\",C80&\"/\"&A$109))","v":""},null,null,{"$f":"IF(I80=\"\",\"\",VLOOKUP(J80,OFFSET(departRV,,MATCH(I80,SCcredits,0)),2,0))","v":""},null,null,null,null,null,null,{"$f":"SUMIFS(G80,H80,\"V\")","v":0},{"$f":"IF(L80<>\"\",L80+M79-N80)","v":0},{"$f":"(SUMIFS(S80,R80,\"V\"))","v":0},null,null,null,null,null,null,{"$f":"IF(P80=\"\",\"\",VLOOKUP(Q80,OFFSET(departRV,,MATCH(P80,SCdebits,0)),2,0))","v":""},null,null,{"$f":"IF(W80=\"\",\"\",IF(W80>DAY(EOMONTH(DATE(2022,A$109,1),0)),\"\",W80&\"/\"&A$109))","v":""},1]
[null,"",null,null,"",null,null,null,null,null,null,0,{"$f":"IF(L81<>\"\",L81+M80-N81)","v":0},{"$f":"(SUMIFS(S81,R81,\"V\"))","v":0},null,null,null,null,null,null,"",null,null,{"$f":"IF(W81=\"\",\"\",IF(W81>DAY(EOMONTH(DATE(2022,A$109,1),0)),\"\",W81&\"/\"&A$109))","v":""},2,null,0]
[null,"",null,null,"",null,null,null,null,null,null,0,0,0,null,null,null,null,null,null,"",null,null,{"$f":"IF(W82=\"\",\"\",IF(W82>DAY(EOMONTH(DATE(2022,A$109,1),0)),\"\",W82&\"/\"&A$109))","v":""},3,null,0]
[null,"",null,null,"",null,null,null,null,null,null,0,0,0,null,null,null,null,null,null,"",null,null,{"$f":"IF(W83=\"\",\"\",IF(W83>DAY(EOMONTH(DATE(2022,A$109,1),0)),\"\",W83&\"/\"&A$109))","v":""},4,null,0]
[null,"",null,null,"",null,null,null,null,null,null,0,0,0,null,null,null,null,null,null,"",null,null,{"$f":"IF(W84=\"\",\"\",IF(W84>DAY(EOMONTH(DATE(2022,A$109,1),0)),\"\",W84&\"/\"&A$109))","v":""},5,null,0]
[null,"",null,null,"",null,null,null,null,null,null,0,0,0,null,null,null,null,null,null,"",null,null,"",6]
[null,"",null,null,"",null,null,null,null,null,null,0,0,0,null,null,null,null,null,null,"",null,null,{"$f":"IF(W86=\"\",\"\",IF(W86>DAY(EOMONTH(DATE(2022,A$109,1),0)),\"\",W86&\"/\"&A$109))","v":""},7]
[null,"",null,null,"",null,null,null,null,null,null,0,0,0,null,null,null,null,null,null,"",null,null,"",8]
[null,"",null,null,"",null,null,null,null,null,null,0,0,0,null,null,null,null,null,null,"",null,null,"",9]
[null,"",null,null,"",null,null,null,null,null,null,0,0,0,null,null,null,null,null,null,"",null,null,"",10]
[null,"",null,null,"",null,null,null,null,null,null,0,0,0,null,null,null,null,null,null,"",null,null,"",11]
[null,"",null,null,"",null,null,null,null,null,null,0,0,0,null,null,null,null,null,null,"",null,null,"",12]
[null,"",null,null,"",null,null,null,null,null,null,0,0,0,null,null,null,null,null,null,"",null,null,"",13]
[null,"",null,null,"",null,null,null,null,null,null,0,0,0,null,null,null,null,null,null,"",null,null,"",14]
[null,"",null,null,"",null,null,null,null,null,null,0,0,0,null,null,null,null,null,null,"",null,null,"",15]
[null,"",null,null,"",null,null,null,null,null,null,0,0,0,null,null,null,null,null,null,"",null,null,"",16]
[null,"",null,null,"",null,null,null,null,null,null,0,0,0,null,null,null,null,null,null,"",null,null,"",17]
[null,"",null,null,"",null,null,null,null,null,null,0,0,0,null,null,null,null,null,null,"",null,null,"",18]
[null,"",null,null,"",null,null,null,null,null,null,0,0,0,null,null,null,null,null,null,"",null,null,"",19]
[null,"",null,null,"",null,null,null,null,null,null,0,0,0,null,null,null,null,null,null,"",null,null,"",20]
[null,"",null,null,"",null,null,null,null,null,null,0,0,0,null,null,null,null,null,null,"",null,null,"",21]
[null,"",null,null,"",null,null,null,null,null,null,0,0,0,null,null,null,null,null,null,"",null,null,"",22]
[null,"",null,null,"",null,null,null,null,null,null,0,0,0,null,null,null,null,null,null,"",null,null,"",23]
[null,"",null,null,"",null,null,null,null,null,null,0,0,0,null,null,null,null,null,null,"",null,null,"",24]
[null,"",null,null,"",null,null,null,null,null,null,0,0,0,null,null,null,null,null,null,"",null,null,"",25]
[null,"",null,null,"",null,null,null,null,null,null,0,0,0,null,null,null,null,null,null,"",null,null,"",26]
[null,"",null,null,"",null,null,null,null,null,null,0,0,0,null,null,null,null,null,null,"",null,null,"",27]
[null,"",null,null,"",null,null,null,null,null,null,0,0,0,null,null,null,null,null,null,"",null,null,"",28]
[null,"",null,null,"",null,null,null,null,null,null,0,0,0,null,null,null,null,null,null,"",null,null,"",29]
[3,"",null,null,"",null,null,null,null,null,null,0,0,0,null,null,null,null,null,null,"",null,null,"",30]
[null,null,null,null,"Crédit non Validé",null,{"$f":"SUM(G80:G109)","v":0},"CREDIT",null,null,null,{"$f":"SUMIFS(L80:L109,H80:H109,\"V\")","v":0},{"$f":"L110-N110","v":0},{"$f":"SUMIFS(N79:N109,R79:R109,\"V\")","v":0},"DEBIT",null,null,null,{"$f":"SUM(S79:S109)-S115","v":0},null," Débit non Validé moins Différé"]
[null,null,"Possibilité investissement sur  NON Validé",null,null,null,{"$f":"IF(I111>9,A439,0)","v":0},"SUR",{"$f":"F439","v":12},"MOIS",null,null,null,null,"SUR",{"$f":"S439","v":12},"MOIS",null,{"$f":"IF(P111>9,A439,0)","v":0},null,"Possibilité investissement SUR Validé"]
[null,null,null,null,null,null,"10 /mois",{"$f":"A78","v":"MARS"},null,null,null,null,{"$f":"VLOOKUP(9^9,M$79:M$109,1)","v":0},{"$f":"'REV DEP'!G51","v":0},null,"Moins Cartes",null,null,null,null,{"$f":"U76","v":"22 D SC CON Bas Don V.19.1 Format MOI"}]
["KIKO",null,null,null,null,null,null,null,null,null,null,{"$f":"A114","v":"AVRIL"},null,null,"9 /Mois"]
["AVRIL","Date",null,"Commentaire","Désignation",null,"Crédit","   V","Code","S/C","C H","Valeur","Solde","Valeur","C H","Code","S/C","V/D","Débit",null,"Désignation","Commentaire","Date"]
[null,null,null,null,null,null,null,null,null,null,null,null,{"$f":"M112-N115","v":0},{"$f":"(SUMIFS(S115,R115,\"V\"))","v":0},null,null,null,"V",{"$f":"SUMIFS(S80:S109,R80:R109,\"D\")","v":0},null,"Cartes Mois précédent"]
[null,{"$f":"IF(C116=\"\",\"\",IF(C116>DAY(EOMONTH(DATE(2022,A$145,1),0)),\"\",C116&\"/\"&A$145))","v":""},null,null,{"$f":"IF(I116=\"\",\"\",VLOOKUP(J116,OFFSET(departRV,,MATCH(I116,SCcredits,0)),2,0))","v":""},null,null,null,null,null,null,{"$f":"SUMIFS(G116,H116,\"V\")","v":0},{"$f":"IF(L116<>\"\",L116+M115-N116)","v":0},{"$f":"(SUMIFS(S116,R116,\"V\"))","v":0},null,null,null,null,null,null,{"$f":"IF(P116=\"\",\"\",VLOOKUP(Q116,OFFSET(departRV,,MATCH(P116,SCdebits,0)),2,0))","v":""},null,null,{"$f":"IF(W116=\"\",\"\",IF(W116>DAY(EOMONTH(DATE(2022,A$145,1),0)),\"\",W116&\"/\"&A$145))","v":""},1]
[null,"",null,null,"",null,null,null,null,null,null,0,{"$f":"IF(L117<>\"\",L117+M116-N117)","v":0},{"$f":"(SUMIFS(S117,R117,\"V\"))","v":0},null,null,null,null,null,null,"",null,null,"",2]
[null,"",null,null,"",null,null,null,null,null,null,0,0,0,null,null,null,null,null,null,"",null,null,"",3]
[null,"",null,null,"",null,null,null,null,null,null,0,0,0,null,null,null,null,null,null,"",null,null,"",4]
[null,"",null,null,"",null,null,null,null,null,null,0,0,0,null,null,null,null,null,null,"",null,null,"",5]
[null,"",null,null,"",null,null,null,null,null,null,0,0,0,null,null,null,null,null,null,"",null,null,"",6]
[null,"",null,null,"",null,null,null,null,null,null,0,0,0,null,null,null,null,null,null,"",null,null,"",7]
[null,"",null,null,"",null,null,null,null,null,null,0,0,0,null,null,null,null,null,null,"",null,null,"",8]
[null,"",null,null,"",null,null,null,null,null,null,0,0,0,null,null,null,null,null,null,"",null,null,"",9]
[null,"",null,null,"",null,null,null,null,null,null,0,0,0,null,null,null,null,null,null,"",null,null,"",10]
[null,"",null,null,"",null,null,null,null,null,null,0,0,0,null,null,null,null,null,null,"",null,null,"",11]
[null,"",null,null,"",null,null,null,null,null,null,0,0,0,null,null,null,null,null,null,"",null,null,"",12]
[null,"",null,null,"",null,null,null,null,null,null,0,0,0,null,null,null,null,null,null,"",null,null,"",13]
[null,"",null,null,"",null,null,null,null,null,null,0,0,0,null,null,null,null,null,null,"",null,null,"",14]
[null,"",null,null,"",null,null,null,null,null,null,0,0,0,null,null,null,null,null,null,"",null,null,"",15]
[null,"",null,null,"",null,null,null,null,null,null,0,0,0,null,null,null,null,null,null,"",null,null,"",16]
[null,"",null,null,"",null,null,null,null,null,null,0,0,0,null,null,null,null,null,null,"",null,null,"",17]
[null,"",null,null,"",null,null,null,null,null,null,0,0,0,null,null,null,null,null,null,"",null,null,"",18]
[null,"",null,null,"",null,null,null,null,null,null,0,0,0,null,null,null,null,null,null,"",null,null,"",19]
[null,"",null,null,"",null,null,null,null,null,null,0,0,0,null,null,null,null,null,null,"",null,null,"",20]
[null,"",null,null,"",null,null,null,null,null,null,0,0,0,null,null,null,null,null,null,"",null,null,"",21]
[null,"",null,null,"",null,null,null,null,null,null,0,0,0,null,null,null,null,null,null,"",null,null,"",22]
[null,"",null,null,"",null,null,null,null,null,null,0,0,0,null,null,null,null,null,null,"",null,null,"",23]
[null,"",null,null,"",null,null,null,null,null,null,0,0,0,null,null,null,null,null,null,"",null,null,"",24]
[null,"",null,null,"",null,null,null,null,null,null,0,0,0,null,null,null,null,null,null,"",null,null,"",25]
[null,"",null,null,"",null,null,null,null,null,null,0,0,0,null,null,null,null,null,null,"",null,null,"",26]
[null,"",null,null,"",null,null,null,null,null,null,0,0,0,null,null,null,null,null,null,"",null,null,"",27]
[null,"",null,null,"",null,null,null,null,null,null,0,0,0,null,null,null,null,null,null,"",null,null,"",28]
[null,"",null,null,"",null,null,null,null,null,null,0,0,0,null,null,null,null,null,null,"",null,null,"",29]
[4,"",null,null,"",null,null,null,null,null,null,0,0,0,null,null,null,null,null,null,"",null,null,"",30]
[null,null,null,null,"Crédit non Validé",null,{"$f":"SUM(G116:G145)","v":0},"CREDIT",null,null,null,{"$f":"SUMIFS(L116:L145,H116:H145,\"V\")","v":0},{"$f":"L146-N146","v":0},{"$f":"SUMIFS(N115:N145,R115:R145,\"V\")","v":0},"DEBIT",null,null,null,{"$f":"SUM(S115:S145)-S151","v":0},null," Débit non Validé moins Différé"]
[null,null,"Possibilité investissement sur  NON Validé",null,null,null,{"$f":"IF(I147>8,A439,0)","v":0},"SUR",{"$f":"F439","v":12},"MOIS",null,null,null,null,"SUR",{"$f":"S439","v":12},"MOIS",null,{"$f":"IF(P147>8,A439,0)","v":0},null,"Possibilité investissement SUR Validé"]
[null,null,null,null,null,null,"9 /Mois",{"$f":"A114","v":"AVRIL"},null,null,null,null,{"$f":"VLOOKUP(9^9,M$115:M$145,1)","v":0},null,null,null,null,null,null,null,{"$f":"U112","v":"22 D SC CON Bas Don V.19.1 Format MOI"}]
["KIKO",null,null,null,null,null,null,null,null,null,null,{"$f":"A150","v":"MAI"},null,null,"8 /Mois"]
["MAI","Date",null,"Commentaire","Désignation",null,"Crédit","   V","Code","S/C","C H","Valeur","Solde","Valeur","C H","Code","S/C","V/D","Débit",null,"Désignation","Commentaire","Date"]
[null,null,null,null,null,null,null,null,null,null,null,null,{"$f":"M148-N151","v":0},{"$f":"(SUMIFS(S151,R151,\"V\"))","v":0},null,null,null,"V",{"$f":"SUMIFS(S116:S145,R116:R145,\"D\")","v":0},null,"Cartes Mois précédent"]
[null,{"$f":"IF(C152=\"\",\"\",IF(C152>DAY(EOMONTH(DATE(2022,A$181,1),0)),\"\",C152&\"/\"&A$181))","v":""},null,null,{"$f":"IF(I152=\"\",\"\",VLOOKUP(J152,OFFSET(departRV,,MATCH(I152,SCcredits,0)),2,0))","v":""},null,null,null,null,null,null,{"$f":"SUMIFS(G152,H152,\"V\")","v":0},{"$f":"IF(L152<>\"\",L152+M151-N152)","v":0},{"$f":"(SUMIFS(S152,R152,\"V\"))","v":0},null,null,null,null,null,null,{"$f":"IF(P152=\"\",\"\",VLOOKUP(Q152,OFFSET(departRV,,MATCH(P152,SCdebits,0)),2,0))","v":""},null,null,{"$f":"IF(W152=\"\",\"\",IF(W152>DAY(EOMONTH(DATE(2022,A$181,1),0)),\"\",W152&\"/\"&A$181))","v":""},1]
[null,"",null,null,"",null,null,null,null,null,null,0,{"$f":"IF(L153<>\"\",L153+M152-N153)","v":0},{"$f":"(SUMIFS(S153,R153,\"V\"))","v":0},null,null,null,null,null,null,"",null,null,"",2]
[null,"",null,null,"",null,null,null,null,null,null,0,0,0,null,null,null,null,null,null,"",null,null,"",3]
[null,"",null,null,"",null,null,null,null,null,null,0,0,0,null,null,null,null,null,null,"",null,null,"",4]
[null,"",null,null,"",null,null,null,null,null,null,0,0,0,null,null,null,null,null,null,"",null,null,"",5]
[null,"",null,null,"",null,null,null,null,null,null,0,0,0,null,null,null,null,null,null,"",null,null,"",6]
[null,"",null,null,"",null,null,null,null,null,null,0,0,0,null,null,null,null,null,null,"",null,null,"",7]
[null,"",null,null,"",null,null,null,null,null,null,0,0,0,null,null,null,null,null,null,"",null,null,"",8]
[null,"",null,null,"",null,null,null,null,null,null,0,0,0,null,null,null,null,null,null,"",null,null,"",9]
[null,"",null,null,"",null,null,null,null,null,null,0,0,0,null,null,null,null,null,null,"",null,null,"",10]
[null,"",null,null,"",null,null,null,null,null,null,0,0,0,null,null,null,null,null,null,"",null,null,"",11]
[null,"",null,null,"",null,null,null,null,null,null,0,0,0,null,null,null,null,null,null,"",null,null,"",12]
[null,"",null,null,"",null,null,null,null,null,null,0,0,0,null,null,null,null,null,null,"",null,null,"",13]
[null,"",null,null,"",null,null,null,null,null,null,0,0,0,null,null,null,null,null,null,"",null,null,"",14]
[null,"",null,null,"",null,null,null,null,null,null,0,0,0,null,null,null,null,null,null,"",null,null,"",15]
[null,"",null,null,"",null,null,null,null,null,null,0,0,0,null,null,null,null,null,null,"",null,null,"",16]
[null,"",null,null,"",null,null,null,null,null,null,0,0,0,null,null,null,null,null,null,"",null,null,"",17]
[null,"",null,null,"",null,null,null,null,null,null,0,0,0,null,null,null,null,null,null,"",null,null,"",18]
[null,"",null,null,"",null,null,null,null,null,null,0,0,0,null,null,null,null,null,null,"",null,null,"",19]
[null,"",null,null,"",null,null,null,null,null,null,0,0,0,null,null,null,null,null,null,"",null,null,"",20]
[null,"",null,null,"",null,null,null,null,null,null,0,0,0,null,null,null,null,null,null,"",null,null,"",21]
[null,"",null,null,"",null,null,null,null,null,null,0,0,0,null,null,null,null,null,null,"",null,null,"",22]
[null,"",null,null,"",null,null,null,null,null,null,0,0,0,null,null,null,null,null,null,"",null,null,"",23]
[null,"",null,null,"",null,null,null,null,null,null,0,0,0,null,null,null,null,null,null,"",null,null,"",24]
[null,"",null,null,"",null,null,null,null,null,null,0,0,0,null,null,null,null,null,null,"",null,null,"",25]
[null,"",null,null,"",null,null,null,null,null,null,0,0,0,null,null,null,null,null,null,"",null,null,"",26]
[null,"",null,null,"",null,null,null,null,null,null,0,0,0,null,null,null,null,null,null,"",null,null,"",27]
[null,"",null,null,"",null,null,null,null,null,null,0,0,0,null,null,null,null,null,null,"",null,null,"",28]
[null,"",null,null,"",null,null,null,null,null,null,0,0,0,null,null,null,null,null,null,"",null,null,"",29]
[5,"",null,null,"",null,null,null,null,null,null,0,0,0,null,null,null,null,null,null,"",null,null,"",30]
[null,null,null,null,"Crédit non Validé",null,{"$f":"SUM(G152:G181)","v":0},"CREDIT",null,null,null,{"$f":"SUMIFS(L152:L181,H152:H181,\"V\")","v":0},{"$f":"L182-N182","v":0},{"$f":"SUMIFS(N151:N181,R151:R181,\"V\")","v":0},"DEBIT",null,null,null,{"$f":"SUM(S151:S181)-S187","v":0},null," Débit non Validé moins Différé"]
[null,null,"Possibilité investissement sur  NON Validé",null,null,null,{"$f":"IF(I183>7,A439,0)","v":0},"SUR",{"$f":"F439","v":12},"MOIS",null,null,null,null,"SUR",{"$f":"S439","v":12},"MOIS",null,{"$f":"IF(P183>7,A439,0)","v":0},null,"Possibilité investissement SUR Validé"]
[null,null,null,null,null,null,"8 /Mois",{"$f":"A150","v":"MAI"},null,null,null,null,{"$f":"VLOOKUP(9^9,M$151:M$181,1)","v":0},null,null,null,null,null,null,null,{"$f":"U148","v":"22 D SC CON Bas Don V.19.1 Format MOI"}]
["KIKO",null,null,null,null,null,null,null,null,null,null,{"$f":"A186","v":"JUIN"},null,null,"7 /Mois"]
["JUIN","Date",null,"Commentaire","Désignation",null,"Crédit","   V","Code","S/C","C H","Valeur","Solde","Valeur","C H","Code","S/C","V/D","Débit",null,"Désignation","Commentaire","Date"]
[null,null,null,null,null,null,null,null,null,null,null,null,{"$f":"M184-N187","v":0},{"$f":"(SUMIFS(S187,R187,\"V\"))","v":0},null,null,null,"V",{"$f":"SUMIFS(S152:S181,R152:R181,\"D\")","v":0},null,"Cartes Mois précédent"]
[null,{"$f":"IF(C188=\"\",\"\",IF(C188>DAY(EOMONTH(DATE(2022,A$217,1),0)),\"\",C188&\"/\"&A$217))","v":""},null,null,{"$f":"IF(I188=\"\",\"\",VLOOKUP(J188,OFFSET(departRV,,MATCH(I188,SCcredits,0)),2,0))","v":""},null,null,null,null,null,null,{"$f":"SUMIFS(G188,H188,\"V\")","v":0},{"$f":"IF(L188<>\"\",L188+M187-N188)","v":0},{"$f":"(SUMIFS(S188,R188,\"V\"))","v":0},null,null,null,null,null,null,{"$f":"IF(P188=\"\",\"\",VLOOKUP(Q188,OFFSET(departRV,,MATCH(P188,SCdebits,0)),2,0))","v":""},null,null,{"$f":"IF(W188=\"\",\"\",IF(W188>DAY(EOMONTH(DATE(2022,A$217,1),0)),\"\",W188&\"/\"&A$217))","v":""},1]
[null,"",null,null,"",null,null,null,null,null,null,0,{"$f":"IF(L189<>\"\",L189+M188-N189)","v":0},{"$f":"(SUMIFS(S189,R189,\"V\"))","v":0},null,null,null,null,null,null,"",null,null,"",2]
[null,"",null,null,"",null,null,null,null,null,null,0,0,0,null,null,null,null,null,null,"",null,null,"",3]
[null,"",null,null,"",null,null,null,null,null,null,0,0,0,null,null,null,null,null,null,"",null,null,"",4]
[null,"",null,null,"",null,null,null,null,null,null,0,0,0,null,null,null,null,null,null,"",null,null,"",5]
[null,"",null,null,"",null,null,null,null,null,null,0,0,0,null,null,null,null,null,null,"",null,null,"",6]
[null,"",null,null,"",null,null,null,null,null,null,0,0,0,null,null,null,null,null,null,"",null,null,"",7]
[null,"",null,null,"",null,null,null,null,null,null,0,0,0,null,null,null,null,null,null,"",null,null,"",8]
[null,"",null,null,"",null,null,null,null,null,null,0,0,0,null,null,null,null,null,null,"",null,null,"",9]
[null,"",null,null,"",null,null,null,null,null,null,0,0,0,null,null,null,null,null,null,"",null,null,"",10]
[null,"",null,null,"",null,null,null,null,null,null,0,0,0,null,null,null,null,null,null,"",null,null,"",11]
[null,"",null,null,"",null,null,null,null,null,null,0,0,0,null,null,null,null,null,null,"",null,null,"",12]
[null,"",null,null,"",null,null,null,null,null,null,0,0,0,null,null,null,null,null,null,"",null,null,"",13]
[null,"",null,null,"",null,null,null,null,null,null,0,0,0,null,null,null,null,null,null,"",null,null,"",14]
[null,"",null,null,"",null,null,null,null,null,null,0,0,0,null,null,null,null,null,null,"",null,null,"",15]
[null,"",null,null,"",null,null,null,null,null,null,0,0,0,null,null,null,null,null,null,"",null,null,"",16]
[null,"",null,null,"",null,null,null,null,null,null,0,0,0,null,null,null,null,null,null,"",null,null,"",17]
[null,"",null,null,"",null,null,null,null,null,null,0,0,0,null,null,null,null,null,null,"",null,null,"",18]
[null,"",null,null,"",null,null,null,null,null,null,0,0,0,null,null,null,null,null,null,"",null,null,"",19]
[null,"",null,null,"",null,null,null,null,null,null,0,0,0,null,null,null,null,null,null,"",null,null,"",20]
[null,"",null,null,"",null,null,null,null,null,null,0,0,0,null,null,null,null,null,null,"",null,null,"",21]
[null,"",null,null,"",null,null,null,null,null,null,0,0,0,null,null,null,null,null,null,"",null,null,"",22]
[null,"",null,null,"",null,null,null,null,null,null,0,0,0,null,null,null,null,null,null,"",null,null,"",23]
[null,"",null,null,"",null,null,null,null,null,null,0,0,0,null,null,null,null,null,null,"",null,null,"",24]
[null,"",null,null,"",null,null,null,null,null,null,0,0,0,null,null,null,null,null,null,"",null,null,"",25]
[null,"",null,null,"",null,null,null,null,null,null,0,0,0,null,null,null,null,null,null,"",null,null,"",26]
[null,"",null,null,"",null,null,null,null,null,null,0,0,0,null,null,null,null,null,null,"",null,null,"",27]
[null,"",null,null,"",null,null,null,null,null,null,0,0,0,null,null,null,null,null,null,"",null,null,"",28]
[null,"",null,null,"",null,null,null,null,null,null,0,0,0,null,null,null,null,null,null,"",null,null,"",29]
[6,"",null,null,"",null,null,null,null,null,null,0,0,0,null,null,null,null,null,null,"",null,null,"",30]
[null,null,null,null,"Crédit non Validé",null,{"$f":"SUM(G188:G217)","v":0},"CREDIT",null,null,null,{"$f":"SUMIFS(L188:L217,H188:H217,\"V\")","v":0},{"$f":"L218-N218","v":0},{"$f":"SUMIFS(N187:N217,R187:R217,\"V\")","v":0},"DEBIT",null,null,null,{"$f":"SUM(S187:S217)-S223","v":0},null," Débit non Validé moins Différé"]
[null,null,"Possibilité investissement sur  NON Validé",null,null,null,{"$f":"IF(I219>6,A439,0)","v":0},"SUR",{"$f":"F439","v":12},"MOIS",null,null,null,null,"SUR",{"$f":"S439","v":12},"MOIS",null,{"$f":"IF(P219>6,A439,0)","v":0},null,"Possibilité investissement SUR Validé"]
[null,null,null,null,null,null,{"$f":"O185","v":"7 /Mois"},{"$f":"A186","v":"JUIN"},null,null,null,null,{"$f":"VLOOKUP(9^9,M$187:M$217,1)","v":0},null,null,null,null,null,null,null,{"$f":"U184","v":"22 D SC CON Bas Don V.19.1 Format MOI"}]
["KIKO",null,null,null,null,null,null,null,null,null,null,{"$f":"A222","v":"JUILLET"},null,null,"6 /Mois"]
["JUILLET","Date",null,"Commentaire","Désignation",null,"Crédit","   V","Code","S/C","C H","Valeur","Solde","Valeur","C H","Code","S/C","V/D","Débit",null,"Désignation","Commentaire","Date"]
[null,null,null,null,null,null,null,null,null,null,null,null,{"$f":"M220-N223","v":0},{"$f":"(SUMIFS(S223,R223,\"V\"))","v":0},null,null,null,"V",{"$f":"SUMIFS(S188:S217,R188:R217,\"D\")","v":0},null,"Cartes Mois précédent"]
[null,{"$f":"IF(C224=\"\",\"\",IF(C224>DAY(EOMONTH(DATE(2022,A$253,1),0)),\"\",C224&\"/\"&A$253))","v":""},null,null,{"$f":"IF(I224=\"\",\"\",VLOOKUP(J224,OFFSET(departRV,,MATCH(I224,SCcredits,0)),2,0))","v":""},null,null,null,null,null,null,{"$f":"SUMIFS(G224,H224,\"V\")","v":0},{"$f":"IF(L224<>\"\",L224+M223-N224)","v":0},{"$f":"(SUMIFS(S224,R224,\"V\"))","v":0},null,null,null,null,null,null,{"$f":"IF(P224=\"\",\"\",VLOOKUP(Q224,OFFSET(departRV,,MATCH(P224,SCdebits,0)),2,0))","v":""},null,null,{"$f":"IF(W224=\"\",\"\",IF(W224>DAY(EOMONTH(DATE(2022,A$253,1),0)),\"\",W224&\"/\"&A$253))","v":""},1]
[null,"",null,null,"",null,null,null,null,null,null,0,{"$f":"IF(L225<>\"\",L225+M224-N225)","v":0},{"$f":"(SUMIFS(S225,R225,\"V\"))","v":0},null,null,null,null,null,null,"",null,null,"",2]
[null,"",null,null,"",null,null,null,null,null,null,0,0,0,null,null,null,null,null,null,"",null,null,"",3]
[null,"",null,null,"",null,null,null,null,null,null,0,0,0,null,null,null,null,null,null,"",null,null,"",4]
[null,"",null,null,"",null,null,null,null,null,null,0,0,0,null,null,null,null,null,null,"",null,null,"",5]
[null,"",null,null,"",null,null,null,null,null,null,0,0,0,null,null,null,null,null,null,"",null,null,"",6]
[null,"",null,null,"",null,null,null,null,null,null,0,0,0,null,null,null,null,null,null,"",null,null,"",7]
[null,"",null,null,"",null,null,null,null,null,null,0,0,0,null,null,null,null,null,null,"",null,null,"",8]
[null,"",null,null,"",null,null,null,null,null,null,0,0,0,null,null,null,null,null,null,"",null,null,"",9]
[null,"",null,null,"",null,null,null,null,null,null,0,0,0,null,null,null,null,null,null,"",null,null,"",10]
[null,"",null,null,"",null,null,null,null,null,null,0,0,0,null,null,null,null,null,null,"",null,null,"",11]
[null,"",null,null,"",null,null,null,null,null,null,0,0,0,null,null,null,null,null,null,"",null,null,"",12]
[null,"",null,null,"",null,null,null,null,null,null,0,0,0,null,null,null,null,null,null,"",null,null,"",13]
[null,"",null,null,"",null,null,null,null,null,null,0,0,0,null,null,null,null,null,null,"",null,null,"",14]
[null,"",null,null,"",null,null,null,null,null,null,0,0,0,null,null,null,null,null,null,"",null,null,"",15]
[null,"",null,null,"",null,null,null,null,null,null,0,0,0,null,null,null,null,null,null,"",null,null,"",16]
[null,"",null,null,"",null,null,null,null,null,null,0,0,0,null,null,null,null,null,null,"",null,null,"",17]
[null,"",null,null,"",null,null,null,null,null,null,0,0,0,null,null,null,null,null,null,"",null,null,"",18]
[null,"",null,null,"",null,null,null,null,null,null,0,0,0,null,null,null,null,null,null,"",null,null,"",19]
[null,"",null,null,"",null,null,null,null,null,null,0,0,0,null,null,null,null,null,null,"",null,null,"",20]
[null,"",null,null,"",null,null,null,null,null,null,0,0,0,null,null,null,null,null,null,"",null,null,"",21]
[null,"",null,null,"",null,null,null,null,null,null,0,0,0,null,null,null,null,null,null,"",null,null,"",22]
[null,"",null,null,"",null,null,null,null,null,null,0,0,0,null,null,null,null,null,null,"",null,null,"",23]
[null,"",null,null,"",null,null,null,null,null,null,0,0,0,null,null,null,null,null,null,"",null,null,"",24]
[null,"",null,null,"",null,null,null,null,null,null,0,0,0,null,null,null,null,null,null,"",null,null,"",25]
[null,"",null,null,"",null,null,null,null,null,null,0,0,0,null,null,null,null,null,null,"",null,null,"",26]
[null,"",null,null,"",null,null,null,null,null,null,0,0,0,null,null,null,null,null,null,"",null,null,"",27]
[null,"",null,null,"",null,null,null,null,null,null,0,0,0,null,null,null,null,null,null,"",null,null,"",28]
[null,"",null,null,"",null,null,null,null,null,null,0,0,0,null,null,null,null,null,null,"",null,null,"",29]
[7,"",null,null,"",null,null,null,null,null,null,0,0,0,null,null,null,null,null,null,"",null,null,"",30]
[null,null,null,null,"Crédit non Validé",null,{"$f":"SUM(G224:G253)","v":0},"CREDIT",null,null,null,{"$f":"SUMIFS(L224:L253,H224:H253,\"V\")","v":0},{"$f":"L254-N254","v":0},{"$f":"SUMIFS(N223:N253,R223:R253,\"V\")","v":0},"DEBIT",null,null,null,{"$f":"SUM(S223:S253)-S259","v":0},null," Débit non Validé moins Différé"]
[null,null,"Possibilité investissement sur  NON Validé",null,null,null,{"$f":"IF(I255>5,A439,0)","v":0},"SUR",{"$f":"F439","v":12},"MOIS",null,null,null,null,"SUR",{"$f":"S439","v":12},"MOIS",null,{"$f":"IF(P255>5,A439,0)","v":0},null,"Possibilité investissement SUR Validé"]
[null,null,null,null,null,null,{"$f":"O221","v":"6 /Mois"},{"$f":"A222","v":"JUILLET"},null,null,null,null,{"$f":"VLOOKUP(9^9,M$223:M$253,1)","v":0},null,null,null,null,null,null,null,{"$f":"U220","v":"22 D SC CON Bas Don V.19.1 Format MOI"}]
["KIKO",null,null,null,null,null,null,null,null,null,null,{"$f":"A258","v":"AOÛT"},null,null,"5 /Mois"]
["AOÛT","Date",null,"Commentaire","Désignation",null,"Crédit","   V","Code","S/C","C H","Valeur","Solde","Valeur","C H","Code","S/C","V/D","Débit",null,"Désignation","Commentaire","Date"]
[null,null,null,null,null,null,null,null,null,null,null,null,{"$f":"M256-N259","v":0},{"$f":"(SUMIFS(S259,R259,\"V\"))","v":0},null,null,null,"V",{"$f":"SUMIFS(S224:S253,R224:R253,\"D\")","v":0},null,"Cartes Mois précédent"]
[null,{"$f":"IF(C260=\"\",\"\",IF(C260>DAY(EOMONTH(DATE(2022,A$289,1),0)),\"\",C260&\"/\"&A$289))","v":""},null,null,{"$f":"IF(I260=\"\",\"\",VLOOKUP(J260,OFFSET(departRV,,MATCH(I260,SCcredits,0)),2,0))","v":""},null,null,null,null,null,null,{"$f":"SUMIFS(G260,H260,\"V\")","v":0},{"$f":"IF(L260<>\"\",L260+M259-N260)","v":0},{"$f":"(SUMIFS(S260,R260,\"V\"))","v":0},null,null,null,null,null,null,{"$f":"IF(P260=\"\",\"\",VLOOKUP(Q260,OFFSET(departRV,,MATCH(P260,SCdebits,0)),2,0))","v":""},null,null,{"$f":"IF(W260=\"\",\"\",IF(W260>DAY(EOMONTH(DATE(2022,A$289,1),0)),\"\",W260&\"/\"&A$289))","v":""},1]
[null,"",null,null,"",null,null,null,null,null,null,0,{"$f":"IF(L261<>\"\",L261+M260-N261)","v":0},{"$f":"(SUMIFS(S261,R261,\"V\"))","v":0},null,null,null,null,null,null,"",null,null,"",2]
[null,"",null,null,"",null,null,null,null,null,null,0,0,0,null,null,null,null,null,null,"",null,null,"",3]
[null,"",null,null,"",null,null,null,null,null,null,0,0,0,null,null,null,null,null,null,"",null,null,"",4]
[null,"",null,null,"",null,null,null,null,null,null,0,0,0,null,null,null,null,null,null,"",null,null,"",5]
[null,"",null,null,"",null,null,null,null,null,null,0,0,0,null,null,null,null,null,null,"",null,null,"",6]
[null,"",null,null,"",null,null,null,null,null,null,0,0,0,null,null,null,null,null,null,"",null,null,"",7]
[null,"",null,null,"",null,null,null,null,null,null,0,0,0,null,null,null,null,null,null,"",null,null,"",8]
[null,"",null,null,"",null,null,null,null,null,null,0,0,0,null,null,null,null,null,null,"",null,null,"",9]
[null,"",null,null,"",null,null,null,null,null,null,0,0,0,null,null,null,null,null,null,"",null,null,"",10]
[null,"",null,null,"",null,null,null,null,null,null,0,0,0,null,null,null,null,null,null,"",null,null,"",11]
[null,"",null,null,"",null,null,null,null,null,null,0,0,0,null,null,null,null,null,null,"",null,null,"",12]
[null,"",null,null,"",null,null,null,null,null,null,0,0,0,null,null,null,null,null,null,"",null,null,"",13]
[null,"",null,null,"",null,null,null,null,null,null,0,0,0,null,null,null,null,null,null,"",null,null,"",14]
[null,"",null,null,"",null,null,null,null,null,null,0,0,0,null,null,null,null,null,null,"",null,null,"",15]
[null,"",null,null,"",null,null,null,null,null,null,0,0,0,null,null,null,null,null,null,"",null,null,"",16]
[null,"",null,null,"",null,null,null,null,null,null,0,0,0,null,null,null,null,null,null,"",null,null,"",17]
[null,"",null,null,"",null,null,null,null,null,null,0,0,0,null,null,null,null,null,null,"",null,null,"",18]
[null,"",null,null,"",null,null,null,null,null,null,0,0,0,null,null,null,null,null,null,"",null,null,"",19]
[null,"",null,null,"",null,null,null,null,null,null,0,0,0,null,null,null,null,null,null,"",null,null,"",20]
[null,"",null,null,"",null,null,null,null,null,null,0,0,0,null,null,null,null,null,null,"",null,null,"",21]
[null,"",null,null,"",null,null,null,null,null,null,0,0,0,null,null,null,null,null,null,"",null,null,"",22]
[null,"",null,null,"",null,null,null,null,null,null,0,0,0,null,null,null,null,null,null,"",null,null,"",23]
[null,"",null,null,"",null,null,null,null,null,null,0,0,0,null,null,null,null,null,null,"",null,null,"",24]
[null,"",null,null,"",null,null,null,null,null,null,0,0,0,null,null,null,null,null,null,"",null,null,"",25]
[null,"",null,null,"",null,null,null,null,null,null,0,0,0,null,null,null,null,null,null,"",null,null,"",26]
[null,"",null,null,"",null,null,null,null,null,null,0,0,0,null,null,null,null,null,null,"",null,null,"",27]
[null,"",null,null,"",null,null,null,null,null,null,0,0,0,null,null,null,null,null,null,"",null,null,"",28]
[null,"",null,null,"",null,null,null,null,null,null,0,0,0,null,null,null,null,null,null,"",null,null,"",29]
[8,"",null,null,"",null,null,null,null,null,null,0,0,0,null,null,null,null,null,null,"",null,null,"",30]
[null,null,null,null,"Crédit non Validé",null,{"$f":"SUM(G260:G289)","v":0},"CREDIT",null,null,null,{"$f":"SUMIFS(L259:L289,H259:H289,\"V\")","v":0},{"$f":"L290-N290","v":0},{"$f":"SUMIFS(N259:N289,R259:R289,\"V\")","v":0},"DEBIT",null,null,null,{"$f":"SUM(S259:S289)-S295","v":0},null," Débit non Validé moins Différé"]
[null,null,"Possibilité investissement sur  NON Validé",null,null,null,{"$f":"IF(I291>4,A439,0)","v":0},"SUR",{"$f":"F439","v":12},"MOIS",null,null,null,null,"SUR",{"$f":"S439","v":12},"MOIS",null,{"$f":"IF(P291>4,A439,0)","v":0},null,"Possibilité investissement SUR Validé"]
[null,null,null,null,null,null,{"$f":"O257","v":"5 /Mois"},{"$f":"A258","v":"AOÛT"},null,null,null,null,{"$f":"VLOOKUP(9^9,M$259:M$289,1)","v":0},null,null,null,null,null,null,null,{"$f":"U256","v":"22 D SC CON Bas Don V.19.1 Format MOI"}]
["KIKO",null,null,null,null,null,null,null,null,null,null,{"$f":"A294","v":"SEPTEMBRE"},null,null,"4 /Mois"]
["SEPTEMBRE","Date",null,"Commentaire","Désignation",null,"Crédit","   V","Code","S/C","C H","Valeur","Solde","Valeur","C H","Code","S/C","V/D","Débit",null,"Désignation","Commentaire","Date"]
[null,null,null,null,null,null,null,null,null,null,null,null,{"$f":"M292-N295","v":0},{"$f":"(SUMIFS(S295,R295,\"V\"))","v":0},null,null,null,"V",{"$f":"SUMIFS(S260:S289,R260:R289,\"D\")","v":0},null,"Cartes Mois précédent"]
[null,{"$f":"IF(C296=\"\",\"\",IF(C296>DAY(EOMONTH(DATE(2022,A$325,1),0)),\"\",C296&\"/\"&A$325))","v":""},null,null,{"$f":"IF(I296=\"\",\"\",VLOOKUP(J296,OFFSET(departRV,,MATCH(I296,SCcredits,0)),2,0))","v":""},null,null,null,null,null,null,{"$f":"SUMIFS(G296,H296,\"V\")","v":0},{"$f":"IF(L296<>\"\",L296+M295-N296)","v":0},{"$f":"(SUMIFS(S296,R296,\"V\"))","v":0},null,null,null,null,null,null,{"$f":"IF(P296=\"\",\"\",VLOOKUP(Q296,OFFSET(departRV,,MATCH(P296,SCdebits,0)),2,0))","v":""},null,null,{"$f":"IF(W296=\"\",\"\",IF(W296>DAY(EOMONTH(DATE(2022,A$325,1),0)),\"\",W296&\"/\"&A$325))","v":""},1]
[null,"",null,null,"",null,null,null,null,null,null,0,{"$f":"IF(L297<>\"\",L297+M296-N297)","v":0},{"$f":"(SUMIFS(S297,R297,\"V\"))","v":0},null,null,null,null,null,null,"",null,null,"",2]
[null,"",null,null,"",null,null,null,null,null,null,0,0,0,null,null,null,null,null,null,"",null,null,"",3]
[null,"",null,null,"",null,null,null,null,null,null,0,0,0,null,null,null,null,null,null,"",null,null,"",4]
[null,"",null,null,"",null,null,null,null,null,null,0,0,0,null,null,null,null,null,null,"",null,null,"",5]
[null,"",null,null,"",null,null,null,null,null,null,0,0,0,null,null,null,null,null,null,"",null,null,"",6]
[null,"",null,null,"",null,null,null,null,null,null,0,0,0,null,null,null,null,null,null,"",null,null,"",7]
[null,"",null,null,"",null,null,null,null,null,null,0,0,0,null,null,null,null,null,null,"",null,null,"",8]
[null,"",null,null,"",null,null,null,null,null,null,0,0,0,null,null,null,null,null,null,"",null,null,"",9]
[null,"",null,null,"",null,null,null,null,null,null,0,0,0,null,null,null,null,null,null,"",null,null,"",10]
[null,"",null,null,"",null,null,null,null,null,null,0,0,0,null,null,null,null,null,null,"",null,null,"",11]
[null,"",null,null,"",null,null,null,null,null,null,0,0,0,null,null,null,null,null,null,"",null,null,"",12]
[null,"",null,null,"",null,null,null,null,null,null,0,0,0,null,null,null,null,null,null,"",null,null,"",13]
[null,"",null,null,"",null,null,null,null,null,null,0,0,0,null,null,null,null,null,null,"",null,null,"",14]
[null,"",null,null,"",null,null,null,null,null,null,0,0,0,null,null,null,null,null,null,"",null,null,"",15]
[null,"",null,null,"",null,null,null,null,null,null,0,0,0,null,null,null,null,null,null,"",null,null,"",16]
[null,"",null,null,"",null,null,null,null,null,null,0,0,0,null,null,null,null,null,null,"",null,null,"",17]
[null,"",null,null,"",null,null,null,null,null,null,0,0,0,null,null,null,null,null,null,"",null,null,"",18]
[null,"",null,null,"",null,null,null,null,null,null,0,0,0,null,null,null,null,null,null,"",null,null,"",19]
[null,"",null,null,"",null,null,null,null,null,null,0,0,0,null,null,null,null,null,null,"",null,null,"",20]
[null,"",null,null,"",null,null,null,null,null,null,0,0,0,null,null,null,null,null,null,"",null,null,"",21]
[null,"",null,null,"",null,null,null,null,null,null,0,0,0,null,null,null,null,null,null,"",null,null,"",22]
[null,"",null,null,"",null,null,null,null,null,null,0,0,0,null,null,null,null,null,null,"",null,null,"",23]
[null,"",null,null,"",null,null,null,null,null,null,0,0,0,null,null,null,null,null,null,"",null,null,"",24]
[null,"",null,null,"",null,null,null,null,null,null,0,0,0,null,null,null,null,null,null,"",null,null,"",25]
[null,"",null,null,"",null,null,null,null,null,null,0,0,0,null,null,null,null,null,null,"",null,null,"",26]
[null,"",null,null,"",null,null,null,null,null,null,0,0,0,null,null,null,null,null,null,"",null,null,"",27]
[null,"",null,null,"",null,null,null,null,null,null,0,0,0,null,null,null,null,null,null,"",null,null,"",28]
[null,"",null,null,"",null,null,null,null,null,null,0,0,0,null,null,null,null,null,null,"",null,null,"",29]
[9,"",null,null,"",null,null,null,null,null,null,0,0,0,null,null,null,null,null,null,"",null,null,"",30]
[null,null,null,null,"Crédit non Validé",null,{"$f":"SUM(G296:G325)","v":0},"CREDIT",null,null,null,{"$f":"SUMIFS(L295:L325,H295:H325,\"V\")","v":0},{"$f":"L326-N326","v":0},{"$f":"SUMIFS(N295:N325,R295:R325,\"V\")","v":0},"DEBIT",null,null,null,{"$f":"SUM(S295:S325)-S331","v":0},null," Débit non Validé moins Différé"]
[null,null,"Possibilité investissement sur  NON Validé",null,null,null,{"$f":"IF(I327>3,A439,0)","v":0},"SUR",{"$f":"F439","v":12},"MOIS",null,null,null,null,"SUR",{"$f":"S439","v":12},"MOIS",null,{"$f":"IF(P327>3,A439,0)","v":0},null,"Possibilité investissement SUR Validé"]
[null,null,null,null,null,null,{"$f":"O293","v":"4 /Mois"},{"$f":"A294","v":"SEPTEMBRE"},null,null,null,null,{"$f":"VLOOKUP(9^9,M$295:M$325,1)","v":0},null,null,null,null,null,null,null,{"$f":"U292","v":"22 D SC CON Bas Don V.19.1 Format MOI"}]
["KIKO",null,null,null,null,null,null,null,null,null,null,{"$f":"A330","v":"OCTOBRE"},null,null,"3 /Mois"]
["OCTOBRE","Date",null,"Commentaire","Désignation",null,"Crédit","   V","Code","S/C","C H","Valeur","Solde","Valeur","C H","Code","S/C","V/D","Débit",null,"Désignation","Commentaire","Date"]
[null,null,null,null,null,null,null,null,null,null,null,null,{"$f":"M328-N331","v":0},{"$f":"(SUMIFS(S331,R331,\"V\"))","v":0},null,null,null,"V",{"$f":"SUMIFS(S296:S325,R296:R325,\"D\")","v":0},null,"Cartes Mois précédent"]
[null,{"$f":"IF(C332=\"\",\"\",IF(C332>DAY(EOMONTH(DATE(2022,A$361,1),0)),\"\",C332&\"/\"&A$361))","v":""},null,null,{"$f":"IF(I332=\"\",\"\",VLOOKUP(J332,OFFSET(departRV,,MATCH(I332,SCcredits,0)),2,0))","v":""},null,null,null,null,null,null,{"$f":"SUMIFS(G332,H332,\"V\")","v":0},{"$f":"IF(L332<>\"\",L332+M331-N332)","v":0},{"$f":"(SUMIFS(S332,R332,\"V\"))","v":0},null,null,null,null,null,null,{"$f":"IF(P332=\"\",\"\",VLOOKUP(Q332,OFFSET(departRV,,MATCH(P332,SCdebits,0)),2,0))","v":""},null,null,{"$f":"IF(W332=\"\",\"\",IF(W332>DAY(EOMONTH(DATE(2022,A$361,1),0)),\"\",W332&\"/\"&A$361))","v":""},1]
[null,"",null,null,"",null,null,null,null,null,null,0,{"$f":"IF(L333<>\"\",L333+M332-N333)","v":0},{"$f":"(SUMIFS(S333,R333,\"V\"))","v":0},null,null,null,null,null,null,"",null,null,"",2]
[null,"",null,null,"",null,null,null,null,null,null,0,0,0,null,null,null,null,null,null,"",null,null,"",3]
[null,"",null,null,"",null,null,null,null,null,null,0,0,0,null,null,null,null,null,null,"",null,null,"",4]
[null,"",null,null,"",null,null,null,null,null,null,0,0,0,null,null,null,null,null,null,"",null,null,"",5]
[null,"",null,null,"",null,null,null,null,null,null,0,0,0,null,null,null,null,null,null,"",null,null,"",6]
[null,"",null,null,"",null,null,null,null,null,null,0,0,0,null,null,null,null,null,null,"",null,null,"",7]
[null,"",null,null,"",null,null,null,null,null,null,0,0,0,null,null,null,null,null,null,"",null,null,"",8]
[null,"",null,null,"",null,null,null,null,null,null,0,0,0,null,null,null,null,null,null,"",null,null,"",9]
[null,"",null,null,"",null,null,null,null,null,null,0,0,0,null,null,null,null,null,null,"",null,null,"",10]
[null,"",null,null,"",null,null,null,null,null,null,0,0,0,null,null,null,null,null,null,"",null,null,"",11]
[null,"",null,null,"",null,null,null,null,null,null,0,0,0,null,null,null,null,null,null,"",null,null,"",12]
[null,"",null,null,"",null,null,null,null,null,null,0,0,0,null,null,null,null,null,null,"",null,null,"",13]
[null,"",null,null,"",null,null,null,null,null,null,0,0,0,null,null,null,null,null,null,"",null,null,"",14]
[null,"",null,null,"",null,null,null,null,null,null,0,0,0,null,null,null,null,null,null,"",null,null,"",15]
[null,"",null,null,"",null,null,null,null,null,null,0,0,0,null,null,null,null,null,null,"",null,null,"",16]
[null,"",null,null,"",null,null,null,null,null,null,0,0,0,null,null,null,null,null,null,"",null,null,"",17]
[null,"",null,null,"",null,null,null,null,null,null,0,0,0,null,null,null,null,null,null,"",null,null,"",18]
[null,"",null,null,"",null,null,null,null,null,null,0,0,0,null,null,null,null,null,null,"",null,null,"",19]
[null,"",null,null,"",null,null,null,null,null,null,0,0,0,null,null,null,null,null,null,"",null,null,"",20]
[null,"",null,null,"",null,null,null,null,null,null,0,0,0,null,null,null,null,null,null,"",null,null,"",21]
[null,"",null,null,"",null,null,null,null,null,null,0,0,0,null,null,null,null,null,null,"",null,null,"",22]
[null,"",null,null,"",null,null,null,null,null,null,0,0,0,null,null,null,null,null,null,"",null,null,"",23]
[null,"",null,null,"",null,null,null,null,null,null,0,0,0,null,null,null,null,null,null,"",null,null,"",24]
[null,"",null,null,"",null,null,null,null,null,null,0,0,0,null,null,null,null,null,null,"",null,null,"",25]
[null,"",null,null,"",null,null,null,null,null,null,0,0,0,null,null,null,null,null,null,"",null,null,"",26]
[null,"",null,null,"",null,null,null,null,null,null,0,0,0,null,null,null,null,null,null,"",null,null,"",27]
[null,"",null,null,"",null,null,null,null,null,null,0,0,0,null,null,null,null,null,null,"",null,null,"",28]
[null,"",null,null,"",null,null,null,null,null,null,0,0,0,null,null,null,null,null,null,"",null,null,"",29]
[10,"",null,null,"",null,null,null,null,null,null,0,0,0,null,null,null,null,null,null,"",null,null,"",30]
[null,null,null,null,"Crédit non Validé",null,{"$f":"SUM(G332:G361)","v":0},"CREDIT",null,null,null,{"$f":"SUMIFS(L331:L361,H331:H361,\"V\")","v":0},{"$f":"L362-N362","v":0},{"$f":"SUMIFS(N331:N361,R331:R361,\"V\")","v":0},"DEBIT",null,null,null,{"$f":"SUM(S331:S361)-S367","v":0},null," Débit non Validé moins Différé"]
[null,null,"Possibilité investissement sur  NON Validé",null,null,null,{"$f":"IF(I363>2,A439,0)","v":0},"SUR",{"$f":"F439","v":12},"MOIS",null,null,null,null,"SUR",{"$f":"S439","v":12},"MOIS",null,{"$f":"IF(P363>2,A439,0)","v":0},null,"Possibilité investissement SUR Validé"]
[null,null,null,null,null,null,{"$f":"O329","v":"3 /Mois"},{"$f":"A330","v":"OCTOBRE"},null,null,null,null,{"$f":"VLOOKUP(9^9,M$331:M$361,1)","v":0},null,null,null,null,null,null,null,{"$f":"U328","v":"22 D SC CON Bas Don V.19.1 Format MOI"}]
["KIKO",null,null,null,null,null,null,null,null,null,null,{"$f":"A366","v":"NOVEMBRE"},null,null,"2 /Mois"]
["NOVEMBRE","Date",null,"Commentaire","Désignation",null,"Crédit","   V","Code","S/C","C H","Valeur","Solde","Valeur","C H","Code","S/C","V/D","Débit",null,"Désignation","Commentaire","Date"]
[null,null,null,null,null,null,null,null,null,null,null,null,{"$f":"M364-N367","v":0},{"$f":"(SUMIFS(S367,R367,\"V\"))","v":0},null,null,null,"V",{"$f":"SUMIFS(S332:S361,R332:R361,\"D\")","v":0},null,"Cartes Mois précédent"]
[null,{"$f":"IF(C368=\"\",\"\",IF(C368>DAY(EOMONTH(DATE(2022,A$397,1),0)),\"\",C368&\"/\"&A$397))","v":""},null,null,{"$f":"IF(I368=\"\",\"\",VLOOKUP(J368,OFFSET(departRV,,MATCH(I368,SCcredits,0)),2,0))","v":""},null,null,null,null,null,null,{"$f":"SUMIFS(G368,H368,\"V\")","v":0},{"$f":"IF(L368<>\"\",L368+M367-N368)","v":0},{"$f":"(SUMIFS(S368,R368,\"V\"))","v":0},null,null,null,null,null,null,{"$f":"IF(P368=\"\",\"\",VLOOKUP(Q368,OFFSET(departRV,,MATCH(P368,SCdebits,0)),2,0))","v":""},null,null,{"$f":"IF(W368=\"\",\"\",IF(W368>DAY(EOMONTH(DATE(2022,A$397,1),0)),\"\",W368&\"/\"&A$397))","v":""},1]
[null,"",null,null,"",null,null,null,null,null,null,0,{"$f":"IF(L369<>\"\",L369+M368-N369)","v":0},{"$f":"(SUMIFS(S369,R369,\"V\"))","v":0},null,null,null,null,null,null,"",null,null,"",2]
[null,"",null,null,"",null,null,null,null,null,null,0,0,0,null,null,null,null,null,null,"",null,null,"",3]
[null,"",null,null,"",null,null,null,null,null,null,0,0,0,null,null,null,null,null,null,"",null,null,"",4]
[null,"",null,null,"",null,null,null,null,null,null,0,0,0,null,null,null,null,null,null,"",null,null,"",5]
[null,"",null,null,"",null,null,null,null,null,null,0,0,0,null,null,null,null,null,null,"",null,null,"",6]
[null,"",null,null,"",null,null,null,null,null,null,0,0,0,null,null,null,null,null,null,"",null,null,"",7]
[null,"",null,null,"",null,null,null,null,null,null,0,0,0,null,null,null,null,null,null,"",null,null,"",8]
[null,"",null,null,"",null,null,null,null,null,null,0,0,0,null,null,null,null,null,null,"",null,null,"",9]
[null,"",null,null,"",null,null,null,null,null,null,0,0,0,null,null,null,null,null,null,"",null,null,"",10]
[null,"",null,null,"",null,null,null,null,null,null,0,0,0,null,null,null,null,null,null,"",null,null,"",11]
[null,"",null,null,"",null,null,null,null,null,null,0,0,0,null,null,null,null,null,null,"",null,null,"",12]
[null,"",null,null,"",null,null,null,null,null,null,0,0,0,null,null,null,null,null,null,"",null,null,"",13]
[null,"",null,null,"",null,null,null,null,null,null,0,0,0,null,null,null,null,null,null,"",null,null,"",14]
[null,"",null,null,"",null,null,null,null,null,null,0,0,0,null,null,null,null,null,null,"",null,null,"",15]
[null,"",null,null,"",null,null,null,null,null,null,0,0,0,null,null,null,null,null,null,"",null,null,"",16]
[null,"",null,null,"",null,null,null,null,null,null,0,0,0,null,null,null,null,null,null,"",null,null,"",17]
[null,"",null,null,"",null,null,null,null,null,null,0,0,0,null,null,null,null,null,null,"",null,null,"",18]
[null,"",null,null,"",null,null,null,null,null,null,0,0,0,null,null,null,null,null,null,"",null,null,"",19]
[null,"",null,null,"",null,null,null,null,null,null,0,0,0,null,null,null,null,null,null,"",null,null,"",20]
[null,"",null,null,"",null,null,null,null,null,null,0,0,0,null,null,null,null,null,null,"",null,null,"",21]
[null,"",null,null,"",null,null,null,null,null,null,0,0,0,null,null,null,null,null,null,"",null,null,"",22]
[null,"",null,null,"",null,null,null,null,null,null,0,0,0,null,null,null,null,null,null,"",null,null,"",23]
[null,"",null,null,"",null,null,null,null,null,null,0,0,0,null,null,null,null,null,null,"",null,null,"",24]
[null,"",null,null,"",null,null,null,null,null,null,0,0,0,null,null,null,null,null,null,"",null,null,"",25]
[null,"",null,null,"",null,null,null,null,null,null,0,0,0,null,null,null,null,null,null,"",null,null,"",26]
[null,"",null,null,"",null,null,null,null,null,null,0,0,0,null,null,null,null,null,null,"",null,null,"",27]
[null,"",null,null,"",null,null,null,null,null,null,0,0,0,null,null,null,null,null,null,"",null,null,"",28]
[null,"",null,null,"",null,null,null,null,null,null,0,0,0,null,null,null,null,null,null,"",null,null,"",29]
[11,"",null,null,"",null,null,null,null,null,null,0,0,0,null,null,null,null,null,null,"",null,null,"",30]
[null,null,null,null,"Crédit non Validé",null,{"$f":"SUM(G368:G397)","v":0},"CREDIT",null,null,null,{"$f":"SUMIFS(L368:L397,H368:H397,\"V\")","v":0},{"$f":"L398-N398","v":0},{"$f":"SUMIFS(N367:N397,R367:R397,\"V\")","v":0},"DEBIT",null,null,null,{"$f":"SUM(S367:S397)-S403","v":0},null," Débit non Validé moins Différé"]
[null,null,"Possibilité investissement sur  NON Validé",null,null,null,{"$f":"IF(I399>1,A439,0)","v":0},"SUR",{"$f":"F439","v":12},"MOIS",null,null,null,null,"SUR",{"$f":"S439","v":12},"MOIS",null,{"$f":"IF(P399>1,A439,0)","v":0},null,"Possibilité investissement SUR Validé"]
[null,null,null,null,null,null,{"$f":"O365","v":"2 /Mois"},{"$f":"A366","v":"NOVEMBRE"},null,null,null,null,{"$f":"VLOOKUP(9^9,M$367:M$397,1)","v":0},null,null,null,null,null,null,null,{"$f":"U364","v":"22 D SC CON Bas Don V.19.1 Format MOI"}]
["KIKO",null,null,null,null,null,null,null,null,null,null,{"$f":"A402","v":"DÉCEMBRE"},null,null,"1 /Mois"]
["DÉCEMBRE","Date",null,"Commentaire","Désignation",null,"Crédit","   V","Code","S/C","C H","Valeur","Solde","Valeur","C H","Code","S/C","V/D","Débit",null,"Désignation","Commentaire","Date"]
[null,null,null,null,null,null,null,null,null,null,null,null,{"$f":"M400-N403","v":0},{"$f":"(SUMIFS(S403,R403,\"V\"))","v":0},null,null,null,"V",{"$f":"SUMIFS(S368:S397,R368:R397,\"D\")","v":0},null,"Cartes Mois précédent"]
[null,{"$f":"IF(C404=\"\",\"\",IF(C404>DAY(EOMONTH(DATE(2022,A$433,1),0)),\"\",C404&\"/\"&A$433))","v":""},null,null,{"$f":"IF(I404=\"\",\"\",VLOOKUP(J404,OFFSET(departRV,,MATCH(I404,SCcredits,0)),2,0))","v":""},null,null,null,null,null,null,{"$f":"SUMIFS(G404,H404,\"V\")","v":0},{"$f":"IF(L404<>\"\",L404+M403-N404)","v":0},{"$f":"(SUMIFS(S404,R404,\"V\"))","v":0},null,null,null,null,null,null,{"$f":"IF(P404=\"\",\"\",VLOOKUP(Q404,OFFSET(departRV,,MATCH(P404,SCdebits,0)),2,0))","v":""},null,null,{"$f":"IF(W404=\"\",\"\",IF(W404>DAY(EOMONTH(DATE(2022,A$433,1),0)),\"\",W404&\"/\"&A$433))","v":""},1]
[null,"",null,null,"",null,null,null,null,null,null,0,{"$f":"IF(L405<>\"\",L405+M404-N405)","v":0},{"$f":"(SUMIFS(S405,R405,\"V\"))","v":0},null,null,null,null,null,null,"",null,null,"",2]
[null,"",null,null,"",null,null,null,null,null,null,0,0,0,null,null,null,null,null,null,"",null,null,"",3]
[null,"",null,null,"",null,null,null,null,null,null,0,0,0,null,null,null,null,null,null,"",null,null,"",4]
[null,"",null,null,"",null,null,null,null,null,null,0,0,0,null,null,null,null,null,null,"",null,null,"",5]
[null,"",null,null,"",null,null,null,null,null,null,0,0,0,null,null,null,null,null,null,"",null,null,"",6]
[null,"",null,null,"",null,null,null,null,null,null,0,0,0,null,null,null,null,null,null,"",null,null,"",7]
[null,"",null,null,"",null,null,null,null,null,null,0,0,0,null,null,null,null,null,null,"",null,null,"",8]
[null,"",null,null,"",null,null,null,null,null,null,0,0,0,null,null,null,null,null,null,"",null,null,"",9]
[null,"",null,null,"",null,null,null,null,null,null,0,0,0,null,null,null,null,null,null,"",null,null,"",10]
[null,"",null,null,"",null,null,null,null,null,null,0,0,0,null,null,null,null,null,null,"",null,null,"",11]
[null,"",null,null,"",null,null,null,null,null,null,0,0,0,null,null,null,null,null,null,"",null,null,"",12]
[null,"",null,null,"",null,null,null,null,null,null,0,0,0,null,null,null,null,null,null,"",null,null,"",13]
[null,"",null,null,"",null,null,null,null,null,null,0,0,0,null,null,null,null,null,null,"",null,null,"",14]
[null,"",null,null,"",null,null,null,null,null,null,0,0,0,null,null,null,null,null,null,"",null,null,"",15]
[null,"",null,null,"",null,null,null,null,null,null,0,0,0,null,null,null,null,null,null,"",null,null,"",16]
[null,"",null,null,"",null,null,null,null,null,null,0,0,0,null,null,null,null,null,null,"",null,null,"",17]
[null,"",null,null,"",null,null,null,null,null,null,0,0,0,null,null,null,null,null,null,"",null,null,"",18]
[null,"",null,null,"",null,null,null,null,null,null,0,0,0,null,null,null,null,null,null,"",null,null,"",19]
[null,"",null,null,"",null,null,null,null,null,null,0,0,0,null,null,null,null,null,null,"",null,null,"",20]
[null,"",null,null,"",null,null,null,null,null,null,0,0,0,null,null,null,null,null,null,"",null,null,"",21]
[null,"",null,null,"",null,null,null,null,null,null,0,0,0,null,null,null,null,null,null,"",null,null,"",22]
[null,"",null,null,"",null,null,null,null,null,null,0,0,0,null,null,null,null,null,null,"",null,null,"",23]
[null,"",null,null,"",null,null,null,null,null,null,0,0,0,null,null,null,null,null,null,"",null,null,"",24]
[null,"",null,null,"",null,null,null,null,null,null,0,0,0,null,null,null,null,null,null,"",null,null,"",25]
[null,"",null,null,"",null,null,null,null,null,null,0,0,0,null,null,null,null,null,null,"",null,null,"",26]
[null,"",null,null,"",null,null,null,null,null,null,0,0,0,null,null,null,null,null,null,"",null,null,"",27]
[null,"",null,null,"",null,null,null,null,null,null,0,0,0,null,null,null,null,null,null,"",null,null,"",28]
[null,"",null,null,"",null,null,null,null,null,null,0,0,0,null,null,null,null,null,null,"",null,null,"",29]
[12,"",null,null,"",null,null,null,null,null,null,0,0,0,null,null,null,null,null,null,"",null,null,"",30]
[null,null,null,null,"Crédit non Validé",null,{"$f":"SUM(G403:G433)","v":0},"CREDIT",null,null,null,{"$f":"SUMIFS(L404:L433,H404:H433,\"V\")","v":0},{"$f":"L434-N434","v":0},{"$f":"SUMIFS(N403:N433,R403:R433,\"V\")","v":0},"DEBIT",null,null,null,{"$f":"SUM(S403:S433)-S435","v":0},null," Débit non Validé moins Différé"]
[null,null,null,null,null,null,null,null,{"$f":"U400","v":"22 D SC CON Bas Don V.19.1 Format MOI"},null,null,null,null,null,null,null,null,"D",{"$f":"SUMIFS(S403:S433,R403:R433,\"D\")","v":0},null,"Cartes Mois précédent"]
[]
[null,null,null,"Possibilité investissement sur  NON Validé",null,null,null,{"$f":"Prévisionnel!J40","v":0},null,null,null,{"$f":"SUMIFS(G437,H437,\"V\")","v":0},null,null,null,{"$f":"Prévisionnel!J18","v":0},null,null,"Possibilité investissement SUR Validé"]
[null,null,null,"A valider pour proportionnel",null,null,null,null,null,{"$f":"A402","v":"DÉCEMBRE"},null,null,{"$f":"VLOOKUP(9^9,M$403:M$433,1)","v":0},null,null,null,null,null,null,null,"A valider pour proportionnel"]
[{"$f":"Prévisionnel!J40","v":0},null,"BUDGET DEPENSES",null,"MOIS",12,null,null,null,null,null,{"$f":"Prévisionnel!H40","v":0},null,{"$f":"Prévisionnel!H18","v":0},null,"MOIS",null,null,12,null,"BUDGET DEPENSES",null,{"$f":"Prévisionnel!J18","v":0}]
[null,null,null,null,"Montant a ajouter",{"$f":"L439","v":0},null,null,null,null,null,null,null,null,null,null,null,"Montant a ajouter",null,null,{"$f":"P437*S439","v":0}]

{"sheet":"REV DEP","index":1,"n_rows":176,"n_cols":22,"rows_kept":176,"cut":false,"hidden":false,"merged":[[156,2,156,3],[162,2,162,3],[79,2,79,3],[113,2,115,2],[139,2,139,3],[144,2,144,3],[149,2,149,3],[146,2,146,3],[129,2,129,3],[147,2,147,3],[120,2,120,3],[103,2,103,3],[116,2,116,3],[123,2,123,3],[125,2,125,3],[128,2,128,3],[109,2,109,3],[106,2,106,3],[126,2,126,3],[142,2,142,3],[141,2,141,3],[35,2,35,3],[78,2,78,3],[155,2,155,3],[105,2,105,3],[100,2,100,3],[104,2,104,3],[110,2,110,3],[107,2,107,3],[124,2,124,3],[85,2,85,3],[83,2,83,3],[84,2,84,3],[86,2,86,3],[153,2,153,3],[47,2,47,3],[46,2,46,3],[48,2,48,3],[50,2,50,3],[55,2,56,2],[88,2,88,3],[39,2,39,3],[74,2,74,3],[73,2,73,3],[72,2,72,3],[5,2,5,3],[36,2,36,3],[64,2,64,3],[111,2,111,3],[22,2,22,3],[37,2,37,3],[38,2,38,3],[138,2,138,3],[95,2,95,3],[99,2,99,3],[80,2,80,3],[6,2,6,3],[10,2,10,3],[18,2,18,3],[81,2,81,3],[82,2,82,3],[119,2,119,3],[117,2,117,3],[130,2,130,3],[60,2,60,3],[33,2,33,3],[94,2,94,3],[42,3,43,3],[34,2,34,3],[3,2,3,3],[108,2,108,3],[122,2,122,3],[121,2,121,3],[70,2,70,3],[67,2,67,3],[63,2,63,3],[65,2,65,3],[93,2,93,3],[71,2,71,3],[91,2,91,3],[68,2,68,3],[75,2,75,3],[62,2,62,3],[69,2,69,3],[102,2,102,3],[92,2,92,3],[40,2,40,3],[66,2,66,3],[98,2,98,3],[45,2,45,3],[49,2,49,3],[54,2,54,3],[52,2,52,3],[170,2,172,2],[173,2,175,2],[176,2,176,3],[53,2,53,3],[101,2,101,3],[164,2,164,3],[140,2,140,3],[143,2,143,3],[145,2,145,3],[148,2,148,3],[118,2,118,3],[166,2,166,3],[165,2,165,3],[161,2,161,3],[167,2,167,3],[127,2,127,3],[163,2,163,3],[152,2,152,3],[158,2,158,3],[157,2,157,3],[150,2,150,3],[154,2,154,3],[151,2,151,3],[87,2,87,3]]}
[]
[null,null,null,null,null,null,null,null,null,null,null,null,null,null,null,null,null,{"$f":"'Frais annuel 22'!AC15","v":0}]
[null,"REVENUS",null,null,null,null,null,null,null,null,null,null,null,null,null,null,"TOTAUX ANNEE","REVENUS"]
[null,null,"Revenus",null,"JANVIER","FEVRIER","MARS","AVRIL","MAI","JUIN","JUILLET","AOUT","SEPTEMBRE","OCTOBRE","NOVEMBRE ","DECEMBRE",{"$f":"'Frais annuel 22'!V400","v":0},"Désignations"]
[null,null,null,"R E V ",{"$f":"SUMIFS('Frais annuel 22'!L8:L37,'Frais annuel 22'!I8:I37,\"REV\")","v":0},{"$f":"SUMIFS('Frais annuel 22'!L44:L73,'Frais annuel 22'!I44:I73,\"REV\")","v":0},{"$f":"SUMIFS('Frais annuel 22'!L80:L109,'Frais annuel 22'!I80:I109,\"REV\")","v":0},{"$f":"SUMIFS('Frais annuel 22'!L116:L145,'Frais annuel 22'!I116:I145,\"REV\")","v":0},{"$f":"SUMIFS('Frais annuel 22'!L152:L181,'Frais annuel 22'!I152:I181,\"REV\")","v":0},{"$f":"SUMIFS('Frais annuel 22'!L188:L217,'Frais annuel 22'!I188:I217,\"REV\")","v":0},{"$f":"SUMIFS('Frais annuel 22'!L224:L253,'Frais annuel 22'!I224:I253,\"REV\")","v":0},{"$f":"SUMIFS('Frais annuel 22'!L260:L289,'Frais annuel 22'!I260:I289,\"REV\")","v":0},{"$f":"SUMIFS('Frais annuel 22'!L296:L325,'Frais annuel 22'!I296:I325,\"REV\")","v":0},{"$f":"SUMIFS('Frais annuel 22'!L332:L361,'Frais annuel 22'!I332:I361,\"REV\")","v":0},{"$f":"SUMIFS('Frais annuel 22'!L368:L397,'Frais annuel 22'!I368:I397,\"REV\")","v":0},{"$f":"SUMIFS('Frais annuel 22'!L404:L433,'Frais annuel 22'!I404:I433,\"REV\")","v":0},{"$f":"SUM(E5:P5)","v":0}]
[null,null,"ARC",null,{"$f":"SUMIFS('Frais annuel 22'!L8:L37,'Frais annuel 22'!J8:J37,\"ARC\")","v":0},{"$f":"SUMIFS('Frais annuel 22'!L44:L73,'Frais annuel 22'!J44:J73,\"ARC\")","v":0},{"$f":"SUMIFS('Frais annuel 22'!L80:L109,'Frais annuel 22'!J80:J109,\"ARC\")","v":0},{"$f":"SUMIFS('Frais annuel 22'!L116:L145,'Frais annuel 22'!J116:J145,\"ARC\")","v":0},{"$f":"SUMIFS('Frais annuel 22'!L152:L181,'Frais annuel 22'!J152:J181,\"ARC\")","v":0},{"$f":"SUMIFS('Frais annuel 22'!L188:L217,'Frais annuel 22'!J188:J217,\"ARC\")","v":0},{"$f":"SUMIFS('Frais annuel 22'!L224:L253,'Frais annuel 22'!J224:J253,\"ARC\")","v":0},{"$f":"SUMIFS('Frais annuel 22'!L260:L289,'Frais annuel 22'!J260:J289,\"ARC\")","v":0},{"$f":"SUMIFS('Frais annuel 22'!L296:L325,'Frais annuel 22'!J296:J325,\"ARC\")","v":0},{"$f":"SUMIFS('Frais annuel 22'!L332:L361,'Frais annuel 22'!J332:J361,\"ARC\")","v":0},{"$f":"SUMIFS('Frais annuel 22'!L368:L397,'Frais annuel 22'!J368:J397,\"ARC\")","v":0},{"$f":"SUMIFS('Frais annuel 22'!L404:L433,'Frais annuel 22'!J404:J433,\"ARC\")","v":0},0,{"$f":"DATA!E31","v":"ALPRO ARRCO Prest BTP"}]
[null,null,"GA0",null,{"$f":"SUMIFS('Frais annuel 22'!L8:L37,'Frais annuel 22'!J8:J37,\"GA0\")","v":0},{"$f":"SUMIFS('Frais annuel 22'!L45:L74,'Frais annuel 22'!J45:J74,\"GA0\")","v":0},{"$f":"SUMIFS('Frais annuel 22'!L80:L109,'Frais annuel 22'!J80:J109,\"GA0\")","v":0},{"$f":"SUMIFS('Frais annuel 22'!L117:L146,'Frais annuel 22'!J117:J146,\"GA0\")","v":0},{"$f":"SUMIFS('Frais annuel 22'!L152:L181,'Frais annuel 22'!J152:J181,\"GA0\")","v":0},{"$f":"SUMIFS('Frais annuel 22'!L188:L217,'Frais annuel 22'!J188:J217,\"GA0\")","v":0},{"$f":"SUMIFS('Frais annuel 22'!L224:L253,'Frais annuel 22'!J224:J253,\"GA0\")","v":0},{"$f":"SUMIFS('Frais annuel 22'!L260:L289,'Frais annuel 22'!J260:J289,\"GA0\")","v":0},{"$f":"SUMIFS('Frais annuel 22'!L296:L325,'Frais annuel 22'!J296:J325,\"GA0\")","v":0},{"$f":"SUMIFS('Frais annuel 22'!L332:L361,'Frais annuel 22'!J332:J361,\"GA0\")","v":0},{"$f":"SUMIFS('Frais annuel 22'!L368:L397,'Frais annuel 22'!J368:J397,\"GA0\")","v":0},{"$f":"SUMIFS('Frais annuel 22'!L404:L433,'Frais annuel 22'!J404:J433,\"GA0\")","v":0},0,{"$f":"DATA!E32","v":"GROUPAMA GAN VIE"}]
[null,null,null," ESP  DIV",{"$f":"SUMIFS('Frais annuel 22'!L$8:L$37,'Frais annuel 22'!J$8:J$37,\"DIV\",'Frais annuel 22'!K$8:K$37,\"ESP\")","v":0},{"$f":"SUMIFS('Frais annuel 22'!L$44:L$73,'Frais annuel 22'!J$44:J$73,\"DIV\",'Frais annuel 22'!K$44:K$73,\"ESP\")","v":0},{"$f":"SUMIFS('Frais annuel 22'!L$80:L$109,'Frais annuel 22'!J$80:J$109,\"DIV\",'Frais annuel 22'!K$80:K$109,\"ESP\")","v":0},{"$f":"SUMIFS('Frais annuel 22'!L$116:L$145,'Frais annuel 22'!J$116:J$145,\"DIV\",'Frais annuel 22'!K$116:K$145,\"ESP\")","v":0},{"$f":"SUMIFS('Frais annuel 22'!L$152:L$181,'Frais annuel 22'!J$152:J$181,\"DIV\",'Frais annuel 22'!K$152:K$181,\"ESP\")","v":0},{"$f":"SUMIFS('Frais annuel 22'!L$188:L$217,'Frais annuel 22'!J$188:J$217,\"DIV\",'Frais annuel 22'!K$188:K$217,\"ESP\")","v":0},{"$f":"SUMIFS('Frais annuel 22'!L$224:L$253,'Frais annuel 22'!J$224:J$253,\"DIV\",'Frais annuel 22'!K$224:K$253,\"ESP\")","v":0},{"$f":"SUMIFS('Frais annuel 22'!L$260:L$289,'Frais annuel 22'!J$260:J$289,\"DIV\",'Frais annuel 22'!K$260:K$289,\"ESP\")","v":0},{"$f":"SUMIFS('Frais annuel 22'!L$296:L$325,'Frais annuel 22'!J$296:J$325,\"DIV\",'Frais annuel 22'!K$296:K$325,\"ESP\")","v":0},{"$f":"SUMIFS('Frais annuel 22'!L$322:L$361,'Frais annuel 22'!J$322:J$361,\"DIV\",'Frais annuel 22'!K$322:K$361,\"ESP\")","v":0},{"$f":"SUMIFS('Frais annuel 22'!L$368:L$397,'Frais annuel 22'!J$368:J$397,\"DIV\",'Frais annuel 22'!K$368:K$397,\"ESP\")","v":0},{"$f":"SUMIFS('Frais annuel 22'!L$404:L$433,'Frais annuel 22'!J$404:J$433,\"DIV\",'Frais annuel 22'!K$404:K$433,\"ESP\")","v":0},0,{"$f":"DATA!E33","v":"Autre Virement"}]
[null,null,null,"CH  DIV",{"$f":"SUMIFS('Frais annuel 22'!L$8:L$37,'Frais annuel 22'!J$8:J$37,\"DIV\",'Frais annuel 22'!K$8:K$37,\"CH\")","v":0},{"$f":"SUMIFS('Frais annuel 22'!L$44:L$73,'Frais annuel 22'!J$44:J$73,\"DIV\",'Frais annuel 22'!K$44:K$73,\"CH\")","v":0},{"$f":"SUMIFS('Frais annuel 22'!L$80:L$109,'Frais annuel 22'!J$80:J$109,\"DIV\",'Frais annuel 22'!K$80:K$109,\"CH\")","v":0},{"$f":"SUMIFS('Frais annuel 22'!L$116:L$145,'Frais annuel 22'!J$116:J$145,\"DIV\",'Frais annuel 22'!K$116:K$145,\"CH\")","v":0},{"$f":"SUMIFS('Frais annuel 22'!L$152:L$181,'Frais annuel 22'!J$152:J$181,\"DIV\",'Frais annuel 22'!K$152:K$181,\"CH\")","v":0},{"$f":"SUMIFS('Frais annuel 22'!L$188:L$217,'Frais annuel 22'!J$188:J$217,\"DIV\",'Frais annuel 22'!K$188:K$217,\"CH\")","v":0},{"$f":"SUMIFS('Frais annuel 22'!L$224:L$253,'Frais annuel 22'!J$224:J$253,\"DIV\",'Frais annuel 22'!K$224:K$253,\"CH\")","v":0},{"$f":"SUMIFS('Frais annuel 22'!L$260:L$289,'Frais annuel 22'!J$260:J$289,\"DIV\",'Frais annuel 22'!K$260:K$289,\"CH\")","v":0},{"$f":"SUMIFS('Frais annuel 22'!L$296:L$325,'Frais annuel 22'!J$296:J$325,\"DIV\",'Frais annuel 22'!K$296:K$325,\"CH\")","v":0},{"$f":"SUMIFS('Frais annuel 22'!L$322:L$361,'Frais annuel 22'!J$322:J$361,\"DIV\",'Frais annuel 22'!K$322:K$361,\"CH\")","v":0},{"$f":"SUMIFS('Frais annuel 22'!L$368:L$397,'Frais annuel 22'!J$368:J$397,\"DIV\",'Frais annuel 22'!K$368:K$397,\"CH\")","v":0},{"$f":"SUMIFS('Frais annuel 22'!L$404:L$433,'Frais annuel 22'!J$404:J$433,\"DIV\",'Frais annuel 22'!K$404:K$433,\"CH\")","v":0},0,"TOTAL"]
[null,null,null,"VIREMENT  DIV",{"$f":"SUMIFS('Frais annuel 22'!L$8:L$37,'Frais annuel 22'!J$8:J$37,\"DIV\",'Frais annuel 22'!K$8:K$37,\"VIR\")","v":0},{"$f":"SUMIFS('Frais annuel 22'!L$44:L$73,'Frais annuel 22'!J$44:J$73,\"DIV\",'Frais annuel 22'!K$44:K$73,\"VIR\")","v":0},{"$f":"SUMIFS('Frais annuel 22'!L$80:L$109,'Frais annuel 22'!J$80:J$109,\"DIV\",'Frais annuel 22'!K$80:K$109,\"VIR\")","v":0},{"$f":"SUMIFS('Frais annuel 22'!L$116:L$145,'Frais annuel 22'!J$116:J$145,\"DIV\",'Frais annuel 22'!K$116:K$145,\"VIR\")","v":0},{"$f":"SUMIFS('Frais annuel 22'!L$152:L$181,'Frais annuel 22'!J$152:J$181,\"DIV\",'Frais annuel 22'!K$152:K$181,\"VIR\")","v":0},{"$f":"SUMIFS('Frais annuel 22'!L$188:L$217,'Frais annuel 22'!J$188:J$217,\"DIV\",'Frais annuel 22'!K$188:K$217,\"VIR\")","v":0},{"$f":"SUMIFS('Frais annuel 22'!L$224:L$253,'Frais annuel 22'!J$224:J$253,\"DIV\",'Frais annuel 22'!K$224:K$253,\"VIR\")","v":0},{"$f":"SUMIFS('Frais annuel 22'!L$260:L$289,'Frais annuel 22'!J$260:J$289,\"DIV\",'Frais annuel 22'!K$260:K$289,\"VIR\")","v":0},{"$f":"SUMIFS('Frais annuel 22'!L$296:L$325,'Frais annuel 22'!J$296:J$325,\"DIV\",'Frais annuel 22'!K$296:K$325,\"VIR\")","v":0},{"$f":"SUMIFS('Frais annuel 22'!L$322:L$361,'Frais annuel 22'!J$322:J$361,\"DIV\",'Frais annuel 22'!K$322:K$361,\"VIR\")","v":0},{"$f":"SUMIFS('Frais annuel 22'!L$368:L$397,'Frais annuel 22'!J$368:J$397,\"DIV\",'Frais annuel 22'!K$368:K$397,\"VIR\")","v":0},{"$f":"SUMIFS('Frais annuel 22'!L$404:L$433,'Frais annuel 22'!J$404:J$433,\"DIV\",'Frais annuel 22'!K$404:K$433,\"VIR\")","v":0},0,{"$f":"SUM(Q8:Q10)","v":0}]
[null,null,"RET",null,{"$f":"SUMIFS('Frais annuel 22'!L8:L37,'Frais annuel 22'!J8:J37,\"RET\")","v":0},{"$f":"SUMIFS('Frais annuel 22'!L44:L73,'Frais annuel 22'!J44:J73,\"RET\")","v":0},{"$f":"SUMIFS('Frais annuel 22'!L80:L109,'Frais annuel 22'!J80:J109,\"RET\")","v":0},{"$f":"SUMIFS('Frais annuel 22'!L116:L145,'Frais annuel 22'!J116:J145,\"RET\")","v":0},{"$f":"SUMIFS('Frais annuel 22'!L152:L181,'Frais annuel 22'!J152:J181,\"RET\")","v":0},{"$f":"SUMIFS('Frais annuel 22'!L188:L217,'Frais annuel 22'!J188:J217,\"RET\")","v":0},{"$f":"SUMIFS('Frais annuel 22'!L224:L253,'Frais annuel 22'!J224:J253,\"RET\")","v":0},{"$f":"SUMIFS('Frais annuel 22'!L260:L289,'Frais annuel 22'!J260:J289,\"RET\")","v":0},{"$f":"SUMIFS('Frais annuel 22'!L296:L325,'Frais annuel 22'!J296:J325,\"RET\")","v":0},{"$f":"SUMIFS('Frais annuel 22'!L332:L361,'Frais annuel 22'!J332:J361,\"RET\")","v":0},{"$f":"SUMIFS('Frais annuel 22'!L368:L397,'Frais annuel 22'!J368:J397,\"RET\")","v":0},{"$f":"SUMIFS('Frais annuel 22'!L404:L433,'Frais annuel 22'!J404:J433,\"RET\")","v":0},0,{"$f":"DATA!E34","v":"Caisse Ass Retraite "}]
[null,null,null,"Sous Total :",{"$f":"SUM(E6:E11)","v":0},{"$f":"SUM(F6:F11)","v":0},{"$f":"SUM(G6:G11)","v":0},{"$f":"SUM(H6:H11)","v":0},0,0,0,0,0,0,0,{"$f":"SUM(P6:P11)","v":0},{"$f":"SUM(Q6:Q11)","v":0}]
[null,null,null,"R E M ",{"$f":"SUMIFS('Frais annuel 22'!L8:L37,'Frais annuel 22'!I8:I37,\"REM\")","v":0},{"$f":"SUMIFS('Frais annuel 22'!L44:L73,'Frais annuel 22'!I44:I73,\"REM\")","v":0},{"$f":"SUMIFS('Frais annuel 22'!L80:L109,'Frais annuel 22'!I80:I109,\"REM\")","v":0},{"$f":"SUMIFS('Frais annuel 22'!L116:L145,'Frais annuel 22'!I116:I145,\"REM\")","v":0},{"$f":"SUMIFS('Frais annuel 22'!L152:L181,'Frais annuel 22'!I152:I181,\"REM\")","v":0},{"$f":"SUMIFS('Frais annuel 22'!L188:L217,'Frais annuel 22'!I188:I217,\"REM\")","v":0},{"$f":"SUMIFS('Frais annuel 22'!L224:L253,'Frais annuel 22'!I224:I253,\"REM\")","v":0},{"$f":"SUMIFS('Frais annuel 22'!L260:L289,'Frais annuel 22'!I260:I289,\"REM\")","v":0},{"$f":"SUMIFS('Frais annuel 22'!L296:L325,'Frais annuel 22'!I296:I325,\"REM\")","v":0},{"$f":"SUMIFS('Frais annuel 22'!L332:L361,'Frais annuel 22'!I332:I361,\"REM\")","v":0},{"$f":"SUMIFS('Frais annuel 22'!L368:L397,'Frais annuel 22'!I368:I397,\"REM\")","v":0},{"$f":"SUMIFS('Frais annuel 22'!L404:L433,'Frais annuel 22'!I404:I433,\"REM\")","v":0},{"$f":"SUM(E13:P13)","v":0}]
[null,null,null,"AM",{"$f":"SUMIFS('Frais annuel 22'!L8:L37,'Frais annuel 22'!J8:J37,\"AM\")","v":0},{"$f":"SUMIFS('Frais annuel 22'!L44:L73,'Frais annuel 22'!J44:J73,\"AM\")","v":0},{"$f":"SUMIFS('Frais annuel 22'!L80:L109,'Frais annuel 22'!J80:J109,\"AM\")","v":0},{"$f":"SUMIFS('Frais annuel 22'!L116:L145,'Frais annuel 22'!J116:J145,\"AM\")","v":0},{"$f":"SUMIFS('Frais annuel 22'!L152:L181,'Frais annuel 22'!J152:J181,\"AM\")","v":0},{"$f":"SUMIFS('Frais annuel 22'!L188:L217,'Frais annuel 22'!J188:J217,\"AM\")","v":0},{"$f":"SUMIFS('Frais annuel 22'!L224:L253,'Frais annuel 22'!J224:J253,\"AM\")","v":0},{"$f":"SUMIFS('Frais annuel 22'!L260:L289,'Frais annuel 22'!J260:J289,\"AM\")","v":0},{"$f":"SUMIFS('Frais annuel 22'!L296:L325,'Frais annuel 22'!J296:J325,\"AM\")","v":0},{"$f":"SUMIFS('Frais annuel 22'!L332:L361,'Frais annuel 22'!J332:J361,\"AM\")","v":0},{"$f":"SUMIFS('Frais annuel 22'!L368:L397,'Frais annuel 22'!J368:J397,\"AM\")","v":0},{"$f":"SUMIFS('Frais annuel 22'!L404:L433,'Frais annuel 22'!J404:J433,\"AM\")","v":0},0,{"$f":"DATA!G31","v":"C.P.A.M. ALBI"}]
[null,null,null,"ESP  BP",{"$f":"SUMIFS('Frais annuel 22'!L$8:L$37,'Frais annuel 22'!J$8:J$37,\"BP\",'Frais annuel 22'!K$8:K$37,\"ESP\")","v":0},{"$f":"SUMIFS('Frais annuel 22'!L$44:L$73,'Frais annuel 22'!J$44:J$73,\"BP\",'Frais annuel 22'!K$44:K$73,\"ESP\")","v":0},{"$f":"SUMIFS('Frais annuel 22'!L$80:L$109,'Frais annuel 22'!J$80:J$109,\"BP\",'Frais annuel 22'!K$80:K$109,\"ESP\")","v":0},{"$f":"SUMIFS('Frais annuel 22'!L$116:L$145,'Frais annuel 22'!J$116:J$145,\"BP\",'Frais annuel 22'!K$116:K$145,\"ESP\")","v":0},{"$f":"SUMIFS('Frais annuel 22'!L$152:L$181,'Frais annuel 22'!J$152:J$181,\"BP\",'Frais annuel 22'!K$152:K$181,\"ESP\")","v":0},{"$f":"SUMIFS('Frais annuel 22'!L$188:L$217,'Frais annuel 22'!J$188:J$217,\"BP\",'Frais annuel 22'!K$188:K$217,\"ESP\")","v":0},{"$f":"SUMIFS('Frais annuel 22'!L$224:L$253,'Frais annuel 22'!J$224:J$253,\"BP\",'Frais annuel 22'!K$224:K$253,\"ESP\")","v":0},{"$f":"SUMIFS('Frais annuel 22'!L$260:L$289,'Frais annuel 22'!J$260:J$289,\"BP\",'Frais annuel 22'!K$260:K$289,\"ESP\")","v":0},{"$f":"SUMIFS('Frais annuel 22'!L$296:L$325,'Frais annuel 22'!J$296:J$325,\"BP\",'Frais annuel 22'!K$296:K$325,\"ESP\")","v":0},{"$f":"SUMIFS('Frais annuel 22'!L$322:L$361,'Frais annuel 22'!J$322:J$361,\"BP\",'Frais annuel 22'!K$322:K$361,\"ESP\")","v":0},{"$f":"SUMIFS('Frais annuel 22'!L$368:L$397,'Frais annuel 22'!J$368:J$397,\"BP\",'Frais annuel 22'!K$368:K$397,\"ESP\")","v":0},{"$f":"SUMIFS('Frais annuel 22'!L$404:L$433,'Frais annuel 22'!J$404:J$433,\"BP\",'Frais annuel 22'!K$404:K$433,\"ESP\")","v":0},0,{"$f":"DATA!G32","v":"PIERROT"},null,null,null,{"$f":"F43","v":0}]
[null,null,null,"CH BP",{"$f":"SUMIFS('Frais annuel 22'!L$8:L$37,'Frais annuel 22'!J$8:J$37,\"BP\",'Frais annuel 22'!K$8:K$37,\"CH\")","v":0},{"$f":"SUMIFS('Frais annuel 22'!L$44:L$73,'Frais annuel 22'!J$44:J$73,\"BP\",'Frais annuel 22'!K$44:K$73,\"CH\")","v":0},{"$f":"SUMIFS('Frais annuel 22'!L$80:L$109,'Frais annuel 22'!J$80:J$109,\"BP\",'Frais annuel 22'!K$80:K$109,\"CH\")","v":0},{"$f":"SUMIFS('Frais annuel 22'!L$116:L$145,'Frais annuel 22'!J$116:J$145,\"BP\",'Frais annuel 22'!K$116:K$145,\"CH\")","v":0},{"$f":"SUMIFS('Frais annuel 22'!L$152:L$181,'Frais annuel 22'!J$152:J$181,\"BP\",'Frais annuel 22'!K$152:K$181,\"CH\")","v":0},{"$f":"SUMIFS('Frais annuel 22'!L$188:L$217,'Frais annuel 22'!J$188:J$217,\"BP\",'Frais annuel 22'!K$188:K$217,\"CH\")","v":0},{"$f":"SUMIFS('Frais annuel 22'!L$224:L$253,'Frais annuel 22'!J$224:J$253,\"BP\",'Frais annuel 22'!K$224:K$253,\"CH\")","v":0},{"$f":"SUMIFS('Frais annuel 22'!L$260:L$289,'Frais annuel 22'!J$260:J$289,\"BP\",'Frais annuel 22'!K$260:K$289,\"CH\")","v":0},{"$f":"SUMIFS('Frais annuel 22'!L$296:L$325,'Frais annuel 22'!J$296:J$325,\"BP\",'Frais annuel 22'!K$296:K$325,\"CH\")","v":0},{"$f":"SUMIFS('Frais annuel 22'!L$322:L$361,'Frais annuel 22'!J$322:J$361,\"BP\",'Frais annuel 22'!K$322:K$361,\"CH\")","v":0},{"$f":"SUMIFS('Frais annuel 22'!L$368:L$397,'Frais annuel 22'!J$368:J$397,\"BP\",'Frais annuel 22'!K$368:K$397,\"CH\")","v":0},{"$f":"SUMIFS('Frais annuel 22'!L$404:L$433,'Frais annuel 22'!J$404:J$433,\"BP\",'Frais annuel 22'!K$404:K$433,\"CH\")","v":0},0,"TOTAL",null,null,null,{"$f":"F44","v":0}]
[null,null,null,"VIREMENT BP",{"$f":"SUMIFS('Frais annuel 22'!L$8:L$37,'Frais annuel 22'!J$8:J$37,\"BP\",'Frais annuel 22'!K$8:K$37,\"VIR\")","v":0},{"$f":"SUMIFS('Frais annuel 22'!L$44:L$73,'Frais annuel 22'!J$44:J$73,\"BP\",'Frais annuel 22'!K$44:K$73,\"VIR\")","v":0},{"$f":"SUMIFS('Frais annuel 22'!L$80:L$109,'Frais annuel 22'!J$80:J$109,\"BP\",'Frais annuel 22'!K$80:K$109,\"VIR\")","v":0},{"$f":"SUMIFS('Frais annuel 22'!L$116:L$145,'Frais annuel 22'!J$116:J$145,\"BP\",'Frais annuel 22'!K$116:K$145,\"VIR\")","v":0},{"$f":"SUMIFS('Frais annuel 22'!L$152:L$181,'Frais annuel 22'!J$152:J$181,\"BP\",'Frais annuel 22'!K$152:K$181,\"VIR\")","v":0},{"$f":"SUMIFS('Frais annuel 22'!L$188:L$217,'Frais annuel 22'!J$188:J$217,\"BP\",'Frais annuel 22'!K$188:K$217,\"VIR\")","v":0},{"$f":"SUMIFS('Frais annuel 22'!L$224:L$253,'Frais annuel 22'!J$224:J$253,\"BP\",'Frais annuel 22'!K$224:K$253,\"VIR\")","v":0},{"$f":"SUMIFS('Frais annuel 22'!L$260:L$289,'Frais annuel 22'!J$260:J$289,\"BP\",'Frais annuel 22'!K$260:K$289,\"VIR\")","v":0},{"$f":"SUMIFS('Frais annuel 22'!L$296:L$325,'Frais annuel 22'!J$296:J$325,\"BP\",'Frais annuel 22'!K$296:K$325,\"VIR\")","v":0},{"$f":"SUMIFS('Frais annuel 22'!L$322:L$361,'Frais annuel 22'!J$322:J$361,\"BP\",'Frais annuel 22'!K$322:K$361,\"VIR\")","v":0},{"$f":"SUMIFS('Frais annuel 22'!L$368:L$397,'Frais annuel 22'!J$368:J$397,\"BP\",'Frais annuel 22'!K$368:K$397,\"VIR\")","v":0},{"$f":"SUMIFS('Frais annuel 22'!L$404:L$433,'Frais annuel 22'!J$404:J$433,\"BP\",'Frais annuel 22'!K$404:K$433,\"VIR\")","v":0},0,{"$f":"SUM(Q15:Q17)","v":0},null,null,null,{"$f":"V15-V16","v":0}]
[null,null,null,"BT1",{"$f":"SUMIFS('Frais annuel 22'!L8:L37,'Frais annuel 22'!J8:J37,\"BT1\")","v":0},{"$f":"SUMIFS('Frais annuel 22'!L44:L73,'Frais annuel 22'!J44:J73,\"BT1\")","v":0},{"$f":"SUMIFS('Frais annuel 22'!L80:L109,'Frais annuel 22'!J80:J109,\"BT1\")","v":0},{"$f":"SUMIFS('Frais annuel 22'!L116:L145,'Frais annuel 22'!J116:J145,\"BT1\")","v":0},{"$f":"SUMIFS('Frais annuel 22'!L152:L181,'Frais annuel 22'!J152:J181,\"BT1\")","v":0},{"$f":"SUMIFS('Frais annuel 22'!L188:L217,'Frais annuel 22'!J188:J217,\"BT1\")","v":0},{"$f":"SUMIFS('Frais annuel 22'!L224:L253,'Frais annuel 22'!J224:J253,\"BT1\")","v":0},{"$f":"SUMIFS('Frais annuel 22'!L260:L289,'Frais annuel 22'!J260:J289,\"BT1\")","v":0},{"$f":"SUMIFS('Frais annuel 22'!L296:L325,'Frais annuel 22'!J296:J325,\"BT1\")","v":0},{"$f":"SUMIFS('Frais annuel 22'!L332:L361,'Frais annuel 22'!J332:J361,\"BT1\")","v":0},{"$f":"SUMIFS('Frais annuel 22'!L368:L397,'Frais annuel 22'!J368:J397,\"BT1\")","v":0},{"$f":"SUMIFS('Frais annuel 22'!L404:L433,'Frais annuel 22'!J404:J433,\"BT1\")","v":0},0,{"$f":"DATA!G33","v":"PRO BTP PRESTATIONS"}]
[null,null,"CPA",null,{"$f":"SUMIFS('Frais annuel 22'!L8:L37,'Frais annuel 22'!J8:J37,\"CPA\")","v":0},{"$f":"SUMIFS('Frais annuel 22'!L44:L73,'Frais annuel 22'!J44:J73,\"CPA\")","v":0},{"$f":"SUMIFS('Frais annuel 22'!L80:L109,'Frais annuel 22'!J80:J109,\"CPA\")","v":0},{"$f":"SUMIFS('Frais annuel 22'!L116:L145,'Frais annuel 22'!J116:J145,\"CPA\")","v":0},{"$f":"SUMIFS('Frais annuel 22'!L152:L181,'Frais annuel 22'!J152:J181,\"CPA\")","v":0},{"$f":"SUMIFS('Frais annuel 22'!L188:L217,'Frais annuel 22'!J188:J217,\"CPA\")","v":0},{"$f":"SUMIFS('Frais annuel 22'!L224:L253,'Frais annuel 22'!J224:J253,\"CPA\")","v":0},{"$f":"SUMIFS('Frais annuel 22'!L260:L289,'Frais annuel 22'!J260:J289,\"CPA\")","v":0},{"$f":"SUMIFS('Frais annuel 22'!L296:L325,'Frais annuel 22'!J296:J325,\"CPA\")","v":0},{"$f":"SUMIFS('Frais annuel 22'!L332:L361,'Frais annuel 22'!J332:J361,\"CPA\")","v":0},{"$f":"SUMIFS('Frais annuel 22'!L368:L397,'Frais annuel 22'!J368:J397,\"CPA\")","v":0},{"$f":"SUMIFS('Frais annuel 22'!L404:L433,'Frais annuel 22'!J404:J433,\"CPA\")","v":0},0,{"$f":"DATA!G34","v":"Remb CPAM"}]
[null,null,null,"ESP  D IV",{"$f":"SUMIFS('Frais annuel 22'!L$8:L$37,'Frais annuel 22'!J$8:J$37,\"D IV\",'Frais annuel 22'!K$8:K$37,\"ESP\")","v":0},{"$f":"SUMIFS('Frais annuel 22'!L$44:L$73,'Frais annuel 22'!J$44:J$73,\"D IV\",'Frais annuel 22'!K$44:K$73,\"ESP\")","v":0},{"$f":"SUMIFS('Frais annuel 22'!L$80:L$109,'Frais annuel 22'!J$80:J$109,\"D IV\",'Frais annuel 22'!K$80:K$109,\"ESP\")","v":0},{"$f":"SUMIFS('Frais annuel 22'!L$116:L$145,'Frais annuel 22'!J$116:J$145,\"D IV\",'Frais annuel 22'!K$116:K$145,\"ESP\")","v":0},{"$f":"SUMIFS('Frais annuel 22'!L$152:L$181,'Frais annuel 22'!J$152:J$181,\"D IV\",'Frais annuel 22'!K$152:K$181,\"ESP\")","v":0},{"$f":"SUMIFS('Frais annuel 22'!L$188:L$217,'Frais annuel 22'!J$188:J$217,\"D IV\",'Frais annuel 22'!K$188:K$217,\"ESP\")","v":0},{"$f":"SUMIFS('Frais annuel 22'!L$224:L$253,'Frais annuel 22'!J$224:J$253,\"D IV\",'Frais annuel 22'!K$224:K$253,\"ESP\")","v":0},{"$f":"SUMIFS('Frais annuel 22'!L$260:L$289,'Frais annuel 22'!J$260:J$289,\"D IV\",'Frais annuel 22'!K$260:K$289,\"ESP\")","v":0},{"$f":"SUMIFS('Frais annuel 22'!L$296:L$325,'Frais annuel 22'!J$296:J$325,\"D IV\",'Frais annuel 22'!K$296:K$325,\"ESP\")","v":0},{"$f":"SUMIFS('Frais annuel 22'!L$322:L$361,'Frais annuel 22'!J$322:J$361,\"D IV\",'Frais annuel 22'!K$322:K$361,\"ESP\")","v":0},{"$f":"SUMIFS('Frais annuel 22'!L$368:L$397,'Frais annuel 22'!J$368:J$397,\"D IV\",'Frais annuel 22'!K$368:K$397,\"ESP\")","v":0},{"$f":"SUMIFS('Frais annuel 22'!L$404:L$433,'Frais annuel 22'!J$404:J$433,\"D IV\",'Frais annuel 22'!K$404:K$433,\"ESP\")","v":0},{"$f":"SUM(E20:P20)","v":0},{"$f":"DATA!G35","v":"Remb  Christophe"}]
[null,null,null," CH  D IV",{"$f":"SUMIFS('Frais annuel 22'!L$8:L$37,'Frais annuel 22'!J$8:J$37,\"D IV\",'Frais annuel 22'!K$8:K$37,\"CH\")","v":0},{"$f":"SUMIFS('Frais annuel 22'!L$44:L$73,'Frais annuel 22'!J$44:J$73,\"D IV\",'Frais annuel 22'!K$44:K$73,\"CH\")","v":0},{"$f":"SUMIFS('Frais annuel 22'!L$80:L$109,'Frais annuel 22'!J$80:J$109,\"D IV\",'Frais annuel 22'!K$80:K$109,\"CH\")","v":0},{"$f":"SUMIFS('Frais annuel 22'!L$116:L$145,'Frais annuel 22'!J$116:J$145,\"D IV\",'Frais annuel 22'!K$116:K$145,\"CH\")","v":0},{"$f":"SUMIFS('Frais annuel 22'!L$152:L$181,'Frais annuel 22'!J$152:J$181,\"D IV\",'Frais annuel 22'!K$152:K$181,\"CH\")","v":0},{"$f":"SUMIFS('Frais annuel 22'!L$188:L$217,'Frais annuel 22'!J$188:J$217,\"D IV\",'Frais annuel 22'!K$188:K$217,\"CH\")","v":0},{"$f":"SUMIFS('Frais annuel 22'!L$224:L$253,'Frais annuel 22'!J$224:J$253,\"D IV\",'Frais annuel 22'!K$224:K$253,\"CH\")","v":0},{"$f":"SUMIFS('Frais annuel 22'!L$260:L$289,'Frais annuel 22'!J$260:J$289,\"D IV\",'Frais annuel 22'!K$260:K$289,\"CH\")","v":0},{"$f":"SUMIFS('Frais annuel 22'!L$296:L$325,'Frais annuel 22'!J$296:J$325,\"D IV\",'Frais annuel 22'!K$296:K$325,\"CH\")","v":0},{"$f":"SUMIFS('Frais annuel 22'!L$322:L$361,'Frais annuel 22'!J$322:J$361,\"D IV\",'Frais annuel 22'!K$322:K$361,\"CH\")","v":0},{"$f":"SUMIFS('Frais annuel 22'!L$368:L$397,'Frais annuel 22'!J$368:J$397,\"D IV\",'Frais annuel 22'!K$368:K$397,\"CH\")","v":0},{"$f":"SUMIFS('Frais annuel 22'!L$404:L$433,'Frais annuel 22'!J$404:J$433,\"D IV\",'Frais annuel 22'!K$404:K$433,\"CH\")","v":0},{"$f":"SUM(E21:P21)","v":0},"TOTAL"]
[null,null,null,"VIREMENT  D IV",{"$f":"SUMIFS('Frais annuel 22'!L$8:L$37,'Frais annuel 22'!J$8:J$37,\"D IV\",'Frais annuel 22'!K$8:K$37,\"VIR\")","v":0},{"$f":"SUMIFS('Frais annuel 22'!L$44:L$73,'Frais annuel 22'!J$44:J$73,\"D IV\",'Frais annuel 22'!K$44:K$73,\"VIR\")","v":0},{"$f":"SUMIFS('Frais annuel 22'!L$80:L$109,'Frais annuel 22'!J$80:J$109,\"D IV\",'Frais annuel 22'!K$80:K$109,\"VIR\")","v":0},{"$f":"SUMIFS('Frais annuel 22'!L$116:L$145,'Frais annuel 22'!J$116:J$145,\"D IV\",'Frais annuel 22'!K$116:K$145,\"VIR\")","v":0},{"$f":"SUMIFS('Frais annuel 22'!L$152:L$181,'Frais annuel 22'!J$152:J$181,\"D IV\",'Frais annuel 22'!K$152:K$181,\"VIR\")","v":0},{"$f":"SUMIFS('Frais annuel 22'!L$188:L$217,'Frais annuel 22'!J$188:J$217,\"D IV\",'Frais annuel 22'!K$188:K$217,\"VIR\")","v":0},{"$f":"SUMIFS('Frais annuel 22'!L$224:L$253,'Frais annuel 22'!J$224:J$253,\"D IV\",'Frais annuel 22'!K$224:K$253,\"VIR\")","v":0},{"$f":"SUMIFS('Frais annuel 22'!L$260:L$289,'Frais annuel 22'!J$260:J$289,\"D IV\",'Frais annuel 22'!K$260:K$289,\"VIR\")","v":0},{"$f":"SUMIFS('Frais annuel 22'!L$296:L$325,'Frais annuel 22'!J$296:J$325,\"D IV\",'Frais annuel 22'!K$296:K$325,\"VIR\")","v":0},{"$f":"SUMIFS('Frais annuel 22'!L$322:L$361,'Frais annuel 22'!J$322:J$361,\"D IV\",'Frais annuel 22'!K$322:K$361,\"VIR\")","v":0},{"$f":"SUMIFS('Frais annuel 22'!L$368:L$397,'Frais annuel 22'!J$368:J$397,\"D IV\",'Frais annuel 22'!K$368:K$397,\"VIR\")","v":0},{"$f":"SUMIFS('Frais annuel 22'!L$404:L$433,'Frais annuel 22'!J$404:J$433,\"D IV\",'Frais annuel 22'!K$404:K$433,\"VIR\")","v":0},0,{"$f":"SUM(Q20:Q22)","v":0}]
[null,null,"PBP",null,{"$f":"SUMIFS('Frais annuel 22'!L8:L37,'Frais annuel 22'!J8:J37,\"PBP\")","v":0},{"$f":"SUMIFS('Frais annuel 22'!L44:L73,'Frais annuel 22'!J44:J73,\"PBP\")","v":0},{"$f":"SUMIFS('Frais annuel 22'!L80:L109,'Frais annuel 22'!J80:J109,\"PBP\")","v":0},{"$f":"SUMIFS('Frais annuel 22'!L116:L145,'Frais annuel 22'!J116:J145,\"PBP\")","v":0},{"$f":"SUMIFS('Frais annuel 22'!L152:L181,'Frais annuel 22'!J152:J181,\"PBP\")","v":0},{"$f":"SUMIFS('Frais annuel 22'!L188:L217,'Frais annuel 22'!J188:J217,\"PBP\")","v":0},{"$f":"SUMIFS('Frais annuel 22'!L224:L253,'Frais annuel 22'!J224:J253,\"PBP\")","v":0},{"$f":"SUMIFS('Frais annuel 22'!L260:L289,'Frais annuel 22'!J260:J289,\"PBP\")","v":0},{"$f":"SUMIFS('Frais annuel 22'!L296:L325,'Frais annuel 22'!J296:J325,\"PBP\")","v":0},{"$f":"SUMIFS('Frais annuel 22'!L332:L361,'Frais annuel 22'!J332:J361,\"PBP\")","v":0},{"$f":"SUMIFS('Frais annuel 22'!L368:L397,'Frais annuel 22'!J368:J397,\"PBP\")","v":0},{"$f":"SUMIFS('Frais annuel 22'!L404:L433,'Frais annuel 22'!J404:J433,\"PBP\")","v":0},0,{"$f":"DATA!G36","v":"VIREMENT PRO BTP"}]
[null,null,null,"Sous Total :",{"$f":"SUM(E14:E23)","v":0},{"$f":"SUM(F14:F23)","v":0},{"$f":"SUM(G14:G23)","v":0},{"$f":"SUM(H14:H23)","v":0},0,{"$f":"SUM(J14:J23)","v":0},0,0,0,0,0,0,0]
[null,null,null,"V I R ",{"$f":"SUMIFS('Frais annuel 22'!L8:L37,'Frais annuel 22'!I8:I37,\"VIR\")","v":0},{"$f":"SUMIFS('Frais annuel 22'!L44:L73,'Frais annuel 22'!I44:I73,\"VIR\")","v":0},{"$f":"SUMIFS('Frais annuel 22'!L80:L109,'Frais annuel 22'!I80:I109,\"VIR\")","v":0},{"$f":"SUMIFS('Frais annuel 22'!L116:L145,'Frais annuel 22'!I116:I145,\"VIR\")","v":0},{"$f":"SUMIFS('Frais annuel 22'!L152:L181,'Frais annuel 22'!I152:I181,\"VIR\")","v":0},{"$f":"SUMIFS('Frais annuel 22'!L188:L217,'Frais annuel 22'!I188:I217,\"VIR\")","v":0},{"$f":"SUMIFS('Frais annuel 22'!L224:L253,'Frais annuel 22'!I224:I253,\"VIR\")","v":0},{"$f":"SUMIFS('Frais annuel 22'!L260:L289,'Frais annuel 22'!I260:I289,\"VIR\")","v":0},{"$f":"SUMIFS('Frais annuel 22'!L296:L325,'Frais annuel 22'!I296:I325,\"VIR\")","v":0},{"$f":"SUMIFS('Frais annuel 22'!L332:L361,'Frais annuel 22'!I332:I361,\"VIR\")","v":0},{"$f":"SUMIFS('Frais annuel 22'!L368:L397,'Frais annuel 22'!I368:I397,\"VIR\")","v":0},{"$f":"SUMIFS('Frais annuel 22'!L404:L433,'Frais annuel 22'!I404:I433,\"VIR\")","v":0},0]
[null,null,null,"ESP  VBP",{"$f":"SUMIFS('Frais annuel 22'!L$8:L$37,'Frais annuel 22'!J$8:J$37,\"VBP\",'Frais annuel 22'!K$8:K$37,\"ESP\")","v":0},{"$f":"SUMIFS('Frais annuel 22'!L$44:L$73,'Frais annuel 22'!J$44:J$73,\"VBP\",'Frais annuel 22'!K$44:K$73,\"ESP\")","v":0},{"$f":"SUMIFS('Frais annuel 22'!L$80:L$109,'Frais annuel 22'!J$80:J$109,\"VBP\",'Frais annuel 22'!K$80:K$109,\"ESP\")","v":0},{"$f":"SUMIFS('Frais annuel 22'!L$116:L$145,'Frais annuel 22'!J$116:J$145,\"VBP\",'Frais annuel 22'!K$116:K$145,\"ESP\")","v":0},{"$f":"SUMIFS('Frais annuel 22'!L$152:L$181,'Frais annuel 22'!J$152:J$181,\"VBP\",'Frais annuel 22'!K$152:K$181,\"ESP\")","v":0},{"$f":"SUMIFS('Frais annuel 22'!L$188:L$217,'Frais annuel 22'!J$188:J$217,\"VBP\",'Frais annuel 22'!K$188:K$217,\"ESP\")","v":0},{"$f":"SUMIFS('Frais annuel 22'!L$224:L$253,'Frais annuel 22'!J$224:J$253,\"VBP\",'Frais annuel 22'!K$224:K$253,\"ESP\")","v":0},{"$f":"SUMIFS('Frais annuel 22'!L$260:L$289,'Frais annuel 22'!J$260:J$289,\"VBP\",'Frais annuel 22'!K$260:K$289,\"ESP\")","v":0},{"$f":"SUMIFS('Frais annuel 22'!L$296:L$325,'Frais annuel 22'!J$296:J$325,\"VBP\",'Frais annuel 22'!K$296:K$325,\"ESP\")","v":0},{"$f":"SUMIFS('Frais annuel 22'!L$322:L$361,'Frais annuel 22'!J$322:J$361,\"VBP\",'Frais annuel 22'!K$322:K$361,\"ESP\")","v":0},{"$f":"SUMIFS('Frais annuel 22'!L$368:L$397,'Frais annuel 22'!J$368:J$397,\"VBP\",'Frais annuel 22'!K$368:K$397,\"ESP\")","v":0},{"$f":"SUMIFS('Frais annuel 22'!L$404:L$433,'Frais annuel 22'!J$404:J$433,\"VBP\",'Frais annuel 22'!K$404:K$433,\"ESP\")","v":0},0,{"$f":"DATA!I30","v":"Virement compte BP"}]
[null,null,null,"CH  VBP",{"$f":"SUMIFS('Frais annuel 22'!L$8:L$37,'Frais annuel 22'!J$8:J$37,\"VBP\",'Frais annuel 22'!K$8:K$37,\"CH\")","v":0},{"$f":"SUMIFS('Frais annuel 22'!L$44:L$73,'Frais annuel 22'!J$44:J$73,\"VBP\",'Frais annuel 22'!K$44:K$73,\"CH\")","v":0},{"$f":"SUMIFS('Frais annuel 22'!L$80:L$109,'Frais annuel 22'!J$80:J$109,\"VBP\",'Frais annuel 22'!K$80:K$109,\"CH\")","v":0},{"$f":"SUMIFS('Frais annuel 22'!L$116:L$145,'Frais annuel 22'!J$116:J$145,\"VBP\",'Frais annuel 22'!K$116:K$145,\"CH\")","v":0},{"$f":"SUMIFS('Frais annuel 22'!L$152:L$181,'Frais annuel 22'!J$152:J$181,\"VBP\",'Frais annuel 22'!K$152:K$181,\"CH\")","v":0},{"$f":"SUMIFS('Frais annuel 22'!L$188:L$217,'Frais annuel 22'!J$188:J$217,\"VBP\",'Frais annuel 22'!K$188:K$217,\"CH\")","v":0},{"$f":"SUMIFS('Frais annuel 22'!L$224:L$253,'Frais annuel 22'!J$224:J$253,\"VBP\",'Frais annuel 22'!K$224:K$253,\"CH\")","v":0},{"$f":"SUMIFS('Frais annuel 22'!L$260:L$289,'Frais annuel 22'!J$260:J$289,\"VBP\",'Frais annuel 22'!K$260:K$289,\"CH\")","v":0},{"$f":"SUMIFS('Frais annuel 22'!L$296:L$325,'Frais annuel 22'!J$296:J$325,\"VBP\",'Frais annuel 22'!K$296:K$325,\"CH\")","v":0},{"$f":"SUMIFS('Frais annuel 22'!L$322:L$361,'Frais annuel 22'!J$322:J$361,\"VBP\",'Frais annuel 22'!K$322:K$361,\"CH\")","v":0},{"$f":"SUMIFS('Frais annuel 22'!L$368:L$397,'Frais annuel 22'!J$368:J$397,\"VBP\",'Frais annuel 22'!K$368:K$397,\"CH\")","v":0},{"$f":"SUMIFS('Frais annuel 22'!L$404:L$433,'Frais annuel 22'!J$404:J$433,\"VBP\",'Frais annuel 22'!K$404:K$433,\"CH\")","v":0},{"$f":"SUM(E27:P27)","v":0},"TOTAL"]
[null,null,null,"VIREMENT  VBP",{"$f":"SUMIFS('Frais annuel 22'!L$8:L$37,'Frais annuel 22'!J$8:J$37,\"VBP\",'Frais annuel 22'!K$8:K$37,\"VIR\")","v":0},{"$f":"SUMIFS('Frais annuel 22'!L$44:L$73,'Frais annuel 22'!J$44:J$73,\"VBP\",'Frais annuel 22'!K$44:K$73,\"VIR\")","v":0},{"$f":"SUMIFS('Frais annuel 22'!L$80:L$109,'Frais annuel 22'!J$80:J$109,\"VBP\",'Frais annuel 22'!K$80:K$109,\"VIR\")","v":0},{"$f":"SUMIFS('Frais annuel 22'!L$116:L$145,'Frais annuel 22'!J$116:J$145,\"VBP\",'Frais annuel 22'!K$116:K$145,\"VIR\")","v":0},{"$f":"SUMIFS('Frais annuel 22'!L$152:L$181,'Frais annuel 22'!J$152:J$181,\"VBP\",'Frais annuel 22'!K$152:K$181,\"VIR\")","v":0},{"$f":"SUMIFS('Frais annuel 22'!L$188:L$217,'Frais annuel 22'!J$188:J$217,\"VBP\",'Frais annuel 22'!K$188:K$217,\"VIR\")","v":0},{"$f":"SUMIFS('Frais annuel 22'!L$224:L$253,'Frais annuel 22'!J$224:J$253,\"VBP\",'Frais annuel 22'!K$224:K$253,\"VIR\")","v":0},{"$f":"SUMIFS('Frais annuel 22'!L$260:L$289,'Frais annuel 22'!J$260:J$289,\"VBP\",'Frais annuel 22'!K$260:K$289,\"VIR\")","v":0},{"$f":"SUMIFS('Frais annuel 22'!L$296:L$325,'Frais annuel 22'!J$296:J$325,\"VBP\",'Frais annuel 22'!K$296:K$325,\"VIR\")","v":0},{"$f":"SUMIFS('Frais annuel 22'!L$322:L$361,'Frais annuel 22'!J$322:J$361,\"VBP\",'Frais annuel 22'!K$322:K$361,\"VIR\")","v":0},{"$f":"SUMIFS('Frais annuel 22'!L$368:L$397,'Frais annuel 22'!J$368:J$397,\"VBP\",'Frais annuel 22'!K$368:K$397,\"VIR\")","v":0},{"$f":"SUMIFS('Frais annuel 22'!L$404:L$433,'Frais annuel 22'!J$404:J$433,\"VBP\",'Frais annuel 22'!K$404:K$433,\"VIR\")","v":0},0,{"$f":"SUM(Q26:Q28)","v":0}]
[null,null,null,"ESP  VIR",{"$f":"SUMIFS('Frais annuel 22'!L$8:L$37,'Frais annuel 22'!J$8:J$37,\"VI R\",'Frais annuel 22'!K$8:K$37,\"ESP\")","v":0},{"$f":"SUMIFS('Frais annuel 22'!L$44:L$73,'Frais annuel 22'!J$44:J$73,\"VI R\",'Frais annuel 22'!K$44:K$73,\"ESP\")","v":0},{"$f":"SUMIFS('Frais annuel 22'!L$80:L$109,'Frais annuel 22'!J$80:J$109,\"VI R\",'Frais annuel 22'!K$80:K$109,\"ESP\")","v":0},{"$f":"SUMIFS('Frais annuel 22'!L$116:L$145,'Frais annuel 22'!J$116:J$145,\"VI R\",'Frais annuel 22'!K$116:K$145,\"ESP\")","v":0},{"$f":"SUMIFS('Frais annuel 22'!L$152:L$181,'Frais annuel 22'!J$152:J$181,\"VI R\",'Frais annuel 22'!K$152:K$181,\"ESP\")","v":0},{"$f":"SUMIFS('Frais annuel 22'!L$188:L$217,'Frais annuel 22'!J$188:J$217,\"VI R\",'Frais annuel 22'!K$188:K$217,\"ESP\")","v":0},{"$f":"SUMIFS('Frais annuel 22'!L$224:L$253,'Frais annuel 22'!J$224:J$253,\"VI R\",'Frais annuel 22'!K$224:K$253,\"ESP\")","v":0},{"$f":"SUMIFS('Frais annuel 22'!L$260:L$289,'Frais annuel 22'!J$260:J$289,\"VI R\",'Frais annuel 22'!K$260:K$289,\"ESP\")","v":0},{"$f":"SUMIFS('Frais annuel 22'!L$296:L$325,'Frais annuel 22'!J$296:J$325,\"VI R\",'Frais annuel 22'!K$296:K$325,\"ESP\")","v":0},{"$f":"SUMIFS('Frais annuel 22'!L$322:L$361,'Frais annuel 22'!J$322:J$361,\"VI R\",'Frais annuel 22'!K$322:K$361,\"ESP\")","v":0},{"$f":"SUMIFS('Frais annuel 22'!L$368:L$397,'Frais annuel 22'!J$368:J$397,\"VI R\",'Frais annuel 22'!K$368:K$397,\"ESP\")","v":0},{"$f":"SUMIFS('Frais annuel 22'!L$404:L$433,'Frais annuel 22'!J$404:J$433,\"VI R\",'Frais annuel 22'!K$404:K$433,\"ESP\")","v":0},0,{"$f":"DATA!I31","v":"Autre virement"}]
[null,null,null,"CH  VIR",{"$f":"SUMIFS('Frais annuel 22'!L$8:L$37,'Frais annuel 22'!J$8:J$37,\"VI R\",'Frais annuel 22'!K$8:K$37,\"CH\")","v":0},{"$f":"SUMIFS('Frais annuel 22'!L$44:L$73,'Frais annuel 22'!J$44:J$73,\"VI R\",'Frais annuel 22'!K$44:K$73,\"CH\")","v":0},{"$f":"SUMIFS('Frais annuel 22'!L$80:L$109,'Frais annuel 22'!J$80:J$109,\"VI R\",'Frais annuel 22'!K$80:K$109,\"CH\")","v":0},{"$f":"SUMIFS('Frais annuel 22'!L$116:L$145,'Frais annuel 22'!J$116:J$145,\"VI R\",'Frais annuel 22'!K$116:K$145,\"CH\")","v":0},{"$f":"SUMIFS('Frais annuel 22'!L$152:L$181,'Frais annuel 22'!J$152:J$181,\"VI R\",'Frais annuel 22'!K$152:K$181,\"CH\")","v":0},{"$f":"SUMIFS('Frais annuel 22'!L$188:L$217,'Frais annuel 22'!J$188:J$217,\"VI R\",'Frais annuel 22'!K$188:K$217,\"CH\")","v":0},{"$f":"SUMIFS('Frais annuel 22'!L$224:L$253,'Frais annuel 22'!J$224:J$253,\"VI R\",'Frais annuel 22'!K$224:K$253,\"CH\")","v":0},{"$f":"SUMIFS('Frais annuel 22'!L$260:L$289,'Frais annuel 22'!J$260:J$289,\"VI R\",'Frais annuel 22'!K$260:K$289,\"CH\")","v":0},{"$f":"SUMIFS('Frais annuel 22'!L$296:L$325,'Frais annuel 22'!J$296:J$325,\"VI R\",'Frais annuel 22'!K$296:K$325,\"CH\")","v":0},{"$f":"SUMIFS('Frais annuel 22'!L$322:L$361,'Frais annuel 22'!J$322:J$361,\"VI R\",'Frais annuel 22'!K$322:K$361,\"CH\")","v":0},{"$f":"SUMIFS('Frais annuel 22'!L$368:L$397,'Frais annuel 22'!J$368:J$397,\"VI R\",'Frais annuel 22'!K$368:K$397,\"CH\")","v":0},{"$f":"SUMIFS('Frais annuel 22'!L$404:L$433,'Frais annuel 22'!J$404:J$433,\"VI R\",'Frais annuel 22'!K$404:K$433,\"CH\")","v":0},{"$f":"SUM(E30:P30)","v":0},"TOTAL"]
[null,null,null," VIREMENT  VIR",{"$f":"SUMIFS('Frais annuel 22'!L$8:L$37,'Frais annuel 22'!J$8:J$37,\"VIR\",'Frais annuel 22'!K$8:K$37,\"VIR\")","v":0},{"$f":"SUMIFS('Frais annuel 22'!L$44:L$73,'Frais annuel 22'!J$44:J$73,\"VI R\",'Frais annuel 22'!K$44:K$73,\"VIR\")","v":0},{"$f":"SUMIFS('Frais annuel 22'!L$80:L$109,'Frais annuel 22'!J$80:J$109,\"VI R\",'Frais annuel 22'!K$80:K$109,\"VIR\")","v":0},{"$f":"SUMIFS('Frais annuel 22'!L$116:L$145,'Frais annuel 22'!J$116:J$145,\"VI R\",'Frais annuel 22'!K$116:K$145,\"VIR\")","v":0},{"$f":"SUMIFS('Frais annuel 22'!L$152:L$181,'Frais annuel 22'!J$152:J$181,\"VI R\",'Frais annuel 22'!K$152:K$181,\"VIR\")","v":0},{"$f":"SUMIFS('Frais annuel 22'!L$188:L$217,'Frais annuel 22'!J$188:J$217,\"VI R\",'Frais annuel 22'!K$188:K$217,\"VIR\")","v":0},{"$f":"SUMIFS('Frais annuel 22'!L$224:L$253,'Frais annuel 22'!J$224:J$253,\"VI R\",'Frais annuel 22'!K$224:K$253,\"VIR\")","v":0},{"$f":"SUMIFS('Frais annuel 22'!L$260:L$289,'Frais annuel 22'!J$260:J$289,\"VI R\",'Frais annuel 22'!K$260:K$289,\"VIR\")","v":0},{"$f":"SUMIFS('Frais annuel 22'!L$296:L$325,'Frais annuel 22'!J$296:J$325,\"VI R\",'Frais annuel 22'!K$296:K$325,\"VIR\")","v":0},{"$f":"SUMIFS('Frais annuel 22'!L$322:L$361,'Frais annuel 22'!J$322:J$361,\"VI R\",'Frais annuel 22'!K$322:K$361,\"VIR\")","v":0},{"$f":"SUMIFS('Frais annuel 22'!L$368:L$397,'Frais annuel 22'!J$368:J$397,\"VI R\",'Frais annuel 22'!K$368:K$397,\"VIR\")","v":0},{"$f":"SUMIFS('Frais annuel 22'!L$404:L$433,'Frais annuel 22'!J$404:J$433,\"VI R\",'Frais annuel 22'!K$404:K$433,\"VIR\")","v":0},0,{"$f":"SUM(Q29:Q31)","v":0}]
[null,null,null,"Sous Total :",{"$f":"SUM(E26:E31)","v":0},{"$f":"SUM(F26:F31)","v":0},{"$f":"SUM(G26:G31)","v":0},{"$f":"SUM(H26:H31)","v":0},{"$f":"SUM(I26:I31)","v":0},0,0,0,0,0,0,0,0]
[null,null,null,"F R P ",{"$f":"SUMIFS('Frais annuel 22'!L8:L37,'Frais annuel 22'!I8:I37,\"FRP\")","v":0},{"$f":"SUMIFS('Frais annuel 22'!M8:M37,'Frais annuel 22'!J8:J37,\"FRP\")","v":0},{"$f":"SUMIFS('Frais annuel 22'!N8:N37,'Frais annuel 22'!K8:K37,\"FRP\")","v":0},{"$f":"SUMIFS('Frais annuel 22'!O8:O37,'Frais annuel 22'!L8:L37,\"FRP\")","v":0},{"$f":"SUMIFS('Frais annuel 22'!P8:P37,'Frais annuel 22'!M8:M37,\"FRP\")","v":0},{"$f":"SUMIFS('Frais annuel 22'!Q8:Q37,'Frais annuel 22'!N8:N37,\"FRP\")","v":0},{"$f":"SUMIFS('Frais annuel 22'!R8:R37,'Frais annuel 22'!O8:O37,\"FRP\")","v":0},{"$f":"SUMIFS('Frais annuel 22'!S8:S37,'Frais annuel 22'!P8:P37,\"FRP\")","v":0},{"$f":"SUMIFS('Frais annuel 22'!T8:T37,'Frais annuel 22'!Q8:Q37,\"FRP\")","v":0},{"$f":"SUMIFS('Frais annuel 22'!U8:U37,'Frais annuel 22'!R8:R37,\"FRP\")","v":0},{"$f":"SUMIFS('Frais annuel 22'!V8:V37,'Frais annuel 22'!S8:S37,\"FRP\")","v":0},{"$f":"SUMIFS('Frais annuel 22'!W8:W37,'Frais annuel 22'!T8:T37,\"FRP\")","v":0},0]
[null,null,"C2",null,{"$f":"SUMIFS('Frais annuel 22'!L8:L37,'Frais annuel 22'!J8:J37,\"C2\")","v":0},{"$f":"SUMIFS('Frais annuel 22'!L44:L73,'Frais annuel 22'!J44:J73,\"C2\")","v":0},{"$f":"SUMIFS('Frais annuel 22'!L80:L109,'Frais annuel 22'!J80:J109,\"C2\")","v":0},{"$f":"SUMIFS('Frais annuel 22'!L116:L145,'Frais annuel 22'!J116:J145,\"C2\")","v":0},{"$f":"SUMIFS('Frais annuel 22'!L152:L181,'Frais annuel 22'!J152:J181,\"C2\")","v":0},{"$f":"SUMIFS('Frais annuel 22'!L$188:L$217,'Frais annuel 22'!J$188:J$217,\"C2\")","v":0},{"$f":"SUMIFS('Frais annuel 22'!L224:L253,'Frais annuel 22'!J224:J253,\"C2\")","v":0},{"$f":"SUMIFS('Frais annuel 22'!L260:L289,'Frais annuel 22'!J260:J289,\"C2\")","v":0},{"$f":"SUMIFS('Frais annuel 22'!L296:L325,'Frais annuel 22'!J296:J325,\"C2\")","v":0},{"$f":"SUMIFS('Frais annuel 22'!L332:L361,'Frais annuel 22'!J332:J361,\"C2\")","v":0},{"$f":"SUMIFS('Frais annuel 22'!L368:L397,'Frais annuel 22'!J368:J397,\"C2\")","v":0},{"$f":"SUMIFS('Frais annuel 22'!L404:L433,'Frais annuel 22'!J404:J433,\"C2\")","v":0},0,{"$f":"DATA!K30","v":"BOXER  CARB  BARDOU"}]
[null,null,"DFP",null,{"$f":"SUMIFS('Frais annuel 22'!L8:L37,'Frais annuel 22'!J8:J37,\"DFP\")","v":0},{"$f":"SUMIFS('Frais annuel 22'!L44:L73,'Frais annuel 22'!J44:J73,\"DFP\")","v":0},{"$f":"SUMIFS('Frais annuel 22'!L80:L109,'Frais annuel 22'!J80:J109,\"DFP\")","v":0},{"$f":"SUMIFS('Frais annuel 22'!L116:L145,'Frais annuel 22'!J116:J145,\"DFP\")","v":0},{"$f":"SUMIFS('Frais annuel 22'!L152:L181,'Frais annuel 22'!J152:J181,\"DFP\")","v":0},{"$f":"SUMIFS('Frais annuel 22'!L$188:L$217,'Frais annuel 22'!J$188:J$217,\"DFP\")","v":0},{"$f":"SUMIFS('Frais annuel 22'!L224:L253,'Frais annuel 22'!J224:J253,\"DFP\")","v":0},{"$f":"SUMIFS('Frais annuel 22'!L260:L289,'Frais annuel 22'!J260:J289,\"DFP\")","v":0},{"$f":"SUMIFS('Frais annuel 22'!L296:L325,'Frais annuel 22'!J296:J325,\"DFP\")","v":0},{"$f":"SUMIFS('Frais annuel 22'!L332:L361,'Frais annuel 22'!J332:J361,\"DFP\")","v":0},{"$f":"SUMIFS('Frais annuel 22'!L368:L397,'Frais annuel 22'!J368:J397,\"DFP\")","v":0},{"$f":"SUMIFS('Frais annuel 22'!L404:L433,'Frais annuel 22'!J404:J433,\"DFP\")","v":0},0,{"$f":"DATA!K31","v":"EDF PLN "}]
[null,null,"EP3",null,{"$f":"SUMIFS('Frais annuel 22'!L8:L37,'Frais annuel 22'!J8:J37,\"EP3\")","v":0},{"$f":"SUMIFS('Frais annuel 22'!L44:L73,'Frais annuel 22'!J44:J73,\"EP3\")","v":0},{"$f":"SUMIFS('Frais annuel 22'!L80:L109,'Frais annuel 22'!J80:J109,\"EP3\")","v":0},{"$f":"SUMIFS('Frais annuel 22'!L116:L145,'Frais annuel 22'!J116:J145,\"EP3\")","v":0},{"$f":"SUMIFS('Frais annuel 22'!L152:L181,'Frais annuel 22'!J152:J181,\"EP3\")","v":0},{"$f":"SUMIFS('Frais annuel 22'!L$188:L$217,'Frais annuel 22'!J$188:J$217,\"EP3\")","v":0},{"$f":"SUMIFS('Frais annuel 22'!L224:L253,'Frais annuel 22'!J224:J253,\"EP3\")","v":0},{"$f":"SUMIFS('Frais annuel 22'!L260:L289,'Frais annuel 22'!J260:J289,\"EP3\")","v":0},{"$f":"SUMIFS('Frais annuel 22'!L296:L325,'Frais annuel 22'!J296:J325,\"EP3\")","v":0},{"$f":"SUMIFS('Frais annuel 22'!L332:L361,'Frais annuel 22'!J332:J361,\"EP3\")","v":0},{"$f":"SUMIFS('Frais annuel 22'!L368:L397,'Frais annuel 22'!J368:J397,\"EP3\")","v":0},{"$f":"SUMIFS('Frais annuel 22'!L404:L433,'Frais annuel 22'!J404:J433,\"EP3\")","v":0},0,{"$f":"DATA!K32","v":"EAU PLN"}]
[null,null,"ES2",null,{"$f":"SUMIFS('Frais annuel 22'!L8:L37,'Frais annuel 22'!J8:J37,\"ES2\")","v":0},{"$f":"SUMIFS('Frais annuel 22'!L44:L73,'Frais annuel 22'!J44:J73,\"ES2\")","v":0},{"$f":"SUMIFS('Frais annuel 22'!L80:L109,'Frais annuel 22'!J80:J109,\"ES2\")","v":0},{"$f":"SUMIFS('Frais annuel 22'!L116:L145,'Frais annuel 22'!J116:J145,\"ES2\")","v":0},{"$f":"SUMIFS('Frais annuel 22'!L152:L181,'Frais annuel 22'!J152:J181,\"ES2\")","v":0},{"$f":"SUMIFS('Frais annuel 22'!L$188:L$217,'Frais annuel 22'!J$188:J$217,\"ES2\")","v":0},{"$f":"SUMIFS('Frais annuel 22'!L224:L253,'Frais annuel 22'!J224:J253,\"ES2\")","v":0},{"$f":"SUMIFS('Frais annuel 22'!L260:L289,'Frais annuel 22'!J260:J289,\"ES2\")","v":0},{"$f":"SUMIFS('Frais annuel 22'!L296:L325,'Frais annuel 22'!J296:J325,\"ES2\")","v":0},{"$f":"SUMIFS('Frais annuel 22'!L332:L361,'Frais annuel 22'!J332:J361,\"ES2\")","v":0},{"$f":"SUMIFS('Frais annuel 22'!L368:L397,'Frais annuel 22'!J368:J397,\"ES2\")","v":0},{"$f":"SUMIFS('Frais annuel 22'!L404:L433,'Frais annuel 22'!J404:J433,\"ES2\")","v":0},0,{"$f":"DATA!K33","v":"EAU SALAS"}]
[null,null,"GA3",null,{"$f":"SUMIFS('Frais annuel 22'!L8:L37,'Frais annuel 22'!J8:J37,\"GA3\")","v":0},{"$f":"SUMIFS('Frais annuel 22'!L44:L73,'Frais annuel 22'!J44:J73,\"GA3\")","v":0},{"$f":"SUMIFS('Frais annuel 22'!L80:L109,'Frais annuel 22'!J80:J109,\"GA3\")","v":0},{"$f":"SUMIFS('Frais annuel 22'!L116:L145,'Frais annuel 22'!J116:J145,\"GA3\")","v":0},{"$f":"SUMIFS('Frais annuel 22'!L152:L181,'Frais annuel 22'!J152:J181,\"GA3\")","v":0},{"$f":"SUMIFS('Frais annuel 22'!L$188:L$217,'Frais annuel 22'!J$188:J$217,\"GA3\")","v":0},{"$f":"SUMIFS('Frais annuel 22'!L224:L253,'Frais annuel 22'!J224:J253,\"GA3\")","v":0},{"$f":"SUMIFS('Frais annuel 22'!L260:L289,'Frais annuel 22'!J260:J289,\"GA3\")","v":0},{"$f":"SUMIFS('Frais annuel 22'!L296:L325,'Frais annuel 22'!J296:J325,\"GA3\")","v":0},{"$f":"SUMIFS('Frais annuel 22'!L332:L361,'Frais annuel 22'!J332:J361,\"GA3\")","v":0},{"$f":"SUMIFS('Frais annuel 22'!L368:L397,'Frais annuel 22'!J368:J397,\"GA3\")","v":0},{"$f":"SUMIFS('Frais annuel 22'!L404:L433,'Frais annuel 22'!J404:J433,\"GA3\")","v":0},0,{"$f":"DATA!K34","v":"GAN ASS MAISON PLN"}]
[null,null,"MA",null,{"$f":"SUMIFS('Frais annuel 22'!L8:L37,'Frais annuel 22'!J8:J37,\"MA\")","v":0},{"$f":"SUMIFS('Frais annuel 22'!L44:L73,'Frais annuel 22'!J44:J73,\"MA\")","v":0},{"$f":"SUMIFS('Frais annuel 22'!L80:L109,'Frais annuel 22'!J80:J109,\"MA\")","v":0},{"$f":"SUMIFS('Frais annuel 22'!L116:L145,'Frais annuel 22'!J116:J145,\"MA\")","v":0},{"$f":"SUMIFS('Frais annuel 22'!L152:L181,'Frais annuel 22'!J152:J181,\"MA\")","v":0},{"$f":"SUMIFS('Frais annuel 22'!L$188:L$217,'Frais annuel 22'!J$188:J$217,\"MA\")","v":0},{"$f":"SUMIFS('Frais annuel 22'!L224:L253,'Frais annuel 22'!J224:J253,\"MA\")","v":0},{"$f":"SUMIFS('Frais annuel 22'!L260:L289,'Frais annuel 22'!J260:J289,\"MA\")","v":0},{"$f":"SUMIFS('Frais annuel 22'!L296:L325,'Frais annuel 22'!J296:J325,\"MA\")","v":0},{"$f":"SUMIFS('Frais annuel 22'!L332:L361,'Frais annuel 22'!J332:J361,\"MA\")","v":0},{"$f":"SUMIFS('Frais annuel 22'!L368:L397,'Frais annuel 22'!J368:J397,\"MA\")","v":0},{"$f":"SUMIFS('Frais annuel 22'!L404:L433,'Frais annuel 22'!J404:J433,\"MA\")","v":0},0,{"$f":"DATA!K35","v":"SCI MAAF"}]
[null,null,"OR2",null,{"$f":"SUMIFS('Frais annuel 22'!L7:L36,'Frais annuel 22'!J7:J36,\"OR2\")","v":0},{"$f":"SUMIFS('Frais annuel 22'!L43:L72,'Frais annuel 22'!J43:J72,\"OR2\")","v":0},{"$f":"SUMIFS('Frais annuel 22'!L79:L108,'Frais annuel 22'!J79:J108,\"OR2\")","v":0},{"$f":"SUMIFS('Frais annuel 22'!L115:L144,'Frais annuel 22'!J115:J144,\"OR2\")","v":0},{"$f":"SUMIFS('Frais annuel 22'!L151:L180,'Frais annuel 22'!J151:J180,\"OR2\")","v":0},{"$f":"SUMIFS('Frais annuel 22'!L$188:L$217,'Frais annuel 22'!J$188:J$217,\"OR2\")","v":0},{"$f":"SUMIFS('Frais annuel 22'!L223:L252,'Frais annuel 22'!J223:J252,\"OR2\")","v":0},{"$f":"SUMIFS('Frais annuel 22'!L259:L288,'Frais annuel 22'!J259:J288,\"OR2\")","v":0},{"$f":"SUMIFS('Frais annuel 22'!L295:L324,'Frais annuel 22'!J295:J324,\"OR2\")","v":0},{"$f":"SUMIFS('Frais annuel 22'!L331:L360,'Frais annuel 22'!J331:J360,\"OR2\")","v":0},{"$f":"SUMIFS('Frais annuel 22'!L367:L396,'Frais annuel 22'!J367:J396,\"OR2\")","v":0},{"$f":"SUMIFS('Frais annuel 22'!L403:L432,'Frais annuel 22'!J403:J432,\"OR2\")","v":0},{"$f":"SUM(E40:P40)","v":0},{"$f":"DATA!K35","v":"SCI MAAF"}]
[null,null,"GA B",null,{"$f":"SUMIFS('Frais annuel 22'!L8:L37,'Frais annuel 22'!J8:J37,\"GA B\")","v":0},{"$f":"SUMIFS('Frais annuel 22'!L44:L73,'Frais annuel 22'!J44:J73,\"GA B\")","v":0},{"$f":"SUMIFS('Frais annuel 22'!L80:L109,'Frais annuel 22'!J80:J109,\"GA B\")","v":0},{"$f":"SUMIFS('Frais annuel 22'!L116:L145,'Frais annuel 22'!J116:J145,\"GA B\")","v":0},{"$f":"SUMIFS('Frais annuel 22'!L152:L181,'Frais annuel 22'!J152:J181,\"GA B\")","v":0},{"$f":"SUMIFS('Frais annuel 22'!L$188:L$217,'Frais annuel 22'!J$188:J$217,\"GA B\")","v":0},{"$f":"SUMIFS('Frais annuel 22'!L224:L253,'Frais annuel 22'!J224:J253,\"GA B\")","v":0},{"$f":"SUMIFS('Frais annuel 22'!L260:L289,'Frais annuel 22'!J260:J289,\"GA B\")","v":0},{"$f":"SUMIFS('Frais annuel 22'!L296:L325,'Frais annuel 22'!J296:J325,\"GA B\")","v":0},{"$f":"SUMIFS('Frais annuel 22'!L332:L361,'Frais annuel 22'!J332:J361,\"GA B\")","v":0},{"$f":"SUMIFS('Frais annuel 22'!L368:L397,'Frais annuel 22'!J368:J397,\"GA B\")","v":0},{"$f":"SUMIFS('Frais annuel 22'!L404:L433,'Frais annuel 22'!J404:J433,\"GA B\")","v":0},0,"GAN BOXER"]
[null,null,null,"Sous Total :",{"$f":"SUM(E34:E41)","v":0},{"$f":"SUM(F34:F41)","v":0},{"$f":"SUM(G34:G41)","v":0},0,0,0,{"$f":"SUM(K34:K41)","v":0},0,0,0,0,0,{"$f":"SUM(Q34:Q41)","v":0}]
[null,null,null,"Total revenus",{"$f":"SUM(E5,E13,E25,E33)","v":0},{"$f":"SUM(F5,F13,F25,F33)","v":0},{"$f":"SUM(G5,G13,G25,G33)","v":0},{"$f":"SUM(H5,H13,H25,H33)","v":0},{"$f":"SUM(I5,I13,I25,I33)","v":0},0,0,0,0,0,0,0,{"$f":"SUM(E43:P43)","v":0}]
[null,null,null,null,{"$f":"SUM(E6:E11,E14:E23,E26:E31,E34:E41)","v":0},{"$f":"SUM(F6:F11,F15:F23,F26:F31,F34:F41)","v":0},{"$f":"SUM(G6:G11,G15:G23,G26:G31,G34:G41)","v":0},{"$f":"SUM(H6:H11,H15:H23,H26:H31,H34:H41)","v":0},0,0,0,0,0,0,0,0,{"$f":"SUM(E44:P44)","v":0}]
[]
[]
[null,null,null,null,"JANVIER","FEVRIER","MARS","AVRIL","MAI","JUIN","JUILLET","AOUT","SEPTEMBRE","OCTOBRE","NOVEMBRE ","DECEMBRE"]
[null,null,"Solde début de mois",null,{"$f":"'Frais annuel 22'!L5","v":0},{"$f":"E53","v":0},{"$f":"F53","v":0},{"$f":"G53","v":0},0,0,0,0,0,0,0,0]
[null,null,"Cartes payement différé mois précédant",null,{"$f":"'Frais annuel 22'!S7","v":0},{"$f":"'Frais annuel 22'!S43","v":0},{"$f":"'Frais annuel 22'!S79","v":0},{"$f":"'Frais annuel 22'!S115","v":0},{"$f":"'Frais annuel 22'!S151","v":0},{"$f":"'Frais annuel 22'!S187","v":0},{"$f":"'Frais annuel 22'!S223","v":0},{"$f":"'Frais annuel 22'!S259","v":0},{"$f":"'Frais annuel 22'!S295","v":0},{"$f":"'Frais annuel 22'!S331","v":0},{"$f":"'Frais annuel 22'!S367","v":0},{"$f":"'Frais annuel 22'!S403","v":0}]
[]
[null,null,"Solde disponible moins carte dif",null,{"$f":"E53-F49","v":0},{"$f":"F53-G49","v":0},{"$f":"G53-H49","v":0},{"$f":"H53-I49","v":0},0,0,0,0,0,0,0,0]
[null,null,null,"Différence",{"$f":"E53-E51","v":0},{"$f":"F53-F51","v":0},0,0,0,0,0,0,0,0,0,0]
[null,null,"Solde de Banque fin de mois",null,{"$f":"(E48+E43-E56)","v":0},{"$f":"(F48+F43-F56)","v":0},{"$f":"(G48+G43-G56)","v":0},{"$f":"(H48+H43-H56)","v":0},{"$f":"(I48+I43-I56)","v":0},0,0,0,0,0,0,{"$f":"(P48+P43+P56)","v":0}]
[]
[]
[null,null,"Total  dépenses Mois en cour","avec cartes mois avant",{"$f":"(E77+E90+E97+E113+E133+E160+E169+C114)-(F49*2)","v":0},{"$f":"(F77+F90+F97+F113+F133+F160+F169+E115)-(G49*2)","v":0},{"$f":"(G77+G90+G97+G113+G133+G160+G169+F115)-(H49*2)","v":0},{"$f":"(H77+H90+H97+H113+H133+H160+H169+G115)-(I49*2)","v":0},0,0,0,0,0,0,0,0,{"$f":"SUM(E56:P56)","v":0}]
[null,null,null,"avec payement différé",{"$f":"(E77+E90+E97+E113+E133+E160+E169+F49)-(C114)","v":0},{"$f":"(F77+F90+F97+F113+F133+F160+F169+G49)-(E115)","v":0},0,0,0,0,0,0,0,0,0,0,{"$f":"SUM(E57:P57)","v":0}]
[null,null,null,"Dépenses ","JANVIER","FEVRIER","MARS","AVRIL","MAI","JUIN","JUILLET","AOUT","SEPTEMBRE","OCTOBRE","NOVEMBRE ","DECEMBRE"]
[]
[null,"D  E  P  E  N  S  E  S",null,null,null,null,null,null,null,null,null,null,null,null,null,null,"TOTAUX ANNEE","DEPENSES"]
[null,null,"Dépenses ",null,"JANVIER","FEVRIER","MARS","AVRIL","MAI","JUIN","JUILLET","AOUT","SEPTEMBRE","OCTOBRE","NOVEMBRE ","DECEMBRE",{"$f":"Q4","v":0},"Désignations"]
[null,null,null,"M A I ",{"$f":"SUMIFS('Frais annuel 22'!N8:N37,'Frais annuel 22'!P8:P37,\"MAI\")","v":0},{"$f":"SUMIFS('Frais annuel 22'!N44:N73,'Frais annuel 22'!P44:P73,\"MAI\")","v":0},{"$f":"SUMIFS('Frais annuel 22'!N80:N109,'Frais annuel 22'!P80:P109,\"MAI\")","v":0},{"$f":"SUMIFS('Frais annuel 22'!N116:N145,'Frais annuel 22'!P116:P145,\"MAI\")","v":0},{"$f":"SUMIFS('Frais annuel 22'!N152:N181,'Frais annuel 22'!P152:P181,\"MAI\")","v":0},{"$f":"SUMIFS('Frais annuel 22'!N188:N217,'Frais annuel 22'!P188:P217,\"MAI\")","v":0},{"$f":"SUMIFS('Frais annuel 22'!N224:N253,'Frais annuel 22'!P224:P253,\"MAI\")","v":0},{"$f":"SUMIFS('Frais annuel 22'!N260:N289,'Frais annuel 22'!P260:P289,\"MAI\")","v":0},{"$f":"SUMIFS('Frais annuel 22'!N296:N325,'Frais annuel 22'!P296:P325,\"MAI\")","v":0},{"$f":"SUMIFS('Frais annuel 22'!N332:N361,'Frais annuel 22'!P332:P361,\"MAI\")","v":0},{"$f":"SUMIFS('Frais annuel 22'!N368:N397,'Frais annuel 22'!P368:P397,\"MAI\")","v":0},{"$f":"SUMIFS('Frais annuel 22'!N404:N433,'Frais annuel 22'!P404:P433,\"MAI\")","v":0},{"$f":"SUM(E62:P62)","v":0},"Charges"]
[null,null,"DFM",null,{"$f":"SUMIFS('Frais annuel 22'!N8:N37,'Frais annuel 22'!Q8:Q37,\"DFM\")","v":0},{"$f":"SUMIFS('Frais annuel 22'!N44:N73,'Frais annuel 22'!Q44:Q73,\"DFM\")","v":0},{"$f":"SUMIFS('Frais annuel 22'!N80:N109,'Frais annuel 22'!Q80:Q109,\"DFM\")","v":0},{"$f":"SUMIFS('Frais annuel 22'!N116:N145,'Frais annuel 22'!Q116:Q145,\"DFM\")","v":0},{"$f":"SUMIFS('Frais annuel 22'!N$152:N$181,'Frais annuel 22'!Q$152:Q$181,\"DFM\")","v":0},{"$f":"SUMIFS('Frais annuel 22'!N$188:N$217,'Frais annuel 22'!Q$188:Q$217,\"DFM\")","v":0},{"$f":"SUMIFS('Frais annuel 22'!N$224:N$253,'Frais annuel 22'!Q$224:Q$253,\"DFM\")","v":0},{"$f":"SUMIFS('Frais annuel 22'!N$260:N$289,'Frais annuel 22'!Q$260:Q$289,\"DFM\")","v":0},{"$f":"SUMIFS('Frais annuel 22'!N$296:N$325,'Frais annuel 22'!Q$296:Q$325,\"DFM\")","v":0},{"$f":"SUMIFS('Frais annuel 22'!N$332:N$361,'Frais annuel 22'!Q$332:Q$361,\"DFM\")","v":0},{"$f":"SUMIFS('Frais annuel 22'!N$368:N$397,'Frais annuel 22'!Q$368:Q$397,\"DFM\")","v":0},{"$f":"SUMIFS('Frais annuel 22'!N$404:N$433,'Frais annuel 22'!Q$404:Q$433,\"DFM\")","v":0},0,{"$f":"DATA!M7","v":"EDF MAISON"}]
[null,null,"DFP",null,{"$f":"SUMIFS('Frais annuel 22'!S8:S37,'Frais annuel 22'!Q8:Q37,\"DFP\")","v":0},{"$f":"SUMIFS('Frais annuel 22'!S44:S73,'Frais annuel 22'!Q44:Q73,\"DFP\")","v":0},{"$f":"SUMIFS('Frais annuel 22'!S80:S109,'Frais annuel 22'!Q80:Q109,\"DFP\")","v":0},{"$f":"SUMIFS('Frais annuel 22'!S116:S145,'Frais annuel 22'!Q116:Q145,\"DFP\")","v":0},{"$f":"SUMIFS('Frais annuel 22'!S$152:S$181,'Frais annuel 22'!Q$152:Q$181,\"DFP\")","v":0},{"$f":"SUMIFS('Frais annuel 22'!S$188:S$217,'Frais annuel 22'!Q$188:Q$217,\"DFP\")","v":0},{"$f":"SUMIFS('Frais annuel 22'!S$224:S$253,'Frais annuel 22'!Q$224:Q$253,\"DFP\")","v":0},{"$f":"SUMIFS('Frais annuel 22'!S$260:S$289,'Frais annuel 22'!Q$260:Q$289,\"DFP\")","v":0},{"$f":"SUMIFS('Frais annuel 22'!S$296:S$325,'Frais annuel 22'!Q$296:Q$325,\"DFP\")","v":0},{"$f":"SUMIFS('Frais annuel 22'!S$332:S$361,'Frais annuel 22'!Q$332:Q$361,\"DFP\")","v":0},{"$f":"SUMIFS('Frais annuel 22'!S$368:S$397,'Frais annuel 22'!Q$368:Q$397,\"DFP\")","v":0},{"$f":"SUMIFS('Frais annuel 22'!S$404:S$433,'Frais annuel 22'!Q$404:Q$433,\"DFP\")","v":0},0,{"$f":"DATA!M8","v":"EDF PLN "}]
[null,null,"EM1",null,{"$f":"SUMIFS('Frais annuel 22'!N8:N37,'Frais annuel 22'!Q8:Q37,\"EM1\")","v":0},{"$f":"SUMIFS('Frais annuel 22'!N44:N73,'Frais annuel 22'!Q44:Q73,\"EM1\")","v":0},{"$f":"SUMIFS('Frais annuel 22'!N80:N109,'Frais annuel 22'!Q80:Q109,\"EM1\")","v":0},{"$f":"SUMIFS('Frais annuel 22'!N116:N145,'Frais annuel 22'!Q116:Q145,\"EM1\")","v":0},{"$f":"SUMIFS('Frais annuel 22'!N$152:N$181,'Frais annuel 22'!Q$152:Q$181,\"EM1\")","v":0},{"$f":"SUMIFS('Frais annuel 22'!N$188:N$217,'Frais annuel 22'!Q$188:Q$217,\"EM1\")","v":0},{"$f":"SUMIFS('Frais annuel 22'!N$224:N$253,'Frais annuel 22'!Q$224:Q$253,\"EM1\")","v":0},{"$f":"SUMIFS('Frais annuel 22'!N$260:N$289,'Frais annuel 22'!Q$260:Q$289,\"EM1\")","v":0},{"$f":"SUMIFS('Frais annuel 22'!N$296:N$325,'Frais annuel 22'!Q$296:Q$325,\"EM1\")","v":0},{"$f":"SUMIFS('Frais annuel 22'!N$332:N$361,'Frais annuel 22'!Q$332:Q$361,\"EM1\")","v":0},{"$f":"SUMIFS('Frais annuel 22'!N$368:N$397,'Frais annuel 22'!Q$368:Q$397,\"EM1\")","v":0},{"$f":"SUMIFS('Frais annuel 22'!S$404:S$433,'Frais annuel 22'!Q$404:Q$433,\"EM1\")","v":0},0,{"$f":"DATA!M9","v":"EAU MAISON"}]
[null,null,"EP3",null,{"$f":"SUMIFS('Frais annuel 22'!N8:N37,'Frais annuel 22'!Q8:Q37,\"EP3\")","v":0},{"$f":"SUMIFS('Frais annuel 22'!N44:N73,'Frais annuel 22'!Q44:Q73,\"EP3\")","v":0},{"$f":"SUMIFS('Frais annuel 22'!N80:N109,'Frais annuel 22'!Q80:Q109,\"EP3\")","v":0},{"$f":"SUMIFS('Frais annuel 22'!N116:N145,'Frais annuel 22'!Q116:Q145,\"EP3\")","v":0},{"$f":"SUMIFS('Frais annuel 22'!N$152:N$181,'Frais annuel 22'!Q$152:Q$181,\"EP3\")","v":0},{"$f":"SUMIFS('Frais annuel 22'!N$188:N$217,'Frais annuel 22'!Q$188:Q$217,\"EP3\")","v":0},{"$f":"SUMIFS('Frais annuel 22'!N$224:N$253,'Frais annuel 22'!Q$224:Q$253,\"EP3\")","v":0},{"$f":"SUMIFS('Frais annuel 22'!N$260:N$289,'Frais annuel 22'!Q$260:Q$289,\"EP3\")","v":0},{"$f":"SUMIFS('Frais annuel 22'!N$296:N$325,'Frais annuel 22'!Q$296:Q$325,\"EP3\")","v":0},{"$f":"SUMIFS('Frais annuel 22'!N$332:N$361,'Frais annuel 22'!Q$332:Q$361,\"EP3\")","v":0},{"$f":"SUMIFS('Frais annuel 22'!N$368:N$397,'Frais annuel 22'!Q$368:Q$397,\"EP3\")","v":0},{"$f":"SUMIFS('Frais annuel 22'!N$404:N$433,'Frais annuel 22'!Q$404:Q$433,\"EP3\")","v":0},0,{"$f":"DATA!M10","v":"EAU PLN"}]
[null,null,"ES2",null,{"$f":"SUMIFS('Frais annuel 22'!N8:N37,'Frais annuel 22'!Q8:Q37,\"ES2\")","v":0},{"$f":"SUMIFS('Frais annuel 22'!N44:N73,'Frais annuel 22'!Q44:Q73,\"ES2\")","v":0},{"$f":"SUMIFS('Frais annuel 22'!N80:N109,'Frais annuel 22'!Q80:Q109,\"ES2\")","v":0},{"$f":"SUMIFS('Frais annuel 22'!N116:N145,'Frais annuel 22'!Q116:Q145,\"ES2\")","v":0},{"$f":"SUMIFS('Frais annuel 22'!N$152:N$181,'Frais annuel 22'!Q$152:Q$181,\"ES2\")","v":0},{"$f":"SUMIFS('Frais annuel 22'!N$188:N$217,'Frais annuel 22'!Q$188:Q$217,\"ES2\")","v":0},{"$f":"SUMIFS('Frais annuel 22'!N$224:N$253,'Frais annuel 22'!Q$224:Q$253,\"ES2\")","v":0},{"$f":"SUMIFS('Frais annuel 22'!N$260:N$289,'Frais annuel 22'!Q$260:Q$289,\"ES2\")","v":0},{"$f":"SUMIFS('Frais annuel 22'!N$296:N$325,'Frais annuel 22'!Q$296:Q$325,\"ES2\")","v":0},{"$f":"SUMIFS('Frais annuel 22'!N$332:N$361,'Frais annuel 22'!Q$332:Q$361,\"ES2\")","v":0},{"$f":"SUMIFS('Frais annuel 22'!N$368:N$397,'Frais annuel 22'!Q$368:Q$397,\"ES2\")","v":0},{"$f":"SUMIFS('Frais annuel 22'!S$404:S$433,'Frais annuel 22'!Q$404:Q$433,\"ES2\")","v":0},0,{"$f":"DATA!M11","v":"EAU SALAS"}]
[null,null,"GA1",null,{"$f":"SUMIFS('Frais annuel 22'!N8:N37,'Frais annuel 22'!Q8:Q37,\"GA1\")","v":0},{"$f":"SUMIFS('Frais annuel 22'!N44:N73,'Frais annuel 22'!Q44:Q73,\"GA1\")","v":0},{"$f":"SUMIFS('Frais annuel 22'!N80:N109,'Frais annuel 22'!Q80:Q109,\"GA1\")","v":0},{"$f":"SUMIFS('Frais annuel 22'!N116:N145,'Frais annuel 22'!Q116:Q145,\"GA1\")","v":0},{"$f":"SUMIFS('Frais annuel 22'!N$152:N$181,'Frais annuel 22'!Q$152:Q$181,\"GA1\")","v":0},{"$f":"SUMIFS('Frais annuel 22'!N$188:N$217,'Frais annuel 22'!Q$188:Q$217,\"GA1\")","v":0},{"$f":"SUMIFS('Frais annuel 22'!N$224:N$253,'Frais annuel 22'!Q$224:Q$253,\"GA1\")","v":0},{"$f":"SUMIFS('Frais annuel 22'!N$260:N$289,'Frais annuel 22'!Q$260:Q$289,\"GA1\")","v":0},{"$f":"SUMIFS('Frais annuel 22'!N$296:N$325,'Frais annuel 22'!Q$296:Q$325,\"GA1\")","v":0},{"$f":"SUMIFS('Frais annuel 22'!N$332:N$361,'Frais annuel 22'!Q$332:Q$361,\"GA1\")","v":0},{"$f":"SUMIFS('Frais annuel 22'!N$368:N$397,'Frais annuel 22'!Q$368:Q$397,\"GA1\")","v":0},{"$f":"SUMIFS('Frais annuel 22'!N$404:N$433,'Frais annuel 22'!Q$404:Q$433,\"GA1\")","v":0},0,{"$f":"DATA!M12","v":"GAN ASSUR MAISON"}]
[null,null,"GA2",null,{"$f":"SUMIFS('Frais annuel 22'!N8:N37,'Frais annuel 22'!Q8:Q37,\"GA2\")","v":0},{"$f":"SUMIFS('Frais annuel 22'!N44:N73,'Frais annuel 22'!Q44:Q73,\"GA2\")","v":0},{"$f":"SUMIFS('Frais annuel 22'!N80:N109,'Frais annuel 22'!Q80:Q109,\"GA2\")","v":0},{"$f":"SUMIFS('Frais annuel 22'!N116:N145,'Frais annuel 22'!Q116:Q145,\"GA2\")","v":0},{"$f":"SUMIFS('Frais annuel 22'!N$152:N$181,'Frais annuel 22'!Q$152:Q$181,\"GA2\")","v":0},{"$f":"SUMIFS('Frais annuel 22'!N$188:N$217,'Frais annuel 22'!Q$188:Q$217,\"GA2\")","v":0},{"$f":"SUMIFS('Frais annuel 22'!N$224:N$253,'Frais annuel 22'!Q$224:Q$253,\"GA2\")","v":0},{"$f":"SUMIFS('Frais annuel 22'!N$260:N$289,'Frais annuel 22'!Q$260:Q$289,\"GA2\")","v":0},{"$f":"SUMIFS('Frais annuel 22'!N$296:N$325,'Frais annuel 22'!Q$296:Q$325,\"GA2\")","v":0},{"$f":"SUMIFS('Frais annuel 22'!N$332:N$361,'Frais annuel 22'!Q$332:Q$361,\"GA2\")","v":0},{"$f":"SUMIFS('Frais annuel 22'!N$368:N$397,'Frais annuel 22'!Q$368:Q$397,\"GA2\")","v":0},{"$f":"SUMIFS('Frais annuel 22'!N$404:N$433,'Frais annuel 22'!Q$404:Q$433,\"GA2\")","v":0},0,{"$f":"DATA!M13","v":"GAN ASSUR  SALAS"}]
[null,null,"GA3",null,{"$f":"SUMIFS('Frais annuel 22'!N8:N37,'Frais annuel 22'!Q8:Q37,\"GA3\")","v":0},{"$f":"SUMIFS('Frais annuel 22'!N44:N73,'Frais annuel 22'!Q44:Q73,\"GA3\")","v":0},{"$f":"SUMIFS('Frais annuel 22'!N80:N109,'Frais annuel 22'!Q80:Q109,\"GA3\")","v":0},{"$f":"SUMIFS('Frais annuel 22'!N116:N145,'Frais annuel 22'!Q116:Q145,\"GA3\")","v":0},{"$f":"SUMIFS('Frais annuel 22'!N$152:N$181,'Frais annuel 22'!Q$152:Q$181,\"GA3\")","v":0},{"$f":"SUMIFS('Frais annuel 22'!N$188:N$217,'Frais annuel 22'!Q$188:Q$217,\"GA3\")","v":0},{"$f":"SUMIFS('Frais annuel 22'!N$224:N$253,'Frais annuel 22'!Q$224:Q$253,\"GA3\")","v":0},{"$f":"SUMIFS('Frais annuel 22'!N$260:N$289,'Frais annuel 22'!Q$260:Q$289,\"GA3\")","v":0},{"$f":"SUMIFS('Frais annuel 22'!N$296:N$325,'Frais annuel 22'!Q$296:Q$325,\"GA3\")","v":0},{"$f":"SUMIFS('Frais annuel 22'!N$332:N$361,'Frais annuel 22'!Q$332:Q$361,\"GA3\")","v":0},{"$f":"SUMIFS('Frais annuel 22'!N$368:N$397,'Frais annuel 22'!Q$368:Q$397,\"GA3\")","v":0},{"$f":"SUMIFS('Frais annuel 22'!N$404:N$433,'Frais annuel 22'!Q$404:Q$433,\"GA3\")","v":0},0,{"$f":"DATA!M14","v":"GAN ASSUR  PLN"}]
[null,null,"OR2",null,{"$f":"SUMIFS('Frais annuel 22'!N8:N37,'Frais annuel 22'!Q8:Q37,\"OR2\")","v":0},{"$f":"SUMIFS('Frais annuel 22'!N44:N73,'Frais annuel 22'!Q44:Q73,\"OR2\")","v":0},{"$f":"SUMIFS('Frais annuel 22'!N80:N109,'Frais annuel 22'!Q80:Q109,\"OR2\")","v":0},{"$f":"SUMIFS('Frais annuel 22'!N116:N145,'Frais annuel 22'!Q116:Q145,\"OR2\")","v":0},{"$f":"SUMIFS('Frais annuel 22'!N$152:N$181,'Frais annuel 22'!Q$152:Q$181,\"OR2\")","v":0},{"$f":"SUMIFS('Frais annuel 22'!N$188:N$217,'Frais annuel 22'!Q$188:Q$217,\"OR2\")","v":0},{"$f":"SUMIFS('Frais annuel 22'!N$224:N$253,'Frais annuel 22'!Q$224:Q$253,\"OR2\")","v":0},{"$f":"SUMIFS('Frais annuel 22'!N$260:N$289,'Frais annuel 22'!Q$260:Q$289,\"OR2\")","v":0},{"$f":"SUMIFS('Frais annuel 22'!N$296:N$325,'Frais annuel 22'!Q$296:Q$325,\"OR2\")","v":0},{"$f":"SUMIFS('Frais annuel 22'!N$332:N$361,'Frais annuel 22'!Q$332:Q$361,\"OR2\")","v":0},{"$f":"SUMIFS('Frais annuel 22'!N$368:N$397,'Frais annuel 22'!Q$368:Q$397,\"OR2\")","v":0},{"$f":"SUMIFS('Frais annuel 22'!S$404:S$433,'Frais annuel 22'!Q$404:Q$433,\"OR2\")","v":0},0,{"$f":"DATA!M16","v":"ORDURE SALAS"}]
[null,null,"OR1",null,{"$f":"SUMIFS('Frais annuel 22'!N8:N37,'Frais annuel 22'!Q8:Q37,\"OR1\")","v":0},{"$f":"SUMIFS('Frais annuel 22'!N44:N73,'Frais annuel 22'!Q44:Q73,\"OR1\")","v":0},{"$f":"SUMIFS('Frais annuel 22'!N80:N109,'Frais annuel 22'!Q80:Q109,\"OR1\")","v":0},{"$f":"SUMIFS('Frais annuel 22'!N116:N145,'Frais annuel 22'!Q116:Q145,\"OR1\")","v":0},{"$f":"SUMIFS('Frais annuel 22'!N$152:N$181,'Frais annuel 22'!Q$152:Q$181,\"OR1\")","v":0},{"$f":"SUMIFS('Frais annuel 22'!N$188:N$217,'Frais annuel 22'!Q$188:Q$217,\"OR1\")","v":0},{"$f":"SUMIFS('Frais annuel 22'!N$224:N$253,'Frais annuel 22'!Q$224:Q$253,\"OR1\")","v":0},{"$f":"SUMIFS('Frais annuel 22'!N$260:N$289,'Frais annuel 22'!Q$260:Q$289,\"OR1\")","v":0},{"$f":"SUMIFS('Frais annuel 22'!N$296:N$325,'Frais annuel 22'!Q$296:Q$325,\"OR1\")","v":0},{"$f":"SUMIFS('Frais annuel 22'!N$332:N$361,'Frais annuel 22'!Q$332:Q$361,\"OR1\")","v":0},{"$f":"SUMIFS('Frais annuel 22'!N$368:N$397,'Frais annuel 22'!Q$368:Q$397,\"OR1\")","v":0},{"$f":"SUMIFS('Frais annuel 22'!S$404:S$433,'Frais annuel 22'!Q$404:Q$433,\"OR1\")","v":0},0,{"$f":"DATA!M15","v":"ORDURE MAISON"}]
[null,null,"FOM",null,{"$f":"SUMIFS('Frais annuel 22'!N5:N34,'Frais annuel 22'!Q5:Q34,\"FOM\")","v":0},{"$f":"SUMIFS('Frais annuel 22'!N41:N70,'Frais annuel 22'!Q41:Q70,\"FOM\")","v":0},{"$f":"SUMIFS('Frais annuel 22'!N77:N106,'Frais annuel 22'!Q77:Q106,\"FOM\")","v":0},{"$f":"SUMIFS('Frais annuel 22'!N$116:N$145,'Frais annuel 22'!Q$116:Q$145,\"FOM\")","v":0},{"$f":"SUMIFS('Frais annuel 22'!N$152:N$181,'Frais annuel 22'!Q$152:Q$181,\"FOM\")","v":0},{"$f":"SUMIFS('Frais annuel 22'!N$188:N$217,'Frais annuel 22'!Q$188:Q$217,\"FOM\")","v":0},{"$f":"SUMIFS('Frais annuel 22'!N$224:N$253,'Frais annuel 22'!Q$224:Q$253,\"FOM\")","v":0},{"$f":"SUMIFS('Frais annuel 22'!N$260:N$289,'Frais annuel 22'!Q$260:Q$289,\"FOM\")","v":0},{"$f":"SUMIFS('Frais annuel 22'!N$296:N$325,'Frais annuel 22'!Q$296:Q$325,\"FOM\")","v":0},{"$f":"SUMIFS('Frais annuel 22'!N$332:N$361,'Frais annuel 22'!Q$332:Q$361,\"FOM\")","v":0},{"$f":"SUMIFS('Frais annuel 22'!N$368:N$397,'Frais annuel 22'!Q$368:Q$397,\"FOM\")","v":0},{"$f":"SUMIFS('Frais annuel 22'!N$404:N$433,'Frais annuel 22'!Q$404:Q$433,\"FOM\")","v":0},{"$f":"SUM(E73:P73)","v":0},{"$f":"DATA!M17","v":"FONCIE MAISON"}]
[null,null,"FOS",null,{"$f":"SUMIFS('Frais annuel 22'!N6:N35,'Frais annuel 22'!Q6:Q35,\"FOS\")","v":0},{"$f":"SUMIFS('Frais annuel 22'!N42:N71,'Frais annuel 22'!Q42:Q71,\"FOS\")","v":0},{"$f":"SUMIFS('Frais annuel 22'!N78:N107,'Frais annuel 22'!Q78:Q107,\"FOS\")","v":0},{"$f":"SUMIFS('Frais annuel 22'!N$116:N$145,'Frais annuel 22'!Q$116:Q$145,\"FOS\")","v":0},{"$f":"SUMIFS('Frais annuel 22'!N$152:N$181,'Frais annuel 22'!Q$152:Q$181,\"FOS\")","v":0},{"$f":"SUMIFS('Frais annuel 22'!N$188:N$217,'Frais annuel 22'!Q$188:Q$217,\"FOS\")","v":0},{"$f":"SUMIFS('Frais annuel 22'!N$224:N$253,'Frais annuel 22'!Q$224:Q$253,\"FOS\")","v":0},{"$f":"SUMIFS('Frais annuel 22'!N$260:N$289,'Frais annuel 22'!Q$260:Q$289,\"FOS\")","v":0},{"$f":"SUMIFS('Frais annuel 22'!N$296:N$325,'Frais annuel 22'!Q$296:Q$325,\"FOS\")","v":0},{"$f":"SUMIFS('Frais annuel 22'!N$332:N$361,'Frais annuel 22'!Q$332:Q$361,\"FOS\")","v":0},{"$f":"SUMIFS('Frais annuel 22'!N$368:N$397,'Frais annuel 22'!Q$368:Q$397,\"FOS\")","v":0},{"$f":"SUMIFS('Frais annuel 22'!N$404:N$433,'Frais annuel 22'!Q$404:Q$433,\"FOS\")","v":0},{"$f":"SUM(E74:P74)","v":0},{"$f":"DATA!M18","v":"FONCIE SALAS"}]
[null,null,"FOP",null,{"$f":"SUMIFS('Frais annuel 22'!N7:N36,'Frais annuel 22'!Q7:Q36,\"FOP\")","v":0},{"$f":"SUMIFS('Frais annuel 22'!N43:N72,'Frais annuel 22'!Q43:Q72,\"FOP\")","v":0},{"$f":"SUMIFS('Frais annuel 22'!N79:N108,'Frais annuel 22'!Q79:Q108,\"FOP\")","v":0},{"$f":"SUMIFS('Frais annuel 22'!N$116:N$145,'Frais annuel 22'!Q$116:Q$145,\"FOP\")","v":0},{"$f":"SUMIFS('Frais annuel 22'!N$152:N$181,'Frais annuel 22'!Q$152:Q$181,\"FOP\")","v":0},{"$f":"SUMIFS('Frais annuel 22'!N$188:N$217,'Frais annuel 22'!Q$188:Q$217,\"FOP\")","v":0},{"$f":"SUMIFS('Frais annuel 22'!N$224:N$253,'Frais annuel 22'!Q$224:Q$253,\"FOP\")","v":0},{"$f":"SUMIFS('Frais annuel 22'!N$260:N$289,'Frais annuel 22'!Q$260:Q$289,\"FOP\")","v":0},{"$f":"SUMIFS('Frais annuel 22'!N$296:N$325,'Frais annuel 22'!Q$296:Q$325,\"FOP\")","v":0},{"$f":"SUMIFS('Frais annuel 22'!N$332:N$361,'Frais annuel 22'!Q$332:Q$361,\"FOP\")","v":0},{"$f":"SUMIFS('Frais annuel 22'!N$368:N$397,'Frais annuel 22'!Q$368:Q$397,\"FOP\")","v":0},{"$f":"SUMIFS('Frais annuel 22'!N$404:N$433,'Frais annuel 22'!Q$404:Q$433,\"FOP\")","v":0},{"$f":"SUM(E75:P75)","v":0},{"$f":"DATA!M19","v":"FONCIE PLN"}]
[null,null,"THP",null,{"$f":"SUMIFS('Frais annuel 22'!N8:N37,'Frais annuel 22'!Q8:Q37,\"THP\")","v":0},{"$f":"SUMIFS('Frais annuel 22'!N44:N73,'Frais annuel 22'!Q44:Q73,\"THP\")","v":0},{"$f":"SUMIFS('Frais annuel 22'!N80:N109,'Frais annuel 22'!Q80:Q109,\"THP\")","v":0},{"$f":"SUMIFS('Frais annuel 22'!N$116:N$145,'Frais annuel 22'!Q$116:Q$145,\"THP\")","v":0},{"$f":"SUMIFS('Frais annuel 22'!N$152:N$181,'Frais annuel 22'!Q$152:Q$181,\"THP\")","v":0},{"$f":"SUMIFS('Frais annuel 22'!N$188:N$217,'Frais annuel 22'!Q$188:Q$217,\"THP\")","v":0},{"$f":"SUMIFS('Frais annuel 22'!N$224:N$253,'Frais annuel 22'!Q$224:Q$253,\"THP\")","v":0},{"$f":"SUMIFS('Frais annuel 22'!N$260:N$289,'Frais annuel 22'!Q$260:Q$289,\"THP\")","v":0},{"$f":"SUMIFS('Frais annuel 22'!N$296:N$325,'Frais annuel 22'!Q$296:Q$325,\"THP\")","v":0},{"$f":"SUMIFS('Frais annuel 22'!N$332:N$361,'Frais annuel 22'!Q$332:Q$361,\"THP\")","v":0},{"$f":"SUMIFS('Frais annuel 22'!N$368:N$397,'Frais annuel 22'!Q$368:Q$397,\"THP\")","v":0},{"$f":"SUMIFS('Frais annuel 22'!N$404:N$433,'Frais annuel 22'!Q$404:Q$433,\"THP\")","v":0},{"$f":"SUM(E76:P76)","v":0},{"$f":"DATA!M20","v":"PLN TAXE HABITATION"}]
[null,null,null,"Sous Total :",{"$f":"SUM(E63:E76)","v":0},0,0,0,0,0,0,0,0,0,0,0,{"$f":"SUM(Q63:Q72)","v":0}]
[null,null,null,"P  R E ",{"$f":"SUMIFS('Frais annuel 22'!N8:N37,'Frais annuel 22'!P8:P37,\"PRE\")","v":0},{"$f":"SUMIFS('Frais annuel 22'!N44:N73,'Frais annuel 22'!P44:P73,\"PRE\")","v":0},{"$f":"SUMIFS('Frais annuel 22'!N80:N109,'Frais annuel 22'!P80:P109,\"PRE\")","v":0},{"$f":"SUMIFS('Frais annuel 22'!N116:N145,'Frais annuel 22'!P116:P145,\"PRE\")","v":0},{"$f":"SUMIFS('Frais annuel 22'!N152:N181,'Frais annuel 22'!P152:P181,\"PRE\")","v":0},{"$f":"SUMIFS('Frais annuel 22'!N188:N217,'Frais annuel 22'!P188:P217,\"PRE\")","v":0},{"$f":"SUMIFS('Frais annuel 22'!N224:N253,'Frais annuel 22'!P224:P253,\"PRE\")","v":0},{"$f":"SUMIFS('Frais annuel 22'!N260:N289,'Frais annuel 22'!P260:P289,\"PRE\")","v":0},{"$f":"SUMIFS('Frais annuel 22'!N296:N325,'Frais annuel 22'!P296:P325,\"PRE\")","v":0},{"$f":"SUMIFS('Frais annuel 22'!N332:N361,'Frais annuel 22'!P332:P361,\"PRE\")","v":0},{"$f":"SUMIFS('Frais annuel 22'!N368:N397,'Frais annuel 22'!P368:P397,\"PRE\")","v":0},{"$f":"SUMIFS('Frais annuel 22'!N404:N433,'Frais annuel 22'!P404:P433,\"PRE\")","v":0},{"$f":"SUM(E78:P78)","v":0},"Prélèvements"]
[null,null,"AGI",null,{"$f":"SUMIFS('Frais annuel 22'!N8:N37,'Frais annuel 22'!Q8:Q37,\"AGI\")","v":0},{"$f":"SUMIFS('Frais annuel 22'!N44:N73,'Frais annuel 22'!Q44:Q73,\"AGI\")","v":0},{"$f":"SUMIFS('Frais annuel 22'!N80:N109,'Frais annuel 22'!Q80:Q109,\"AGI\")","v":0},{"$f":"SUMIFS('Frais annuel 22'!N$116:N$145,'Frais annuel 22'!Q$116:Q$145,\"AGI\")","v":0},{"$f":"SUMIFS('Frais annuel 22'!N$152:$N181,'Frais annuel 22'!Q$152:Q$181,\"AGI\")","v":0},{"$f":"SUMIFS('Frais annuel 22'!N$188:N$217,'Frais annuel 22'!Q$188:Q$217,\"AGI\")","v":0},{"$f":"SUMIFS('Frais annuel 22'!N$224:N$253,'Frais annuel 22'!Q$224:Q$253,\"AGI\")","v":0},{"$f":"SUMIFS('Frais annuel 22'!N$260:N$289,'Frais annuel 22'!Q$260:Q$289,\"AGI\")","v":0},{"$f":"SUMIFS('Frais annuel 22'!N$296:N$325,'Frais annuel 22'!Q$296:Q$325,\"AGI\")","v":0},{"$f":"SUMIFS('Frais annuel 22'!N$332:N$361,'Frais annuel 22'!Q$332:Q$361,\"AGI\")","v":0},{"$f":"SUMIFS('Frais annuel 22'!N$368:N$397,'Frais annuel 22'!Q$368:Q$397,\"AGI\")","v":0},{"$f":"SUMIFS('Frais annuel 22'!N$404:N$433,'Frais annuel 22'!Q$404:Q$433,\"AGI\")","v":0},0,{"$f":"DATA!K7","v":"AGIPI RET  PASCALE "}]
[null,null,"BT1",null,{"$f":"SUMIFS('Frais annuel 22'!N8:N37,'Frais annuel 22'!Q8:Q37,\"BT1\")","v":0},{"$f":"SUMIFS('Frais annuel 22'!N44:N73,'Frais annuel 22'!Q44:Q73,\"BT1\")","v":0},{"$f":"SUMIFS('Frais annuel 22'!N80:N109,'Frais annuel 22'!Q80:Q109,\"BT1\")","v":0},{"$f":"SUMIFS('Frais annuel 22'!N$116:N$145,'Frais annuel 22'!Q$116:Q$145,\"BT1\")","v":0},{"$f":"SUMIFS('Frais annuel 22'!N$152:N$181,'Frais annuel 22'!Q$152:Q$181,\"BT1\")","v":0},{"$f":"SUMIFS('Frais annuel 22'!N$188:N$217,'Frais annuel 22'!Q$188:Q$217,\"BT1\")","v":0},{"$f":"SUMIFS('Frais annuel 22'!N$224:N$253,'Frais annuel 22'!Q$224:Q$253,\"BT1\")","v":0},{"$f":"SUMIFS('Frais annuel 22'!N$260:N$289,'Frais annuel 22'!Q$260:Q$289,\"BT1\")","v":0},{"$f":"SUMIFS('Frais annuel 22'!N$296:N$325,'Frais annuel 22'!Q$296:Q$325,\"BT1\")","v":0},{"$f":"SUMIFS('Frais annuel 22'!N$332:N$361,'Frais annuel 22'!Q$332:Q$361,\"BT1\")","v":0},{"$f":"SUMIFS('Frais annuel 22'!N$368:N$397,'Frais annuel 22'!Q$368:Q$397,\"BT1\")","v":0},{"$f":"SUMIFS('Frais annuel 22'!N$404:N$433,'Frais annuel 22'!Q$404:Q$433,\"BT1\")","v":0},0,{"$f":"DATA!K8","v":"PRO BTP PRESTATIONS"}]
[null,null,"BTP",null,{"$f":"SUMIFS('Frais annuel 22'!N8:N37,'Frais annuel 22'!Q8:Q37,\"BTP\")","v":0},{"$f":"SUMIFS('Frais annuel 22'!N44:N73,'Frais annuel 22'!Q44:Q73,\"BTP\")","v":0},{"$f":"SUMIFS('Frais annuel 22'!N80:N109,'Frais annuel 22'!Q80:Q109,\"BTP\")","v":0},{"$f":"SUMIFS('Frais annuel 22'!N$116:N$145,'Frais annuel 22'!Q$116:Q$145,\"BTP\")","v":0},{"$f":"SUMIFS('Frais annuel 22'!N$152:N$181,'Frais annuel 22'!Q$152:Q$181,\"BTP\")","v":0},{"$f":"SUMIFS('Frais annuel 22'!N$188:N$217,'Frais annuel 22'!Q$188:Q$217,\"BTP\")","v":0},{"$f":"SUMIFS('Frais annuel 22'!N$224:N$253,'Frais annuel 22'!Q$224:Q$253,\"BTP\")","v":0},{"$f":"SUMIFS('Frais annuel 22'!N$260:N$289,'Frais annuel 22'!Q$260:Q$289,\"BTP\")","v":0},{"$f":"SUMIFS('Frais annuel 22'!N$296:N$325,'Frais annuel 22'!Q$296:Q$325,\"BTP\")","v":0},{"$f":"SUMIFS('Frais annuel 22'!N$332:N$361,'Frais annuel 22'!Q$332:Q$361,\"BTP\")","v":0},{"$f":"SUMIFS('Frais annuel 22'!N$368:N$397,'Frais annuel 22'!Q$368:Q$397,\"BTP\")","v":0},{"$f":"SUMIFS('Frais annuel 22'!N$404:N$433,'Frais annuel 22'!Q$404:Q$433,\"BTP\")","v":0},0,{"$f":"DATA!K9","v":"PR PRO BTP"}]
[null,null,"CSG",null,{"$f":"SUMIFS('Frais annuel 22'!N8:N37,'Frais annuel 22'!Q8:Q37,\"CSG\")","v":0},{"$f":"SUMIFS('Frais annuel 22'!N44:N73,'Frais annuel 22'!Q44:Q73,\"CSG\")","v":0},{"$f":"SUMIFS('Frais annuel 22'!N80:N109,'Frais annuel 22'!Q80:Q109,\"CSG\")","v":0},{"$f":"SUMIFS('Frais annuel 22'!N$116:N$145,'Frais annuel 22'!Q$116:Q$145,\"CSG\")","v":0},{"$f":"SUMIFS('Frais annuel 22'!N$152:N$181,'Frais annuel 22'!Q$152:Q$181,\"CSG\")","v":0},{"$f":"SUMIFS('Frais annuel 22'!N$188:N$217,'Frais annuel 22'!Q$188:Q$217,\"CSG\")","v":0},{"$f":"SUMIFS('Frais annuel 22'!N$224:N$253,'Frais annuel 22'!Q$224:Q$253,\"CSG\")","v":0},{"$f":"SUMIFS('Frais annuel 22'!N$260:N$289,'Frais annuel 22'!Q$260:Q$289,\"CSG\")","v":0},{"$f":"SUMIFS('Frais annuel 22'!N$296:N$325,'Frais annuel 22'!Q$296:Q$325,\"CSG\")","v":0},{"$f":"SUMIFS('Frais annuel 22'!N$332:N$361,'Frais annuel 22'!Q$332:Q$361,\"CSG\")","v":0},{"$f":"SUMIFS('Frais annuel 22'!N$368:N$397,'Frais annuel 22'!Q$368:Q$397,\"CSG\")","v":0},{"$f":"SUMIFS('Frais annuel 22'!N$404:N$433,'Frais annuel 22'!Q$404:Q$433,\"CSG\")","v":0},0,{"$f":"DATA!K10","v":"IMPOT CSG"}]
[null,null,"F CE",null,{"$f":"SUMIFS('Frais annuel 22'!N8:N37,'Frais annuel 22'!Q8:Q37,\"F CE\")","v":0},{"$f":"SUMIFS('Frais annuel 22'!N44:N73,'Frais annuel 22'!Q44:Q73,\"F CE\")","v":0},{"$f":"SUMIFS('Frais annuel 22'!N80:N109,'Frais annuel 22'!Q80:Q109,\"F CE\")","v":0},{"$f":"SUMIFS('Frais annuel 22'!N$116:N$145,'Frais annuel 22'!Q$116:Q$145,\"F CE\")","v":0},{"$f":"SUMIFS('Frais annuel 22'!N$152:N$181,'Frais annuel 22'!Q$152:Q$181,\"F CE\")","v":0},{"$f":"SUMIFS('Frais annuel 22'!N$188:N$217,'Frais annuel 22'!Q$188:Q$217,\"F CE\")","v":0},{"$f":"SUMIFS('Frais annuel 22'!N$224:N$253,'Frais annuel 22'!Q$224:Q$253,\"F CE\")","v":0},{"$f":"SUMIFS('Frais annuel 22'!N$260:N$289,'Frais annuel 22'!Q$260:Q$289,\"F CE\")","v":0},{"$f":"SUMIFS('Frais annuel 22'!N$296:N$325,'Frais annuel 22'!Q$296:Q$325,\"F CE\")","v":0},{"$f":"SUMIFS('Frais annuel 22'!N$332:N$361,'Frais annuel 22'!Q$332:Q$361,\"F CE\")","v":0},{"$f":"SUMIFS('Frais annuel 22'!N$368:N$397,'Frais annuel 22'!Q$368:Q$397,\"F CE\")","v":0},{"$f":"SUMIFS('Frais annuel 22'!N$404:N$433,'Frais annuel 22'!Q$404:Q$433,\"F CE\")","v":0},0,{"$f":"DATA!K11","v":"Forfait Caisse Epargne"}]
[null,null,"IM",null,{"$f":"SUMIFS('Frais annuel 22'!N8:N37,'Frais annuel 22'!Q8:Q37,\"IM\")","v":0},{"$f":"SUMIFS('Frais annuel 22'!N44:N73,'Frais annuel 22'!Q44:Q73,\"IM\")","v":0},{"$f":"SUMIFS('Frais annuel 22'!N80:N109,'Frais annuel 22'!Q80:Q109,\"IM\")","v":0},{"$f":"SUMIFS('Frais annuel 22'!N$116:N$145,'Frais annuel 22'!Q$116:Q$145,\"IM\")","v":0},{"$f":"SUMIFS('Frais annuel 22'!N$152:N$181,'Frais annuel 22'!Q$152:Q$181,\"IM\")","v":0},{"$f":"SUMIFS('Frais annuel 22'!N$188:N$217,'Frais annuel 22'!Q$188:Q$217,\"IM\")","v":0},{"$f":"SUMIFS('Frais annuel 22'!N$224:N$253,'Frais annuel 22'!Q$224:Q$253,\"IM\")","v":0},{"$f":"SUMIFS('Frais annuel 22'!N$260:N$289,'Frais annuel 22'!Q$260:Q$289,\"IM\")","v":0},{"$f":"SUMIFS('Frais annuel 22'!N$296:N$325,'Frais annuel 22'!Q$296:Q$325,\"IM\")","v":0},{"$f":"SUMIFS('Frais annuel 22'!N$332:N$361,'Frais annuel 22'!Q$332:Q$361,\"IM\")","v":0},{"$f":"SUMIFS('Frais annuel 22'!N$368:N$397,'Frais annuel 22'!Q$368:Q$397,\"IM\")","v":0},{"$f":"SUMIFS('Frais annuel 22'!N$404:N$433,'Frais annuel 22'!Q$404:Q$433,\"IM\")","v":0},0,{"$f":"DATA!K12","v":"PR-IM"}]
[null,null,"MUT",null,{"$f":"SUMIFS('Frais annuel 22'!N8:N37,'Frais annuel 22'!Q8:Q37,\"MUT\")","v":0},{"$f":"SUMIFS('Frais annuel 22'!N44:N73,'Frais annuel 22'!Q44:Q73,\"MUT\")","v":0},{"$f":"SUMIFS('Frais annuel 22'!N80:N109,'Frais annuel 22'!Q80:Q109,\"MUT\")","v":0},{"$f":"SUMIFS('Frais annuel 22'!N$116:N$145,'Frais annuel 22'!Q$116:Q$145,\"MUT\")","v":0},{"$f":"SUMIFS('Frais annuel 22'!N$152:N$181,'Frais annuel 22'!Q$152:Q$181,\"MUT\")","v":0},{"$f":"SUMIFS('Frais annuel 22'!N$188:N$217,'Frais annuel 22'!Q$188:Q$217,\"MUT\")","v":0},{"$f":"SUMIFS('Frais annuel 22'!N$224:N$253,'Frais annuel 22'!Q$224:Q$253,\"MUT\")","v":0},{"$f":"SUMIFS('Frais annuel 22'!N$260:N$289,'Frais annuel 22'!Q$260:Q$289,\"MUT\")","v":0},{"$f":"SUMIFS('Frais annuel 22'!N$296:N$325,'Frais annuel 22'!Q$296:Q$325,\"MUT\")","v":0},{"$f":"SUMIFS('Frais annuel 22'!N$332:N$361,'Frais annuel 22'!Q$332:Q$361,\"MUT\")","v":0},{"$f":"SUMIFS('Frais annuel 22'!N$368:N$397,'Frais annuel 22'!Q$368:Q$397,\"MUT\")","v":0},{"$f":"SUMIFS('Frais annuel 22'!N$404:N$433,'Frais annuel 22'!Q$404:Q$433,\"MUT\")","v":0},0,{"$f":"DATA!K13","v":"MUTUELLE PRO BTP"}]
[null,null,"PRB",null,{"$f":"SUMIFS('Frais annuel 22'!N8:N37,'Frais annuel 22'!Q8:Q37,\"PRB\")","v":0},{"$f":"SUMIFS('Frais annuel 22'!N44:N73,'Frais annuel 22'!Q44:Q73,\"PRB\")","v":0},{"$f":"SUMIFS('Frais annuel 22'!N80:N109,'Frais annuel 22'!Q80:Q109,\"PRB\")","v":0},{"$f":"SUMIFS('Frais annuel 22'!N$116:N$145,'Frais annuel 22'!Q$116:Q$145,\"PRB\")","v":0},{"$f":"SUMIFS('Frais annuel 22'!N$152:N$181,'Frais annuel 22'!Q$152:Q$181,\"PRB\")","v":0},{"$f":"SUMIFS('Frais annuel 22'!N$188:N$217,'Frais annuel 22'!Q$188:Q$217,\"PRB\")","v":0},{"$f":"SUMIFS('Frais annuel 22'!N$224:N$253,'Frais annuel 22'!Q$224:Q$253,\"PRB\")","v":0},{"$f":"SUMIFS('Frais annuel 22'!N$260:N$289,'Frais annuel 22'!Q$260:Q$289,\"PRB\")","v":0},{"$f":"SUMIFS('Frais annuel 22'!N$296:N$325,'Frais annuel 22'!Q$296:Q$325,\"PRB\")","v":0},{"$f":"SUMIFS('Frais annuel 22'!N$332:N$361,'Frais annuel 22'!Q$332:Q$361,\"PRB\")","v":0},{"$f":"SUMIFS('Frais annuel 22'!N$368:N$397,'Frais annuel 22'!Q$368:Q$397,\"PRB\")","v":0},{"$f":"SUMIFS('Frais annuel 22'!N$404:N$433,'Frais annuel 22'!Q$404:Q$433,\"PRB\")","v":0},0,{"$f":"DATA!K14","v":"VIREMENT PRO BTP"}]
[null,null,"PRI",null,{"$f":"SUMIFS('Frais annuel 22'!N8:N37,'Frais annuel 22'!Q8:Q37,\"PRI\")","v":0},{"$f":"SUMIFS('Frais annuel 22'!N44:N73,'Frais annuel 22'!Q44:Q73,\"PRI\")","v":0},{"$f":"SUMIFS('Frais annuel 22'!N80:N109,'Frais annuel 22'!Q80:Q109,\"PRI\")","v":0},{"$f":"SUMIFS('Frais annuel 22'!N$116:N$145,'Frais annuel 22'!Q$116:Q$145,\"PRI\")","v":0},{"$f":"SUMIFS('Frais annuel 22'!N$152:N$181,'Frais annuel 22'!Q$152:Q$181,\"PRI\")","v":0},{"$f":"SUMIFS('Frais annuel 22'!N$188:N$217,'Frais annuel 22'!Q$188:Q$217,\"PRI\")","v":0},{"$f":"SUMIFS('Frais annuel 22'!N$224:N$253,'Frais annuel 22'!Q$224:Q$253,\"PRI\")","v":0},{"$f":"SUMIFS('Frais annuel 22'!N$260:N$289,'Frais annuel 22'!Q$260:Q$289,\"PRI\")","v":0},{"$f":"SUMIFS('Frais annuel 22'!N$296:N$325,'Frais annuel 22'!Q$296:Q$325,\"PRI\")","v":0},{"$f":"SUMIFS('Frais annuel 22'!N$332:N$361,'Frais annuel 22'!Q$332:Q$361,\"PRI\")","v":0},{"$f":"SUMIFS('Frais annuel 22'!N$368:N$397,'Frais annuel 22'!Q$368:Q$397,\"PRI\")","v":0},{"$f":"SUMIFS('Frais annuel 22'!N$404:N$433,'Frais annuel 22'!Q$404:Q$433,\"PRI\")","v":0},0,{"$f":"DATA!K15","v":"PRLV PRIXTEL"}]
[null,null,"SFR",null,{"$f":"SUMIFS('Frais annuel 22'!N7:N36,'Frais annuel 22'!Q7:Q36,\"SFR\")","v":0},{"$f":"SUMIFS('Frais annuel 22'!N43:N72,'Frais annuel 22'!Q43:Q72,\"SFR\")","v":0},{"$f":"SUMIFS('Frais annuel 22'!N79:N108,'Frais annuel 22'!Q79:Q108,\"SFR\")","v":0},{"$f":"SUMIFS('Frais annuel 22'!N$116:N$145,'Frais annuel 22'!Q$116:Q$145,\"SFR\")","v":0},{"$f":"SUMIFS('Frais annuel 22'!N$152:N$181,'Frais annuel 22'!Q$152:Q$181,\"SFR\")","v":0},{"$f":"SUMIFS('Frais annuel 22'!N$188:N$217,'Frais annuel 22'!Q$188:Q$217,\"SFR\")","v":0},{"$f":"SUMIFS('Frais annuel 22'!N$224:N$253,'Frais annuel 22'!Q$224:Q$253,\"SFR\")","v":0},{"$f":"SUMIFS('Frais annuel 22'!N$260:N$289,'Frais annuel 22'!Q$260:Q$289,\"SFR\")","v":0},{"$f":"SUMIFS('Frais annuel 22'!N$296:N$325,'Frais annuel 22'!Q$296:Q$325,\"SFR\")","v":0},{"$f":"SUMIFS('Frais annuel 22'!N$332:N$361,'Frais annuel 22'!Q$332:Q$361,\"SFR\")","v":0},{"$f":"SUMIFS('Frais annuel 22'!N$368:N$397,'Frais annuel 22'!Q$368:Q$397,\"SFR\")","v":0},{"$f":"SUMIFS('Frais annuel 22'!N$404:N$433,'Frais annuel 22'!Q$404:Q$433,\"SFR\")","v":0},{"$f":"SUM(E88:P88)","v":0},{"$f":"DATA!K15","v":"PRLV PRIXTEL"}]
[null,null,"TRE",null,{"$f":"SUMIFS('Frais annuel 22'!N9:N38,'Frais annuel 22'!Q9:Q38,\"TRE\")","v":0},{"$f":"SUMIFS('Frais annuel 22'!N45:N74,'Frais annuel 22'!Q45:Q74,\"TRE\")","v":0},{"$f":"SUMIFS('Frais annuel 22'!N81:N110,'Frais annuel 22'!Q81:Q110,\"TRE\")","v":0},{"$f":"SUMIFS('Frais annuel 22'!N$116:N$145,'Frais annuel 22'!Q$116:Q$145,\"TRE\")","v":0},{"$f":"SUMIFS('Frais annuel 22'!N$152:N$181,'Frais annuel 22'!Q$152:Q$181,\"TRE\")","v":0},{"$f":"SUMIFS('Frais annuel 22'!N$188:N$217,'Frais annuel 22'!Q$188:Q$217,\"TRE\")","v":0},{"$f":"SUMIFS('Frais annuel 22'!N$224:N$253,'Frais annuel 22'!Q$224:Q$253,\"TRE\")","v":0},{"$f":"SUMIFS('Frais annuel 22'!N$260:N$289,'Frais annuel 22'!Q$260:Q$289,\"TRE\")","v":0},{"$f":"SUMIFS('Frais annuel 22'!N$296:N$325,'Frais annuel 22'!Q$296:Q$325,\"TRE\")","v":0},{"$f":"SUMIFS('Frais annuel 22'!N$332:N$361,'Frais annuel 22'!Q$332:Q$361,\"TRE\")","v":0},{"$f":"SUMIFS('Frais annuel 22'!N$368:N$397,'Frais annuel 22'!Q$368:Q$397,\"TRE\")","v":0},{"$f":"SUMIFS('Frais annuel 22'!N$404:N$433,'Frais annuel 22'!Q$404:Q$433,\"TRE\")","v":0},{"$f":"SUM(E89:P89)","v":0},{"$f":"DATA!K17","v":"AUTRE"}]
[null,null,null,"Sous Total :",{"$f":"SUM(E79:E89)","v":0},{"$f":"SUM(F79:F89)","v":0},{"$f":"SUM(G79:G89)","v":0},{"$f":"SUM(H79:H89)","v":0},{"$f":"SUM(J79:J89)","v":0},{"$f":"SUM(J79:J89)","v":0},{"$f":"SUM(K79:K89)","v":0},{"$f":"SUM(L79:L89)","v":0},{"$f":"SUM(M79:N89)","v":0},{"$f":"SUM(N79:N89)","v":0},{"$f":"SUM(O79:O89)","v":0},{"$f":"SUM(P79:P89)","v":0},{"$f":"SUM(Q79:Q89)","v":0}]
[null,null,null,"R E N ",{"$f":"SUMIFS('Frais annuel 22'!S8:S37,'Frais annuel 22'!P8:P37,\"REN\")","v":0},{"$f":"SUMIFS('Frais annuel 22'!S44:S73,'Frais annuel 22'!P44:P73,\"REN\")","v":0},{"$f":"SUMIFS('Frais annuel 22'!S80:S109,'Frais annuel 22'!P80:P109,\"REN\")","v":0},{"$f":"SUMIFS('Frais annuel 22'!N116:N145,'Frais annuel 22'!P116:P145,\"REN\")","v":0},{"$f":"SUMIFS('Frais annuel 22'!N152:N181,'Frais annuel 22'!P152:P181,\"REN\")","v":0},{"$f":"SUMIFS('Frais annuel 22'!N188:N217,'Frais annuel 22'!P188:P217,\"REN\")","v":0},{"$f":"SUMIFS('Frais annuel 22'!N224:N253,'Frais annuel 22'!P224:P253,\"REN\")","v":0},{"$f":"SUMIFS('Frais annuel 22'!N260:N289,'Frais annuel 22'!P260:P289,\"REN\")","v":0},{"$f":"SUMIFS('Frais annuel 22'!N296:N325,'Frais annuel 22'!P296:P325,\"REN\")","v":0},{"$f":"SUMIFS('Frais annuel 22'!N332:N361,'Frais annuel 22'!P332:P361,\"REN\")","v":0},{"$f":"SUMIFS('Frais annuel 22'!N368:N397,'Frais annuel 22'!P368:P397,\"REN\")","v":0},{"$f":"SUMIFS('Frais annuel 22'!N404:N433,'Frais annuel 22'!P404:P433,\"REN\")","v":0},{"$f":"SUM(E91:P91)","v":0},"Rentes"]
[null,null,"ARC",null,{"$f":"SUMIFS('Frais annuel 22'!N8:N37,'Frais annuel 22'!Q8:Q37,\"ARC\")","v":0},{"$f":"SUMIFS('Frais annuel 22'!N$44:N$73,'Frais annuel 22'!Q$44:Q$73,\"ARC\")","v":0},{"$f":"SUMIFS('Frais annuel 22'!N$80:N$109,'Frais annuel 22'!Q$80:Q$109,\"ARC\")","v":0},{"$f":"SUMIFS('Frais annuel 22'!N$116:N$145,'Frais annuel 22'!Q$116:Q$145,\"ARC\")","v":0},{"$f":"SUMIFS('Frais annuel 22'!N$152:N$181,'Frais annuel 22'!Q$152:Q$181,\"ARC\")","v":0},{"$f":"SUMIFS('Frais annuel 22'!N$188:N$217,'Frais annuel 22'!Q$188:Q$217,\"ARC\")","v":0},{"$f":"SUMIFS('Frais annuel 22'!N$224:N$253,'Frais annuel 22'!Q$224:Q$253,\"ARC\")","v":0},{"$f":"SUMIFS('Frais annuel 22'!N$260:N$289,'Frais annuel 22'!Q$260:Q$289,\"ARC\")","v":0},{"$f":"SUMIFS('Frais annuel 22'!N$296:N$325,'Frais annuel 22'!Q$296:Q$325,\"ARC\")","v":0},{"$f":"SUMIFS('Frais annuel 22'!N$332:N$361,'Frais annuel 22'!Q$332:Q$361,\"ARC\")","v":0},{"$f":"SUMIFS('Frais annuel 22'!N$368:N$397,'Frais annuel 22'!Q$368:Q$397,\"ARC\")","v":0},{"$f":"SUMIFS('Frais annuel 22'!N$404:N$433,'Frais annuel 22'!Q$404:Q$433,\"ARC\")","v":0},0,{"$f":"DATA!O7","v":"ALPRO ARRCO PREST BTP "}]
[null,null,"AM",null,{"$f":"SUMIFS('Frais annuel 22'!N8:N37,'Frais annuel 22'!Q8:Q37,\"AM\")","v":0},{"$f":"SUMIFS('Frais annuel 22'!N$44:N$73,'Frais annuel 22'!Q$44:Q$73,\"AM\")","v":0},{"$f":"SUMIFS('Frais annuel 22'!N$80:N$109,'Frais annuel 22'!Q$80:Q$109,\"AM\")","v":0},{"$f":"SUMIFS('Frais annuel 22'!N$116:N$145,'Frais annuel 22'!Q$116:Q$145,\"AM\")","v":0},{"$f":"SUMIFS('Frais annuel 22'!N$152:N$181,'Frais annuel 22'!Q$152:Q$181,\"AM\")","v":0},{"$f":"SUMIFS('Frais annuel 22'!N$188:N$217,'Frais annuel 22'!Q$188:Q$217,\"AM\")","v":0},{"$f":"SUMIFS('Frais annuel 22'!N$224:N$253,'Frais annuel 22'!Q$224:Q$253,\"AM\")","v":0},{"$f":"SUMIFS('Frais annuel 22'!N$260:N$289,'Frais annuel 22'!Q$260:Q$289,\"AM\")","v":0},{"$f":"SUMIFS('Frais annuel 22'!N$296:N$325,'Frais annuel 22'!Q$296:Q$325,\"AM\")","v":0},{"$f":"SUMIFS('Frais annuel 22'!N$332:N$361,'Frais annuel 22'!Q$332:Q$361,\"AM\")","v":0},{"$f":"SUMIFS('Frais annuel 22'!N$368:N$397,'Frais annuel 22'!Q$368:Q$397,\"AM\")","v":0},{"$f":"SUMIFS('Frais annuel 22'!N$404:N$433,'Frais annuel 22'!Q$404:Q$433,\"AM\")","v":0},0,{"$f":"DATA!O8","v":"C.P.A.M. ALBI"}]
[null,null,"BP",null,{"$f":"SUMIFS('Frais annuel 22'!N8:N37,'Frais annuel 22'!Q8:Q37,\"BP\")","v":0},{"$f":"SUMIFS('Frais annuel 22'!N$44:N$73,'Frais annuel 22'!Q$44:Q$73,\"BP\")","v":0},{"$f":"SUMIFS('Frais annuel 22'!N$80:N$109,'Frais annuel 22'!Q$80:Q$109,\"BP\")","v":0},{"$f":"SUMIFS('Frais annuel 22'!N$116:N$145,'Frais annuel 22'!Q$116:Q$145,\"BP\")","v":0},{"$f":"SUMIFS('Frais annuel 22'!N$152:N$181,'Frais annuel 22'!Q$152:Q$181,\"BP\")","v":0},{"$f":"SUMIFS('Frais annuel 22'!N$188:N$217,'Frais annuel 22'!Q$188:Q$217,\"BP\")","v":0},{"$f":"SUMIFS('Frais annuel 22'!N$224:N$253,'Frais annuel 22'!Q$224:Q$253,\"BP\")","v":0},{"$f":"SUMIFS('Frais annuel 22'!N$260:N$289,'Frais annuel 22'!Q$260:Q$289,\"BP\")","v":0},{"$f":"SUMIFS('Frais annuel 22'!N$296:N$325,'Frais annuel 22'!Q$296:Q$325,\"BP\")","v":0},{"$f":"SUMIFS('Frais annuel 22'!N$332:N$361,'Frais annuel 22'!Q$332:Q$361,\"BP\")","v":0},{"$f":"SUMIFS('Frais annuel 22'!N$368:N$397,'Frais annuel 22'!Q$368:Q$397,\"BP\")","v":0},{"$f":"SUMIFS('Frais annuel 22'!N$404:N$433,'Frais annuel 22'!Q$404:Q$433,\"BP\")","v":0},0,{"$f":"DATA!O9","v":"PIERROT"}]
[null,null,"GA0",null,{"$f":"SUMIFS('Frais annuel 22'!N8:N37,'Frais annuel 22'!Q8:Q37,\"GA0\")","v":0},{"$f":"SUMIFS('Frais annuel 22'!N$44:N$73,'Frais annuel 22'!Q$44:Q$73,\"GA0\")","v":0},{"$f":"SUMIFS('Frais annuel 22'!N$80:N$109,'Frais annuel 22'!Q$80:Q$109,\"GA0\")","v":0},{"$f":"SUMIFS('Frais annuel 22'!N$116:N$145,'Frais annuel 22'!Q$116:Q$145,\"GA0\")","v":0},{"$f":"SUMIFS('Frais annuel 22'!N$152:N$181,'Frais annuel 22'!Q$152:Q$181,\"GA0\")","v":0},{"$f":"SUMIFS('Frais annuel 22'!N$188:N$217,'Frais annuel 22'!Q$188:Q$217,\"GA0\")","v":0},{"$f":"SUMIFS('Frais annuel 22'!N$224:N$253,'Frais annuel 22'!Q$224:Q$253,\"GA0\")","v":0},{"$f":"SUMIFS('Frais annuel 22'!N$260:N$289,'Frais annuel 22'!Q$260:Q$289,\"GA0\")","v":0},{"$f":"SUMIFS('Frais annuel 22'!N$296:N$325,'Frais annuel 22'!Q$296:Q$325,\"GA0\")","v":0},{"$f":"SUMIFS('Frais annuel 22'!N$332:N$361,'Frais annuel 22'!Q$332:Q$361,\"GA0\")","v":0},{"$f":"SUMIFS('Frais annuel 22'!N$368:N$397,'Frais annuel 22'!Q$368:Q$397,\"GA0\")","v":0},{"$f":"SUMIFS('Frais annuel 22'!N$404:N$433,'Frais annuel 22'!Q$404:Q$433,\"GA0\")","v":0},0,{"$f":"DATA!O10","v":"RETRAITE SUP GAN"}]
[null,null,"RET",null,{"$f":"SUMIFS('Frais annuel 22'!N8:N37,'Frais annuel 22'!Q8:Q37,\"RET\")","v":0},{"$f":"SUMIFS('Frais annuel 22'!N$44:N$73,'Frais annuel 22'!Q$44:Q$73,\"RET\")","v":0},{"$f":"SUMIFS('Frais annuel 22'!N$80:N$109,'Frais annuel 22'!Q$80:Q$109,\"RET\")","v":0},{"$f":"SUMIFS('Frais annuel 22'!N$116:N$145,'Frais annuel 22'!Q$116:Q$145,\"RET\")","v":0},{"$f":"SUMIFS('Frais annuel 22'!N$152:N$181,'Frais annuel 22'!Q$152:Q$181,\"RET\")","v":0},{"$f":"SUMIFS('Frais annuel 22'!N$188:N$217,'Frais annuel 22'!Q$188:Q$217,\"RET\")","v":0},{"$f":"SUMIFS('Frais annuel 22'!N$224:N$253,'Frais annuel 22'!Q$224:Q$253,\"RET\")","v":0},{"$f":"SUMIFS('Frais annuel 22'!N$260:N$289,'Frais annuel 22'!Q$260:Q$289,\"RET\")","v":0},{"$f":"SUMIFS('Frais annuel 22'!N$296:N$325,'Frais annuel 22'!Q$296:Q$325,\"RET\")","v":0},{"$f":"SUMIFS('Frais annuel 22'!N$332:N$361,'Frais annuel 22'!Q$332:Q$361,\"RET\")","v":0},{"$f":"SUMIFS('Frais annuel 22'!N$368:N$397,'Frais annuel 22'!Q$368:Q$397,\"RET\")","v":0},{"$f":"SUMIFS('Frais annuel 22'!N$404:N$433,'Frais annuel 22'!Q$404:Q$433,\"RET\")","v":0},0,{"$f":"DATA!O11","v":"CAISSE D'ASS RET "}]
[null,null,null,"Sous Total :",{"$f":"SUM(E92:E96)","v":0},0,0,0,0,0,0,{"$f":"SUM(L92:L96)","v":0},0,0,0,0,0]
[null,null,null,"V E H ",{"$f":"SUMIFS('Frais annuel 22'!S8:S37,'Frais annuel 22'!P8:P37,\"VEH\")","v":0},{"$f":"SUMIFS('Frais annuel 22'!S44:S73,'Frais annuel 22'!P44:P73,\"VEH\")","v":0},{"$f":"SUMIFS('Frais annuel 22'!S80:S109,'Frais annuel 22'!P80:P109,\"VEH\")","v":0},{"$f":"SUMIFS('Frais annuel 22'!S116:S145,'Frais annuel 22'!P116:P145,\"VEH\")","v":0},{"$f":"SUMIFS('Frais annuel 22'!S152:S181,'Frais annuel 22'!P152:P181,\"VEH\")","v":0},{"$f":"SUMIFS('Frais annuel 22'!S188:S217,'Frais annuel 22'!P188:P217,\"VEH\")","v":0},{"$f":"SUMIFS('Frais annuel 22'!S224:S253,'Frais annuel 22'!P224:P253,\"VEH\")","v":0},{"$f":"SUMIFS('Frais annuel 22'!S260:S289,'Frais annuel 22'!P260:P289,\"VEH\")","v":0},{"$f":"SUMIFS('Frais annuel 22'!S296:S325,'Frais annuel 22'!P296:P325,\"VEH\")","v":0},{"$f":"SUMIFS('Frais annuel 22'!S332:S361,'Frais annuel 22'!P332:P361,\"VEH\")","v":0},{"$f":"SUMIFS('Frais annuel 22'!S368:S397,'Frais annuel 22'!P368:P397,\"VEH\")","v":0},{"$f":"SUMIFS('Frais annuel 22'!S404:S433,'Frais annuel 22'!P404:P433,\"VEH\")","v":0},{"$f":"SUM(E98:P98)","v":0},"Voiture"]
[null,null,"ABX",null,{"$f":"SUMIFS('Frais annuel 22'!S8:S37,'Frais annuel 22'!Q8:Q37,\"ABX\")","v":0},{"$f":"SUMIFS('Frais annuel 22'!S$44:S$73,'Frais annuel 22'!Q$44:Q$73,\"ABX\")","v":0},{"$f":"SUMIFS('Frais annuel 22'!S$80:S$109,'Frais annuel 22'!Q$80:Q$109,\"ABX\")","v":0},{"$f":"SUMIFS('Frais annuel 22'!S$116:S$145,'Frais annuel 22'!Q$116:Q$145,\"ABX\")","v":0},{"$f":"SUMIFS('Frais annuel 22'!S$152:S$181,'Frais annuel 22'!Q$152:Q$181,\"ABX\")","v":0},{"$f":"SUMIFS('Frais annuel 22'!S$188:S$217,'Frais annuel 22'!Q$188:Q$217,\"ABX\")","v":0},{"$f":"SUMIFS('Frais annuel 22'!S$224:S$253,'Frais annuel 22'!Q$224:Q$253,\"ABX\")","v":0},{"$f":"SUMIFS('Frais annuel 22'!S$260:S$289,'Frais annuel 22'!Q$260:Q$289,\"ABX\")","v":0},{"$f":"SUMIFS('Frais annuel 22'!S$296:S$325,'Frais annuel 22'!Q$296:Q$325,\"ABX\")","v":0},{"$f":"SUMIFS('Frais annuel 22'!S$332:S$361,'Frais annuel 22'!Q$332:Q$361,\"ABX\")","v":0},{"$f":"SUMIFS('Frais annuel 22'!S$368:S$397,'Frais annuel 22'!Q$368:Q$397,\"ABX\")","v":0},{"$f":"SUMIFS('Frais annuel 22'!S$404:S$433,'Frais annuel 22'!Q$404:Q$433,\"ABX\")","v":0},0,{"$f":"DATA!G7","v":"BX GAN"}]
[null,null,"ADS",null,{"$f":"SUMIFS('Frais annuel 22'!S8:S37,'Frais annuel 22'!Q8:Q37,\"ADS\")","v":0},{"$f":"SUMIFS('Frais annuel 22'!S$44:S$73,'Frais annuel 22'!Q$44:Q$73,\"ADS\")","v":0},{"$f":"SUMIFS('Frais annuel 22'!S$80:S$109,'Frais annuel 22'!Q$80:Q$109,\"ADS\")","v":0},{"$f":"SUMIFS('Frais annuel 22'!S$116:S$145,'Frais annuel 22'!Q$116:Q$145,\"ADS\")","v":0},{"$f":"SUMIFS('Frais annuel 22'!S$152:S$181,'Frais annuel 22'!Q$152:Q$181,\"ADS\")","v":0},{"$f":"SUMIFS('Frais annuel 22'!S$188:S$217,'Frais annuel 22'!Q$188:Q$217,\"ADS\")","v":0},{"$f":"SUMIFS('Frais annuel 22'!S$224:S$253,'Frais annuel 22'!Q$224:Q$253,\"ADS\")","v":0},{"$f":"SUMIFS('Frais annuel 22'!S$260:S$289,'Frais annuel 22'!Q$260:Q$289,\"ADS\")","v":0},{"$f":"SUMIFS('Frais annuel 22'!S$296:S$325,'Frais annuel 22'!Q$296:Q$325,\"ADS\")","v":0},{"$f":"SUMIFS('Frais annuel 22'!S$332:S$361,'Frais annuel 22'!Q$332:Q$361,\"ADS\")","v":0},{"$f":"SUMIFS('Frais annuel 22'!S$368:S$397,'Frais annuel 22'!Q$368:Q$397,\"ADS\")","v":0},{"$f":"SUMIFS('Frais annuel 22'!S$404:S$433,'Frais annuel 22'!Q$404:Q$433,\"ADS\")","v":0},0,{"$f":"DATA!G8","v":"DS5 GAN"}]
[null,null,"ESP  BCA",null,{"$f":"SUMIFS('Frais annuel 22'!N$8:N$37,'Frais annuel 22'!Q$8:Q$37,\"BCA\",'Frais annuel 22'!O$8:O$37,\"ESP\")","v":0},{"$f":"SUMIFS('Frais annuel 22'!N$44:N$73,'Frais annuel 22'!Q$44:Q$73,\"BCA\",'Frais annuel 22'!O$44:O$73,\"ESP\")","v":0},{"$f":"SUMIFS('Frais annuel 22'!N$80:N$109,'Frais annuel 22'!Q$80:Q$109,\"BCA\",'Frais annuel 22'!O$80:O$109,\"ESP\")","v":0},{"$f":"SUMIFS('Frais annuel 22'!N$116:N$145,'Frais annuel 22'!Q$116:Q$145,\"BCA\",'Frais annuel 22'!O$116:O$145,\"ESP\")","v":0},{"$f":"SUMIFS('Frais annuel 22'!N$152:N$181,'Frais annuel 22'!Q$152:Q$181,\"BCA\",'Frais annuel 22'!O$152:O$181,\"ESP\")","v":0},{"$f":"SUMIFS('Frais annuel 22'!N$188:N$217,'Frais annuel 22'!Q$188:Q$217,\"BCA\",'Frais annuel 22'!O$188:O$217,\"ESP\")","v":0},{"$f":"SUMIFS('Frais annuel 22'!N$224:N$253,'Frais annuel 22'!Q$224:Q$253,\"BCA\",'Frais annuel 22'!O$224:O$253,\"ESP\")","v":0},{"$f":"SUMIFS('Frais annuel 22'!N$260:N$289,'Frais annuel 22'!Q$260:Q$289,\"BCA\",'Frais annuel 22'!O$260:O$289,\"ESP\")","v":0},{"$f":"SUMIFS('Frais annuel 22'!N$296:N$325,'Frais annuel 22'!Q$296:Q$325,\"BCA\",'Frais annuel 22'!O$296:O$325,\"ESP\")","v":0},{"$f":"SUMIFS('Frais annuel 22'!N$332:N$361,'Frais annuel 22'!Q$332:Q$361,\"BCA\",'Frais annuel 22'!O$332:O$361,\"ESP\")","v":0},{"$f":"SUMIFS('Frais annuel 22'!N$368:N$397,'Frais annuel 22'!Q$368:Q$397,\"BCA\",'Frais annuel 22'!O$368:O$397,\"ESP\")","v":0},{"$f":"SUMIFS('Frais annuel 22'!N$404:N$433,'Frais annuel 22'!Q$404:Q$433,\"BCA\",'Frais annuel 22'!O$404:O$433,\"ESP\")","v":0},0,{"$f":"DATA!G9","v":"BOXER  CARB  "}]
[null,null,"CH  BCA",null,{"$f":"SUMIFS('Frais annuel 22'!N$8:N$37,'Frais annuel 22'!Q$8:Q$37,\"BCA\",'Frais annuel 22'!O$8:O$37,\"CH\")","v":0},{"$f":"SUMIFS('Frais annuel 22'!N$44:N$73,'Frais annuel 22'!Q$44:Q$73,\"BCA\",'Frais annuel 22'!O$44:O$73,\"CH\")","v":0},{"$f":"SUMIFS('Frais annuel 22'!N$80:N$109,'Frais annuel 22'!Q$80:Q$109,\"BCA\",'Frais annuel 22'!O$80:O$109,\"CH\")","v":0},{"$f":"SUMIFS('Frais annuel 22'!N$116:N$145,'Frais annuel 22'!Q$116:Q$145,\"BCA\",'Frais annuel 22'!O$116:O$145,\"CH\")","v":0},{"$f":"SUMIFS('Frais annuel 22'!N$152:N$181,'Frais annuel 22'!Q$152:Q$181,\"BCA\",'Frais annuel 22'!O$152:O$181,\"CH\")","v":0},{"$f":"SUMIFS('Frais annuel 22'!N$188:N$217,'Frais annuel 22'!Q$188:Q$217,\"BCA\",'Frais annuel 22'!O$188:O$217,\"CH\")","v":0},{"$f":"SUMIFS('Frais annuel 22'!N$224:N$253,'Frais annuel 22'!Q$224:Q$253,\"BCA\",'Frais annuel 22'!O$224:O$253,\"CH\")","v":0},{"$f":"SUMIFS('Frais annuel 22'!N$260:N$289,'Frais annuel 22'!Q$260:Q$289,\"BCA\",'Frais annuel 22'!O$260:O$289,\"CH\")","v":0},{"$f":"SUMIFS('Frais annuel 22'!N$296:N$325,'Frais annuel 22'!Q$296:Q$325,\"BCA\",'Frais annuel 22'!O$296:O$325,\"CH\")","v":0},{"$f":"SUMIFS('Frais annuel 22'!N$332:N$361,'Frais annuel 22'!Q$332:Q$361,\"BCA\",'Frais annuel 22'!O$332:O$361,\"CH\")","v":0},{"$f":"SUMIFS('Frais annuel 22'!N$368:N$397,'Frais annuel 22'!Q$368:Q$397,\"BCA\",'Frais annuel 22'!O$368:O$397,\"CH\")","v":0},{"$f":"SUMIFS('Frais annuel 22'!N$404:N$433,'Frais annuel 22'!Q$404:Q$433,\"BCA\",'Frais annuel 22'!O$404:O$433,\"CH\")","v":0},0,"TOTAL"]
[null,null,"CARTE  BCA",null,{"$f":"SUMIFS('Frais annuel 22'!S$8:S$37,'Frais annuel 22'!Q$8:Q$37,\"BCA\",'Frais annuel 22'!O$8:O$37,\"CAR\")","v":0},{"$f":"SUMIFS('Frais annuel 22'!S$44:S$73,'Frais annuel 22'!Q$44:Q$73,\"BCA\",'Frais annuel 22'!O$44:O$73,\"CAR\")","v":0},{"$f":"SUMIFS('Frais annuel 22'!S$80:S$109,'Frais annuel 22'!Q$80:Q$109,\"BCA\",'Frais annuel 22'!O$80:O$109,\"CAR\")","v":0},{"$f":"SUMIFS('Frais annuel 22'!S$116:S$145,'Frais annuel 22'!Q$116:Q$145,\"BCA\",'Frais annuel 22'!O$116:O$145,\"CAR\")","v":0},{"$f":"SUMIFS('Frais annuel 22'!S$152:S$181,'Frais annuel 22'!Q$152:Q$181,\"BCA\",'Frais annuel 22'!O$152:O$181,\"CAR\")","v":0},{"$f":"SUMIFS('Frais annuel 22'!S$188:S$217,'Frais annuel 22'!Q$188:Q$217,\"BCA\",'Frais annuel 22'!O$188:O$217,\"CAR\")","v":0},{"$f":"SUMIFS('Frais annuel 22'!S$224:S$253,'Frais annuel 22'!Q$224:Q$253,\"BCA\",'Frais annuel 22'!O$224:O$253,\"CAR\")","v":0},{"$f":"SUMIFS('Frais annuel 22'!S$260:S$289,'Frais annuel 22'!Q$260:Q$289,\"BCA\",'Frais annuel 22'!O$260:O$289,\"CAR\")","v":0},{"$f":"SUMIFS('Frais annuel 22'!S$296:S$325,'Frais annuel 22'!Q$296:Q$325,\"BCA\",'Frais annuel 22'!O$296:O$325,\"CAR\")","v":0},{"$f":"SUMIFS('Frais annuel 22'!S$332:S$361,'Frais annuel 22'!Q$332:Q$361,\"BCA\",'Frais annuel 22'!O$332:O$361,\"CAR\")","v":0},{"$f":"SUMIFS('Frais annuel 22'!S$368:S$397,'Frais annuel 22'!Q$368:Q$397,\"BCA\",'Frais annuel 22'!O$368:O$397,\"CAR\")","v":0},{"$f":"SUMIFS('Frais annuel 22'!S$404:S$433,'Frais annuel 22'!Q$404:Q$433,\"BCA\",'Frais annuel 22'!O$404:O$433,\"CAR\")","v":0},0,{"$f":"SUM(Q101:Q103)","v":0}]
[null,null,"ESP  D SC",null,{"$f":"SUMIFS('Frais annuel 22'!N$8:N$37,'Frais annuel 22'!Q$8:Q$37,\"D SC\",'Frais annuel 22'!O$8:O$37,\"ESP\")","v":0},{"$f":"SUMIFS('Frais annuel 22'!N$44:N$73,'Frais annuel 22'!Q$44:Q$73,\"D SC\",'Frais annuel 22'!O$44:O$73,\"ESP\")","v":0},{"$f":"SUMIFS('Frais annuel 22'!N$80:N$109,'Frais annuel 22'!Q$80:Q$109,\"D SC\",'Frais annuel 22'!O$80:O$109,\"ESP\")","v":0},{"$f":"SUMIFS('Frais annuel 22'!N$116:N$145,'Frais annuel 22'!Q$116:Q$145,\"D SC\",'Frais annuel 22'!O$116:O$145,\"ESP\")","v":0},{"$f":"SUMIFS('Frais annuel 22'!N$152:N$181,'Frais annuel 22'!Q$152:Q$181,\"D SC\",'Frais annuel 22'!O$152:O$181,\"ESP\")","v":0},{"$f":"SUMIFS('Frais annuel 22'!N$188:N$217,'Frais annuel 22'!Q$188:Q$217,\"D SC\",'Frais annuel 22'!O$188:O$217,\"ESP\")","v":0},{"$f":"SUMIFS('Frais annuel 22'!N$224:N$253,'Frais annuel 22'!Q$224:Q$253,\"D SC\",'Frais annuel 22'!O$224:O$253,\"ESP\")","v":0},{"$f":"SUMIFS('Frais annuel 22'!N$260:N$289,'Frais annuel 22'!Q$260:Q$289,\"D SC\",'Frais annuel 22'!O$260:O$289,\"ESP\")","v":0},{"$f":"SUMIFS('Frais annuel 22'!N$296:N$325,'Frais annuel 22'!Q$296:Q$325,\"D SC\",'Frais annuel 22'!O$296:O$325,\"ESP\")","v":0},{"$f":"SUMIFS('Frais annuel 22'!N$332:N$361,'Frais annuel 22'!Q$332:Q$361,\"D SC\",'Frais annuel 22'!O$332:O$361,\"ESP\")","v":0},{"$f":"SUMIFS('Frais annuel 22'!N$368:N$397,'Frais annuel 22'!Q$368:Q$397,\"D SC\",'Frais annuel 22'!O$368:O$397,\"ESP\")","v":0},{"$f":"SUMIFS('Frais annuel 22'!N$404:N$433,'Frais annuel 22'!Q$404:Q$433,\"D SC\",'Frais annuel 22'!O$404:O$433,\"ESP\")","v":0},0,{"$f":"DATA!G10","v":"DS5  CARB  "}]
[null,null," CH  D SC",null,{"$f":"SUMIFS('Frais annuel 22'!N$8:N$37,'Frais annuel 22'!Q$8:Q$37,\"D SC\",'Frais annuel 22'!O$8:O$37,\"CH\")","v":0},{"$f":"SUMIFS('Frais annuel 22'!N$44:N$73,'Frais annuel 22'!Q$44:Q$73,\"D SC\",'Frais annuel 22'!O$44:O$73,\"CH\")","v":0},{"$f":"SUMIFS('Frais annuel 22'!N$80:N$109,'Frais annuel 22'!Q$80:Q$109,\"D SC\",'Frais annuel 22'!O$80:O$109,\"CH\")","v":0},{"$f":"SUMIFS('Frais annuel 22'!N$116:N$145,'Frais annuel 22'!Q$116:Q$145,\"D SC\",'Frais annuel 22'!O$116:O$145,\"CH\")","v":0},{"$f":"SUMIFS('Frais annuel 22'!N$152:N$181,'Frais annuel 22'!Q$152:Q$181,\"D SC\",'Frais annuel 22'!O$152:O$181,\"CH\")","v":0},{"$f":"SUMIFS('Frais annuel 22'!N$188:N$217,'Frais annuel 22'!Q$188:Q$217,\"D SC\",'Frais annuel 22'!O$188:O$217,\"CH\")","v":0},{"$f":"SUMIFS('Frais annuel 22'!N$224:N$253,'Frais annuel 22'!Q$224:Q$253,\"D SC\",'Frais annuel 22'!O$224:O$253,\"CH\")","v":0},{"$f":"SUMIFS('Frais annuel 22'!N$260:N$289,'Frais annuel 22'!Q$260:Q$289,\"D SC\",'Frais annuel 22'!O$260:O$289,\"CH\")","v":0},{"$f":"SUMIFS('Frais annuel 22'!N$296:N$325,'Frais annuel 22'!Q$296:Q$325,\"D SC\",'Frais annuel 22'!O$296:O$325,\"CH\")","v":0},{"$f":"SUMIFS('Frais annuel 22'!N$332:N$361,'Frais annuel 22'!Q$332:Q$361,\"D SC\",'Frais annuel 22'!O$332:O$361,\"CH\")","v":0},{"$f":"SUMIFS('Frais annuel 22'!N$368:N$397,'Frais annuel 22'!Q$368:Q$397,\"D SC\",'Frais annuel 22'!O$368:O$397,\"CH\")","v":0},{"$f":"SUMIFS('Frais annuel 22'!N$404:N$433,'Frais annuel 22'!Q$404:Q$433,\"D SC\",'Frais annuel 22'!O$404:O$433,\"CH\")","v":0},0,"TOTAL"]
[null,null,"CARTE  D SC",null,{"$f":"SUMIFS('Frais annuel 22'!S$8:S$37,'Frais annuel 22'!Q$8:Q$37,\"D SC\",'Frais annuel 22'!O$8:O$37,\"CAR\")","v":0},{"$f":"SUMIFS('Frais annuel 22'!S$44:S$73,'Frais annuel 22'!Q$44:Q$73,\"D SC\",'Frais annuel 22'!O$44:O$73,\"CAR\")","v":0},{"$f":"SUMIFS('Frais annuel 22'!S$80:S$109,'Frais annuel 22'!Q$80:Q$109,\"D SC\",'Frais annuel 22'!O$80:O$109,\"CAR\")","v":0},{"$f":"SUMIFS('Frais annuel 22'!S$116:S$145,'Frais annuel 22'!Q$116:Q$145,\"D SC\",'Frais annuel 22'!O$116:O$145,\"CAR\")","v":0},{"$f":"SUMIFS('Frais annuel 22'!S$152:S$181,'Frais annuel 22'!Q$152:Q$181,\"D SC\",'Frais annuel 22'!O$152:O$181,\"CAR\")","v":0},{"$f":"SUMIFS('Frais annuel 22'!S$188:S$217,'Frais annuel 22'!Q$188:Q$217,\"D SC\",'Frais annuel 22'!O$188:O$217,\"CAR\")","v":0},{"$f":"SUMIFS('Frais annuel 22'!S$224:S$253,'Frais annuel 22'!Q$224:Q$253,\"D SC\",'Frais annuel 22'!O$224:O$253,\"CAR\")","v":0},{"$f":"SUMIFS('Frais annuel 22'!S$260:S$289,'Frais annuel 22'!Q$260:Q$289,\"D SC\",'Frais annuel 22'!O$260:O$289,\"CAR\")","v":0},{"$f":"SUMIFS('Frais annuel 22'!S$296:S$325,'Frais annuel 22'!Q$296:Q$325,\"D SC\",'Frais annuel 22'!O$296:O$325,\"CAR\")","v":0},{"$f":"SUMIFS('Frais annuel 22'!S$332:S$361,'Frais annuel 22'!Q$332:Q$361,\"D SC\",'Frais annuel 22'!O$332:O$361,\"CAR\")","v":0},{"$f":"SUMIFS('Frais annuel 22'!S$368:S$397,'Frais annuel 22'!Q$368:Q$397,\"D SC\",'Frais annuel 22'!O$368:O$397,\"CAR\")","v":0},{"$f":"SUMIFS('Frais annuel 22'!S$404:S$433,'Frais annuel 22'!Q$404:Q$433,\"D SC\",'Frais annuel 22'!O$404:O$433,\"CAR\")","v":0},0,{"$f":"SUM(Q104:Q106)","v":0}]
[null,null,"ESP  EN1",null,{"$f":"SUMIFS('Frais annuel 22'!N$8:N$37,'Frais annuel 22'!Q$8:Q$37,\"EN1\",'Frais annuel 22'!O$8:O$37,\"ESP\")","v":0},{"$f":"SUMIFS('Frais annuel 22'!N$44:N$73,'Frais annuel 22'!Q$44:Q$73,\"EN1\",'Frais annuel 22'!O$44:O$73,\"ESP\")","v":0},{"$f":"SUMIFS('Frais annuel 22'!N$80:N$109,'Frais annuel 22'!Q$80:Q$109,\"EN1\",'Frais annuel 22'!O$80:O$109,\"ESP\")","v":0},{"$f":"SUMIFS('Frais annuel 22'!N$116:N$145,'Frais annuel 22'!Q$116:Q$145,\"EN1\",'Frais annuel 22'!O$116:O$145,\"ESP\")","v":0},{"$f":"SUMIFS('Frais annuel 22'!N$152:N$181,'Frais annuel 22'!Q$152:Q$181,\"EN1\",'Frais annuel 22'!O$152:O$181,\"ESP\")","v":0},{"$f":"SUMIFS('Frais annuel 22'!N$188:N$217,'Frais annuel 22'!Q$188:Q$217,\"EN1\",'Frais annuel 22'!O$188:O$217,\"ESP\")","v":0},{"$f":"SUMIFS('Frais annuel 22'!N$224:N$253,'Frais annuel 22'!Q$224:Q$253,\"EN1\",'Frais annuel 22'!O$224:O$253,\"ESP\")","v":0},{"$f":"SUMIFS('Frais annuel 22'!N$260:N$289,'Frais annuel 22'!Q$260:Q$289,\"EN1\",'Frais annuel 22'!O$260:O$289,\"ESP\")","v":0},{"$f":"SUMIFS('Frais annuel 22'!N$296:N$325,'Frais annuel 22'!Q$296:Q$325,\"EN1\",'Frais annuel 22'!O$296:O$325,\"ESP\")","v":0},{"$f":"SUMIFS('Frais annuel 22'!N$332:N$361,'Frais annuel 22'!Q$332:Q$361,\"EN1\",'Frais annuel 22'!O$332:O$361,\"ESP\")","v":0},{"$f":"SUMIFS('Frais annuel 22'!N$368:N$397,'Frais annuel 22'!Q$368:Q$397,\"EN1\",'Frais annuel 22'!O$368:O$397,\"ESP\")","v":0},{"$f":"SUMIFS('Frais annuel 22'!N$404:N$433,'Frais annuel 22'!Q$404:Q$433,\"EN1\",'Frais annuel 22'!O$404:O$433,\"ESP\")","v":0},0,{"$f":"DATA!G11","v":"DS5 ENTRETIEN"}]
[null,null,"CH  EN1",null,{"$f":"SUMIFS('Frais annuel 22'!N$8:N$37,'Frais annuel 22'!Q$8:Q$37,\"EN1\",'Frais annuel 22'!O$8:O$37,\"CH\")","v":0},{"$f":"SUMIFS('Frais annuel 22'!N$44:N$73,'Frais annuel 22'!Q$44:Q$73,\"EN1\",'Frais annuel 22'!O$44:O$73,\"CH\")","v":0},{"$f":"SUMIFS('Frais annuel 22'!N$80:N$109,'Frais annuel 22'!Q$80:Q$109,\"EN1\",'Frais annuel 22'!O$80:O$109,\"CH\")","v":0},{"$f":"SUMIFS('Frais annuel 22'!N$116:N$145,'Frais annuel 22'!Q$116:Q$145,\"EN1\",'Frais annuel 22'!O$116:O$145,\"CH\")","v":0},{"$f":"SUMIFS('Frais annuel 22'!N$152:N$181,'Frais annuel 22'!Q$152:Q$181,\"EN1\",'Frais annuel 22'!O$152:O$181,\"CH\")","v":0},{"$f":"SUMIFS('Frais annuel 22'!N$188:N$217,'Frais annuel 22'!Q$188:Q$217,\"EN1\",'Frais annuel 22'!O$188:O$217,\"CH\")","v":0},{"$f":"SUMIFS('Frais annuel 22'!N$224:N$253,'Frais annuel 22'!Q$224:Q$253,\"EN1\",'Frais annuel 22'!O$224:O$253,\"CH\")","v":0},{"$f":"SUMIFS('Frais annuel 22'!N$260:N$289,'Frais annuel 22'!Q$260:Q$289,\"EN1\",'Frais annuel 22'!O$260:O$289,\"CH\")","v":0},{"$f":"SUMIFS('Frais annuel 22'!N$296:N$325,'Frais annuel 22'!Q$296:Q$325,\"EN1\",'Frais annuel 22'!O$296:O$325,\"CH\")","v":0},{"$f":"SUMIFS('Frais annuel 22'!N$332:N$361,'Frais annuel 22'!Q$332:Q$361,\"EN1\",'Frais annuel 22'!O$332:O$361,\"CH\")","v":0},{"$f":"SUMIFS('Frais annuel 22'!N$368:N$397,'Frais annuel 22'!Q$368:Q$397,\"EN1\",'Frais annuel 22'!O$368:O$397,\"CH\")","v":0},{"$f":"SUMIFS('Frais annuel 22'!N$404:N$433,'Frais annuel 22'!Q$404:Q$433,\"EN1\",'Frais annuel 22'!O$404:O$433,\"CH\")","v":0},0,"TOTAL"]
[null,null,"CARTE  EN1",null,{"$f":"SUMIFS('Frais annuel 22'!S$8:S$37,'Frais annuel 22'!Q$8:Q$37,\"EN1\",'Frais annuel 22'!O$8:O$37,\"CAR\")","v":0},{"$f":"SUMIFS('Frais annuel 22'!S$44:S$73,'Frais annuel 22'!Q$44:Q$73,\"EN1\",'Frais annuel 22'!O$44:O$73,\"CAR\")","v":0},{"$f":"SUMIFS('Frais annuel 22'!S$80:S$109,'Frais annuel 22'!Q$80:Q$109,\"EN1\",'Frais annuel 22'!O$80:O$109,\"CAR\")","v":0},{"$f":"SUMIFS('Frais annuel 22'!S$116:S$145,'Frais annuel 22'!Q$116:Q$145,\"EN1\",'Frais annuel 22'!O$116:O$145,\"CAR\")","v":0},{"$f":"SUMIFS('Frais annuel 22'!S$152:S$181,'Frais annuel 22'!Q$152:Q$181,\"EN1\",'Frais annuel 22'!O$152:O$181,\"CAR\")","v":0},{"$f":"SUMIFS('Frais annuel 22'!S$188:S$217,'Frais annuel 22'!Q$188:Q$217,\"EN1\",'Frais annuel 22'!O$188:O$217,\"CAR\")","v":0},{"$f":"SUMIFS('Frais annuel 22'!S$224:S$253,'Frais annuel 22'!Q$224:Q$253,\"EN1\",'Frais annuel 22'!O$224:O$253,\"CAR\")","v":0},{"$f":"SUMIFS('Frais annuel 22'!S$260:S$289,'Frais annuel 22'!Q$260:Q$289,\"EN1\",'Frais annuel 22'!O$260:O$289,\"CAR\")","v":0},{"$f":"SUMIFS('Frais annuel 22'!S$296:S$325,'Frais annuel 22'!Q$296:Q$325,\"EN1\",'Frais annuel 22'!O$296:O$325,\"CAR\")","v":0},{"$f":"SUMIFS('Frais annuel 22'!S$332:S$361,'Frais annuel 22'!Q$332:Q$361,\"EN1\",'Frais annuel 22'!O$332:O$361,\"CAR\")","v":0},{"$f":"SUMIFS('Frais annuel 22'!S$368:S$397,'Frais annuel 22'!Q$368:Q$397,\"EN1\",'Frais annuel 22'!O$368:O$397,\"CAR\")","v":0},{"$f":"SUMIFS('Frais annuel 22'!S$404:S$433,'Frais annuel 22'!Q$404:Q$433,\"EN1\",'Frais annuel 22'!O$404:O$433,\"CAR\")","v":0},0,{"$f":"SUM(Q107:Q109)","v":0}]
[null,null,"ESP EN2",null,{"$f":"SUMIFS('Frais annuel 22'!N$8:N$37,'Frais annuel 22'!Q$8:Q$37,\"EN2\",'Frais annuel 22'!O$8:O$37,\"ESP\")","v":0},{"$f":"SUMIFS('Frais annuel 22'!N$44:N$73,'Frais annuel 22'!Q$44:Q$73,\"EN2\",'Frais annuel 22'!O$44:O$73,\"ESP\")","v":0},{"$f":"SUMIFS('Frais annuel 22'!N$80:N$109,'Frais annuel 22'!Q$80:Q$109,\"EN2\",'Frais annuel 22'!O$80:O$109,\"ESP\")","v":0},{"$f":"SUMIFS('Frais annuel 22'!N$116:N$145,'Frais annuel 22'!Q$116:Q$145,\"EN2\",'Frais annuel 22'!O$116:O$145,\"ESP\")","v":0},{"$f":"SUMIFS('Frais annuel 22'!N$152:N$181,'Frais annuel 22'!Q$152:Q$181,\"EN2\",'Frais annuel 22'!O$152:O$181,\"ESP\")","v":0},{"$f":"SUMIFS('Frais annuel 22'!N$188:N$217,'Frais annuel 22'!Q$188:Q$217,\"EN2\",'Frais annuel 22'!O$188:O$217,\"ESP\")","v":0},{"$f":"SUMIFS('Frais annuel 22'!N$224:N$253,'Frais annuel 22'!Q$224:Q$253,\"EN2\",'Frais annuel 22'!O$224:O$253,\"ESP\")","v":0},{"$f":"SUMIFS('Frais annuel 22'!N$260:N$289,'Frais annuel 22'!Q$260:Q$289,\"EN2\",'Frais annuel 22'!O$260:O$289,\"ESP\")","v":0},{"$f":"SUMIFS('Frais annuel 22'!N$296:N$325,'Frais annuel 22'!Q$296:Q$325,\"EN2\",'Frais annuel 22'!O$296:O$325,\"ESP\")","v":0},{"$f":"SUMIFS('Frais annuel 22'!N$332:N$361,'Frais annuel 22'!Q$332:Q$361,\"EN2\",'Frais annuel 22'!O$332:O$361,\"ESP\")","v":0},{"$f":"SUMIFS('Frais annuel 22'!N$368:N$397,'Frais annuel 22'!Q$368:Q$397,\"EN2\",'Frais annuel 22'!O$368:O$397,\"ESP\")","v":0},{"$f":"SUMIFS('Frais annuel 22'!N$404:N$433,'Frais annuel 22'!Q$404:Q$433,\"EN2\",'Frais annuel 22'!O$404:O$433,\"ESP\")","v":0},0,{"$f":"DATA!G12","v":"BOXER ENTRETIEN"}]
[null,null,"CH  EN2",null,{"$f":"SUMIFS('Frais annuel 22'!N$8:N$37,'Frais annuel 22'!Q$8:Q$37,\"EN2\",'Frais annuel 22'!O$8:O$37,\"CH\")","v":0},{"$f":"SUMIFS('Frais annuel 22'!N$44:N$73,'Frais annuel 22'!Q$44:Q$73,\"EN2\",'Frais annuel 22'!O$44:O$73,\"CH\")","v":0},{"$f":"SUMIFS('Frais annuel 22'!N$80:N$109,'Frais annuel 22'!Q$80:Q$109,\"EN2\",'Frais annuel 22'!O$80:O$109,\"CH\")","v":0},{"$f":"SUMIFS('Frais annuel 22'!N$116:N$145,'Frais annuel 22'!Q$116:Q$145,\"EN2\",'Frais annuel 22'!O$116:O$145,\"CH\")","v":0},{"$f":"SUMIFS('Frais annuel 22'!N$152:N$181,'Frais annuel 22'!Q$152:Q$181,\"EN2\",'Frais annuel 22'!O$152:O$181,\"CH\")","v":0},{"$f":"SUMIFS('Frais annuel 22'!N$188:N$217,'Frais annuel 22'!Q$188:Q$217,\"EN2\",'Frais annuel 22'!O$188:O$217,\"CH\")","v":0},{"$f":"SUMIFS('Frais annuel 22'!N$224:N$253,'Frais annuel 22'!Q$224:Q$253,\"EN2\",'Frais annuel 22'!O$224:O$253,\"CH\")","v":0},{"$f":"SUMIFS('Frais annuel 22'!N$260:N$289,'Frais annuel 22'!Q$260:Q$289,\"EN2\",'Frais annuel 22'!O$260:O$289,\"CH\")","v":0},{"$f":"SUMIFS('Frais annuel 22'!N$296:N$325,'Frais annuel 22'!Q$296:Q$325,\"EN2\",'Frais annuel 22'!O$296:O$325,\"CH\")","v":0},{"$f":"SUMIFS('Frais annuel 22'!N$332:N$361,'Frais annuel 22'!Q$332:Q$361,\"EN2\",'Frais annuel 22'!O$332:O$361,\"CH\")","v":0},{"$f":"SUMIFS('Frais annuel 22'!N$368:N$397,'Frais annuel 22'!Q$368:Q$397,\"EN2\",'Frais annuel 22'!O$368:O$397,\"CH\")","v":0},{"$f":"SUMIFS('Frais annuel 22'!N$404:N$433,'Frais annuel 22'!Q$404:Q$433,\"EN2\",'Frais annuel 22'!O$404:O$433,\"CH\")","v":0},0,"TOTAL"]
[null,null,"CARTE  EN2",null,{"$f":"SUMIFS('Frais annuel 22'!S$8:S$37,'Frais annuel 22'!Q$8:Q$37,\"EN2\",'Frais annuel 22'!O$8:O$37,\"CAR\")","v":0},{"$f":"SUMIFS('Frais annuel 22'!S$44:S$73,'Frais annuel 22'!Q$44:Q$73,\"EN2\",'Frais annuel 22'!O$44:O$73,\"CAR\")","v":0},{"$f":"SUMIFS('Frais annuel 22'!S$80:S$109,'Frais annuel 22'!Q$80:Q$109,\"EN2\",'Frais annuel 22'!O$80:O$109,\"CAR\")","v":0},{"$f":"SUMIFS('Frais annuel 22'!S$116:S$145,'Frais annuel 22'!Q$116:Q$145,\"EN2\",'Frais annuel 22'!O$116:O$145,\"CAR\")","v":0},{"$f":"SUMIFS('Frais annuel 22'!S$152:S$181,'Frais annuel 22'!Q$152:Q$181,\"EN2\",'Frais annuel 22'!O$152:O$181,\"CAR\")","v":0},{"$f":"SUMIFS('Frais annuel 22'!S$188:S$217,'Frais annuel 22'!Q$188:Q$217,\"EN2\",'Frais annuel 22'!O$188:O$217,\"CAR\")","v":0},{"$f":"SUMIFS('Frais annuel 22'!S$224:S$253,'Frais annuel 22'!Q$224:Q$253,\"EN2\",'Frais annuel 22'!O$224:O$253,\"CAR\")","v":0},{"$f":"SUMIFS('Frais annuel 22'!S$260:S$289,'Frais annuel 22'!Q$260:Q$289,\"EN2\",'Frais annuel 22'!O$260:O$289,\"CAR\")","v":0},{"$f":"SUMIFS('Frais annuel 22'!S$296:S$325,'Frais annuel 22'!Q$296:Q$325,\"EN2\",'Frais annuel 22'!O$296:O$325,\"CAR\")","v":0},{"$f":"SUMIFS('Frais annuel 22'!S$332:S$361,'Frais annuel 22'!Q$332:Q$361,\"EN2\",'Frais annuel 22'!O$332:O$361,\"CAR\")","v":0},{"$f":"SUMIFS('Frais annuel 22'!S$368:S$397,'Frais annuel 22'!Q$368:Q$397,\"EN2\",'Frais annuel 22'!O$368:O$397,\"CAR\")","v":0},{"$f":"SUMIFS('Frais annuel 22'!S$404:S$433,'Frais annuel 22'!Q$404:Q$433,\"EN2\",'Frais annuel 22'!O$404:O$433,\"CAR\")","v":0},0,{"$f":"SUM(Q110:Q112)","v":0}]
[null,null,null,"Sous Total :",{"$f":"SUM(E99:E112)","v":0},{"$f":"SUM(F99:F112)","v":0},{"$f":"SUM(G99:G112)","v":0},{"$f":"SUM(H99:H112)","v":0},0,0,0,0,0,0,0,0,0]
[null,null,{"$f":"E49","v":0},"C O U ",{"$f":"SUMIFS('Frais annuel 22'!S8:S37,'Frais annuel 22'!P8:P37,\"COU\")","v":0},{"$f":"SUMIFS('Frais annuel 22'!S44:S73,'Frais annuel 22'!P44:P73,\"COU\")","v":0},{"$f":"SUMIFS('Frais annuel 22'!S80:S109,'Frais annuel 22'!P80:P109,\"COU\")","v":0},{"$f":"SUMIFS('Frais annuel 22'!S116:S145,'Frais annuel 22'!P116:P145,\"COU\")","v":0},{"$f":"SUMIFS('Frais annuel 22'!S152:S181,'Frais annuel 22'!P152:P181,\"COU\")","v":0},{"$f":"SUMIFS('Frais annuel 22'!S188:S217,'Frais annuel 22'!P188:P217,\"COU\")","v":0},{"$f":"SUMIFS('Frais annuel 22'!S224:S253,'Frais annuel 22'!P224:P253,\"COU\")","v":0},{"$f":"SUMIFS('Frais annuel 22'!S260:S289,'Frais annuel 22'!P260:P289,\"COU\")","v":0},{"$f":"SUMIFS('Frais annuel 22'!S296:S325,'Frais annuel 22'!P296:P325,\"COU\")","v":0},{"$f":"SUMIFS('Frais annuel 22'!S332:S361,'Frais annuel 22'!P332:P361,\"COU\")","v":0},{"$f":"SUMIFS('Frais annuel 22'!S368:S397,'Frais annuel 22'!P368:P397,\"COU\")","v":0},{"$f":"SUMIFS('Frais annuel 22'!S404:S433,'Frais annuel 22'!P404:P433,\"COU\")","v":0},{"$f":"SUM(E114:P114)","v":0},"Courses"]
[null,null,null,"Cartes Différés Mois Prochain",{"$f":"SUMIFS('Frais annuel 22'!S8:S37,'Frais annuel 22'!R8:R37,\"D\")","v":0},{"$f":"SUMIFS('Frais annuel 22'!S44:S73,'Frais annuel 22'!R44:R73,\"D\")","v":0},{"$f":"SUMIFS('Frais annuel 22'!S80:S109,'Frais annuel 22'!R80:R109,\"D\")","v":0},{"$f":"SUMIFS('Frais annuel 22'!S116:S145,'Frais annuel 22'!R116:R145,\"D\")","v":0},{"$f":"SUMIFS('Frais annuel 22'!S152:S181,'Frais annuel 22'!R152:R181,\"D\")","v":0},{"$f":"SUMIFS('Frais annuel 22'!S188:S217,'Frais annuel 22'!R188:R217,\"D\")","v":0},{"$f":"SUMIFS('Frais annuel 22'!S224:S253,'Frais annuel 22'!R224:R253,\"D\")","v":0},{"$f":"SUMIFS('Frais annuel 22'!S260:S289,'Frais annuel 22'!R260:R289,\"D\")","v":0},{"$f":"SUMIFS('Frais annuel 22'!S296:S325,'Frais annuel 22'!R296:R325,\"D\")","v":0},{"$f":"SUMIFS('Frais annuel 22'!S332:S361,'Frais annuel 22'!R332:R361,\"D\")","v":0},{"$f":"SUMIFS('Frais annuel 22'!S368:S397,'Frais annuel 22'!R368:R397,\"D\")","v":0},{"$f":"SUMIFS('Frais annuel 22'!T368:T397,'Frais annuel 22'!S368:S397,\"D\")","v":0},0,"Cartes Différés"]
[null,null,null,"REB",{"$f":"SUMIFS('Frais annuel 22'!S8:S37,'Frais annuel 22'!Q8:Q37,\"REB\")","v":0},{"$f":"SUMIFS('Frais annuel 22'!S44:S73,'Frais annuel 22'!Q44:Q73,\"REB\")","v":0},{"$f":"SUMIFS('Frais annuel 22'!S80:S109,'Frais annuel 22'!Q80:Q109,\"REB\")","v":0},{"$f":"SUMIFS('Frais annuel 22'!S116:S145,'Frais annuel 22'!Q116:Q145,\"REB\")","v":0},{"$f":"SUMIFS('Frais annuel 22'!S152:S181,'Frais annuel 22'!Q152:Q181,\"REB\")","v":0},{"$f":"SUMIFS('Frais annuel 22'!S188:S217,'Frais annuel 22'!Q188:Q217,\"REB\")","v":0},{"$f":"SUMIFS('Frais annuel 22'!S224:S253,'Frais annuel 22'!Q224:Q253,\"REB\")","v":0},{"$f":"SUMIFS('Frais annuel 22'!S260:S289,'Frais annuel 22'!Q260:Q289,\"REB\")","v":0},{"$f":"SUMIFS('Frais annuel 22'!S296:S325,'Frais annuel 22'!Q296:Q325,\"REB\")","v":0},{"$f":"SUMIFS('Frais annuel 22'!S332:S361,'Frais annuel 22'!Q332:Q361,\"REB\")","v":0},{"$f":"SUMIFS('Frais annuel 22'!S368:S397,'Frais annuel 22'!Q368:Q397,\"REB\")","v":0},{"$f":"SUMIFS('Frais annuel 22'!S404:S433,'Frais annuel 22'!Q404:Q433,\"REB\")","v":0},0,{"$f":"DATA!E7","v":"Remboursement"}]
[null,null,"ESP DV",null,{"$f":"SUMIFS('Frais annuel 22'!N$8:N$37,'Frais annuel 22'!Q$8:Q$37,\"DV\",'Frais annuel 22'!O$8:O$37,\"ESP\")","v":0},{"$f":"SUMIFS('Frais annuel 22'!N$44:N$73,'Frais annuel 22'!Q$44:Q$73,\"DV\",'Frais annuel 22'!O$44:O$73,\"ESP\")","v":0},{"$f":"SUMIFS('Frais annuel 22'!N$80:N$109,'Frais annuel 22'!Q$80:Q$109,\"DV\",'Frais annuel 22'!O$80:O$109,\"ESP\")","v":0},{"$f":"SUMIFS('Frais annuel 22'!N$116:N$145,'Frais annuel 22'!Q$116:Q$145,\"DV\",'Frais annuel 22'!O$116:O$145,\"ESP\")","v":0},{"$f":"SUMIFS('Frais annuel 22'!N$152:N$181,'Frais annuel 22'!Q$152:Q$181,\"DV\",'Frais annuel 22'!O$152:O$181,\"ESP\")","v":0},{"$f":"SUMIFS('Frais annuel 22'!N$188:N$217,'Frais annuel 22'!Q$188:Q$217,\"DV\",'Frais annuel 22'!O$188:O$217,\"ESP\")","v":0},{"$f":"SUMIFS('Frais annuel 22'!N$224:N$253,'Frais annuel 22'!Q$224:Q$253,\"DV\",'Frais annuel 22'!O$224:O$253,\"ESP\")","v":0},{"$f":"SUMIFS('Frais annuel 22'!N$260:N$289,'Frais annuel 22'!Q$260:Q$289,\"DV\",'Frais annuel 22'!O$260:O$289,\"ESP\")","v":0},{"$f":"SUMIFS('Frais annuel 22'!N$296:N$325,'Frais annuel 22'!Q$296:Q$325,\"DV\",'Frais annuel 22'!O$296:O$325,\"ESP\")","v":0},{"$f":"SUMIFS('Frais annuel 22'!N$332:N$361,'Frais annuel 22'!Q$332:Q$361,\"DV\",'Frais annuel 22'!O$332:O$361,\"ESP\")","v":0},{"$f":"SUMIFS('Frais annuel 22'!N$368:N$397,'Frais annuel 22'!Q$368:Q$397,\"DV\",'Frais annuel 22'!O$368:O$397,\"ESP\")","v":0},{"$f":"SUMIFS('Frais annuel 22'!N$404:N$433,'Frais annuel 22'!Q$404:Q$433,\"DV\",'Frais annuel 22'!O$404:O$433,\"ESP\")","v":0},0,{"$f":"C119","v":"CARTE DV"}]
[null,null,"CH  DV",null,{"$f":"SUMIFS('Frais annuel 22'!$N8:N$37,'Frais annuel 22'!Q$8:Q$37,\"DV\",'Frais annuel 22'!O$8:O$37,\"CH\")","v":0},{"$f":"SUMIFS('Frais annuel 22'!N$44:N$73,'Frais annuel 22'!Q$44:Q$73,\"DV\",'Frais annuel 22'!O$44:O$73,\"CH\")","v":0},{"$f":"SUMIFS('Frais annuel 22'!N$80:N$109,'Frais annuel 22'!Q$80:Q$109,\"DV\",'Frais annuel 22'!O$80:O$109,\"CH\")","v":0},{"$f":"SUMIFS('Frais annuel 22'!N$116:N$145,'Frais annuel 22'!Q$116:Q$145,\"DV\",'Frais annuel 22'!O$116:O$145,\"CH\")","v":0},{"$f":"SUMIFS('Frais annuel 22'!N$152:N$181,'Frais annuel 22'!Q$152:Q$181,\"DV\",'Frais annuel 22'!O$152:O$181,\"CH\")","v":0},{"$f":"SUMIFS('Frais annuel 22'!N$188:N$217,'Frais annuel 22'!Q$188:Q$217,\"DV\",'Frais annuel 22'!O$188:O$217,\"CH\")","v":0},{"$f":"SUMIFS('Frais annuel 22'!N$224:N$253,'Frais annuel 22'!Q$224:Q$253,\"DV\",'Frais annuel 22'!O$224:O$253,\"CH\")","v":0},{"$f":"SUMIFS('Frais annuel 22'!N$260:N$289,'Frais annuel 22'!Q$260:Q$289,\"DV\",'Frais annuel 22'!O$260:O$289,\"CH\")","v":0},{"$f":"SUMIFS('Frais annuel 22'!N$296:N$325,'Frais annuel 22'!Q$296:Q$325,\"DV\",'Frais annuel 22'!O$296:O$325,\"CH\")","v":0},{"$f":"SUMIFS('Frais annuel 22'!N$332:N$361,'Frais annuel 22'!Q$332:Q$361,\"DV\",'Frais annuel 22'!O$332:O$361,\"CH\")","v":0},{"$f":"SUMIFS('Frais annuel 22'!N$368:N$397,'Frais annuel 22'!Q$368:Q$397,\"DV\",'Frais annuel 22'!O$368:O$397,\"CH\")","v":0},{"$f":"SUMIFS('Frais annuel 22'!N$404:N$433,'Frais annuel 22'!Q$404:Q$433,\"DV\",'Frais annuel 22'!O$404:O$433,\"CH\")","v":0},0,"TOTAL"]
[null,null,"CARTE DV",null,{"$f":"SUMIFS('Frais annuel 22'!S$8:S$37,'Frais annuel 22'!Q$8:Q$37,\"DV\",'Frais annuel 22'!O$8:O$37,\"CAR\")","v":0},{"$f":"SUMIFS('Frais annuel 22'!S$44:S$73,'Frais annuel 22'!Q$44:Q$73,\"DV\",'Frais annuel 22'!O$44:O$73,\"CAR\")","v":0},{"$f":"SUMIFS('Frais annuel 22'!S$80:S$109,'Frais annuel 22'!Q$80:Q$109,\"DV\",'Frais annuel 22'!O$80:O$109,\"CAR\")","v":0},{"$f":"SUMIFS('Frais annuel 22'!S$116:S$145,'Frais annuel 22'!Q$116:Q$145,\"DV\",'Frais annuel 22'!O$116:O$145,\"CAR\")","v":0},{"$f":"SUMIFS('Frais annuel 22'!S$152:S$181,'Frais annuel 22'!Q$152:Q$181,\"DV\",'Frais annuel 22'!O$152:O$181,\"CAR\")","v":0},{"$f":"SUMIFS('Frais annuel 22'!S$188:S$217,'Frais annuel 22'!Q$188:Q$217,\"DV\",'Frais annuel 22'!O$188:O$217,\"CAR\")","v":0},{"$f":"SUMIFS('Frais annuel 22'!S$224:S$253,'Frais annuel 22'!Q$224:Q$253,\"DV\",'Frais annuel 22'!O$224:O$253,\"CAR\")","v":0},{"$f":"SUMIFS('Frais annuel 22'!S$260:S$289,'Frais annuel 22'!Q$260:Q$289,\"DV\",'Frais annuel 22'!O$260:O$289,\"CAR\")","v":0},{"$f":"SUMIFS('Frais annuel 22'!S$296:S$325,'Frais annuel 22'!Q$296:Q$325,\"DV\",'Frais annuel 22'!O$296:O$325,\"CAR\")","v":0},{"$f":"SUMIFS('Frais annuel 22'!S$332:S$361,'Frais annuel 22'!Q$332:Q$361,\"DV\",'Frais annuel 22'!O$332:O$361,\"CAR\")","v":0},{"$f":"SUMIFS('Frais annuel 22'!S$368:S$397,'Frais annuel 22'!Q$368:Q$397,\"DV\",'Frais annuel 22'!O$368:O$397,\"CAR\")","v":0},{"$f":"SUMIFS('Frais annuel 22'!S$404:S$433,'Frais annuel 22'!Q$404:Q$433,\"DV\",'Frais annuel 22'!O$404:O$433,\"CAR\")","v":0},0,{"$f":"SUM(Q117:Q119)","v":0}]
[null,null,"ESP GFR",null,{"$f":"SUMIFS('Frais annuel 22'!N$8:N$37,'Frais annuel 22'!Q$8:Q$37,\"GFR\",'Frais annuel 22'!O$8:O$37,\"ESP\")","v":0},{"$f":"SUMIFS('Frais annuel 22'!N$44:N$73,'Frais annuel 22'!Q$44:Q$73,\"GFR\",'Frais annuel 22'!O$44:O$73,\"ESP\")","v":0},{"$f":"SUMIFS('Frais annuel 22'!N$80:N$109,'Frais annuel 22'!Q$80:Q$109,\"GFR\",'Frais annuel 22'!O$80:O$109,\"ESP\")","v":0},{"$f":"SUMIFS('Frais annuel 22'!N$116:N$145,'Frais annuel 22'!Q$116:Q$145,\"GFR\",'Frais annuel 22'!O$116:O$145,\"ESP\")","v":0},{"$f":"SUMIFS('Frais annuel 22'!N$152:N$181,'Frais annuel 22'!Q$152:Q$181,\"GFR\",'Frais annuel 22'!O$152:O$181,\"ESP\")","v":0},{"$f":"SUMIFS('Frais annuel 22'!N$188:N$217,'Frais annuel 22'!Q$188:Q$217,\"GFR\",'Frais annuel 22'!O$188:O$217,\"ESP\")","v":0},{"$f":"SUMIFS('Frais annuel 22'!N$224:N$253,'Frais annuel 22'!Q$224:Q$253,\"GFR\",'Frais annuel 22'!O$224:O$253,\"ESP\")","v":0},{"$f":"SUMIFS('Frais annuel 22'!N$260:N$289,'Frais annuel 22'!Q$260:Q$289,\"GFR\",'Frais annuel 22'!O$260:O$289,\"ESP\")","v":0},{"$f":"SUMIFS('Frais annuel 22'!N$296:N$325,'Frais annuel 22'!Q$296:Q$325,\"GFR\",'Frais annuel 22'!O$296:O$325,\"ESP\")","v":0},{"$f":"SUMIFS('Frais annuel 22'!N$332:N$361,'Frais annuel 22'!Q$332:Q$361,\"GFR\",'Frais annuel 22'!O$332:O$361,\"ESP\")","v":0},{"$f":"SUMIFS('Frais annuel 22'!N$368:N$397,'Frais annuel 22'!Q$368:Q$397,\"GFR\",'Frais annuel 22'!O$368:O$397,\"ESP\")","v":0},{"$f":"SUMIFS('Frais annuel 22'!N$404:N$433,'Frais annuel 22'!Q$404:Q$433,\"GFR\",'Frais annuel 22'!O$404:O$433,\"ESP\")","v":0},0,{"$f":"DATA!E9","v":"GRAND FRAIS"}]
[null,null,"CH GFR",null,{"$f":"SUMIFS('Frais annuel 22'!$N8:N$37,'Frais annuel 22'!Q$8:Q$37,\"GFR\",'Frais annuel 22'!O$8:O$37,\"CH\")","v":0},{"$f":"SUMIFS('Frais annuel 22'!N$44:N$73,'Frais annuel 22'!Q$44:Q$73,\"GFR\",'Frais annuel 22'!O$44:O$73,\"CH\")","v":0},{"$f":"SUMIFS('Frais annuel 22'!N$80:N$109,'Frais annuel 22'!Q$80:Q$109,\"GFR\",'Frais annuel 22'!O$80:O$109,\"CH\")","v":0},{"$f":"SUMIFS('Frais annuel 22'!N$116:N$145,'Frais annuel 22'!Q$116:Q$145,\"GFR\",'Frais annuel 22'!O$116:O$145,\"CH\")","v":0},{"$f":"SUMIFS('Frais annuel 22'!N$152:N$181,'Frais annuel 22'!Q$152:Q$181,\"GFR\",'Frais annuel 22'!O$152:O$181,\"CH\")","v":0},{"$f":"SUMIFS('Frais annuel 22'!N$188:N$217,'Frais annuel 22'!Q$188:Q$217,\"GFR\",'Frais annuel 22'!O$188:O$217,\"CH\")","v":0},{"$f":"SUMIFS('Frais annuel 22'!N$224:N$253,'Frais annuel 22'!Q$224:Q$253,\"GFR\",'Frais annuel 22'!O$224:O$253,\"CH\")","v":0},{"$f":"SUMIFS('Frais annuel 22'!N$260:N$289,'Frais annuel 22'!Q$260:Q$289,\"GFR\",'Frais annuel 22'!O$260:O$289,\"CH\")","v":0},{"$f":"SUMIFS('Frais annuel 22'!N$296:N$325,'Frais annuel 22'!Q$296:Q$325,\"GFR\",'Frais annuel 22'!O$296:O$325,\"CH\")","v":0},{"$f":"SUMIFS('Frais annuel 22'!N$332:N$361,'Frais annuel 22'!Q$332:Q$361,\"GFR\",'Frais annuel 22'!O$332:O$361,\"CH\")","v":0},{"$f":"SUMIFS('Frais annuel 22'!N$368:N$397,'Frais annuel 22'!Q$368:Q$397,\"GFR\",'Frais annuel 22'!O$368:O$397,\"CH\")","v":0},{"$f":"SUMIFS('Frais annuel 22'!N$404:N$433,'Frais annuel 22'!Q$404:Q$433,\"GFR\",'Frais annuel 22'!O$404:O$433,\"CH\")","v":0},0,"TOTAL"]
[null,null,"CARTE GFR",null,{"$f":"SUMIFS('Frais annuel 22'!S$8:S$37,'Frais annuel 22'!Q$8:Q$37,\"GFR\",'Frais annuel 22'!O$8:O$37,\"CAR\")","v":0},{"$f":"SUMIFS('Frais annuel 22'!S$44:S$73,'Frais annuel 22'!Q$44:Q$73,\"GFR\",'Frais annuel 22'!O$44:O$73,\"CAR\")","v":0},{"$f":"SUMIFS('Frais annuel 22'!S$80:S$109,'Frais annuel 22'!Q$80:Q$109,\"GFR\",'Frais annuel 22'!O$80:O$109,\"CAR\")","v":0},{"$f":"SUMIFS('Frais annuel 22'!S$116:S$145,'Frais annuel 22'!Q$116:Q$145,\"GFR\",'Frais annuel 22'!O$116:O$145,\"CAR\")","v":0},{"$f":"SUMIFS('Frais annuel 22'!S$152:S$181,'Frais annuel 22'!Q$152:Q$181,\"GFR\",'Frais annuel 22'!O$152:O$181,\"CAR\")","v":0},{"$f":"SUMIFS('Frais annuel 22'!S$188:S$217,'Frais annuel 22'!Q$188:Q$217,\"GFR\",'Frais annuel 22'!O$188:O$217,\"CAR\")","v":0},{"$f":"SUMIFS('Frais annuel 22'!S$224:S$253,'Frais annuel 22'!Q$224:Q$253,\"GFR\",'Frais annuel 22'!O$224:O$253,\"CAR\")","v":0},{"$f":"SUMIFS('Frais annuel 22'!S$260:S$289,'Frais annuel 22'!Q$260:Q$289,\"GFR\",'Frais annuel 22'!O$260:O$289,\"CAR\")","v":0},{"$f":"SUMIFS('Frais annuel 22'!S$296:S$325,'Frais annuel 22'!Q$296:Q$325,\"GFR\",'Frais annuel 22'!O$296:O$325,\"CAR\")","v":0},{"$f":"SUMIFS('Frais annuel 22'!S$332:S$361,'Frais annuel 22'!Q$332:Q$361,\"GFR\",'Frais annuel 22'!O$332:O$361,\"CAR\")","v":0},{"$f":"SUMIFS('Frais annuel 22'!S$368:S$397,'Frais annuel 22'!Q$368:Q$397,\"GFR\",'Frais annuel 22'!O$368:O$397,\"CAR\")","v":0},{"$f":"SUMIFS('Frais annuel 22'!S$404:S$433,'Frais annuel 22'!Q$404:Q$433,\"GFR\",'Frais annuel 22'!O$404:O$433,\"CAR\")","v":0},0,{"$f":"SUM(Q120:Q122)","v":0}]
[null,null,"ESP LE1",null,{"$f":"SUMIFS('Frais annuel 22'!N$8:N$37,'Frais annuel 22'!Q$8:Q$37,\"LE1\",'Frais annuel 22'!O$8:O$37,\"ESP\")","v":0},{"$f":"SUMIFS('Frais annuel 22'!N$44:N$73,'Frais annuel 22'!Q$44:Q$73,\"LE1\",'Frais annuel 22'!O$44:O$73,\"ESP\")","v":0},{"$f":"SUMIFS('Frais annuel 22'!N$80:N$109,'Frais annuel 22'!Q$80:Q$109,\"LE1\",'Frais annuel 22'!O$80:O$109,\"ESP\")","v":0},{"$f":"SUMIFS('Frais annuel 22'!N$116:N$145,'Frais annuel 22'!Q$116:Q$145,\"LE1\",'Frais annuel 22'!O$116:O$145,\"ESP\")","v":0},{"$f":"SUMIFS('Frais annuel 22'!N$152:N$181,'Frais annuel 22'!Q$152:Q$181,\"LE1\",'Frais annuel 22'!O$152:O$181,\"ESP\")","v":0},{"$f":"SUMIFS('Frais annuel 22'!N$188:N$217,'Frais annuel 22'!Q$188:Q$217,\"LE1\",'Frais annuel 22'!O$188:O$217,\"ESP\")","v":0},{"$f":"SUMIFS('Frais annuel 22'!N$224:N$253,'Frais annuel 22'!Q$224:Q$253,\"LE1\",'Frais annuel 22'!O$224:O$253,\"ESP\")","v":0},{"$f":"SUMIFS('Frais annuel 22'!N$260:N$289,'Frais annuel 22'!Q$260:Q$289,\"LE1\",'Frais annuel 22'!O$260:O$289,\"ESP\")","v":0},{"$f":"SUMIFS('Frais annuel 22'!N$296:N$325,'Frais annuel 22'!Q$296:Q$325,\"LE1\",'Frais annuel 22'!O$296:O$325,\"ESP\")","v":0},{"$f":"SUMIFS('Frais annuel 22'!N$332:N$361,'Frais annuel 22'!Q$332:Q$361,\"LE1\",'Frais annuel 22'!O$332:O$361,\"ESP\")","v":0},{"$f":"SUMIFS('Frais annuel 22'!N$368:N$397,'Frais annuel 22'!Q$368:Q$397,\"LE1\",'Frais annuel 22'!O$368:O$397,\"ESP\")","v":0},{"$f":"SUMIFS('Frais annuel 22'!N$404:N$433,'Frais annuel 22'!Q$404:Q$433,\"LE1\",'Frais annuel 22'!O$404:O$433,\"ESP\")","v":0},0,{"$f":"R125","v":0}]
[null,null,"CH LE1",null,{"$f":"SUMIFS('Frais annuel 22'!$N8:N$37,'Frais annuel 22'!Q$8:Q$37,\"LE1\",'Frais annuel 22'!O$8:O$37,\"CH\")","v":0},{"$f":"SUMIFS('Frais annuel 22'!N$44:N$73,'Frais annuel 22'!Q$44:Q$73,\"LE1\",'Frais annuel 22'!O$44:O$73,\"CH\")","v":0},{"$f":"SUMIFS('Frais annuel 22'!N$80:N$109,'Frais annuel 22'!Q$80:Q$109,\"LE1\",'Frais annuel 22'!O$80:O$109,\"CH\")","v":0},{"$f":"SUMIFS('Frais annuel 22'!N$116:N$145,'Frais annuel 22'!Q$116:Q$145,\"LE1\",'Frais annuel 22'!O$116:O$145,\"CH\")","v":0},{"$f":"SUMIFS('Frais annuel 22'!N$152:N$181,'Frais annuel 22'!Q$152:Q$181,\"LE1\",'Frais annuel 22'!O$152:O$181,\"CH\")","v":0},{"$f":"SUMIFS('Frais annuel 22'!N$188:N$217,'Frais annuel 22'!Q$188:Q$217,\"LE1\",'Frais annuel 22'!O$188:O$217,\"CH\")","v":0},{"$f":"SUMIFS('Frais annuel 22'!N$224:N$253,'Frais annuel 22'!Q$224:Q$253,\"LE1\",'Frais annuel 22'!O$224:O$253,\"CH\")","v":0},{"$f":"SUMIFS('Frais annuel 22'!N$260:N$289,'Frais annuel 22'!Q$260:Q$289,\"LE1\",'Frais annuel 22'!O$260:O$289,\"CH\")","v":0},{"$f":"SUMIFS('Frais annuel 22'!N$296:N$325,'Frais annuel 22'!Q$296:Q$325,\"LE1\",'Frais annuel 22'!O$296:O$325,\"CH\")","v":0},{"$f":"SUMIFS('Frais annuel 22'!N$332:N$361,'Frais annuel 22'!Q$332:Q$361,\"LE1\",'Frais annuel 22'!O$332:O$361,\"CH\")","v":0},{"$f":"SUMIFS('Frais annuel 22'!N$368:N$397,'Frais annuel 22'!Q$368:Q$397,\"LE1\",'Frais annuel 22'!O$368:O$397,\"CH\")","v":0},{"$f":"SUMIFS('Frais annuel 22'!N$404:N$433,'Frais annuel 22'!Q$404:Q$433,\"LE1\",'Frais annuel 22'!O$404:O$433,\"CH\")","v":0},0,"TOTAL"]
[null,null," CARTE LE1",null,{"$f":"SUMIFS('Frais annuel 22'!S$8:S$37,'Frais annuel 22'!Q$8:Q$37,\"LE1\",'Frais annuel 22'!O$8:O$37,\"CAR\")","v":0},{"$f":"SUMIFS('Frais annuel 22'!S$44:S$73,'Frais annuel 22'!Q$44:Q$73,\"LE1\",'Frais annuel 22'!O$44:O$73,\"CAR\")","v":0},{"$f":"SUMIFS('Frais annuel 22'!S$80:S$109,'Frais annuel 22'!Q$80:Q$109,\"LE1\",'Frais annuel 22'!O$80:O$109,\"CAR\")","v":0},{"$f":"SUMIFS('Frais annuel 22'!S$116:S$145,'Frais annuel 22'!Q$116:Q$145,\"LE1\",'Frais annuel 22'!O$116:O$145,\"CAR\")","v":0},{"$f":"SUMIFS('Frais annuel 22'!S$152:S$181,'Frais annuel 22'!Q$152:Q$181,\"LE1\",'Frais annuel 22'!O$152:O$181,\"CAR\")","v":0},{"$f":"SUMIFS('Frais annuel 22'!S$188:S$217,'Frais annuel 22'!Q$188:Q$217,\"LE1\",'Frais annuel 22'!O$188:O$217,\"CAR\")","v":0},{"$f":"SUMIFS('Frais annuel 22'!S$224:S$253,'Frais annuel 22'!Q$224:Q$253,\"LE1\",'Frais annuel 22'!O$224:O$253,\"CAR\")","v":0},{"$f":"SUMIFS('Frais annuel 22'!S$260:S$289,'Frais annuel 22'!Q$260:Q$289,\"LE1\",'Frais annuel 22'!O$260:O$289,\"CAR\")","v":0},{"$f":"SUMIFS('Frais annuel 22'!S$296:S$325,'Frais annuel 22'!Q$296:Q$325,\"LE1\",'Frais annuel 22'!O$296:O$325,\"CAR\")","v":0},{"$f":"SUMIFS('Frais annuel 22'!S$332:S$361,'Frais annuel 22'!Q$332:Q$361,\"LE1\",'Frais annuel 22'!O$332:O$361,\"CAR\")","v":0},{"$f":"SUMIFS('Frais annuel 22'!S$368:S$397,'Frais annuel 22'!Q$368:Q$397,\"LE1\",'Frais annuel 22'!O$368:O$397,\"CAR\")","v":0},{"$f":"SUMIFS('Frais annuel 22'!S$404:S$433,'Frais annuel 22'!Q$404:Q$433,\"LE1\",'Frais annuel 22'!O$404:O$433,\"CAR\")","v":0},0,{"$f":"SUM(Q123:Q125)","v":0}]
[null,null,"ESP  LE2",null,{"$f":"SUMIFS('Frais annuel 22'!N$8:N$37,'Frais annuel 22'!Q$8:Q$37,\"LE2\",'Frais annuel 22'!O$8:O$37,\"ESP\")","v":0},{"$f":"SUMIFS('Frais annuel 22'!N$44:N$73,'Frais annuel 22'!Q$44:Q$73,\"LE2\",'Frais annuel 22'!O$44:O$73,\"ESP\")","v":0},{"$f":"SUMIFS('Frais annuel 22'!N$80:N$109,'Frais annuel 22'!Q$80:Q$109,\"LE2\",'Frais annuel 22'!O$80:O$109,\"ESP\")","v":0},{"$f":"SUMIFS('Frais annuel 22'!N$116:N$145,'Frais annuel 22'!Q$116:Q$145,\"LE2\",'Frais annuel 22'!O$116:O$145,\"ESP\")","v":0},{"$f":"SUMIFS('Frais annuel 22'!N$152:N$181,'Frais annuel 22'!Q$152:Q$181,\"LE2\",'Frais annuel 22'!O$152:O$181,\"ESP\")","v":0},{"$f":"SUMIFS('Frais annuel 22'!N$188:N$217,'Frais annuel 22'!Q$188:Q$217,\"LE2\",'Frais annuel 22'!O$188:O$217,\"ESP\")","v":0},{"$f":"SUMIFS('Frais annuel 22'!N$224:N$253,'Frais annuel 22'!Q$224:Q$253,\"LE2\",'Frais annuel 22'!O$224:O$253,\"ESP\")","v":0},{"$f":"SUMIFS('Frais annuel 22'!N$260:N$289,'Frais annuel 22'!Q$260:Q$289,\"LE2\",'Frais annuel 22'!O$260:O$289,\"ESP\")","v":0},{"$f":"SUMIFS('Frais annuel 22'!N$296:N$325,'Frais annuel 22'!Q$296:Q$325,\"LE2\",'Frais annuel 22'!O$296:O$325,\"ESP\")","v":0},{"$f":"SUMIFS('Frais annuel 22'!N$332:N$361,'Frais annuel 22'!Q$332:Q$361,\"LE2\",'Frais annuel 22'!O$332:O$361,\"ESP\")","v":0},{"$f":"SUMIFS('Frais annuel 22'!N$368:N$397,'Frais annuel 22'!Q$368:Q$397,\"LE2\",'Frais annuel 22'!O$368:O$397,\"ESP\")","v":0},{"$f":"SUMIFS('Frais annuel 22'!N$404:N$433,'Frais annuel 22'!Q$404:Q$433,\"LE2\",'Frais annuel 22'!O$404:O$433,\"ESP\")","v":0},0,{"$f":"R128","v":0}]
[null,null,"CH LE2",null,{"$f":"SUMIFS('Frais annuel 22'!$N8:N$37,'Frais annuel 22'!Q$8:Q$37,\"LE2\",'Frais annuel 22'!O$8:O$37,\"CH\")","v":0},{"$f":"SUMIFS('Frais annuel 22'!N$44:N$73,'Frais annuel 22'!Q$44:Q$73,\"LE2\",'Frais annuel 22'!O$44:O$73,\"CH\")","v":0},{"$f":"SUMIFS('Frais annuel 22'!N$80:N$109,'Frais annuel 22'!Q$80:Q$109,\"LE2\",'Frais annuel 22'!O$80:O$109,\"CH\")","v":0},{"$f":"SUMIFS('Frais annuel 22'!N$116:N$145,'Frais annuel 22'!Q$116:Q$145,\"LE2\",'Frais annuel 22'!O$116:O$145,\"CH\")","v":0},{"$f":"SUMIFS('Frais annuel 22'!N$152:N$181,'Frais annuel 22'!Q$152:Q$181,\"LE2\",'Frais annuel 22'!O$152:O$181,\"CH\")","v":0},{"$f":"SUMIFS('Frais annuel 22'!N$188:N$217,'Frais annuel 22'!Q$188:Q$217,\"LE2\",'Frais annuel 22'!O$188:O$217,\"CH\")","v":0},{"$f":"SUMIFS('Frais annuel 22'!N$224:N$253,'Frais annuel 22'!Q$224:Q$253,\"LE2\",'Frais annuel 22'!O$224:O$253,\"CH\")","v":0},{"$f":"SUMIFS('Frais annuel 22'!N$260:N$289,'Frais annuel 22'!Q$260:Q$289,\"LE2\",'Frais annuel 22'!O$260:O$289,\"CH\")","v":0},{"$f":"SUMIFS('Frais annuel 22'!N$296:N$325,'Frais annuel 22'!Q$296:Q$325,\"LE2\",'Frais annuel 22'!O$296:O$325,\"CH\")","v":0},{"$f":"SUMIFS('Frais annuel 22'!N$332:N$361,'Frais annuel 22'!Q$332:Q$361,\"LE2\",'Frais annuel 22'!O$332:O$361,\"CH\")","v":0},{"$f":"SUMIFS('Frais annuel 22'!N$368:N$397,'Frais annuel 22'!Q$368:Q$397,\"LE2\",'Frais annuel 22'!O$368:O$397,\"CH\")","v":0},{"$f":"SUMIFS('Frais annuel 22'!N$404:N$433,'Frais annuel 22'!Q$404:Q$433,\"LE2\",'Frais annuel 22'!O$404:O$433,\"CH\")","v":0},0,"TOTAL"]
[null,null," CARTE  LE2",null,{"$f":"SUMIFS('Frais annuel 22'!S$8:S$37,'Frais annuel 22'!Q$8:Q$37,\"LE2\",'Frais annuel 22'!O$8:O$37,\"CAR\")","v":0},{"$f":"SUMIFS('Frais annuel 22'!S$44:S$73,'Frais annuel 22'!Q$44:Q$73,\"LE2\",'Frais annuel 22'!O$44:O$73,\"CAR\")","v":0},{"$f":"SUMIFS('Frais annuel 22'!S$80:S$109,'Frais annuel 22'!Q$80:Q$109,\"LE2\",'Frais annuel 22'!O$80:O$109,\"CAR\")","v":0},{"$f":"SUMIFS('Frais annuel 22'!S$116:S$145,'Frais annuel 22'!Q$116:Q$145,\"LE2\",'Frais annuel 22'!O$116:O$145,\"CAR\")","v":0},{"$f":"SUMIFS('Frais annuel 22'!S$152:S$181,'Frais annuel 22'!Q$152:Q$181,\"LE2\",'Frais annuel 22'!O$152:O$181,\"CAR\")","v":0},{"$f":"SUMIFS('Frais annuel 22'!S$188:S$217,'Frais annuel 22'!Q$188:Q$217,\"LE2\",'Frais annuel 22'!O$188:O$217,\"CAR\")","v":0},{"$f":"SUMIFS('Frais annuel 22'!S$224:S$253,'Frais annuel 22'!Q$224:Q$253,\"LE2\",'Frais annuel 22'!O$224:O$253,\"CAR\")","v":0},{"$f":"SUMIFS('Frais annuel 22'!S$260:S$289,'Frais annuel 22'!Q$260:Q$289,\"LE2\",'Frais annuel 22'!O$260:O$289,\"CAR\")","v":0},{"$f":"SUMIFS('Frais annuel 22'!S$296:S$325,'Frais annuel 22'!Q$296:Q$325,\"LE2\",'Frais annuel 22'!O$296:O$325,\"CAR\")","v":0},{"$f":"SUMIFS('Frais annuel 22'!S$332:S$361,'Frais annuel 22'!Q$332:Q$361,\"LE2\",'Frais annuel 22'!O$332:O$361,\"CAR\")","v":0},{"$f":"SUMIFS('Frais annuel 22'!S$368:S$397,'Frais annuel 22'!Q$368:Q$397,\"LE2\",'Frais annuel 22'!O$368:O$397,\"CAR\")","v":0},{"$f":"SUMIFS('Frais annuel 22'!S$404:S$433,'Frais annuel 22'!Q$404:Q$433,\"LE2\",'Frais annuel 22'!O$404:O$433,\"CAR\")","v":0},0,{"$f":"SUM(Q126:Q128)","v":0}]
[null,null,"ESP S U",null,{"$f":"SUMIFS('Frais annuel 22'!N$8:N$37,'Frais annuel 22'!Q$8:Q$37,\"S U\",'Frais annuel 22'!O$8:O$37,\"ESP\")","v":0},{"$f":"SUMIFS('Frais annuel 22'!N$44:N$73,'Frais annuel 22'!Q$44:Q$73,\"S U\",'Frais annuel 22'!O$44:O$73,\"ESP\")","v":0},{"$f":"SUMIFS('Frais annuel 22'!N$80:N$109,'Frais annuel 22'!Q$80:Q$109,\"S U\",'Frais annuel 22'!O$80:O$109,\"ESP\")","v":0},{"$f":"SUMIFS('Frais annuel 22'!N$116:N$145,'Frais annuel 22'!Q$116:Q$145,\"S U\",'Frais annuel 22'!O$116:O$145,\"ESP\")","v":0},{"$f":"SUMIFS('Frais annuel 22'!N$152:N$181,'Frais annuel 22'!Q$152:Q$181,\"S U\",'Frais annuel 22'!O$152:O$181,\"ESP\")","v":0},{"$f":"SUMIFS('Frais annuel 22'!N$188:N$217,'Frais annuel 22'!Q$188:Q$217,\"S U\",'Frais annuel 22'!O$188:O$217,\"ESP\")","v":0},{"$f":"SUMIFS('Frais annuel 22'!N$224:N$253,'Frais annuel 22'!Q$224:Q$253,\"S U\",'Frais annuel 22'!O$224:O$253,\"ESP\")","v":0},{"$f":"SUMIFS('Frais annuel 22'!N$260:N$289,'Frais annuel 22'!Q$260:Q$289,\"S U\",'Frais annuel 22'!O$260:O$289,\"ESP\")","v":0},{"$f":"SUMIFS('Frais annuel 22'!N$296:N$325,'Frais annuel 22'!Q$296:Q$325,\"S U\",'Frais annuel 22'!O$296:O$325,\"ESP\")","v":0},{"$f":"SUMIFS('Frais annuel 22'!N$332:N$361,'Frais annuel 22'!Q$332:Q$361,\"S U\",'Frais annuel 22'!O$332:O$361,\"ESP\")","v":0},{"$f":"SUMIFS('Frais annuel 22'!N$368:N$397,'Frais annuel 22'!Q$368:Q$397,\"S U\",'Frais annuel 22'!O$368:O$397,\"ESP\")","v":0},{"$f":"SUMIFS('Frais annuel 22'!N$404:N$433,'Frais annuel 22'!Q$404:Q$433,\"S U\",'Frais annuel 22'!O$404:O$433,\"ESP\")","v":0},0,{"$f":"R131","v":0}]
[null,null,"CH S U",null,{"$f":"SUMIFS('Frais annuel 22'!$N8:N$37,'Frais annuel 22'!Q$8:Q$37,\"S U\",'Frais annuel 22'!O$8:O$37,\"CH\")","v":0},{"$f":"SUMIFS('Frais annuel 22'!N$44:N$73,'Frais annuel 22'!Q$44:Q$73,\"S U\",'Frais annuel 22'!O$44:O$73,\"CH\")","v":0},{"$f":"SUMIFS('Frais annuel 22'!N$80:N$109,'Frais annuel 22'!Q$80:Q$109,\"S U\",'Frais annuel 22'!O$80:O$109,\"CH\")","v":0},{"$f":"SUMIFS('Frais annuel 22'!N$116:N$145,'Frais annuel 22'!Q$116:Q$145,\"S U\",'Frais annuel 22'!O$116:O$145,\"CH\")","v":0},{"$f":"SUMIFS('Frais annuel 22'!N$152:N$181,'Frais annuel 22'!Q$152:Q$181,\"S U\",'Frais annuel 22'!O$152:O$181,\"CH\")","v":0},{"$f":"SUMIFS('Frais annuel 22'!N$188:N$217,'Frais annuel 22'!Q$188:Q$217,\"S U\",'Frais annuel 22'!O$188:O$217,\"CH\")","v":0},{"$f":"SUMIFS('Frais annuel 22'!N$224:N$253,'Frais annuel 22'!Q$224:Q$253,\"S U\",'Frais annuel 22'!O$224:O$253,\"CH\")","v":0},{"$f":"SUMIFS('Frais annuel 22'!N$260:N$289,'Frais annuel 22'!Q$260:Q$289,\"S U\",'Frais annuel 22'!O$260:O$289,\"CH\")","v":0},{"$f":"SUMIFS('Frais annuel 22'!N$296:N$325,'Frais annuel 22'!Q$296:Q$325,\"S U\",'Frais annuel 22'!O$296:O$325,\"CH\")","v":0},{"$f":"SUMIFS('Frais annuel 22'!N$332:N$361,'Frais annuel 22'!Q$332:Q$361,\"S U\",'Frais annuel 22'!O$332:O$361,\"CH\")","v":0},{"$f":"SUMIFS('Frais annuel 22'!N$368:N$397,'Frais annuel 22'!Q$368:Q$397,\"S U\",'Frais annuel 22'!O$368:O$397,\"CH\")","v":0},{"$f":"SUMIFS('Frais annuel 22'!N$404:N$433,'Frais annuel 22'!Q$404:Q$433,\"S U\",'Frais annuel 22'!O$404:O$433,\"CH\")","v":0},0,"TOTAL"]
[null,null,"CARTE   S U",null,{"$f":"SUMIFS('Frais annuel 22'!S$8:S$37,'Frais annuel 22'!Q$8:Q$37,\"S U\",'Frais annuel 22'!O$8:O$37,\"CAR\")","v":0},{"$f":"SUMIFS('Frais annuel 22'!S$44:S$73,'Frais annuel 22'!Q$44:Q$73,\"S U\",'Frais annuel 22'!O$44:O$73,\"CAR\")","v":0},{"$f":"SUMIFS('Frais annuel 22'!S$80:S$109,'Frais annuel 22'!Q$80:Q$109,\"S U\",'Frais annuel 22'!O$80:O$109,\"CAR\")","v":0},{"$f":"SUMIFS('Frais annuel 22'!S$116:S$145,'Frais annuel 22'!Q$116:Q$145,\"S U\",'Frais annuel 22'!O$116:O$145,\"CAR\")","v":0},{"$f":"SUMIFS('Frais annuel 22'!S$152:S$181,'Frais annuel 22'!Q$152:Q$181,\"S U\",'Frais annuel 22'!O$152:O$181,\"CAR\")","v":0},{"$f":"SUMIFS('Frais annuel 22'!S$188:S$217,'Frais annuel 22'!Q$188:Q$217,\"S U\",'Frais annuel 22'!O$188:O$217,\"CAR\")","v":0},{"$f":"SUMIFS('Frais annuel 22'!S$224:S$253,'Frais annuel 22'!Q$224:Q$253,\"S U\",'Frais annuel 22'!O$224:O$253,\"CAR\")","v":0},{"$f":"SUMIFS('Frais annuel 22'!S$260:S$289,'Frais annuel 22'!Q$260:Q$289,\"S U\",'Frais annuel 22'!O$260:O$289,\"CAR\")","v":0},{"$f":"SUMIFS('Frais annuel 22'!S$296:S$325,'Frais annuel 22'!Q$296:Q$325,\"S U\",'Frais annuel 22'!O$296:O$325,\"CAR\")","v":0},{"$f":"SUMIFS('Frais annuel 22'!S$332:S$361,'Frais annuel 22'!Q$332:Q$361,\"S U\",'Frais annuel 22'!O$332:O$361,\"CAR\")","v":0},{"$f":"SUMIFS('Frais annuel 22'!S$368:S$397,'Frais annuel 22'!Q$368:Q$397,\"S U\",'Frais annuel 22'!O$368:O$397,\"CAR\")","v":0},{"$f":"SUMIFS('Frais annuel 22'!S$404:S$433,'Frais annuel 22'!Q$404:Q$433,\"S U\",'Frais annuel 22'!O$404:O$433,\"CAR\")","v":0},0,{"$f":"SUM(Q129:Q131)","v":0}]
[null,null,null,"Sous Total  MOIS",{"$f":"SUM(E116:E131)","v":0},{"$f":"SUM(F116:F131)","v":0},{"$f":"SUM(G116:G131)","v":0},{"$f":"SUM(H116:H131)","v":0},0,0,0,0,0,0,0,0,{"$f":"SUM(Q115:Q131)","v":0},{"$f":"SUM(E132:P132)","v":0}]
[null,null,null,"Sous Total 2 :",{"$f":"SUM(E115:E131)","v":0},{"$f":"SUM(F115:F131)","v":0},{"$f":"SUM(G115:G131)","v":0},{"$f":"SUM(H115:H131)","v":0},0,0,0,0,0,0,0,0,{"$f":"SUM(Q116:Q131)","v":0},{"$f":"SUM(E133:P133)","v":0}]
[null,null,{"$f":"E17","v":0},"REM   BP",{"$f":"E17","v":0},0,0,{"$f":"H17","v":0},0,0,0,0,0,0,0,0,{"$f":"SUM(E134:P134)","v":0}]
[null,null,null,"TOTAL   ",{"$f":"E133-E134","v":0},{"$f":"F133-F134","v":0},0,0,0,0,0,0,0,0,0,0,{"$f":"SUM(E135:P135)","v":0},{"$f":"SUM(E135:P135)","v":0}]
[null,null,null,"Dépenses mois réel",{"$f":"E135-F134","v":0},{"$f":"F135-G134","v":0},{"$f":"G135-H134","v":0},{"$f":"H135-I134","v":0},{"$f":"I135-J134","v":0},0,0,0,0,0,0]
[null,null,null,null,"JANVIER","FEVRIER","MARS","AVRIL","MAI","JUIN","JUILLET","AOUT","SEPTEMBRE","OCTOBRE","NOVEMBRE ","DECEMBRE"]
[null,null,null,"S A N ",{"$f":"SUMIFS('Frais annuel 22'!S8:S37,'Frais annuel 22'!P8:P37,\"SAN\")","v":0},{"$f":"SUMIFS('Frais annuel 22'!S44:S73,'Frais annuel 22'!P44:P73,\"SAN\")","v":0},{"$f":"SUMIFS('Frais annuel 22'!S80:S109,'Frais annuel 22'!P80:P109,\"SAN\")","v":0},{"$f":"SUMIFS('Frais annuel 22'!S116:S145,'Frais annuel 22'!P116:P145,\"SAN\")","v":0},{"$f":"SUMIFS('Frais annuel 22'!S152:S181,'Frais annuel 22'!P152:P181,\"SAN\")","v":0},{"$f":"SUMIFS('Frais annuel 22'!S188:S217,'Frais annuel 22'!P188:P217,\"SAN\")","v":0},{"$f":"SUMIFS('Frais annuel 22'!S224:S253,'Frais annuel 22'!P224:P253,\"SAN\")","v":0},{"$f":"SUMIFS('Frais annuel 22'!S260:S289,'Frais annuel 22'!P260:P289,\"SAN\")","v":0},{"$f":"SUMIFS('Frais annuel 22'!S296:S325,'Frais annuel 22'!P296:P325,\"SAN\")","v":0},{"$f":"SUMIFS('Frais annuel 22'!S332:S361,'Frais annuel 22'!P332:P361,\"SAN\")","v":0},{"$f":"SUMIFS('Frais annuel 22'!S368:S397,'Frais annuel 22'!P368:P397,\"SAN\")","v":0},{"$f":"SUMIFS('Frais annuel 22'!S404:S433,'Frais annuel 22'!P404:P433,\"SAN\")","v":0},{"$f":"SUM(E138:P138)","v":0},"Santé"]
[null,null,"ESP  DEN1",null,{"$f":"SUMIFS('Frais annuel 22'!N8:N37,'Frais annuel 22'!Q8:Q37,\"DEN1\",'Frais annuel 22'!O8:O37,\"ESP\")","v":0},{"$f":"SUMIFS('Frais annuel 22'!N$44:N$73,'Frais annuel 22'!Q$44:Q$73,\"DEN1\",'Frais annuel 22'!O$44:O$73,\"ESP\")","v":0},{"$f":"SUMIFS('Frais annuel 22'!N$80:N$109,'Frais annuel 22'!Q$80:Q$109,\"DEN1\",'Frais annuel 22'!O$80:O$109,\"ESP\")","v":0},{"$f":"SUMIFS('Frais annuel 22'!N$116:N$145,'Frais annuel 22'!Q$116:Q$145,\"DEN1\",'Frais annuel 22'!O$116:O$145,\"ESP\")","v":0},{"$f":"SUMIFS('Frais annuel 22'!N$152:N$181,'Frais annuel 22'!Q$152:Q$181,\"DEN1\",'Frais annuel 22'!O$152:O$181,\"ESP\")","v":0},{"$f":"SUMIFS('Frais annuel 22'!N$188:N$217,'Frais annuel 22'!Q$188:Q$217,\"DEN1\",'Frais annuel 22'!O$188:O$217,\"ESP\")","v":0},{"$f":"SUMIFS('Frais annuel 22'!N$224:N$253,'Frais annuel 22'!Q$224:Q$253,\"DEN1\",'Frais annuel 22'!O$224:O$253,\"ESP\")","v":0},{"$f":"SUMIFS('Frais annuel 22'!N$260:N$289,'Frais annuel 22'!Q$260:Q$289,\"DEN1\",'Frais annuel 22'!O$260:O$289,\"ESP\")","v":0},{"$f":"SUMIFS('Frais annuel 22'!N$296:N$325,'Frais annuel 22'!Q$296:Q$325,\"DEN1\",'Frais annuel 22'!O$296:O$325,\"ESP\")","v":0},{"$f":"SUMIFS('Frais annuel 22'!N$332:N$361,'Frais annuel 22'!Q$332:Q$361,\"DEN1\",'Frais annuel 22'!O$332:O$361,\"ESP\")","v":0},{"$f":"SUMIFS('Frais annuel 22'!N$368:N$397,'Frais annuel 22'!Q$368:Q$397,\"DEN1\",'Frais annuel 22'!O$368:O$397,\"ESP\")","v":0},{"$f":"SUMIFS('Frais annuel 22'!N$404:N$433,'Frais annuel 22'!Q$404:Q$433,\"DEN1\",'Frais annuel 22'!O$404:O$433,\"ESP\")","v":0},0,{"$f":"DATA!Q7","v":"K GOURNAY COPPE Dent"}]
[null,null,"CH  DEN1",null,{"$f":"SUMIFS('Frais annuel 22'!N8:N37,'Frais annuel 22'!Q8:Q37,\"DEN1\",'Frais annuel 22'!O8:O37,\"CH\")","v":0},{"$f":"SUMIFS('Frais annuel 22'!N$44:N$73,'Frais annuel 22'!Q$44:Q$73,\"DEN1\",'Frais annuel 22'!O$44:O$73,\"CH\")","v":0},{"$f":"SUMIFS('Frais annuel 22'!N$80:N$109,'Frais annuel 22'!Q$80:Q$109,\"DEN1\",'Frais annuel 22'!O$80:O$109,\"CH\")","v":0},{"$f":"SUMIFS('Frais annuel 22'!N$116:N$145,'Frais annuel 22'!Q$116:Q$145,\"DEN1\",'Frais annuel 22'!O$116:O$145,\"CH\")","v":0},{"$f":"SUMIFS('Frais annuel 22'!N$152:N$181,'Frais annuel 22'!Q$152:Q$181,\"DEN1\",'Frais annuel 22'!O$152:O$181,\"CH\")","v":0},{"$f":"SUMIFS('Frais annuel 22'!N$188:N$217,'Frais annuel 22'!Q$188:Q$217,\"DEN1\",'Frais annuel 22'!O$188:O$217,\"CH\")","v":0},{"$f":"SUMIFS('Frais annuel 22'!N$224:N$253,'Frais annuel 22'!Q$224:Q$253,\"DEN1\",'Frais annuel 22'!O$224:O$253,\"CH\")","v":0},{"$f":"SUMIFS('Frais annuel 22'!N$260:N$289,'Frais annuel 22'!Q$260:Q$289,\"DEN1\",'Frais annuel 22'!O$260:O$289,\"CH\")","v":0},{"$f":"SUMIFS('Frais annuel 22'!N$296:N$325,'Frais annuel 22'!Q$296:Q$325,\"DEN1\",'Frais annuel 22'!O$296:O$325,\"CH\")","v":0},{"$f":"SUMIFS('Frais annuel 22'!N$332:N$361,'Frais annuel 22'!Q$332:Q$361,\"DEN1\",'Frais annuel 22'!O$332:O$361,\"CH\")","v":0},{"$f":"SUMIFS('Frais annuel 22'!N$368:N$397,'Frais annuel 22'!Q$368:Q$397,\"DEN1\",'Frais annuel 22'!O$368:O$397,\"CH\")","v":0},{"$f":"SUMIFS('Frais annuel 22'!N$404:N$433,'Frais annuel 22'!Q$404:Q$433,\"DEN1\",'Frais annuel 22'!O$404:O$433,\"CH\")","v":0},0,"TOTAL + 08/12/21  6,90 €"]
[null,null," CARTE  DEN1",null,{"$f":"SUMIFS('Frais annuel 22'!S8:S37,'Frais annuel 22'!Q8:Q37,\"DEN1\",'Frais annuel 22'!O8:O37,\"CAR\")","v":0},{"$f":"SUMIFS('Frais annuel 22'!S$44:S$73,'Frais annuel 22'!Q$44:Q$73,\"DEN1\",'Frais annuel 22'!O$44:O$73,\"CAR\")","v":0},{"$f":"SUMIFS('Frais annuel 22'!S$80:S$109,'Frais annuel 22'!Q$80:Q$109,\"DEN1\",'Frais annuel 22'!O$80:O$109,\"CAR\")","v":0},{"$f":"SUMIFS('Frais annuel 22'!S$116:S$145,'Frais annuel 22'!Q$116:Q$145,\"DEN1\",'Frais annuel 22'!O$116:O$145,\"CAR\")","v":0},{"$f":"SUMIFS('Frais annuel 22'!S$152:S$181,'Frais annuel 22'!Q$152:Q$181,\"DEN1\",'Frais annuel 22'!O$152:O$181,\"CAR\")","v":0},{"$f":"SUMIFS('Frais annuel 22'!S$188:S$217,'Frais annuel 22'!Q$188:Q$217,\"DEN1\",'Frais annuel 22'!O$188:O$217,\"CAR\")","v":0},{"$f":"SUMIFS('Frais annuel 22'!S$224:S$253,'Frais annuel 22'!Q$224:Q$253,\"DEN1\",'Frais annuel 22'!O$224:O$253,\"CAR\")","v":0},{"$f":"SUMIFS('Frais annuel 22'!S$260:S$289,'Frais annuel 22'!Q$260:Q$289,\"DEN1\",'Frais annuel 22'!O$260:O$289,\"CAR\")","v":0},{"$f":"SUMIFS('Frais annuel 22'!S$296:S$325,'Frais annuel 22'!Q$296:Q$325,\"DEN1\",'Frais annuel 22'!O$296:O$325,\"CAR\")","v":0},{"$f":"SUMIFS('Frais annuel 22'!S$332:S$361,'Frais annuel 22'!Q$332:Q$361,\"DEN1\",'Frais annuel 22'!O$332:O$361,\"CAR\")","v":0},{"$f":"SUMIFS('Frais annuel 22'!S$368:S$397,'Frais annuel 22'!Q$368:Q$397,\"DEN1\",'Frais annuel 22'!O$368:O$397,\"CAR\")","v":0},{"$f":"SUMIFS('Frais annuel 22'!S$404:S$433,'Frais annuel 22'!Q$404:Q$433,\"DEN1\",'Frais annuel 22'!O$404:O$433,\"CAR\")","v":0},0,{"$f":"SUM(Q139:Q141)","v":0}]
[null,null,"ESP  DEN2",null,{"$f":"SUMIFS('Frais annuel 22'!N$8:N$37,'Frais annuel 22'!Q$8:Q$37,\"DEN2\",'Frais annuel 22'!O$8:O$37,\"ESP\")","v":0},{"$f":"SUMIFS('Frais annuel 22'!N$44:N$73,'Frais annuel 22'!Q$44:Q$73,\"DEN2\",'Frais annuel 22'!O$44:O$73,\"ESP\")","v":0},{"$f":"SUMIFS('Frais annuel 22'!N$80:N$109,'Frais annuel 22'!Q$80:Q$109,\"DEN2\",'Frais annuel 22'!O$80:O$109,\"ESP\")","v":0},{"$f":"SUMIFS('Frais annuel 22'!N$116:N$145,'Frais annuel 22'!Q$116:Q$145,\"DEN2\",'Frais annuel 22'!O$116:O$145,\"ESP\")","v":0},{"$f":"SUMIFS('Frais annuel 22'!N$152:N$181,'Frais annuel 22'!Q$152:Q$181,\"DEN2\",'Frais annuel 22'!O$152:O$181,\"ESP\")","v":0},{"$f":"SUMIFS('Frais annuel 22'!N$188:N$217,'Frais annuel 22'!Q$188:Q$217,\"DEN2\",'Frais annuel 22'!O$188:O$217,\"ESP\")","v":0},{"$f":"SUMIFS('Frais annuel 22'!N$224:N$253,'Frais annuel 22'!Q$224:Q$253,\"DEN2\",'Frais annuel 22'!O$224:O$253,\"ESP\")","v":0},{"$f":"SUMIFS('Frais annuel 22'!N$260:N$289,'Frais annuel 22'!Q$260:Q$289,\"DEN2\",'Frais annuel 22'!O$260:O$289,\"ESP\")","v":0},{"$f":"SUMIFS('Frais annuel 22'!N$296:N$325,'Frais annuel 22'!Q$296:Q$325,\"DEN2\",'Frais annuel 22'!O$296:O$325,\"ESP\")","v":0},{"$f":"SUMIFS('Frais annuel 22'!N$332:N$361,'Frais annuel 22'!Q$332:Q$361,\"DEN2\",'Frais annuel 22'!O$332:O$361,\"ESP\")","v":0},{"$f":"SUMIFS('Frais annuel 22'!N$368:N$397,'Frais annuel 22'!Q$368:Q$397,\"DEN2\",'Frais annuel 22'!O$368:O$397,\"ESP\")","v":0},{"$f":"SUMIFS('Frais annuel 22'!N$404:N$433,'Frais annuel 22'!Q$404:Q$433,\"DEN2\",'Frais annuel 22'!O$404:O$433,\"ESP\")","v":0},0,{"$f":"DATA!Q8","v":"PASCALE"}]
[null,null,"CH  DEN2",null,{"$f":"SUMIFS('Frais annuel 22'!N$8:N$37,'Frais annuel 22'!Q$8:Q$37,\"DEN2\",'Frais annuel 22'!O$8:O$37,\"CH\")","v":0},{"$f":"SUMIFS('Frais annuel 22'!N$44:N$73,'Frais annuel 22'!Q$44:Q$73,\"DEN2\",'Frais annuel 22'!O$44:O$73,\"CH\")","v":0},{"$f":"SUMIFS('Frais annuel 22'!N$80:N$109,'Frais annuel 22'!Q$80:Q$109,\"DEN2\",'Frais annuel 22'!O$80:O$109,\"CH\")","v":0},{"$f":"SUMIFS('Frais annuel 22'!N$116:N$145,'Frais annuel 22'!Q$116:Q$145,\"DEN2\",'Frais annuel 22'!O$116:O$145,\"CH\")","v":0},{"$f":"SUMIFS('Frais annuel 22'!N$152:N$181,'Frais annuel 22'!Q$152:Q$181,\"DEN2\",'Frais annuel 22'!O$152:O$181,\"CH\")","v":0},{"$f":"SUMIFS('Frais annuel 22'!N$188:N$217,'Frais annuel 22'!Q$188:Q$217,\"DEN2\",'Frais annuel 22'!O$188:O$217,\"CH\")","v":0},{"$f":"SUMIFS('Frais annuel 22'!N$224:N$253,'Frais annuel 22'!Q$224:Q$253,\"DEN2\",'Frais annuel 22'!O$224:O$253,\"CH\")","v":0},{"$f":"SUMIFS('Frais annuel 22'!N$260:N$289,'Frais annuel 22'!Q$260:Q$289,\"DEN2\",'Frais annuel 22'!O$260:O$289,\"CH\")","v":0},{"$f":"SUMIFS('Frais annuel 22'!N$296:N$325,'Frais annuel 22'!Q$296:Q$325,\"DEN2\",'Frais annuel 22'!O$296:O$325,\"CH\")","v":0},{"$f":"SUMIFS('Frais annuel 22'!N$332:N$361,'Frais annuel 22'!Q$332:Q$361,\"DEN2\",'Frais annuel 22'!O$332:O$361,\"CH\")","v":0},{"$f":"SUMIFS('Frais annuel 22'!N$368:N$397,'Frais annuel 22'!Q$368:Q$397,\"DEN2\",'Frais annuel 22'!O$368:O$397,\"CH\")","v":0},{"$f":"SUMIFS('Frais annuel 22'!N$404:N$433,'Frais annuel 22'!Q$404:Q$433,\"DEN2\",'Frais annuel 22'!O$404:O$433,\"CH\")","v":0},0,"TOTAL"]
[null,null,"  CARTE  DEN2",null,{"$f":"SUMIFS('Frais annuel 22'!S$8:S$37,'Frais annuel 22'!Q$8:Q$37,\"DEN2\",'Frais annuel 22'!O$8:O$37,\"CAR\")","v":0},{"$f":"SUMIFS('Frais annuel 22'!S$44:S$73,'Frais annuel 22'!Q$44:Q$73,\"DEN2\",'Frais annuel 22'!O$44:O$73,\"CAR\")","v":0},{"$f":"SUMIFS('Frais annuel 22'!N$80:N$109,'Frais annuel 22'!Q$80:Q$109,\"DEN2\",'Frais annuel 22'!O$80:O$109,\"CAR\")","v":0},{"$f":"SUMIFS('Frais annuel 22'!N$116:N$145,'Frais annuel 22'!Q$116:Q$145,\"DEN2\",'Frais annuel 22'!O$116:O$145,\"CAR\")","v":0},{"$f":"SUMIFS('Frais annuel 22'!N$152:N$181,'Frais annuel 22'!Q$152:Q$181,\"DEN2\",'Frais annuel 22'!O$152:O$181,\"CAR\")","v":0},{"$f":"SUMIFS('Frais annuel 22'!N$188:N$217,'Frais annuel 22'!Q$188:Q$217,\"DEN2\",'Frais annuel 22'!O$188:O$217,\"CAR\")","v":0},{"$f":"SUMIFS('Frais annuel 22'!N$224:N$253,'Frais annuel 22'!Q$224:Q$253,\"DEN2\",'Frais annuel 22'!O$224:O$253,\"CAR\")","v":0},{"$f":"SUMIFS('Frais annuel 22'!N$260:N$289,'Frais annuel 22'!Q$260:Q$289,\"DEN2\",'Frais annuel 22'!O$260:O$289,\"CAR\")","v":0},{"$f":"SUMIFS('Frais annuel 22'!N$296:N$325,'Frais annuel 22'!Q$296:Q$325,\"DEN2\",'Frais annuel 22'!O$296:O$325,\"CAR\")","v":0},{"$f":"SUMIFS('Frais annuel 22'!N$332:N$361,'Frais annuel 22'!Q$332:Q$361,\"DEN2\",'Frais annuel 22'!O$332:O$361,\"CAR\")","v":0},{"$f":"SUMIFS('Frais annuel 22'!N$368:N$397,'Frais annuel 22'!Q$368:Q$397,\"DEN2\",'Frais annuel 22'!O$368:O$397,\"CAR\")","v":0},{"$f":"SUMIFS('Frais annuel 22'!N$404:N$433,'Frais annuel 22'!Q$404:Q$433,\"DEN2\",'Frais annuel 22'!O$404:O$433,\"CAR\")","v":0},0,{"$f":"SUM(Q142:Q144)","v":0}]
[null,null,"ESP  DO1",null,{"$f":"SUMIFS('Frais annuel 22'!N$8:N$37,'Frais annuel 22'!Q$8:Q$37,\"DO1\",'Frais annuel 22'!O$8:O$37,\"ESP\")","v":0},{"$f":"SUMIFS('Frais annuel 22'!N$44:N$73,'Frais annuel 22'!Q$44:Q$73,\"DO1\",'Frais annuel 22'!O$44:O$73,\"ESP\")","v":0},{"$f":"SUMIFS('Frais annuel 22'!N$80:N$109,'Frais annuel 22'!Q$80:Q$109,\"DO1\",'Frais annuel 22'!O$80:O$109,\"ESP\")","v":0},{"$f":"SUMIFS('Frais annuel 22'!N$116:N$145,'Frais annuel 22'!Q$116:Q$145,\"DO1\",'Frais annuel 22'!O$116:O$145,\"ESP\")","v":0},{"$f":"SUMIFS('Frais annuel 22'!N$152:N$181,'Frais annuel 22'!Q$152:Q$181,\"DO1\",'Frais annuel 22'!O$152:O$181,\"ESP\")","v":0},{"$f":"SUMIFS('Frais annuel 22'!N$188:N$217,'Frais annuel 22'!Q$188:Q$217,\"DO1\",'Frais annuel 22'!O$188:O$217,\"ESP\")","v":0},{"$f":"SUMIFS('Frais annuel 22'!N$224:N$253,'Frais annuel 22'!Q$224:Q$253,\"DO1\",'Frais annuel 22'!O$224:O$253,\"ESP\")","v":0},{"$f":"SUMIFS('Frais annuel 22'!N$260:N$289,'Frais annuel 22'!Q$260:Q$289,\"DO1\",'Frais annuel 22'!O$260:O$289,\"ESP\")","v":0},{"$f":"SUMIFS('Frais annuel 22'!N$296:N$325,'Frais annuel 22'!Q$296:Q$325,\"DO1\",'Frais annuel 22'!O$296:O$325,\"ESP\")","v":0},{"$f":"SUMIFS('Frais annuel 22'!N$332:N$361,'Frais annuel 22'!Q$332:Q$361,\"DO1\",'Frais annuel 22'!O$332:O$361,\"ESP\")","v":0},{"$f":"SUMIFS('Frais annuel 22'!N$368:N$397,'Frais annuel 22'!Q$368:Q$397,\"DO1\",'Frais annuel 22'!O$368:O$397,\"ESP\")","v":0},{"$f":"SUMIFS('Frais annuel 22'!N$404:N$433,'Frais annuel 22'!Q$404:Q$433,\"DO1\",'Frais annuel 22'!O$404:O$433,\"ESP\")","v":0},0,{"$f":"DATA!Q9","v":"BRASSAC"}]
[null,null,"CH  DO1",null,{"$f":"SUMIFS('Frais annuel 22'!N$8:N$37,'Frais annuel 22'!Q$8:Q$37,\"DO1\",'Frais annuel 22'!O$8:O$37,\"CH\")","v":0},{"$f":"SUMIFS('Frais annuel 22'!N$44:N$73,'Frais annuel 22'!Q$44:Q$73,\"DO1\",'Frais annuel 22'!O$44:O$73,\"CH\")","v":0},{"$f":"SUMIFS('Frais annuel 22'!N$80:N$109,'Frais annuel 22'!Q$80:Q$109,\"DO1\",'Frais annuel 22'!O$80:O$109,\"CH\")","v":0},{"$f":"SUMIFS('Frais annuel 22'!N$116:N$145,'Frais annuel 22'!Q$116:Q$145,\"DO1\",'Frais annuel 22'!O$116:O$145,\"CH\")","v":0},{"$f":"SUMIFS('Frais annuel 22'!N$152:N$181,'Frais annuel 22'!Q$152:Q$181,\"DO1\",'Frais annuel 22'!O$152:O$181,\"CH\")","v":0},{"$f":"SUMIFS('Frais annuel 22'!N$188:N$217,'Frais annuel 22'!Q$188:Q$217,\"DO1\",'Frais annuel 22'!O$188:O$217,\"CH\")","v":0},{"$f":"SUMIFS('Frais annuel 22'!N$224:N$253,'Frais annuel 22'!Q$224:Q$253,\"DO1\",'Frais annuel 22'!O$224:O$253,\"CH\")","v":0},{"$f":"SUMIFS('Frais annuel 22'!N$260:N$289,'Frais annuel 22'!Q$260:Q$289,\"DO1\",'Frais annuel 22'!O$260:O$289,\"CH\")","v":0},{"$f":"SUMIFS('Frais annuel 22'!N$296:N$325,'Frais annuel 22'!Q$296:Q$325,\"DO1\",'Frais annuel 22'!O$296:O$325,\"CH\")","v":0},{"$f":"SUMIFS('Frais annuel 22'!N$332:N$361,'Frais annuel 22'!Q$332:Q$361,\"DO1\",'Frais annuel 22'!O$332:O$361,\"CH\")","v":0},{"$f":"SUMIFS('Frais annuel 22'!N$368:N$397,'Frais annuel 22'!Q$368:Q$397,\"DO1\",'Frais annuel 22'!O$368:O$397,\"CH\")","v":0},{"$f":"SUMIFS('Frais annuel 22'!N$404:N$433,'Frais annuel 22'!Q$404:Q$433,\"DO1\",'Frais annuel 22'!O$404:O$433,\"CH\")","v":0},0,"TOTAL"]
[null,null,"  CARTE  DO1",null,{"$f":"SUMIFS('Frais annuel 22'!S$8:S$37,'Frais annuel 22'!Q$8:Q$37,\"DO1\",'Frais annuel 22'!O$8:O$37,\"CAR\")","v":0},{"$f":"SUMIFS('Frais annuel 22'!S$44:S$73,'Frais annuel 22'!Q$44:Q$73,\"DO1\",'Frais annuel 22'!O$44:O$73,\"CAR\")","v":0},{"$f":"SUMIFS('Frais annuel 22'!S$80:S$109,'Frais annuel 22'!Q$80:Q$109,\"DO1\",'Frais annuel 22'!O$80:O$109,\"CAR\")","v":0},{"$f":"SUMIFS('Frais annuel 22'!S$116:S$145,'Frais annuel 22'!Q$116:Q$145,\"DO1\",'Frais annuel 22'!O$116:O$145,\"CAR\")","v":0},{"$f":"SUMIFS('Frais annuel 22'!S$152:S$181,'Frais annuel 22'!Q$152:Q$181,\"DO1\",'Frais annuel 22'!O$152:O$181,\"CAR\")","v":0},{"$f":"SUMIFS('Frais annuel 22'!S$188:S$217,'Frais annuel 22'!Q$188:Q$217,\"DO1\",'Frais annuel 22'!O$188:O$217,\"CAR\")","v":0},{"$f":"SUMIFS('Frais annuel 22'!S$224:S$253,'Frais annuel 22'!Q$224:Q$253,\"DO1\",'Frais annuel 22'!O$224:O$253,\"CAR\")","v":0},{"$f":"SUMIFS('Frais annuel 22'!S$260:S$289,'Frais annuel 22'!Q$260:Q$289,\"DO1\",'Frais annuel 22'!O$260:O$289,\"CAR\")","v":0},{"$f":"SUMIFS('Frais annuel 22'!S$296:S$325,'Frais annuel 22'!Q$296:Q$325,\"DO1\",'Frais annuel 22'!O$296:O$325,\"CAR\")","v":0},{"$f":"SUMIFS('Frais annuel 22'!S$332:S$361,'Frais annuel 22'!Q$332:Q$361,\"DO1\",'Frais annuel 22'!O$332:O$361,\"CAR\")","v":0},{"$f":"SUMIFS('Frais annuel 22'!S$368:S$397,'Frais annuel 22'!Q$368:Q$397,\"DO1\",'Frais annuel 22'!O$368:O$397,\"CAR\")","v":0},{"$f":"SUMIFS('Frais annuel 22'!S$404:S$433,'Frais annuel 22'!Q$404:Q$433,\"DO1\",'Frais annuel 22'!O$404:O$433,\"CAR\")","v":0},0,{"$f":"DATA!Q9","v":"BRASSAC"}]
[null,null,"ESP DO2",null,{"$f":"SUMIFS('Frais annuel 22'!N$8:N$37,'Frais annuel 22'!Q$8:Q$37,\"DO2\",'Frais annuel 22'!O$8:O$37,\"ESP\")","v":0},{"$f":"SUMIFS('Frais annuel 22'!N$44:N$73,'Frais annuel 22'!Q$44:Q$73,\"DO2\",'Frais annuel 22'!O$44:O$73,\"ESP\")","v":0},{"$f":"SUMIFS('Frais annuel 22'!N$80:N$109,'Frais annuel 22'!Q$80:Q$109,\"DO2\",'Frais annuel 22'!O$80:O$109,\"ESP\")","v":0},{"$f":"SUMIFS('Frais annuel 22'!N$116:N$145,'Frais annuel 22'!Q$116:Q$145,\"DO2\",'Frais annuel 22'!O$116:O$145,\"ESP\")","v":0},{"$f":"SUMIFS('Frais annuel 22'!N$152:N$181,'Frais annuel 22'!Q$152:Q$181,\"DO2\",'Frais annuel 22'!O$152:O$181,\"ESP\")","v":0},{"$f":"SUMIFS('Frais annuel 22'!N$188:N$217,'Frais annuel 22'!Q$188:Q$217,\"DO2\",'Frais annuel 22'!O$188:O$217,\"ESP\")","v":0},{"$f":"SUMIFS('Frais annuel 22'!N$224:N$253,'Frais annuel 22'!Q$224:Q$253,\"DO2\",'Frais annuel 22'!O$224:O$253,\"ESP\")","v":0},{"$f":"SUMIFS('Frais annuel 22'!N$260:N$289,'Frais annuel 22'!Q$260:Q$289,\"DO2\",'Frais annuel 22'!O$260:O$289,\"ESP\")","v":0},{"$f":"SUMIFS('Frais annuel 22'!N$296:N$325,'Frais annuel 22'!Q$296:Q$325,\"DO2\",'Frais annuel 22'!O$296:O$325,\"ESP\")","v":0},{"$f":"SUMIFS('Frais annuel 22'!N$332:N$361,'Frais annuel 22'!Q$332:Q$361,\"DO2\",'Frais annuel 22'!O$332:O$361,\"ESP\")","v":0},{"$f":"SUMIFS('Frais annuel 22'!N$368:N$397,'Frais annuel 22'!Q$368:Q$397,\"DO2\",'Frais annuel 22'!O$368:O$397,\"ESP\")","v":0},{"$f":"SUMIFS('Frais annuel 22'!N$404:N$433,'Frais annuel 22'!Q$404:Q$433,\"DO2\",'Frais annuel 22'!O$404:O$433,\"ESP\")","v":0},0,{"$f":"R149","v":"TOTAL"}]
[null,null,"CH DO2",null,{"$f":"SUMIFS('Frais annuel 22'!N$8:N$37,'Frais annuel 22'!Q$8:Q$37,\"DO2\",'Frais annuel 22'!O$8:O$37,\"CH\")","v":0},{"$f":"SUMIFS('Frais annuel 22'!N$44:N$73,'Frais annuel 22'!Q$44:Q$73,\"DO2\",'Frais annuel 22'!O$44:O$73,\"CH\")","v":0},{"$f":"SUMIFS('Frais annuel 22'!N$80:N$109,'Frais annuel 22'!Q$80:Q$109,\"DO2\",'Frais annuel 22'!O$80:O$109,\"CH\")","v":0},{"$f":"SUMIFS('Frais annuel 22'!N$116:N$145,'Frais annuel 22'!Q$116:Q$145,\"DO2\",'Frais annuel 22'!O$116:O$145,\"CH\")","v":0},{"$f":"SUMIFS('Frais annuel 22'!N$152:N$181,'Frais annuel 22'!Q$152:Q$181,\"DO2\",'Frais annuel 22'!O$152:O$181,\"CH\")","v":0},{"$f":"SUMIFS('Frais annuel 22'!N$188:N$217,'Frais annuel 22'!Q$188:Q$217,\"DO2\",'Frais annuel 22'!O$188:O$217,\"CH\")","v":0},{"$f":"SUMIFS('Frais annuel 22'!N$224:N$253,'Frais annuel 22'!Q$224:Q$253,\"DO2\",'Frais annuel 22'!O$224:O$253,\"CH\")","v":0},{"$f":"SUMIFS('Frais annuel 22'!N$224:N$253,'Frais annuel 22'!Q$224:Q$253,\"DO2\",'Frais annuel 22'!O$224:O$253,\"CH\")","v":0},{"$f":"SUMIFS('Frais annuel 22'!N$296:N$325,'Frais annuel 22'!Q$296:Q$325,\"DO2\",'Frais annuel 22'!O$296:O$325,\"CH\")","v":0},{"$f":"SUMIFS('Frais annuel 22'!N$332:N$361,'Frais annuel 22'!Q$332:Q$361,\"DO2\",'Frais annuel 22'!O$332:O$361,\"CH\")","v":0},{"$f":"SUMIFS('Frais annuel 22'!N$368:N$397,'Frais annuel 22'!Q$368:Q$397,\"DO2\",'Frais annuel 22'!O$368:O$397,\"CH\")","v":0},{"$f":"SUMIFS('Frais annuel 22'!N$404:N$433,'Frais annuel 22'!Q$404:Q$433,\"DO2\",'Frais annuel 22'!O$404:O$433,\"CH\")","v":0},0,"TOTAL"]
[null,null,"  CARTE  DO2",null,{"$f":"SUMIFS('Frais annuel 22'!S$8:S$37,'Frais annuel 22'!Q$8:Q$37,\"DO2\",'Frais annuel 22'!O$8:O$37,\"CAR\")","v":0},{"$f":"SUMIFS('Frais annuel 22'!S$44:S$73,'Frais annuel 22'!Q$44:Q$73,\"DO2\",'Frais annuel 22'!O$44:O$73,\"CAR\")","v":0},{"$f":"SUMIFS('Frais annuel 22'!S$80:S$109,'Frais annuel 22'!Q$80:Q$109,\"DO2\",'Frais annuel 22'!O$80:O$109,\"CAR\")","v":0},{"$f":"SUMIFS('Frais annuel 22'!S$116:S$145,'Frais annuel 22'!Q$116:Q$145,\"DO2\",'Frais annuel 22'!O$116:O$145,\"CAR\")","v":0},{"$f":"SUMIFS('Frais annuel 22'!S$152:S$181,'Frais annuel 22'!Q$152:Q$181,\"DO2\",'Frais annuel 22'!O$152:O$181,\"CAR\")","v":0},{"$f":"SUMIFS('Frais annuel 22'!S$188:S$217,'Frais annuel 22'!Q$188:Q$217,\"DO2\",'Frais annuel 22'!O$188:O$217,\"CAR\")","v":0},{"$f":"SUMIFS('Frais annuel 22'!S$224:S$253,'Frais annuel 22'!Q$224:Q$253,\"DO2\",'Frais annuel 22'!O$224:O$253,\"CAR\")","v":0},{"$f":"SUMIFS('Frais annuel 22'!S$260:S$289,'Frais annuel 22'!Q$260:Q$289,\"DO2\",'Frais annuel 22'!O$260:O$289,\"CAR\")","v":0},{"$f":"SUMIFS('Frais annuel 22'!S$296:S$325,'Frais annuel 22'!Q$296:Q$325,\"DO2\",'Frais annuel 22'!O$296:O$325,\"CAR\")","v":0},{"$f":"SUMIFS('Frais annuel 22'!S$332:S$361,'Frais annuel 22'!Q$332:Q$361,\"DO2\",'Frais annuel 22'!O$332:O$361,\"CAR\")","v":0},{"$f":"SUMIFS('Frais annuel 22'!S$368:S$397,'Frais annuel 22'!Q$368:Q$397,\"DO2\",'Frais annuel 22'!O$368:O$397,\"CAR\")","v":0},{"$f":"SUMIFS('Frais annuel 22'!S$404:S$433,'Frais annuel 22'!Q$404:Q$433,\"DO2\",'Frais annuel 22'!O$404:O$433,\"CAR\")","v":0},0,{"$f":"SUM(Q148:Q150)","v":0}]
[null,null,"ESP  PH1",null,{"$f":"SUMIFS('Frais annuel 22'!N$8:N$37,'Frais annuel 22'!Q$8:Q$37,\"PH1\",'Frais annuel 22'!O$8:O$37,\"ESP\")","v":0},{"$f":"SUMIFS('Frais annuel 22'!N$44:N$73,'Frais annuel 22'!Q$44:Q$73,\"PH1\",'Frais annuel 22'!O$44:O$73,\"ESP\")","v":0},{"$f":"SUMIFS('Frais annuel 22'!N$80:N$109,'Frais annuel 22'!Q$80:Q$109,\"PH1\",'Frais annuel 22'!O$80:O$109,\"ESP\")","v":0},{"$f":"SUMIFS('Frais annuel 22'!N$116:N$145,'Frais annuel 22'!Q$116:Q$145,\"PH1\",'Frais annuel 22'!O$116:O$145,\"ESP\")","v":0},{"$f":"SUMIFS('Frais annuel 22'!N$152:N$181,'Frais annuel 22'!Q$152:Q$181,\"PH1\",'Frais annuel 22'!O$152:O$181,\"ESP\")","v":0},{"$f":"SUMIFS('Frais annuel 22'!N$188:N$217,'Frais annuel 22'!Q$188:Q$217,\"PH1\",'Frais annuel 22'!O$188:O$217,\"ESP\")","v":0},{"$f":"SUMIFS('Frais annuel 22'!N$224:N$253,'Frais annuel 22'!Q$224:Q$253,\"PH1\",'Frais annuel 22'!O$224:O$253,\"ESP\")","v":0},{"$f":"SUMIFS('Frais annuel 22'!N$260:N$289,'Frais annuel 22'!Q$260:Q$289,\"PH1\",'Frais annuel 22'!O$260:O$289,\"ESP\")","v":0},{"$f":"SUMIFS('Frais annuel 22'!N$296:N$325,'Frais annuel 22'!Q$296:Q$325,\"PH1\",'Frais annuel 22'!O$296:O$325,\"ESP\")","v":0},{"$f":"SUMIFS('Frais annuel 22'!N$332:N$361,'Frais annuel 22'!Q$332:Q$361,\"PH1\",'Frais annuel 22'!O$332:O$361,\"ESP\")","v":0},{"$f":"SUMIFS('Frais annuel 22'!N$368:N$397,'Frais annuel 22'!Q$368:Q$397,\"PH1\",'Frais annuel 22'!O$368:O$397,\"ESP\")","v":0},{"$f":"SUMIFS('Frais annuel 22'!N$404:N$433,'Frais annuel 22'!Q$404:Q$433,\"PH1\",'Frais annuel 22'!O$404:O$433,\"ESP\")","v":0},0,{"$f":"DATA!Q11","v":"PHARMACIE du Martinet"}]
[null,null,"CH  PH1",null,{"$f":"SUMIFS('Frais annuel 22'!N$8:N$37,'Frais annuel 22'!Q$8:Q$37,\"PH1\",'Frais annuel 22'!O$8:O$37,\"CH\")","v":0},{"$f":"SUMIFS('Frais annuel 22'!N$44:N$73,'Frais annuel 22'!Q$44:Q$73,\"PH1\",'Frais annuel 22'!O$44:O$73,\"CH\")","v":0},{"$f":"SUMIFS('Frais annuel 22'!N$80:N$109,'Frais annuel 22'!Q$80:Q$109,\"PH1\",'Frais annuel 22'!O$80:O$109,\"CH\")","v":0},{"$f":"SUMIFS('Frais annuel 22'!N$116:N$145,'Frais annuel 22'!Q$116:Q$145,\"PH1\",'Frais annuel 22'!O$116:O$145,\"CH\")","v":0},{"$f":"SUMIFS('Frais annuel 22'!N$152:N$181,'Frais annuel 22'!Q$152:Q$181,\"PH1\",'Frais annuel 22'!O$152:O$181,\"CH\")","v":0},{"$f":"SUMIFS('Frais annuel 22'!N$188:N$217,'Frais annuel 22'!Q$188:Q$217,\"PH1\",'Frais annuel 22'!O$188:O$217,\"CH\")","v":0},{"$f":"SUMIFS('Frais annuel 22'!N$224:N$253,'Frais annuel 22'!Q$224:Q$253,\"PH1\",'Frais annuel 22'!O$224:O$253,\"CH\")","v":0},{"$f":"SUMIFS('Frais annuel 22'!N$260:N$289,'Frais annuel 22'!Q$260:Q$289,\"PH1\",'Frais annuel 22'!O$260:O$289,\"CH\")","v":0},{"$f":"SUMIFS('Frais annuel 22'!N$296:N$325,'Frais annuel 22'!Q$296:Q$325,\"PH1\",'Frais annuel 22'!O$296:O$325,\"CH\")","v":0},{"$f":"SUMIFS('Frais annuel 22'!N$332:N$361,'Frais annuel 22'!Q$332:Q$361,\"PH1\",'Frais annuel 22'!O$332:O$361,\"CH\")","v":0},{"$f":"SUMIFS('Frais annuel 22'!N$368:N$397,'Frais annuel 22'!Q$368:Q$397,\"PH1\",'Frais annuel 22'!O$368:O$397,\"CH\")","v":0},{"$f":"SUMIFS('Frais annuel 22'!N$404:N$433,'Frais annuel 22'!Q$404:Q$433,\"PH1\",'Frais annuel 22'!O$404:O$433,\"CH\")","v":0},0,"TOTAL"]
[null,null,"  CARTE  PH1",null,{"$f":"SUMIFS('Frais annuel 22'!S$8:S$37,'Frais annuel 22'!Q$8:Q$37,\"PH1\",'Frais annuel 22'!O$8:O$37,\"CAR\")","v":0},{"$f":"SUMIFS('Frais annuel 22'!S$44:S$73,'Frais annuel 22'!Q$44:Q$73,\"PH1\",'Frais annuel 22'!O$44:O$73,\"CAR\")","v":0},{"$f":"SUMIFS('Frais annuel 22'!S$80:S$109,'Frais annuel 22'!Q$80:Q$109,\"PH1\",'Frais annuel 22'!O$80:O$109,\"CAR\")","v":0},{"$f":"SUMIFS('Frais annuel 22'!S$116:S$145,'Frais annuel 22'!Q$116:Q$145,\"PH1\",'Frais annuel 22'!O$116:O$145,\"CAR\")","v":0},{"$f":"SUMIFS('Frais annuel 22'!S$152:S$181,'Frais annuel 22'!Q$152:Q$181,\"PH1\",'Frais annuel 22'!O$152:O$181,\"CAR\")","v":0},{"$f":"SUMIFS('Frais annuel 22'!S$188:S$217,'Frais annuel 22'!Q$188:Q$217,\"PH1\",'Frais annuel 22'!O$188:O$217,\"CAR\")","v":0},{"$f":"SUMIFS('Frais annuel 22'!S$224:S$253,'Frais annuel 22'!Q$224:Q$253,\"PH1\",'Frais annuel 22'!O$224:O$253,\"CAR\")","v":0},{"$f":"SUMIFS('Frais annuel 22'!S$260:S$289,'Frais annuel 22'!Q$260:Q$289,\"PH1\",'Frais annuel 22'!O$260:O$289,\"CAR\")","v":0},{"$f":"SUMIFS('Frais annuel 22'!S$296:S$325,'Frais annuel 22'!Q$296:Q$325,\"PH1\",'Frais annuel 22'!O$296:O$325,\"CAR\")","v":0},{"$f":"SUMIFS('Frais annuel 22'!S$332:S$361,'Frais annuel 22'!Q$332:Q$361,\"PH1\",'Frais annuel 22'!O$332:O$361,\"CAR\")","v":0},{"$f":"SUMIFS('Frais annuel 22'!S$368:S$397,'Frais annuel 22'!Q$368:Q$397,\"PH1\",'Frais annuel 22'!O$368:O$397,\"CAR\")","v":0},{"$f":"SUMIFS('Frais annuel 22'!S$404:S$433,'Frais annuel 22'!Q$404:Q$433,\"PH1\",'Frais annuel 22'!O$404:O$433,\"CAR\")","v":0},0,{"$f":"SUM(Q151:Q153)","v":0}]
[null,null,"ESP  PH2",null,{"$f":"SUMIFS('Frais annuel 22'!N$8:N$37,'Frais annuel 22'!Q$8:Q$37,\"PH2\",'Frais annuel 22'!O$8:O$37,\"ESP\")","v":0},{"$f":"SUMIFS('Frais annuel 22'!N$44:N$73,'Frais annuel 22'!Q$44:Q$73,\"PH2\",'Frais annuel 22'!O$44:O$73,\"ESP\")","v":0},{"$f":"SUMIFS('Frais annuel 22'!N$80:N$109,'Frais annuel 22'!Q$80:Q$109,\"PH2\",'Frais annuel 22'!O$80:O$109,\"ESP\")","v":0},{"$f":"SUMIFS('Frais annuel 22'!N$116:N$145,'Frais annuel 22'!Q$116:Q$145,\"PH2\",'Frais annuel 22'!O$116:O$145,\"ESP\")","v":0},{"$f":"SUMIFS('Frais annuel 22'!N$152:N$181,'Frais annuel 22'!Q$152:Q$181,\"PH2\",'Frais annuel 22'!O$152:O$181,\"ESP\")","v":0},{"$f":"SUMIFS('Frais annuel 22'!N$188:N$217,'Frais annuel 22'!Q$188:Q$217,\"PH2\",'Frais annuel 22'!O$188:O$217,\"ESP\")","v":0},{"$f":"SUMIFS('Frais annuel 22'!N$224:N$253,'Frais annuel 22'!Q$224:Q$253,\"PH2\",'Frais annuel 22'!O$224:O$253,\"ESP\")","v":0},{"$f":"SUMIFS('Frais annuel 22'!N$260:N$289,'Frais annuel 22'!Q$260:Q$289,\"PH2\",'Frais annuel 22'!O$260:O$289,\"ESP\")","v":0},{"$f":"SUMIFS('Frais annuel 22'!N$296:N$325,'Frais annuel 22'!Q$296:Q$325,\"PH2\",'Frais annuel 22'!O$296:O$325,\"ESP\")","v":0},{"$f":"SUMIFS('Frais annuel 22'!N$332:N$361,'Frais annuel 22'!Q$332:Q$361,\"PH2\",'Frais annuel 22'!O$332:O$361,\"ESP\")","v":0},{"$f":"SUMIFS('Frais annuel 22'!N$368:N$397,'Frais annuel 22'!Q$368:Q$397,\"PH2\",'Frais annuel 22'!O$368:O$397,\"ESP\")","v":0},{"$f":"SUMIFS('Frais annuel 22'!N$404:N$433,'Frais annuel 22'!Q$404:Q$433,\"PH2\",'Frais annuel 22'!O$404:O$433,\"ESP\")","v":0},0,{"$f":"DATA!Q12","v":"PHARMACIE BRASSAC"}]
[null,null,"CH  PH2",null,{"$f":"SUMIFS('Frais annuel 22'!N$8:N$37,'Frais annuel 22'!Q$8:Q$37,\"PH2\",'Frais annuel 22'!O$8:O$37,\"CH\")","v":0},{"$f":"SUMIFS('Frais annuel 22'!N$44:N$73,'Frais annuel 22'!Q$44:Q$73,\"PH2\",'Frais annuel 22'!O$44:O$73,\"CH\")","v":0},{"$f":"SUMIFS('Frais annuel 22'!N$80:N$109,'Frais annuel 22'!Q$80:Q$109,\"PH2\",'Frais annuel 22'!O$80:O$109,\"CH\")","v":0},{"$f":"SUMIFS('Frais annuel 22'!N$116:N$145,'Frais annuel 22'!Q$116:Q$145,\"PH2\",'Frais annuel 22'!O$116:O$145,\"CH\")","v":0},{"$f":"SUMIFS('Frais annuel 22'!N$152:N$181,'Frais annuel 22'!Q$152:Q$181,\"PH2\",'Frais annuel 22'!O$152:O$181,\"CH\")","v":0},{"$f":"SUMIFS('Frais annuel 22'!N$188:N$217,'Frais annuel 22'!Q$188:Q$217,\"PH2\",'Frais annuel 22'!O$188:O$217,\"CH\")","v":0},{"$f":"SUMIFS('Frais annuel 22'!N$224:N$253,'Frais annuel 22'!Q$224:Q$253,\"PH2\",'Frais annuel 22'!O$224:O$253,\"CH\")","v":0},{"$f":"SUMIFS('Frais annuel 22'!N$260:N$289,'Frais annuel 22'!Q$260:Q$289,\"PH2\",'Frais annuel 22'!O$260:O$289,\"CH\")","v":0},{"$f":"SUMIFS('Frais annuel 22'!N$296:N$325,'Frais annuel 22'!Q$296:Q$325,\"PH2\",'Frais annuel 22'!O$296:O$325,\"CH\")","v":0},{"$f":"SUMIFS('Frais annuel 22'!N$296:N$325,'Frais annuel 22'!Q$296:Q$325,\"PH2\",'Frais annuel 22'!O$296:O$325,\"CH\")","v":0},{"$f":"SUMIFS('Frais annuel 22'!N$368:N$397,'Frais annuel 22'!Q$368:Q$397,\"PH2\",'Frais annuel 22'!O$368:O$397,\"CH\")","v":0},{"$f":"SUMIFS('Frais annuel 22'!N$404:N$433,'Frais annuel 22'!Q$404:Q$433,\"PH2\",'Frais annuel 22'!O$404:O$433,\"CH\")","v":0},0,"TOTAL"]
[null,null,"  CARTE  PH2",null,{"$f":"SUMIFS('Frais annuel 22'!S$8:S$37,'Frais annuel 22'!Q$8:Q$37,\"PH2\",'Frais annuel 22'!O$8:O$37,\"CAR\")","v":0},{"$f":"SUMIFS('Frais annuel 22'!S$44:S$73,'Frais annuel 22'!Q$44:Q$73,\"PH2\",'Frais annuel 22'!O$44:O$73,\"CAR\")","v":0},{"$f":"SUMIFS('Frais annuel 22'!S$80:S$109,'Frais annuel 22'!Q$80:Q$109,\"PH2\",'Frais annuel 22'!O$80:O$109,\"CAR\")","v":0},{"$f":"SUMIFS('Frais annuel 22'!S$116:S$145,'Frais annuel 22'!Q$116:Q$145,\"PH2\",'Frais annuel 22'!O$116:O$145,\"CAR\")","v":0},{"$f":"SUMIFS('Frais annuel 22'!S$152:S$181,'Frais annuel 22'!Q$152:Q$181,\"PH2\",'Frais annuel 22'!O$152:O$181,\"CAR\")","v":0},{"$f":"SUMIFS('Frais annuel 22'!S$188:S$217,'Frais annuel 22'!Q$188:Q$217,\"PH2\",'Frais annuel 22'!O$188:O$217,\"CAR\")","v":0},{"$f":"SUMIFS('Frais annuel 22'!S$224:S$253,'Frais annuel 22'!Q$224:Q$253,\"PH2\",'Frais annuel 22'!O$224:O$253,\"CAR\")","v":0},{"$f":"SUMIFS('Frais annuel 22'!S$260:S$289,'Frais annuel 22'!Q$260:Q$289,\"PH2\",'Frais annuel 22'!O$260:O$289,\"CAR\")","v":0},{"$f":"SUMIFS('Frais annuel 22'!S$296:S$325,'Frais annuel 22'!Q$296:Q$325,\"PH2\",'Frais annuel 22'!O$296:O$325,\"CAR\")","v":0},{"$f":"SUMIFS('Frais annuel 22'!S$332:S$361,'Frais annuel 22'!Q$332:Q$361,\"PH2\",'Frais annuel 22'!O$332:O$361,\"CAR\")","v":0},{"$f":"SUMIFS('Frais annuel 22'!S$368:S$397,'Frais annuel 22'!Q$368:Q$397,\"PH2\",'Frais annuel 22'!O$368:O$397,\"CAR\")","v":0},{"$f":"SUMIFS('Frais annuel 22'!S$404:S$433,'Frais annuel 22'!Q$404:Q$433,\"PH2\",'Frais annuel 22'!O$404:O$433,\"CAR\")","v":0},0,{"$f":"SUM(Q154:Q156)","v":0}]
[null,null,"ESP PH3",null,{"$f":"SUMIFS('Frais annuel 22'!N$8:N$37,'Frais annuel 22'!Q$8:Q$37,\"PH3\",'Frais annuel 22'!O$8:O$37,\"ESP\")","v":0},{"$f":"SUMIFS('Frais annuel 22'!N$44:N$73,'Frais annuel 22'!Q$44:Q$73,\"PH3\",'Frais annuel 22'!O$44:O$73,\"ESP\")","v":0},{"$f":"SUMIFS('Frais annuel 22'!N$80:N$109,'Frais annuel 22'!Q$80:Q$109,\"PH3\",'Frais annuel 22'!O$80:O$109,\"ESP\")","v":0},{"$f":"SUMIFS('Frais annuel 22'!N$116:N$145,'Frais annuel 22'!Q$116:Q$145,\"PH3\",'Frais annuel 22'!O$116:O$145,\"ESP\")","v":0},{"$f":"SUMIFS('Frais annuel 22'!N$152:N$181,'Frais annuel 22'!Q$152:Q$181,\"PH3\",'Frais annuel 22'!O$152:O$181,\"ESP\")","v":0},{"$f":"SUMIFS('Frais annuel 22'!N$188:N$217,'Frais annuel 22'!Q$188:Q$217,\"PH3\",'Frais annuel 22'!O$188:O$217,\"ESP\")","v":0},{"$f":"SUMIFS('Frais annuel 22'!N$224:N$253,'Frais annuel 22'!Q$224:Q$253,\"PH3\",'Frais annuel 22'!O$224:O$253,\"ESP\")","v":0},{"$f":"SUMIFS('Frais annuel 22'!N$260:N$289,'Frais annuel 22'!Q$260:Q$289,\"PH3\",'Frais annuel 22'!O$260:O$289,\"ESP\")","v":0},{"$f":"SUMIFS('Frais annuel 22'!N$296:N$325,'Frais annuel 22'!Q$296:Q$325,\"PH3\",'Frais annuel 22'!O$296:O$325,\"ESP\")","v":0},{"$f":"SUMIFS('Frais annuel 22'!N$332:N$361,'Frais annuel 22'!Q$332:Q$361,\"PH3\",'Frais annuel 22'!O$332:O$361,\"ESP\")","v":0},{"$f":"SUMIFS('Frais annuel 22'!N$368:N$397,'Frais annuel 22'!Q$368:Q$397,\"PH3\",'Frais annuel 22'!O$368:O$397,\"ESP\")","v":0},{"$f":"SUMIFS('Frais annuel 22'!N$404:N$433,'Frais annuel 22'!Q$404:Q$433,\"PH3\",'Frais annuel 22'!O$404:O$433,\"ESP\")","v":0},0,{"$f":"DATA!Q13","v":"PHARMACIE AUTRE"}]
[null,null,"CH PH3",null,{"$f":"SUMIFS('Frais annuel 22'!N$8:N$37,'Frais annuel 22'!Q$8:Q$37,\"PH3\",'Frais annuel 22'!O$8:O$37,\"CH\")","v":0},{"$f":"SUMIFS('Frais annuel 22'!N$44:N$73,'Frais annuel 22'!Q$44:Q$73,\"PH3\",'Frais annuel 22'!O$44:O$73,\"CH\")","v":0},{"$f":"SUMIFS('Frais annuel 22'!N$80:N$109,'Frais annuel 22'!Q$80:Q$109,\"PH3\",'Frais annuel 22'!O$80:O$109,\"CH\")","v":0},{"$f":"SUMIFS('Frais annuel 22'!N$116:N$145,'Frais annuel 22'!Q$116:Q$145,\"PH3\",'Frais annuel 22'!O$116:O$145,\"CH\")","v":0},{"$f":"SUMIFS('Frais annuel 22'!N$152:N$181,'Frais annuel 22'!Q$152:Q$181,\"PH3\",'Frais annuel 22'!O$152:O$181,\"CH\")","v":0},{"$f":"SUMIFS('Frais annuel 22'!N$188:N$217,'Frais annuel 22'!Q$188:Q$217,\"PH3\",'Frais annuel 22'!O$188:O$217,\"CH\")","v":0},{"$f":"SUMIFS('Frais annuel 22'!N$224:N$253,'Frais annuel 22'!Q$224:Q$253,\"PH3\",'Frais annuel 22'!O$224:O$253,\"CH\")","v":0},{"$f":"SUMIFS('Frais annuel 22'!N$260:N$289,'Frais annuel 22'!Q$260:Q$289,\"PH3\",'Frais annuel 22'!O$260:O$289,\"CH\")","v":0},{"$f":"SUMIFS('Frais annuel 22'!N$296:N$325,'Frais annuel 22'!Q$296:Q$325,\"PH3\",'Frais annuel 22'!O$296:O$325,\"CH\")","v":0},{"$f":"SUMIFS('Frais annuel 22'!N$332:N$361,'Frais annuel 22'!Q$332:Q$361,\"PH3\",'Frais annuel 22'!O$332:O$361,\"CH\")","v":0},{"$f":"SUMIFS('Frais annuel 22'!N$368:N$397,'Frais annuel 22'!Q$368:Q$397,\"PH3\",'Frais annuel 22'!O$368:O$397,\"CH\")","v":0},{"$f":"SUMIFS('Frais annuel 22'!N$404:N$433,'Frais annuel 22'!Q$404:Q$433,\"PH3\",'Frais annuel 22'!O$404:O$433,\"CH\")","v":0},0,"TOTAL"]
[null,null,"  CARTE  PH3",null,{"$f":"SUMIFS('Frais annuel 22'!S$8:S$37,'Frais annuel 22'!Q$8:Q$37,\"PH3\",'Frais annuel 22'!O$8:O$37,\"CAR\")","v":0},{"$f":"SUMIFS('Frais annuel 22'!S$44:S$73,'Frais annuel 22'!Q$44:Q$73,\"PH3\",'Frais annuel 22'!O$44:O$73,\"CAR\")","v":0},{"$f":"SUMIFS('Frais annuel 22'!S$80:S$109,'Frais annuel 22'!Q$80:Q$109,\"PH3\",'Frais annuel 22'!O$80:O$109,\"CAR\")","v":0},{"$f":"SUMIFS('Frais annuel 22'!S$116:S$145,'Frais annuel 22'!Q$116:Q$145,\"PH3\",'Frais annuel 22'!O$116:O$145,\"CAR\")","v":0},{"$f":"SUMIFS('Frais annuel 22'!S$152:S$181,'Frais annuel 22'!Q$152:Q$181,\"PH3\",'Frais annuel 22'!O$152:O$181,\"CAR\")","v":0},{"$f":"SUMIFS('Frais annuel 22'!S$188:S$217,'Frais annuel 22'!Q$188:Q$217,\"PH3\",'Frais annuel 22'!O$188:O$217,\"CAR\")","v":0},{"$f":"SUMIFS('Frais annuel 22'!S$224:S$253,'Frais annuel 22'!Q$224:Q$253,\"PH3\",'Frais annuel 22'!O$224:O$253,\"CAR\")","v":0},{"$f":"SUMIFS('Frais annuel 22'!S$260:S$289,'Frais annuel 22'!Q$260:Q$289,\"PH3\",'Frais annuel 22'!O$260:O$289,\"CAR\")","v":0},{"$f":"SUMIFS('Frais annuel 22'!S$296:S$325,'Frais annuel 22'!Q$296:Q$325,\"PH3\",'Frais annuel 22'!O$296:O$325,\"CAR\")","v":0},{"$f":"SUMIFS('Frais annuel 22'!S$332:S$361,'Frais annuel 22'!Q$332:Q$361,\"PH3\",'Frais annuel 22'!O$332:O$361,\"CAR\")","v":0},{"$f":"SUMIFS('Frais annuel 22'!S$368:S$397,'Frais annuel 22'!Q$368:Q$397,\"PH3\",'Frais annuel 22'!O$368:O$397,\"CAR\")","v":0},{"$f":"SUMIFS('Frais annuel 22'!S$404:S$433,'Frais annuel 22'!Q$404:Q$433,\"PH3\",'Frais annuel 22'!O$404:O$433,\"CAR\")","v":0},0,{"$f":"SUM(Q157:Q159)","v":0}]
[null,null,null,"Sous Total :",{"$f":"SUM(E139:E159)","v":0},0,0,0,0,0,0,0,0,0,0,0,{"$f":"SUM(Q141:Q159)","v":0}]
[null,null,null,"D  I  V ",{"$f":"SUMIFS('Frais annuel 22'!S8:S37,'Frais annuel 22'!P8:P37,\"DIV\")","v":0},{"$f":"SUMIFS('Frais annuel 22'!S44:S73,'Frais annuel 22'!P44:P73,\"DIV\")","v":0},{"$f":"SUMIFS('Frais annuel 22'!S80:S109,'Frais annuel 22'!P80:P109,\"DIV\")","v":0},{"$f":"SUMIFS('Frais annuel 22'!S116:S145,'Frais annuel 22'!P116:P145,\"DIV\")","v":0},{"$f":"SUMIFS('Frais annuel 22'!S152:S181,'Frais annuel 22'!P152:P181,\"DIV\")","v":0},{"$f":"SUMIFS('Frais annuel 22'!S188:S217,'Frais annuel 22'!P188:P217,\"DIV\")","v":0},{"$f":"SUMIFS('Frais annuel 22'!S224:S253,'Frais annuel 22'!P224:P253,\"DIV\")","v":0},{"$f":"SUMIFS('Frais annuel 22'!S260:S289,'Frais annuel 22'!P260:P289,\"DIV\")","v":0},{"$f":"SUMIFS('Frais annuel 22'!S296:S325,'Frais annuel 22'!P296:P325,\"DIV\")","v":0},{"$f":"SUMIFS('Frais annuel 22'!S332:S361,'Frais annuel 22'!P332:P361,\"DIV\")","v":0},{"$f":"SUMIFS('Frais annuel 22'!S368:S397,'Frais annuel 22'!P368:P397,\"DIV\")","v":0},{"$f":"SUMIFS('Frais annuel 22'!S404:S433,'Frais annuel 22'!P404:P433,\"DIV\")","v":0},{"$f":"SUM(E161:P161)","v":0},"Loisirs"]
[null,null,"MAF",null,{"$f":"SUMIFS('Frais annuel 22'!S8:S37,'Frais annuel 22'!Q8:Q37,\"MAF\")","v":0},{"$f":"SUMIFS('Frais annuel 22'!S44:S73,'Frais annuel 22'!Q44:Q73,\"MAF\")","v":0},{"$f":"SUMIFS('Frais annuel 22'!S80:S109,'Frais annuel 22'!Q80:Q109,\"MAF\")","v":0},{"$f":"SUMIFS('Frais annuel 22'!S116:S145,'Frais annuel 22'!Q116:Q145,\"MAF\")","v":0},{"$f":"SUMIFS('Frais annuel 22'!S$152:S$181,'Frais annuel 22'!Q$152:Q$181,\"MAF\")","v":0},{"$f":"SUMIFS('Frais annuel 22'!S$188:S$217,'Frais annuel 22'!Q$188:Q$217,\"MAF\")","v":0},{"$f":"SUMIFS('Frais annuel 22'!S$224:S$253,'Frais annuel 22'!Q$224:Q$253,\"MAF\")","v":0},{"$f":"SUMIFS('Frais annuel 22'!S$260:S$289,'Frais annuel 22'!Q$260:Q$289,\"MAF\")","v":0},{"$f":"SUMIFS('Frais annuel 22'!S$296:S$325,'Frais annuel 22'!Q$296:Q$325,\"MAF\")","v":0},{"$f":"SUMIFS('Frais annuel 22'!S$332:S$361,'Frais annuel 22'!P$332:P$361,\"MAF\")","v":0},{"$f":"SUMIFS('Frais annuel 22'!S$368:S$397,'Frais annuel 22'!Q$368:Q$397,\"MAF\")","v":0},{"$f":"SUMIFS('Frais annuel 22'!S$404:S$433,'Frais annuel 22'!Q$404:Q$433,\"MAF\")","v":0},{"$f":"SUM(E162:P162)","v":0},{"$f":"DATA!I11","v":"MAAF"}]
[null,null,"Virements   AVI",null,{"$f":"SUMIFS('Frais annuel 22'!S8:S37,'Frais annuel 22'!Q8:Q37,\"AVI\")","v":0},{"$f":"SUMIFS('Frais annuel 22'!S44:S73,'Frais annuel 22'!Q44:Q73,\"AVI\")","v":0},{"$f":"SUMIFS('Frais annuel 22'!S80:S109,'Frais annuel 22'!Q80:Q109,\"AVI\")","v":0},{"$f":"SUMIFS('Frais annuel 22'!S116:S145,'Frais annuel 22'!Q116:Q145,\"AVI\")","v":0},{"$f":"SUMIFS('Frais annuel 22'!S$152:S$181,'Frais annuel 22'!Q$152:Q$181,\"AVI\")","v":0},{"$f":"SUMIFS('Frais annuel 22'!S188:S217,'Frais annuel 22'!Q188:Q217,\"AVI\")","v":0},{"$f":"SUMIFS('Frais annuel 22'!S224:S253,'Frais annuel 22'!Q224:Q253,\"AVI\")","v":0},{"$f":"SUMIFS('Frais annuel 22'!S260:S289,'Frais annuel 22'!Q260:Q289,\"AVI\")","v":0},{"$f":"SUMIFS('Frais annuel 22'!S296:S325,'Frais annuel 22'!Q296:Q325,\"AVI\")","v":0},{"$f":"SUMIFS('Frais annuel 22'!S332:S361,'Frais annuel 22'!P332:P361,\"AVI\")","v":0},{"$f":"SUMIFS('Frais annuel 22'!S368:S397,'Frais annuel 22'!Q368:Q397,\"AVI\")","v":0},{"$f":"SUMIFS('Frais annuel 22'!S404:S433,'Frais annuel 22'!Q404:Q433,\"AVI\")","v":0},0,{"$f":"DATA!I7","v":"Autre "}]
[null,null,"  ESP CARO",null,{"$f":"SUMIFS('Frais annuel 22'!S$8:S$37,'Frais annuel 22'!Q$8:Q$37,\"CARO\",'Frais annuel 22'!O$8:O$37,\"ESP\")","v":0},{"$f":"SUMIFS('Frais annuel 22'!S$44:S$73,'Frais annuel 22'!Q$44:Q$73,\"CARO\",'Frais annuel 22'!O$44:O$73,\"ESP\")","v":0},{"$f":"SUMIFS('Frais annuel 22'!S$80:S$109,'Frais annuel 22'!Q$80:Q$109,\"CARO\",'Frais annuel 22'!O$80:O$109,\"ESP\")","v":0},{"$f":"SUMIFS('Frais annuel 22'!S$116:S$145,'Frais annuel 22'!Q$116:Q$145,\"CARO\",'Frais annuel 22'!O$116:O$145,\"ESP\")","v":0},{"$f":"SUMIFS('Frais annuel 22'!S$152:S$181,'Frais annuel 22'!Q$152:Q$181,\"CARO\",'Frais annuel 22'!O$152:O$181,\"ESP\")","v":0},{"$f":"SUMIFS('Frais annuel 22'!S$188:S$217,'Frais annuel 22'!Q$188:Q$217,\"CARO\",'Frais annuel 22'!O$188:O$217,\"ESP\")","v":0},{"$f":"SUMIFS('Frais annuel 22'!S$224:S$253,'Frais annuel 22'!Q$224:Q$253,\"CARO\",'Frais annuel 22'!O$224:O$253,\"ESP\")","v":0},{"$f":"SUMIFS('Frais annuel 22'!S$260:S$289,'Frais annuel 22'!Q$260:Q$289,\"CARO\",'Frais annuel 22'!O$260:O$289,\"ESP\")","v":0},{"$f":"SUMIFS('Frais annuel 22'!S$296:S$325,'Frais annuel 22'!Q$296:Q$325,\"CARO\",'Frais annuel 22'!O$296:O$325,\"ESP\")","v":0},{"$f":"SUMIFS('Frais annuel 22'!S$332:S$361,'Frais annuel 22'!Q$332:Q$361,\"CARO\",'Frais annuel 22'!O$332:O$361,\"ESP\")","v":0},{"$f":"SUMIFS('Frais annuel 22'!S$368:S$397,'Frais annuel 22'!Q$368:Q$397,\"CARO\",'Frais annuel 22'!O$368:O$397,\"ESP\")","v":0},{"$f":"SUMIFS('Frais annuel 22'!S$404:S$433,'Frais annuel 22'!Q$404:Q$433,\"CARO\",'Frais annuel 22'!O$404:O$433,\"ESP\")","v":0},0,{"$f":"DATA!I8","v":"CAROLE \"\""}]
[null,null,"  CH CARO",null,{"$f":"SUMIFS('Frais annuel 22'!$S$8:$S$37,'Frais annuel 22'!$Q$8:$Q$37,\"CARO\",'Frais annuel 22'!$O$8:$O$37,\"CH\")","v":0},{"$f":"SUMIFS('Frais annuel 22'!S$44:S$73,'Frais annuel 22'!Q$44:Q$73,\"CARO\",'Frais annuel 22'!O$44:O$73,\"CH\")","v":0},{"$f":"SUMIFS('Frais annuel 22'!S$80:S$109,'Frais annuel 22'!Q$80:Q$109,\"CARO\",'Frais annuel 22'!O$80:O$109,\"CH\")","v":0},{"$f":"SUMIFS('Frais annuel 22'!S$116:S$145,'Frais annuel 22'!Q$116:Q$145,\"CARO\",'Frais annuel 22'!O$116:O$145,\"CH\")","v":0},{"$f":"SUMIFS('Frais annuel 22'!S$152:S$181,'Frais annuel 22'!Q$152:Q$181,\"CARO\",'Frais annuel 22'!O$152:O$181,\"CH\")","v":0},{"$f":"SUMIFS('Frais annuel 22'!S$188:S$217,'Frais annuel 22'!Q$188:Q$217,\"CARO\",'Frais annuel 22'!O$188:O$217,\"CH\")","v":0},{"$f":"SUMIFS('Frais annuel 22'!S$224:S$253,'Frais annuel 22'!Q$224:Q$253,\"CARO\",'Frais annuel 22'!O$224:O$253,\"CH\")","v":0},{"$f":"SUMIFS('Frais annuel 22'!S$260:S$289,'Frais annuel 22'!Q$260:Q$289,\"CARO\",'Frais annuel 22'!O$260:O$289,\"CH\")","v":0},{"$f":"SUMIFS('Frais annuel 22'!S$296:S$325,'Frais annuel 22'!Q$296:Q$325,\"CARO\",'Frais annuel 22'!O$296:O$325,\"CH\")","v":0},{"$f":"SUMIFS('Frais annuel 22'!S$332:S$361,'Frais annuel 22'!Q$332:Q$361,\"CARO\",'Frais annuel 22'!O$332:O$361,\"CH\")","v":0},{"$f":"SUMIFS('Frais annuel 22'!S$368:S$397,'Frais annuel 22'!Q$368:Q$397,\"CARO\",'Frais annuel 22'!O$368:O$397,\"CH\")","v":0},{"$f":"SUMIFS('Frais annuel 22'!S$404:S$433,'Frais annuel 22'!Q$404:Q$433,\"CARO\",'Frais annuel 22'!O$404:O$433,\"CH\")","v":0},0,"TOTAL"]
[null,null," CARTE CARO",null,{"$f":"SUMIFS('Frais annuel 22'!$S$8:$S$37,'Frais annuel 22'!$Q$8:$Q$37,\"CARO\",'Frais annuel 22'!$O$8:$O$37,\"CAR\")","v":0},{"$f":"SUMIFS('Frais annuel 22'!S$44:S$73,'Frais annuel 22'!Q$44:Q$73,\"CARO\",'Frais annuel 22'!O$44:O$73,\"CAR\")","v":0},{"$f":"SUMIFS('Frais annuel 22'!S$80:S$109,'Frais annuel 22'!Q$80:Q$109,\"CARO\",'Frais annuel 22'!O$80:O$109,\"CAR\")","v":0},{"$f":"SUMIFS('Frais annuel 22'!S$116:S$145,'Frais annuel 22'!Q$116:Q$145,\"CARO\",'Frais annuel 22'!O$116:O$145,\"CAR\")","v":0},{"$f":"SUMIFS('Frais annuel 22'!S$152:S$181,'Frais annuel 22'!Q$152:Q$181,\"CARO\",'Frais annuel 22'!O$152:O$181,\"CAR\")","v":0},{"$f":"SUMIFS('Frais annuel 22'!S$188:S$217,'Frais annuel 22'!Q$188:Q$217,\"CARO\",'Frais annuel 22'!O$188:O$217,\"CAR\")","v":0},{"$f":"SUMIFS('Frais annuel 22'!S$224:S$253,'Frais annuel 22'!Q$224:Q$253,\"CARO\",'Frais annuel 22'!O$224:O$253,\"CAR\")","v":0},{"$f":"SUMIFS('Frais annuel 22'!S$260:S$289,'Frais annuel 22'!Q$260:Q$289,\"CARO\",'Frais annuel 22'!O$260:O$289,\"CAR\")","v":0},{"$f":"SUMIFS('Frais annuel 22'!S$296:S$325,'Frais annuel 22'!Q$296:Q$325,\"CARO\",'Frais annuel 22'!O$296:O$325,\"CAR\")","v":0},{"$f":"SUMIFS('Frais annuel 22'!S$332:S$361,'Frais annuel 22'!Q$332:Q$361,\"CARO\",'Frais annuel 22'!O$332:O$361,\"CAR\")","v":0},{"$f":"SUMIFS('Frais annuel 22'!S$368:S$397,'Frais annuel 22'!Q$368:Q$397,\"CARO\",'Frais annuel 22'!O$368:O$397,\"CAR\")","v":0},{"$f":"SUMIFS('Frais annuel 22'!S$404:S$433,'Frais annuel 22'!Q$404:Q$433,\"CARO\",'Frais annuel 22'!O$404:O$433,\"CAR\")","v":0},0,{"$f":"SUM(Q164:Q166)","v":0}]
[null,null,"CARTE  CBL",null,{"$f":"SUMIFS('Frais annuel 22'!S8:S37,'Frais annuel 22'!Q8:Q37,\"CBL\")","v":0},{"$f":"SUMIFS('Frais annuel 22'!S44:S73,'Frais annuel 22'!Q44:Q73,\"CBL\")","v":0},{"$f":"SUMIFS('Frais annuel 22'!S80:S109,'Frais annuel 22'!Q80:Q109,\"CBL\")","v":0},{"$f":"SUMIFS('Frais annuel 22'!S116:S145,'Frais annuel 22'!Q116:Q145,\"CBL\")","v":0},{"$f":"SUMIFS('Frais annuel 22'!S$152:S$181,'Frais annuel 22'!Q$152:Q$181,\"CBL\")","v":0},{"$f":"SUMIFS('Frais annuel 22'!S188:S217,'Frais annuel 22'!Q188:Q217,\"CBL\")","v":0},{"$f":"SUMIFS('Frais annuel 22'!S224:S253,'Frais annuel 22'!Q224:Q253,\"CBL\")","v":0},{"$f":"SUMIFS('Frais annuel 22'!S260:S289,'Frais annuel 22'!Q260:Q289,\"CBL\")","v":0},{"$f":"SUMIFS('Frais annuel 22'!S296:S325,'Frais annuel 22'!Q296:Q325,\"CBL\")","v":0},{"$f":"SUMIFS('Frais annuel 22'!S332:S361,'Frais annuel 22'!P332:P361,\"CBL\")","v":0},{"$f":"SUMIFS('Frais annuel 22'!S368:S397,'Frais annuel 22'!Q368:Q397,\"CBL\")","v":0},{"$f":"SUMIFS('Frais annuel 22'!S404:S433,'Frais annuel 22'!Q404:Q433,\"CBL\")","v":0},0,{"$f":"DATA!I9","v":"CARTE BLEU"}]
[null,null,"CARTE  PAY",null,{"$f":"SUMIFS('Frais annuel 22'!S8:S37,'Frais annuel 22'!Q8:Q37,\"PAY\")","v":0},{"$f":"SUMIFS('Frais annuel 22'!S44:S73,'Frais annuel 22'!Q44:Q73,\"PAY\")","v":0},{"$f":"SUMIFS('Frais annuel 22'!S80:S109,'Frais annuel 22'!Q80:Q109,\"PAY\")","v":0},{"$f":"SUMIFS('Frais annuel 22'!S116:S145,'Frais annuel 22'!Q116:Q145,\"PAY\")","v":0},{"$f":"SUMIFS('Frais annuel 22'!S$152:S$181,'Frais annuel 22'!Q$152:Q$181,\"PAY\")","v":0},{"$f":"SUMIFS('Frais annuel 22'!S188:S217,'Frais annuel 22'!Q188:Q217,\"PAY\")","v":0},{"$f":"SUMIFS('Frais annuel 22'!S224:S253,'Frais annuel 22'!Q224:Q253,\"PAY\")","v":0},{"$f":"SUMIFS('Frais annuel 22'!S260:S289,'Frais annuel 22'!Q260:Q289,\"PAY\")","v":0},{"$f":"SUMIFS('Frais annuel 22'!S296:S325,'Frais annuel 22'!Q296:Q325,\"PAY\")","v":0},{"$f":"SUMIFS('Frais annuel 22'!S332:S361,'Frais annuel 22'!P332:P361,\"PAY\")","v":0},{"$f":"SUMIFS('Frais annuel 22'!S368:S397,'Frais annuel 22'!Q368:Q397,\"PAY\")","v":0},{"$f":"SUMIFS('Frais annuel 22'!S404:S433,'Frais annuel 22'!Q404:Q433,\"PAY\")","v":0},0,{"$f":"DATA!I10","v":"PAYPAL"}]
[null,null,null,"Sous Total :",{"$f":"SUM(E162:E168)","v":0},0,0,0,0,0,0,0,0,0,0,0,0]
[null,null,null,"DIVERS  / MOIS",{"$f":"SUM(E171:E176)","v":0},{"$f":"SUMIFS('Frais annuel 22'!N44:N73,'Frais annuel 22'!P44:P73,\"DIV\")","v":0},{"$f":"SUMIFS('Frais annuel 22'!N80:N109,'Frais annuel 22'!P80:P109,\"DIV\")","v":0},{"$f":"SUM(H122:H145)","v":0},{"$f":"SUMIFS('Frais annuel 22'!N160:N189,'Frais annuel 22'!P160:P189,\"DIV\")","v":0},{"$f":"SUMIFS('Frais annuel 22'!N196:N225,'Frais annuel 22'!P196:P225,\"DIV\")","v":0},{"$f":"SUMIFS('Frais annuel 22'!N232:N261,'Frais annuel 22'!P232:P261,\"DIV\")","v":0},{"$f":"SUMIFS('Frais annuel 22'!N268:N297,'Frais annuel 22'!P268:P297,\"DIV\")","v":0},{"$f":"SUMIFS('Frais annuel 22'!N304:N333,'Frais annuel 22'!P304:P333,\"DIV\")","v":0},{"$f":"SUMIFS('Frais annuel 22'!N340:N369,'Frais annuel 22'!P340:P369,\"DIV\")","v":0},{"$f":"SUMIFS('Frais annuel 22'!N376:N405,'Frais annuel 22'!P376:P405,\"DIV\")","v":0},{"$f":"SUMIFS('Frais annuel 22'!N414:N441,'Frais annuel 22'!P414:P441,\"DIV\")","v":0},{"$f":"SUM(E170:P170)","v":0},"Loisirs"]
[null,null," Courses","ESP",null,null,null,null,null,null,null,null,null,null,null,null,0,{"$f":"D173","v":"  CARTES    COU"}]
[null,null,null,"CH",{"$f":"SUM(E165,E158,E155,E152,E149,E146,E143,E140,E130,E127,E124,E121,E118,E111,E108,E105,E102)","v":0},null,null,null,null,null,null,null,null,null,null,null,0,"TOTAL"]
[null,null,null,"  CARTES    COU",{"$f":"E115+E133","v":0},{"$f":"F133+F115","v":0},{"$f":"SUM(G168,G167,G166,E163,G159,G156,G153,G150,G147,G144,G141,G131,G128,G125,G122,G119,G116,G112,G109,G106,G103)","v":0},null,null,null,null,null,null,null,null,null,0,{"$f":"SUM(Q171:Q173)","v":0}]
[null,null,"Autres","ESP",null,null,null,null,null,null,null,null,null,null,null,null,0,{"$f":"D176","v":"  CARTES   AUTRES"}]
[null,null,null,"CH",null,null,null,null,null,null,null,null,null,null,null,null,0,"TOTAL"]
[null,null,null,"  CARTES   AUTRES",null,null,null,null,null,null,null,null,null,null,null,null,0,{"$f":"SUM(Q174:Q176)","v":0}]

{"sheet":"DATA","index":2,"n_rows":37,"n_cols":42,"rows_kept":37,"cut":false,"hidden":false,"merged":[]}
["20 emplacements de code en col B reportés par formule ligne 3",null,null,null,null,null,null,"pour vide dans menu déroulant",null,null,null,"mis un espace dans les cellules bleues"]
["20 emplacements par sous-codes"]
[null,null,null,1,null,2,null,3,null,4,null,5,null,6,null,7,null,8,null,9,null,10,null,11,null,12,null,13,null,14,null,15,null,16,null,17,null,18,null,19,null,20]
[null,null,null,{"$f":"COUNTA(D6:D25)","v":7},null,{"$f":"COUNTA(F6:F25)","v":7},null,{"$f":"COUNTA(H6:H25)","v":6},null,{"$f":"COUNTA(J6:J25)","v":12},null,{"$f":"COUNTA(L6:L25)","v":15},null,{"$f":"COUNTA(N6:N25)","v":6},null,{"$f":"COUNTA(P6:P25)","v":8},null,{"$f":"COUNTA(R6:R25)","v":0},null,{"$f":"COUNTA(T6:T25)","v":0},null,{"$f":"COUNTA(V6:V25)","v":0},null,{"$f":"COUNTA(X6:X25)","v":0},null,{"$f":"COUNTA(Z6:Z25)","v":0},null,{"$f":"COUNTA(AB6:AB25)","v":0},null,{"$f":"COUNTA(AD6:AD25)","v":0},null,{"$f":"COUNTA(AF6:AF25)","v":0},null,{"$f":"COUNTA(AH6:AH25)","v":0},null,{"$f":"COUNTA(AJ6:AJ25)","v":0},null,{"$f":"COUNTA(AL6:AL25)","v":0},null,{"$f":"COUNTA(AN6:AN25)","v":0},null,{"$f":"COUNTA(AP6:AP25)","v":0}]
["CODES DEBITS",null,"SS/CODES",{"$f":"IF(D3<=COUNTA($B$6:$B$25),INDEX($B$6:$B$25,D3),\"\")","v":"COU"},null,{"$f":"IF(F3<=COUNTA($B$6:$B$25),INDEX($B$6:$B$25,F3),\"\")","v":"VEH"},null,{"$f":"IF(H3<=COUNTA($B$6:$B$25),INDEX($B$6:$B$25,H3),\"\")","v":"DIV"},null,{"$f":"IF(J3<=COUNTA($B$6:$B$25),INDEX($B$6:$B$25,J3),\"\")","v":"PRE"},null,{"$f":"IF(L3<=COUNTA($B$6:$B$25),INDEX($B$6:$B$25,L3),\"\")","v":"MAI"},null,{"$f":"IF(N3<=COUNTA($B$6:$B$25),INDEX($B$6:$B$25,N3),\"\")","v":"REN"},null,{"$f":"IF(P3<=COUNTA($B$6:$B$25),INDEX($B$6:$B$25,P3),\"\")","v":"SAN"},null,{"$f":"IF(R3<=COUNTA($B$6:$B$25),INDEX($B$6:$B$25,R3),\"\")","v":""},null,{"$f":"IF(T3<=COUNTA($B$6:$B$25),INDEX($B$6:$B$25,T3),\"\")","v":""},null,{"$f":"IF(V3<=COUNTA($B$6:$B$25),INDEX($B$6:$B$25,V3),\"\")","v":""},null,{"$f":"IF(X3<=COUNTA($B$6:$B$25),INDEX($B$6:$B$25,X3),\"\")","v":""},null,{"$f":"IF(Z3<=COUNTA($B$6:$B$25),INDEX($B$6:$B$25,Z3),\"\")","v":""},null,{"$f":"IF(AB3<=COUNTA($B$6:$B$25),INDEX($B$6:$B$25,AB3),\"\")","v":""},null,{"$f":"IF(AD3<=COUNTA($B$6:$B$25),INDEX($B$6:$B$25,AD3),\"\")","v":""},null,{"$f":"IF(AF3<=COUNTA($B$6:$B$25),INDEX($B$6:$B$25,AF3),\"\")","v":""},null,{"$f":"IF(AH3<=COUNTA($B$6:$B$25),INDEX($B$6:$B$25,AH3),\"\")","v":""},null,{"$f":"IF(AJ3<=COUNTA($B$6:$B$25),INDEX($B$6:$B$25,AJ3),\"\")","v":""},null,{"$f":"IF(AL3<=COUNTA($B$6:$B$25),INDEX($B$6:$B$25,AL3),\"\")","v":""},null,{"$f":"IF(AN3<=COUNTA($B$6:$B$25),INDEX($B$6:$B$25,AN3),\"\")","v":""},null,{"$f":"IF(AP3<=COUNTA($B$6:$B$25),INDEX($B$6:$B$25,AP3),\"\")","v":""}]
["Courses","COU","départ des decalages"," ",null," ",null," ",null," ",null," ",null," ",null," "]
["Voiture","VEH",null,"REB","Remboursement","ABX","BX GAN","AVI","Autre ","AGI","AGIPI RET  PASCALE ","DFM","EDF MAISON","ARC","ALPRO ARRCO PREST BTP ","DEN1","K GOURNAY COPPE Dent"]
["Loisirs","DIV",null,"DV","DIVERS","ADS","DS5 GAN","CARO","CAROLE \"\"","BT1","PRO BTP PRESTATIONS","DFP","EDF PLN ","AM","C.P.A.M. ALBI","DEN2","PASCALE"]
["Prélèvements","PRE",null,"GFR","GRAND FRAIS","BCA","BOXER  CARB  ","CBL","CARTE BLEU","BTP","PR PRO BTP","EM1","EAU MAISON","BP","PIERROT","DO1","BRASSAC"]
["Charges","MAI",null,"LE1","ELECLERC","D SC","DS5  CARB  ","PAY","PAYPAL","CSG","IMPOT CSG","EP3","EAU PLN","GA0","RETRAITE SUP GAN","DO2","Divers"]
["RENTE","REN",null,"LE2","CASTRESDIS Leclerc ","EN1","DS5 ENTRETIEN","MAF","MAAF","F CE","Forfait Caisse Epargne","ES2","EAU SALAS","RET","CAISSE D'ASS RET ","PH1","PHARMACIE du Martinet"]
["SANTE","SAN",null,"S U","MAGASIN U","EN2","BOXER ENTRETIEN",null,null,"IM","PR-IM","GA1","GAN ASSUR MAISON",null,null,"PH2","PHARMACIE BRASSAC"]
[null,null,null,null,null,null,null,null,null,"MUT","MUTUELLE PRO BTP","GA2","GAN ASSUR  SALAS",null,null,"PH3","PHARMACIE AUTRE"]
[null,null,null,null,null,null,null,null,null,"PRB","VIREMENT PRO BTP","GA3","GAN ASSUR  PLN"]
[null,null,null,null,null,null,null,null,null,"PRI","PRLV PRIXTEL","OR1","ORDURE MAISON"]
["MULTI PAYEMENT",null,null,null,null,null,null,null,null,"SFR","SFR PRLV  FIXE ADSL","OR2","ORDURE SALAS"]
[null,null,null,null,null,null,null,null,null,"TRE","AUTRE","FOM","FONCIE MAISON"]
[null,null,null,null,null,null,null,null,null,null,null,"FOS","FONCIE SALAS"]
[null,null,null,null,null,null,null,null,null,null,null,"FOP","FONCIE PLN"]
[null,null,null,null,null,null,null,null,null,null,null,"THP","PLN TAXE HABITATION"]
[]
[]
[]
[]
[]
[]
[null,null,null,1,null,2,null,3,null,4,null,5,null,6,null,7,null,8,null,9,null,10,null,11,null,12,null,13,null,14,null,15,null,16,null,17,null,18,null,19,null,20]
[null,null,null,{"$f":"COUNTA(D30:D50)","v":5},null,{"$f":"COUNTA(F30:F50)","v":7},null,{"$f":"COUNTA(H30:H50)","v":3},null,{"$f":"COUNTA(J30:J50)","v":8},null,{"$f":"COUNTA(L30:L50)","v":0},null,{"$f":"COUNTA(N30:N50)","v":0},null,{"$f":"COUNTA(P30:P50)","v":0},null,{"$f":"COUNTA(R30:R50)","v":0},null,{"$f":"COUNTA(T30:T50)","v":0},null,{"$f":"COUNTA(V30:V50)","v":0},null,{"$f":"COUNTA(X30:X50)","v":0},null,{"$f":"COUNTA(Z30:Z50)","v":0},null,{"$f":"COUNTA(AB30:AB50)","v":0},null,{"$f":"COUNTA(AD30:AD50)","v":0},null,{"$f":"COUNTA(AF30:AF50)","v":0},null,{"$f":"COUNTA(AH30:AH50)","v":0},null,{"$f":"COUNTA(AJ30:AJ50)","v":0},null,{"$f":"COUNTA(AL30:AL50)","v":0},null,{"$f":"COUNTA(AN30:AN50)","v":0},null,{"$f":"COUNTA(AP30:AP50)","v":0}]
["CODES CREDITS",null,"SS/CODES",{"$f":"IF(D27<=COUNTA($B$30:$B$50),INDEX($B$30:$B$50,D27),\"\")","v":"REV"},null,{"$f":"IF(F27<=COUNTA($B$30:$B$50),INDEX($B$30:$B$50,F27),\"\")","v":"REM"},null,{"$f":"IF(H27<=COUNTA($B$30:$B$50),INDEX($B$30:$B$50,H27),\"\")","v":"VIR"},null,{"$f":"IF(J27<=COUNTA($B$30:$B$50),INDEX($B$30:$B$50,J27),\"\")","v":"FRP"},null,{"$f":"IF(L27<=COUNTA($B$30:$B$50),INDEX($B$30:$B$50,L27),\"\")","v":""},null,{"$f":"IF(N27<=COUNTA($B$30:$B$50),INDEX($B$30:$B$50,N27),\"\")","v":""},null,{"$f":"IF(P27<=COUNTA($B$30:$B$49),INDEX($B$30:$B$49,P27),\"\")","v":""},null,{"$f":"IF(R27<=COUNTA($B$30:$B$49),INDEX($B$30:$B$49,R27),\"\")","v":""},null,{"$f":"IF(T27<=COUNTA($B$30:$B$49),INDEX($B$30:$B$49,T27),\"\")","v":""},null,{"$f":"IF(V27<=COUNTA($B$30:$B$49),INDEX($B$30:$B$49,V27),\"\")","v":""},null,{"$f":"IF(X27<=COUNTA($B$30:$B$49),INDEX($B$30:$B$49,X27),\"\")","v":""},null,{"$f":"IF(Z27<=COUNTA($B$30:$B$49),INDEX($B$30:$B$49,Z27),\"\")","v":""},null,{"$f":"IF(AB27<=COUNTA($B$30:$B$49),INDEX($B$30:$B$49,AB27),\"\")","v":""},null,{"$f":"IF(AD27<=COUNTA($B$30:$B$49),INDEX($B$30:$B$49,AD27),\"\")","v":""},null,{"$f":"IF(AF27<=COUNTA($B$30:$B$49),INDEX($B$30:$B$49,AF27),\"\")","v":""},null,{"$f":"IF(AH27<=COUNTA($B$30:$B$49),INDEX($B$30:$B$49,AH27),\"\")","v":""},null,{"$f":"IF(AJ27<=COUNTA($B$30:$B$49),INDEX($B$30:$B$49,AJ27),\"\")","v":""},null,{"$f":"IF(AL27<=COUNTA($B$30:$B$49),INDEX($B$30:$B$49,AL27),\"\")","v":""},null,{"$f":"IF(AN27<=COUNTA($B$30:$B$49),INDEX($B$30:$B$49,AN27),\"\")","v":""},null,{"$f":"IF(AP27<=COUNTA($B$30:$B$49),INDEX($B$30:$B$49,AP27),\"\")","v":""}]
["Revenus","REV","départ des decalages"," ",null," ",null,"VBP","Virement compte BP","C2","BOXER  CARB  BARDOU"]
["Remboursements","REM",null,"ARC","ALPRO ARRCO Prest BTP","AM","C.P.A.M. ALBI","VI R","Autre virement","DFP","EDF PLN "]
["Virements","VIR",null,"GA0","GROUPAMA GAN VIE","BP","PIERROT"," ",null,"EP3","EAU PLN"]
["Frais Remb Perso","FRP",null,"DIV","Autre Virement","BT1","PRO BTP PRESTATIONS",null,null,"ES2","EAU SALAS"]
[null,null,null,"RET","Caisse Ass Retraite ","CPA","Remb CPAM",null,null,"GA3","GAN ASS MAISON PLN"]
[null,null,null,null,null,"D IV","Remb  Christophe",null,null,"MA","SCI MAAF"]
[null,null,null,null,null,"PBP","VIREMENT PRO BTP",null,null,"OR2","ORDURE SALAS"]
[null,null,null,null,null,null,null,null,null,"GA B","GAN BOXER"]

{"sheet":"Prévisionnel","index":3,"n_rows":89,"n_cols":10,"rows_kept":89,"cut":false,"hidden":false,"merged":[[25,0,25,9],[46,9,46,10],[47,9,47,10],[48,9,48,10],[43,9,43,10],[43,11,43,13],[46,11,46,13],[47,11,47,13]]}
[]
[]
[]
["POSSIBILITE EN PROPORTIONNALITE SUR L ANNEE SUR MONTANTS   VALIDES"]
[null,null,"CREDIT","DIF","DEBIT","MOIS"]
[12,"JANVIER",{"$f":"'Frais annuel 22'!L38","v":0},{"$f":"C6+E6","v":0},{"$f":"-'Frais annuel 22'!N38","v":0},{"$f":"SUM(J6:J17)","v":0},12,{"$f":"SUM(E6:E17,C6:C17)+C$41","v":0},{"$f":"IF(G6=\"12\",H6,H6)","v":0},{"$f":"I6/G6","v":0}]
[11,"FEVRIER",{"$f":"'Frais annuel 22'!L74","v":0},{"$f":"C7+E7","v":0},{"$f":"-'Frais annuel 22'!N74","v":0},{"$f":"SUM(J7:J17)","v":0},11,{"$f":"SUM(E7:E17,C7:C17)+C19","v":0},{"$f":"IF(G7=\"11\",H7,H7)","v":0},{"$f":"I7/G7","v":0}]
[10,"MARS",{"$f":"'Frais annuel 22'!L110","v":0},{"$f":"C8+E8","v":0},{"$f":"-'Frais annuel 22'!N110","v":0},{"$f":"SUM(J8:J17)","v":0},10,{"$f":"SUM(E8:E17,C8:C17)+C$41","v":0},{"$f":"IF(G8=\"110\",H8,H8)","v":0},{"$f":"I8/G8","v":0}]
[9,"AVRIL",{"$f":"'Frais annuel 22'!L146","v":0},0,{"$f":"-'Frais annuel 22'!N146","v":0},{"$f":"SUM(J9:J17)","v":0},9,{"$f":"SUM(E9:E17,C9:C17)+C$41","v":0},{"$f":"IF(G9=\"9\",H9,H9)","v":0},0]
[8,"MAI",{"$f":"'Frais annuel 22'!L182","v":0},0,{"$f":"-'Frais annuel 22'!N182","v":0},{"$f":"SUM(J10:J17)","v":0},8,{"$f":"SUM(E10:E17,C10:C17)+C$41","v":0},{"$f":"IF(G10=\"8\",H10,H10)","v":0},0]
[7,"JUIN",{"$f":"'Frais annuel 22'!L218","v":0},0,{"$f":"-'Frais annuel 22'!N218","v":0},{"$f":"SUM(J11:J17)","v":0},7,{"$f":"SUM(E11:E17,C11:C17)+C$41","v":0},{"$f":"IF(G11=\"7\",H11,H11)","v":0},0]
[6,"JUILLET",{"$f":"'Frais annuel 22'!L254","v":0},0,{"$f":"-'Frais annuel 22'!N254","v":0},{"$f":"SUM(J12:J17)","v":0},6,{"$f":"SUM(E12:E17,C12:C17)+C$41","v":0},{"$f":"IF(G12=\"6\",H12,H12)","v":0},0]
[5,"AOÛT",{"$f":"'Frais annuel 22'!L290","v":0},0,{"$f":"-'Frais annuel 22'!N290","v":0},{"$f":"SUM(J13:J17)","v":0},5,{"$f":"SUM(E13:E17,C13:C17)+C$41","v":0},{"$f":"IF(G13=\"5\",H13,H13)","v":0},0]
[4,"SEPTEMBRE",{"$f":"'Frais annuel 22'!L326","v":0},0,{"$f":"-'Frais annuel 22'!N326","v":0},{"$f":"SUM(J14:J17)","v":0},4,{"$f":"SUM(E14:E17,C14:C17)+C$41","v":0},{"$f":"IF(G14=\"4\",H14,H14)","v":0},0]
[3,"OCTOBRE",{"$f":"'Frais annuel 22'!L362","v":0},0,{"$f":"-'Frais annuel 22'!N362","v":0},{"$f":"SUM(J15:J17)","v":0},3,{"$f":"SUM(E15:E17,C15:C17)+C$41","v":0},{"$f":"IF(G15=\"3\",H15,H15)","v":0},0]
[2,"NOVEMBRE",{"$f":"'Frais annuel 22'!L398","v":0},0,{"$f":"-'Frais annuel 22'!N398","v":0},{"$f":"SUM(J16:J17)","v":0},2,{"$f":"SUM(E16:E17,C16:C17)+C$41","v":0},{"$f":"IF(G16=\"2\",H16,H16)","v":0},{"$f":"I16/G16","v":0}]
[1,"DÉCEMBRE",{"$f":"'Frais annuel 22'!L434","v":0},0,{"$f":"-'Frais annuel 22'!N434","v":0},{"$f":"SUM(J17)","v":0},1,{"$f":"SUM(E17,C17)+C$41","v":0},{"$f":"IF(G17=\"1\",H17,H17)","v":0},{"$f":"I17/G17","v":0}]
[null,null,{"$f":"SUM(C6:C17)","v":0},{"$f":"SUM(D6:D17)","v":0},{"$f":"SUM(E6:E17)","v":0},null,{"$f":"'Frais annuel 22'!S439","v":12},{"$f":"IF(G18=12,H6,IF(G18=11,H7,IF(G18=10,H8,IF(G18=9,H9,IF(G18=8,H10,IF(G18=7,H11,IF(G18=6,H12,IF(G18=5,H13,IF(G18=4,H14,IF(G18=3,H15,IF(G18=2,H16,IF(G18=1,H17))))))))))))","v":0},null,{"$f":"IF(G18=12,J6,IF(G18=11,J7,IF(G18=10,J8,IF(G18=9,J9,IF(G18=8,J10,IF(G18=7,J11,IF(G18=6,J12,IF(G18=5,J13,IF(G18=4,J15,IF(G18=3,J14,IF(G18=2,J16,IF(G18=1,J17))))))))))))","v":0}]
["SOLDE",{"$f":"'Frais annuel 22'!L5","v":0},{"$f":"B19","v":0},{"$f":"B19","v":0}]
[null,null,{"$f":"C18+C19","v":0},{"$f":"SUM(D18:D19)","v":0},{"$f":"E18","v":0}]
[]
[]
[]
[]
[]
["POSSIBILITE EN PROPORTIONNALITE SUR L ANNEE SUR MONTANTS NON  VALIDES"]
[null,null,"CREDIT","DIF","DEBIT","MOIS"]
[12,"JANVIER",{"$f":"'Frais annuel 22'!G38","v":0},{"$f":"C28+E28","v":0},{"$f":"-'Frais annuel 22'!S38","v":0},{"$f":"SUM(J28:J39)","v":0},12,{"$f":"SUM(E28:E39,C28:C39)+C$41","v":0},{"$f":"IF(G28=\"12\",H28,H28)","v":0},{"$f":"I28/G28","v":0}]
[11,"FEVRIER",{"$f":"'Frais annuel 22'!G74","v":0},{"$f":"C29+E29","v":0},{"$f":"-'Frais annuel 22'!S74","v":0},{"$f":"SUM(J29:J39)","v":0},11,{"$f":"SUM(E29:E39,C29:C39)+C41","v":0},{"$f":"IF(G29=\"11\",H29,H29)","v":0},{"$f":"I29/G29","v":0}]
[10,"MARS",{"$f":"'Frais annuel 22'!G110","v":0},{"$f":"C30+E30","v":0},{"$f":"-'Frais annuel 22'!S110","v":0},{"$f":"SUM(J30:J39)","v":0},10,{"$f":"SUM(E30:E39,C30:C39)+C$41","v":0},{"$f":"IF(G30=\"110\",H30,H30)","v":0},{"$f":"I30/G30","v":0}]
[9,"AVRIL",{"$f":"'Frais annuel 22'!G146","v":0},0,{"$f":"-'Frais annuel 22'!S146","v":0},{"$f":"SUM(J31:J39)","v":0},9,{"$f":"SUM(E31:E39,C31:C39)+C$41","v":0},{"$f":"IF(G31=\"9\",H31,H31)","v":0},0]
[8,"MAI",{"$f":"'Frais annuel 22'!G182","v":0},0,{"$f":"-'Frais annuel 22'!S182","v":0},{"$f":"SUM(J32:J39)","v":0},8,{"$f":"SUM(E32:E39,C32:C39)+C$41","v":0},{"$f":"IF(G32=\"8\",H32,H32)","v":0},0]
[7,"JUIN",{"$f":"'Frais annuel 22'!G218","v":0},0,{"$f":"-'Frais annuel 22'!S218","v":0},{"$f":"SUM(J33:J39)","v":0},7,{"$f":"SUM(E33:E39,C33:C39)+C$41","v":0},{"$f":"IF(G33=\"7\",H33,H33)","v":0},0]
[6,"JUILLET",{"$f":"'Frais annuel 22'!G254","v":0},0,{"$f":"-'Frais annuel 22'!S254","v":0},{"$f":"SUM(J34:J39)","v":0},6,{"$f":"SUM(E34:E39,C34:C39)+C$41","v":0},{"$f":"IF(G34=\"6\",H34,H34)","v":0},0]
[5,"AOÛT",{"$f":"'Frais annuel 22'!G290","v":0},0,{"$f":"-'Frais annuel 22'!S290","v":0},{"$f":"SUM(J35:J39)","v":0},5,{"$f":"SUM(E35:E39,C35:C39)+C$41","v":0},{"$f":"IF(G35=\"5\",H35,H35)","v":0},0]
[4,"SEPTEMBRE",{"$f":"'Frais annuel 22'!G326","v":0},0,{"$f":"-'Frais annuel 22'!S326","v":0},{"$f":"SUM(J36:J39)","v":0},4,{"$f":"SUM(E36:E39,C36:C39)+C$41","v":0},{"$f":"IF(G36=\"4\",H36,H36)","v":0},0]
[3,"OCTOBRE",{"$f":"'Frais annuel 22'!G362","v":0},0,{"$f":"-'Frais annuel 22'!S362","v":0},{"$f":"SUM(J37:J39)","v":0},3,{"$f":"SUM(E37:E39,C37:C39)+C$41","v":0},{"$f":"IF(G37=\"3\",H37,H37)","v":0},0]
[2,"NOVEMBRE",{"$f":"'Frais annuel 22'!G398","v":0},0,{"$f":"-'Frais annuel 22'!S398","v":0},{"$f":"SUM(J38:J39)","v":0},2,{"$f":"SUM(E38:E39,C38:C39)+C$41","v":0},{"$f":"IF(G38=\"2\",H38,H38)","v":0},{"$f":"I38/G38","v":0}]
[1,"DÉCEMBRE",{"$f":"'Frais annuel 22'!G434","v":0},0,{"$f":"-'Frais annuel 22'!S434","v":0},{"$f":"SUM(J39)","v":0},1,{"$f":"SUM(E39,C39)+C$41","v":0},{"$f":"IF(G39=\"1\",H39,H39)","v":0},{"$f":"I39/G39","v":0}]
[null,null,{"$f":"SUM(C28:C39)","v":0},{"$f":"SUM(D28:D39)","v":0},{"$f":"SUM(E28:E39)","v":0},null,{"$f":"'Frais annuel 22'!F439","v":12},{"$f":"IF(G40=12,H28,IF(G40=11,H29,IF(G40=10,H30,IF(G40=9,H31,IF(G40=8,H32,IF(G40=7,H33,IF(G40=6,H34,IF(G40=5,H35,IF(G40=4,H36,IF(G40=3,H37,IF(G40=2,H38,IF(G40=1,H39))))))))))))","v":0},null,{"$f":"IF(G40=12,J28,IF(G40=11,J29,IF(G40=10,J30,IF(G40=9,J31,IF(G40=8,J32,IF(G40=7,J33,IF(G40=6,J34,IF(G40=5,J35,IF(G40=4,J37,IF(G40=3,J36,IF(G40=2,J38,IF(G40=1,J39))))))))))))","v":0}]
["SOLDE",{"$f":"'Frais annuel 22'!L5","v":0},{"$f":"B41","v":0},{"$f":"B41","v":0}]
[null,null,{"$f":"C40+C41","v":0},{"$f":"SUM(D40:D41)","v":0},{"$f":"E40","v":0}]
[]
[]
[]
[]
[]
[]
[]
[]
[]
[]
[]
[]
[]
[]
[]
[]
[]
[]
[]
[]
[]
[]
[]
[]
[]
[]
[]
[]
[]
[]
[null,null,"Explication de la formule =DECALER(debutdebits;;EQUIV(K6;SCdebits;0);INDEX(nombreSCdebits;;EQUIV(K6;SCdebits;0)))"]
[null,null,"(Elle comporte 3 plages nommées de DATA)"]
[null,null,"DECALER(cellule de départ;nombre de lignes (ici rien); nombre de colonnes (ici le 1er EQUIV); sur une hauteur de (ici l'INDEX EQUIV)"]
[]
[]
[]
[]
[]
[]
[]
[]
[]
[]
[null,null,null,"En K6 il y a MA  celui se trouve en 7eme position dans la plage horizontale Scdebits, on va donc décaler de 7 colonnes"]
[null,null,null,"on se trouve alors sur la cellule où il y a DEC"]
[null,null,null,"on va décaler ensuite en hauteur du nombre situé dans nombreSCdebits qu'on trouve avec INDEX comme positionné dans la même colonne que K6 dans SCdebits donc la 7eme"]
[null,null,null,"le 7eme nombre dans la plage nombredebits etant 5 on prend 5 veleurs en hauteur donc la liste déroulante comprendra DEC MEU DEP ELM et vide"]

{"sheet":"Notice","index":4,"n_rows":71,"n_cols":1,"rows_kept":71,"cut":false,"hidden":false,"merged":[[6,0,6,7],[0,0,0,7],[1,0,2,7],[3,0,3,7],[4,0,4,7],[5,0,5,7],[18,0,18,7],[7,0,7,7],[8,0,8,7],[9,0,9,7],[10,0,10,7],[11,0,11,7],[12,0,12,7],[13,0,13,7],[14,0,14,7],[15,0,15,7],[16,0,16,7],[17,0,17,7],[30,0,30,7],[19,0,19,7],[20,0,20,7],[21,0,21,7],[22,0,22,7],[23,0,23,7],[24,0,24,7],[25,0,25,7],[26,0,26,7],[27,0,27,7],[28,0,28,7],[29,0,29,7],[42,0,42,7],[31,0,31,7],[32,0,32,7],[33,0,33,7],[34,0,34,7],[35,0,35,7],[36,0,36,7],[37,0,37,7],[38,0,38,7],[39,0,39,7],[40,0,40,7],[41,0,41,7],[54,0,54,7],[43,0,43,7],[44,0,44,7],[45,0,45,7],[46,0,46,7],[47,0,47,7],[48,0,48,7],[49,0,49,7],[50,0,50,7],[51,0,51,7],[52,0,52,7],[53,0,53,7],[66,0,66,7],[55,0,55,7],[56,0,56,7],[57,0,57,7],[58,0,58,7],[59,0,59,7],[60,0,60,7],[61,0,61,7],[62,0,62,7],[63,0,63,7],[64,0,64,7],[65,0,65,7],[78,0,78,7],[67,0,67,7],[68,0,68,7],[69,0,69,7],[70,0,70,7],[71,0,71,7],[72,0,72,7],[73,0,73,7],[74,0,74,7],[75,0,75,7],[76,0,76,7],[77,0,77,7],[90,0,90,7],[79,0,79,7],[80,0,80,7],[81,0,81,7],[82,0,82,7],[83,0,83,7],[84,0,84,7],[85,0,85,7],[86,0,86,7],[87,0,87,7],[88,0,88,7],[89,0,89,7],[97,0,97,7],[98,0,98,7],[91,0,91,7],[92,0,92,7],[93,0,93,7],[94,0,94,7],[95,0,95,7],[96,0,96,7]]}
[]
["NOTICE"]
[]
[]
["Ces feuilles on pour but de réaliser un suivi de frais annuel divisé en douze mois."]
["(*)De pouvoir réaliser un prévisionnel sur l'année en rentrant les charges régulières de chaque mois."]
["De suivre dans la feuille \"REV DEP\" le budget consacré au fonctionnement de l'année, en aillant le détail"]
["mois par mois."]
["Pour cela il faut renseigner la feuille DATA avec le descriptif adéquat sachant que certaines"]
["affectations ont plusieurs type de payement  (soit  rentrée ou sortie) en Virement (VIR) pour CREDIT"]
["ou Carte (CAR). Les mentions CH ou ESP sont possibles. Tout cela distribue correctement les données "]
["en feuille REV DEP."]
["Attention, lors de la composition du DATA les cellules mentionnées en bleu ont les trois façons de"]
["ventiler les frais à l'encontre des autres qui restent simples ."]
["Lors de cette opération, s'il est permis de faire plusieurs sélections. La police de caractère passe "]
["à la couleur orange, identique à celle qui la suit (sinon en jaune)."]
[]
["Ce prévisionnel s'effectue en deux parties :"]
["Une en colonne G et S sur l'estimatif des frais"]
["L'autre après validation des montant (lignes H et R par un V) soit clavier ou barre de choix."]
[]
["Possibilité investissement sur  NON Validé"]
["On rentre manuellement la somme que l'on trouve en L439 dans la cellule F438"]
["Cela donne le montant restant pour l'année (F440) ou par mois (A439)"]
[]
["Possibilité investissement SUR Validé"]
["On rentre manuellement la somme que l'on trouve en N439 dans la cellule R438"]
["Cela donne le montant restant pour l'année (U440) ou par mois (W439)"]
["Suivant l'avancement dans l'année il est possible d'effectuer cette opération en sélectionnant dans "]
["les cellules F et S les mois restants."]
[]
["Cette feuille possède deux impératifs :"]
["La justesse des opérations"]
["La sécurité des données"]
[]
["Pour les  opérations de saisie il est préférable de commencer par la partie basse des colonnes pour "]
["chaque mois (prévisionnel de départ) afin de pouvoir établir le concret des opérations en respectant "]
["les dates d'opérations effectuées."]
[]
["A SAVOIR : pour la saisi de la date il suffit de rentrer en colonne C et W celle du jour + Entrée (clavier)"]
[]
["La sécurité se retrouve sur 13 cellules qui déverrouillent le mois sur lequel on se trouve "]
["Sélectionner KIKO, ce qui permet de voir dans la barre déroulante VALIDE ou Couleur (blanc)"]
[]
["Les lignes 2A et 3A donnent accès au choix des couleurs."]
["Partie haute va pouvoir colorier les colonnes FG et ST"]
["Celle du bas seulement les colonnes F et T. "]
["Cela permet de pointer les opérations aux besoins."]
[]
[]
["DEBUTER  :"]
["Cellule D5 : donner l'intitulé du document"]
["Cellule V5 : année de suivie"]
["Cellule L5 : montant du solde mois précédent"]
["Cellule S7 : montant des cartes avec payement différé  "]
["Pour la suite revenir au  (*) de la première feuille"]
[]
["Information : il est possible d'avoir le suivi des cartes de crédit à payement différé en validant dans la"]
["colonne R (barre déroulante)  le D qui s'affiche en rouge"]
[]
["Disfonctionnement constaté en feuille \"Frais annuel 22\" :"]
[]
["Penser à déverrouiller dans les cellules : $A$2,5,41,77,113,149,185,221,257,293,329,365,401"]
["Le fait de déverrouiller manuellement une d'entre elles actionne un message de confirmation."]
[]
["Une fois que l'on désire quitter, le message est renouvelé en informant la fermeture des 13 choix."]
[]
["Pour les feuilles  REC DEP et le Prévisionnel je n'ai pas le recul suffisant pour le garantir. "]
["Je corrige au fur et à mesure et les mises à jour resteront disponibles."]
[]
["Si toutefois une erreur se présente il faut relever le numéro de ligne et colonne."]