{"text_format":"1","workbook":"xlsx","n_sheets":8,"sheets":["Fiche_Saisie","TCD2","TCD1","Base_données","Modif_Saisie","Base_Adresses","Grand_Est","Feuil1"],"not_rendered":{"charts":0,"images":0,"macros":1,"external_links":0,"defined_names":34,"comments":0,"pivot_tables":2},"unopened":[],"bounds":{"document_bytes":16777216,"sheet_cells":100000,"rows_first":2000,"rows_last":500,"rows_between":2000,"halvings":0,"cell_chars":16384,"cell_head_chars":4096},"cells_cut":0,"cells_raw":0,"read":"whole","date_system":"1900"}

{"sheet":"Fiche_Saisie","index":0,"n_rows":22,"n_cols":30,"rows_kept":22,"cut":false,"hidden":false,"merged":[]}
[null,null,null,null,null,null,null,null,null,10,{"$f":"J1+1","v":11},{"$f":"K1+1","v":12},13,14,15,16,17,18,19,20,21,22,23,24,25,26,27,28,29,30]
["Code","Nom Parrain\nFilleul ","Année","MOIS","Sem","N°-Parrain\nN°- filleul","Num Parrain\n & Filleul","Parrain\nNb. Filleul\nVente","Parrai / filleul","Date","Commercial","nom\nParrain","prénom\nParrain","Téléphone\nParrain","nom Filleul","prenom Filleul","Téléphone\nFilleul","N°-","Rue","CP","Commune","Date\n Phonning","relance1","relance2","Résultat\nPhonning","date/rdv client","Vente","date de pose","Pose en M²","pose effectue"]
[{"$f":"$B$5","v":"2022_13_C1_P_24_F143"},{"$f":"IF(I2=\"vide\",0,IF($I3=\"P\",\"Parrain\"&\" \"&$L3&\" \"&$M3,IF($I3=\"F\",\"Parrain\"&\" \"&$L3&\" \"&$M3&\" Filleul\"&\" \"&$O3&\" \"&$P3)))","v":"Parrain Durantond jean-Patrick Filleul Pasteur Jean-michel"},{"$f":"YEAR($J$3)","v":2022},{"$f":"MONTH($J$3)","v":4},{"$f":"WEEKNUM($J$3,2)","v":14},{"$f":"IF(AND(L3<>\"\",M3<>\"\",I3<>\"\"),COUNTIF(Base_données!$I20:$I$186,$I$3),0)+1","v":144},{"$f":"RIGHT(LEFT(B5,FIND(\"_\",B5,10)-1),1)","v":"1"},{"$f":"IF($F$8=\"P\",Base_données!$C$4+1,Base_données!$C$5+1)","v":144},{"$f":"$F$8","v":"F"},{"$f":"$D$8","v":"2022-04-02T18:20:00.600"},{"$f":"$B$8","v":"PASCAL"},{"$f":"$B$10","v":"Durantond"},{"$f":"$D$10","v":"jean-Patrick"},{"$f":"$F$10","v":655188765},{"$f":"IF($B$14=\"\",\"\",$B$14)","v":"Pasteur"},{"$f":"IF($D$14=\"\",\"\",$D$14)","v":"Jean-michel"},{"$f":"IF($F$14=\"\",\"\",$F$14)","v":768060822},{"$f":"IF($B$12=\"\",\"\",$B$12)","v":57},{"$f":"IF($D$12=\"\",\"\",$D$12)","v":"Av, Général Galliéni"},{"$f":"IF($F$12=\"\",\"\",$F$12)","v":10300},{"$f":"IF($H$12=\"\",\"\",$H$12)","v":"STE SAVINE"},{"$f":"IF($B$18=\"\",\"\",$B$18)","v":"2022-03-10"},{"$f":"IF($D$18=\"\",\"\",$D$18)","v":44634},{"$f":"IF($F$18=\"\",\"\",$F$18)","v":44638},{"$f":"IF($H$18=\"\",\"\",$H$18)","v":"OK"},{"$f":"IF($B$21=\"\",\"\",$B$21)","v":"2022-03-22"},{"$f":"IF($D$21=\"\",\"\",$D$21)","v":""},{"$f":"IF($B$23=\"\",\"\",$B$23)","v":""},{"$f":"IF($D$23=\"\",\"\",$D$23)","v":""},{"$f":"IF($F$23=\"\",\"\",$F$23)","v":""}]
[]
[null,"2022_13_C1_P_24_F143"]
[]
[{"$f":"$C$7+1","v":11},"Commercial",10,"Date",9,"Parrain"]
[null,"PASCAL",null,{"$f":"NOW()","v":"2022-04-02T18:20:00.600"},null,"F"]
[{"$f":"$A$7+1","v":12},"nom\nParrain",{"$f":"$A$9+1","v":13},"prénom\nParrain",{"$f":"$C$9+1","v":14},"Téléphone"]
[null,"Durantond",null,"jean-Patrick",null,655188765]
[18,"N°-",{"$f":"$A$11+1","v":19},"Rue",{"$f":"$C$11+1","v":20},"CP",{"$f":"$E$11+1","v":21},"Commune"]
[null,57,null,"Av, Général Galliéni",null,10300,null,"STE SAVINE"]
[{"$f":"$E$9+1","v":15},"nom Filleul",{"$f":"$A$13+1","v":16},"Prénom Filleul",{"$f":"$C$13+1","v":17},"Téléphone"]
[null,"Pasteur",null,"Jean-michel",null,768060822]
[{"$f":"$E$13+1","v":18},"N°-",{"$f":"$A$15+1","v":19},"Rue",{"$f":"$C$15+1","v":20},"CP",{"$f":"$E$15+1","v":21},"Commune"]
{"$rows_left_out":8}
{"sheet":"TCD2","index":1,"n_rows":10,"n_cols":4,"rows_kept":10,"cut":false,"hidden":false,"merged":[]}
[]
["MOIS",2]
["Sem",8]
["Commercial","(Tous)"]
[]
["Étiquettes de lignes","Nb pose effectue","Nb de Num Filleul","Somme en M²"]
["client 104 Nom",8,15,1168]
["client 27 Nom",9,9,1424]
["client 30 Nom",7,7,1030]
["Total général",24,31,3622]

{"sheet":"TCD1","index":2,"n_rows":31,"n_cols":3,"rows_kept":31,"cut":false,"hidden":false,"merged":[]}
[]
[]
["Commercial","(Tous)"]
["MOIS",2]
["Sem","(Tous)"]
[]
["Étiquettes de lignes","Nb pose effectue","Somme en M²"]
["client 21 Nom",7,570]
["client 45 Nom",6,720]
["client 135 Nom",8,800]
["client 81 Nom",9,860]
["client 104 Nom",8,1168]
["client 126 Nom",8,800]
["client 29 Nom",9,840]
["client 10 Nom",6,400]
{"$rows_left_out":17}
{"sheet":"Base_données","index":3,"n_rows":188,"n_cols":30,"rows_kept":188,"cut":false,"hidden":false,"merged":[]}
["Code","Nom Parrain\nFilleul ","Année","MOIS","Sem","N°-Parrain\nN°- filleul","Num Parrain\n & Filleul","Parrain\nNb. Filleul\nVente","Parrai / filleul","Date","Commercial","nom\nParrain","prénom\nParrain","Téléphone\nParrain","nom","prenom","Téléphone\nFilleul","N°-","Rue","CP","Commune","Date\n Phonning","relance1","relance2","Résultat\nPhonning","date/rdv client","Vente","date de pose","Pose en M²","pose effectue"]
["=SI($K2=\"\";0;$C$2&\"_\"&E2&\"_C\"&RECHERCHEV(K2;Grand_Est!$I$20:$J$34;2;0)&\"_P_\"&NB.SI($I2:$I$210;\"P\")&\"_\"&SI(I2=\"F\";\"F\"&NB.SI($I2:$I$210;\"F\");\"000\"))",{"$f":"IF(I2=\"vide\",0,IF($I2=\"P\",\"Parrain\"&\" \"&$L2&\" \"&$M2,IF($I2=\"F\",\"Parrain\"&\" \"&$L2&\" \"&$M2&\" Filleul\"&\" \"&$O2&\" \"&$P2)))","v":"Parrain client 104 Nom client 104 Prénom Filleul  "},{"$f":"YEAR($J$2)","v":2022},{"$f":"MONTH($J$2)","v":2},{"$f":"WEEKNUM($J$2,21)","v":8},{"$f":"IF(AND(L2<>\"\",M2<>\"\",I2<>\"\"),COUNTIF($I20:$I$186,I2),0)+1","v":144},{"$f":"IF(AND(L2=\"\",M2=\"\"),0,IF(I2=\"P\",COUNTIF($I$20:$I186,\"P\"),COUNTIF($L$20:$L186,$L20)-1))","v":6},{"$f":"IF(AD2=\"\",0,IF(OR(I2=\"F\",I2=\"vide\"),0,COUNTIFS($L$20:$L$186,IF($I2=\"P\",$L2,0),$AD$20:$AD$186,\"OK\")-1))","v":0},"F","2022-02-21","JEAN","client 104 Nom","client 104 Prénom",680614822,null,null,null,null,null,10500,"BLIGNICOURT",{"$f":"J2+14","v":"2022-03-07"},null,null,null,{"$f":"V2+7","v":"2022-03-14"},null,{"$f":"V2+21","v":"2022-03-28"}]
[{"$f":"IF(A2<>\"\",1,0)","v":1},1,1,1,1,{"$f":"IF(F2<>\"\",1,0)","v":1},{"$f":"IF(G2<>\"\",1,0)","v":1},{"$f":"IF(H2<>\"\",1,0)","v":1},{"$f":"IF(I2<>\"\",1,0)","v":1},1,1,{"$f":"IF(L2<>\"\",1,0)","v":1},{"$f":"IF(M2<>\"\",1,0)","v":1},1,0,0,0,{"$f":"IF(R2<>\"\",1,0)","v":0},{"$f":"IF(S2<>\"\",1,0)","v":0},1,{"$f":"IF(U2<>\"\",1,0)","v":1},null,{"$f":"IF(W2=\"\",0,1)","v":0},{"$f":"IF(X2=\"\",0,1)","v":0},{"$f":"IF(Y2=\"\",0,1)","v":0},{"$f":"IF(Y2=\"OK\",1,0)","v":0},{"$f":"IF(AA2<>\"\",1,0)","v":0},{"$f":"IF(AA2=\"OK\",1,0)","v":0},null,{"$f":"IF(AND(AB2<NOW(),AD2=\"ok\"),1,0)","v":0}]
[null,null,{"$f":"COUNTIF($I$20:$I$186,\"P\")","v":24},null,null,null,null,null,null,{"$f":"RANDBETWEEN(1,140)","v":26},{"$f":"RANDBETWEEN(1,140)","v":119},{"$f":"VLOOKUP($J$4,Base_Adresses!$A$3:$H$142,COLUMN()-10,0)","v":"client 26 Nom"},{"$f":"VLOOKUP($J$4,Base_Adresses!$A$3:$H$142,COLUMN()-10,0)","v":"client 26 Prénom"},{"$f":"VLOOKUP($J$4,Base_Adresses!$A$3:$H$142,COLUMN()-6,0)","v":635526547},{"$f":"VLOOKUP($K$4,Base_Adresses!$A$3:$H$142,COLUMN()-13,0)","v":"client 119 Nom"},{"$f":"VLOOKUP($K$4,Base_Adresses!$A$3:$H$142,COLUMN()-13,0)","v":"client 119 Prénom"},{"$f":"VLOOKUP($K$4,Base_Adresses!$A$3:$H$142,COLUMN()-9,0)","v":670840930},{"$f":"VLOOKUP($K$4,Base_Adresses!$A$3:$H$142,COLUMN()-14,0)","v":222},{"$f":"VLOOKUP($K$4,Base_Adresses!$A$3:$H$142,COLUMN()-14,0)","v":"Rue du village DCN"},{"$f":"VLOOKUP($K$4,Base_Adresses!$A$3:$H$142,COLUMN()-14,0)","v":10240},{"$f":"VLOOKUP($K$4,Base_Adresses!$A$3:$H$142,COLUMN()-14,0)","v":"AVANT LES RAMERUPT"}]
[null,null,{"$f":"COUNTIF($I$20:$I$186,\"f\")","v":143},null,null,null,null,null,null,null,null,null,null,null,null,null,null,null,null,"Résultat Phonning",{"$f":"COUNTIF($Y$20:$Y$186,\"OK\")","v":56}]
[null,null,null,null,null,null,null,null,null,{"$f":"COLUMN()","v":10},null,null,null,null,null,null,"Filleul",{"$f":"COUNTIF($I$20:$I$186,\"F\")","v":143},null,"Vente",{"$f":"COUNTIF($AA$20:$AA$186,\"OK\")","v":132}]
[null,null,null,null,null,null,null,null,null,null,null,null,null,null,null,null,null,null,null,"pose effectue",{"$f":"COUNTIF($AD$20:$AD$186,\"OK\")","v":133}]
[null,null,null,null,null,null,null,null,null,"Année",{"$f":"YEAR($L$9)","v":2022},null,null,null,null,null,null,null,"Total"]
[null,null,null,null,null,"Nb_Parrain","P",null,null,"Mois",4,{"$f":"CHOOSE(WEEKDAY(DATE(YEAR($J$2),$K$9,1),2),0,-1,-2,-3,3,2,1)+DATE(YEAR($J$2),$K$9,1)","v":"2022-04-04"},null,null,null,null,null,null,"M² mois",null,null,"OK"]
[null,null,null,null,{"$f":"K10","v":14},{"$f":"L10","v":15},16,{"$f":"O10","v":17},{"$f":"P10","v":18},"Sem. ",{"$f":"WEEKNUM(L9,21)","v":14},{"$f":"K10+1","v":15},{"$f":"L10+1","v":16},null,{"$f":"M10+1","v":17},18,null,null,{"$f":"SUM(S11:S16)","v":207},null,null,{"$f":"WEEKNUM($L$9,21)","v":14},{"$f":"V10+1","v":15},{"$f":"W10+1","v":16},{"$f":"X10+1","v":17},{"$f":"Y10+1","v":18}]
[null,null,null,null,{"$f":"COUNTIFS($D$20:$D$186,$K$9,$E$20:$E$186,E$10,$K$20:$K$186,$J11,$I$20:$I$186,$G$9)","v":0},0,0,0,0,"JEAN",{"$f":"SUMIFS($AC$20:$AC$186,$E$20:$E$186,K$10,$K$20:$K$186,$J11)","v":0},0,0,null,{"$f":"SUMIFS($AC$20:$AC$186,$E$20:$E$186,O$10,$K$20:$K$186,$J11)","v":0},0,null,{"$f":"SUMIFS($AC$20:$AC$186,$E$20:$E$186,$K$10,$K$20:$K$186,$J11)","v":0},{"$f":"SUMIFS($AC$20:$AC$186,$D$20:$D$186,$K$9,$K$20:$K$186,$J11)","v":207},null,"JEAN",{"$f":"COUNTIFS($C$20:$C$186,$K$8,$D$20:$D$186,$K$9,$E$20:$E$186,V$10,$K$20:$K$186,$U11,$Y$20:$Y$186,$V$9)","v":0},0,0,0,0]
[null,null,null,null,0,0,0,0,0,"PASCAL",0,0,0,null,0,0,null,0,0,null,"PASCAL",0,0,0,0,0]
[null,null,null,null,0,0,0,0,0,"THIERRY",0,0,0,null,0,0,null,0,0,null,"THIERRY",0,0,0,0,0]
[null,null,null,null,0,0,0,0,0,"SILVAIN",0,0,0,null,0,0,null,0,0,null,"SILVAIN",0,0,0,0,0]
[null,null,null,null,0,0,0,0,0,"ANTOINE",0,0,0,null,0,0,null,0,0,null,"ANTOINE",0,0,0,0,0]
{"$rows_left_out":174}
{"sheet":"Modif_Saisie","index":4,"n_rows":23,"n_cols":30,"rows_kept":23,"cut":false,"hidden":false,"merged":[]}
[null,null,null,null,null,null,null,null,null,10,{"$f":"J1+1","v":11},{"$f":"K1+1","v":12},13,14,15,16,17,18,19,20,21,22,23,24,25,26,27,28,29,30]
["Code","Nom Parrain\nFilleul ","Année","MOIS","Sem","N°-Parrain\nN°- filleul","Num Parrain\n & Filleul","Parrain\nNb. Filleul\nVente","Parrai / filleul","Date","Commercial","nom\nParrain","prénom\nParrain","Téléphone\nParrain","nom Filleul","prenom Filleul","Téléphone\nFilleul","N°-","Rue","CP","Commune","Date\n Phonning","relance1","relance2","Résultat\nPhonning","date/rdv client","Vente","date de pose","Pose en M²","pose effectue"]
[{"$f":"$B$5","v":"2022_5_C2_P_2_F11"},{"$f":"IF(I2=\"vide\",0,IF($I2=\"P\",\"Parrain\"&\" \"&$L2&\" \"&$M2,IF($I2=\"F\",\"Parrain\"&\" \"&$L2&\" \"&$M2&\" Filleul\"&\" \"&$O2&\" \"&$P2)))","v":false},{"$f":"YEAR($J$3)","v":2022},{"$f":"MONTH($J$3)","v":2},{"$f":"WEEKNUM($J$3,21)","v":5},{"$f":"IF(AND(L3<>\"\",M3<>\"\",I3<>\"\"),COUNTIF(Base_données!$I21:$I$186,I3),0)+1","v":144},{"$f":"RIGHT(LEFT(B5,FIND(\"_\",B5,10)-1),1)","v":"2"},{"$f":"IF(AD2=\"\",0,IF(LEFT(RIGHT(B5,2),1)=\"F\",$B$14,COUNTIFS($L$20:$L$210,IF($I2=\"P\",$D$10),$AD$20:$AD$210,\"OK\")-1))","v":-1},"F",{"$f":"$D$8","v":"2022-02-01"},{"$f":"$B$8","v":"PASCAL"},{"$f":"$B$10","v":"client 54 Nom"},{"$f":"$D$10","v":"client 54 Prénom"},{"$f":"$F$10","v":619306489},{"$f":"$B$14","v":"client 26 Nom"},{"$f":"$D$14","v":"client 26 Prénom"},{"$f":"$F$14","v":635526547},{"$f":"$B$16","v":13},{"$f":"$D$16","v":"Rue du village Y"},{"$f":"$F$16","v":10130},{"$f":"$H$16","v":"CHAMOY"},{"$f":"$B$18","v":"2022-03-07"},{"$f":"$D$18","v":"Nok"},{"$f":"$F$18","v":"nok"},{"$f":"$H$18","v":"ok"},{"$f":"$B$21","v":"2022-03-13"},{"$f":"$D$21","v":"ok"},{"$f":"$B$23","v":"2022-03-08"},{"$f":"$D$23","v":160},{"$f":"$F$23","v":"Ok"}]
[]
[null,"2022_5_C2_P_2_F11",null,{"$f":"C3&\"_\"&E3&\"_\"&\"C\"&K4&\"_\"&I4&\"_\"&G4&IF(I3=\"P\",\"_000\",222)","v":"2022_5_C__222"},null,null,{"$f":"IF(AND(L5=\"\",M5=\"\"),0,IF(I5=\"P\",RIGHT(LEFT(B7,FIND(\"_\",B7,5)-1),1),LEFT(RIGHT(B7,2),1)))","v":0}]
[]
[{"$f":"$C$7+1","v":11},"Commercial",10,"Date",null,"Parrain"]
[null,{"$f":"VLOOKUP($B$5,Base_données!$A$20:$BD$186,$A$7,0)","v":"PASCAL"},null,{"$f":"VLOOKUP($B$5,Base_données!$A$20:$BD$186,$C$7,0)","v":"2022-02-01"},null,{"$f":"I3","v":"F"}]
[{"$f":"$A$7+1","v":12},"nom\nParrain",{"$f":"$A$9+1","v":13},"prénom\nParrain",{"$f":"$C$9+1","v":14},"Téléphone"]
[null,{"$f":"VLOOKUP($B$5,Base_données!$A$20:$BD$186,$A$9,0)","v":"client 54 Nom"},null,{"$f":"VLOOKUP($B$5,Base_données!$A$20:$BD$186,$C$9,0)","v":"client 54 Prénom"},null,{"$f":"IF(VLOOKUP($B$5,Base_données!$A$20:$BD$186,$E$9,0)=0,\"\",VLOOKUP($B$5,Base_données!$A$20:$BD$186,$E$9,0))","v":619306489}]
[18,"N°-",{"$f":"$A$11+1","v":19},"Rue",{"$f":"$C$11+1","v":20},"CP",{"$f":"$E$11+1","v":21},"Commune"]
[null,{"$f":"IF($B$16<>\"\",\"\",VLOOKUP($B$5,Base_données!$A$20:$BD$186,$A$11,0))","v":""},null,{"$f":"IF($D$16<>\"\",\"\",VLOOKUP($B$5,Base_données!$A$20:$BD$186,$C$11,0))","v":""},null,{"$f":"IF($F$16<>\"\",\"\",VLOOKUP($B$5,Base_données!$A$20:$BD$186,$E$11,0))","v":""},null,{"$f":"IF($H$16<>\"\",\"\",VLOOKUP($B$5,Base_données!$A$20:$BD$186,$G$11,0))","v":""}]
[{"$f":"$E$9+1","v":15},"nom Filleul",{"$f":"$A$13+1","v":16},"Prénom Filleul",{"$f":"$C$13+1","v":17},"Téléphone"]
[null,{"$f":"IF(VLOOKUP($B$5,Base_données!$A$20:$BD$186,$A$13,0)=0,\"\",VLOOKUP($B$5,Base_données!$A$20:$BD$186,$A$13,0))","v":"client 26 Nom"},null,{"$f":"IF(VLOOKUP($B$5,Base_données!$A$20:$BD$186,$C$13,0)=0,\"\",VLOOKUP($B$5,Base_données!$A$20:$BD$186,$C$13,0))","v":"client 26 Prénom"},null,{"$f":"IF(VLOOKUP($B$5,Base_données!$A$20:$BD$186,$E$13,0)=0,\"\",VLOOKUP($B$5,Base_données!$A$20:$BD$186,$E$13,0))","v":635526547}]
[{"$f":"$E$13+1","v":18},"N°-",{"$f":"$A$15+1","v":19},"Rue",{"$f":"$C$15+1","v":20},"CP",{"$f":"$E$15+1","v":21},"Commune"]
{"$rows_left_out":9}
{"sheet":"Base_Adresses","index":5,"n_rows":142,"n_cols":8,"rows_kept":142,"cut":false,"hidden":false,"merged":[]}
["Base_Clients_Essai"]
[{"$f":"COLUMN()","v":1},{"$f":"COLUMN()","v":2},{"$f":"COLUMN()","v":3},{"$f":"COLUMN()","v":4},{"$f":"COLUMN()","v":5},{"$f":"COLUMN()","v":6},{"$f":"COLUMN()","v":7},{"$f":"COLUMN()","v":8}]
[1,"client 1 Nom","client 1 Prénom",4,"Rue du village @",10700,"TORCY LE GRAND",603470094]
[2,"client 2 Nom","client 2 Prénom",25,"Rue du village A",10700,"TORCY LE PETIT",672490692]
[3,"client 3 Nom","client 3 Prénom",41,"Rue du village B",10700,"TROUAN LE GRAND",638675734]
[4,"client 4 Nom","client 4 Prénom",117,"Rue du village C",10100,"GELANNES",672501849]
[5,"client 5 Nom","client 5 Prénom",67,"Rue du village D",10100,"LA FOSSE CORDUAN",699104827]
[6,"client 6 Nom","client 6 Prénom",157,"Rue du village E",10100,"LES GRANGES",617460923]
[7,"client 7 Nom","client 7 Prénom",158,"Rue du village F",10100,"OSSEY LES TROIS MAISONS",688214485]
[8,"client 8 Nom","client 8 Prénom",19,"Rue du village G",10100,"PARS LES ROMILLY",651723065]
[9,"client 9 Nom","client 9 Prénom",27,"Rue du village H",10100,"ROMILLY SUR SEINE",644465218]
[10,"client 10 Nom","client 10 Prénom",57,"Rue du village I",10100,"ST HILAIRE SOUS ROMILLY",660338199]
[11,"client 11 Nom","client 11 Prénom",40,"Rue du village J",10100,"ST LOUP DE BUFFIGNY",688080821]
[12,"client 12 Nom","client 12 Prénom",26,"Rue du village K",10120,"CHEVILLELE",687534346]
[13,"client 13 Nom","client 13 Prénom",238,"Rue du village L",10600,"BARBEREY AUX MOINES",618219055]
{"$rows_left_out":128}
{"sheet":"Grand_Est","index":6,"n_rows":5669,"n_cols":21,"rows_kept":5669,"cut":false,"hidden":false,"merged":[[6,14,7,16],[10,14,11,16]]}
["cp","cp","villes",{"$f":"MAX(D2:D5669)","v":46}]
[8000,"08000","CHARLEVILLE MEZIERES",{"$f":"COUNTIF($B$2:$B$5669,B2)","v":5},null,"N°","REGION","Département","Villes",null,null,"Liste_Mois"]
[8000,"08000","LES AYVELLES",5,null,8,"Grand_Est","Ardennes","Charleville-Mézières",8,null,1]
[8000,"08000","PRIX LES MEZIERES",5,null,10,"Grand_Est","Aube","Troyes",10,null,2]
[8000,"08000","VILLERS SEMEUSE",5,null,51,"Grand_Est","Marne","Châlons-en-Champagne",51,null,3,null,null,"Formule Code Colonne A Base_Donnees"]
[8000,"08000","WARCQ",5,null,52,"Grand_Est","Haute-Marne","Chaumont",52,null,4]
[8090,"08090","AIGLEMONT",17,null,54,"Grand_Est","Meurthe-et-Moselle","Nancy",54,null,5,null,null,"2022_8_C1_P_25_F152"]
[8090,"08090","ARREUX",17,null,55,"Grand_Est","Meuse","Bar-le-Duc",55,null,6,null,"Colonne I"]
[8090,"08090","BELVAL",17,null,57,"Grand_Est","Moselle","Metz",57,null,7,null,"F",2022,8,"C et 1(J1grand Est)","F","Nb P base colonne I20-210","F si F colonne I","Nb F si F Colonne I"]
[8090,"08090","CLIRON",17,null,67,"Grand_Est","Bas-Rhin","Strasbourg",67,null,8,null,null,null,null,"Nom Parrain"]
[8090,"08090","DAMOUZY",17,null,68,"Grand_Est","Haut-Rhin","Colmar",68,null,9,null,null,"2022_8_C2_P_23_000"]
[8090,"08090","EVIGNY",17,null,88,"Grand_Est","Vosges","Épinal",88,null,10]
[8090,"08090","FAGNON",17,null,"Code postal et ville",null,"Pose_effectuée","Parrain/filleul",null,null,11,null,"P",2022,8,"C et 1(J1grand Est)","P","Nb P base colonne I20-210","000"]
[8090,"08090","HAM LES MOINES",17,null,{"$f":"COUNTIF($B$2:$B$5669,F15)","v":36},{"$f":"\"première ligne \"&MATCH(F15,A1:A5669,0)","v":"première ligne 872"},"Ok","P",null,null,12]
[8090,"08090","HAUDRECY",17,null,{"$f":"INDIRECT(ADDRESS(MATCH(Base_données!$T$2,$A$1:$A$5669,0)+ROW()-15,1,3,1,\"Grand_Est\"),1)","v":10500},{"$f":"INDIRECT(ADDRESS(MATCH($F$15,$A$1:$A$5669,0)+ROW()-15,3,3,1,\"Grand_Est\"),1)","v":"BETIGNICOURT"},"NoK","F",null,null,"tous"]
{"$rows_left_out":5655}
{"sheet":"Feuil1","index":7,"n_rows":37,"n_cols":34,"rows_kept":37,"cut":false,"hidden":false,"merged":[]}
["Code","Nom Parrain\nFilleul ","Année","MOIS",null,null,null,null,"Sem","N°-Parrain\nN°- filleul","Num Filleul","Parrain\nNb. filleul","Parrain\nfilleul","Date","Commercial","nom\nParrain","prénom\nParrain","Téléphone\nParrain","nom\nFilleul","Prénom\nFilleul","Téléphone\nFilleul","N°- Rue","Nom Rue","CP","Commune","Date\n Phonning","relance1","relance2","Résultat\nPhonning","date/rdv client","Vente","date de pose","Pose en M²","pose effectue"]
[null,{"$f":"IF(I2=\"vide\",0,IF($I2=\"P\",\"Parrain\"&\" \"&$L2&\" \"&$M2,IF($I2=\"F\",\"Parrain\"&\" \"&$L2&\" \"&$M2&\" Filleul\"&\" \"&$O2&\" \"&$P2)))","v":"Parrain client 104 Nom client 104 Prénom Filleul  "},{"$f":"YEAR($J$2)","v":2022},{"$f":"MONTH($J$2)","v":2},{"$f":"WEEKNUM($J$2,21)","v":8},{"$f":"IF(AND(L2<>\"\",M2<>\"\",I2<>\"\"),COUNTIF($I20:$I$210,I2),0)+1","v":1},{"$f":"IF(AND(L2=\"\",M2=\"\"),0,IF(I2=\"P\",COUNTIF($I$20:$I210,\"P\"),COUNTIF($L$20:$L210,$L20)-1))","v":-1},{"$f":"IF(AD2=\"\",0,IF(OR(I2=\"F\",I2=\"vide\"),0,COUNTIFS($L$20:$L$210,IF($I2=\"P\",$L2,0),$AD$20:$AD$210,\"OK\")-1))","v":0},"F","2022-02-21","JEAN","client 104 Nom","client 104 Prénom",680614822]
[null,"=SI($K2=\"\";0;$C$2&\"_\"&E2&\"_C\"&RECHERCHEV(K2;Grand_Est!$I$20:$J$34;2;0)&\"_P_\"&NB.SI($I2:$I$210;\"P\")&\"_\"&SI(I2=\"F\";\"F\"&NB.SI($I2:$I$210;\"F\");\"000\"))"]
[]
["CmD_Modification","2022-04-03",{"$f":"WEEKNUM(B5,2)","v":14}]
["CmD_Sauve"]
["cmdClose"]
["cmdDelete"]
["cmdReset",null,null,null,null,null,"        .Lbl_Date_Jour      'Ok date   10"]
["Frame3"]
["Lbl_Date_Jour",null,null,null,null,null,"        .TextB_Commercial = \"\"  ' ok    11"]
["OptB_Filleul"]
["OptB_Parrain",null,null,null,"P","F","        .OptB_Parrain = False       'ok     9","F"]
["TextB_CF",null,null,null,null,null,"        .OptB_Filleul = False        'ok     9"]
["TextB_Commercial"]
{"$rows_left_out":22}