{"text_format":"1","workbook":"xlsx","n_sheets":8,"sheets":["Fiche_Saisie","TCD2","TCD1","Base_données","Modif_Saisie","Base_Adresses","Grand_Est","Feuil1"],"not_rendered":{"charts":0,"images":0,"macros":1,"external_links":0,"defined_names":34,"comments":0,"pivot_tables":2},"unopened":[],"bounds":{"document_bytes":16777216,"sheet_cells":100000,"rows_first":2000,"rows_last":500,"rows_between":2000,"halvings":0,"cell_chars":16384,"cell_head_chars":4096},"cells_cut":0,"cells_raw":0,"read":"whole","date_system":"1900"}

{"sheet":"Fiche_Saisie","index":0,"n_rows":22,"n_cols":30,"rows_kept":22,"cut":false,"hidden":false,"merged":[]}
[null,null,null,null,null,null,null,null,null,10,{"$f":"J1+1","v":11},{"$f":"K1+1","v":12},13,14,15,16,17,18,19,20,21,22,23,24,25,26,27,28,29,30]
["Code","Nom Parrain\nFilleul ","Année","MOIS","Sem","N°-Parrain\nN°- filleul","Num Parrain\n & Filleul","Parrain\nNb. Filleul\nVente","Parrai / filleul","Date","Commercial","nom\nParrain","prénom\nParrain","Téléphone\nParrain","nom Filleul","prenom Filleul","Téléphone\nFilleul","N°-","Rue","CP","Commune","Date\n Phonning","relance1","relance2","Résultat\nPhonning","date/rdv client","Vente","date de pose","Pose en M²","pose effectue"]
[{"$f":"$B$5","v":"2022_13_C1_P_24_F143"},{"$f":"IF(I2=\"vide\",0,IF($I3=\"P\",\"Parrain\"&\" \"&$L3&\" \"&$M3,IF($I3=\"F\",\"Parrain\"&\" \"&$L3&\" \"&$M3&\" Filleul\"&\" \"&$O3&\" \"&$P3)))","v":"Parrain Durantond jean-Patrick Filleul Pasteur Jean-michel"},{"$f":"YEAR($J$3)","v":2022},{"$f":"MONTH($J$3)","v":4},{"$f":"WEEKNUM($J$3,2)","v":14},{"$f":"IF(AND(L3<>\"\",M3<>\"\",I3<>\"\"),COUNTIF(Base_données!$I20:$I$186,$I$3),0)+1","v":144},{"$f":"RIGHT(LEFT(B5,FIND(\"_\",B5,10)-1),1)","v":"1"},{"$f":"IF($F$8=\"P\",Base_données!$C$4+1,Base_données!$C$5+1)","v":144},{"$f":"$F$8","v":"F"},{"$f":"$D$8","v":"2022-04-02T18:20:00.600"},{"$f":"$B$8","v":"PASCAL"},{"$f":"$B$10","v":"Durantond"},{"$f":"$D$10","v":"jean-Patrick"},{"$f":"$F$10","v":655188765},{"$f":"IF($B$14=\"\",\"\",$B$14)","v":"Pasteur"},{"$f":"IF($D$14=\"\",\"\",$D$14)","v":"Jean-michel"},{"$f":"IF($F$14=\"\",\"\",$F$14)","v":768060822},{"$f":"IF($B$12=\"\",\"\",$B$12)","v":57},{"$f":"IF($D$12=\"\",\"\",$D$12)","v":"Av, Général Galliéni"},{"$f":"IF($F$12=\"\",\"\",$F$12)","v":10300},{"$f":"IF($H$12=\"\",\"\",$H$12)","v":"STE SAVINE"},{"$f":"IF($B$18=\"\",\"\",$B$18)","v":"2022-03-10"},{"$f":"IF($D$18=\"\",\"\",$D$18)","v":44634},{"$f":"IF($F$18=\"\",\"\",$F$18)","v":44638},{"$f":"IF($H$18=\"\",\"\",$H$18)","v":"OK"},{"$f":"IF($B$21=\"\",\"\",$B$21)","v":"2022-03-22"},{"$f":"IF($D$21=\"\",\"\",$D$21)","v":""},{"$f":"IF($B$23=\"\",\"\",$B$23)","v":""},{"$f":"IF($D$23=\"\",\"\",$D$23)","v":""},{"$f":"IF($F$23=\"\",\"\",$F$23)","v":""}]
[]
[null,"2022_13_C1_P_24_F143"]
[]
[{"$f":"$C$7+1","v":11},"Commercial",10,"Date",9,"Parrain"]
[null,"PASCAL",null,{"$f":"NOW()","v":"2022-04-02T18:20:00.600"},null,"F"]
[{"$f":"$A$7+1","v":12},"nom\nParrain",{"$f":"$A$9+1","v":13},"prénom\nParrain",{"$f":"$C$9+1","v":14},"Téléphone"]
[null,"Durantond",null,"jean-Patrick",null,655188765]
[18,"N°-",{"$f":"$A$11+1","v":19},"Rue",{"$f":"$C$11+1","v":20},"CP",{"$f":"$E$11+1","v":21},"Commune"]
[null,57,null,"Av, Général Galliéni",null,10300,null,"STE SAVINE"]
[{"$f":"$E$9+1","v":15},"nom Filleul",{"$f":"$A$13+1","v":16},"Prénom Filleul",{"$f":"$C$13+1","v":17},"Téléphone"]
[null,"Pasteur",null,"Jean-michel",null,768060822]
[{"$f":"$E$13+1","v":18},"N°-",{"$f":"$A$15+1","v":19},"Rue",{"$f":"$C$15+1","v":20},"CP",{"$f":"$E$15+1","v":21},"Commune"]
[null,53,null,"Ambroise Cottet",null,10000,null,"Troyes"]
[{"$f":"$G$15+1","v":22},"Date\n Phonning",{"$f":"$A$17+1","v":23},"relance1",{"$f":"$C$17+1","v":24},"relance2",{"$f":"$E$17+1","v":25},"Résultat\nPhonning"]
[null,"2022-03-10",null,"2022-03-14",null,"2022-03-18",null,"OK"]
[]
[{"$f":"$G$17+1","v":26},"date/rdv client",{"$f":"$A$20+1","v":27},"Vente"]
[null,"2022-03-22"]
[{"$f":"$C$20+1","v":28},"date de pose",{"$f":"$A$22+1","v":29},"Pose en M²",{"$f":"$C$22+1","v":30},"pose effectue"]

{"sheet":"TCD2","index":1,"n_rows":10,"n_cols":4,"rows_kept":10,"cut":false,"hidden":false,"merged":[]}
[]
["MOIS",2]
["Sem",8]
["Commercial","(Tous)"]
[]
["Étiquettes de lignes","Nb pose effectue","Nb de Num Filleul","Somme en M²"]
["client 104 Nom",8,15,1168]
["client 27 Nom",9,9,1424]
["client 30 Nom",7,7,1030]
["Total général",24,31,3622]

{"sheet":"TCD1","index":2,"n_rows":31,"n_cols":3,"rows_kept":31,"cut":false,"hidden":false,"merged":[]}
[]
[]
["Commercial","(Tous)"]
["MOIS",2]
["Sem","(Tous)"]
[]
["Étiquettes de lignes","Nb pose effectue","Somme en M²"]
["client 21 Nom",7,570]
["client 45 Nom",6,720]
["client 135 Nom",8,800]
["client 81 Nom",9,860]
["client 104 Nom",8,1168]
["client 126 Nom",8,800]
["client 29 Nom",9,840]
["client 10 Nom",6,400]
["client 84 Nom",6,780]
["client 127 Nom",8,1120]
["client 56 Nom",7,960]
["client 139 Nom",7,960]
["client 94 Nom",7,1120]
["client 54 Nom",7,1000]
["client 74 Nom",6,960]
["client 55 Nom",6,540]
["client 114 Nom",7,840]
["client 124 Nom",7,702]
["client 49 Nom",7,1067]
["client 34 Nom",9,1116]
["client 15 Nom",5,560]
["client 27 Nom",9,1424]
["client 30 Nom",7,1030]
["Total général",166,20337]

{"sheet":"Base_données","index":3,"n_rows":188,"n_cols":30,"rows_kept":188,"cut":false,"hidden":false,"merged":[]}
["Code","Nom Parrain\nFilleul ","Année","MOIS","Sem","N°-Parrain\nN°- filleul","Num Parrain\n & Filleul","Parrain\nNb. Filleul\nVente","Parrai / filleul","Date","Commercial","nom\nParrain","prénom\nParrain","Téléphone\nParrain","nom","prenom","Téléphone\nFilleul","N°-","Rue","CP","Commune","Date\n Phonning","relance1","relance2","Résultat\nPhonning","date/rdv client","Vente","date de pose","Pose en M²","pose effectue"]
["=SI($K2=\"\";0;$C$2&\"_\"&E2&\"_C\"&RECHERCHEV(K2;Grand_Est!$I$20:$J$34;2;0)&\"_P_\"&NB.SI($I2:$I$210;\"P\")&\"_\"&SI(I2=\"F\";\"F\"&NB.SI($I2:$I$210;\"F\");\"000\"))",{"$f":"IF(I2=\"vide\",0,IF($I2=\"P\",\"Parrain\"&\" \"&$L2&\" \"&$M2,IF($I2=\"F\",\"Parrain\"&\" \"&$L2&\" \"&$M2&\" Filleul\"&\" \"&$O2&\" \"&$P2)))","v":"Parrain client 104 Nom client 104 Prénom Filleul  "},{"$f":"YEAR($J$2)","v":2022},{"$f":"MONTH($J$2)","v":2},{"$f":"WEEKNUM($J$2,21)","v":8},{"$f":"IF(AND(L2<>\"\",M2<>\"\",I2<>\"\"),COUNTIF($I20:$I$186,I2),0)+1","v":144},{"$f":"IF(AND(L2=\"\",M2=\"\"),0,IF(I2=\"P\",COUNTIF($I$20:$I186,\"P\"),COUNTIF($L$20:$L186,$L20)-1))","v":6},{"$f":"IF(AD2=\"\",0,IF(OR(I2=\"F\",I2=\"vide\"),0,COUNTIFS($L$20:$L$186,IF($I2=\"P\",$L2,0),$AD$20:$AD$186,\"OK\")-1))","v":0},"F","2022-02-21","JEAN","client 104 Nom","client 104 Prénom",680614822,null,null,null,null,null,10500,"BLIGNICOURT",{"$f":"J2+14","v":"2022-03-07"},null,null,null,{"$f":"V2+7","v":"2022-03-14"},null,{"$f":"V2+21","v":"2022-03-28"}]
[{"$f":"IF(A2<>\"\",1,0)","v":1},1,1,1,1,{"$f":"IF(F2<>\"\",1,0)","v":1},{"$f":"IF(G2<>\"\",1,0)","v":1},{"$f":"IF(H2<>\"\",1,0)","v":1},{"$f":"IF(I2<>\"\",1,0)","v":1},1,1,{"$f":"IF(L2<>\"\",1,0)","v":1},{"$f":"IF(M2<>\"\",1,0)","v":1},1,0,0,0,{"$f":"IF(R2<>\"\",1,0)","v":0},{"$f":"IF(S2<>\"\",1,0)","v":0},1,{"$f":"IF(U2<>\"\",1,0)","v":1},null,{"$f":"IF(W2=\"\",0,1)","v":0},{"$f":"IF(X2=\"\",0,1)","v":0},{"$f":"IF(Y2=\"\",0,1)","v":0},{"$f":"IF(Y2=\"OK\",1,0)","v":0},{"$f":"IF(AA2<>\"\",1,0)","v":0},{"$f":"IF(AA2=\"OK\",1,0)","v":0},null,{"$f":"IF(AND(AB2<NOW(),AD2=\"ok\"),1,0)","v":0}]
[null,null,{"$f":"COUNTIF($I$20:$I$186,\"P\")","v":24},null,null,null,null,null,null,{"$f":"RANDBETWEEN(1,140)","v":26},{"$f":"RANDBETWEEN(1,140)","v":119},{"$f":"VLOOKUP($J$4,Base_Adresses!$A$3:$H$142,COLUMN()-10,0)","v":"client 26 Nom"},{"$f":"VLOOKUP($J$4,Base_Adresses!$A$3:$H$142,COLUMN()-10,0)","v":"client 26 Prénom"},{"$f":"VLOOKUP($J$4,Base_Adresses!$A$3:$H$142,COLUMN()-6,0)","v":635526547},{"$f":"VLOOKUP($K$4,Base_Adresses!$A$3:$H$142,COLUMN()-13,0)","v":"client 119 Nom"},{"$f":"VLOOKUP($K$4,Base_Adresses!$A$3:$H$142,COLUMN()-13,0)","v":"client 119 Prénom"},{"$f":"VLOOKUP($K$4,Base_Adresses!$A$3:$H$142,COLUMN()-9,0)","v":670840930},{"$f":"VLOOKUP($K$4,Base_Adresses!$A$3:$H$142,COLUMN()-14,0)","v":222},{"$f":"VLOOKUP($K$4,Base_Adresses!$A$3:$H$142,COLUMN()-14,0)","v":"Rue du village DCN"},{"$f":"VLOOKUP($K$4,Base_Adresses!$A$3:$H$142,COLUMN()-14,0)","v":10240},{"$f":"VLOOKUP($K$4,Base_Adresses!$A$3:$H$142,COLUMN()-14,0)","v":"AVANT LES RAMERUPT"}]
[null,null,{"$f":"COUNTIF($I$20:$I$186,\"f\")","v":143},null,null,null,null,null,null,null,null,null,null,null,null,null,null,null,null,"Résultat Phonning",{"$f":"COUNTIF($Y$20:$Y$186,\"OK\")","v":56}]
[null,null,null,null,null,null,null,null,null,{"$f":"COLUMN()","v":10},null,null,null,null,null,null,"Filleul",{"$f":"COUNTIF($I$20:$I$186,\"F\")","v":143},null,"Vente",{"$f":"COUNTIF($AA$20:$AA$186,\"OK\")","v":132}]
[null,null,null,null,null,null,null,null,null,null,null,null,null,null,null,null,null,null,null,"pose effectue",{"$f":"COUNTIF($AD$20:$AD$186,\"OK\")","v":133}]
[null,null,null,null,null,null,null,null,null,"Année",{"$f":"YEAR($L$9)","v":2022},null,null,null,null,null,null,null,"Total"]
[null,null,null,null,null,"Nb_Parrain","P",null,null,"Mois",4,{"$f":"CHOOSE(WEEKDAY(DATE(YEAR($J$2),$K$9,1),2),0,-1,-2,-3,3,2,1)+DATE(YEAR($J$2),$K$9,1)","v":"2022-04-04"},null,null,null,null,null,null,"M² mois",null,null,"OK"]
[null,null,null,null,{"$f":"K10","v":14},{"$f":"L10","v":15},16,{"$f":"O10","v":17},{"$f":"P10","v":18},"Sem. ",{"$f":"WEEKNUM(L9,21)","v":14},{"$f":"K10+1","v":15},{"$f":"L10+1","v":16},null,{"$f":"M10+1","v":17},18,null,null,{"$f":"SUM(S11:S16)","v":207},null,null,{"$f":"WEEKNUM($L$9,21)","v":14},{"$f":"V10+1","v":15},{"$f":"W10+1","v":16},{"$f":"X10+1","v":17},{"$f":"Y10+1","v":18}]
[null,null,null,null,{"$f":"COUNTIFS($D$20:$D$186,$K$9,$E$20:$E$186,E$10,$K$20:$K$186,$J11,$I$20:$I$186,$G$9)","v":0},0,0,0,0,"JEAN",{"$f":"SUMIFS($AC$20:$AC$186,$E$20:$E$186,K$10,$K$20:$K$186,$J11)","v":0},0,0,null,{"$f":"SUMIFS($AC$20:$AC$186,$E$20:$E$186,O$10,$K$20:$K$186,$J11)","v":0},0,null,{"$f":"SUMIFS($AC$20:$AC$186,$E$20:$E$186,$K$10,$K$20:$K$186,$J11)","v":0},{"$f":"SUMIFS($AC$20:$AC$186,$D$20:$D$186,$K$9,$K$20:$K$186,$J11)","v":207},null,"JEAN",{"$f":"COUNTIFS($C$20:$C$186,$K$8,$D$20:$D$186,$K$9,$E$20:$E$186,V$10,$K$20:$K$186,$U11,$Y$20:$Y$186,$V$9)","v":0},0,0,0,0]
[null,null,null,null,0,0,0,0,0,"PASCAL",0,0,0,null,0,0,null,0,0,null,"PASCAL",0,0,0,0,0]
[null,null,null,null,0,0,0,0,0,"THIERRY",0,0,0,null,0,0,null,0,0,null,"THIERRY",0,0,0,0,0]
[null,null,null,null,0,0,0,0,0,"SILVAIN",0,0,0,null,0,0,null,0,0,null,"SILVAIN",0,0,0,0,0]
[null,null,null,null,0,0,0,0,0,"ANTOINE",0,0,0,null,0,0,null,0,0,null,"ANTOINE",0,0,0,0,0]
[null,null,null,null,0,0,0,0,0,"MAXIME",0,0,0,null,0,0,null,0,0,null,"MAXIME",0,0,0,0,0,null,"Nb_Vente",{"$f":"COUNTIF(AD20:AD186,\"OK\")","v":133}]
[null,null,null,null,null,null,null,null,null,null,null,null,null,null,null,null,null,null,null,null,null,{"$f":"COUNTIFS($C$20:$C$186,$K$8,$D$20:$D$186,$K$9,$E$20:$E$186,V$10,$K$20:$K$186,#REF!,$Y$20:$Y$186,$V$9)","v":0},{"$f":"COUNTIFS($C$20:$C$186,$K$8,$D$20:$D$186,$K$9,$E$20:$E$186,W$10,$K$20:$K$186,#REF!,$Y$20:$Y$186,$V$9)","v":0},{"$f":"COUNTIFS($C$20:$C$186,$K$8,$D$20:$D$186,$K$9,$E$20:$E$186,X$10,$K$20:$K$186,#REF!,$Y$20:$Y$186,$V$9)","v":0},{"$f":"COUNTIFS($C$20:$C$186,$K$8,$D$20:$D$186,$K$9,$E$20:$E$186,Y$10,$K$20:$K$186,#REF!,$Y$20:$Y$186,$V$9)","v":0},{"$f":"COUNTIFS($C$20:$C$186,$K$8,$D$20:$D$186,$K$9,$E$20:$E$186,Z$10,$K$20:$K$186,#REF!,$Y$20:$Y$186,$V$9)","v":0},null,"Moyenne",{"$f":"AC18/AC16","v":154.46616541353384}]
[{"$f":"IF($K18=\"\",0,$C$2&\"_\"&E18&\"_C\"&VLOOKUP(K18,Grand_Est!$I$20:$J$34,2,0)&\"_P_\"&COUNTIF($I18:$I$186,\"P\")&\"_\"&IF(I18=\"F\",\"F\"&COUNTIF($I18:$I$186,\"F\"),\"000\"))","v":0},{"$f":"IF(I18=\"vide\",0,IF($I18=\"P\",\"Parrain\"&\" \"&$L18&\" \"&$M18,IF($I18=\"F\",\"Parrain\"&\" \"&$L18&\" \"&$M18&\" Filleul\"&\" \"&$O18&\" \"&$P18)))","v":false},2022,3,11,{"$f":"IF(AND(L18<>\"\",M18<>\"\",I18<>\"\"),COUNTIF($I18:$I$20,I18),0)","v":0},{"$f":"IF(AND(L18=\"\",M18=\"\"),0,IF(I18=\"P\",COUNTIF($I18:$I$20,\"P\"),COUNTIF($L18:$L$20,$L18)-1))","v":0},{"$f":"IF($I18=\"P\",COUNTIFS($AD$20:$AD$186,\"ok\",$L$20:$L$186,$L18,$M$20:$M$186,$M18)-1,0)","v":0},null,null,null,null,null,null,null,null,null,null,null,null,null,null,null,null,null,null,null,"Total",{"$f":"SUM(AC20:AC198)","v":20544}]
["Code","Nom Parrain\nFilleul ","Année","MOIS","Sem","N°-Parrain\nN°- filleul","Num Filleul","Parrain\nNb. filleul","Parrain\nfilleul","Date","Commercial","nom\nParrain","prénom\nParrain","Téléphone\nParrain","nom\nFilleul","Prénom\nFilleul","Téléphone\nFilleul","N°- Rue","Nom Rue","CP","Commune","Date\n Phonning","relance1","relance2","Résultat\nPhonning","date/rdv client","Vente","date de pose","Pose en M²","pose effectue"]
[{"$f":"IF($K20=\"\",0,$C20&\"_\"&$E20&\"_C\"&VLOOKUP($K20,Grand_Est!$I$20:$J$34,2,0)&\"_P_\"&COUNTIF($I20:$I$20,\"P\")&\"_\"&IF(I20=\"F\",\"F\"&COUNTIF($I20:$I$20,\"F\"),\"000\"))","v":"2022_5_C1_P_1_000"},{"$f":"IF(I20=\"vide\",0,IF($I20=\"P\",\"Parrain\"&\" \"&$L20&\" \"&$M20,IF($I20=\"F\",\"Parrain\"&\" \"&$L20&\" \"&$M20&\" Filleul\"&\" \"&$O20&\" \"&$P20)))","v":"Parrain client 139 Nom client 139 Prénom"},{"$f":"YEAR($J$2)","v":2022},{"$f":"MONTH($J20)","v":2},{"$f":"WEEKNUM($J20,21)","v":5},{"$f":"IF(AND(L20<>\"\",M20<>\"\",I20<>\"\"),COUNTIF($I20:$I$20,I20),0)","v":1},{"$f":"IF(AND(L20=\"\",M20=\"\"),0,IF(I20=\"P\",COUNTIF($I20:$I$20,\"P\"),COUNTIF($L20:$L$20,$L20)-1))","v":1},{"$f":"IF($I20=\"P\",COUNTIFS($AD$20:$AD$186,\"ok\",$L$20:$L$186,$L20,$M$20:$M$186,$M20)-1,0)","v":5},"P","2022-02-01","JEAN","client 139 Nom","client 139 Prénom",660546033,null,null,null,38,"Rue du village BU",10500,"LASSICOURT","2022-01-15","Nok","nok","ok","2022-03-02","ok","2022-03-06",160,"Ok"]
[{"$f":"IF($K21=\"\",0,$C21&\"_\"&$E21&\"_C\"&VLOOKUP($K21,Grand_Est!$I$20:$J$34,2,0)&\"_P_\"&COUNTIF($I$20:$I21,\"P\")&\"_\"&IF(I21=\"F\",\"F\"&COUNTIF($I$20:$I21,\"F\"),\"000\"))","v":"2022_5_C1_P_1_F1"},{"$f":"IF(I21=\"vide\",0,IF($I21=\"P\",\"Parrain\"&\" \"&$L21&\" \"&$M21,IF($I21=\"F\",\"Parrain\"&\" \"&$L21&\" \"&$M21&\" Filleul\"&\" \"&$O21&\" \"&$P21)))","v":"Parrain client 139 Nom client 139 Prénom Filleul client 81 Nom client 81 Prénom"},{"$f":"YEAR($J$2)","v":2022},{"$f":"MONTH($J21)","v":2},{"$f":"WEEKNUM($J21,21)","v":5},{"$f":"IF(AND(L21<>\"\",M21<>\"\",I21<>\"\"),COUNTIF($I$20:$I21,I21),0)","v":1},{"$f":"IF(AND(L21=\"\",M21=\"\"),0,IF(I21=\"P\",COUNTIF($I$20:$I21,\"P\"),COUNTIF($L$20:$L21,$L21)-1))","v":1},0,"F","2022-02-01","JEAN","client 139 Nom","client 139 Prénom",660546033,"client 81 Nom","client 81 Prénom",620781576,146,"Rue du village CB",10500,"PERTHES LES BRIENNE","2022-01-15","Nok","nok","ok","2022-03-02","ok","2022-03-06",160,"Ok"]
[{"$f":"IF($K22=\"\",0,$C22&\"_\"&$E22&\"_C\"&VLOOKUP($K22,Grand_Est!$I$20:$J$34,2,0)&\"_P_\"&COUNTIF($I$20:$I22,\"P\")&\"_\"&IF(I22=\"F\",\"F\"&COUNTIF($I$20:$I22,\"F\"),\"000\"))","v":"2022_5_C1_P_1_F2"},"Parrain client 139 Nom client 139 Prénom Filleul client 63 Nom client 63 Prénom",2022,2,5,{"$f":"IF(AND(L22<>\"\",M22<>\"\",I22<>\"\"),COUNTIF($I$20:$I22,I22),0)","v":2},{"$f":"IF(AND(L22=\"\",M22=\"\"),0,IF(I22=\"P\",COUNTIF($I$20:$I22,\"P\"),COUNTIF($L$20:$L22,$L22)-1))","v":2},0,"F","2022-02-01","JEAN","client 139 Nom","client 139 Prénom",660546033,"client 63 Nom","client 63 Prénom",626583590,136,"Rue du village BJ",10500,"CHAUMESNIL","2022-01-15","Nok","ok",null,"2022-03-02","ok","2022-03-06",160,"Ok"]
[{"$f":"IF($K23=\"\",0,$C23&\"_\"&$E23&\"_C\"&VLOOKUP($K23,Grand_Est!$I$20:$J$34,2,0)&\"_P_\"&COUNTIF($I$20:$I23,\"P\")&\"_\"&IF(I23=\"F\",\"F\"&COUNTIF($I$20:$I23,\"F\"),\"000\"))","v":"2022_5_C1_P_1_F3"},"Parrain client 139 Nom client 139 Prénom Filleul client 86 Nom client 86 Prénom",2022,2,5,{"$f":"IF(AND(L23<>\"\",M23<>\"\",I23<>\"\"),COUNTIF($I$20:$I23,I23),0)","v":3},{"$f":"IF(AND(L23=\"\",M23=\"\"),0,IF(I23=\"P\",COUNTIF($I$20:$I23,\"P\"),COUNTIF($L$20:$L23,$L23)-1))","v":3},0,"F","2022-02-01","JEAN","client 139 Nom","client 139 Prénom",660546033,"client 86 Nom","client 86 Prénom",673909860,213,"Rue du village CG",10500,"RANCES","2022-01-15","Nok","ok",null,"2022-03-02","ok","2022-03-06",160,"Ok"]
[{"$f":"IF($K24=\"\",0,$C24&\"_\"&$E24&\"_C\"&VLOOKUP($K24,Grand_Est!$I$20:$J$34,2,0)&\"_P_\"&COUNTIF($I$20:$I24,\"P\")&\"_\"&IF(I24=\"F\",\"F\"&COUNTIF($I$20:$I24,\"F\"),\"000\"))","v":"2022_5_C1_P_1_F4"},"Parrain client 139 Nom client 139 Prénom Filleul client 92 Nom client 92 Prénom",2022,2,5,{"$f":"IF(AND(L24<>\"\",M24<>\"\",I24<>\"\"),COUNTIF($I$20:$I24,I24),0)","v":4},{"$f":"IF(AND(L24=\"\",M24=\"\"),0,IF(I24=\"P\",COUNTIF($I$20:$I24,\"P\"),COUNTIF($L$20:$L24,$L24)-1))","v":4},0,"F","2022-02-01","JEAN","client 139 Nom","client 139 Prénom",660546033,"client 92 Nom","client 92 Prénom",688315052,79,"Rue du village CM",10400,"AVANT LES MARCILLY","2022-01-15","Nok","nok","nok",null,"Nok",null,null,"NoK"]
[{"$f":"IF($K25=\"\",0,$C25&\"_\"&$E25&\"_C\"&VLOOKUP($K25,Grand_Est!$I$20:$J$34,2,0)&\"_P_\"&COUNTIF($I$20:$I25,\"P\")&\"_\"&IF(I25=\"F\",\"F\"&COUNTIF($I$20:$I25,\"F\"),\"000\"))","v":"2022_5_C1_P_1_F5"},"Parrain client 139 Nom client 139 Prénom Filleul client 35 Nom client 35 Prénom",2022,2,5,{"$f":"IF(AND(L25<>\"\",M25<>\"\",I25<>\"\"),COUNTIF($I$20:$I25,I25),0)","v":5},{"$f":"IF(AND(L25=\"\",M25=\"\"),0,IF(I25=\"P\",COUNTIF($I$20:$I25,\"P\"),COUNTIF($L$20:$L25,$L25)-1))","v":5},0,"F","2022-02-01","JEAN","client 139 Nom","client 139 Prénom",660546033,"client 35 Nom","client 35 Prénom",648803279,179,"Rue du village AH",10340,"BAGNEUX LA FOSSE","2022-01-15","Nok","ok",null,"2022-03-02","ok","2022-03-06",160,"Ok"]
[{"$f":"IF($K26=\"\",0,$C26&\"_\"&$E26&\"_C\"&VLOOKUP($K26,Grand_Est!$I$20:$J$34,2,0)&\"_P_\"&COUNTIF($I$20:$I26,\"P\")&\"_\"&IF(I26=\"F\",\"F\"&COUNTIF($I$20:$I26,\"F\"),\"000\"))","v":"2022_5_C1_P_1_F6"},"Parrain client 139 Nom client 139 Prénom Filleul client 98 Nom client 98 Prénom",2022,2,5,{"$f":"IF(AND(L26<>\"\",M26<>\"\",I26<>\"\"),COUNTIF($I$20:$I26,I26),0)","v":6},{"$f":"IF(AND(L26=\"\",M26=\"\"),0,IF(I26=\"P\",COUNTIF($I$20:$I26,\"P\"),COUNTIF($L$20:$L26,$L26)-1))","v":6},0,"F","2022-02-01","JEAN","client 139 Nom","client 139 Prénom",660546033,"client 98 Nom","client 98 Prénom",677819310,166,"Rue du village CS",10400,"FONTAINE MACON","2022-01-15","Nok","ok",null,"2022-03-02","ok","2022-03-06",160,"Ok"]
[{"$f":"IF($K27=\"\",0,$C27&\"_\"&$E27&\"_C\"&VLOOKUP($K27,Grand_Est!$I$20:$J$34,2,0)&\"_P_\"&COUNTIF($I$20:$I27,\"P\")&\"_\"&IF(I27=\"F\",\"F\"&COUNTIF($I$20:$I27,\"F\"),\"000\"))","v":"2022_5_C2_P_2_000"},"Parrain client 54 Nom client 54 Prénom",2022,2,5,{"$f":"IF(AND(L27<>\"\",M27<>\"\",I27<>\"\"),COUNTIF($I$20:$I27,I27),0)","v":2},{"$f":"IF(AND(L27=\"\",M27=\"\"),0,IF(I27=\"P\",COUNTIF($I$20:$I27,\"P\"),COUNTIF($L$20:$L27,$L27)-1))","v":2},5,"P","2022-02-01","PASCAL","client 54 Nom","client 54 Prénom",619306489,null,null,null,114,"Rue du village BO",10500,"EPOTHEMONT","2022-01-15","Nok","ok",null,"2022-03-02","ok","2022-03-06",200,"Ok"]
[{"$f":"IF($K28=\"\",0,$C28&\"_\"&$E28&\"_C\"&VLOOKUP($K28,Grand_Est!$I$20:$J$34,2,0)&\"_P_\"&COUNTIF($I$20:$I28,\"P\")&\"_\"&IF(I28=\"F\",\"F\"&COUNTIF($I$20:$I28,\"F\"),\"000\"))","v":"2022_5_C2_P_2_F7"},"Parrain client 54 Nom client 54 Prénom Filleul client 89 Nom client 89 Prénom",2022,2,5,{"$f":"IF(AND(L28<>\"\",M28<>\"\",I28<>\"\"),COUNTIF($I$20:$I28,I28),0)","v":7},{"$f":"IF(AND(L28=\"\",M28=\"\"),0,IF(I28=\"P\",COUNTIF($I$20:$I28,\"P\"),COUNTIF($L$20:$L28,$L28)-1))","v":1},0,"F","2022-02-01","PASCAL","client 54 Nom","client 54 Prénom",619306489,"client 89 Nom","client 89 Prénom",671364202,133,"Rue du village CJ",10500,"ST LEGER SOUS BRIENNE","2022-01-15","Nok","ok",null,"2022-03-02","ok","2022-03-06",160,"Ok"]
[{"$f":"IF($K29=\"\",0,$C29&\"_\"&$E29&\"_C\"&VLOOKUP($K29,Grand_Est!$I$20:$J$34,2,0)&\"_P_\"&COUNTIF($I$20:$I29,\"P\")&\"_\"&IF(I29=\"F\",\"F\"&COUNTIF($I$20:$I29,\"F\"),\"000\"))","v":"2022_5_C2_P_2_F8"},"Parrain client 54 Nom client 54 Prénom Filleul client 96 Nom client 96 Prénom",2022,2,5,{"$f":"IF(AND(L29<>\"\",M29<>\"\",I29<>\"\"),COUNTIF($I$20:$I29,I29),0)","v":8},{"$f":"IF(AND(L29=\"\",M29=\"\"),0,IF(I29=\"P\",COUNTIF($I$20:$I29,\"P\"),COUNTIF($L$20:$L29,$L29)-1))","v":2},0,"F","2022-02-01","PASCAL","client 54 Nom","client 54 Prénom",619306489,"client 96 Nom","client 96 Prénom",660482562,46,"Rue du village CQ",10400,"COURTAVANT","2022-03-07","Nok","nok","ok","2022-03-10","ok",null,160,"Ok"]
[{"$f":"IF($K30=\"\",0,$C30&\"_\"&$E30&\"_C\"&VLOOKUP($K30,Grand_Est!$I$20:$J$34,2,0)&\"_P_\"&COUNTIF($I$20:$I30,\"P\")&\"_\"&IF(I30=\"F\",\"F\"&COUNTIF($I$20:$I30,\"F\"),\"000\"))","v":"2022_5_C2_P_2_F9"},"Parrain client 54 Nom client 54 Prénom Filleul client 26 Nom client 26 Prénom",2022,2,5,{"$f":"IF(AND(L30<>\"\",M30<>\"\",I30<>\"\"),COUNTIF($I$20:$I30,I30),0)","v":9},{"$f":"IF(AND(L30=\"\",M30=\"\"),0,IF(I30=\"P\",COUNTIF($I$20:$I30,\"P\"),COUNTIF($L$20:$L30,$L30)-1))","v":3},0,"F","2022-02-01","PASCAL","client 54 Nom","client 54 Prénom",619306489,"client 26 Nom","client 26 Prénom",635526547,13,"Rue du village Y",10130,"CHAMOY","2022-03-07","Nok","nok","nok",null,"Nok",null,null,"NoK"]
[{"$f":"IF($K31=\"\",0,$C31&\"_\"&$E31&\"_C\"&VLOOKUP($K31,Grand_Est!$I$20:$J$34,2,0)&\"_P_\"&COUNTIF($I$20:$I31,\"P\")&\"_\"&IF(I31=\"F\",\"F\"&COUNTIF($I$20:$I31,\"F\"),\"000\"))","v":"2022_5_C2_P_2_F10"},"Parrain client 54 Nom client 54 Prénom Filleul client 111 Nom client 111 Prénom",2022,2,5,{"$f":"IF(AND(L31<>\"\",M31<>\"\",I31<>\"\"),COUNTIF($I$20:$I31,I31),0)","v":10},{"$f":"IF(AND(L31=\"\",M31=\"\"),0,IF(I31=\"P\",COUNTIF($I$20:$I31,\"P\"),COUNTIF($L$20:$L31,$L31)-1))","v":4},0,"F","2022-02-01","PASCAL","client 54 Nom","client 54 Prénom",619306489,"client 111 Nom","client 111 Prénom",698959546,227,"Rue du village DCF",10400,"PONT SUR SEINE","2022-03-07","Nok","nok","ok","2022-03-12","ok","2022-03-07",160,"Ok"]
[{"$f":"IF($K32=\"\",0,$C32&\"_\"&$E32&\"_C\"&VLOOKUP($K32,Grand_Est!$I$20:$J$34,2,0)&\"_P_\"&COUNTIF($I$20:$I32,\"P\")&\"_\"&IF(I32=\"F\",\"F\"&COUNTIF($I$20:$I32,\"F\"),\"000\"))","v":"2022_5_C2_P_2_F11"},"Parrain client 54 Nom client 54 Prénom Filleul client 26 Nom client 26 Prénom",2022,2,5,{"$f":"IF(AND(L32<>\"\",M32<>\"\",I32<>\"\"),COUNTIF($I$20:$I32,I32),0)","v":11},{"$f":"IF(AND(L32=\"\",M32=\"\"),0,IF(I32=\"P\",COUNTIF($I$20:$I32,\"P\"),COUNTIF($L$20:$L32,$L32)-1))","v":5},0,"F","2022-02-01","PASCAL","client 54 Nom","client 54 Prénom",619306489,"client 26 Nom","client 26 Prénom",635526547,13,"Rue du village Y",10130,"CHAMOY","2022-03-07","Nok","nok","ok","2022-03-13","ok","2022-03-08",160,"Ok"]
[{"$f":"IF($K33=\"\",0,$C33&\"_\"&$E33&\"_C\"&VLOOKUP($K33,Grand_Est!$I$20:$J$34,2,0)&\"_P_\"&COUNTIF($I$20:$I33,\"P\")&\"_\"&IF(I33=\"F\",\"F\"&COUNTIF($I$20:$I33,\"F\"),\"000\"))","v":"2022_5_C2_P_2_F12"},"Parrain client 54 Nom client 54 Prénom Filleul client 109 Nom client 109 Prénom",2022,2,5,{"$f":"IF(AND(L33<>\"\",M33<>\"\",I33<>\"\"),COUNTIF($I$20:$I33,I33),0)","v":12},{"$f":"IF(AND(L33=\"\",M33=\"\"),0,IF(I33=\"P\",COUNTIF($I$20:$I33,\"P\"),COUNTIF($L$20:$L33,$L33)-1))","v":6},0,"F","2022-02-01","PASCAL","client 54 Nom","client 54 Prénom",619306489,"client 109 Nom","client 109 Prénom",621985486,174,"Rue du village DCD",10400,"PERIGNY LA ROSE","2022-03-07","Nok","nok","ok","2022-03-14","ok","2022-03-09",160,"Ok"]
[{"$f":"IF($K34=\"\",0,$C34&\"_\"&$E34&\"_C\"&VLOOKUP($K34,Grand_Est!$I$20:$J$34,2,0)&\"_P_\"&COUNTIF($I$20:$I34,\"P\")&\"_\"&IF(I34=\"F\",\"F\"&COUNTIF($I$20:$I34,\"F\"),\"000\"))","v":"2022_5_C3_P_3_000"},"Parrain client 74 Nom client 74 Prénom",2022,2,5,{"$f":"IF(AND(L34<>\"\",M34<>\"\",I34<>\"\"),COUNTIF($I$20:$I34,I34),0)","v":3},{"$f":"IF(AND(L34=\"\",M34=\"\"),0,IF(I34=\"P\",COUNTIF($I$20:$I34,\"P\"),COUNTIF($L$20:$L34,$L34)-1))","v":3},4,"P","2022-02-01","THIERRY","client 74 Nom","client 74 Prénom",667259016,null,null,null,34,"Rue du village CO",10400,"BOUY SUR ORVIN","2022-03-07","Nok","ok",null,"2022-03-15","ok","2022-03-10",190,"Ok"]
[{"$f":"IF($K35=\"\",0,$C35&\"_\"&$E35&\"_C\"&VLOOKUP($K35,Grand_Est!$I$20:$J$34,2,0)&\"_P_\"&COUNTIF($I$20:$I35,\"P\")&\"_\"&IF(I35=\"F\",\"F\"&COUNTIF($I$20:$I35,\"F\"),\"000\"))","v":"2022_5_C3_P_3_F13"},"Parrain client 74 Nom client 74 Prénom Filleul client 78 Nom client 78 Prénom",2022,2,5,{"$f":"IF(AND(L35<>\"\",M35<>\"\",I35<>\"\"),COUNTIF($I$20:$I35,I35),0)","v":13},{"$f":"IF(AND(L35=\"\",M35=\"\"),0,IF(I35=\"P\",COUNTIF($I$20:$I35,\"P\"),COUNTIF($L$20:$L35,$L35)-1))","v":1},0,"F","2022-02-01","THIERRY","client 74 Nom","client 74 Prénom",667259016,"client 78 Nom","client 78 Prénom",690947261,94,"Rue du village BY",10500,"MOLINS SUR AUBE",null,"Nok","ok",null,"2022-03-02","ok","2022-03-11",250,"Ok"]
[{"$f":"IF($K36=\"\",0,$C36&\"_\"&$E36&\"_C\"&VLOOKUP($K36,Grand_Est!$I$20:$J$34,2,0)&\"_P_\"&COUNTIF($I$20:$I36,\"P\")&\"_\"&IF(I36=\"F\",\"F\"&COUNTIF($I$20:$I36,\"F\"),\"000\"))","v":"2022_5_C3_P_3_F14"},"Parrain client 74 Nom client 74 Prénom Filleul client 11 Nom client 11 Prénom",2022,2,5,{"$f":"IF(AND(L36<>\"\",M36<>\"\",I36<>\"\"),COUNTIF($I$20:$I36,I36),0)","v":14},{"$f":"IF(AND(L36=\"\",M36=\"\"),0,IF(I36=\"P\",COUNTIF($I$20:$I36,\"P\"),COUNTIF($L$20:$L36,$L36)-1))","v":2},0,"F","2022-02-01","THIERRY","client 74 Nom","client 74 Prénom",667259016,"client 11 Nom","client 11 Prénom",688080821,40,"Rue du village J",10100,"ST LOUP DE BUFFIGNY",null,"Nok","ok",null,"2022-03-02","ok","2022-03-12",140,"Ok"]
[{"$f":"IF($K37=\"\",0,$C37&\"_\"&$E37&\"_C\"&VLOOKUP($K37,Grand_Est!$I$20:$J$34,2,0)&\"_P_\"&COUNTIF($I$20:$I37,\"P\")&\"_\"&IF(I37=\"F\",\"F\"&COUNTIF($I$20:$I37,\"F\"),\"000\"))","v":"2022_5_C3_P_3_F15"},"Parrain client 74 Nom client 74 Prénom Filleul client 11 Nom client 11 Prénom",2022,2,5,{"$f":"IF(AND(L37<>\"\",M37<>\"\",I37<>\"\"),COUNTIF($I$20:$I37,I37),0)","v":15},{"$f":"IF(AND(L37=\"\",M37=\"\"),0,IF(I37=\"P\",COUNTIF($I$20:$I37,\"P\"),COUNTIF($L$20:$L37,$L37)-1))","v":3},0,"F","2022-02-01","THIERRY","client 74 Nom","client 74 Prénom",667259016,"client 11 Nom","client 11 Prénom",688080821,40,"Rue du village J",10100,"ST LOUP DE BUFFIGNY",null,"Nok","ok",null,"2022-03-02","ok","2022-03-13",200,"Ok"]
[{"$f":"IF($K38=\"\",0,$C38&\"_\"&$E38&\"_C\"&VLOOKUP($K38,Grand_Est!$I$20:$J$34,2,0)&\"_P_\"&COUNTIF($I$20:$I38,\"P\")&\"_\"&IF(I38=\"F\",\"F\"&COUNTIF($I$20:$I38,\"F\"),\"000\"))","v":"2022_5_C3_P_3_F16"},"Parrain client 74 Nom client 74 Prénom Filleul client 20 Nom client 20 Prénom",2022,2,5,{"$f":"IF(AND(L38<>\"\",M38<>\"\",I38<>\"\"),COUNTIF($I$20:$I38,I38),0)","v":16},{"$f":"IF(AND(L38=\"\",M38=\"\"),0,IF(I38=\"P\",COUNTIF($I$20:$I38,\"P\"),COUNTIF($L$20:$L38,$L38)-1))","v":4},0,"F","2022-02-01","THIERRY","client 74 Nom","client 74 Prénom",667259016,"client 20 Nom","client 20 Prénom",643941973,36,"Rue du village S",10600,"ST LYE","2022-03-07","Nok","ok",null,"2022-03-02","ok","2022-03-14",180,"Ok"]
[{"$f":"IF($K39=\"\",0,$C39&\"_\"&$E39&\"_C\"&VLOOKUP($K39,Grand_Est!$I$20:$J$34,2,0)&\"_P_\"&COUNTIF($I$20:$I39,\"P\")&\"_\"&IF(I39=\"F\",\"F\"&COUNTIF($I$20:$I39,\"F\"),\"000\"))","v":"2022_5_C3_P_3_F17"},"Parrain client 74 Nom client 74 Prénom Filleul client 19 Nom client 19 Prénom",2022,2,5,{"$f":"IF(AND(L39<>\"\",M39<>\"\",I39<>\"\"),COUNTIF($I$20:$I39,I39),0)","v":17},{"$f":"IF(AND(L39=\"\",M39=\"\"),0,IF(I39=\"P\",COUNTIF($I$20:$I39,\"P\"),COUNTIF($L$20:$L39,$L39)-1))","v":5},0,"F","2022-02-01","THIERRY","client 74 Nom","client 74 Prénom",667259016,"client 19 Nom","client 19 Prénom",651189811,39,"Rue du village R",10600,"ST BENOIT SUR SEINE","2022-03-07","Nok","nok","ok",null,"Nok","2022-03-15",null,"NoK"]
[{"$f":"IF($K40=\"\",0,$C40&\"_\"&$E40&\"_C\"&VLOOKUP($K40,Grand_Est!$I$20:$J$34,2,0)&\"_P_\"&COUNTIF($I$20:$I40,\"P\")&\"_\"&IF(I40=\"F\",\"F\"&COUNTIF($I$20:$I40,\"F\"),\"000\"))","v":"2022_5_C4_P_4_000"},"Parrain client 56 Nom client 56 Prénom",2022,2,5,{"$f":"IF(AND(L40<>\"\",M40<>\"\",I40<>\"\"),COUNTIF($I$20:$I40,I40),0)","v":4},{"$f":"IF(AND(L40=\"\",M40=\"\"),0,IF(I40=\"P\",COUNTIF($I$20:$I40,\"P\"),COUNTIF($L$20:$L40,$L40)-1))","v":4},5,"P","2022-02-01","SILVAIN","client 56 Nom","client 56 Prénom",664272545,null,null,null,97,"Rue du village BS",10500,"LA ROTHIERE",null,"Nok","ok",null,"2022-03-02","Ok","2022-03-16",160,"Ok"]
[{"$f":"IF($K41=\"\",0,$C41&\"_\"&$E41&\"_C\"&VLOOKUP($K41,Grand_Est!$I$20:$J$34,2,0)&\"_P_\"&COUNTIF($I$20:$I41,\"P\")&\"_\"&IF(I41=\"F\",\"F\"&COUNTIF($I$20:$I41,\"F\"),\"000\"))","v":"2022_5_C4_P_4_F18"},"Parrain client 56 Nom client 56 Prénom Filleul client 78 Nom client 78 Prénom",2022,2,5,{"$f":"IF(AND(L41<>\"\",M41<>\"\",I41<>\"\"),COUNTIF($I$20:$I41,I41),0)","v":18},{"$f":"IF(AND(L41=\"\",M41=\"\"),0,IF(I41=\"P\",COUNTIF($I$20:$I41,\"P\"),COUNTIF($L$20:$L41,$L41)-1))","v":1},0,"F","2022-02-01","SILVAIN","client 56 Nom","client 56 Prénom",664272545,"client 78 Nom","client 78 Prénom",690947261,94,"Rue du village BY",10500,"MOLINS SUR AUBE",null,"Nok","ok",null,"2022-03-02","Ok","2022-03-17",160,"Ok"]
[{"$f":"IF($K42=\"\",0,$C42&\"_\"&$E42&\"_C\"&VLOOKUP($K42,Grand_Est!$I$20:$J$34,2,0)&\"_P_\"&COUNTIF($I$20:$I42,\"P\")&\"_\"&IF(I42=\"F\",\"F\"&COUNTIF($I$20:$I42,\"F\"),\"000\"))","v":"2022_5_C4_P_4_F19"},"Parrain client 56 Nom client 56 Prénom Filleul client 96 Nom client 96 Prénom",2022,2,5,{"$f":"IF(AND(L42<>\"\",M42<>\"\",I42<>\"\"),COUNTIF($I$20:$I42,I42),0)","v":19},{"$f":"IF(AND(L42=\"\",M42=\"\"),0,IF(I42=\"P\",COUNTIF($I$20:$I42,\"P\"),COUNTIF($L$20:$L42,$L42)-1))","v":2},0,"F","2022-02-01","SILVAIN","client 56 Nom","client 56 Prénom",664272545,"client 96 Nom","client 96 Prénom",660482562,46,"Rue du village CQ",10400,"COURTAVANT",null,"Nok","ok",null,"2022-03-02","Ok","2022-03-18",160,"Ok"]
[{"$f":"IF($K43=\"\",0,$C43&\"_\"&$E43&\"_C\"&VLOOKUP($K43,Grand_Est!$I$20:$J$34,2,0)&\"_P_\"&COUNTIF($I$20:$I43,\"P\")&\"_\"&IF(I43=\"F\",\"F\"&COUNTIF($I$20:$I43,\"F\"),\"000\"))","v":"2022_5_C4_P_4_F20"},"Parrain client 56 Nom client 56 Prénom Filleul client 89 Nom client 89 Prénom",2022,2,5,{"$f":"IF(AND(L43<>\"\",M43<>\"\",I43<>\"\"),COUNTIF($I$20:$I43,I43),0)","v":20},{"$f":"IF(AND(L43=\"\",M43=\"\"),0,IF(I43=\"P\",COUNTIF($I$20:$I43,\"P\"),COUNTIF($L$20:$L43,$L43)-1))","v":3},0,"F","2022-02-01","SILVAIN","client 56 Nom","client 56 Prénom",664272545,"client 89 Nom","client 89 Prénom",671364202,133,"Rue du village CJ",10500,"ST LEGER SOUS BRIENNE",null,"Nok","ok",null,"2022-03-02","Nok",null,null,"NoK"]
[{"$f":"IF($K44=\"\",0,$C44&\"_\"&$E44&\"_C\"&VLOOKUP($K44,Grand_Est!$I$20:$J$34,2,0)&\"_P_\"&COUNTIF($I$20:$I44,\"P\")&\"_\"&IF(I44=\"F\",\"F\"&COUNTIF($I$20:$I44,\"F\"),\"000\"))","v":"2022_5_C4_P_4_F21"},"Parrain client 56 Nom client 56 Prénom Filleul client 9 Nom client 9 Prénom",2022,2,5,{"$f":"IF(AND(L44<>\"\",M44<>\"\",I44<>\"\"),COUNTIF($I$20:$I44,I44),0)","v":21},{"$f":"IF(AND(L44=\"\",M44=\"\"),0,IF(I44=\"P\",COUNTIF($I$20:$I44,\"P\"),COUNTIF($L$20:$L44,$L44)-1))","v":4},0,"F","2022-02-01","SILVAIN","client 56 Nom","client 56 Prénom",664272545,"client 9 Nom","client 9 Prénom",644465218,27,"Rue du village H",10100,"ROMILLY SUR SEINE",null,"Nok","ok",null,"2022-03-02","Ok","2022-03-20",160,"Ok"]
[{"$f":"IF($K45=\"\",0,$C45&\"_\"&$E45&\"_C\"&VLOOKUP($K45,Grand_Est!$I$20:$J$34,2,0)&\"_P_\"&COUNTIF($I$20:$I45,\"P\")&\"_\"&IF(I45=\"F\",\"F\"&COUNTIF($I$20:$I45,\"F\"),\"000\"))","v":"2022_5_C4_P_4_F22"},"Parrain client 56 Nom client 56 Prénom Filleul client 122 Nom client 122 Prénom",2022,2,5,{"$f":"IF(AND(L45<>\"\",M45<>\"\",I45<>\"\"),COUNTIF($I$20:$I45,I45),0)","v":22},{"$f":"IF(AND(L45=\"\",M45=\"\"),0,IF(I45=\"P\",COUNTIF($I$20:$I45,\"P\"),COUNTIF($L$20:$L45,$L45)-1))","v":5},0,"F","2022-02-01","SILVAIN","client 56 Nom","client 56 Prénom",664272545,"client 122 Nom","client 122 Prénom",664654982,142,"Rue du village DCQ",10240,"COCLOIS",null,"Nok","ok",null,"2022-03-02","Ok","2022-03-21",160,"Ok"]
[{"$f":"IF($K46=\"\",0,$C46&\"_\"&$E46&\"_C\"&VLOOKUP($K46,Grand_Est!$I$20:$J$34,2,0)&\"_P_\"&COUNTIF($I$20:$I46,\"P\")&\"_\"&IF(I46=\"F\",\"F\"&COUNTIF($I$20:$I46,\"F\"),\"000\"))","v":"2022_5_C4_P_4_F23"},"Parrain client 56 Nom client 56 Prénom Filleul client 43 Nom client 43 Prénom",2022,2,5,{"$f":"IF(AND(L46<>\"\",M46<>\"\",I46<>\"\"),COUNTIF($I$20:$I46,I46),0)","v":23},{"$f":"IF(AND(L46=\"\",M46=\"\"),0,IF(I46=\"P\",COUNTIF($I$20:$I46,\"P\"),COUNTIF($L$20:$L46,$L46)-1))","v":6},0,"F","2022-02-01","SILVAIN","client 56 Nom","client 56 Prénom",664272545,"client 43 Nom","client 43 Prénom",648935512,43,"Rue du village AP",10410,"BELLEY",null,"Nok","nok","ok","2022-03-02","Ok","2022-03-22",160,"Ok"]
[{"$f":"IF($K47=\"\",0,$C47&\"_\"&$E47&\"_C\"&VLOOKUP($K47,Grand_Est!$I$20:$J$34,2,0)&\"_P_\"&COUNTIF($I$20:$I47,\"P\")&\"_\"&IF(I47=\"F\",\"F\"&COUNTIF($I$20:$I47,\"F\"),\"000\"))","v":"2022_5_C5_P_5_000"},"Parrain client 94 Nom client 94 Prénom",2022,2,5,{"$f":"IF(AND(L47<>\"\",M47<>\"\",I47<>\"\"),COUNTIF($I$20:$I47,I47),0)","v":5},{"$f":"IF(AND(L47=\"\",M47=\"\"),0,IF(I47=\"P\",COUNTIF($I$20:$I47,\"P\"),COUNTIF($L$20:$L47,$L47)-1))","v":5},6,"P","2022-02-01","ANTOINE","client 94 Nom","client 94 Prénom",611157827,null,null,null,190,"Rue du village DCA",10400,"MARNAY SUR SEINE",null,"Nok","ok",null,"2022-03-02","Ok","2022-03-23",160,"Ok"]
[{"$f":"IF($K48=\"\",0,$C48&\"_\"&$E48&\"_C\"&VLOOKUP($K48,Grand_Est!$I$20:$J$34,2,0)&\"_P_\"&COUNTIF($I$20:$I48,\"P\")&\"_\"&IF(I48=\"F\",\"F\"&COUNTIF($I$20:$I48,\"F\"),\"000\"))","v":"2022_5_C5_P_5_F24"},"Parrain client 94 Nom client 94 Prénom Filleul client 102 Nom client 102 Prénom",2022,2,5,{"$f":"IF(AND(L48<>\"\",M48<>\"\",I48<>\"\"),COUNTIF($I$20:$I48,I48),0)","v":24},{"$f":"IF(AND(L48=\"\",M48=\"\"),0,IF(I48=\"P\",COUNTIF($I$20:$I48,\"P\"),COUNTIF($L$20:$L48,$L48)-1))","v":1},0,"F","2022-02-01","ANTOINE","client 94 Nom","client 94 Prénom",611157827,"client 102 Nom","client 102 Prénom",670203892,87,"Rue du village CW",10400,"LA MOTTE TILLY",null,"Nok","ok",null,"2022-03-02","Ok","2022-03-24",160,"Ok"]
[{"$f":"IF($K49=\"\",0,$C49&\"_\"&$E49&\"_C\"&VLOOKUP($K49,Grand_Est!$I$20:$J$34,2,0)&\"_P_\"&COUNTIF($I$20:$I49,\"P\")&\"_\"&IF(I49=\"F\",\"F\"&COUNTIF($I$20:$I49,\"F\"),\"000\"))","v":"2022_5_C5_P_5_F25"},"Parrain client 94 Nom client 94 Prénom Filleul client 119 Nom client 119 Prénom",2022,2,5,{"$f":"IF(AND(L49<>\"\",M49<>\"\",I49<>\"\"),COUNTIF($I$20:$I49,I49),0)","v":25},{"$f":"IF(AND(L49=\"\",M49=\"\"),0,IF(I49=\"P\",COUNTIF($I$20:$I49,\"P\"),COUNTIF($L$20:$L49,$L49)-1))","v":2},0,"F","2022-02-01","ANTOINE","client 94 Nom","client 94 Prénom",611157827,"client 119 Nom","client 119 Prénom",670840930,222,"Rue du village DCN",10240,"AVANT LES RAMERUPT",null,"Nok","nok","ok","2022-03-02","Ok","2022-03-25",160,"Ok"]
[{"$f":"IF($K50=\"\",0,$C50&\"_\"&$E50&\"_C\"&VLOOKUP($K50,Grand_Est!$I$20:$J$34,2,0)&\"_P_\"&COUNTIF($I$20:$I50,\"P\")&\"_\"&IF(I50=\"F\",\"F\"&COUNTIF($I$20:$I50,\"F\"),\"000\"))","v":"2022_5_C5_P_5_F26"},"Parrain client 94 Nom client 94 Prénom Filleul client 44 Nom client 44 Prénom",2022,2,5,{"$f":"IF(AND(L50<>\"\",M50<>\"\",I50<>\"\"),COUNTIF($I$20:$I50,I50),0)","v":26},{"$f":"IF(AND(L50=\"\",M50=\"\"),0,IF(I50=\"P\",COUNTIF($I$20:$I50,\"P\"),COUNTIF($L$20:$L50,$L50)-1))","v":3},0,"F","2022-02-01","ANTOINE","client 94 Nom","client 94 Prénom",611157827,"client 44 Nom","client 44 Prénom",648200684,33,"Rue du village AQ",10200,"AILLEVILLE",null,"Nok","nok","ok","2022-03-02","Ok","2022-03-26",160,"Ok"]
[{"$f":"IF($K51=\"\",0,$C51&\"_\"&$E51&\"_C\"&VLOOKUP($K51,Grand_Est!$I$20:$J$34,2,0)&\"_P_\"&COUNTIF($I$20:$I51,\"P\")&\"_\"&IF(I51=\"F\",\"F\"&COUNTIF($I$20:$I51,\"F\"),\"000\"))","v":"2022_5_C5_P_5_F27"},"Parrain client 94 Nom client 94 Prénom Filleul client 34 Nom client 34 Prénom",2022,2,5,{"$f":"IF(AND(L51<>\"\",M51<>\"\",I51<>\"\"),COUNTIF($I$20:$I51,I51),0)","v":27},{"$f":"IF(AND(L51=\"\",M51=\"\"),0,IF(I51=\"P\",COUNTIF($I$20:$I51,\"P\"),COUNTIF($L$20:$L51,$L51)-1))","v":4},0,"F","2022-02-01","ANTOINE","client 94 Nom","client 94 Prénom",611157827,"client 34 Nom","client 34 Prénom",636943062,237,"Rue du village AG",10340,"AVIREY LINGEY",null,"Nok","nok","ok","2022-03-02","Ok","2022-03-27",160,"Ok"]
[{"$f":"IF($K52=\"\",0,$C52&\"_\"&$E52&\"_C\"&VLOOKUP($K52,Grand_Est!$I$20:$J$34,2,0)&\"_P_\"&COUNTIF($I$20:$I52,\"P\")&\"_\"&IF(I52=\"F\",\"F\"&COUNTIF($I$20:$I52,\"F\"),\"000\"))","v":"2022_5_C5_P_5_F28"},"Parrain client 94 Nom client 94 Prénom Filleul client 97 Nom client 97 Prénom",2022,2,5,{"$f":"IF(AND(L52<>\"\",M52<>\"\",I52<>\"\"),COUNTIF($I$20:$I52,I52),0)","v":28},{"$f":"IF(AND(L52=\"\",M52=\"\"),0,IF(I52=\"P\",COUNTIF($I$20:$I52,\"P\"),COUNTIF($L$20:$L52,$L52)-1))","v":5},{"$f":"IF($I52=\"P\",COUNTIFS($AD$20:$AD$186,\"ok\",$L$20:$L$186,$L52,$M$20:$M$186,$M52)-1,0)","v":0},"F","2022-02-01","ANTOINE","client 94 Nom","client 94 Prénom",611157827,"client 97 Nom","client 97 Prénom",626040625,28,"Rue du village CR",10400,"FERREUX QUINCEY",null,"Nok","ok",null,"2022-03-02","Ok","2022-03-28",160,"Ok"]
[{"$f":"IF($K53=\"\",0,$C53&\"_\"&$E53&\"_C\"&VLOOKUP($K53,Grand_Est!$I$20:$J$34,2,0)&\"_P_\"&COUNTIF($I$20:$I53,\"P\")&\"_\"&IF(I53=\"F\",\"F\"&COUNTIF($I$20:$I53,\"F\"),\"000\"))","v":"2022_5_C5_P_5_F29"},"Parrain client 94 Nom client 94 Prénom Filleul client 70 Nom client 70 Prénom",2022,2,5,{"$f":"IF(AND(L53<>\"\",M53<>\"\",I53<>\"\"),COUNTIF($I$20:$I53,I53),0)","v":29},{"$f":"IF(AND(L53=\"\",M53=\"\"),0,IF(I53=\"P\",COUNTIF($I$20:$I53,\"P\"),COUNTIF($L$20:$L53,$L53)-1))","v":6},0,"F","2022-02-01","ANTOINE","client 94 Nom","client 94 Prénom",611157827,"client 70 Nom","client 70 Prénom",680622160,110,"Rue du village BQ",10500,"JUZANVIGNY",null,"Nok","ok",null,"2022-03-02","Ok","2022-03-29",160,"Ok"]
[{"$f":"IF($K54=\"\",0,$C54&\"_\"&$E54&\"_C\"&VLOOKUP($K54,Grand_Est!$I$20:$J$34,2,0)&\"_P_\"&COUNTIF($I$20:$I54,\"P\")&\"_\"&IF(I54=\"F\",\"F\"&COUNTIF($I$20:$I54,\"F\"),\"000\"))","v":"2022_5_C6_P_6_000"},"Parrain client 127 Nom client 127 Prénom",2022,2,5,{"$f":"IF(AND(L54<>\"\",M54<>\"\",I54<>\"\"),COUNTIF($I$20:$I54,I54),0)","v":6},{"$f":"IF(AND(L54=\"\",M54=\"\"),0,IF(I54=\"P\",COUNTIF($I$20:$I54,\"P\"),COUNTIF($L$20:$L54,$L54)-1))","v":6},6,"P","2022-02-01","MAXIME","client 127 Nom","client 127 Prénom",695056076,null,null,null,22,"Rue du village DDF",10320,"MAUPAS",null,"Nok","ok",null,"2022-03-02","Ok","2022-03-30",160,"Ok"]
[{"$f":"IF($K55=\"\",0,$C55&\"_\"&$E55&\"_C\"&VLOOKUP($K55,Grand_Est!$I$20:$J$34,2,0)&\"_P_\"&COUNTIF($I$20:$I55,\"P\")&\"_\"&IF(I55=\"F\",\"F\"&COUNTIF($I$20:$I55,\"F\"),\"000\"))","v":"2022_5_C6_P_6_F30"},"Parrain client 127 Nom client 127 Prénom Filleul client 79 Nom client 79 Prénom",2022,2,5,{"$f":"IF(AND(L55<>\"\",M55<>\"\",I55<>\"\"),COUNTIF($I$20:$I55,I55),0)","v":30},{"$f":"IF(AND(L55=\"\",M55=\"\"),0,IF(I55=\"P\",COUNTIF($I$20:$I55,\"P\"),COUNTIF($L$20:$L55,$L55)-1))","v":1},0,"F","2022-02-01","MAXIME","client 127 Nom","client 127 Prénom",695056076,"client 79 Nom","client 79 Prénom",639067026,212,"Rue du village BZ",10500,"MORVILLIERS",null,"Nok","ok",null,"2022-03-02","Ok","2022-03-31",160,"Ok"]
[{"$f":"IF($K56=\"\",0,$C56&\"_\"&$E56&\"_C\"&VLOOKUP($K56,Grand_Est!$I$20:$J$34,2,0)&\"_P_\"&COUNTIF($I$20:$I56,\"P\")&\"_\"&IF(I56=\"F\",\"F\"&COUNTIF($I$20:$I56,\"F\"),\"000\"))","v":"2022_5_C6_P_6_F31"},"Parrain client 127 Nom client 127 Prénom Filleul client 83 Nom client 83 Prénom",2022,2,5,{"$f":"IF(AND(L56<>\"\",M56<>\"\",I56<>\"\"),COUNTIF($I$20:$I56,I56),0)","v":31},{"$f":"IF(AND(L56=\"\",M56=\"\"),0,IF(I56=\"P\",COUNTIF($I$20:$I56,\"P\"),COUNTIF($L$20:$L56,$L56)-1))","v":2},0,"F","2022-02-01","MAXIME","client 127 Nom","client 127 Prénom",695056076,"client 83 Nom","client 83 Prénom",698755571,71,"Rue du village CD",10500,"PRECY NOTRE DAME",null,"Nok","nok","ok","2022-03-02","Ok","2022-04-01",160,"Ok"]
[{"$f":"IF($K57=\"\",0,$C57&\"_\"&$E57&\"_C\"&VLOOKUP($K57,Grand_Est!$I$20:$J$34,2,0)&\"_P_\"&COUNTIF($I$20:$I57,\"P\")&\"_\"&IF(I57=\"F\",\"F\"&COUNTIF($I$20:$I57,\"F\"),\"000\"))","v":"2022_5_C6_P_6_F32"},"Parrain client 127 Nom client 127 Prénom Filleul client 14 Nom client 14 Prénom",2022,2,5,{"$f":"IF(AND(L57<>\"\",M57<>\"\",I57<>\"\"),COUNTIF($I$20:$I57,I57),0)","v":32},{"$f":"IF(AND(L57=\"\",M57=\"\"),0,IF(I57=\"P\",COUNTIF($I$20:$I57,\"P\"),COUNTIF($L$20:$L57,$L57)-1))","v":3},0,"F","2022-02-01","MAXIME","client 127 Nom","client 127 Prénom",695056076,"client 14 Nom","client 14 Prénom",697949355,21,"Rue du village M",10600,"BARBEREY ST SULPICE",null,"Nok","nok","nok",null,"Nok",null,null,"NoK"]
[{"$f":"IF($K58=\"\",0,$C58&\"_\"&$E58&\"_C\"&VLOOKUP($K58,Grand_Est!$I$20:$J$34,2,0)&\"_P_\"&COUNTIF($I$20:$I58,\"P\")&\"_\"&IF(I58=\"F\",\"F\"&COUNTIF($I$20:$I58,\"F\"),\"000\"))","v":"2022_5_C6_P_6_F33"},"Parrain client 127 Nom client 127 Prénom Filleul client 107 Nom client 107 Prénom",2022,2,5,{"$f":"IF(AND(L58<>\"\",M58<>\"\",I58<>\"\"),COUNTIF($I$20:$I58,I58),0)","v":33},{"$f":"IF(AND(L58=\"\",M58=\"\"),0,IF(I58=\"P\",COUNTIF($I$20:$I58,\"P\"),COUNTIF($L$20:$L58,$L58)-1))","v":4},0,"F","2022-02-01","MAXIME","client 127 Nom","client 127 Prénom",695056076,"client 107 Nom","client 107 Prénom",627411022,29,"Rue du village DCB",10400,"MONTPOTHIER",null,"Nok","nok","ok","2022-03-02","Ok","2022-04-03",160,"Ok"]
[{"$f":"IF($K59=\"\",0,$C59&\"_\"&$E59&\"_C\"&VLOOKUP($K59,Grand_Est!$I$20:$J$34,2,0)&\"_P_\"&COUNTIF($I$20:$I59,\"P\")&\"_\"&IF(I59=\"F\",\"F\"&COUNTIF($I$20:$I59,\"F\"),\"000\"))","v":"2022_5_C6_P_6_F34"},"Parrain client 127 Nom client 127 Prénom Filleul client 98 Nom client 98 Prénom",2022,2,5,{"$f":"IF(AND(L59<>\"\",M59<>\"\",I59<>\"\"),COUNTIF($I$20:$I59,I59),0)","v":34},{"$f":"IF(AND(L59=\"\",M59=\"\"),0,IF(I59=\"P\",COUNTIF($I$20:$I59,\"P\"),COUNTIF($L$20:$L59,$L59)-1))","v":5},0,"F","2022-02-01","MAXIME","client 127 Nom","client 127 Prénom",695056076,"client 98 Nom","client 98 Prénom",677819310,166,"Rue du village CS",10400,"FONTAINE MACON",null,"Nok","nok","ok","2022-03-02","Ok","2022-04-04",160,"Ok"]
[{"$f":"IF($K60=\"\",0,$C60&\"_\"&$E60&\"_C\"&VLOOKUP($K60,Grand_Est!$I$20:$J$34,2,0)&\"_P_\"&COUNTIF($I$20:$I60,\"P\")&\"_\"&IF(I60=\"F\",\"F\"&COUNTIF($I$20:$I60,\"F\"),\"000\"))","v":"2022_5_C6_P_6_F35"},"Parrain client 127 Nom client 127 Prénom Filleul client 3 Nom client 3 Prénom",2022,2,5,{"$f":"IF(AND(L60<>\"\",M60<>\"\",I60<>\"\"),COUNTIF($I$20:$I60,I60),0)","v":35},{"$f":"IF(AND(L60=\"\",M60=\"\"),0,IF(I60=\"P\",COUNTIF($I$20:$I60,\"P\"),COUNTIF($L$20:$L60,$L60)-1))","v":6},0,"F","2022-02-01","MAXIME","client 127 Nom","client 127 Prénom",695056076,"client 3 Nom","client 3 Prénom",638675734,41,"Rue du village B",10700,"TROUAN LE GRAND",null,"Nok","nok","ok","2022-03-02","Ok","2022-04-05",160,"Ok"]
[{"$f":"IF($K61=\"\",0,$C61&\"_\"&$E61&\"_C\"&VLOOKUP($K61,Grand_Est!$I$20:$J$34,2,0)&\"_P_\"&COUNTIF($I$20:$I61,\"P\")&\"_\"&IF(I61=\"F\",\"F\"&COUNTIF($I$20:$I61,\"F\"),\"000\"))","v":"2022_6_C6_P_6_F36"},"Parrain client 127 Nom client 127 Prénom Filleul client 84 Nom client 84 Prénom",2022,2,6,{"$f":"IF(AND(L61<>\"\",M61<>\"\",I61<>\"\"),COUNTIF($I$20:$I61,I61),0)","v":36},{"$f":"IF(AND(L61=\"\",M61=\"\"),0,IF(I61=\"P\",COUNTIF($I$20:$I61,\"P\"),COUNTIF($L$20:$L61,$L61)-1))","v":7},0,"F","2022-02-07","MAXIME","client 127 Nom","client 127 Prénom",695056076,"client 84 Nom","client 84 Prénom",688593398,106,"Rue du village CE",10500,"PRECY ST MARTIN",null,"Nok","nok","ok","2022-03-02","Ok","2022-04-06",160,"Ok"]
[{"$f":"IF($K62=\"\",0,$C62&\"_\"&$E62&\"_C\"&VLOOKUP($K62,Grand_Est!$I$20:$J$34,2,0)&\"_P_\"&COUNTIF($I$20:$I62,\"P\")&\"_\"&IF(I62=\"F\",\"F\"&COUNTIF($I$20:$I62,\"F\"),\"000\"))","v":"2022_6_C1_P_7_000"},"Parrain client 45 Nom client 45 Prénom",2022,2,6,{"$f":"IF(AND(L62<>\"\",M62<>\"\",I62<>\"\"),COUNTIF($I$20:$I62,I62),0)","v":7},{"$f":"IF(AND(L62=\"\",M62=\"\"),0,IF(I62=\"P\",COUNTIF($I$20:$I62,\"P\"),COUNTIF($L$20:$L62,$L62)-1))","v":7},4,"P","2022-02-07","JEAN","client 45 Nom","client 45 Prénom",626583590,null,null,null,136,"Rue du village BJ",10500,"CHAUMESNIL",null,"Nok","ok",null,"2022-03-02","Nok",null,null,"NoK"]
[{"$f":"IF($K63=\"\",0,$C63&\"_\"&$E63&\"_C\"&VLOOKUP($K63,Grand_Est!$I$20:$J$34,2,0)&\"_P_\"&COUNTIF($I$20:$I63,\"P\")&\"_\"&IF(I63=\"F\",\"F\"&COUNTIF($I$20:$I63,\"F\"),\"000\"))","v":"2022_6_C1_P_7_F37"},"Parrain client 45 Nom client 45 Prénom Filleul client 131 Nom client 131 Prénom",2022,2,6,{"$f":"IF(AND(L63<>\"\",M63<>\"\",I63<>\"\"),COUNTIF($I$20:$I63,I63),0)","v":37},{"$f":"IF(AND(L63=\"\",M63=\"\"),0,IF(I63=\"P\",COUNTIF($I$20:$I63,\"P\"),COUNTIF($L$20:$L63,$L63)-1))","v":1},0,"F","2022-02-07","JEAN","client 45 Nom","client 45 Prénom",626583590,"client 131 Nom","client 131 Prénom",645043049,184,"Rue du village DDD",10320,"LONGEVILLE SUR MOGNE",null,"Nok","ok",null,"2022-03-02","Ok","2022-03-15",130,"Ok"]
[{"$f":"IF($K64=\"\",0,$C64&\"_\"&$E64&\"_C\"&VLOOKUP($K64,Grand_Est!$I$20:$J$34,2,0)&\"_P_\"&COUNTIF($I$20:$I64,\"P\")&\"_\"&IF(I64=\"F\",\"F\"&COUNTIF($I$20:$I64,\"F\"),\"000\"))","v":"2022_6_C1_P_7_F38"},"Parrain client 45 Nom client 45 Prénom Filleul client 33 Nom client 33 Prénom",2022,2,6,{"$f":"IF(AND(L64<>\"\",M64<>\"\",I64<>\"\"),COUNTIF($I$20:$I64,I64),0)","v":38},{"$f":"IF(AND(L64=\"\",M64=\"\"),0,IF(I64=\"P\",COUNTIF($I$20:$I64,\"P\"),COUNTIF($L$20:$L64,$L64)-1))","v":2},0,"F","2022-02-07","JEAN","client 45 Nom","client 45 Prénom",626583590,"client 33 Nom","client 33 Prénom",610759302,42,"Rue du village AF",10340,"ARRELLES",null,"Nok","ok",null,"2022-03-02","Ok","2022-03-15",150,"Ok"]
[{"$f":"IF($K65=\"\",0,$C65&\"_\"&$E65&\"_C\"&VLOOKUP($K65,Grand_Est!$I$20:$J$34,2,0)&\"_P_\"&COUNTIF($I$20:$I65,\"P\")&\"_\"&IF(I65=\"F\",\"F\"&COUNTIF($I$20:$I65,\"F\"),\"000\"))","v":"2022_6_C1_P_7_F39"},"Parrain client 45 Nom client 45 Prénom Filleul client 104 Nom client 104 Prénom",2022,2,6,{"$f":"IF(AND(L65<>\"\",M65<>\"\",I65<>\"\"),COUNTIF($I$20:$I65,I65),0)","v":39},{"$f":"IF(AND(L65=\"\",M65=\"\"),0,IF(I65=\"P\",COUNTIF($I$20:$I65,\"P\"),COUNTIF($L$20:$L65,$L65)-1))","v":3},0,"F","2022-02-07","JEAN","client 45 Nom","client 45 Prénom",626583590,"client 104 Nom","client 104 Prénom",642998582,69,"Rue du village CY",10400,"LA VILLENEUVE AU CHATELOT",null,"Nok","ok",null,"2022-03-02","Ok","2022-03-15",120,"Ok"]
[{"$f":"IF($K66=\"\",0,$C66&\"_\"&$E66&\"_C\"&VLOOKUP($K66,Grand_Est!$I$20:$J$34,2,0)&\"_P_\"&COUNTIF($I$20:$I66,\"P\")&\"_\"&IF(I66=\"F\",\"F\"&COUNTIF($I$20:$I66,\"F\"),\"000\"))","v":"2022_6_C1_P_7_F40"},"Parrain client 45 Nom client 45 Prénom Filleul client 107 Nom client 107 Prénom",2022,2,6,{"$f":"IF(AND(L66<>\"\",M66<>\"\",I66<>\"\"),COUNTIF($I$20:$I66,I66),0)","v":40},{"$f":"IF(AND(L66=\"\",M66=\"\"),0,IF(I66=\"P\",COUNTIF($I$20:$I66,\"P\"),COUNTIF($L$20:$L66,$L66)-1))","v":4},0,"F","2022-02-07","JEAN","client 45 Nom","client 45 Prénom",626583590,"client 107 Nom","client 107 Prénom",627411022,29,"Rue du village DCB",10400,"MONTPOTHIER",null,"Nok","ok",null,"2022-03-02","Ok","2022-03-15",200,"Ok"]
[{"$f":"IF($K67=\"\",0,$C67&\"_\"&$E67&\"_C\"&VLOOKUP($K67,Grand_Est!$I$20:$J$34,2,0)&\"_P_\"&COUNTIF($I$20:$I67,\"P\")&\"_\"&IF(I67=\"F\",\"F\"&COUNTIF($I$20:$I67,\"F\"),\"000\"))","v":"2022_6_C1_P_7_F41"},"Parrain client 45 Nom client 45 Prénom Filleul client 129 Nom client 129 Prénom",2022,2,6,{"$f":"IF(AND(L67<>\"\",M67<>\"\",I67<>\"\"),COUNTIF($I$20:$I67,I67),0)","v":41},{"$f":"IF(AND(L67=\"\",M67=\"\"),0,IF(I67=\"P\",COUNTIF($I$20:$I67,\"P\"),COUNTIF($L$20:$L67,$L67)-1))","v":5},0,"F","2022-02-07","JEAN","client 45 Nom","client 45 Prénom",626583590,"client 129 Nom","client 129 Prénom",621503734,236,"Rue du village DCX",10320,"BOUILLY",null,"Nok","ok",null,"2022-03-02","Ok","2022-03-15",120,"Ok"]
[{"$f":"IF($K68=\"\",0,$C68&\"_\"&$E68&\"_C\"&VLOOKUP($K68,Grand_Est!$I$20:$J$34,2,0)&\"_P_\"&COUNTIF($I$20:$I68,\"P\")&\"_\"&IF(I68=\"F\",\"F\"&COUNTIF($I$20:$I68,\"F\"),\"000\"))","v":"2022_6_C2_P_8_000"},"Parrain client 135 Nom client 135 Prénom",2022,2,6,{"$f":"IF(AND(L68<>\"\",M68<>\"\",I68<>\"\"),COUNTIF($I$20:$I68,I68),0)","v":8},{"$f":"IF(AND(L68=\"\",M68=\"\"),0,IF(I68=\"P\",COUNTIF($I$20:$I68,\"P\"),COUNTIF($L$20:$L68,$L68)-1))","v":8},5,"P","2022-02-07","PASCAL","client 135 Nom","client 135 Prénom",685906285,null,null,null,109,"Rue du village BF",10500,"BRAUX",null,"Nok","ok",null,"2022-03-02","Ok","2022-03-15",150,"Ok"]
[{"$f":"IF($K69=\"\",0,$C69&\"_\"&$E69&\"_C\"&VLOOKUP($K69,Grand_Est!$I$20:$J$34,2,0)&\"_P_\"&COUNTIF($I$20:$I69,\"P\")&\"_\"&IF(I69=\"F\",\"F\"&COUNTIF($I$20:$I69,\"F\"),\"000\"))","v":"2022_6_C2_P_8_F42"},"Parrain client 135 Nom client 135 Prénom Filleul client 48 Nom client 48 Prénom",2022,2,6,{"$f":"IF(AND(L69<>\"\",M69<>\"\",I69<>\"\"),COUNTIF($I$20:$I69,I69),0)","v":42},{"$f":"IF(AND(L69=\"\",M69=\"\"),0,IF(I69=\"P\",COUNTIF($I$20:$I69,\"P\"),COUNTIF($L$20:$L69,$L69)-1))","v":1},0,"F","2022-02-07","PASCAL","client 135 Nom","client 135 Prénom",685906285,"client 48 Nom","client 48 Prénom",674409450,180,"Rue du village AU",10500,"BRIENNE LE CHATEAU",null,"Nok","nok","ok","2022-03-02","Ok","2022-03-16",120,"Ok"]
[{"$f":"IF($K70=\"\",0,$C70&\"_\"&$E70&\"_C\"&VLOOKUP($K70,Grand_Est!$I$20:$J$34,2,0)&\"_P_\"&COUNTIF($I$20:$I70,\"P\")&\"_\"&IF(I70=\"F\",\"F\"&COUNTIF($I$20:$I70,\"F\"),\"000\"))","v":"2022_6_C2_P_8_F43"},"Parrain client 135 Nom client 135 Prénom Filleul client 85 Nom client 85 Prénom",2022,2,6,{"$f":"IF(AND(L70<>\"\",M70<>\"\",I70<>\"\"),COUNTIF($I$20:$I70,I70),0)","v":43},{"$f":"IF(AND(L70=\"\",M70=\"\"),0,IF(I70=\"P\",COUNTIF($I$20:$I70,\"P\"),COUNTIF($L$20:$L70,$L70)-1))","v":2},0,"F","2022-02-07","PASCAL","client 135 Nom","client 135 Prénom",685906285,"client 85 Nom","client 85 Prénom",677623160,23,"Rue du village CF",10500,"RADONVILLIERS",null,"Nok","ok",null,"2022-03-02","Nok",null,null,"NoK"]
[{"$f":"IF($K71=\"\",0,$C71&\"_\"&$E71&\"_C\"&VLOOKUP($K71,Grand_Est!$I$20:$J$34,2,0)&\"_P_\"&COUNTIF($I$20:$I71,\"P\")&\"_\"&IF(I71=\"F\",\"F\"&COUNTIF($I$20:$I71,\"F\"),\"000\"))","v":"2022_6_C2_P_8_F44"},"Parrain client 135 Nom client 135 Prénom Filleul client 45 Nom client 45 Prénom",2022,2,6,{"$f":"IF(AND(L71<>\"\",M71<>\"\",I71<>\"\"),COUNTIF($I$20:$I71,I71),0)","v":44},{"$f":"IF(AND(L71=\"\",M71=\"\"),0,IF(I71=\"P\",COUNTIF($I$20:$I71,\"P\"),COUNTIF($L$20:$L71,$L71)-1))","v":3},0,"F","2022-02-07","PASCAL","client 135 Nom","client 135 Prénom",685906285,"client 45 Nom","client 45 Prénom",653739073,83,"Rue du village AR",10500,"BLIGNICOURT",null,"Nok","nok","ok","2022-03-02","Ok","2022-03-16",140,"Ok"]
[{"$f":"IF($K72=\"\",0,$C72&\"_\"&$E72&\"_C\"&VLOOKUP($K72,Grand_Est!$I$20:$J$34,2,0)&\"_P_\"&COUNTIF($I$20:$I72,\"P\")&\"_\"&IF(I72=\"F\",\"F\"&COUNTIF($I$20:$I72,\"F\"),\"000\"))","v":"2022_6_C2_P_8_F45"},"Parrain client 135 Nom client 135 Prénom Filleul client 126 Nom client 126 Prénom",2022,2,6,{"$f":"IF(AND(L72<>\"\",M72<>\"\",I72<>\"\"),COUNTIF($I$20:$I72,I72),0)","v":45},{"$f":"IF(AND(L72=\"\",M72=\"\"),0,IF(I72=\"P\",COUNTIF($I$20:$I72,\"P\"),COUNTIF($L$20:$L72,$L72)-1))","v":4},0,"F","2022-02-07","PASCAL","client 135 Nom","client 135 Prénom",685906285,"client 126 Nom","client 126 Prénom",650606084,123,"Rue du village DCU",10240,"LONGSOLS",null,"Nok","ok",null,"2022-03-02","Ok","2022-03-16",120,"Ok"]
[{"$f":"IF($K73=\"\",0,$C73&\"_\"&$E73&\"_C\"&VLOOKUP($K73,Grand_Est!$I$20:$J$34,2,0)&\"_P_\"&COUNTIF($I$20:$I73,\"P\")&\"_\"&IF(I73=\"F\",\"F\"&COUNTIF($I$20:$I73,\"F\"),\"000\"))","v":"2022_6_C2_P_8_F46"},"Parrain client 135 Nom client 135 Prénom Filleul client 138 Nom client 138 Prénom",2022,2,6,{"$f":"IF(AND(L73<>\"\",M73<>\"\",I73<>\"\"),COUNTIF($I$20:$I73,I73),0)","v":46},{"$f":"IF(AND(L73=\"\",M73=\"\"),0,IF(I73=\"P\",COUNTIF($I$20:$I73,\"P\"),COUNTIF($L$20:$L73,$L73)-1))","v":5},0,"F","2022-02-07","PASCAL","client 135 Nom","client 135 Prénom",685906285,"client 138 Nom","client 138 Prénom",694172022,107,"Rue du village DDG",10320,"RONCENAY",null,"Nok","nok","ok","2022-03-02","Ok","2022-03-16",120,"Ok"]
[{"$f":"IF($K74=\"\",0,$C74&\"_\"&$E74&\"_C\"&VLOOKUP($K74,Grand_Est!$I$20:$J$34,2,0)&\"_P_\"&COUNTIF($I$20:$I74,\"P\")&\"_\"&IF(I74=\"F\",\"F\"&COUNTIF($I$20:$I74,\"F\"),\"000\"))","v":"2022_6_C2_P_8_F47"},"Parrain client 135 Nom client 135 Prénom Filleul client 74 Nom client 74 Prénom",2022,2,6,{"$f":"IF(AND(L74<>\"\",M74<>\"\",I74<>\"\"),COUNTIF($I$20:$I74,I74),0)","v":47},{"$f":"IF(AND(L74=\"\",M74=\"\"),0,IF(I74=\"P\",COUNTIF($I$20:$I74,\"P\"),COUNTIF($L$20:$L74,$L74)-1))","v":6},0,"F","2022-02-07","PASCAL","client 135 Nom","client 135 Prénom",685906285,"client 74 Nom","client 74 Prénom",660546033,38,"Rue du village BU",10500,"LASSICOURT",null,"Nok","ok",null,"2022-03-02","Ok","2022-03-16",150,"Ok"]
[{"$f":"IF($K75=\"\",0,$C75&\"_\"&$E75&\"_C\"&VLOOKUP($K75,Grand_Est!$I$20:$J$34,2,0)&\"_P_\"&COUNTIF($I$20:$I75,\"P\")&\"_\"&IF(I75=\"F\",\"F\"&COUNTIF($I$20:$I75,\"F\"),\"000\"))","v":"2022_6_C2_P_8_F48"},"Parrain client 135 Nom client 135 Prénom Filleul client 29 Nom client 29 Prénom",2022,2,6,{"$f":"IF(AND(L75<>\"\",M75<>\"\",I75<>\"\"),COUNTIF($I$20:$I75,I75),0)","v":48},{"$f":"IF(AND(L75=\"\",M75=\"\"),0,IF(I75=\"P\",COUNTIF($I$20:$I75,\"P\"),COUNTIF($L$20:$L75,$L75)-1))","v":7},0,"F","2022-02-07","PASCAL","client 135 Nom","client 135 Prénom",685906285,"client 29 Nom","client 29 Prénom",641852890,160,"Rue du village AB",10310,"JUVANCOURT",null,"Nok","ok",null,"2022-03-02","Nok",null,null,"NoK"]
[{"$f":"IF($K76=\"\",0,$C76&\"_\"&$E76&\"_C\"&VLOOKUP($K76,Grand_Est!$I$20:$J$34,2,0)&\"_P_\"&COUNTIF($I$20:$I76,\"P\")&\"_\"&IF(I76=\"F\",\"F\"&COUNTIF($I$20:$I76,\"F\"),\"000\"))","v":"2022_6_C3_P_9_000"},"Parrain client 84 Nom client 84 Prénom",2022,2,6,{"$f":"IF(AND(L76<>\"\",M76<>\"\",I76<>\"\"),COUNTIF($I$20:$I76,I76),0)","v":9},{"$f":"IF(AND(L76=\"\",M76=\"\"),0,IF(I76=\"P\",COUNTIF($I$20:$I76,\"P\"),COUNTIF($L$20:$L76,$L76)-1))","v":9},5,"P","2022-02-07","THIERRY","client 84 Nom","client 84 Prénom",627086058,null,null,null,194,"Rue du village BR",10500,"LA CHAISE",null,"Nok","nok","ok","2022-03-03","Ok","2022-03-17",150,"Ok"]
[{"$f":"IF($K77=\"\",0,$C77&\"_\"&$E77&\"_C\"&VLOOKUP($K77,Grand_Est!$I$20:$J$34,2,0)&\"_P_\"&COUNTIF($I$20:$I77,\"P\")&\"_\"&IF(I77=\"F\",\"F\"&COUNTIF($I$20:$I77,\"F\"),\"000\"))","v":"2022_6_C3_P_9_F49"},"Parrain client 84 Nom client 84 Prénom Filleul client 45 Nom client 45 Prénom",2022,2,6,{"$f":"IF(AND(L77<>\"\",M77<>\"\",I77<>\"\"),COUNTIF($I$20:$I77,I77),0)","v":49},{"$f":"IF(AND(L77=\"\",M77=\"\"),0,IF(I77=\"P\",COUNTIF($I$20:$I77,\"P\"),COUNTIF($L$20:$L77,$L77)-1))","v":1},0,"F","2022-02-07","THIERRY","client 84 Nom","client 84 Prénom",627086058,"client 45 Nom","client 45 Prénom",653739073,83,"Rue du village AR",10500,"BLIGNICOURT",null,"Nok","ok",null,"2022-03-03","Ok","2022-03-18",120,"Ok"]
[{"$f":"IF($K78=\"\",0,$C78&\"_\"&$E78&\"_C\"&VLOOKUP($K78,Grand_Est!$I$20:$J$34,2,0)&\"_P_\"&COUNTIF($I$20:$I78,\"P\")&\"_\"&IF(I78=\"F\",\"F\"&COUNTIF($I$20:$I78,\"F\"),\"000\"))","v":"2022_6_C3_P_9_F50"},"Parrain client 84 Nom client 84 Prénom Filleul client 54 Nom client 54 Prénom",2022,2,6,{"$f":"IF(AND(L78<>\"\",M78<>\"\",I78<>\"\"),COUNTIF($I$20:$I78,I78),0)","v":50},{"$f":"IF(AND(L78=\"\",M78=\"\"),0,IF(I78=\"P\",COUNTIF($I$20:$I78,\"P\"),COUNTIF($L$20:$L78,$L78)-1))","v":2},0,"F","2022-02-07","THIERRY","client 84 Nom","client 84 Prénom",627086058,"client 54 Nom","client 54 Prénom",684874997,154,"Rue du village BA",10500,"EPAGNE",null,"Nok","ok",null,"2022-03-03","Ok","2022-03-19",120,"Ok"]
[{"$f":"IF($K79=\"\",0,$C79&\"_\"&$E79&\"_C\"&VLOOKUP($K79,Grand_Est!$I$20:$J$34,2,0)&\"_P_\"&COUNTIF($I$20:$I79,\"P\")&\"_\"&IF(I79=\"F\",\"F\"&COUNTIF($I$20:$I79,\"F\"),\"000\"))","v":"2022_6_C3_P_9_F51"},"Parrain client 84 Nom client 84 Prénom Filleul client 123 Nom client 123 Prénom",2022,2,6,{"$f":"IF(AND(L79<>\"\",M79<>\"\",I79<>\"\"),COUNTIF($I$20:$I79,I79),0)","v":51},{"$f":"IF(AND(L79=\"\",M79=\"\"),0,IF(I79=\"P\",COUNTIF($I$20:$I79,\"P\"),COUNTIF($L$20:$L79,$L79)-1))","v":3},0,"F","2022-02-07","THIERRY","client 84 Nom","client 84 Prénom",627086058,"client 123 Nom","client 123 Prénom",642407521,241,"Rue du village DCR",10240,"DAMPIERRE",null,"Nok","ok",null,"2022-03-03","Ok","2022-03-20",140,"Ok"]
[{"$f":"IF($K80=\"\",0,$C80&\"_\"&$E80&\"_C\"&VLOOKUP($K80,Grand_Est!$I$20:$J$34,2,0)&\"_P_\"&COUNTIF($I$20:$I80,\"P\")&\"_\"&IF(I80=\"F\",\"F\"&COUNTIF($I$20:$I80,\"F\"),\"000\"))","v":"2022_6_C3_P_9_F52"},"Parrain client 84 Nom client 84 Prénom Filleul client 114 Nom client 114 Prénom",2022,2,6,{"$f":"IF(AND(L80<>\"\",M80<>\"\",I80<>\"\"),COUNTIF($I$20:$I80,I80),0)","v":52},{"$f":"IF(AND(L80=\"\",M80=\"\"),0,IF(I80=\"P\",COUNTIF($I$20:$I80,\"P\"),COUNTIF($L$20:$L80,$L80)-1))","v":4},0,"F","2022-02-07","THIERRY","client 84 Nom","client 84 Prénom",627086058,"client 114 Nom","client 114 Prénom",695121228,203,"Rue du village DCI",10400,"ST AUBIN",null,"Nok","nok","ok","2022-03-04","Ok","2022-03-21",130,"Ok"]
[{"$f":"IF($K81=\"\",0,$C81&\"_\"&$E81&\"_C\"&VLOOKUP($K81,Grand_Est!$I$20:$J$34,2,0)&\"_P_\"&COUNTIF($I$20:$I81,\"P\")&\"_\"&IF(I81=\"F\",\"F\"&COUNTIF($I$20:$I81,\"F\"),\"000\"))","v":"2022_6_C3_P_9_F53"},"Parrain client 84 Nom client 84 Prénom Filleul client 87 Nom client 87 Prénom",2022,2,6,{"$f":"IF(AND(L81<>\"\",M81<>\"\",I81<>\"\"),COUNTIF($I$20:$I81,I81),0)","v":53},{"$f":"IF(AND(L81=\"\",M81=\"\"),0,IF(I81=\"P\",COUNTIF($I$20:$I81,\"P\"),COUNTIF($L$20:$L81,$L81)-1))","v":5},0,"F","2022-02-07","THIERRY","client 84 Nom","client 84 Prénom",627086058,"client 87 Nom","client 87 Prénom",622379338,103,"Rue du village CH",10500,"ROSNAY L'HOPITAL",null,"Nok","ok",null,"2022-03-02","Ok",null,120,"Ok"]
[{"$f":"IF($K82=\"\",0,$C82&\"_\"&$E82&\"_C\"&VLOOKUP($K82,Grand_Est!$I$20:$J$34,2,0)&\"_P_\"&COUNTIF($I$20:$I82,\"P\")&\"_\"&IF(I82=\"F\",\"F\"&COUNTIF($I$20:$I82,\"F\"),\"000\"))","v":"2022_6_C4_P_10_000"},"Parrain client 81 Nom client 81 Prénom",2022,2,6,{"$f":"IF(AND(L82<>\"\",M82<>\"\",I82<>\"\"),COUNTIF($I$20:$I82,I82),0)","v":10},{"$f":"IF(AND(L82=\"\",M82=\"\"),0,IF(I82=\"P\",COUNTIF($I$20:$I82,\"P\"),COUNTIF($L$20:$L82,$L82)-1))","v":10},5,"P","2022-02-07","SILVAIN","client 81 Nom","client 81 Prénom",637284570,null,null,null,9,"Rue du village AV",10500,"CHALETTE SUR VOIRE",null,"Nok","nok","ok","2022-03-02","Ok","2022-03-16",200,"Ok"]
[{"$f":"IF($K83=\"\",0,$C83&\"_\"&$E83&\"_C\"&VLOOKUP($K83,Grand_Est!$I$20:$J$34,2,0)&\"_P_\"&COUNTIF($I$20:$I83,\"P\")&\"_\"&IF(I83=\"F\",\"F\"&COUNTIF($I$20:$I83,\"F\"),\"000\"))","v":"2022_6_C4_P_10_F54"},"Parrain client 81 Nom client 81 Prénom Filleul client 103 Nom client 103 Prénom",2022,2,6,{"$f":"IF(AND(L83<>\"\",M83<>\"\",I83<>\"\"),COUNTIF($I$20:$I83,I83),0)","v":54},{"$f":"IF(AND(L83=\"\",M83=\"\"),0,IF(I83=\"P\",COUNTIF($I$20:$I83,\"P\"),COUNTIF($L$20:$L83,$L83)-1))","v":1},0,"F","2022-02-07","SILVAIN","client 81 Nom","client 81 Prénom",637284570,"client 103 Nom","client 103 Prénom",619340139,113,"Rue du village CX",10400,"LA SAULSOTTE",null,"Nok","ok",null,"2022-03-02","Ok","2022-03-16",120,"Ok"]
[{"$f":"IF($K84=\"\",0,$C84&\"_\"&$E84&\"_C\"&VLOOKUP($K84,Grand_Est!$I$20:$J$34,2,0)&\"_P_\"&COUNTIF($I$20:$I84,\"P\")&\"_\"&IF(I84=\"F\",\"F\"&COUNTIF($I$20:$I84,\"F\"),\"000\"))","v":"2022_6_C4_P_10_F55"},"Parrain client 81 Nom client 81 Prénom Filleul client 139 Nom client 139 Prénom",2022,2,6,{"$f":"IF(AND(L84<>\"\",M84<>\"\",I84<>\"\"),COUNTIF($I$20:$I84,I84),0)","v":55},{"$f":"IF(AND(L84=\"\",M84=\"\"),0,IF(I84=\"P\",COUNTIF($I$20:$I84,\"P\"),COUNTIF($L$20:$L84,$L84)-1))","v":2},{"$f":"IF($I84=\"P\",COUNTIFS($AD$20:$AD$186,\"ok\",$L$20:$L$186,$L84,$M$20:$M$186,$M84)-1,0)","v":0},"F","2022-02-07","SILVAIN","client 81 Nom","client 81 Prénom",637284570,"client 139 Nom","client 139 Prénom",624905624,96,"Rue du village DDH",10320,"SOMMEVAL",null,"Nok","nok","nok","2022-03-02","Nok",null,null,"NoK"]
[{"$f":"IF($K85=\"\",0,$C85&\"_\"&$E85&\"_C\"&VLOOKUP($K85,Grand_Est!$I$20:$J$34,2,0)&\"_P_\"&COUNTIF($I$20:$I85,\"P\")&\"_\"&IF(I85=\"F\",\"F\"&COUNTIF($I$20:$I85,\"F\"),\"000\"))","v":"2022_6_C4_P_10_F56"},{"$f":"IF(I85=\"vide\",0,IF($I85=\"P\",\"Parrain\"&\" \"&$L85&\" \"&$M85,IF($I85=\"F\",\"Parrain\"&\" \"&$L85&\" \"&$M85&\" Filleul\"&\" \"&$O85&\" \"&$P85)))","v":"Parrain client 81 Nom client 81 Prénom Filleul client 36 Nom client 36 Prénom"},{"$f":"YEAR($J$2)","v":2022},{"$f":"MONTH($J85)","v":2},{"$f":"WEEKNUM($J85,21)","v":6},{"$f":"IF(AND(L85<>\"\",M85<>\"\",I85<>\"\"),COUNTIF($I$20:$I85,I85),0)","v":56},{"$f":"IF(AND(L85=\"\",M85=\"\"),0,IF(I85=\"P\",COUNTIF($I$20:$I85,\"P\"),COUNTIF($L$20:$L85,$L85)-1))","v":3},0,"F","2022-02-07","SILVAIN","client 81 Nom","client 81 Prénom",637284570,"client 36 Nom","client 36 Prénom",696567037,229,"Rue du village AI",10340,"BEAUVOIR SUR SARCE",null,"Nok","ok",null,"2022-03-02","Ok","2022-03-16",120,"Ok"]
[{"$f":"IF($K86=\"\",0,$C86&\"_\"&$E86&\"_C\"&VLOOKUP($K86,Grand_Est!$I$20:$J$34,2,0)&\"_P_\"&COUNTIF($I$20:$I86,\"P\")&\"_\"&IF(I86=\"F\",\"F\"&COUNTIF($I$20:$I86,\"F\"),\"000\"))","v":"2022_6_C4_P_10_F57"},"Parrain client 81 Nom client 81 Prénom Filleul client 12 Nom client 12 Prénom",2022,2,6,{"$f":"IF(AND(L86<>\"\",M86<>\"\",I86<>\"\"),COUNTIF($I$20:$I86,I86),0)","v":57},{"$f":"IF(AND(L86=\"\",M86=\"\"),0,IF(I86=\"P\",COUNTIF($I$20:$I86,\"P\"),COUNTIF($L$20:$L86,$L86)-1))","v":4},0,"F","2022-02-07","SILVAIN","client 81 Nom","client 81 Prénom",637284570,"client 12 Nom","client 12 Prénom",687534346,26,"Rue du village K",10120,"CHEVILLELE",null,"Nok","nok","nok",null,"Nok",null,null,"NoK"]
[{"$f":"IF($K87=\"\",0,$C87&\"_\"&$E87&\"_C\"&VLOOKUP($K87,Grand_Est!$I$20:$J$34,2,0)&\"_P_\"&COUNTIF($I$20:$I87,\"P\")&\"_\"&IF(I87=\"F\",\"F\"&COUNTIF($I$20:$I87,\"F\"),\"000\"))","v":"2022_6_C4_P_10_F58"},"Parrain client 81 Nom client 81 Prénom Filleul client 10 Nom client 10 Prénom",2022,2,6,{"$f":"IF(AND(L87<>\"\",M87<>\"\",I87<>\"\"),COUNTIF($I$20:$I87,I87),0)","v":58},{"$f":"IF(AND(L87=\"\",M87=\"\"),0,IF(I87=\"P\",COUNTIF($I$20:$I87,\"P\"),COUNTIF($L$20:$L87,$L87)-1))","v":5},0,"F","2022-02-07","SILVAIN","client 81 Nom","client 81 Prénom",637284570,"client 10 Nom","client 10 Prénom",660338199,57,"Rue du village I",10100,"ST HILAIRE SOUS ROMILLY",null,"Nok","ok",null,"2022-03-03","Ok","2022-03-16",120,"Ok"]
[{"$f":"IF($K88=\"\",0,$C88&\"_\"&$E88&\"_C\"&VLOOKUP($K88,Grand_Est!$I$20:$J$34,2,0)&\"_P_\"&COUNTIF($I$20:$I88,\"P\")&\"_\"&IF(I88=\"F\",\"F\"&COUNTIF($I$20:$I88,\"F\"),\"000\"))","v":"2022_6_C4_P_10_F59"},"Parrain client 81 Nom client 81 Prénom Filleul client 17 Nom client 17 Prénom",2022,2,6,{"$f":"IF(AND(L88<>\"\",M88<>\"\",I88<>\"\"),COUNTIF($I$20:$I88,I88),0)","v":59},{"$f":"IF(AND(L88=\"\",M88=\"\"),0,IF(I88=\"P\",COUNTIF($I$20:$I88,\"P\"),COUNTIF($L$20:$L88,$L88)-1))","v":6},0,"F","2022-02-07","SILVAIN","client 81 Nom","client 81 Prénom",637284570,"client 17 Nom","client 17 Prénom",667288911,56,"Rue du village P",10600,"PAYNS",null,"Nok","nok","nok",null,"Nok",null,null,"NoK"]
[{"$f":"IF($K89=\"\",0,$C89&\"_\"&$E89&\"_C\"&VLOOKUP($K89,Grand_Est!$I$20:$J$34,2,0)&\"_P_\"&COUNTIF($I$20:$I89,\"P\")&\"_\"&IF(I89=\"F\",\"F\"&COUNTIF($I$20:$I89,\"F\"),\"000\"))","v":"2022_6_C4_P_10_F60"},"Parrain client 81 Nom client 81 Prénom Filleul client 5 Nom client 5 Prénom",2022,2,6,{"$f":"IF(AND(L89<>\"\",M89<>\"\",I89<>\"\"),COUNTIF($I$20:$I89,I89),0)","v":60},{"$f":"IF(AND(L89=\"\",M89=\"\"),0,IF(I89=\"P\",COUNTIF($I$20:$I89,\"P\"),COUNTIF($L$20:$L89,$L89)-1))","v":7},0,"F","2022-02-07","SILVAIN","client 81 Nom","client 81 Prénom",637284570,"client 5 Nom","client 5 Prénom",699104827,67,"Rue du village D",10100,"LA FOSSE CORDUAN",null,"Nok","ok",null,"2022-03-03","Ok","2022-03-16",120,"Ok"]
[{"$f":"IF($K90=\"\",0,$C90&\"_\"&$E90&\"_C\"&VLOOKUP($K90,Grand_Est!$I$20:$J$34,2,0)&\"_P_\"&COUNTIF($I$20:$I90,\"P\")&\"_\"&IF(I90=\"F\",\"F\"&COUNTIF($I$20:$I90,\"F\"),\"000\"))","v":"2022_6_C4_P_10_F61"},"Parrain client 81 Nom client 81 Prénom Filleul client 116 Nom client 116 Prénom",2022,2,6,{"$f":"IF(AND(L90<>\"\",M90<>\"\",I90<>\"\"),COUNTIF($I$20:$I90,I90),0)","v":61},{"$f":"IF(AND(L90=\"\",M90=\"\"),0,IF(I90=\"P\",COUNTIF($I$20:$I90,\"P\"),COUNTIF($L$20:$L90,$L90)-1))","v":8},0,"F","2022-02-07","SILVAIN","client 81 Nom","client 81 Prénom",637284570,"client 116 Nom","client 116 Prénom",666548086,85,"Rue du village DCK",10400,"TRAINEL",null,"Nok","ok",null,"2022-03-03","Ok","2022-03-16",180,"Ok"]
[{"$f":"IF($K91=\"\",0,$C91&\"_\"&$E91&\"_C\"&VLOOKUP($K91,Grand_Est!$I$20:$J$34,2,0)&\"_P_\"&COUNTIF($I$20:$I91,\"P\")&\"_\"&IF(I91=\"F\",\"F\"&COUNTIF($I$20:$I91,\"F\"),\"000\"))","v":"2022_6_C5_P_11_000"},"Parrain client 126 Nom client 126 Prénom",2022,2,6,{"$f":"IF(AND(L91<>\"\",M91<>\"\",I91<>\"\"),COUNTIF($I$20:$I91,I91),0)","v":11},{"$f":"IF(AND(L91=\"\",M91=\"\"),0,IF(I91=\"P\",COUNTIF($I$20:$I91,\"P\"),COUNTIF($L$20:$L91,$L91)-1))","v":11},5,"P","2022-02-07","ANTOINE","client 126 Nom","client 126 Prénom",657167997,null,null,null,92,"Rue du village CZ",10400,"LE MERIOT",null,"Nok","ok",null,"2022-03-02","Ok","2022-03-16",120,"Ok"]
[{"$f":"IF($K92=\"\",0,$C92&\"_\"&$E92&\"_C\"&VLOOKUP($K92,Grand_Est!$I$20:$J$34,2,0)&\"_P_\"&COUNTIF($I$20:$I92,\"P\")&\"_\"&IF(I92=\"F\",\"F\"&COUNTIF($I$20:$I92,\"F\"),\"000\"))","v":"2022_6_C5_P_11_F62"},"Parrain client 126 Nom client 126 Prénom Filleul client 87 Nom client 87 Prénom",2022,2,6,{"$f":"IF(AND(L92<>\"\",M92<>\"\",I92<>\"\"),COUNTIF($I$20:$I92,I92),0)","v":62},{"$f":"IF(AND(L92=\"\",M92=\"\"),0,IF(I92=\"P\",COUNTIF($I$20:$I92,\"P\"),COUNTIF($L$20:$L92,$L92)-1))","v":1},0,"F","2022-02-07","ANTOINE","client 126 Nom","client 126 Prénom",657167997,"client 87 Nom","client 87 Prénom",691956656,81,"Rue du village CH",10300,"ROSNAY L'HOPITAL",null,"Nok","ok",null,"2022-03-04","Ok","2022-03-16",120,"Ok"]
[{"$f":"IF($K93=\"\",0,$C93&\"_\"&$E93&\"_C\"&VLOOKUP($K93,Grand_Est!$I$20:$J$34,2,0)&\"_P_\"&COUNTIF($I$20:$I93,\"P\")&\"_\"&IF(I93=\"F\",\"F\"&COUNTIF($I$20:$I93,\"F\"),\"000\"))","v":"2022_6_C5_P_11_F63"},"Parrain client 126 Nom client 126 Prénom Filleul client 105 Nom client 105 Prénom",2022,2,6,{"$f":"IF(AND(L93<>\"\",M93<>\"\",I93<>\"\"),COUNTIF($I$20:$I93,I93),0)","v":63},{"$f":"IF(AND(L93=\"\",M93=\"\"),0,IF(I93=\"P\",COUNTIF($I$20:$I93,\"P\"),COUNTIF($L$20:$L93,$L93)-1))","v":2},0,"F","2022-02-07","ANTOINE","client 126 Nom","client 126 Prénom",657167997,"client 105 Nom","client 105 Prénom",726745315,70,"Rue du village CZ",10200,"LE MERIOT",null,"Nok","nok","ok","2022-03-04","Ok","2022-03-16",200,"Ok"]
[{"$f":"IF($K94=\"\",0,$C94&\"_\"&$E94&\"_C\"&VLOOKUP($K94,Grand_Est!$I$20:$J$34,2,0)&\"_P_\"&COUNTIF($I$20:$I94,\"P\")&\"_\"&IF(I94=\"F\",\"F\"&COUNTIF($I$20:$I94,\"F\"),\"000\"))","v":"2022_6_C5_P_11_F64"},"Parrain client 126 Nom client 126 Prénom Filleul client 87 Nom client 87 Prénom",2022,2,6,{"$f":"IF(AND(L94<>\"\",M94<>\"\",I94<>\"\"),COUNTIF($I$20:$I94,I94),0)","v":64},{"$f":"IF(AND(L94=\"\",M94=\"\"),0,IF(I94=\"P\",COUNTIF($I$20:$I94,\"P\"),COUNTIF($L$20:$L94,$L94)-1))","v":3},0,"F","2022-02-07","ANTOINE","client 126 Nom","client 126 Prénom",657167997,"client 87 Nom","client 87 Prénom",761533974,59,"Rue du village CH",10100,"ROSNAY L'HOPITAL",null,"ok",null,null,"2022-03-04","Ok","2022-03-16",120,"Ok"]
[{"$f":"IF($K95=\"\",0,$C95&\"_\"&$E95&\"_C\"&VLOOKUP($K95,Grand_Est!$I$20:$J$34,2,0)&\"_P_\"&COUNTIF($I$20:$I95,\"P\")&\"_\"&IF(I95=\"F\",\"F\"&COUNTIF($I$20:$I95,\"F\"),\"000\"))","v":"2022_6_C5_P_11_F65"},"Parrain client 126 Nom client 126 Prénom Filleul client 105 Nom client 105 Prénom",2022,2,6,{"$f":"IF(AND(L95<>\"\",M95<>\"\",I95<>\"\"),COUNTIF($I$20:$I95,I95),0)","v":65},{"$f":"IF(AND(L95=\"\",M95=\"\"),0,IF(I95=\"P\",COUNTIF($I$20:$I95,\"P\"),COUNTIF($L$20:$L95,$L95)-1))","v":4},0,"F","2022-02-07","ANTOINE","client 126 Nom","client 126 Prénom",657167997,"client 105 Nom","client 105 Prénom",796322633,48,"Rue du village CZ",10000,"LE MERIOT",null,"Nok","nok","nok",null,"Nok",null,null,"NoK"]
[{"$f":"IF($K96=\"\",0,$C96&\"_\"&$E96&\"_C\"&VLOOKUP($K96,Grand_Est!$I$20:$J$34,2,0)&\"_P_\"&COUNTIF($I$20:$I96,\"P\")&\"_\"&IF(I96=\"F\",\"F\"&COUNTIF($I$20:$I96,\"F\"),\"000\"))","v":"2022_6_C5_P_11_F66"},"Parrain client 126 Nom client 126 Prénom Filleul client 87 Nom client 87 Prénom",2022,2,6,{"$f":"IF(AND(L96<>\"\",M96<>\"\",I96<>\"\"),COUNTIF($I$20:$I96,I96),0)","v":66},{"$f":"IF(AND(L96=\"\",M96=\"\"),0,IF(I96=\"P\",COUNTIF($I$20:$I96,\"P\"),COUNTIF($L$20:$L96,$L96)-1))","v":5},0,"F","2022-02-07","ANTOINE","client 126 Nom","client 126 Prénom",657167997,"client 87 Nom","client 87 Prénom",831111292,37,"Rue du village CH",9900,"ROSNAY L'HOPITAL",null,"Nok","ok",null,"2022-03-04","Ok","2022-03-18",120,"Ok"]
[{"$f":"IF($K97=\"\",0,$C97&\"_\"&$E97&\"_C\"&VLOOKUP($K97,Grand_Est!$I$20:$J$34,2,0)&\"_P_\"&COUNTIF($I$20:$I97,\"P\")&\"_\"&IF(I97=\"F\",\"F\"&COUNTIF($I$20:$I97,\"F\"),\"000\"))","v":"2022_6_C5_P_11_F67"},"Parrain client 126 Nom client 126 Prénom Filleul client 105 Nom client 105 Prénom",2022,2,6,{"$f":"IF(AND(L97<>\"\",M97<>\"\",I97<>\"\"),COUNTIF($I$20:$I97,I97),0)","v":67},{"$f":"IF(AND(L97=\"\",M97=\"\"),0,IF(I97=\"P\",COUNTIF($I$20:$I97,\"P\"),COUNTIF($L$20:$L97,$L97)-1))","v":6},0,"F","2022-02-07","ANTOINE","client 126 Nom","client 126 Prénom",657167997,"client 105 Nom","client 105 Prénom",865899951,26,"Rue du village CZ",9800,"LE MERIOT",null,"Nok","ok",null,"2022-03-04","Ok","2022-03-19",120,"Ok"]
[{"$f":"IF($K98=\"\",0,$C98&\"_\"&$E98&\"_C\"&VLOOKUP($K98,Grand_Est!$I$20:$J$34,2,0)&\"_P_\"&COUNTIF($I$20:$I98,\"P\")&\"_\"&IF(I98=\"F\",\"F\"&COUNTIF($I$20:$I98,\"F\"),\"000\"))","v":"2022_6_C5_P_11_F68"},"Parrain client 126 Nom client 126 Prénom Filleul client 87 Nom client 87 Prénom",2022,2,6,{"$f":"IF(AND(L98<>\"\",M98<>\"\",I98<>\"\"),COUNTIF($I$20:$I98,I98),0)","v":68},{"$f":"IF(AND(L98=\"\",M98=\"\"),0,IF(I98=\"P\",COUNTIF($I$20:$I98,\"P\"),COUNTIF($L$20:$L98,$L98)-1))","v":7},0,"F","2022-02-07","ANTOINE","client 126 Nom","client 126 Prénom",657167997,"client 87 Nom","client 87 Prénom",900688610,15,"Rue du village CH",9700,"ROSNAY L'HOPITAL",null,"Nok","nok","nok",null,"Nok",null,null,"NoK"]
[{"$f":"IF($K99=\"\",0,$C99&\"_\"&$E99&\"_C\"&VLOOKUP($K99,Grand_Est!$I$20:$J$34,2,0)&\"_P_\"&COUNTIF($I$20:$I99,\"P\")&\"_\"&IF(I99=\"F\",\"F\"&COUNTIF($I$20:$I99,\"F\"),\"000\"))","v":"2022_6_C5_P_11_F69"},"Parrain client 29 Nom client 29 Prénom Filleul client 105 Nom client 105 Prénom",2022,2,6,{"$f":"IF(AND(L99<>\"\",M99<>\"\",I99<>\"\"),COUNTIF($I$20:$I99,I99),0)","v":69},{"$f":"IF(AND(L99=\"\",M99=\"\"),0,IF(I99=\"P\",COUNTIF($I$20:$I99,\"P\"),COUNTIF($L$20:$L99,$L99)-1))","v":0},0,"F","2022-02-07","ANTOINE","client 29 Nom","client 29 Prénom",657167997,"client 105 Nom","client 105 Prénom",935477269,4,"Rue du village CZ",9600,"LE MERIOT",null,"Nok","ok",null,"2022-03-04","Ok","2022-03-12",120,"Ok"]
[{"$f":"IF($K100=\"\",0,$C100&\"_\"&$E100&\"_C\"&VLOOKUP($K100,Grand_Est!$I$20:$J$34,2,0)&\"_P_\"&COUNTIF($I$20:$I100,\"P\")&\"_\"&IF(I100=\"F\",\"F\"&COUNTIF($I$20:$I100,\"F\"),\"000\"))","v":"2022_6_C6_P_12_000"},"Parrain client 29 Nom client 29 Prénom",2022,2,6,{"$f":"IF(AND(L100<>\"\",M100<>\"\",I100<>\"\"),COUNTIF($I$20:$I100,I100),0)","v":12},{"$f":"IF(AND(L100=\"\",M100=\"\"),0,IF(I100=\"P\",COUNTIF($I$20:$I100,\"P\"),COUNTIF($L$20:$L100,$L100)-1))","v":12},6,"p","2022-02-07","MAXIME","client 29 Nom","client 29 Prénom",970265928,null,null,null,-7,"Rue du village CH",9500,"ROSNAY L'HOPITAL",null,"Nok","ok",null,"2022-03-04","Ok","2022-03-13",120,"Ok"]
[{"$f":"IF($K101=\"\",0,$C101&\"_\"&$E101&\"_C\"&VLOOKUP($K101,Grand_Est!$I$20:$J$34,2,0)&\"_P_\"&COUNTIF($I$20:$I101,\"P\")&\"_\"&IF(I101=\"F\",\"F\"&COUNTIF($I$20:$I101,\"F\"),\"000\"))","v":"2022_6_C6_P_12_F70"},"Parrain client 21 Nom client 21 Prénom Filleul client 11 Nom client 11 Prénom",2022,2,6,{"$f":"IF(AND(L101<>\"\",M101<>\"\",I101<>\"\"),COUNTIF($I$20:$I101,I101),0)","v":70},{"$f":"IF(AND(L101=\"\",M101=\"\"),0,IF(I101=\"P\",COUNTIF($I$20:$I101,\"P\"),COUNTIF($L$20:$L101,$L101)-1))","v":0},0,"F","2022-02-07","MAXIME","client 21 Nom","client 21 Prénom",970265928,"client 11 Nom","client 11 Prénom",648200684,33,"Rue du village AQ",10200,"AILLEVILLE",null,"Nok","ok",null,"2022-03-02","Ok","2022-03-14",130,"Ok"]
[{"$f":"IF($K102=\"\",0,$C102&\"_\"&$E102&\"_C\"&VLOOKUP($K102,Grand_Est!$I$20:$J$34,2,0)&\"_P_\"&COUNTIF($I$20:$I102,\"P\")&\"_\"&IF(I102=\"F\",\"F\"&COUNTIF($I$20:$I102,\"F\"),\"000\"))","v":"2022_6_C6_P_12_F71"},"Parrain client 21 Nom client 21 Prénom Filleul client 76 Nom client 76 Prénom",2022,2,6,{"$f":"IF(AND(L102<>\"\",M102<>\"\",I102<>\"\"),COUNTIF($I$20:$I102,I102),0)","v":71},{"$f":"IF(AND(L102=\"\",M102=\"\"),0,IF(I102=\"P\",COUNTIF($I$20:$I102,\"P\"),COUNTIF($L$20:$L102,$L102)-1))","v":1},0,"F","2022-02-07","MAXIME","client 21 Nom","client 21 Prénom",970265928,"client 76 Nom","client 76 Prénom",680801034,99,"Rue du village DCH",10400,"SOLIGNY LES ETANGS",null,"Nok","ok",null,"2022-03-02","Ok","2022-03-14",80,"Ok"]
[{"$f":"IF($K103=\"\",0,$C103&\"_\"&$E103&\"_C\"&VLOOKUP($K103,Grand_Est!$I$20:$J$34,2,0)&\"_P_\"&COUNTIF($I$20:$I103,\"P\")&\"_\"&IF(I103=\"F\",\"F\"&COUNTIF($I$20:$I103,\"F\"),\"000\"))","v":"2022_6_C6_P_12_F72"},"Parrain client 21 Nom client 21 Prénom Filleul client 8 Nom client 8 Prénom",2022,2,6,{"$f":"IF(AND(L103<>\"\",M103<>\"\",I103<>\"\"),COUNTIF($I$20:$I103,I103),0)","v":72},{"$f":"IF(AND(L103=\"\",M103=\"\"),0,IF(I103=\"P\",COUNTIF($I$20:$I103,\"P\"),COUNTIF($L$20:$L103,$L103)-1))","v":2},0,"F","2022-02-07","MAXIME","client 21 Nom","client 21 Prénom",970265928,"client 8 Nom","client 8 Prénom",690947261,94,"Rue du village BY",10500,"MOLINS SUR AUBE",null,"Nok","ok",null,null,"Nok",null,null,"NoK"]
[{"$f":"IF($K104=\"\",0,$C104&\"_\"&$E104&\"_C\"&VLOOKUP($K104,Grand_Est!$I$20:$J$34,2,0)&\"_P_\"&COUNTIF($I$20:$I104,\"P\")&\"_\"&IF(I104=\"F\",\"F\"&COUNTIF($I$20:$I104,\"F\"),\"000\"))","v":"2022_6_C6_P_12_F73"},"Parrain client 21 Nom client 21 Prénom Filleul client 9 Nom client 9 Prénom",2022,2,6,{"$f":"IF(AND(L104<>\"\",M104<>\"\",I104<>\"\"),COUNTIF($I$20:$I104,I104),0)","v":73},{"$f":"IF(AND(L104=\"\",M104=\"\"),0,IF(I104=\"P\",COUNTIF($I$20:$I104,\"P\"),COUNTIF($L$20:$L104,$L104)-1))","v":3},0,"F","2022-02-07","MAXIME","client 21 Nom","client 21 Prénom",970265928,"client 9 Nom","client 9 Prénom",611157827,190,"Rue du village DCA",10400,"SOLIGNY LES ETANGS",null,"Nok","ok",null,"2022-03-02","Ok","2022-03-14",100,"Ok"]
[{"$f":"IF($K105=\"\",0,$C105&\"_\"&$E105&\"_C\"&VLOOKUP($K105,Grand_Est!$I$20:$J$34,2,0)&\"_P_\"&COUNTIF($I$20:$I105,\"P\")&\"_\"&IF(I105=\"F\",\"F\"&COUNTIF($I$20:$I105,\"F\"),\"000\"))","v":"2022_6_C6_P_12_F74"},"Parrain client 21 Nom client 21 Prénom Filleul client 135 Nom client 135 Prénom",2022,2,6,{"$f":"IF(AND(L105<>\"\",M105<>\"\",I105<>\"\"),COUNTIF($I$20:$I105,I105),0)","v":74},{"$f":"IF(AND(L105=\"\",M105=\"\"),0,IF(I105=\"P\",COUNTIF($I$20:$I105,\"P\"),COUNTIF($L$20:$L105,$L105)-1))","v":4},0,"F","2022-02-07","MAXIME","client 21 Nom","client 21 Prénom",970265928,"client 135 Nom","client 135 Prénom",696578640,105,"Rue du village CK",10400,"MONTPOTHIER",null,"Nok","nok","ok","2022-03-02","Ok","2022-03-14",140,"Ok"]
[{"$f":"IF($K106=\"\",0,$C106&\"_\"&$E106&\"_C\"&VLOOKUP($K106,Grand_Est!$I$20:$J$34,2,0)&\"_P_\"&COUNTIF($I$20:$I106,\"P\")&\"_\"&IF(I106=\"F\",\"F\"&COUNTIF($I$20:$I106,\"F\"),\"000\"))","v":"2022_6_C6_P_12_F75"},"Parrain client 21 Nom client 21 Prénom Filleul client 126 Nom client 126 Prénom",2022,2,6,{"$f":"IF(AND(L106<>\"\",M106<>\"\",I106<>\"\"),COUNTIF($I$20:$I106,I106),0)","v":75},{"$f":"IF(AND(L106=\"\",M106=\"\"),0,IF(I106=\"P\",COUNTIF($I$20:$I106,\"P\"),COUNTIF($L$20:$L106,$L106)-1))","v":5},0,"F","2022-02-07","MAXIME","client 21 Nom","client 21 Prénom",970265928,"client 126 Nom","client 126 Prénom",620086084,47,"Rue du village AS",10500,"BRAUX",null,"Nok","ok",null,null,"Nok",null,null,"NoK"]
[{"$f":"IF($K107=\"\",0,$C107&\"_\"&$E107&\"_C\"&VLOOKUP($K107,Grand_Est!$I$20:$J$34,2,0)&\"_P_\"&COUNTIF($I$20:$I107,\"P\")&\"_\"&IF(I107=\"F\",\"F\"&COUNTIF($I$20:$I107,\"F\"),\"000\"))","v":"2022_6_C4_P_13_000"},"Parrain client 55 Nom client 55 Prénom",2022,2,6,{"$f":"IF(AND(L107<>\"\",M107<>\"\",I107<>\"\"),COUNTIF($I$20:$I107,I107),0)","v":13},{"$f":"IF(AND(L107=\"\",M107=\"\"),0,IF(I107=\"P\",COUNTIF($I$20:$I107,\"P\"),COUNTIF($L$20:$L107,$L107)-1))","v":13},4,"P","2022-02-07","SILVAIN","client 55 Nom","client 55 Prénom",627086058,null,null,null,194,"Rue du village BR",10500,"LA CHAISE",null,"Nok","ok",null,"2022-03-02","Ok","2022-03-14",120,"Ok"]
[{"$f":"IF($K108=\"\",0,$C108&\"_\"&$E108&\"_C\"&VLOOKUP($K108,Grand_Est!$I$20:$J$34,2,0)&\"_P_\"&COUNTIF($I$20:$I108,\"P\")&\"_\"&IF(I108=\"F\",\"F\"&COUNTIF($I$20:$I108,\"F\"),\"000\"))","v":"2022_6_C5_P_13_F76"},"Parrain client 55 Nom client 55 Prénom Filleul client 133 Nom client 133 Prénom",2022,2,6,{"$f":"IF(AND(L108<>\"\",M108<>\"\",I108<>\"\"),COUNTIF($I$20:$I108,I108),0)","v":76},{"$f":"IF(AND(L108=\"\",M108=\"\"),0,IF(I108=\"P\",COUNTIF($I$20:$I108,\"P\"),COUNTIF($L$20:$L108,$L108)-1))","v":1},0,"F","2022-02-07","ANTOINE","client 55 Nom","client 55 Prénom",627086058,"client 133 Nom","client 133 Prénom",679729494,183,"Rue du village DCV",10240,"MAGNICOURT",null,"Nok","ok",null,"2022-03-02","Ok","2022-03-14",110,"Ok"]
[{"$f":"IF($K109=\"\",0,$C109&\"_\"&$E109&\"_C\"&VLOOKUP($K109,Grand_Est!$I$20:$J$34,2,0)&\"_P_\"&COUNTIF($I$20:$I109,\"P\")&\"_\"&IF(I109=\"F\",\"F\"&COUNTIF($I$20:$I109,\"F\"),\"000\"))","v":"2022_6_C5_P_13_F77"},"Parrain client 55 Nom client 55 Prénom Filleul client 124 Nom client 124 Prénom",2022,2,6,{"$f":"IF(AND(L109<>\"\",M109<>\"\",I109<>\"\"),COUNTIF($I$20:$I109,I109),0)","v":77},{"$f":"IF(AND(L109=\"\",M109=\"\"),0,IF(I109=\"P\",COUNTIF($I$20:$I109,\"P\"),COUNTIF($L$20:$L109,$L109)-1))","v":2},0,"F","2022-02-07","ANTOINE","client 55 Nom","client 55 Prénom",627086058,"client 124 Nom","client 124 Prénom",687867869,177,"Rue du village BT",10500,"LA VILLE AUX BOIS",null,"Nok","nok","ok","2022-03-02","Ok","2022-03-14",90,"Ok"]
[{"$f":"IF($K110=\"\",0,$C110&\"_\"&$E110&\"_C\"&VLOOKUP($K110,Grand_Est!$I$20:$J$34,2,0)&\"_P_\"&COUNTIF($I$20:$I110,\"P\")&\"_\"&IF(I110=\"F\",\"F\"&COUNTIF($I$20:$I110,\"F\"),\"000\"))","v":"2022_6_C5_P_13_F78"},"Parrain client 55 Nom client 55 Prénom Filleul client 81 Nom client 81 Prénom",2022,2,6,{"$f":"IF(AND(L110<>\"\",M110<>\"\",I110<>\"\"),COUNTIF($I$20:$I110,I110),0)","v":78},{"$f":"IF(AND(L110=\"\",M110=\"\"),0,IF(I110=\"P\",COUNTIF($I$20:$I110,\"P\"),COUNTIF($L$20:$L110,$L110)-1))","v":3},0,"F","2022-02-07","ANTOINE","client 55 Nom","client 55 Prénom",627086058,"client 81 Nom","client 81 Prénom",639067026,212,"Rue du village BZ",10500,"MORVILLIERS",null,"Nok","nok","ok","2022-03-02","Ok","2022-03-14",120,"Ok"]
[{"$f":"IF($K111=\"\",0,$C111&\"_\"&$E111&\"_C\"&VLOOKUP($K111,Grand_Est!$I$20:$J$34,2,0)&\"_P_\"&COUNTIF($I$20:$I111,\"P\")&\"_\"&IF(I111=\"F\",\"F\"&COUNTIF($I$20:$I111,\"F\"),\"000\"))","v":"2022_6_C5_P_13_F79"},"Parrain client 55 Nom client 55 Prénom Filleul client 60 Nom client 60 Prénom",2022,2,6,{"$f":"IF(AND(L111<>\"\",M111<>\"\",I111<>\"\"),COUNTIF($I$20:$I111,I111),0)","v":79},{"$f":"IF(AND(L111=\"\",M111=\"\"),0,IF(I111=\"P\",COUNTIF($I$20:$I111,\"P\"),COUNTIF($L$20:$L111,$L111)-1))","v":4},0,"F","2022-02-07","ANTOINE","client 55 Nom","client 55 Prénom",627086058,"client 60 Nom","client 60 Prénom",650795071,14,"Rue du village AX",10500,"COURCELLES SUR VOIRE",null,"Nok","nok","nok",null,"Nok",null,null,"NoK"]
[{"$f":"IF($K112=\"\",0,$C112&\"_\"&$E112&\"_C\"&VLOOKUP($K112,Grand_Est!$I$20:$J$34,2,0)&\"_P_\"&COUNTIF($I$20:$I112,\"P\")&\"_\"&IF(I112=\"F\",\"F\"&COUNTIF($I$20:$I112,\"F\"),\"000\"))","v":"2022_6_C5_P_13_F80"},"Parrain client 55 Nom client 55 Prénom Filleul client 118 Nom client 118 Prénom",2022,2,6,{"$f":"IF(AND(L112<>\"\",M112<>\"\",I112<>\"\"),COUNTIF($I$20:$I112,I112),0)","v":80},{"$f":"IF(AND(L112=\"\",M112=\"\"),0,IF(I112=\"P\",COUNTIF($I$20:$I112,\"P\"),COUNTIF($L$20:$L112,$L112)-1))","v":5},0,"F","2022-02-07","ANTOINE","client 55 Nom","client 55 Prénom",627086058,"client 118 Nom","client 118 Prénom",643941973,36,"Rue du village S",10600,"ST LYE",null,"Nok","ok",null,"2022-03-02","Ok","2022-03-15",100,"Ok"]
[{"$f":"IF($K113=\"\",0,$C113&\"_\"&$E113&\"_C\"&VLOOKUP($K113,Grand_Est!$I$20:$J$34,2,0)&\"_P_\"&COUNTIF($I$20:$I113,\"P\")&\"_\"&IF(I113=\"F\",\"F\"&COUNTIF($I$20:$I113,\"F\"),\"000\"))","v":"2022_6_C6_P_14_000"},"Parrain client 29 Nom client 29 Prénom",2022,2,6,{"$f":"IF(AND(L113<>\"\",M113<>\"\",I113<>\"\"),COUNTIF($I$20:$I113,I113),0)","v":14},{"$f":"IF(AND(L113=\"\",M113=\"\"),0,IF(I113=\"P\",COUNTIF($I$20:$I113,\"P\"),COUNTIF($L$20:$L113,$L113)-1))","v":14},6,"P","2022-02-07","MAXIME","client 29 Nom","client 29 Prénom",627086058,"client 87 Nom","client 87 Prénom",1005054587,18,"Rue du village CH",9400,"ROSNAY L'HOPITAL",null,"Nok","ok",null,"2022-03-03","Ok","2022-03-16",120,"Ok"]
[{"$f":"IF($K114=\"\",0,$C114&\"_\"&$E114&\"_C\"&VLOOKUP($K114,Grand_Est!$I$20:$J$34,2,0)&\"_P_\"&COUNTIF($I$20:$I114,\"P\")&\"_\"&IF(I114=\"F\",\"F\"&COUNTIF($I$20:$I114,\"F\"),\"000\"))","v":"2022_6_C6_P_14_F81"},"Parrain client 29 Nom client 29 Prénom Filleul client 105 Nom client 105 Prénom",2022,2,6,{"$f":"IF(AND(L114<>\"\",M114<>\"\",I114<>\"\"),COUNTIF($I$20:$I114,I114),0)","v":81},{"$f":"IF(AND(L114=\"\",M114=\"\"),0,IF(I114=\"P\",COUNTIF($I$20:$I114,\"P\"),COUNTIF($L$20:$L114,$L114)-1))","v":3},0,"F","2022-02-07","MAXIME","client 29 Nom","client 29 Prénom",627086058,"client 105 Nom","client 105 Prénom",1039843246,29,"Rue du village CZ",9300,"LE MERIOT",null,"Nok","ok",null,"2022-03-04","Ok","2022-03-17",120,"Ok"]
[{"$f":"IF($K115=\"\",0,$C115&\"_\"&$E115&\"_C\"&VLOOKUP($K115,Grand_Est!$I$20:$J$34,2,0)&\"_P_\"&COUNTIF($I$20:$I115,\"P\")&\"_\"&IF(I115=\"F\",\"F\"&COUNTIF($I$20:$I115,\"F\"),\"000\"))","v":"2022_6_C6_P_14_F82"},"Parrain client 29 Nom client 29 Prénom Filleul client 87 Nom client 87 Prénom",2022,2,6,{"$f":"IF(AND(L115<>\"\",M115<>\"\",I115<>\"\"),COUNTIF($I$20:$I115,I115),0)","v":82},{"$f":"IF(AND(L115=\"\",M115=\"\"),0,IF(I115=\"P\",COUNTIF($I$20:$I115,\"P\"),COUNTIF($L$20:$L115,$L115)-1))","v":4},0,"F","2022-02-07","MAXIME","client 29 Nom","client 29 Prénom",627086058,"client 87 Nom","client 87 Prénom",1074631905,40,"Rue du village CH",9200,"ROSNAY L'HOPITAL",null,"Nok","nok","ok",null,"Nok","2022-03-18",null,"NoK"]
[{"$f":"IF($K116=\"\",0,$C116&\"_\"&$E116&\"_C\"&VLOOKUP($K116,Grand_Est!$I$20:$J$34,2,0)&\"_P_\"&COUNTIF($I$20:$I116,\"P\")&\"_\"&IF(I116=\"F\",\"F\"&COUNTIF($I$20:$I116,\"F\"),\"000\"))","v":"2022_6_C6_P_14_F83"},"Parrain client 29 Nom client 29 Prénom Filleul client 105 Nom client 105 Prénom",2022,2,6,{"$f":"IF(AND(L116<>\"\",M116<>\"\",I116<>\"\"),COUNTIF($I$20:$I116,I116),0)","v":83},{"$f":"IF(AND(L116=\"\",M116=\"\"),0,IF(I116=\"P\",COUNTIF($I$20:$I116,\"P\"),COUNTIF($L$20:$L116,$L116)-1))","v":5},{"$f":"IF($I116=\"P\",COUNTIFS($AD$20:$AD$186,\"ok\",$L$20:$L$186,$L116,$M$20:$M$186,$M116)-1,0)","v":0},"F","2022-02-07","MAXIME","client 29 Nom","client 29 Prénom",627086058,"client 105 Nom","client 105 Prénom",1109420564,51,"Rue du village CZ",9100,"LE MERIOT",null,"Nok","nok","ok","2022-03-06","Ok","2022-03-19",120,"Ok"]
[{"$f":"IF($K117=\"\",0,$C117&\"_\"&$E117&\"_C\"&VLOOKUP($K117,Grand_Est!$I$20:$J$34,2,0)&\"_P_\"&COUNTIF($I$20:$I117,\"P\")&\"_\"&IF(I117=\"F\",\"F\"&COUNTIF($I$20:$I117,\"F\"),\"000\"))","v":"2022_6_C6_P_14_F84"},"Parrain client 29 Nom client 29 Prénom Filleul client 87 Nom client 87 Prénom",2022,2,6,{"$f":"IF(AND(L117<>\"\",M117<>\"\",I117<>\"\"),COUNTIF($I$20:$I117,I117),0)","v":84},{"$f":"IF(AND(L117=\"\",M117=\"\"),0,IF(I117=\"P\",COUNTIF($I$20:$I117,\"P\"),COUNTIF($L$20:$L117,$L117)-1))","v":6},0,"F","2022-02-07","MAXIME","client 29 Nom","client 29 Prénom",627086058,"client 87 Nom","client 87 Prénom",1144209223,62,"Rue du village CH",9000,"ROSNAY L'HOPITAL",null,"Nok","nok","ok","2022-03-07","Nok",null,null,"NoK"]
[{"$f":"IF($K118=\"\",0,$C118&\"_\"&$E118&\"_C\"&VLOOKUP($K118,Grand_Est!$I$20:$J$34,2,0)&\"_P_\"&COUNTIF($I$20:$I118,\"P\")&\"_\"&IF(I118=\"F\",\"F\"&COUNTIF($I$20:$I118,\"F\"),\"000\"))","v":"2022_6_C6_P_14_F85"},"Parrain client 29 Nom client 29 Prénom Filleul client 105 Nom client 105 Prénom",2022,2,6,{"$f":"IF(AND(L118<>\"\",M118<>\"\",I118<>\"\"),COUNTIF($I$20:$I118,I118),0)","v":85},{"$f":"IF(AND(L118=\"\",M118=\"\"),0,IF(I118=\"P\",COUNTIF($I$20:$I118,\"P\"),COUNTIF($L$20:$L118,$L118)-1))","v":7},0,"F","2022-02-07","MAXIME","client 29 Nom","client 29 Prénom",627086058,"client 105 Nom","client 105 Prénom",1178997882,73,"Rue du village CZ",8900,"LE MERIOT",null,"Nok","nok","ok","2022-03-08","Ok","2022-03-21",120,"Ok"]
[{"$f":"IF($K119=\"\",0,$C119&\"_\"&$E119&\"_C\"&VLOOKUP($K119,Grand_Est!$I$20:$J$34,2,0)&\"_P_\"&COUNTIF($I$20:$I119,\"P\")&\"_\"&IF(I119=\"F\",\"F\"&COUNTIF($I$20:$I119,\"F\"),\"000\"))","v":"2022_7_C1_P_15_000"},"Parrain client 29 Nom client 29 Prénom",2022,2,7,{"$f":"IF(AND(L119<>\"\",M119<>\"\",I119<>\"\"),COUNTIF($I$20:$I119,I119),0)","v":15},{"$f":"IF(AND(L119=\"\",M119=\"\"),0,IF(I119=\"P\",COUNTIF($I$20:$I119,\"P\"),COUNTIF($L$20:$L119,$L119)-1))","v":15},6,"P","2022-02-14","JEAN","client 29 Nom","client 29 Prénom",1213786541,null,null,null,84,"Rue du village CH",8800,"ROSNAY L'HOPITAL",null,"Nok","ok",null,"2022-03-09","Ok","2022-03-22",120,"Ok"]
[{"$f":"IF($K120=\"\",0,$C120&\"_\"&$E120&\"_C\"&VLOOKUP($K120,Grand_Est!$I$20:$J$34,2,0)&\"_P_\"&COUNTIF($I$20:$I120,\"P\")&\"_\"&IF(I120=\"F\",\"F\"&COUNTIF($I$20:$I120,\"F\"),\"000\"))","v":"2022_7_C1_P_15_F86"},"Parrain client 10 Nom client 10 Prénom Filleul client 105 Nom client 105 Prénom",2022,2,7,{"$f":"IF(AND(L120<>\"\",M120<>\"\",I120<>\"\"),COUNTIF($I$20:$I120,I120),0)","v":86},{"$f":"IF(AND(L120=\"\",M120=\"\"),0,IF(I120=\"P\",COUNTIF($I$20:$I120,\"P\"),COUNTIF($L$20:$L120,$L120)-1))","v":0},0,"F","2022-02-14","JEAN","client 10 Nom","client 10 Prénom",1213786541,"client 105 Nom","client 105 Prénom",1248575200,95,"Rue du village CZ",8700,"LE MERIOT",null,"Nok","nok","nok",null,null,null,null,"NoK"]
[{"$f":"IF($K121=\"\",0,$C121&\"_\"&$E121&\"_C\"&VLOOKUP($K121,Grand_Est!$I$20:$J$34,2,0)&\"_P_\"&COUNTIF($I$20:$I121,\"P\")&\"_\"&IF(I121=\"F\",\"F\"&COUNTIF($I$20:$I121,\"F\"),\"000\"))","v":"2022_7_C1_P_15_F87"},"Parrain client 10 Nom client 10 Prénom Filleul client 87 Nom client 87 Prénom",2022,2,7,{"$f":"IF(AND(L121<>\"\",M121<>\"\",I121<>\"\"),COUNTIF($I$20:$I121,I121),0)","v":87},{"$f":"IF(AND(L121=\"\",M121=\"\"),0,IF(I121=\"P\",COUNTIF($I$20:$I121,\"P\"),COUNTIF($L$20:$L121,$L121)-1))","v":1},0,"F","2022-02-14","JEAN","client 10 Nom","client 10 Prénom",1213786541,"client 87 Nom","client 87 Prénom",1283363859,106,"Rue du village CH",8600,"ROSNAY L'HOPITAL",null,"Nok","ok",null,"2022-03-11","Ok","2022-03-24",120,"Ok"]
[{"$f":"IF($K122=\"\",0,$C122&\"_\"&$E122&\"_C\"&VLOOKUP($K122,Grand_Est!$I$20:$J$34,2,0)&\"_P_\"&COUNTIF($I$20:$I122,\"P\")&\"_\"&IF(I122=\"F\",\"F\"&COUNTIF($I$20:$I122,\"F\"),\"000\"))","v":"2022_7_C1_P_15_F88"},"Parrain client 10 Nom client 10 Prénom Filleul client 105 Nom client 105 Prénom",2022,2,7,{"$f":"IF(AND(L122<>\"\",M122<>\"\",I122<>\"\"),COUNTIF($I$20:$I122,I122),0)","v":88},{"$f":"IF(AND(L122=\"\",M122=\"\"),0,IF(I122=\"P\",COUNTIF($I$20:$I122,\"P\"),COUNTIF($L$20:$L122,$L122)-1))","v":2},0,"F","2022-02-14","JEAN","client 10 Nom","client 10 Prénom",1213786541,"client 105 Nom","client 105 Prénom",1318152518,117,"Rue du village CZ",8500,"LE MERIOT",null,"Nok","ok",null,"2022-03-12","Ok","2022-03-25",120,"Ok"]
[{"$f":"IF($K123=\"\",0,$C123&\"_\"&$E123&\"_C\"&VLOOKUP($K123,Grand_Est!$I$20:$J$34,2,0)&\"_P_\"&COUNTIF($I$20:$I123,\"P\")&\"_\"&IF(I123=\"F\",\"F\"&COUNTIF($I$20:$I123,\"F\"),\"000\"))","v":"2022_7_C1_P_15_F89"},"Parrain client 10 Nom client 10 Prénom Filleul client 87 Nom client 87 Prénom",2022,2,7,{"$f":"IF(AND(L123<>\"\",M123<>\"\",I123<>\"\"),COUNTIF($I$20:$I123,I123),0)","v":89},{"$f":"IF(AND(L123=\"\",M123=\"\"),0,IF(I123=\"P\",COUNTIF($I$20:$I123,\"P\"),COUNTIF($L$20:$L123,$L123)-1))","v":3},0,"F","2022-02-14","JEAN","client 10 Nom","client 10 Prénom",1213786541,"client 87 Nom","client 87 Prénom",1352941177,128,"Rue du village CH",8400,"ROSNAY L'HOPITAL",null,"Nok","nok","nok",null,null,null,null,"NoK"]
[{"$f":"IF($K124=\"\",0,$C124&\"_\"&$E124&\"_C\"&VLOOKUP($K124,Grand_Est!$I$20:$J$34,2,0)&\"_P_\"&COUNTIF($I$20:$I124,\"P\")&\"_\"&IF(I124=\"F\",\"F\"&COUNTIF($I$20:$I124,\"F\"),\"000\"))","v":"2022_7_C1_P_15_F90"},"Parrain client 10 Nom client 10 Prénom Filleul client 87 Nom client 87 Prénom",2022,2,7,{"$f":"IF(AND(L124<>\"\",M124<>\"\",I124<>\"\"),COUNTIF($I$20:$I124,I124),0)","v":90},{"$f":"IF(AND(L124=\"\",M124=\"\"),0,IF(I124=\"P\",COUNTIF($I$20:$I124,\"P\"),COUNTIF($L$20:$L124,$L124)-1))","v":4},0,"F","2022-02-14","JEAN","client 10 Nom","client 10 Prénom",1213786541,"client 87 Nom","client 87 Prénom",1387729836,139,"Rue du village CH",8300,"ROSNAY L'HOPITAL",null,"Nok","nok","ok",null,"Ok","2022-03-27",160,"Ok"]
[{"$f":"IF($K125=\"\",0,$C125&\"_\"&$E125&\"_C\"&VLOOKUP($K125,Grand_Est!$I$20:$J$34,2,0)&\"_P_\"&COUNTIF($I$20:$I125,\"P\")&\"_\"&IF(I125=\"F\",\"F\"&COUNTIF($I$20:$I125,\"F\"),\"000\"))","v":"2022_7_C1_P_15_F91"},"Parrain client 10 Nom client 10 Prénom Filleul client 105 Nom client 105 Prénom",2022,2,7,{"$f":"IF(AND(L125<>\"\",M125<>\"\",I125<>\"\"),COUNTIF($I$20:$I125,I125),0)","v":91},{"$f":"IF(AND(L125=\"\",M125=\"\"),0,IF(I125=\"P\",COUNTIF($I$20:$I125,\"P\"),COUNTIF($L$20:$L125,$L125)-1))","v":5},0,"F","2022-02-14","JEAN","client 10 Nom","client 10 Prénom",1213786541,"client 105 Nom","client 105 Prénom",1422518495,150,"Rue du village CZ",8200,"LE MERIOT",null,"Nok","nok","nok",null,"Nok",null,null,"NoK"]
[{"$f":"IF($K126=\"\",0,$C126&\"_\"&$E126&\"_C\"&VLOOKUP($K126,Grand_Est!$I$20:$J$34,2,0)&\"_P_\"&COUNTIF($I$20:$I126,\"P\")&\"_\"&IF(I126=\"F\",\"F\"&COUNTIF($I$20:$I126,\"F\"),\"000\"))","v":"2022_7_C1_P_15_F92"},"Parrain client 21 Nom client 21 Prénom Filleul client 97 Nom client 97 Prénom",2022,2,7,{"$f":"IF(AND(L126<>\"\",M126<>\"\",I126<>\"\"),COUNTIF($I$20:$I126,I126),0)","v":92},{"$f":"IF(AND(L126=\"\",M126=\"\"),0,IF(I126=\"P\",COUNTIF($I$20:$I126,\"P\"),COUNTIF($L$20:$L126,$L126)-1))","v":6},0,"F","2022-02-14","JEAN","client 21 Nom","client 21 Prénom",1213786541,"client 97 Nom","client 97 Prénom",652908117,90,"Rue du village DCL",10100,"CRANCEY",null,"Nok","ok",null,"2022-03-02","Ok","2022-03-14",120,"Ok"]
[{"$f":"IF($K127=\"\",0,$C127&\"_\"&$E127&\"_C\"&VLOOKUP($K127,Grand_Est!$I$20:$J$34,2,0)&\"_P_\"&COUNTIF($I$20:$I127,\"P\")&\"_\"&IF(I127=\"F\",\"F\"&COUNTIF($I$20:$I127,\"F\"),\"000\"))","v":"2022_7_C2_P_16_000"},"Parrain client 114 Nom client 114 Prénom",2022,2,7,{"$f":"IF(AND(L127<>\"\",M127<>\"\",I127<>\"\"),COUNTIF($I$20:$I127,I127),0)","v":16},{"$f":"IF(AND(L127=\"\",M127=\"\"),0,IF(I127=\"P\",COUNTIF($I$20:$I127,\"P\"),COUNTIF($L$20:$L127,$L127)-1))","v":16},5,"P","2022-02-14","PASCAL","client 114 Nom","client 114 Prénom",687534346,null,null,null,26,"Rue du village K",10120,"CHEVILLELE","2022-03-07","ok",null,null,"2022-03-12","Ok","2022-03-14",140,"Ok"]
[{"$f":"IF($K128=\"\",0,$C128&\"_\"&$E128&\"_C\"&VLOOKUP($K128,Grand_Est!$I$20:$J$34,2,0)&\"_P_\"&COUNTIF($I$20:$I128,\"P\")&\"_\"&IF(I128=\"F\",\"F\"&COUNTIF($I$20:$I128,\"F\"),\"000\"))","v":"2022_7_C2_P_16_F93"},"Parrain client 114 Nom client 114 Prénom Filleul client 77 Nom client 77 Prénom",2022,2,7,{"$f":"IF(AND(L128<>\"\",M128<>\"\",I128<>\"\"),COUNTIF($I$20:$I128,I128),0)","v":93},{"$f":"IF(AND(L128=\"\",M128=\"\"),0,IF(I128=\"P\",COUNTIF($I$20:$I128,\"P\"),COUNTIF($L$20:$L128,$L128)-1))","v":1},0,"F","2022-02-14","PASCAL","client 114 Nom","client 114 Prénom",687534346,"client 77 Nom","client 77 Prénom",616572511,189,"Rue du village BX",10500,"MATHAUX","2022-03-07","ok",null,null,"2022-03-12","Ok","2022-03-14",140,"Ok"]
[{"$f":"IF($K129=\"\",0,$C129&\"_\"&$E129&\"_C\"&VLOOKUP($K129,Grand_Est!$I$20:$J$34,2,0)&\"_P_\"&COUNTIF($I$20:$I129,\"P\")&\"_\"&IF(I129=\"F\",\"F\"&COUNTIF($I$20:$I129,\"F\"),\"000\"))","v":"2022_7_C2_P_16_F94"},"Parrain client 114 Nom client 114 Prénom Filleul client 112 Nom client 112 Prénom",2022,2,7,{"$f":"IF(AND(L129<>\"\",M129<>\"\",I129<>\"\"),COUNTIF($I$20:$I129,I129),0)","v":94},{"$f":"IF(AND(L129=\"\",M129=\"\"),0,IF(I129=\"P\",COUNTIF($I$20:$I129,\"P\"),COUNTIF($L$20:$L129,$L129)-1))","v":2},0,"F","2022-02-14","PASCAL","client 114 Nom","client 114 Prénom",687534346,"client 112 Nom","client 112 Prénom",637465947,3,"Rue du village DCG",10400,"QUINCEY","2022-03-07","Nok","ok",null,"2022-03-12","Ok","2022-03-14",140,"Ok"]
[{"$f":"IF($K130=\"\",0,$C130&\"_\"&$E130&\"_C\"&VLOOKUP($K130,Grand_Est!$I$20:$J$34,2,0)&\"_P_\"&COUNTIF($I$20:$I130,\"P\")&\"_\"&IF(I130=\"F\",\"F\"&COUNTIF($I$20:$I130,\"F\"),\"000\"))","v":"2022_7_C2_P_16_F95"},"Parrain client 114 Nom client 114 Prénom Filleul client 101 Nom client 101 Prénom",2022,2,7,{"$f":"IF(AND(L130<>\"\",M130<>\"\",I130<>\"\"),COUNTIF($I$20:$I130,I130),0)","v":95},{"$f":"IF(AND(L130=\"\",M130=\"\"),0,IF(I130=\"P\",COUNTIF($I$20:$I130,\"P\"),COUNTIF($L$20:$L130,$L130)-1))","v":3},0,"F","2022-02-14","PASCAL","client 114 Nom","client 114 Prénom",687534346,"client 101 Nom","client 101 Prénom",637513979,140,"Rue du village CV",10400,"LA LOUPTIERE THENARD","2022-03-07","Nok","ok",null,"2022-03-12","Ok","2022-03-14",140,"Ok"]
[{"$f":"IF($K131=\"\",0,$C131&\"_\"&$E131&\"_C\"&VLOOKUP($K131,Grand_Est!$I$20:$J$34,2,0)&\"_P_\"&COUNTIF($I$20:$I131,\"P\")&\"_\"&IF(I131=\"F\",\"F\"&COUNTIF($I$20:$I131,\"F\"),\"000\"))","v":"2022_7_C2_P_16_F96"},"Parrain client 114 Nom client 114 Prénom Filleul client 59 Nom client 59 Prénom",2022,2,7,{"$f":"IF(AND(L131<>\"\",M131<>\"\",I131<>\"\"),COUNTIF($I$20:$I131,I131),0)","v":96},{"$f":"IF(AND(L131=\"\",M131=\"\"),0,IF(I131=\"P\",COUNTIF($I$20:$I131,\"P\"),COUNTIF($L$20:$L131,$L131)-1))","v":4},0,"F","2022-02-14","PASCAL","client 114 Nom","client 114 Prénom",687534346,"client 59 Nom","client 59 Prénom",685906285,109,"Rue du village BF",10500,"BRAUX","2022-03-07","ok",null,null,"2022-03-12","Ok","2022-03-14",140,"Ok"]
[{"$f":"IF($K132=\"\",0,$C132&\"_\"&$E132&\"_C\"&VLOOKUP($K132,Grand_Est!$I$20:$J$34,2,0)&\"_P_\"&COUNTIF($I$20:$I132,\"P\")&\"_\"&IF(I132=\"F\",\"F\"&COUNTIF($I$20:$I132,\"F\"),\"000\"))","v":"2022_7_C2_P_16_F97"},"Parrain client 114 Nom client 114 Prénom Filleul client 5 Nom client 5 Prénom",2022,2,7,{"$f":"IF(AND(L132<>\"\",M132<>\"\",I132<>\"\"),COUNTIF($I$20:$I132,I132),0)","v":97},{"$f":"IF(AND(L132=\"\",M132=\"\"),0,IF(I132=\"P\",COUNTIF($I$20:$I132,\"P\"),COUNTIF($L$20:$L132,$L132)-1))","v":5},0,"F","2022-02-14","PASCAL","client 114 Nom","client 114 Prénom",687534346,"client 5 Nom","client 5 Prénom",699104827,67,"Rue du village D",10100,"LA FOSSE CORDUAN","2022-03-07","Nok","ok",null,"2022-03-12","Ok","2022-03-14",140,"Ok"]
[{"$f":"IF($K133=\"\",0,$C133&\"_\"&$E133&\"_C\"&VLOOKUP($K133,Grand_Est!$I$20:$J$34,2,0)&\"_P_\"&COUNTIF($I$20:$I133,\"P\")&\"_\"&IF(I133=\"F\",\"F\"&COUNTIF($I$20:$I133,\"F\"),\"000\"))","v":"2022_7_C2_P_16_F98"},"Parrain client 114 Nom client 114 Prénom Filleul client 40 Nom client 40 Prénom",2022,2,7,{"$f":"IF(AND(L133<>\"\",M133<>\"\",I133<>\"\"),COUNTIF($I$20:$I133,I133),0)","v":98},{"$f":"IF(AND(L133=\"\",M133=\"\"),0,IF(I133=\"P\",COUNTIF($I$20:$I133,\"P\"),COUNTIF($L$20:$L133,$L133)-1))","v":6},0,"F","2022-02-14","PASCAL","client 114 Nom","client 114 Prénom",687534346,"client 40 Nom","client 40 Prénom",649691181,68,"Rue du village AM",10340,"ARRELLES","2022-03-07","ok",null,null,"2022-03-02","Nok",null,null,"NoK"]
[{"$f":"IF($K134=\"\",0,$C134&\"_\"&$E134&\"_C\"&VLOOKUP($K134,Grand_Est!$I$20:$J$34,2,0)&\"_P_\"&COUNTIF($I$20:$I134,\"P\")&\"_\"&IF(I134=\"F\",\"F\"&COUNTIF($I$20:$I134,\"F\"),\"000\"))","v":"2022_7_C3_P_17_000"},"Parrain client 124 Nom client 124 Prénom",2022,2,7,{"$f":"IF(AND(L134<>\"\",M134<>\"\",I134<>\"\"),COUNTIF($I$20:$I134,I134),0)","v":17},{"$f":"IF(AND(L134=\"\",M134=\"\"),0,IF(I134=\"P\",COUNTIF($I$20:$I134,\"P\"),COUNTIF($L$20:$L134,$L134)-1))","v":17},4,"P","2022-02-14","THIERRY","client 124 Nom","client 124 Prénom",685718089,null,null,null,62,"Rue du village DDI",10320,"SOULIGNY","2022-03-07","Nok","ok",null,"2022-03-02","Ok","2022-03-14",140,"Ok"]
[{"$f":"IF($K135=\"\",0,$C135&\"_\"&$E135&\"_C\"&VLOOKUP($K135,Grand_Est!$I$20:$J$34,2,0)&\"_P_\"&COUNTIF($I$20:$I135,\"P\")&\"_\"&IF(I135=\"F\",\"F\"&COUNTIF($I$20:$I135,\"F\"),\"000\"))","v":"2022_7_C3_P_17_F99"},"Parrain client 124 Nom client 124 Prénom Filleul client 61 Nom client 61 Prénom",2022,2,7,{"$f":"IF(AND(L135<>\"\",M135<>\"\",I135<>\"\"),COUNTIF($I$20:$I135,I135),0)","v":99},{"$f":"IF(AND(L135=\"\",M135=\"\"),0,IF(I135=\"P\",COUNTIF($I$20:$I135,\"P\"),COUNTIF($L$20:$L135,$L135)-1))","v":1},0,"F","2022-02-14","THIERRY","client 124 Nom","client 124 Prénom",685718089,"client 61 Nom","client 61 Prénom",699108376,2,"Rue du village BH",10500,"BRIENNE LE CHATEAU","2022-03-07","ok",null,null,"2022-03-02","Ok","2022-03-14",140,"Ok"]
[{"$f":"IF($K136=\"\",0,$C136&\"_\"&$E136&\"_C\"&VLOOKUP($K136,Grand_Est!$I$20:$J$34,2,0)&\"_P_\"&COUNTIF($I$20:$I136,\"P\")&\"_\"&IF(I136=\"F\",\"F\"&COUNTIF($I$20:$I136,\"F\"),\"000\"))","v":"2022_7_C3_P_17_F100"},"Parrain client 124 Nom client 124 Prénom Filleul client 80 Nom client 80 Prénom",2022,2,7,{"$f":"IF(AND(L136<>\"\",M136<>\"\",I136<>\"\"),COUNTIF($I$20:$I136,I136),0)","v":100},{"$f":"IF(AND(L136=\"\",M136=\"\"),0,IF(I136=\"P\",COUNTIF($I$20:$I136,\"P\"),COUNTIF($L$20:$L136,$L136)-1))","v":2},0,"F","2022-02-14","THIERRY","client 124 Nom","client 124 Prénom",685718089,"client 80 Nom","client 80 Prénom",671931994,199,"Rue du village CA",10500,"PEL ET DER","2022-03-07","Nok","nok","ok","2022-03-02","Ok","2022-03-14",140,"Ok"]
[{"$f":"IF($K137=\"\",0,$C137&\"_\"&$E137&\"_C\"&VLOOKUP($K137,Grand_Est!$I$20:$J$34,2,0)&\"_P_\"&COUNTIF($I$20:$I137,\"P\")&\"_\"&IF(I137=\"F\",\"F\"&COUNTIF($I$20:$I137,\"F\"),\"000\"))","v":"2022_7_C3_P_17_F101"},"Parrain client 124 Nom client 124 Prénom Filleul client 139 Nom client 139 Prénom",2022,2,7,{"$f":"IF(AND(L137<>\"\",M137<>\"\",I137<>\"\"),COUNTIF($I$20:$I137,I137),0)","v":101},{"$f":"IF(AND(L137=\"\",M137=\"\"),0,IF(I137=\"P\",COUNTIF($I$20:$I137,\"P\"),COUNTIF($L$20:$L137,$L137)-1))","v":3},0,"F","2022-02-14","THIERRY","client 124 Nom","client 124 Prénom",685718089,"client 139 Nom","client 139 Prénom",624905624,96,"Rue du village DDH",10320,"SOMMEVAL","2022-03-07","ok",null,null,"2022-03-02","Ok","2022-03-14",140,"Ok"]
[{"$f":"IF($K138=\"\",0,$C138&\"_\"&$E138&\"_C\"&VLOOKUP($K138,Grand_Est!$I$20:$J$34,2,0)&\"_P_\"&COUNTIF($I$20:$I138,\"P\")&\"_\"&IF(I138=\"F\",\"F\"&COUNTIF($I$20:$I138,\"F\"),\"000\"))","v":"2022_7_C3_P_17_F102"},"Parrain client 124 Nom client 124 Prénom Filleul client 97 Nom client 97 Prénom",2022,2,7,{"$f":"IF(AND(L138<>\"\",M138<>\"\",I138<>\"\"),COUNTIF($I$20:$I138,I138),0)","v":102},{"$f":"IF(AND(L138=\"\",M138=\"\"),0,IF(I138=\"P\",COUNTIF($I$20:$I138,\"P\"),COUNTIF($L$20:$L138,$L138)-1))","v":4},0,"F","2022-02-14","THIERRY","client 124 Nom","client 124 Prénom",685718089,"client 97 Nom","client 97 Prénom",626040625,28,"Rue du village CR",10400,"FERREUX QUINCEY","2022-03-07","Nok","ok",null,"2022-03-02","Nok",null,null,"NoK"]
[{"$f":"IF($K139=\"\",0,$C139&\"_\"&$E139&\"_C\"&VLOOKUP($K139,Grand_Est!$I$20:$J$34,2,0)&\"_P_\"&COUNTIF($I$20:$I139,\"P\")&\"_\"&IF(I139=\"F\",\"F\"&COUNTIF($I$20:$I139,\"F\"),\"000\"))","v":"2022_7_C3_P_17_F103"},"Parrain client 124 Nom client 124 Prénom Filleul client 90 Nom client 90 Prénom",2022,2,7,{"$f":"IF(AND(L139<>\"\",M139<>\"\",I139<>\"\"),COUNTIF($I$20:$I139,I139),0)","v":103},{"$f":"IF(AND(L139=\"\",M139=\"\"),0,IF(I139=\"P\",COUNTIF($I$20:$I139,\"P\"),COUNTIF($L$20:$L139,$L139)-1))","v":5},0,"F","2022-02-14","THIERRY","client 124 Nom","client 124 Prénom",685718089,"client 90 Nom","client 90 Prénom",696578640,105,"Rue du village CK",10500,"VALLENTIGNY","2022-03-07","ok",null,null,"2022-03-03","Ok","2022-03-16",142,"Ok"]
[{"$f":"IF($K140=\"\",0,$C140&\"_\"&$E140&\"_C\"&VLOOKUP($K140,Grand_Est!$I$20:$J$34,2,0)&\"_P_\"&COUNTIF($I$20:$I140,\"P\")&\"_\"&IF(I140=\"F\",\"F\"&COUNTIF($I$20:$I140,\"F\"),\"000\"))","v":"2022_7_C3_P_17_F104"},"Parrain client 124 Nom client 124 Prénom Filleul client 42 Nom client 42 Prénom",2022,2,7,{"$f":"IF(AND(L140<>\"\",M140<>\"\",I140<>\"\"),COUNTIF($I$20:$I140,I140),0)","v":104},{"$f":"IF(AND(L140=\"\",M140=\"\"),0,IF(I140=\"P\",COUNTIF($I$20:$I140,\"P\"),COUNTIF($L$20:$L140,$L140)-1))","v":6},0,"F","2022-02-14","THIERRY","client 124 Nom","client 124 Prénom",685718089,"client 42 Nom","client 42 Prénom",633850724,10,"Rue du village AO",10270,"BOURANTON","2022-03-07","Nok","nok","nok",null,"Nok",null,null,"NoK"]
[{"$f":"IF($K141=\"\",0,$C141&\"_\"&$E141&\"_C\"&VLOOKUP($K141,Grand_Est!$I$20:$J$34,2,0)&\"_P_\"&COUNTIF($I$20:$I141,\"P\")&\"_\"&IF(I141=\"F\",\"F\"&COUNTIF($I$20:$I141,\"F\"),\"000\"))","v":"2022_7_C4_P_18_000"},"Parrain client 15 Nom client 15 Prénom",2022,2,7,{"$f":"IF(AND(L141<>\"\",M141<>\"\",I141<>\"\"),COUNTIF($I$20:$I141,I141),0)","v":18},{"$f":"IF(AND(L141=\"\",M141=\"\"),0,IF(I141=\"P\",COUNTIF($I$20:$I141,\"P\"),COUNTIF($L$20:$L141,$L141)-1))","v":18},3,"P","2022-02-14","SILVAIN","client 15 Nom","client 15 Prénom",670203892,null,null,null,87,"Rue du village CW",10400,"LA MOTTE TILLY","2022-03-07","ok",null,null,"2022-03-02","Ok","2022-03-14",140,"Ok"]
[{"$f":"IF($K142=\"\",0,$C142&\"_\"&$E142&\"_C\"&VLOOKUP($K142,Grand_Est!$I$20:$J$34,2,0)&\"_P_\"&COUNTIF($I$20:$I142,\"P\")&\"_\"&IF(I142=\"F\",\"F\"&COUNTIF($I$20:$I142,\"F\"),\"000\"))","v":"2022_7_C4_P_18_F105"},"Parrain client 15 Nom client 15 Prénom Filleul client 64 Nom client 64 Prénom",2022,2,7,{"$f":"IF(AND(L142<>\"\",M142<>\"\",I142<>\"\"),COUNTIF($I$20:$I142,I142),0)","v":105},{"$f":"IF(AND(L142=\"\",M142=\"\"),0,IF(I142=\"P\",COUNTIF($I$20:$I142,\"P\"),COUNTIF($L$20:$L142,$L142)-1))","v":1},0,"F","2022-02-14","SILVAIN","client 15 Nom","client 15 Prénom",670203892,"client 64 Nom","client 64 Prénom",652908117,90,"Rue du village DCL",10320,"FAYS LA CHAPELLE","2022-03-07","Nok","nok","ok","2022-03-02","Ok","2022-03-14",140,"Ok"]
[{"$f":"IF($K143=\"\",0,$C143&\"_\"&$E143&\"_C\"&VLOOKUP($K143,Grand_Est!$I$20:$J$34,2,0)&\"_P_\"&COUNTIF($I$20:$I143,\"P\")&\"_\"&IF(I143=\"F\",\"F\"&COUNTIF($I$20:$I143,\"F\"),\"000\"))","v":"2022_7_C4_P_18_F106"},"Parrain client 15 Nom client 15 Prénom Filleul client 120 Nom client 120 Prénom",2022,2,7,{"$f":"IF(AND(L143<>\"\",M143<>\"\",I143<>\"\"),COUNTIF($I$20:$I143,I143),0)","v":106},{"$f":"IF(AND(L143=\"\",M143=\"\"),0,IF(I143=\"P\",COUNTIF($I$20:$I143,\"P\"),COUNTIF($L$20:$L143,$L143)-1))","v":2},0,"F","2022-02-14","SILVAIN","client 15 Nom","client 15 Prénom",670203892,"client 120 Nom","client 120 Prénom",650606084,123,"Rue du village DCU",10240,"LONGSOLS","2022-03-07","Nok","ok",null,"2022-03-02","Ok","2022-03-14",140,"Ok"]
[{"$f":"IF($K144=\"\",0,$C144&\"_\"&$E144&\"_C\"&VLOOKUP($K144,Grand_Est!$I$20:$J$34,2,0)&\"_P_\"&COUNTIF($I$20:$I144,\"P\")&\"_\"&IF(I144=\"F\",\"F\"&COUNTIF($I$20:$I144,\"F\"),\"000\"))","v":"2022_7_C4_P_18_F107"},"Parrain client 15 Nom client 15 Prénom Filleul client 2 Nom client 2 Prénom",2022,2,7,{"$f":"IF(AND(L144<>\"\",M144<>\"\",I144<>\"\"),COUNTIF($I$20:$I144,I144),0)","v":107},{"$f":"IF(AND(L144=\"\",M144=\"\"),0,IF(I144=\"P\",COUNTIF($I$20:$I144,\"P\"),COUNTIF($L$20:$L144,$L144)-1))","v":3},0,"F","2022-02-14","SILVAIN","client 15 Nom","client 15 Prénom",670203892,"client 2 Nom","client 2 Prénom",691851148,16,"Rue du village Z@",10130,"CHESSY LES PRES","2022-03-07","Nok","nok","ok","2022-03-02","Ok","2022-03-14",140,"Ok"]
[{"$f":"IF($K145=\"\",0,$C145&\"_\"&$E145&\"_C\"&VLOOKUP($K145,Grand_Est!$I$20:$J$34,2,0)&\"_P_\"&COUNTIF($I$20:$I145,\"P\")&\"_\"&IF(I145=\"F\",\"F\"&COUNTIF($I$20:$I145,\"F\"),\"000\"))","v":"2022_7_C4_P_18_F108"},"Parrain client 15 Nom client 15 Prénom Filleul client 86 Nom client 86 Prénom",2022,2,7,{"$f":"IF(AND(L145<>\"\",M145<>\"\",I145<>\"\"),COUNTIF($I$20:$I145,I145),0)","v":108},{"$f":"IF(AND(L145=\"\",M145=\"\"),0,IF(I145=\"P\",COUNTIF($I$20:$I145,\"P\"),COUNTIF($L$20:$L145,$L145)-1))","v":4},0,"F","2022-02-14","SILVAIN","client 15 Nom","client 15 Prénom",670203892,"client 86 Nom","client 86 Prénom",634287310,216,"Rue du village BB",10120,"CHEVILLELE","2022-03-07","Nok","nok","nok",null,"Nok",null,null,"NoK"]
[{"$f":"IF($K146=\"\",0,$C146&\"_\"&$E146&\"_C\"&VLOOKUP($K146,Grand_Est!$I$20:$J$34,2,0)&\"_P_\"&COUNTIF($I$20:$I146,\"P\")&\"_\"&IF(I146=\"F\",\"F\"&COUNTIF($I$20:$I146,\"F\"),\"000\"))","v":"2022_7_C5_P_19_000"},"Parrain client 49 Nom client 49 Prénom",2022,2,7,{"$f":"IF(AND(L146<>\"\",M146<>\"\",I146<>\"\"),COUNTIF($I$20:$I146,I146),0)","v":19},{"$f":"IF(AND(L146=\"\",M146=\"\"),0,IF(I146=\"P\",COUNTIF($I$20:$I146,\"P\"),COUNTIF($L$20:$L146,$L146)-1))","v":19},5,"P","2022-02-14","ANTOINE","client 49 Nom","client 49 Prénom",637465947,null,null,null,3,"Rue du village DCG",10400,"QUINCEY","2022-03-07","Nok","nok","ok","2022-03-02","Ok","2022-03-18",175,"Ok"]
[{"$f":"IF($K147=\"\",0,$C147&\"_\"&$E147&\"_C\"&VLOOKUP($K147,Grand_Est!$I$20:$J$34,2,0)&\"_P_\"&COUNTIF($I$20:$I147,\"P\")&\"_\"&IF(I147=\"F\",\"F\"&COUNTIF($I$20:$I147,\"F\"),\"000\"))","v":"2022_7_C5_P_19_F109"},"Parrain client 49 Nom client 49 Prénom Filleul client 122 Nom client 122 Prénom",2022,2,7,{"$f":"IF(AND(L147<>\"\",M147<>\"\",I147<>\"\"),COUNTIF($I$20:$I147,I147),0)","v":109},{"$f":"IF(AND(L147=\"\",M147=\"\"),0,IF(I147=\"P\",COUNTIF($I$20:$I147,\"P\"),COUNTIF($L$20:$L147,$L147)-1))","v":1},0,"F","2022-02-14","ANTOINE","client 49 Nom","client 49 Prénom",637465947,"client 122 Nom","client 122 Prénom",664654982,142,"Rue du village DCQ",10240,"COCLOIS","2022-03-07","Nok","nok","ok","2022-03-02","Ok","2022-03-19",176,"Ok"]
[{"$f":"IF($K148=\"\",0,$C148&\"_\"&$E148&\"_C\"&VLOOKUP($K148,Grand_Est!$I$20:$J$34,2,0)&\"_P_\"&COUNTIF($I$20:$I148,\"P\")&\"_\"&IF(I148=\"F\",\"F\"&COUNTIF($I$20:$I148,\"F\"),\"000\"))","v":"2022_7_C5_P_19_F110"},"Parrain client 49 Nom client 49 Prénom Filleul client 79 Nom client 79 Prénom",2022,2,7,{"$f":"IF(AND(L148<>\"\",M148<>\"\",I148<>\"\"),COUNTIF($I$20:$I148,I148),0)","v":110},{"$f":"IF(AND(L148=\"\",M148=\"\"),0,IF(I148=\"P\",COUNTIF($I$20:$I148,\"P\"),COUNTIF($L$20:$L148,$L148)-1))","v":2},{"$f":"IF($I148=\"P\",COUNTIFS($AD$20:$AD$186,\"ok\",$L$20:$L$186,$L148,$M$20:$M$186,$M148)-1,0)","v":0},"F","2022-02-14","ANTOINE","client 49 Nom","client 49 Prénom",637465947,"client 79 Nom","client 79 Prénom",639067026,212,"Rue du village BZ",10500,"MORVILLIERS","2022-03-07","ok",null,null,"2022-03-02","Ok","2022-03-20",177,"Ok"]
[{"$f":"IF($K149=\"\",0,$C149&\"_\"&$E149&\"_C\"&VLOOKUP($K149,Grand_Est!$I$20:$J$34,2,0)&\"_P_\"&COUNTIF($I$20:$I149,\"P\")&\"_\"&IF(I149=\"F\",\"F\"&COUNTIF($I$20:$I149,\"F\"),\"000\"))","v":"2022_7_C5_P_19_F111"},{"$f":"IF(I149=\"vide\",0,IF($I149=\"P\",\"Parrain\"&\" \"&$L149&\" \"&$M149,IF($I149=\"F\",\"Parrain\"&\" \"&$L149&\" \"&$M149&\" Filleul\"&\" \"&$O149&\" \"&$P149)))","v":"Parrain client 49 Nom client 49 Prénom Filleul client 82 Nom client 82 Prénom"},{"$f":"YEAR($J$2)","v":2022},{"$f":"MONTH($J149)","v":2},{"$f":"WEEKNUM($J149,21)","v":7},{"$f":"IF(AND(L149<>\"\",M149<>\"\",I149<>\"\"),COUNTIF($I$20:$I149,I149),0)","v":111},{"$f":"IF(AND(L149=\"\",M149=\"\"),0,IF(I149=\"P\",COUNTIF($I$20:$I149,\"P\"),COUNTIF($L$20:$L149,$L149)-1))","v":3},0,"F","2022-02-14","ANTOINE","client 49 Nom","client 49 Prénom",637465947,"client 82 Nom","client 82 Prénom",691119431,77,"Rue du village CC",10500,"PETIT MESNIL","2022-03-07","Nok","nok","ok","2022-03-02","Ok","2022-03-21",178,"Ok"]
[{"$f":"IF($K150=\"\",0,$C150&\"_\"&$E150&\"_C\"&VLOOKUP($K150,Grand_Est!$I$20:$J$34,2,0)&\"_P_\"&COUNTIF($I$20:$I150,\"P\")&\"_\"&IF(I150=\"F\",\"F\"&COUNTIF($I$20:$I150,\"F\"),\"000\"))","v":"2022_7_C5_P_19_F112"},"Parrain client 49 Nom client 49 Prénom Filleul client 95 Nom client 95 Prénom",2022,2,7,{"$f":"IF(AND(L150<>\"\",M150<>\"\",I150<>\"\"),COUNTIF($I$20:$I150,I150),0)","v":112},{"$f":"IF(AND(L150=\"\",M150=\"\"),0,IF(I150=\"P\",COUNTIF($I$20:$I150,\"P\"),COUNTIF($L$20:$L150,$L150)-1))","v":4},0,"F","2022-02-14","ANTOINE","client 49 Nom","client 49 Prénom",637465947,"client 95 Nom","client 95 Prénom",631942360,121,"Rue du village CP",10400,"COURCEROY","2022-03-07","Nok","nok","nok",null,"Nok",null,null,"NoK"]
[{"$f":"IF($K151=\"\",0,$C151&\"_\"&$E151&\"_C\"&VLOOKUP($K151,Grand_Est!$I$20:$J$34,2,0)&\"_P_\"&COUNTIF($I$20:$I151,\"P\")&\"_\"&IF(I151=\"F\",\"F\"&COUNTIF($I$20:$I151,\"F\"),\"000\"))","v":"2022_7_C5_P_19_F113"},"Parrain client 49 Nom client 49 Prénom Filleul client 79 Nom client 79 Prénom",2022,2,7,{"$f":"IF(AND(L151<>\"\",M151<>\"\",I151<>\"\"),COUNTIF($I$20:$I151,I151),0)","v":113},{"$f":"IF(AND(L151=\"\",M151=\"\"),0,IF(I151=\"P\",COUNTIF($I$20:$I151,\"P\"),COUNTIF($L$20:$L151,$L151)-1))","v":5},0,"F","2022-02-14","ANTOINE","client 49 Nom","client 49 Prénom",637465947,"client 79 Nom","client 79 Prénom",639067026,212,"Rue du village BZ",10500,"MORVILLIERS","2022-03-07","Nok","nok","ok","2022-03-02","Ok","2022-03-23",180,"Ok"]
[{"$f":"IF($K152=\"\",0,$C152&\"_\"&$E152&\"_C\"&VLOOKUP($K152,Grand_Est!$I$20:$J$34,2,0)&\"_P_\"&COUNTIF($I$20:$I152,\"P\")&\"_\"&IF(I152=\"F\",\"F\"&COUNTIF($I$20:$I152,\"F\"),\"000\"))","v":"2022_7_C5_P_19_F114"},"Parrain client 49 Nom client 49 Prénom Filleul client 4 Nom client 4 Prénom",2022,2,7,{"$f":"IF(AND(L152<>\"\",M152<>\"\",I152<>\"\"),COUNTIF($I$20:$I152,I152),0)","v":114},{"$f":"IF(AND(L152=\"\",M152=\"\"),0,IF(I152=\"P\",COUNTIF($I$20:$I152,\"P\"),COUNTIF($L$20:$L152,$L152)-1))","v":6},0,"F","2022-02-14","ANTOINE","client 49 Nom","client 49 Prénom",637465947,"client 4 Nom","client 4 Prénom",672501849,117,"Rue du village C",10100,"GELANNES","2022-03-07","ok",null,null,"2022-03-02","Ok","2022-03-24",181,"Ok"]
[{"$f":"IF($K153=\"\",0,$C153&\"_\"&$E153&\"_C\"&VLOOKUP($K153,Grand_Est!$I$20:$J$34,2,0)&\"_P_\"&COUNTIF($I$20:$I153,\"P\")&\"_\"&IF(I153=\"F\",\"F\"&COUNTIF($I$20:$I153,\"F\"),\"000\"))","v":"2022_7_C6_P_20_000"},"Parrain client 34 Nom client 34 Prénom",2022,2,7,{"$f":"IF(AND(L153<>\"\",M153<>\"\",I153<>\"\"),COUNTIF($I$20:$I153,I153),0)","v":20},{"$f":"IF(AND(L153=\"\",M153=\"\"),0,IF(I153=\"P\",COUNTIF($I$20:$I153,\"P\"),COUNTIF($L$20:$L153,$L153)-1))","v":20},5,"P","2022-02-14","MAXIME","client 34 Nom","client 34 Prénom",694604705,null,null,null,118,"Rue du village DCS",10240,"DOMMARTIN LE COQ","2022-03-07","Nok","nok","ok","2022-03-02","Ok","2022-03-24",182,"Ok"]
[{"$f":"IF($K154=\"\",0,$C154&\"_\"&$E154&\"_C\"&VLOOKUP($K154,Grand_Est!$I$20:$J$34,2,0)&\"_P_\"&COUNTIF($I$20:$I154,\"P\")&\"_\"&IF(I154=\"F\",\"F\"&COUNTIF($I$20:$I154,\"F\"),\"000\"))","v":"2022_7_C6_P_20_F115"},"Parrain client 34 Nom client 34 Prénom Filleul client 57 Nom client 57 Prénom",2022,2,7,{"$f":"IF(AND(L154<>\"\",M154<>\"\",I154<>\"\"),COUNTIF($I$20:$I154,I154),0)","v":115},{"$f":"IF(AND(L154=\"\",M154=\"\"),0,IF(I154=\"P\",COUNTIF($I$20:$I154,\"P\"),COUNTIF($L$20:$L154,$L154)-1))","v":1},0,"F","2022-02-14","MAXIME","client 34 Nom","client 34 Prénom",694604705,"client 57 Nom","client 57 Prénom",690808392,58,"Rue du village BD",10500,"BLAINCOURT SUR AUBE","2022-03-07","Nok","nok","ok","2022-03-02","Ok","2022-03-24",183,"Ok"]
[{"$f":"IF($K155=\"\",0,$C155&\"_\"&$E155&\"_C\"&VLOOKUP($K155,Grand_Est!$I$20:$J$34,2,0)&\"_P_\"&COUNTIF($I$20:$I155,\"P\")&\"_\"&IF(I155=\"F\",\"F\"&COUNTIF($I$20:$I155,\"F\"),\"000\"))","v":"2022_7_C6_P_20_F116"},"Parrain client 34 Nom client 34 Prénom Filleul client 5 Nom client 5 Prénom",2022,2,7,{"$f":"IF(AND(L155<>\"\",M155<>\"\",I155<>\"\"),COUNTIF($I$20:$I155,I155),0)","v":116},{"$f":"IF(AND(L155=\"\",M155=\"\"),0,IF(I155=\"P\",COUNTIF($I$20:$I155,\"P\"),COUNTIF($L$20:$L155,$L155)-1))","v":2},0,"F","2022-02-14","MAXIME","client 34 Nom","client 34 Prénom",694604705,"client 5 Nom","client 5 Prénom",699104827,67,"Rue du village D",10100,"LA FOSSE CORDUAN","2022-03-07","Nok","ok",null,"2022-03-02","Nok",null,null,"NoK"]
[{"$f":"IF($K156=\"\",0,$C156&\"_\"&$E156&\"_C\"&VLOOKUP($K156,Grand_Est!$I$20:$J$34,2,0)&\"_P_\"&COUNTIF($I$20:$I156,\"P\")&\"_\"&IF(I156=\"F\",\"F\"&COUNTIF($I$20:$I156,\"F\"),\"000\"))","v":"2022_7_C6_P_20_F117"},"Parrain client 34 Nom client 34 Prénom Filleul client 112 Nom client 112 Prénom",2022,2,7,{"$f":"IF(AND(L156<>\"\",M156<>\"\",I156<>\"\"),COUNTIF($I$20:$I156,I156),0)","v":117},{"$f":"IF(AND(L156=\"\",M156=\"\"),0,IF(I156=\"P\",COUNTIF($I$20:$I156,\"P\"),COUNTIF($L$20:$L156,$L156)-1))","v":3},0,"F","2022-02-14","MAXIME","client 34 Nom","client 34 Prénom",694604705,"client 112 Nom","client 112 Prénom",637465947,3,"Rue du village DCG",10400,"QUINCEY","2022-03-07","Nok","nok","ok","2022-03-02","Ok","2022-03-24",185,"Ok"]
[{"$f":"IF($K157=\"\",0,$C157&\"_\"&$E157&\"_C\"&VLOOKUP($K157,Grand_Est!$I$20:$J$34,2,0)&\"_P_\"&COUNTIF($I$20:$I157,\"P\")&\"_\"&IF(I157=\"F\",\"F\"&COUNTIF($I$20:$I157,\"F\"),\"000\"))","v":"2022_7_C6_P_20_F118"},"Parrain client 34 Nom client 34 Prénom Filleul client 123 Nom client 123 Prénom",2022,2,7,{"$f":"IF(AND(L157<>\"\",M157<>\"\",I157<>\"\"),COUNTIF($I$20:$I157,I157),0)","v":118},{"$f":"IF(AND(L157=\"\",M157=\"\"),0,IF(I157=\"P\",COUNTIF($I$20:$I157,\"P\"),COUNTIF($L$20:$L157,$L157)-1))","v":4},0,"F","2022-02-14","MAXIME","client 34 Nom","client 34 Prénom",694604705,"client 123 Nom","client 123 Prénom",642407521,241,"Rue du village DCR",10240,"DAMPIERRE","2022-03-07","Nok","nok","nok",null,"Nok",null,null,"NoK"]
[{"$f":"IF($K158=\"\",0,$C158&\"_\"&$E158&\"_C\"&VLOOKUP($K158,Grand_Est!$I$20:$J$34,2,0)&\"_P_\"&COUNTIF($I$20:$I158,\"P\")&\"_\"&IF(I158=\"F\",\"F\"&COUNTIF($I$20:$I158,\"F\"),\"000\"))","v":"2022_7_C6_P_20_F119"},"Parrain client 34 Nom client 34 Prénom Filleul client 24 Nom client 24 Prénom",2022,2,7,{"$f":"IF(AND(L158<>\"\",M158<>\"\",I158<>\"\"),COUNTIF($I$20:$I158,I158),0)","v":119},{"$f":"IF(AND(L158=\"\",M158=\"\"),0,IF(I158=\"P\",COUNTIF($I$20:$I158,\"P\"),COUNTIF($L$20:$L158,$L158)-1))","v":5},0,"F","2022-02-14","MAXIME","client 34 Nom","client 34 Prénom",694604705,"client 24 Nom","client 24 Prénom",625376012,204,"Rue du village W",10130,"AVREUIL","2022-03-07","Nok","ok","ok","2022-03-02","Ok","2022-03-24",187,"Ok"]
[{"$f":"IF($K159=\"\",0,$C159&\"_\"&$E159&\"_C\"&VLOOKUP($K159,Grand_Est!$I$20:$J$34,2,0)&\"_P_\"&COUNTIF($I$20:$I159,\"P\")&\"_\"&IF(I159=\"F\",\"F\"&COUNTIF($I$20:$I159,\"F\"),\"000\"))","v":"2022_7_C6_P_20_F120"},"Parrain client 34 Nom client 34 Prénom Filleul client 26 Nom client 26 Prénom",2022,2,7,{"$f":"IF(AND(L159<>\"\",M159<>\"\",I159<>\"\"),COUNTIF($I$20:$I159,I159),0)","v":120},{"$f":"IF(AND(L159=\"\",M159=\"\"),0,IF(I159=\"P\",COUNTIF($I$20:$I159,\"P\"),COUNTIF($L$20:$L159,$L159)-1))","v":6},0,"F","2022-02-14","MAXIME","client 34 Nom","client 34 Prénom",694604705,"client 26 Nom","client 26 Prénom",635526547,13,"Rue du village Y",10130,"CHAMOY","2022-03-07","Nok","nok","nok",null,"Nok",null,null,"NoK"]
[{"$f":"IF($K160=\"\",0,$C160&\"_\"&$E160&\"_C\"&VLOOKUP($K160,Grand_Est!$I$20:$J$34,2,0)&\"_P_\"&COUNTIF($I$20:$I160,\"P\")&\"_\"&IF(I160=\"F\",\"F\"&COUNTIF($I$20:$I160,\"F\"),\"000\"))","v":"2022_7_C6_P_20_F121"},"Parrain client 34 Nom client 34 Prénom Filleul client 118 Nom client 118 Prénom",2022,2,7,{"$f":"IF(AND(L160<>\"\",M160<>\"\",I160<>\"\"),COUNTIF($I$20:$I160,I160),0)","v":121},{"$f":"IF(AND(L160=\"\",M160=\"\"),0,IF(I160=\"P\",COUNTIF($I$20:$I160,\"P\"),COUNTIF($L$20:$L160,$L160)-1))","v":7},0,"F","2022-02-14","MAXIME","client 34 Nom","client 34 Prénom",694604705,"client 118 Nom","client 118 Prénom",615171864,196,"Rue du village DCM",10240,"AULNAY","2022-03-07","Nok","nok","ok","2022-03-02","Ok","2022-03-24",189,"Ok"]
[{"$f":"IF($K161=\"\",0,$C161&\"_\"&$E161&\"_C\"&VLOOKUP($K161,Grand_Est!$I$20:$J$34,2,0)&\"_P_\"&COUNTIF($I$20:$I161,\"P\")&\"_\"&IF(I161=\"F\",\"F\"&COUNTIF($I$20:$I161,\"F\"),\"000\"))","v":"2022_7_C6_P_20_F122"},"Parrain client 34 Nom client 34 Prénom Filleul client 54 Nom client 54 Prénom",2022,2,7,{"$f":"IF(AND(L161<>\"\",M161<>\"\",I161<>\"\"),COUNTIF($I$20:$I161,I161),0)","v":122},{"$f":"IF(AND(L161=\"\",M161=\"\"),0,IF(I161=\"P\",COUNTIF($I$20:$I161,\"P\"),COUNTIF($L$20:$L161,$L161)-1))","v":8},0,"F","2022-02-14","MAXIME","client 34 Nom","client 34 Prénom",694604705,"client 54 Nom","client 54 Prénom",684874997,154,"Rue du village BA",10500,"EPAGNE","2022-03-07","Nok","nok","ok","2022-03-02","Ok","2022-03-24",190,"Ok"]
[{"$f":"IF($K162=\"\",0,$C162&\"_\"&$E162&\"_C\"&VLOOKUP($K162,Grand_Est!$I$20:$J$34,2,0)&\"_P_\"&COUNTIF($I$20:$I162,\"P\")&\"_\"&IF(I162=\"F\",\"F\"&COUNTIF($I$20:$I162,\"F\"),\"000\"))","v":"2022_8_C3_P_21_000"},"Parrain client 104 Nom client 104 Prénom",2022,2,8,{"$f":"IF(AND(L162<>\"\",M162<>\"\",I162<>\"\"),COUNTIF($I$20:$I162,I162),0)","v":21},{"$f":"IF(AND(L162=\"\",M162=\"\"),0,IF(I162=\"P\",COUNTIF($I$20:$I162,\"P\"),COUNTIF($L$20:$L162,$L162)-1))","v":21},6,"P","2022-02-21","THIERRY","client 104 Nom","client 104 Prénom",620781576,null,null,null,146,"Rue du village CB",10500,"PERTHES LES BRIENNE","2022-03-07","ok",null,null,"2022-03-02","Ok","2022-03-25",191,"Ok"]
[{"$f":"IF($K163=\"\",0,$C163&\"_\"&$E163&\"_C\"&VLOOKUP($K163,Grand_Est!$I$20:$J$34,2,0)&\"_P_\"&COUNTIF($I$20:$I163,\"P\")&\"_\"&IF(I163=\"F\",\"F\"&COUNTIF($I$20:$I163,\"F\"),\"000\"))","v":"2022_8_C3_P_21_F123"},"Parrain client 104 Nom client 104 Prénom Filleul client 71 Nom client 71 Prénom",2022,2,8,{"$f":"IF(AND(L163<>\"\",M163<>\"\",I163<>\"\"),COUNTIF($I$20:$I163,I163),0)","v":123},{"$f":"IF(AND(L163=\"\",M163=\"\"),0,IF(I163=\"P\",COUNTIF($I$20:$I163,\"P\"),COUNTIF($L$20:$L163,$L163)-1))","v":1},0,"F","2022-02-21","THIERRY","client 104 Nom","client 104 Prénom",620781576,"client 71 Nom","client 71 Prénom",627086058,194,"Rue du village BR",10500,"LA CHAISE","2022-03-07","Nok","nok","ok","2022-03-02","Nok",null,null,"NoK"]
[{"$f":"IF($K164=\"\",0,$C164&\"_\"&$E164&\"_C\"&VLOOKUP($K164,Grand_Est!$I$20:$J$34,2,0)&\"_P_\"&COUNTIF($I$20:$I164,\"P\")&\"_\"&IF(I164=\"F\",\"F\"&COUNTIF($I$20:$I164,\"F\"),\"000\"))","v":"2022_8_C3_P_21_F124"},"Parrain client 104 Nom client 104 Prénom Filleul client 50 Nom client 50 Prénom",2022,2,8,{"$f":"IF(AND(L164<>\"\",M164<>\"\",I164<>\"\"),COUNTIF($I$20:$I164,I164),0)","v":124},{"$f":"IF(AND(L164=\"\",M164=\"\"),0,IF(I164=\"P\",COUNTIF($I$20:$I164,\"P\"),COUNTIF($L$20:$L164,$L164)-1))","v":2},0,"F","2022-02-21","THIERRY","client 104 Nom","client 104 Prénom",620781576,"client 50 Nom","client 50 Prénom",660416816,73,"Rue du village AW",10500,"CHAUMESNIL","2022-03-07","Nok","nok","ok","2022-03-02","Ok","2022-03-27",193,"Ok"]
[{"$f":"IF($K165=\"\",0,$C165&\"_\"&$E165&\"_C\"&VLOOKUP($K165,Grand_Est!$I$20:$J$34,2,0)&\"_P_\"&COUNTIF($I$20:$I165,\"P\")&\"_\"&IF(I165=\"F\",\"F\"&COUNTIF($I$20:$I165,\"F\"),\"000\"))","v":"2022_8_C3_P_21_F125"},"Parrain client 104 Nom client 104 Prénom Filleul client 134 Nom client 134 Prénom",2022,2,8,{"$f":"IF(AND(L165<>\"\",M165<>\"\",I165<>\"\"),COUNTIF($I$20:$I165,I165),0)","v":125},{"$f":"IF(AND(L165=\"\",M165=\"\"),0,IF(I165=\"P\",COUNTIF($I$20:$I165,\"P\"),COUNTIF($L$20:$L165,$L165)-1))","v":3},0,"F","2022-02-21","THIERRY","client 104 Nom","client 104 Prénom",620781576,"client 134 Nom","client 134 Prénom",644317260,93,"Rue du village DDC",10320,"LIREY","2022-03-07","Nok","ok",null,"2022-03-02","Ok","2022-03-28",194,"Ok"]
[{"$f":"IF($K166=\"\",0,$C166&\"_\"&$E166&\"_C\"&VLOOKUP($K166,Grand_Est!$I$20:$J$34,2,0)&\"_P_\"&COUNTIF($I$20:$I166,\"P\")&\"_\"&IF(I166=\"F\",\"F\"&COUNTIF($I$20:$I166,\"F\"),\"000\"))","v":"2022_8_C3_P_21_F126"},"Parrain client 104 Nom client 104 Prénom Filleul client 61 Nom client 61 Prénom",2022,2,8,{"$f":"IF(AND(L166<>\"\",M166<>\"\",I166<>\"\"),COUNTIF($I$20:$I166,I166),0)","v":126},{"$f":"IF(AND(L166=\"\",M166=\"\"),0,IF(I166=\"P\",COUNTIF($I$20:$I166,\"P\"),COUNTIF($L$20:$L166,$L166)-1))","v":4},0,"F","2022-02-21","THIERRY","client 104 Nom","client 104 Prénom",620781576,"client 61 Nom","client 61 Prénom",699108376,2,"Rue du village BH",10500,"BRIENNE LE CHATEAU","2022-03-07","Nok","nok","ok","2022-03-02","Ok","2022-03-29",195,"Ok"]
[{"$f":"IF($K167=\"\",0,$C167&\"_\"&$E167&\"_C\"&VLOOKUP($K167,Grand_Est!$I$20:$J$34,2,0)&\"_P_\"&COUNTIF($I$20:$I167,\"P\")&\"_\"&IF(I167=\"F\",\"F\"&COUNTIF($I$20:$I167,\"F\"),\"000\"))","v":"2022_8_C3_P_21_F127"},"Parrain client 104 Nom client 104 Prénom Filleul client 32 Nom client 32 Prénom",2022,2,8,{"$f":"IF(AND(L167<>\"\",M167<>\"\",I167<>\"\"),COUNTIF($I$20:$I167,I167),0)","v":127},{"$f":"IF(AND(L167=\"\",M167=\"\"),0,IF(I167=\"P\",COUNTIF($I$20:$I167,\"P\"),COUNTIF($L$20:$L167,$L167)-1))","v":5},0,"F","2022-02-21","THIERRY","client 104 Nom","client 104 Prénom",620781576,"client 32 Nom","client 32 Prénom",679497612,44,"Rue du village AE",10430,"ROSIERES PRES TROYES","2022-03-07","Nok","nok","nok",null,"Nok",null,null,"Ok"]
[{"$f":"IF($K168=\"\",0,$C168&\"_\"&$E168&\"_C\"&VLOOKUP($K168,Grand_Est!$I$20:$J$34,2,0)&\"_P_\"&COUNTIF($I$20:$I168,\"P\")&\"_\"&IF(I168=\"F\",\"F\"&COUNTIF($I$20:$I168,\"F\"),\"000\"))","v":"2022_8_C3_P_21_F128"},"Parrain client 104 Nom client 104 Prénom Filleul client 21 Nom client 21 Prénom",2022,2,8,{"$f":"IF(AND(L168<>\"\",M168<>\"\",I168<>\"\"),COUNTIF($I$20:$I168,I168),0)","v":128},{"$f":"IF(AND(L168=\"\",M168=\"\"),0,IF(I168=\"P\",COUNTIF($I$20:$I168,\"P\"),COUNTIF($L$20:$L168,$L168)-1))","v":6},0,"F","2022-02-21","THIERRY","client 104 Nom","client 104 Prénom",620781576,"client 21 Nom","client 21 Prénom",689304712,201,"Rue du village T",10600,"VILLACERF","2022-03-07","Nok","ok",null,"2022-03-02","Ok","2022-03-31",197,"Ok"]
[{"$f":"IF($K169=\"\",0,$C169&\"_\"&$E169&\"_C\"&VLOOKUP($K169,Grand_Est!$I$20:$J$34,2,0)&\"_P_\"&COUNTIF($I$20:$I169,\"P\")&\"_\"&IF(I169=\"F\",\"F\"&COUNTIF($I$20:$I169,\"F\"),\"000\"))","v":"2022_8_C3_P_21_F129"},"Parrain client 104 Nom client 104 Prénom Filleul client 15 Nom client 15 Prénom",2022,2,8,{"$f":"IF(AND(L169<>\"\",M169<>\"\",I169<>\"\"),COUNTIF($I$20:$I169,I169),0)","v":129},{"$f":"IF(AND(L169=\"\",M169=\"\"),0,IF(I169=\"P\",COUNTIF($I$20:$I169,\"P\"),COUNTIF($L$20:$L169,$L169)-1))","v":7},0,"F","2022-02-21","THIERRY","client 104 Nom","client 104 Prénom",620781576,"client 15 Nom","client 15 Prénom",650252785,159,"Rue du village N",10600,"LA CHAPELLE ST LUC","2022-03-07","Nok","nok","ok","2022-03-02","Ok","2022-04-01",198,"Ok"]
[{"$f":"IF($K170=\"\",0,$C170&\"_\"&$E170&\"_C\"&VLOOKUP($K170,Grand_Est!$I$20:$J$34,2,0)&\"_P_\"&COUNTIF($I$20:$I170,\"P\")&\"_\"&IF(I170=\"F\",\"F\"&COUNTIF($I$20:$I170,\"F\"),\"000\"))","v":"2022_8_C1_P_22_000"},"Parrain client 27 Nom client 27 Prénom",2022,2,8,{"$f":"IF(AND(L170<>\"\",M170<>\"\",I170<>\"\"),COUNTIF($I$20:$I170,I170),0)","v":22},{"$f":"IF(AND(L170=\"\",M170=\"\"),0,IF(I170=\"P\",COUNTIF($I$20:$I170,\"P\"),COUNTIF($L$20:$L170,$L170)-1))","v":22},6,"P","2022-02-21","JEAN","client 27 Nom","client 27 Prénom",679729494,null,null,null,183,"Rue du village DCV",10240,"MAGNICOURT","2022-03-07","Nok","nok","nok",null,"Nok",null,null,"NoK"]
[{"$f":"IF($K171=\"\",0,$C171&\"_\"&$E171&\"_C\"&VLOOKUP($K171,Grand_Est!$I$20:$J$34,2,0)&\"_P_\"&COUNTIF($I$20:$I171,\"P\")&\"_\"&IF(I171=\"F\",\"F\"&COUNTIF($I$20:$I171,\"F\"),\"000\"))","v":"2022_8_C1_P_22_F130"},"Parrain client 27 Nom client 27 Prénom Filleul client 75 Nom client 75 Prénom",2022,2,8,{"$f":"IF(AND(L171<>\"\",M171<>\"\",I171<>\"\"),COUNTIF($I$20:$I171,I171),0)","v":130},{"$f":"IF(AND(L171=\"\",M171=\"\"),0,IF(I171=\"P\",COUNTIF($I$20:$I171,\"P\"),COUNTIF($L$20:$L171,$L171)-1))","v":1},0,"F","2022-02-21","JEAN","client 27 Nom","client 27 Prénom",679729494,"client 75 Nom","client 75 Prénom",620487087,75,"Rue du village BV",10500,"LESMONT","2022-03-07","Nok","ok",null,"2022-03-02","Ok","2022-04-03",200,"Ok"]
[{"$f":"IF($K172=\"\",0,$C172&\"_\"&$E172&\"_C\"&VLOOKUP($K172,Grand_Est!$I$20:$J$34,2,0)&\"_P_\"&COUNTIF($I$20:$I172,\"P\")&\"_\"&IF(I172=\"F\",\"F\"&COUNTIF($I$20:$I172,\"F\"),\"000\"))","v":"2022_8_C1_P_22_F131"},"Parrain client 27 Nom client 27 Prénom Filleul client 126 Nom client 126 Prénom",2022,2,8,{"$f":"IF(AND(L172<>\"\",M172<>\"\",I172<>\"\"),COUNTIF($I$20:$I172,I172),0)","v":131},{"$f":"IF(AND(L172=\"\",M172=\"\"),0,IF(I172=\"P\",COUNTIF($I$20:$I172,\"P\"),COUNTIF($L$20:$L172,$L172)-1))","v":2},0,"F","2022-02-21","JEAN","client 27 Nom","client 27 Prénom",679729494,"client 126 Nom","client 126 Prénom",650606084,123,"Rue du village DCU",10240,"LONGSOLS","2022-03-07","Nok","nok","ok","2022-03-02","Ok","2022-04-04",201,"Ok"]
[{"$f":"IF($K173=\"\",0,$C173&\"_\"&$E173&\"_C\"&VLOOKUP($K173,Grand_Est!$I$20:$J$34,2,0)&\"_P_\"&COUNTIF($I$20:$I173,\"P\")&\"_\"&IF(I173=\"F\",\"F\"&COUNTIF($I$20:$I173,\"F\"),\"000\"))","v":"2022_8_C1_P_22_F132"},"Parrain client 27 Nom client 27 Prénom Filleul client 52 Nom client 52 Prénom",2022,2,8,{"$f":"IF(AND(L173<>\"\",M173<>\"\",I173<>\"\"),COUNTIF($I$20:$I173,I173),0)","v":132},{"$f":"IF(AND(L173=\"\",M173=\"\"),0,IF(I173=\"P\",COUNTIF($I$20:$I173,\"P\"),COUNTIF($L$20:$L173,$L173)-1))","v":3},0,"F","2022-02-21","JEAN","client 27 Nom","client 27 Prénom",679729494,"client 52 Nom","client 52 Prénom",666683420,129,"Rue du village AY",10500,"CRESPY LE NEUF","2022-03-07","Nok","nok","ok","2022-03-02","Ok","2022-04-05",202,"Ok"]
[{"$f":"IF($K174=\"\",0,$C174&\"_\"&$E174&\"_C\"&VLOOKUP($K174,Grand_Est!$I$20:$J$34,2,0)&\"_P_\"&COUNTIF($I$20:$I174,\"P\")&\"_\"&IF(I174=\"F\",\"F\"&COUNTIF($I$20:$I174,\"F\"),\"000\"))","v":"2022_8_C1_P_22_F133"},"Parrain client 27 Nom client 27 Prénom Filleul client 5 Nom client 5 Prénom",2022,2,8,{"$f":"IF(AND(L174<>\"\",M174<>\"\",I174<>\"\"),COUNTIF($I$20:$I174,I174),0)","v":133},{"$f":"IF(AND(L174=\"\",M174=\"\"),0,IF(I174=\"P\",COUNTIF($I$20:$I174,\"P\"),COUNTIF($L$20:$L174,$L174)-1))","v":4},0,"F","2022-02-21","JEAN","client 27 Nom","client 27 Prénom",679729494,"client 5 Nom","client 5 Prénom",699104827,67,"Rue du village D",10100,"LA FOSSE CORDUAN","2022-03-07","Nok","ok",null,"2022-03-02","Nok",null,null,"NoK"]
[{"$f":"IF($K175=\"\",0,$C175&\"_\"&$E175&\"_C\"&VLOOKUP($K175,Grand_Est!$I$20:$J$34,2,0)&\"_P_\"&COUNTIF($I$20:$I175,\"P\")&\"_\"&IF(I175=\"F\",\"F\"&COUNTIF($I$20:$I175,\"F\"),\"000\"))","v":"2022_8_C1_P_22_F134"},"Parrain client 27 Nom client 27 Prénom Filleul client 112 Nom client 112 Prénom",2022,2,8,{"$f":"IF(AND(L175<>\"\",M175<>\"\",I175<>\"\"),COUNTIF($I$20:$I175,I175),0)","v":134},{"$f":"IF(AND(L175=\"\",M175=\"\"),0,IF(I175=\"P\",COUNTIF($I$20:$I175,\"P\"),COUNTIF($L$20:$L175,$L175)-1))","v":5},0,"F","2022-02-21","JEAN","client 27 Nom","client 27 Prénom",679729494,"client 112 Nom","client 112 Prénom",637465947,3,"Rue du village DCG",10400,"QUINCEY","2022-03-07","Nok","ok",null,"2022-03-02","Ok","2022-04-07",204,"Ok"]
[{"$f":"IF($K176=\"\",0,$C176&\"_\"&$E176&\"_C\"&VLOOKUP($K176,Grand_Est!$I$20:$J$34,2,0)&\"_P_\"&COUNTIF($I$20:$I176,\"P\")&\"_\"&IF(I176=\"F\",\"F\"&COUNTIF($I$20:$I176,\"F\"),\"000\"))","v":"2022_8_C1_P_22_F135"},"Parrain client 27 Nom client 27 Prénom Filleul client 51 Nom client 51 Prénom",2022,2,8,{"$f":"IF(AND(L176<>\"\",M176<>\"\",I176<>\"\"),COUNTIF($I$20:$I176,I176),0)","v":135},{"$f":"IF(AND(L176=\"\",M176=\"\"),0,IF(I176=\"P\",COUNTIF($I$20:$I176,\"P\"),COUNTIF($L$20:$L176,$L176)-1))","v":6},0,"F","2022-02-21","JEAN","client 27 Nom","client 27 Prénom",679729494,"client 51 Nom","client 51 Prénom",650795071,14,"Rue du village AX",10500,"COURCELLES SUR VOIRE","2022-03-07","Nok","nok","ok","2022-03-02","Ok","2022-04-08",205,"Ok"]
[{"$f":"IF($K177=\"\",0,$C177&\"_\"&$E177&\"_C\"&VLOOKUP($K177,Grand_Est!$I$20:$J$34,2,0)&\"_P_\"&COUNTIF($I$20:$I177,\"P\")&\"_\"&IF(I177=\"F\",\"F\"&COUNTIF($I$20:$I177,\"F\"),\"000\"))","v":"2022_8_C1_P_22_F136"},"Parrain client 27 Nom client 27 Prénom Filleul client 74 Nom client 74 Prénom",2022,2,8,{"$f":"IF(AND(L177<>\"\",M177<>\"\",I177<>\"\"),COUNTIF($I$20:$I177,I177),0)","v":136},{"$f":"IF(AND(L177=\"\",M177=\"\"),0,IF(I177=\"P\",COUNTIF($I$20:$I177,\"P\"),COUNTIF($L$20:$L177,$L177)-1))","v":7},0,"F","2022-02-21","JEAN","client 27 Nom","client 27 Prénom",679729494,"client 74 Nom","client 74 Prénom",660546033,38,"Rue du village BU",10500,"LASSICOURT","2022-03-07","Nok","ok",null,"2022-03-02","Ok","2022-04-09",206,"Ok"]
[{"$f":"IF($K178=\"\",0,$C178&\"_\"&$E178&\"_C\"&VLOOKUP($K178,Grand_Est!$I$20:$J$34,2,0)&\"_P_\"&COUNTIF($I$20:$I178,\"P\")&\"_\"&IF(I178=\"F\",\"F\"&COUNTIF($I$20:$I178,\"F\"),\"000\"))","v":"2022_8_C1_P_22_F137"},"Parrain client 27 Nom client 27 Prénom Filleul client 48 Nom client 48 Prénom",2022,2,8,{"$f":"IF(AND(L178<>\"\",M178<>\"\",I178<>\"\"),COUNTIF($I$20:$I178,I178),0)","v":137},{"$f":"IF(AND(L178=\"\",M178=\"\"),0,IF(I178=\"P\",COUNTIF($I$20:$I178,\"P\"),COUNTIF($L$20:$L178,$L178)-1))","v":8},0,"F","2022-02-21","JEAN","client 27 Nom","client 27 Prénom",679729494,"client 48 Nom","client 48 Prénom",674409450,180,"Rue du village AU",10500,"BRIENNE LE CHATEAU","2022-03-07","Nok","ok",null,"2022-03-02","Ok","2022-04-10",206,"Ok"]
[{"$f":"IF($K179=\"\",0,$C179&\"_\"&$E179&\"_C\"&VLOOKUP($K179,Grand_Est!$I$20:$J$34,2,0)&\"_P_\"&COUNTIF($I$20:$I179,\"P\")&\"_\"&IF(I179=\"F\",\"F\"&COUNTIF($I$20:$I179,\"F\"),\"000\"))","v":"2022_8_C2_P_23_000"},"Parrain client 30 Nom client 30 Prénom",2022,2,8,{"$f":"IF(AND(L179<>\"\",M179<>\"\",I179<>\"\"),COUNTIF($I$20:$I179,I179),0)","v":23},{"$f":"IF(AND(L179=\"\",M179=\"\"),0,IF(I179=\"P\",COUNTIF($I$20:$I179,\"P\"),COUNTIF($L$20:$L179,$L179)-1))","v":23},5,"P","2022-02-21","PASCAL","client 30 Nom","client 30 Prénom",671364202,null,null,null,133,"Rue du village CJ",10500,"ST LEGER SOUS BRIENNE","2022-03-07","Nok","nok","ok","2022-03-14","Nok",null,null,"NoK"]
[{"$f":"IF($K180=\"\",0,$C180&\"_\"&$E180&\"_C\"&VLOOKUP($K180,Grand_Est!$I$20:$J$34,2,0)&\"_P_\"&COUNTIF($I$20:$I180,\"P\")&\"_\"&IF(I180=\"F\",\"F\"&COUNTIF($I$20:$I180,\"F\"),\"000\"))","v":"2022_8_C2_P_23_F138"},"Parrain client 30 Nom client 30 Prénom Filleul client 89 Nom client 89 Prénom",2022,2,8,{"$f":"IF(AND(L180<>\"\",M180<>\"\",I180<>\"\"),COUNTIF($I$20:$I180,I180),0)","v":138},{"$f":"IF(AND(L180=\"\",M180=\"\"),0,IF(I180=\"P\",COUNTIF($I$20:$I180,\"P\"),COUNTIF($L$20:$L180,$L180)-1))","v":1},{"$f":"IF($I180=\"P\",COUNTIFS($AD$20:$AD$186,\"ok\",$L$20:$L$186,$L180,$M$20:$M$186,$M180)-1,0)","v":0},"F","2022-02-21","PASCAL","client 30 Nom","client 30 Prénom",671364202,"client 89 Nom","client 89 Prénom",688593398,106,"Rue du village CE",10500,"PRECY ST MARTIN","2022-03-07","Nok","nok","ok","2022-03-14","Ok","2022-03-28",206,"Ok"]
[{"$f":"IF($K181=\"\",0,$C181&\"_\"&$E181&\"_C\"&VLOOKUP($K181,Grand_Est!$I$20:$J$34,2,0)&\"_P_\"&COUNTIF($I$20:$I181,\"P\")&\"_\"&IF(I181=\"F\",\"F\"&COUNTIF($I$20:$I181,\"F\"),\"000\"))","v":"2022_8_C2_P_23_F139"},"Parrain client 30 Nom client 30 Prénom Filleul client 127 Nom client 127 Prénom",2022,2,8,{"$f":"IF(AND(L181<>\"\",M181<>\"\",I181<>\"\"),COUNTIF($I$20:$I181,I181),0)","v":139},{"$f":"IF(AND(L181=\"\",M181=\"\"),0,IF(I181=\"P\",COUNTIF($I$20:$I181,\"P\"),COUNTIF($L$20:$L181,$L181)-1))","v":2},0,"F","2022-02-21","PASCAL","client 30 Nom","client 30 Prénom",671364202,"client 127 Nom","client 127 Prénom",673909860,213,"Rue du village CG",10500,"RANCES","2022-03-07","Nok","ok",null,"2022-03-14","Ok","2022-03-28",206,"Ok"]
[{"$f":"IF($K182=\"\",0,$C182&\"_\"&$E182&\"_C\"&VLOOKUP($K182,Grand_Est!$I$20:$J$34,2,0)&\"_P_\"&COUNTIF($I$20:$I182,\"P\")&\"_\"&IF(I182=\"F\",\"F\"&COUNTIF($I$20:$I182,\"F\"),\"000\"))","v":"2022_8_C2_P_23_F140"},"Parrain client 30 Nom client 30 Prénom Filleul client 120 Nom client 120 Prénom",2022,2,8,{"$f":"IF(AND(L182<>\"\",M182<>\"\",I182<>\"\"),COUNTIF($I$20:$I182,I182),0)","v":140},{"$f":"IF(AND(L182=\"\",M182=\"\"),0,IF(I182=\"P\",COUNTIF($I$20:$I182,\"P\"),COUNTIF($L$20:$L182,$L182)-1))","v":3},0,"F","2022-02-21","PASCAL","client 30 Nom","client 30 Prénom",671364202,"client 120 Nom","client 120 Prénom",631146229,141,"Rue du village BE",10500,"BLIGNICOURT","2022-03-07","Nok","nok","nok",null,"Nok",null,null,"NoK"]
[{"$f":"IF($K183=\"\",0,$C183&\"_\"&$E183&\"_C\"&VLOOKUP($K183,Grand_Est!$I$20:$J$34,2,0)&\"_P_\"&COUNTIF($I$20:$I183,\"P\")&\"_\"&IF(I183=\"F\",\"F\"&COUNTIF($I$20:$I183,\"F\"),\"000\"))","v":"2022_8_C2_P_23_F141"},"Parrain client 30 Nom client 30 Prénom Filleul client 55 Nom client 55 Prénom",2022,2,8,{"$f":"IF(AND(L183<>\"\",M183<>\"\",I183<>\"\"),COUNTIF($I$20:$I183,I183),0)","v":141},{"$f":"IF(AND(L183=\"\",M183=\"\"),0,IF(I183=\"P\",COUNTIF($I$20:$I183,\"P\"),COUNTIF($L$20:$L183,$L183)-1))","v":4},0,"F","2022-02-21","PASCAL","client 30 Nom","client 30 Prénom",671364202,"client 55 Nom","client 55 Prénom",677819310,166,"Rue du village CS",10400,"FONTAINE MACON","2022-03-07","Nok","nok","ok","2022-03-14","Ok","2022-03-28",206,"Ok"]
[{"$f":"IF($K184=\"\",0,$C184&\"_\"&$E184&\"_C\"&VLOOKUP($K184,Grand_Est!$I$20:$J$34,2,0)&\"_P_\"&COUNTIF($I$20:$I184,\"P\")&\"_\"&IF(I184=\"F\",\"F\"&COUNTIF($I$20:$I184,\"F\"),\"000\"))","v":"2022_8_C2_P_23_F142"},"Parrain client 30 Nom client 30 Prénom Filleul client 35 Nom client 35 Prénom",2022,2,{"$f":"WEEKNUM($J184,21)","v":8},{"$f":"IF(AND(L184<>\"\",M184<>\"\",I184<>\"\"),COUNTIF($I$20:$I184,I184),0)","v":142},{"$f":"IF(AND(L184=\"\",M184=\"\"),0,IF(I184=\"P\",COUNTIF($I$20:$I184,\"P\"),COUNTIF($L$20:$L184,$L184)-1))","v":5},0,"F","2022-02-21","PASCAL","client 30 Nom","client 30 Prénom",671364202,"client 35 Nom","client 35 Prénom",634287310,216,"Rue du village BB",10120,"CHEVILLELE","2022-03-07","Nok","ok",null,"2022-03-14","Ok","2022-03-28",206,"Ok"]
[{"$f":"IF($K185=\"\",0,$C185&\"_\"&$E185&\"_C\"&VLOOKUP($K185,Grand_Est!$I$20:$J$34,2,0)&\"_P_\"&COUNTIF($I$20:$I185,\"P\")&\"_\"&IF(I185=\"F\",\"F\"&COUNTIF($I$20:$I185,\"F\"),\"000\"))","v":"2022_8_C2_P_24_000"},"Parrain client 30 Nom client 30 Prénom",2022,2,8,{"$f":"IF(AND(L185<>\"\",M185<>\"\",I185<>\"\"),COUNTIF($I$20:$I185,I185),0)","v":24},{"$f":"IF(AND(L185=\"\",M185=\"\"),0,IF(I185=\"P\",COUNTIF($I$20:$I185,\"P\"),COUNTIF($L$20:$L185,$L185)-1))","v":24},5,"P","2022-02-21","PASCAL","client 30 Nom","client 30 Prénom",671364202,"client 110 Nom","client 110 Prénom",671364202,133,"Rue du village CJ",10500,"ST LEGER SOUS BRIENNE","2022-03-07","Nok","nok","ok","2022-03-14","Ok","2022-03-28",206,"Ok"]
[{"$f":"IF($K186=\"\",0,$C186&\"_\"&$E186&\"_C\"&VLOOKUP($K186,Grand_Est!$I$20:$J$34,2,0)&\"_P_\"&COUNTIF($I$20:$I186,\"P\")&\"_\"&IF(I186=\"F\",\"F\"&COUNTIF($I$20:$I186,\"F\"),\"000\"))","v":"2022_13_C1_P_24_F143"},{"$f":"IF(I186=\"vide\",0,IF($I186=\"P\",\"Parrain\"&\" \"&$L186&\" \"&$M186,IF($I186=\"F\",\"Parrain\"&\" \"&$L186&\" \"&$M186&\" Filleul\"&\" \"&$O186&\" \"&$P186)))","v":"Parrain client 30 Nom client 30 Prénom Filleul client 110 Nom client 110 Prénom"},{"$f":"YEAR($J$2)","v":2022},{"$f":"MONTH($J186)","v":4},{"$f":"WEEKNUM($J186,21)","v":13},{"$f":"IF(AND(L186<>\"\",M186<>\"\",I186<>\"\"),COUNTIF($I$20:$I186,I186),0)","v":143},{"$f":"IF(AND(L186=\"\",M186=\"\"),0,IF(I186=\"P\",COUNTIF($I$20:$I186,\"P\"),COUNTIF($L$20:$L186,$L186)-1))","v":7},0,"F","2022-04-03","JEAN","client 30 Nom","client 30 Prénom",671364203,"client 110 Nom","client 110 Prénom",671364202,133,"Rue du village CJ",10501,"ST LEGER SOUS BRIENNE","2022-03-08","Nok","nok","ok","2022-03-15","Ok","2022-03-29",207,"Ok"]
[{"$f":"IF($K187=\"\",0,$C187&\"_\"&$E187&\"_C\"&VLOOKUP($K187,Grand_Est!$I$20:$J$34,2,0)&\"_P_\"&COUNTIF($I$20:$I187,\"P\")&\"_\"&IF(I187=\"F\",\"F\"&COUNTIF($I$20:$I187,\"F\"),\"000\"))","v":"2022_13_C4_P_25_000"},{"$f":"IF(I187=\"vide\",0,IF($I187=\"P\",\"Parrain\"&\" \"&$L187&\" \"&$M187,IF($I187=\"F\",\"Parrain\"&\" \"&$L187&\" \"&$M187&\" Filleul\"&\" \"&$O187&\" \"&$P187)))","v":"Parrain Azert Qsd"},{"$f":"YEAR($J$2)","v":2022},{"$f":"MONTH($J187)","v":4},{"$f":"WEEKNUM($J187,21)","v":13},{"$f":"IF(AND(L187<>\"\",M187<>\"\",I187<>\"\"),COUNTIF($I$20:$I187,I187),0)","v":25},{"$f":"IF(AND(L187=\"\",M187=\"\"),0,IF(I187=\"P\",COUNTIF($I$20:$I187,\"P\"),COUNTIF($L$20:$L187,$L187)-1))","v":25},-1,"P","2022-04-02","SILVAIN","Azert","Qsd","02 02 02 20 20",null,null,null,999,"ici","01010","LA BAS"]
[{"$f":"IF($K188=\"\",0,$C188&\"_\"&$E188&\"_C\"&VLOOKUP($K188,Grand_Est!$I$20:$J$34,2,0)&\"_P_\"&COUNTIF($I$20:$I188,\"P\")&\"_\"&IF(I188=\"F\",\"F\"&COUNTIF($I$20:$I188,\"F\"),\"000\"))","v":"2022_13_C4_P_25_F144"},{"$f":"IF(I188=\"vide\",0,IF($I188=\"P\",\"Parrain\"&\" \"&$L188&\" \"&$M188,IF($I188=\"F\",\"Parrain\"&\" \"&$L188&\" \"&$M188&\" Filleul\"&\" \"&$O188&\" \"&$P188)))","v":"Parrain Azert Qsd Filleul Wxcb Mlk"},{"$f":"YEAR($J$2)","v":2022},{"$f":"MONTH($J188)","v":4},{"$f":"WEEKNUM($J188,21)","v":13},{"$f":"IF(AND(L188<>\"\",M188<>\"\",I188<>\"\"),COUNTIF($I$20:$I188,I188),0)","v":144},{"$f":"IF(AND(L188=\"\",M188=\"\"),0,IF(I188=\"P\",COUNTIF($I$20:$I188,\"P\"),COUNTIF($L$20:$L188,$L188)-1))","v":1},0,"F","2022-04-02","SILVAIN","Azert","Qsd","02 02 02 02 02","Wxcb","Mlk","03 03 03 03 03",111,"huee","02020","CHEZ LUI"]

{"sheet":"Modif_Saisie","index":4,"n_rows":23,"n_cols":30,"rows_kept":23,"cut":false,"hidden":false,"merged":[]}
[null,null,null,null,null,null,null,null,null,10,{"$f":"J1+1","v":11},{"$f":"K1+1","v":12},13,14,15,16,17,18,19,20,21,22,23,24,25,26,27,28,29,30]
["Code","Nom Parrain\nFilleul ","Année","MOIS","Sem","N°-Parrain\nN°- filleul","Num Parrain\n & Filleul","Parrain\nNb. Filleul\nVente","Parrai / filleul","Date","Commercial","nom\nParrain","prénom\nParrain","Téléphone\nParrain","nom Filleul","prenom Filleul","Téléphone\nFilleul","N°-","Rue","CP","Commune","Date\n Phonning","relance1","relance2","Résultat\nPhonning","date/rdv client","Vente","date de pose","Pose en M²","pose effectue"]
[{"$f":"$B$5","v":"2022_5_C2_P_2_F11"},{"$f":"IF(I2=\"vide\",0,IF($I2=\"P\",\"Parrain\"&\" \"&$L2&\" \"&$M2,IF($I2=\"F\",\"Parrain\"&\" \"&$L2&\" \"&$M2&\" Filleul\"&\" \"&$O2&\" \"&$P2)))","v":false},{"$f":"YEAR($J$3)","v":2022},{"$f":"MONTH($J$3)","v":2},{"$f":"WEEKNUM($J$3,21)","v":5},{"$f":"IF(AND(L3<>\"\",M3<>\"\",I3<>\"\"),COUNTIF(Base_données!$I21:$I$186,I3),0)+1","v":144},{"$f":"RIGHT(LEFT(B5,FIND(\"_\",B5,10)-1),1)","v":"2"},{"$f":"IF(AD2=\"\",0,IF(LEFT(RIGHT(B5,2),1)=\"F\",$B$14,COUNTIFS($L$20:$L$210,IF($I2=\"P\",$D$10),$AD$20:$AD$210,\"OK\")-1))","v":-1},"F",{"$f":"$D$8","v":"2022-02-01"},{"$f":"$B$8","v":"PASCAL"},{"$f":"$B$10","v":"client 54 Nom"},{"$f":"$D$10","v":"client 54 Prénom"},{"$f":"$F$10","v":619306489},{"$f":"$B$14","v":"client 26 Nom"},{"$f":"$D$14","v":"client 26 Prénom"},{"$f":"$F$14","v":635526547},{"$f":"$B$16","v":13},{"$f":"$D$16","v":"Rue du village Y"},{"$f":"$F$16","v":10130},{"$f":"$H$16","v":"CHAMOY"},{"$f":"$B$18","v":"2022-03-07"},{"$f":"$D$18","v":"Nok"},{"$f":"$F$18","v":"nok"},{"$f":"$H$18","v":"ok"},{"$f":"$B$21","v":"2022-03-13"},{"$f":"$D$21","v":"ok"},{"$f":"$B$23","v":"2022-03-08"},{"$f":"$D$23","v":160},{"$f":"$F$23","v":"Ok"}]
[]
[null,"2022_5_C2_P_2_F11",null,{"$f":"C3&\"_\"&E3&\"_\"&\"C\"&K4&\"_\"&I4&\"_\"&G4&IF(I3=\"P\",\"_000\",222)","v":"2022_5_C__222"},null,null,{"$f":"IF(AND(L5=\"\",M5=\"\"),0,IF(I5=\"P\",RIGHT(LEFT(B7,FIND(\"_\",B7,5)-1),1),LEFT(RIGHT(B7,2),1)))","v":0}]
[]
[{"$f":"$C$7+1","v":11},"Commercial",10,"Date",null,"Parrain"]
[null,{"$f":"VLOOKUP($B$5,Base_données!$A$20:$BD$186,$A$7,0)","v":"PASCAL"},null,{"$f":"VLOOKUP($B$5,Base_données!$A$20:$BD$186,$C$7,0)","v":"2022-02-01"},null,{"$f":"I3","v":"F"}]
[{"$f":"$A$7+1","v":12},"nom\nParrain",{"$f":"$A$9+1","v":13},"prénom\nParrain",{"$f":"$C$9+1","v":14},"Téléphone"]
[null,{"$f":"VLOOKUP($B$5,Base_données!$A$20:$BD$186,$A$9,0)","v":"client 54 Nom"},null,{"$f":"VLOOKUP($B$5,Base_données!$A$20:$BD$186,$C$9,0)","v":"client 54 Prénom"},null,{"$f":"IF(VLOOKUP($B$5,Base_données!$A$20:$BD$186,$E$9,0)=0,\"\",VLOOKUP($B$5,Base_données!$A$20:$BD$186,$E$9,0))","v":619306489}]
[18,"N°-",{"$f":"$A$11+1","v":19},"Rue",{"$f":"$C$11+1","v":20},"CP",{"$f":"$E$11+1","v":21},"Commune"]
[null,{"$f":"IF($B$16<>\"\",\"\",VLOOKUP($B$5,Base_données!$A$20:$BD$186,$A$11,0))","v":""},null,{"$f":"IF($D$16<>\"\",\"\",VLOOKUP($B$5,Base_données!$A$20:$BD$186,$C$11,0))","v":""},null,{"$f":"IF($F$16<>\"\",\"\",VLOOKUP($B$5,Base_données!$A$20:$BD$186,$E$11,0))","v":""},null,{"$f":"IF($H$16<>\"\",\"\",VLOOKUP($B$5,Base_données!$A$20:$BD$186,$G$11,0))","v":""}]
[{"$f":"$E$9+1","v":15},"nom Filleul",{"$f":"$A$13+1","v":16},"Prénom Filleul",{"$f":"$C$13+1","v":17},"Téléphone"]
[null,{"$f":"IF(VLOOKUP($B$5,Base_données!$A$20:$BD$186,$A$13,0)=0,\"\",VLOOKUP($B$5,Base_données!$A$20:$BD$186,$A$13,0))","v":"client 26 Nom"},null,{"$f":"IF(VLOOKUP($B$5,Base_données!$A$20:$BD$186,$C$13,0)=0,\"\",VLOOKUP($B$5,Base_données!$A$20:$BD$186,$C$13,0))","v":"client 26 Prénom"},null,{"$f":"IF(VLOOKUP($B$5,Base_données!$A$20:$BD$186,$E$13,0)=0,\"\",VLOOKUP($B$5,Base_données!$A$20:$BD$186,$E$13,0))","v":635526547}]
[{"$f":"$E$13+1","v":18},"N°-",{"$f":"$A$15+1","v":19},"Rue",{"$f":"$C$15+1","v":20},"CP",{"$f":"$E$15+1","v":21},"Commune"]
[null,{"$f":"IF(OR($B$14=\"\",$D$14=\"\"),\"\",VLOOKUP($B$5,Base_données!$A$20:$BD$186,A15,0))","v":13},null,{"$f":"IF(OR($B$14=\"\",$D$14=\"\"),\"\",VLOOKUP($B$5,Base_données!$A$20:$BD$186,$C$15,0))","v":"Rue du village Y"},null,{"$f":"IF(OR($B$14=\"\",$D$14=\"\"),\"\",VLOOKUP($B$5,Base_données!$A$20:$BD$186,$E$15,0))","v":10130},null,{"$f":"IF(OR($B$14=\"\",$D$14=\"\"),\"\",VLOOKUP($B$5,Base_données!$A$20:$BD$186,$G$15,0))","v":"CHAMOY"}]
[{"$f":"$G$15+1","v":22},"Date\n Phonning",{"$f":"$A$17+1","v":23},"relance1",{"$f":"$C$17+1","v":24},"relance2",{"$f":"$E$17+1","v":25},"Résultat\nPhonning"]
[null,{"$f":"VLOOKUP($B$5,Base_données!$A$20:$BD$186,$A$17,0)","v":"2022-03-07"},null,{"$f":"VLOOKUP($B$5,Base_données!$A$20:$BD$186,$C$17,0)","v":"Nok"},null,{"$f":"VLOOKUP($B$5,Base_données!$A$20:$BD$186,$E$17,0)","v":"nok"},null,{"$f":"VLOOKUP($B$5,Base_données!$A$20:$BD$186,$G$17,0)","v":"ok"}]
[]
[{"$f":"$G$17+1","v":26},"date/rdv client",{"$f":"$A$20+1","v":27},"Vente"]
[null,{"$f":"VLOOKUP($B$5,Base_données!$A$20:$BD$186,$A$20,0)","v":"2022-03-13"},null,{"$f":"VLOOKUP($B$5,Base_données!$A$20:$BD$186,$C$20,0)","v":"ok"}]
[{"$f":"$C$20+1","v":28},"date de pose",{"$f":"$A$22+1","v":29},"Pose en M²",{"$f":"$C$22+1","v":30},"pose effectue"]
[null,{"$f":"IF(VLOOKUP($B$5,Base_données!$A$20:$BD$186,$A$22,0)=0,\"\",VLOOKUP($B$5,Base_données!$A$20:$BD$186,$A$22,0))","v":"2022-03-08"},null,{"$f":"VLOOKUP($B$5,Base_données!$A$20:$BD$186,$C$22,0)","v":160},null,{"$f":"VLOOKUP($B$5,Base_données!$A$20:$BD$186,$E$22,0)","v":"Ok"}]

{"sheet":"Base_Adresses","index":5,"n_rows":142,"n_cols":8,"rows_kept":142,"cut":false,"hidden":false,"merged":[]}
["Base_Clients_Essai"]
[{"$f":"COLUMN()","v":1},{"$f":"COLUMN()","v":2},{"$f":"COLUMN()","v":3},{"$f":"COLUMN()","v":4},{"$f":"COLUMN()","v":5},{"$f":"COLUMN()","v":6},{"$f":"COLUMN()","v":7},{"$f":"COLUMN()","v":8}]
[1,"client 1 Nom","client 1 Prénom",4,"Rue du village @",10700,"TORCY LE GRAND",603470094]
[2,"client 2 Nom","client 2 Prénom",25,"Rue du village A",10700,"TORCY LE PETIT",672490692]
[3,"client 3 Nom","client 3 Prénom",41,"Rue du village B",10700,"TROUAN LE GRAND",638675734]
[4,"client 4 Nom","client 4 Prénom",117,"Rue du village C",10100,"GELANNES",672501849]
[5,"client 5 Nom","client 5 Prénom",67,"Rue du village D",10100,"LA FOSSE CORDUAN",699104827]
[6,"client 6 Nom","client 6 Prénom",157,"Rue du village E",10100,"LES GRANGES",617460923]
[7,"client 7 Nom","client 7 Prénom",158,"Rue du village F",10100,"OSSEY LES TROIS MAISONS",688214485]
[8,"client 8 Nom","client 8 Prénom",19,"Rue du village G",10100,"PARS LES ROMILLY",651723065]
[9,"client 9 Nom","client 9 Prénom",27,"Rue du village H",10100,"ROMILLY SUR SEINE",644465218]
[10,"client 10 Nom","client 10 Prénom",57,"Rue du village I",10100,"ST HILAIRE SOUS ROMILLY",660338199]
[11,"client 11 Nom","client 11 Prénom",40,"Rue du village J",10100,"ST LOUP DE BUFFIGNY",688080821]
[12,"client 12 Nom","client 12 Prénom",26,"Rue du village K",10120,"CHEVILLELE",687534346]
[13,"client 13 Nom","client 13 Prénom",238,"Rue du village L",10600,"BARBEREY AUX MOINES",618219055]
[14,"client 14 Nom","client 14 Prénom",21,"Rue du village M",10600,"BARBEREY ST SULPICE",697949355]
[15,"client 15 Nom","client 15 Prénom",159,"Rue du village N",10600,"LA CHAPELLE ST LUC",650252785]
[16,"client 16 Nom","client 16 Prénom",15,"Rue du village O",10600,"MERGEY",643959035]
[17,"client 17 Nom","client 17 Prénom",56,"Rue du village P",10600,"PAYNS",667288911]
[18,"client 18 Nom","client 18 Prénom",187,"Rue du village Q",10600,"SAVIERES",630213771]
[19,"client 19 Nom","client 19 Prénom",39,"Rue du village R",10600,"ST BENOIT SUR SEINE",651189811]
[20,"client 20 Nom","client 20 Prénom",36,"Rue du village S",10600,"ST LYE",643941973]
[21,"client 21 Nom","client 21 Prénom",201,"Rue du village T",10600,"VILLACERF",689304712]
[22,"client 22 Nom","client 22 Prénom",37,"Rue du village U",10370,"DIVAL",635804690]
[23,"client 23 Nom","client 23 Prénom",18,"Rue du village V",10130,"AUXON",689389437]
[24,"client 24 Nom","client 24 Prénom",204,"Rue du village W",10130,"AVREUIL",625376012]
[25,"client 25 Nom","client 25 Prénom",6,"Rue du village X",10130,"BERNON",654105386]
[26,"client 26 Nom","client 26 Prénom",13,"Rue du village Y",10130,"CHAMOY",635526547]
[27,"client 27 Nom","client 27 Prénom",16,"Rue du village Z@",10130,"CHESSY LES PRES",691851148]
[28,"client 28 Nom","client 28 Prénom",35,"Rue du village AA",10310,"CLAIRVAUX SUR AUBE",605060105]
[29,"client 29 Nom","client 29 Prénom",160,"Rue du village AB",10310,"JUVANCOURT",641852890]
[30,"client 30 Nom","client 30 Prénom",78,"Rue du village AC",10310,"LONGCHAMP SUR AUJON",684634252]
[31,"client 31 Nom","client 31 Prénom",17,"Rue du village AD",10310,"VILLE SOUS LA FERTE",631568868]
[32,"client 32 Nom","client 32 Prénom",44,"Rue du village AE",10430,"ROSIERES PRES TROYES",679497612]
[33,"client 33 Nom","client 33 Prénom",42,"Rue du village AF",10340,"ARRELLES",610759302]
[34,"client 34 Nom","client 34 Prénom",237,"Rue du village AG",10340,"AVIREY LINGEY",636943062]
[35,"client 35 Nom","client 35 Prénom",179,"Rue du village AH",10340,"BAGNEUX LA FOSSE",648803279]
[36,"client 36 Nom","client 36 Prénom",229,"Rue du village AI",10340,"BEAUVOIR SUR SARCE",696567037]
[37,"client 37 Nom","client 37 Prénom",198,"Rue du village AJ",10340,"BRAGELOGNE BEAUVOIR",644572856]
[38,"client 38 Nom","client 38 Prénom",32,"Rue du village AK",10340,"CHANNES",656965669]
[39,"client 39 Nom","client 39 Prénom",20,"Rue du village AL",10340,"LES RICEYS",668286569]
[40,"client 40 Nom","client 40 Prénom",68,"Rue du village AM",10340,"ARRELLES",649691181]
[41,"client 41 Nom","client 41 Prénom",11,"Rue du village AN",10230,"MAILLY LE CAMP",682575270]
[42,"client 42 Nom","client 42 Prénom",10,"Rue du village AO",10270,"BOURANTON",633850724]
[43,"client 43 Nom","client 43 Prénom",43,"Rue du village AP",10410,"BELLEY",648935512]
[44,"client 44 Nom","client 44 Prénom",33,"Rue du village AQ",10200,"AILLEVILLE",648200684]
[45,"client 45 Nom","client 45 Prénom",83,"Rue du village AR",10500,"BLIGNICOURT",653739073]
[46,"client 46 Nom","client 46 Prénom",47,"Rue du village AS",10500,"BRAUX",620086084]
[47,"client 47 Nom","client 47 Prénom",31,"Rue du village AT",10500,"BRIENNE LA VIEILLE",623376053]
[48,"client 48 Nom","client 48 Prénom",180,"Rue du village AU",10500,"BRIENNE LE CHATEAU",674409450]
[49,"client 49 Nom","client 49 Prénom",9,"Rue du village AV",10500,"CHALETTE SUR VOIRE",637284570]
[50,"client 50 Nom","client 50 Prénom",73,"Rue du village AW",10500,"CHAUMESNIL",660416816]
[51,"client 51 Nom","client 51 Prénom",14,"Rue du village AX",10500,"COURCELLES SUR VOIRE",650795071]
[52,"client 52 Nom","client 52 Prénom",129,"Rue du village AY",10500,"CRESPY LE NEUF",666683420]
[53,"client 53 Nom","client 53 Prénom",144,"Rue du village AZ",10500,"DIENVILLE",637271846]
[54,"client 54 Nom","client 54 Prénom",154,"Rue du village BA",10500,"EPAGNE",684874997]
[55,"client 55 Nom","client 55 Prénom",216,"Rue du village BB",10120,"CHEVILLELE",634287310]
[56,"client 56 Nom","client 56 Prénom",131,"Rue du village BC",10500,"BETIGNICOURT",688794410]
[57,"client 57 Nom","client 57 Prénom",58,"Rue du village BD",10500,"BLAINCOURT SUR AUBE",690808392]
[58,"client 58 Nom","client 58 Prénom",141,"Rue du village BE",10500,"BLIGNICOURT",631146229]
[59,"client 59 Nom","client 59 Prénom",109,"Rue du village BF",10500,"BRAUX",685906285]
[60,"client 60 Nom","client 60 Prénom",104,"Rue du village BG",10500,"BRIENNE LA VIEILLE",673201142]
[61,"client 61 Nom","client 61 Prénom",2,"Rue du village BH",10500,"BRIENNE LE CHATEAU",699108376]
[62,"client 62 Nom","client 62 Prénom",76,"Rue du village BI",10500,"CHALETTE SUR VOIRE",671398071]
[63,"client 63 Nom","client 63 Prénom",136,"Rue du village BJ",10500,"CHAUMESNIL",626583590]
[64,"client 64 Nom","client 64 Prénom",61,"Rue du village BK",10500,"COURCELLES SUR VOIRE",629108053]
[65,"client 65 Nom","client 65 Prénom",218,"Rue du village BL",10500,"CRESPY LE NEUF",651860433]
[66,"client 66 Nom","client 66 Prénom",240,"Rue du village BM",10500,"DIENVILLE",679719696]
[67,"client 67 Nom","client 67 Prénom",59,"Rue du village BN",10500,"EPAGNE",653703462]
[68,"client 68 Nom","client 68 Prénom",114,"Rue du village BO",10500,"EPOTHEMONT",619306489]
[69,"client 69 Nom","client 69 Prénom",70,"Rue du village BP",10500,"HAMPIGNY",635465984]
[70,"client 70 Nom","client 70 Prénom",110,"Rue du village BQ",10500,"JUZANVIGNY",680622160]
[71,"client 71 Nom","client 71 Prénom",194,"Rue du village BR",10500,"LA CHAISE",627086058]
[72,"client 72 Nom","client 72 Prénom",97,"Rue du village BS",10500,"LA ROTHIERE",664272545]
[73,"client 73 Nom","client 73 Prénom",177,"Rue du village BT",10500,"LA VILLE AUX BOIS",687867869]
[74,"client 74 Nom","client 74 Prénom",38,"Rue du village BU",10500,"LASSICOURT",660546033]
[75,"client 75 Nom","client 75 Prénom",75,"Rue du village BV",10500,"LESMONT",620487087]
[76,"client 76 Nom","client 76 Prénom",88,"Rue du village BW",10500,"MAIZIERES LES BRIENNE",641583574]
[77,"client 77 Nom","client 77 Prénom",189,"Rue du village BX",10500,"MATHAUX",616572511]
[78,"client 78 Nom","client 78 Prénom",94,"Rue du village BY",10500,"MOLINS SUR AUBE",690947261]
[79,"client 79 Nom","client 79 Prénom",212,"Rue du village BZ",10500,"MORVILLIERS",639067026]
[80,"client 80 Nom","client 80 Prénom",199,"Rue du village CA",10500,"PEL ET DER",671931994]
[81,"client 81 Nom","client 81 Prénom",146,"Rue du village CB",10500,"PERTHES LES BRIENNE",620781576]
[82,"client 82 Nom","client 82 Prénom",77,"Rue du village CC",10500,"PETIT MESNIL",691119431]
[83,"client 83 Nom","client 83 Prénom",71,"Rue du village CD",10500,"PRECY NOTRE DAME",698755571]
[84,"client 84 Nom","client 84 Prénom",106,"Rue du village CE",10500,"PRECY ST MARTIN",688593398]
[85,"client 85 Nom","client 85 Prénom",23,"Rue du village CF",10500,"RADONVILLIERS",677623160]
[86,"client 86 Nom","client 86 Prénom",213,"Rue du village CG",10500,"RANCES",673909860]
[87,"client 87 Nom","client 87 Prénom",103,"Rue du village CH",10500,"ROSNAY L'HOPITAL",622379338]
[88,"client 88 Nom","client 88 Prénom",125,"Rue du village CI",10500,"ST CHRISTOPHE DODINICOURT",633337862]
[89,"client 89 Nom","client 89 Prénom",133,"Rue du village CJ",10500,"ST LEGER SOUS BRIENNE",671364202]
[90,"client 90 Nom","client 90 Prénom",105,"Rue du village CK",10500,"VALLENTIGNY",696578640]
[91,"client 91 Nom","client 91 Prénom",30,"Rue du village CL",10500,"YEVRES LE PETIT",684514942]
[92,"client 92 Nom","client 92 Prénom",79,"Rue du village CM",10400,"AVANT LES MARCILLY",688315052]
[93,"client 93 Nom","client 93 Prénom",80,"Rue du village CN",10400,"BARBUISE",629101637]
[94,"client 94 Nom","client 94 Prénom",34,"Rue du village CO",10400,"BOUY SUR ORVIN",667259016]
[95,"client 95 Nom","client 95 Prénom",121,"Rue du village CP",10400,"COURCEROY",631942360]
[96,"client 96 Nom","client 96 Prénom",46,"Rue du village CQ",10400,"COURTAVANT",660482562]
[97,"client 97 Nom","client 97 Prénom",28,"Rue du village CR",10400,"FERREUX QUINCEY",626040625]
[98,"client 98 Nom","client 98 Prénom",166,"Rue du village CS",10400,"FONTAINE MACON",677819310]
[99,"client 99 Nom","client 99 Prénom",181,"Rue du village CT",10400,"FONTENAY DE BOSSERY",662348160]
[100,"client 100 Nom","client 100 Prénom",155,"Rue du village CU",10400,"GUMERY",699199810]
[101,"client 101 Nom","client 101 Prénom",140,"Rue du village CV",10400,"LA LOUPTIERE THENARD",637513979]
[102,"client 102 Nom","client 102 Prénom",87,"Rue du village CW",10400,"LA MOTTE TILLY",670203892]
[103,"client 103 Nom","client 103 Prénom",113,"Rue du village CX",10400,"LA SAULSOTTE",619340139]
[104,"client 104 Nom","client 104 Prénom",69,"Rue du village CY",10400,"LA VILLENEUVE AU CHATELOT",642998582]
[105,"client 105 Nom","client 105 Prénom",92,"Rue du village CZ",10400,"LE MERIOT",657167997]
[106,"client 106 Nom","client 106 Prénom",190,"Rue du village DCA",10400,"MARNAY SUR SEINE",611157827]
[107,"client 107 Nom","client 107 Prénom",29,"Rue du village DCB",10400,"MONTPOTHIER",627411022]
[108,"client 108 Nom","client 108 Prénom",214,"Rue du village DCC",10400,"NOGENT SUR SEINE",680614822]
[109,"client 109 Nom","client 109 Prénom",174,"Rue du village DCD",10400,"PERIGNY LA ROSE",621985486]
[110,"client 110 Nom","client 110 Prénom",242,"Rue du village DCE",10400,"PLESSIS BARBUISE",639807071]
[111,"client 111 Nom","client 111 Prénom",227,"Rue du village DCF",10400,"PONT SUR SEINE",698959546]
[112,"client 112 Nom","client 112 Prénom",3,"Rue du village DCG",10400,"QUINCEY",637465947]
[113,"client 113 Nom","client 113 Prénom",99,"Rue du village DCH",10400,"SOLIGNY LES ETANGS",680801034]
[114,"client 114 Nom","client 114 Prénom",203,"Rue du village DCI",10400,"ST AUBIN",695121228]
[115,"client 115 Nom","client 115 Prénom",24,"Rue du village DCJ",10400,"ST NICOLAS LA CHAPELLE",656265558]
[116,"client 116 Nom","client 116 Prénom",85,"Rue du village DCK",10400,"TRAINEL",666548086]
[117,"client 117 Nom","client 117 Prénom",90,"Rue du village DCL",10010,{"$error":"#N/A"},652908117]
[118,"client 118 Nom","client 118 Prénom",196,"Rue du village DCM",10240,"AULNAY",615171864]
[119,"client 119 Nom","client 119 Prénom",222,"Rue du village DCN",10240,"AVANT LES RAMERUPT",670840930]
[120,"client 120 Nom","client 120 Prénom",209,"Rue du village DCO",10240,"BRILLECOURT",662742761]
[121,"client 121 Nom","client 121 Prénom",115,"Rue du village DCP",10240,"CHAUDREY",614601842]
[122,"client 122 Nom","client 122 Prénom",142,"Rue du village DCQ",10240,"COCLOIS",664654982]
[123,"client 123 Nom","client 123 Prénom",241,"Rue du village DCR",10240,"DAMPIERRE",642407521]
[124,"client 124 Nom","client 124 Prénom",118,"Rue du village DCS",10240,"DOMMARTIN LE COQ",694604705]
[125,"client 125 Nom","client 125 Prénom",210,"Rue du village DCT",10240,"ISLE AUBIGNY",683909740]
[126,"client 126 Nom","client 126 Prénom",123,"Rue du village DCU",10240,"LONGSOLS",650606084]
[127,"client 127 Nom","client 127 Prénom",183,"Rue du village DCV",10240,"MAGNICOURT",679729494]
[128,"client 128 Nom","client 128 Prénom",223,"Rue du village DCW",10320,"ASSENAY",613358390]
[129,"client 129 Nom","client 129 Prénom",236,"Rue du village DCX",10320,"BOUILLY",621503734]
[130,"client 130 Nom","client 130 Prénom",134,"Rue du village DCY",10320,"CRESANTIGNES",661287898]
[131,"client 131 Nom","client 131 Prénom",151,"Rue du village DCZ",10320,"FAYS LA CHAPELLE",650723477]
[132,"client 132 Nom","client 132 Prénom",130,"Rue du village DDA",10320,"JAVERNANT",678291707]
[133,"client 133 Nom","client 133 Prénom",112,"Rue du village DDB",10320,"JEUGNY",625612228]
[134,"client 134 Nom","client 134 Prénom",93,"Rue du village DDC",10320,"LIREY",644317260]
[135,"client 135 Nom","client 135 Prénom",184,"Rue du village DDD",10320,"LONGEVILLE SUR MOGNE",645043049]
[136,"client 136 Nom","client 136 Prénom",60,"Rue du village DDE",10320,"MACHY",639145006]
[137,"client 137 Nom","client 137 Prénom",22,"Rue du village DDF",10320,"MAUPAS",695056076]
[138,"client 138 Nom","client 138 Prénom",107,"Rue du village DDG",10320,"RONCENAY",694172022]
[139,"client 139 Nom","client 139 Prénom",96,"Rue du village DDH",10320,"SOMMEVAL",624905624]
[140,"client 140 Nom","client 140 Prénom",62,"Rue du village DDI",10320,"SOULIGNY",685718089]

{"sheet":"Grand_Est","index":6,"n_rows":5669,"n_cols":21,"rows_kept":5669,"cut":false,"hidden":false,"merged":[[6,14,7,16],[10,14,11,16]]}
["cp","cp","villes",{"$f":"MAX(D2:D5669)","v":46}]
[8000,"08000","CHARLEVILLE MEZIERES",{"$f":"COUNTIF($B$2:$B$5669,B2)","v":5},null,"N°","REGION","Département","Villes",null,null,"Liste_Mois"]
[8000,"08000","LES AYVELLES",5,null,8,"Grand_Est","Ardennes","Charleville-Mézières",8,null,1]
[8000,"08000","PRIX LES MEZIERES",5,null,10,"Grand_Est","Aube","Troyes",10,null,2]
[8000,"08000","VILLERS SEMEUSE",5,null,51,"Grand_Est","Marne","Châlons-en-Champagne",51,null,3,null,null,"Formule Code Colonne A Base_Donnees"]
[8000,"08000","WARCQ",5,null,52,"Grand_Est","Haute-Marne","Chaumont",52,null,4]
[8090,"08090","AIGLEMONT",17,null,54,"Grand_Est","Meurthe-et-Moselle","Nancy",54,null,5,null,null,"2022_8_C1_P_25_F152"]
[8090,"08090","ARREUX",17,null,55,"Grand_Est","Meuse","Bar-le-Duc",55,null,6,null,"Colonne I"]
[8090,"08090","BELVAL",17,null,57,"Grand_Est","Moselle","Metz",57,null,7,null,"F",2022,8,"C et 1(J1grand Est)","F","Nb P base colonne I20-210","F si F colonne I","Nb F si F Colonne I"]
[8090,"08090","CLIRON",17,null,67,"Grand_Est","Bas-Rhin","Strasbourg",67,null,8,null,null,null,null,"Nom Parrain"]
[8090,"08090","DAMOUZY",17,null,68,"Grand_Est","Haut-Rhin","Colmar",68,null,9,null,null,"2022_8_C2_P_23_000"]
[8090,"08090","EVIGNY",17,null,88,"Grand_Est","Vosges","Épinal",88,null,10]
[8090,"08090","FAGNON",17,null,"Code postal et ville",null,"Pose_effectuée","Parrain/filleul",null,null,11,null,"P",2022,8,"C et 1(J1grand Est)","P","Nb P base colonne I20-210","000"]
[8090,"08090","HAM LES MOINES",17,null,{"$f":"COUNTIF($B$2:$B$5669,F15)","v":36},{"$f":"\"première ligne \"&MATCH(F15,A1:A5669,0)","v":"première ligne 872"},"Ok","P",null,null,12]
[8090,"08090","HAUDRECY",17,null,{"$f":"INDIRECT(ADDRESS(MATCH(Base_données!$T$2,$A$1:$A$5669,0)+ROW()-15,1,3,1,\"Grand_Est\"),1)","v":10500},{"$f":"INDIRECT(ADDRESS(MATCH($F$15,$A$1:$A$5669,0)+ROW()-15,3,3,1,\"Grand_Est\"),1)","v":"BETIGNICOURT"},"NoK","F",null,null,"tous"]
[8090,"08090","HOULDIZY",17,null,{"$f":"IF(ROW()-15>=$F$14,\"\",INDIRECT(ADDRESS(MATCH(Base_données!$T$2,$A$1:$A$5669,0)+ROW()-15,1,3,1,\"Grand_Est\"),1))","v":10500},{"$f":"IF(ROW()-15>=$F$14,\"\",INDIRECT(ADDRESS(MATCH($F$15,$A$1:$A$5669,0)+ROW()-15,3,3,1,\"Grand_Est\"),1))","v":"BLAINCOURT SUR AUBE"},"Vide","Vide"]
[8090,"08090","MONTCORNET",17,null,{"$f":"IF(ROW()-15>=$F$14,\"\",INDIRECT(ADDRESS(MATCH(Base_données!$T$2,$A$1:$A$5669,0)+ROW()-15,1,3,1,\"Grand_Est\"),1))","v":10500},{"$f":"IF(ROW()-15>=$F$14,\"\",INDIRECT(ADDRESS(MATCH($F$15,$A$1:$A$5669,0)+ROW()-15,3,3,1,\"Grand_Est\"),1))","v":"BLIGNICOURT"}]
[8090,"08090","MONTCY NOTRE DAME",17,null,{"$f":"IF(ROW()-15>=$F$14,\"\",INDIRECT(ADDRESS(MATCH(Base_données!$T$2,$A$1:$A$5669,0)+ROW()-15,1,3,1,\"Grand_Est\"),1))","v":10500},"BRAUX"]
[8090,"08090","NEUVILLE LES THIS",17,null,{"$f":"IF(ROW()-15>=$F$14,\"\",INDIRECT(ADDRESS(MATCH(Base_données!$T$2,$A$1:$A$5669,0)+ROW()-15,1,3,1,\"Grand_Est\"),1))","v":10500},"BRIENNE LA VIEILLE",null,"Liste VRP"]
[8090,"08090","ST LAURENT",17,null,{"$f":"IF(ROW()-15>=$F$14,\"\",INDIRECT(ADDRESS(MATCH(Base_données!$T$2,$A$1:$A$5669,0)+ROW()-15,1,3,1,\"Grand_Est\"),1))","v":10500},"BRIENNE LE CHATEAU",null,"JEAN",1]
[8090,"08090","SURY",17,null,{"$f":"IF(ROW()-15>=$F$14,\"\",INDIRECT(ADDRESS(MATCH(Base_données!$T$2,$A$1:$A$5669,0)+ROW()-15,1,3,1,\"Grand_Est\"),1))","v":10500},"CHALETTE SUR VOIRE",null,"PASCAL",2]
[8090,"08090","THIS",17,null,{"$f":"IF(ROW()-15>=$F$14,\"\",INDIRECT(ADDRESS(MATCH(Base_données!$T$2,$A$1:$A$5669,0)+ROW()-15,1,3,1,\"Grand_Est\"),1))","v":10500},"CHAUMESNIL",null,"THIERRY",3]
[8090,"08090","WARNECOURT",17,null,{"$f":"IF(ROW()-15>=$F$14,\"\",INDIRECT(ADDRESS(MATCH(Base_données!$T$2,$A$1:$A$5669,0)+ROW()-15,1,3,1,\"Grand_Est\"),1))","v":10500},"COURCELLES SUR VOIRE",null,"SILVAIN",4]
[8110,"08110","BLAGNY",16,null,{"$f":"IF(ROW()-15>=$F$14,\"\",INDIRECT(ADDRESS(MATCH(Base_données!$T$2,$A$1:$A$5669,0)+ROW()-15,1,3,1,\"Grand_Est\"),1))","v":10500},"CRESPY LE NEUF",null,"ANTOINE",5]
[8110,"08110","CARIGNAN",16,null,{"$f":"IF(ROW()-15>=$F$14,\"\",INDIRECT(ADDRESS(MATCH(Base_données!$T$2,$A$1:$A$5669,0)+ROW()-15,1,3,1,\"Grand_Est\"),1))","v":10500},"DIENVILLE",null,"MAXIME",6]
[8110,"08110","ESCOMBRES ET LE CHESNOIS",16,null,{"$f":"IF(ROW()-15>=$F$14,\"\",INDIRECT(ADDRESS(MATCH(Base_données!$T$2,$A$1:$A$5669,0)+ROW()-15,1,3,1,\"Grand_Est\"),1))","v":10500},"EPAGNE",null,null,7]
[8110,"08110","LES DEUX VILLES",16,null,{"$f":"IF(ROW()-15>=$F$14,\"\",INDIRECT(ADDRESS(MATCH(Base_données!$T$2,$A$1:$A$5669,0)+ROW()-15,1,3,1,\"Grand_Est\"),1))","v":10500},"EPOTHEMONT",null,null,8]
[8110,"08110","LINAY",16,null,{"$f":"IF(ROW()-15>=$F$14,\"\",INDIRECT(ADDRESS(MATCH(Base_données!$T$2,$A$1:$A$5669,0)+ROW()-15,1,3,1,\"Grand_Est\"),1))","v":10500},"HAMPIGNY",null,null,9]
[8110,"08110","MATTON ET CLEMENCY",16,null,{"$f":"IF(ROW()-15>=$F$14,\"\",INDIRECT(ADDRESS(MATCH(Base_données!$T$2,$A$1:$A$5669,0)+ROW()-15,1,3,1,\"Grand_Est\"),1))","v":10500},"JUZANVIGNY",null,null,10]
[8110,"08110","MESSINCOURT",16,null,{"$f":"IF(ROW()-15>=$F$14,\"\",INDIRECT(ADDRESS(MATCH(Base_données!$T$2,$A$1:$A$5669,0)+ROW()-15,1,3,1,\"Grand_Est\"),1))","v":10500},"LA CHAISE",null,null,11]
[8110,"08110","MOGUES",16,null,{"$f":"IF(ROW()-15>=$F$14,\"\",INDIRECT(ADDRESS(MATCH(Base_données!$T$2,$A$1:$A$5669,0)+ROW()-15,1,3,1,\"Grand_Est\"),1))","v":10500},"LA ROTHIERE",null,null,12]
[8110,"08110","OSNES",16,null,{"$f":"IF(ROW()-15>=$F$14,\"\",INDIRECT(ADDRESS(MATCH(Base_données!$T$2,$A$1:$A$5669,0)+ROW()-15,1,3,1,\"Grand_Est\"),1))","v":10500},"LA VILLE AUX BOIS",null,null,13]
[8110,"08110","PURE",16,null,{"$f":"IF(ROW()-15>=$F$14,\"\",INDIRECT(ADDRESS(MATCH(Base_données!$T$2,$A$1:$A$5669,0)+ROW()-15,1,3,1,\"Grand_Est\"),1))","v":10500},"LASSICOURT",null,null,14]
[8110,"08110","SACHY",16,null,{"$f":"IF(ROW()-15>=$F$14,\"\",INDIRECT(ADDRESS(MATCH(Base_données!$T$2,$A$1:$A$5669,0)+ROW()-15,1,3,1,\"Grand_Est\"),1))","v":10500},"LESMONT",null,null,15]
[8110,"08110","SAILLY",16,null,{"$f":"IF(ROW()-15>=$F$14,\"\",INDIRECT(ADDRESS(MATCH(Base_données!$T$2,$A$1:$A$5669,0)+ROW()-15,1,3,1,\"Grand_Est\"),1))","v":10500},"MAIZIERES LES BRIENNE"]
[8110,"08110","TETAIGNE",16,null,{"$f":"IF(ROW()-15>=$F$14,\"\",INDIRECT(ADDRESS(MATCH(Base_données!$T$2,$A$1:$A$5669,0)+ROW()-15,1,3,1,\"Grand_Est\"),1))","v":10500},"MATHAUX"]
[8110,"08110","TREMBLOIS LES CARIGNAN",16,null,{"$f":"IF(ROW()-15>=$F$14,\"\",INDIRECT(ADDRESS(MATCH(Base_données!$T$2,$A$1:$A$5669,0)+ROW()-15,1,3,1,\"Grand_Est\"),1))","v":10500},"MOLINS SUR AUBE"]
[8110,"08110","WE",16,null,{"$f":"IF(ROW()-15>=$F$14,\"\",INDIRECT(ADDRESS(MATCH(Base_données!$T$2,$A$1:$A$5669,0)+ROW()-15,1,3,1,\"Grand_Est\"),1))","v":10500},"MORVILLIERS"]
[8110,"08110","WILLIERS",16,null,{"$f":"IF(ROW()-15>=$F$14,\"\",INDIRECT(ADDRESS(MATCH(Base_données!$T$2,$A$1:$A$5669,0)+ROW()-15,1,3,1,\"Grand_Est\"),1))","v":10500},"PEL ET DER"]
[8120,"08120","BOGNY SUR MEUSE",1,null,{"$f":"IF(ROW()-15>=$F$14,\"\",INDIRECT(ADDRESS(MATCH(Base_données!$T$2,$A$1:$A$5669,0)+ROW()-15,1,3,1,\"Grand_Est\"),1))","v":10500},"PERTHES LES BRIENNE"]
[8130,"08130","ALLAND HUY ET SAUSSEUIL",23,null,{"$f":"IF(ROW()-15>=$F$14,\"\",INDIRECT(ADDRESS(MATCH(Base_données!$T$2,$A$1:$A$5669,0)+ROW()-15,1,3,1,\"Grand_Est\"),1))","v":10500},"PETIT MESNIL"]
[8130,"08130","AMBLY FLEURY",23,null,{"$f":"IF(ROW()-15>=$F$14,\"\",INDIRECT(ADDRESS(MATCH(Base_données!$T$2,$A$1:$A$5669,0)+ROW()-15,1,3,1,\"Grand_Est\"),1))","v":10500},"PRECY NOTRE DAME"]
[8130,"08130","ATTIGNY",23,null,{"$f":"IF(ROW()-15>=$F$14,\"\",INDIRECT(ADDRESS(MATCH(Base_données!$T$2,$A$1:$A$5669,0)+ROW()-15,1,3,1,\"Grand_Est\"),1))","v":10500},"PRECY ST MARTIN"]
[8130,"08130","CHARBOGNE",23,null,{"$f":"IF(ROW()-15>=$F$14,\"\",INDIRECT(ADDRESS(MATCH(Base_données!$T$2,$A$1:$A$5669,0)+ROW()-15,1,3,1,\"Grand_Est\"),1))","v":10500},"RADONVILLIERS"]
[8130,"08130","CHUFFILLY ROCHE",23,null,{"$f":"IF(ROW()-15>=$F$14,\"\",INDIRECT(ADDRESS(MATCH(Base_données!$T$2,$A$1:$A$5669,0)+ROW()-15,1,3,1,\"Grand_Est\"),1))","v":10500},"RANCES"]
[8130,"08130","COULOMMES ET MARQUENY",23,null,{"$f":"IF(ROW()-15>=$F$14,\"\",INDIRECT(ADDRESS(MATCH(Base_données!$T$2,$A$1:$A$5669,0)+ROW()-15,1,3,1,\"Grand_Est\"),1))","v":10500},"ROSNAY L'HOPITAL"]
[8130,"08130","ECORDAL",23,null,{"$f":"IF(ROW()-15>=$F$14,\"\",INDIRECT(ADDRESS(MATCH(Base_données!$T$2,$A$1:$A$5669,0)+ROW()-15,1,3,1,\"Grand_Est\"),1))","v":10500},"ST CHRISTOPHE DODINICOURT"]
[8130,"08130","GIVRY",23,null,{"$f":"IF(ROW()-15>=$F$14,\"\",INDIRECT(ADDRESS(MATCH(Base_données!$T$2,$A$1:$A$5669,0)+ROW()-15,1,3,1,\"Grand_Est\"),1))","v":10500},"ST LEGER SOUS BRIENNE"]
[8130,"08130","GUINCOURT",23,null,{"$f":"IF(ROW()-15>=$F$14,\"\",INDIRECT(ADDRESS(MATCH(Base_données!$T$2,$A$1:$A$5669,0)+ROW()-15,1,3,1,\"Grand_Est\"),1))","v":10500},"VALLENTIGNY"]
[8130,"08130","JONVAL",23,null,{"$f":"IF(ROW()-15>=$F$14,\"\",INDIRECT(ADDRESS(MATCH(Base_données!$T$2,$A$1:$A$5669,0)+ROW()-15,1,3,1,\"Grand_Est\"),1))","v":10500},"YEVRES LE PETIT"]
[8130,"08130","LA SABOTTERIE",23,null,{"$f":"IF(ROW()-15>=$F$14,\"\",INDIRECT(ADDRESS(MATCH(Base_données!$T$2,$A$1:$A$5669,0)+ROW()-15,1,3,1,\"Grand_Est\"),1))","v":""},""]
[8130,"08130","LAMETZ",23,null,{"$f":"IF(ROW()-15>=$F$14,\"\",INDIRECT(ADDRESS(MATCH(Base_données!$T$2,$A$1:$A$5669,0)+ROW()-15,1,3,1,\"Grand_Est\"),1))","v":""},""]
[8130,"08130","MONT LAURENT",23,null,{"$f":"IF(ROW()-15>=$F$14,\"\",INDIRECT(ADDRESS(MATCH(Base_données!$T$2,$A$1:$A$5669,0)+ROW()-15,1,3,1,\"Grand_Est\"),1))","v":""},""]
[8130,"08130","NEUVILLE DAY",23,null,{"$f":"IF(ROW()-15>=$F$14,\"\",INDIRECT(ADDRESS(MATCH(Base_données!$T$2,$A$1:$A$5669,0)+ROW()-15,1,3,1,\"Grand_Est\"),1))","v":""},""]
[8130,"08130","RILLY SUR AISNE",23,null,{"$f":"IF(ROW()-15>=$F$14,\"\",INDIRECT(ADDRESS(MATCH(Base_données!$T$2,$A$1:$A$5669,0)+ROW()-15,1,3,1,\"Grand_Est\"),1))","v":""},""]
[8130,"08130","SAULCES CHAMPENOISES",23,null,{"$f":"IF(ROW()-15>=$F$14,\"\",INDIRECT(ADDRESS(MATCH(Base_données!$T$2,$A$1:$A$5669,0)+ROW()-15,1,3,1,\"Grand_Est\"),1))","v":""},""]
[8130,"08130","SEMUY",23,null,{"$f":"IF(ROW()-15>=$F$14,\"\",INDIRECT(ADDRESS(MATCH(Base_données!$T$2,$A$1:$A$5669,0)+ROW()-15,1,3,1,\"Grand_Est\"),1))","v":""},""]
[8130,"08130","ST LAMBERT ET MONT DE JEUX",23,null,{"$f":"IF(ROW()-15>=$F$14,\"\",INDIRECT(ADDRESS(MATCH(Base_données!$T$2,$A$1:$A$5669,0)+ROW()-15,1,3,1,\"Grand_Est\"),1))","v":""},""]
[8130,"08130","ST LOUP TERRIER",23,null,{"$f":"IF(ROW()-15>=$F$14,\"\",INDIRECT(ADDRESS(MATCH(Base_données!$T$2,$A$1:$A$5669,0)+ROW()-15,1,3,1,\"Grand_Est\"),1))","v":""},""]
[8130,"08130","STE VAUBOURG",23,null,{"$f":"IF(ROW()-15>=$F$14,\"\",INDIRECT(ADDRESS(MATCH(Base_données!$T$2,$A$1:$A$5669,0)+ROW()-15,1,3,1,\"Grand_Est\"),1))","v":""},""]
[8130,"08130","SUZANNE",23]
[8130,"08130","TOURTERON",23]
[8130,"08130","VAUX CHAMPAGNE",23]
[8140,"08140","BAZEILLES",11]
[8140,"08140","BREVILLY",11]
[8140,"08140","DAIGNY",{"$f":"COUNTIF($B$2:$B$5669,B66)","v":11}]
[8140,"08140","DOUZY",11]
[8140,"08140","FRANCHEVAL",11]
[8140,"08140","LA MONCELLE",11]
[8140,"08140","MAIRY",11]
[8140,"08140","POURU AUX BOIS",11]
[8140,"08140","POURU ST REMY",11]
[8140,"08140","RUBECOURT ET LAMECOURT",11]
[8140,"08140","VILLERS CERNAY",11]
[8150,"08150","AUBIGNY LES POTHEES",18]
[8150,"08150","HARCY",18]
[8150,"08150","L'ECHELLE",18]
[8150,"08150","LAVAL MORENCY",18]
[8150,"08150","LE CHATELET SUR SORMONNE",18]
[8150,"08150","LEPRON LES VALLEES",18]
[8150,"08150","LOGNY BOGNY",18]
[8150,"08150","LONNY",18]
[8150,"08150","MURTIN ET BOGNY",18]
[8150,"08150","REMILLY LES POTHEES",18]
[8150,"08150","RENWEZ",18]
[8150,"08150","RIMOGNE",18]
[8150,"08150","ROUVROY SUR AUDRY",18]
[8150,"08150","SECHEVAL",18]
[8150,"08150","SERVION",18]
[8150,"08150","SORMONNE",18]
[8150,"08150","TREMBLOIS LES ROCROI",18]
[8150,"08150","VAUX VILLAINE",18]
[8160,"08160","BALAIVES ET BUTZ",14]
[8160,"08160","BOUTANCOURT",14]
[8160,"08160","CHALANDRY ELAIRE",14]
[8160,"08160","DOM LE MESNIL",14]
[8160,"08160","ELAN",14]
[8160,"08160","ETREPIGNY",14]
[8160,"08160","FLIZE",14]
[8160,"08160","HANNOGNE ST MARTIN",14]
[8160,"08160","LA CASSINE",14]
[8160,"08160","NOUVION SUR MEUSE",14]
[8160,"08160","PONT A BAR",14]
[8160,"08160","SAPOGNE ET FEUCHERES",14]
[8160,"08160","ST MARCEAU",14]
[8160,"08160","VENDRESSE",14]
[8170,"08170","FEPIN",5]
[8170,"08170","FUMAY",5]
[8170,"08170","HARGNIES",5]
[8170,"08170","HAYBES",5]
[8170,"08170","MONTIGNY SUR MEUSE",5]
[8190,"08190","AIRE",15]
[8190,"08190","ASFELD",15]
[8190,"08190","AVAUX",15]
[8190,"08190","BALHAM",15]
[8190,"08190","BLANZY LA SALONNAISE",15]
[8190,"08190","BRIENNE SUR AISNE",15]
[8190,"08190","GOMONT",15]
[8190,"08190","HOUDILCOURT",15]
[8190,"08190","LE THOUR",15]
[8190,"08190","POILCOURT SYDNEY",15]
[8190,"08190","ROIZY",15]
[8190,"08190","SAULT ST REMY",15]
[8190,"08190","ST GERMAINMONT",15]
[8190,"08190","VIEUX LES ASFELD",15]
[8190,"08190","VILLERS DEVANT LE THOUR",15]
[8200,"08200","BALAN",10]
[8200,"08200","FLEIGNEUX",10]
[8200,"08200","FLOING",10]
[8200,"08200","GIVONNE",{"$f":"COUNTIF($B$2:$B$5669,B130)","v":10}]
[8200,"08200","GLAIRE",10]
[8200,"08200","ILLY",10]
[8200,"08200","LA CHAPELLE",10]
[8200,"08200","SEDAN",10]
[8200,"08200","ST MENGES",10]
[8200,"08200","WADELINCOURT",10]
[8210,"08210","AMBLIMONT",9]
[8210,"08210","AUTRECOURT ET POURRON",9]
[8210,"08210","BEAUMONT EN ARGONNE",9]
[8210,"08210","EUILLY ET LOMBUT",9]
[8210,"08210","LETANNE",9]
[8210,"08210","MOUZON",9]
[8210,"08210","VAUX LES MOUZON",9]
[8210,"08210","VILLERS DEVANT MOUZON",9]
[8210,"08210","YONCQ",9]
[8220,"08220","BANOGNE RECOUVRANCE",25]
[8220,"08220","CHAPPES",25]
[8220,"08220","CHAUMONT PORCIEN",25]
[8220,"08220","DOUMELY BEGNY",25]
[8220,"08220","DRAIZE",25]
[8220,"08220","FOREST",25]
[8220,"08220","FRAILLICOURT",25]
[8220,"08220","GIVRON",25]
[8220,"08220","HANNOGNE ST REMY",25]
[8220,"08220","LA HARDOYE",25]
[8220,"08220","LA ROMAGNE",25]
[8220,"08220","LOGNY LES CHAUMONT",25]
[8220,"08220","MAINBRESSON",25]
[8220,"08220","MAINBRESSY",25]
[8220,"08220","MONTMEILLANT",25]
[8220,"08220","REMAUCOURT",25]
[8220,"08220","RENNEVILLE",25]
[8220,"08220","ROCQUIGNY",25]
[8220,"08220","RUBIGNY",25]
[8220,"08220","SERAINCOURT",25]
[8220,"08220","SEVIGNY WALEPPE",25]
[8220,"08220","ST JEAN AUX BOIS",25]
[8220,"08220","ST QUENTIN LE PETIT",25]
[8220,"08220","VAUX LES RUBIGNY",25]
[8220,"08220","WADIMONT",25]
[8230,"08230","BOURG FIDELE",8]
[8230,"08230","GUE D'HOSSUS",8]
[8230,"08230","HIRAUMONT",8]
[8230,"08230","HONGREAU",8]
[8230,"08230","REGNIOWEZ",8]
[8230,"08230","ROCROI",8]
[8230,"08230","SEVIGNY LA FORET",8]
[8230,"08230","TAILLETTE",8]
[8240,"08240","ANDEVANNE",30]
[8240,"08240","AUTHE",30]
[8240,"08240","AUTRUCHE",30]
[8240,"08240","BAR LES BUZANCY",30]
[8240,"08240","BARRICOURT",30]
[8240,"08240","BAYONVILLE",30]
[8240,"08240","BELLEVILLE ET CHATILLON SUR B",30]
[8240,"08240","BELVAL BOIS DES DAMES",30]
[8240,"08240","BOULT AUX BOIS",30]
[8240,"08240","BRIEULLES SUR BAR",30]
[8240,"08240","BRIQUENAY",30]
[8240,"08240","BUZANCY",30]
[8240,"08240","CHATILLON SUR BAR",30]
[8240,"08240","FOSSE",30]
[8240,"08240","GERMONT",30]
[8240,"08240","HARRICOURT",{"$f":"COUNTIF($B$2:$B$5669,B194)","v":30}]
[8240,"08240","IMECOURT",30]
[8240,"08240","LA BERLIERE",30]
[8240,"08240","LANDRES ET ST GEORGES",30]
[8240,"08240","LE CHAMPY",30]
[8240,"08240","NOUART",30]
[8240,"08240","OCHES",30]
[8240,"08240","REMONVILLE",30]
[8240,"08240","SIVRY LES BUZANCY",30]
[8240,"08240","SOMMAUTHE",30]
[8240,"08240","ST PIERREMONT",30]
[8240,"08240","TAILLY",30]
[8240,"08240","THENORGUES",30]
[8240,"08240","VAUX EN DIEULET",30]
[8240,"08240","VERPEL",30]
[8250,"08250","APREMONT",25]
[8250,"08250","AUTRY",25]
[8250,"08250","BEFFU ET LE MORTHOMME",25]
[8250,"08250","BOUCONVILLE",25]
[8250,"08250","CHAMPIGNEULLE",25]
[8250,"08250","CHATEL CHEHERY",25]
[8250,"08250","CHEVIERES",25]
[8250,"08250","CONDE LES AUTRY",25]
[8250,"08250","CORNAY",25]
[8250,"08250","EXERMONT",25]
[8250,"08250","FLEVILLE",25]
[8250,"08250","GRANDHAM",25]
[8250,"08250","GRANDPRE",25]
[8250,"08250","LANCON",25]
[8250,"08250","MARCQ",25]
[8250,"08250","MONTCHEUTIN",25]
[8250,"08250","MOURON",25]
[8250,"08250","OLIZY PRIMAT",25]
[8250,"08250","PRIMAT",25]
[8250,"08250","SECHAULT",25]
[8250,"08250","SENUC",25]
[8250,"08250","SOMMERANCE",25]
[8250,"08250","ST JUVIN",25]
[8250,"08250","TERMES",25]
[8250,"08250","VAUX LES MOURON",25]
[8260,"08260","AUVILLERS LES FORGES",14]
[8260,"08260","BLOMBAY",14]
[8260,"08260","CERNION",14]
[8260,"08260","CHILLY",14]
[8260,"08260","ESTREBAY",14]
[8260,"08260","ETALLE",14]
[8260,"08260","ETEIGNIERES",14]
[8260,"08260","FLAIGNES HAVYS",14]
[8260,"08260","FOULZY",14]
[8260,"08260","GIRONDELLE",14]
[8260,"08260","HAVYS",14]
[8260,"08260","MARBY",14]
[8260,"08260","MAUBERT FONTAINE",14]
[8260,"08260","MON IDEE",14]
[8270,"08270","AUBONCOURT VAUZELLES",21]
[8270,"08270","CHESNOIS AUBONCOURT",21]
[8270,"08270","CORNY MACHEROMENIL",21]
[8270,"08270","FAISSAULT",21]
[8270,"08270","FAUX",21]
[8270,"08270","GRANDCHAMP",21]
[8270,"08270","JUSTINE HERBIGNY",21]
[8270,"08270","LA NEUVILLE LES WASIGNY",21]
[8270,"08270","MARGY",21]
[8270,"08270","MESMONT",21]
[8270,"08270","NOVION PORCIEN",{"$f":"COUNTIF($B$2:$B$5669,B258)","v":21}]
[8270,"08270","PROVISY",21]
[8270,"08270","PUISEUX",21]
[8270,"08270","SAULCES MONCLIN",21]
[8270,"08270","SERY",21]
[8270,"08270","SORCY BAUTHEMONT",21]
[8270,"08270","VAUX MONTREUIL",21]
[8270,"08270","VIEL ST REMY",21]
[8270,"08270","WAGNON",21]
[8270,"08270","WASIGNY",21]
[8270,"08270","WIGNICOURT",21]
[8290,"08290","ANTHENY",14]
[8290,"08290","AOUSTE",14]
[8290,"08290","BAY",14]
[8290,"08290","BLANCHEFOSSE ET BAY",14]
[8290,"08290","BOSSUS LES RUMIGNY",14]
[8290,"08290","CHAMPLIN",14]
[8290,"08290","HANNAPPES",14]
[8290,"08290","LA CERLEAU",14]
[8290,"08290","LA FEREE",14]
[8290,"08290","LE FRETY",14]
[8290,"08290","LIART",14]
[8290,"08290","MARLEMONT",14]
[8290,"08290","PREZ",14]
[8290,"08290","RUMIGNY",14]
[8300,"08300","ACY ROMANCE",30]
[8300,"08300","AMAGNE",30]
[8300,"08300","ARNICOURT",30]
[8300,"08300","AVANCON",30]
[8300,"08300","BARBY",30]
[8300,"08300","BERGNICOURT",30]
[8300,"08300","BERTONCOURT",30]
[8300,"08300","BIERMES",30]
[8300,"08300","COUCY",30]
[8300,"08300","DOUX",30]
[8300,"08300","ECLY",30]
[8300,"08300","HAUTEVILLE",30]
[8300,"08300","INAUMONT",30]
[8300,"08300","L'ECAILLE",30]
[8300,"08300","LE CHATELET SUR RETOURNE",30]
[8300,"08300","LUCQUY",30]
[8300,"08300","NANTEUIL SUR AISNE",30]
[8300,"08300","NEUFLIZE",30]
[8300,"08300","NOVY CHEVRIERES",30]
[8300,"08300","PARGNY RESSON",30]
[8300,"08300","PERTHES",30]
[8300,"08300","RETHEL",30]
[8300,"08300","SAULT LES RETHEL",30]
[8300,"08300","SEUIL",30]
[8300,"08300","SON",30]
[8300,"08300","SORBON",30]
[8300,"08300","ST LOUP CHAMPAGNE",30]
[8300,"08300","ST REMY LE PETIT",30]
[8300,"08300","TAGNON",30]
[8300,"08300","THUGNY TRUGNY",30]
[8310,"08310","ALINCOURT",19]
[8310,"08310","ANNELLES",19]
[8310,"08310","AUSSONCE",19]
[8310,"08310","BIGNICOURT",19]
[8310,"08310","CAUROY",19]
[8310,"08310","DRICOURT",19]
[8310,"08310","HAUVINE",19]
[8310,"08310","JUNIVILLE",19]
[8310,"08310","LA NEUVILLE EN TOURNE A FUY",19]
[8310,"08310","LEFFINCOURT",{"$f":"COUNTIF($B$2:$B$5669,B322)","v":19}]
[8310,"08310","MACHAULT",19]
[8310,"08310","MENIL ANNELLES",19]
[8310,"08310","MENIL LEPINOIS",19]
[8310,"08310","MONT ST REMY",19]
[8310,"08310","PAUVRES",19]
[8310,"08310","ST CLEMENT A ARNES",19]
[8310,"08310","ST ETIENNE A ARNES",19]
[8310,"08310","ST PIERRE A ARNES",19]
[8310,"08310","VILLE SUR RETOURNE",19]
[8320,"08320","AUBRIVES",4]
[8320,"08320","HIERGES",4]
[8320,"08320","VIREUX MOLHAIN",4]
[8320,"08320","VIREUX WALLERAND",4]
[8330,"08330","VRIGNE AUX BOIS",1]
[8350,"08350","BOSSEVAL ET BRIANCOURT",9]
[8350,"08350","CHEHERY",9]
[8350,"08350","CHEVEUGES",9]
[8350,"08350","DONCHERY",9]
[8350,"08350","NOYERS PONT MAUGIS",9]
[8350,"08350","ST AIGNAN",9]
[8350,"08350","THELONNE",9]
[8350,"08350","VILLERS SUR BAR",9]
[8350,"08350","VRIGNE MEUSE",9]
[8360,"08360","CHATEAU PORCIEN",6]
[8360,"08360","CHAUDION",6]
[8360,"08360","CONDE LES HERPY",6]
[8360,"08360","HERPY L'ARLESIENNE",6]
[8360,"08360","ST FERGEUX",6]
[8360,"08360","TAIZY",6]
[8370,"08370","AUFLANCE",13]
[8370,"08370","BIEVRES",13]
[8370,"08370","FROMY",13]
[8370,"08370","HERBEUVAL",13]
[8370,"08370","LA FERTE SUR CHIERS",13]
[8370,"08370","MALANDRY",13]
[8370,"08370","MARGNY",13]
[8370,"08370","MARGUT",13]
[8370,"08370","MOIRY",13]
[8370,"08370","PUILLY ET CHARBEAUX",13]
[8370,"08370","SAPOGNE SUR MARCHE",13]
[8370,"08370","SIGNY MONTLIBERT",13]
[8370,"08370","VILLY",13]
[8380,"08380","AUGE",9]
[8380,"08380","BEAULIEU",9]
[8380,"08380","BROGNON",9]
[8380,"08380","FLIGNY",9]
[8380,"08380","LA GRUERIE",9]
[8380,"08380","LA NEUVILLE AUX JOUTES",9]
[8380,"08380","NEUVILLE LEZ BEAULIEU",9]
[8380,"08380","SIGNY LE PETIT",9]
[8380,"08380","TARZY",9]
[8390,"08390","ARTAISE LE VIVIER",13]
[8390,"08390","LE CHESNE",13]
[8390,"08390","LE MONT DIEU",13]
[8390,"08390","LES GRANDES ARMOISES",13]
[8390,"08390","LES PETITES ARMOISES",13]
[8390,"08390","LOUVERGNY",13]
[8390,"08390","MARQUIGNY",13]
[8390,"08390","MONTGON",13]
[8390,"08390","SAUVILLE",13]
[8390,"08390","STONNE",13]
[8390,"08390","SY",13]
[8390,"08390","TANNAY",13]
[8390,"08390","VERRIERES",{"$f":"COUNTIF($B$2:$B$5669,B386)","v":13}]
[8400,"08400","ARDEUIL ET MONTFAUXELLES",35]
[8400,"08400","AURE",35]
[8400,"08400","BALLAY",35]
[8400,"08400","BLAISE",35]
[8400,"08400","BOURCQ",35]
[8400,"08400","BRECY BRIERES",35]
[8400,"08400","CHALLERANGE",35]
[8400,"08400","CHARDENY",35]
[8400,"08400","CONTREUVE",35]
[8400,"08400","FALAISE",35]
[8400,"08400","GRIVY LOISY",35]
[8400,"08400","LA CROIX AUX BOIS",35]
[8400,"08400","LES ALLEUX",35]
[8400,"08400","LIRY",35]
[8400,"08400","LONGWE",35]
[8400,"08400","MANRE",35]
[8400,"08400","MARS SOUS BOURCQ",35]
[8400,"08400","MARVAUX VIEUX",35]
[8400,"08400","MONT ST MARTIN",35]
[8400,"08400","MONTHOIS",35]
[8400,"08400","NOIRVAL",35]
[8400,"08400","QUATRE CHAMPS",35]
[8400,"08400","QUILLY",35]
[8400,"08400","SAVIGNY SUR AISNE",35]
[8400,"08400","SEMIDE",35]
[8400,"08400","ST MOREL",35]
[8400,"08400","STE MARIE",35]
[8400,"08400","SUGNY",35]
[8400,"08400","TERRON SUR AISNE",35]
[8400,"08400","TOGES",35]
[8400,"08400","TOURCELLES CHAUMONT",35]
[8400,"08400","VANDY",35]
[8400,"08400","VONCQ",35]
[8400,"08400","VOUZIERS",35]
[8400,"08400","VRIZY",35]
[8410,"08410","BOULZICOURT",1]
[8430,"08430","BAALONS",25]
[8430,"08430","BARBAISE",25]
[8430,"08430","BOUVELLEMONT",25]
[8430,"08430","CHAGNY",25]
[8430,"08430","CHAMPIGNEUL SUR VENCE",25]
[8430,"08430","GRUYERES",25]
[8430,"08430","GUIGNICOURT SUR VENCE",25]
[8430,"08430","HAGNICOURT",25]
[8430,"08430","JANDUN",25]
[8430,"08430","LA HORGNE",25]
[8430,"08430","LAUNOIS SUR VENCE",25]
[8430,"08430","MAZERNY",25]
[8430,"08430","MONDIGNY",25]
[8430,"08430","MONTIGNY SUR VENCE",25]
[8430,"08430","NEUVIZY",25]
[8430,"08430","OMONT",25]
[8430,"08430","POIX TERRON",25]
[8430,"08430","RAILLICOURT BARBAISE",25]
[8430,"08430","SINGLY",25]
[8430,"08430","ST PIERRE SUR VENCE",25]
[8430,"08430","TOULIGNY",25]
[8430,"08430","VILLERS LE TILLEUL",25]
[8430,"08430","VILLERS LE TOURNEUR",25]
[8430,"08430","VILLERS SUR LE MONT",25]
[8430,"08430","YVERNAUMONT",25]
[8440,"08440","GERNELLE",5]
[8440,"08440","ISSANCOURT ET RUMEL",5]
[8440,"08440","LUMES",{"$f":"COUNTIF($B$2:$B$5669,B450)","v":5}]
[8440,"08440","VILLE SUR LUMES",5]
[8440,"08440","VIVIER AU COURT",5]
[8450,"08450","ANGECOURT",12]
[8450,"08450","BULSON",12]
[8450,"08450","CHEMERY SUR BAR",12]
[8450,"08450","CONNAGE",12]
[8450,"08450","HARAUCOURT",12]
[8450,"08450","LA BESACE",12]
[8450,"08450","LA NEUVILLE A MAIRE",12]
[8450,"08450","MAISONCELLE ET VILLERS",12]
[8450,"08450","MALMY",12]
[8450,"08450","OMICOURT",12]
[8450,"08450","RAUCOURT ET FLABA",12]
[8450,"08450","REMILLY AILLICOURT",12]
[8460,"08460","DOMMERY",6]
[8460,"08460","LALOBBE",6]
[8460,"08460","LIBRECY",6]
[8460,"08460","MARANWEZ",6]
[8460,"08460","SIGNY L'ABBAYE",6]
[8460,"08460","THIN LE MOUTIER",6]
[8500,"08500","ANCHAMPS",3]
[8500,"08500","LES MAZURES",3]
[8500,"08500","REVIN",3]
[8510,"08510","LA FRANCHEVILLE",1]
[8520,"08520","LA GRANDVILLE",1]
[8540,"08540","TOURNES",1]
[8560,"08560","CLAVY WARBY",3]
[8560,"08560","NEUFMAISON",3]
[8560,"08560","ST MARCEL",3]
[8600,"08600","CHARNOIS",9]
[8600,"08600","CHOOZ",9]
[8600,"08600","FLOHIMONT",9]
[8600,"08600","FOISCHES",9]
[8600,"08600","FROMELENNES",9]
[8600,"08600","GIVET",9]
[8600,"08600","HAM SUR MEUSE",9]
[8600,"08600","LANDRICHAMPS",9]
[8600,"08600","RANCENNES",9]
[8700,"08700","GESPUNSART",5]
[8700,"08700","JOIGNY SUR MEUSE",5]
[8700,"08700","MEILLIER FONTAINE",5]
[8700,"08700","NEUFMANIL",5]
[8700,"08700","NOUZONVILLE",5]
[8800,"08800","DEVILLE",12]
[8800,"08800","HAULME",12]
[8800,"08800","LA PETITE COMMUNE",12]
[8800,"08800","LAIFOUR",12]
[8800,"08800","LES HAUTES RIVIERES",12]
[8800,"08800","LES HAUTS BUTTES",12]
[8800,"08800","LINCHAMPS",12]
[8800,"08800","MONTHERME",12]
[8800,"08800","NOHAN",12]
[8800,"08800","PHADE",12]
[8800,"08800","THILAY",12]
[8800,"08800","TOURNAVAUX",12]
[10000,"10000","TROYES",1]
[10100,"10100","CRANCEY",10]
[10100,"10100","GELANNES",10]
[10100,"10100","LA FOSSE CORDUAN",10]
[10100,"10100","LES GRANGES",10]
[10100,"10100","OSSEY LES TROIS MAISONS",10]
[10100,"10100","PARS LES ROMILLY",10]
[10100,"10100","ROMILLY SUR SEINE",10]
[10100,"10100","ST HILAIRE SOUS ROMILLY",{"$f":"COUNTIF($B$2:$B$5669,B514)","v":10}]
[10100,"10100","ST LOUP DE BUFFIGNY",10]
[10100,"10100","ST MARTIN DE BOSSENAY",10]
[10110,"10110","BALNOT SUR LAIGNES",24]
[10110,"10110","BAR SUR SEINE",24]
[10110,"10110","BERTIGNOLLES",24]
[10110,"10110","BOURGUIGNONS",24]
[10110,"10110","BUXEUIL",24]
[10110,"10110","BUXIERES SUR ARCE",24]
[10110,"10110","CELLES SUR OURCE",24]
[10110,"10110","CHACENAY",24]
[10110,"10110","CHAUFFOUR LES BAILLY",24]
[10110,"10110","CHERVEY",24]
[10110,"10110","EGUILLY SOUS BOIS",24]
[10110,"10110","FRALIGNES",24]
[10110,"10110","LANDREVILLE",24]
[10110,"10110","LOCHES SUR OURCE",24]
[10110,"10110","MAGNANT",24]
[10110,"10110","MAROLLES LES BAILLY",24]
[10110,"10110","MERREY SUR ARCE",24]
[10110,"10110","POLIGNY",24]
[10110,"10110","POLISOT",24]
[10110,"10110","POLISY",24]
[10110,"10110","VILLE SUR ARCE",24]
[10110,"10110","VILLEMORIEN",24]
[10110,"10110","VITRY LE CROISE",24]
[10110,"10110","VIVIERS SUR ARTAUT",24]
[10120,"10120","CHEVILLELE",6]
[10120,"10120","LAINES AUX BOIS",6]
[10120,"10120","LEPINE",6]
[10120,"10120","ST ANDRE LES VERGERS",6]
[10120,"10120","ST GERMAIN",6]
[10120,"10120","ST POUANGE",6]
[10130,"10130","AUXON",19]
[10130,"10130","AVREUIL",19]
[10130,"10130","BERNON",19]
[10130,"10130","CHAMOY",19]
[10130,"10130","CHESSY LES PRES",19]
[10130,"10130","COURSAN EN OTHE",19]
[10130,"10130","COURTAOULT",19]
[10130,"10130","DAVREY",19]
[10130,"10130","EAUX PUISEAUX",19]
[10130,"10130","ERVY LE CHATEL",19]
[10130,"10130","LES CROUTES",19]
[10130,"10130","LIGNIERES",19]
[10130,"10130","MAROLLES SOUS LIGNIERES",19]
[10130,"10130","MONTFEY",19]
[10130,"10130","MONTIGNY LES MONTS",19]
[10130,"10130","RACINES",19]
[10130,"10130","ST PHAL",19]
[10130,"10130","VILLENEUVE AU CHEMIN",19]
[10130,"10130","VOSNON",19]
[10140,"10140","AMANCE",22]
[10140,"10140","ARGANCON",22]
[10140,"10140","BEUREY",22]
[10140,"10140","BOSSANCOURT",22]
[10140,"10140","BRIEL SUR BARSE",22]
[10140,"10140","CHAMP SUR BARSE",22]
[10140,"10140","JESSAINS",22]
[10140,"10140","JUVANZE",22]
[10140,"10140","LA LOGE AUX CHEVRES",22]
[10140,"10140","LA VILLENEUVE AU CHENE",22]
[10140,"10140","LONGPRE LE SEC",22]
[10140,"10140","MAGNY FOUCHARD",22]
[10140,"10140","MAISON DES CHAMPS",{"$f":"COUNTIF($B$2:$B$5669,B578)","v":22}]
[10140,"10140","MESNIL ST PERE",22]
[10140,"10140","MONTMARTIN LE HAUT",22]
[10140,"10140","PUITS ET NUISEMENT",22]
[10140,"10140","THIEFFRAIN",22]
[10140,"10140","TRANNES",22]
[10140,"10140","UNIENVILLE",22]
[10140,"10140","VAUCHONVILLIERS",22]
[10140,"10140","VENDEUVRE SUR BARSE",22]
[10140,"10140","VILLY EN TRODES",22]
[10150,"10150","ARGENTOLLES",15]
[10150,"10150","AUBETERRE",15]
[10150,"10150","CHARMONT SOUS BARBUISE",15]
[10150,"10150","CRENEY PRES TROYES",15]
[10150,"10150","CULOISON",15]
[10150,"10150","FEUGES",15]
[10150,"10150","FONTAINE LUYERES",15]
[10150,"10150","LA VALLOTE",15]
[10150,"10150","LAVAU",15]
[10150,"10150","LUYERES",15]
[10150,"10150","MONTSUZAIN",15]
[10150,"10150","PONT STE MARIE",15]
[10150,"10150","STE MAURE",15]
[10150,"10150","VAILLY",15]
[10150,"10150","VOUE",15]
[10160,"10160","AIX EN OTHE",11]
[10160,"10160","BERULLE",11]
[10160,"10160","MARAYE EN OTHE",11]
[10160,"10160","NOGENT EN OTHE",11]
[10160,"10160","PAISY COSDON",11]
[10160,"10160","PLANTY",11]
[10160,"10160","RIGNY LE FERRON",11]
[10160,"10160","ST BENOIST SUR VANNE",11]
[10160,"10160","ST MARDS EN OTHE",11]
[10160,"10160","VILLEMOIRON EN OTHE",11]
[10160,"10160","VULAINES",11]
[10170,"10170","BESSY",17]
[10170,"10170","CHAUCHIGNY",17]
[10170,"10170","DROUPT ST BASLE",17]
[10170,"10170","DROUPT STE MARIE",17]
[10170,"10170","ETRELLES SUR AUBE",17]
[10170,"10170","FONTAINE LES GRES",17]
[10170,"10170","LES GRANDES CHAPELLES",17]
[10170,"10170","LONGUEVILLE SUR AUBE",17]
[10170,"10170","MERY SUR SEINE",17]
[10170,"10170","MESGRIGNY",17]
[10170,"10170","ORVILLIERS ST JULIEN",17]
[10170,"10170","PREMIERFAIT",17]
[10170,"10170","RHEGES BESSY",17]
[10170,"10170","RILLY STE SYRE",17]
[10170,"10170","ST MESMIN",17]
[10170,"10170","ST OULPH",17]
[10170,"10170","VALLANT ST GEORGES",17]
[10190,"10190","BERCENAY EN OTHE",15]
[10190,"10190","BUCEY EN OTHE",15]
[10190,"10190","CHENNEGY",15]
[10190,"10190","DIERREY ST JULIEN",15]
[10190,"10190","DIERREY ST PIERRE",15]
[10190,"10190","ESTISSAC",15]
[10190,"10190","FONTVANNES",15]
[10190,"10190","MESNIL ST LOUP",15]
[10190,"10190","MESSON",15]
[10190,"10190","NEUVILLE SUR VANNE",15]
[10190,"10190","PALIS",15]
[10190,"10190","PRUGNY",{"$f":"COUNTIF($B$2:$B$5669,B642)","v":15}]
[10190,"10190","THUISY",15]
[10190,"10190","VAUCHASSIS",15]
[10190,"10190","VILLEMAUR SUR VANNE",15]
[10200,"10200","AILLEVILLE",37]
[10200,"10200","ARCONVILLE",37]
[10200,"10200","ARRENTIERES",37]
[10200,"10200","ARSONVAL",37]
[10200,"10200","BAR SUR AUBE",37]
[10200,"10200","BAROVILLE",37]
[10200,"10200","BERGERES",37]
[10200,"10200","BLIGNY",37]
[10200,"10200","CHAMPIGNOL LEZ MONDEVILLE",37]
[10200,"10200","COLOMBE LA FOSSE",37]
[10200,"10200","COLOMBE LE SEC",37]
[10200,"10200","COUVIGNON",37]
[10200,"10200","DOLANCOURT",37]
[10200,"10200","ECLANCE",37]
[10200,"10200","ENGENTE",37]
[10200,"10200","FONTAINE",37]
[10200,"10200","FRAVAUX",37]
[10200,"10200","FRESNAY",37]
[10200,"10200","FULIGNY",37]
[10200,"10200","JAUCOURT",37]
[10200,"10200","LEVIGNY",37]
[10200,"10200","LIGNOL LE CHATEAU",37]
[10200,"10200","MAISONS LES SOULAINES",37]
[10200,"10200","MEURVILLE",37]
[10200,"10200","MONTIER EN L'ISLE",37]
[10200,"10200","PROVERVILLE",37]
[10200,"10200","ROUVRES LES VIGNES",37]
[10200,"10200","SAULCY",37]
[10200,"10200","SOULAINES DHUYS",37]
[10200,"10200","SPOY",37]
[10200,"10200","THIL",37]
[10200,"10200","THORS",37]
[10200,"10200","URVILLE",37]
[10200,"10200","VAL PERDU",37]
[10200,"10200","VERNONVILLIERS",37]
[10200,"10200","VILLE SUR TERRE",37]
[10200,"10200","VOIGNY",37]
[10210,"10210","BALNOT LA GRANGE",23]
[10210,"10210","CHAOURCE",23]
[10210,"10210","CHASEREY",23]
[10210,"10210","CHESLEY",23]
[10210,"10210","COUSSEGREY",23]
[10210,"10210","CUSSANGY",23]
[10210,"10210","ETOURVY",23]
[10210,"10210","LA LOGE POMBLIN",23]
[10210,"10210","LAGESSE",23]
[10210,"10210","LANTAGES",23]
[10210,"10210","LES GRANGES",23]
[10210,"10210","LES LOGES MARGUERON",23]
[10210,"10210","MAISONS LES CHAOURCE",23]
[10210,"10210","METZ ROBERT",23]
[10210,"10210","PARGUES",23]
[10210,"10210","PRASLIN",23]
[10210,"10210","PRUSY",23]
[10210,"10210","TURGY",23]
[10210,"10210","VALLIERES",23]
[10210,"10210","VANLAY",23]
[10210,"10210","VILLIERS LE BOIS",23]
[10210,"10210","VILLIERS SOUS PRASLIN",23]
[10210,"10210","VOUGREY",23]
[10220,"10220","ASSENCIERES",{"$f":"COUNTIF($B$2:$B$5669,B706)","v":12}]
[10220,"10220","BOUY LUXEMBOURG",12]
[10220,"10220","BREVONNES",12]
[10220,"10220","DOSCHES",12]
[10220,"10220","GERAUDOT",12]
[10220,"10220","MESNIL SELLIERES",12]
[10220,"10220","MONTANGON",12]
[10220,"10220","ONJON",12]
[10220,"10220","PINEY",12]
[10220,"10220","ROUILLY SACEY",12]
[10220,"10220","VAL D'AUZON",12]
[10220,"10220","VILLEHARDOUIN",12]
[10230,"10230","MAILLY LE CAMP",1]
[10240,"10240","AULNAY",18]
[10240,"10240","AVANT LES RAMERUPT",18]
[10240,"10240","BRILLECOURT",18]
[10240,"10240","CHAUDREY",18]
[10240,"10240","COCLOIS",18]
[10240,"10240","DAMPIERRE",18]
[10240,"10240","DOMMARTIN LE COQ",18]
[10240,"10240","ISLE AUBIGNY",18]
[10240,"10240","LONGSOLS",18]
[10240,"10240","MAGNICOURT",18]
[10240,"10240","MESNIL LETTRE",18]
[10240,"10240","MOREMBERT",18]
[10240,"10240","NOGENT SUR AUBE",18]
[10240,"10240","POUGY",18]
[10240,"10240","RAMERUPT",18]
[10240,"10240","ROMAINES",18]
[10240,"10240","VAUCOGNE",18]
[10240,"10240","VERRICOURT",18]
[10250,"10250","COURTERON",5]
[10250,"10250","GYE SUR SEINE",5]
[10250,"10250","MUSSY SUR SEINE",5]
[10250,"10250","NEUVILLE SUR SEINE",5]
[10250,"10250","PLAINES ST LANGE",5]
[10260,"10260","CHAPPES",10]
[10260,"10260","COURTENOT",10]
[10260,"10260","FOUCHERES",10]
[10260,"10260","JULLY SUR SARCE",10]
[10260,"10260","MONTCEAUX LES VAUDES",10]
[10260,"10260","RUMILLY LES VAUDES",10]
[10260,"10260","ST PARRES LES VAUDES",10]
[10260,"10260","VAUDES",10]
[10260,"10260","VILLEMOYENNE",10]
[10260,"10260","VIREY SOUS BAR",10]
[10270,"10270","BOURANTON",9]
[10270,"10270","COURTERANGES",9]
[10270,"10270","DAUDES",9]
[10270,"10270","FRESNOY LE CHATEAU",9]
[10270,"10270","LAUBRESSEL",9]
[10270,"10270","LUSIGNY SUR BARSE",9]
[10270,"10270","MONTAULIN",9]
[10270,"10270","MONTIERAMEY",9]
[10270,"10270","MONTREUIL SUR BARSE",9]
[10290,"10290","AVON LA PEZE",11]
[10290,"10290","BERCENAY LE HAYER",11]
[10290,"10290","CHARMOY",11]
[10290,"10290","FAUX VILLECERF",11]
[10290,"10290","FAY LES MARCILLY",11]
[10290,"10290","MARCILLY LE HAYER",11]
[10290,"10290","POUY SUR VANNES",11]
[10290,"10290","RIGNY LA NONNEUSE",11]
[10290,"10290","TRANCAULT",11]
[10290,"10290","VAL D'ORVIN",{"$f":"COUNTIF($B$2:$B$5669,B770)","v":11}]
[10290,"10290","VILLADIN",11]
[10300,"10300","GRANGE L'EVEQUE",6]
[10300,"10300","LA RIVIERE DE CORPS",6]
[10300,"10300","MACEY",6]
[10300,"10300","MONTGUEUX",6]
[10300,"10300","STE SAVINE",6]
[10300,"10300","TORVILLIERS",6]
[10310,"10310","BAYEL",5]
[10310,"10310","CLAIRVAUX SUR AUBE",5]
[10310,"10310","JUVANCOURT",5]
[10310,"10310","LONGCHAMP SUR AUJON",5]
[10310,"10310","VILLE SOUS LA FERTE",5]
[10320,"10320","ASSENAY",15]
[10320,"10320","BOUILLY",15]
[10320,"10320","CRESANTIGNES",15]
[10320,"10320","FAYS LA CHAPELLE",15]
[10320,"10320","JAVERNANT",15]
[10320,"10320","JEUGNY",15]
[10320,"10320","LIREY",15]
[10320,"10320","LONGEVILLE SUR MOGNE",15]
[10320,"10320","MACHY",15]
[10320,"10320","MAUPAS",15]
[10320,"10320","RONCENAY",15]
[10320,"10320","SOMMEVAL",15]
[10320,"10320","SOULIGNY",15]
[10320,"10320","ST JEAN DE BONNEVAL",15]
[10320,"10320","VILLERY",15]
[10330,"10330","ARREMBECOURT",12]
[10330,"10330","BAILLY LE FRANC",12]
[10330,"10330","BALIGNICOURT",12]
[10330,"10330","CHAVANGES",12]
[10330,"10330","DONNEMENT",12]
[10330,"10330","JASSEINES",12]
[10330,"10330","JONCREUIL",12]
[10330,"10330","LENTILLES",12]
[10330,"10330","MONTMORENCY BEAUFORT",12]
[10330,"10330","PARS LES CHAVANGES",12]
[10330,"10330","ST LEGER SOUS MARGERIE",12]
[10330,"10330","VILLERET",12]
[10340,"10340","ARRELLES",7]
[10340,"10340","AVIREY LINGEY",7]
[10340,"10340","BAGNEUX LA FOSSE",7]
[10340,"10340","BEAUVOIR SUR SARCE",7]
[10340,"10340","BRAGELOGNE BEAUVOIR",7]
[10340,"10340","CHANNES",7]
[10340,"10340","LES RICEYS",7]
[10350,"10350","ECHEMINES",7]
[10350,"10350","LE PAVILLON STE JULIE",7]
[10350,"10350","MARIGNY LE CHATEL",7]
[10350,"10350","PRUNAY BELLEVILLE",7]
[10350,"10350","ST FLAVY",7]
[10350,"10350","ST LUPIEN",7]
[10350,"10350","VILLELOUP",7]
[10360,"10360","CUNFIN",6]
[10360,"10360","ESSOYES",6]
[10360,"10360","FONTETTE",6]
[10360,"10360","NOE LES MALLETS",6]
[10360,"10360","ST USAGE",6]
[10360,"10360","VERPILLIERES SUR OURCE",6]
[10370,"10370","DIVAL",2]
[10370,"10370","VILLENAUXE LA GRANDE",2]
[10380,"10380","BOULAGES",5]
[10380,"10380","CHARNY LE BACHOT",5]
[10380,"10380","PLANCY L'ABBAYE",{"$f":"COUNTIF($B$2:$B$5669,B834)","v":5}]
[10380,"10380","VIAPRES LE GRAND",5]
[10380,"10380","VIAPRES LE PETIT",5]
[10390,"10390","CLEREY",2]
[10390,"10390","VERRIERES",2]
[10400,"10400","AVANT LES MARCILLY",25]
[10400,"10400","BARBUISE",25]
[10400,"10400","BOUY SUR ORVIN",25]
[10400,"10400","COURCEROY",25]
[10400,"10400","COURTAVANT",25]
[10400,"10400","FERREUX QUINCEY",25]
[10400,"10400","FONTAINE MACON",25]
[10400,"10400","FONTENAY DE BOSSERY",25]
[10400,"10400","GUMERY",25]
[10400,"10400","LA LOUPTIERE THENARD",25]
[10400,"10400","LA MOTTE TILLY",25]
[10400,"10400","LA SAULSOTTE",25]
[10400,"10400","LA VILLENEUVE AU CHATELOT",25]
[10400,"10400","LE MERIOT",25]
[10400,"10400","MARNAY SUR SEINE",25]
[10400,"10400","MONTPOTHIER",25]
[10400,"10400","NOGENT SUR SEINE",25]
[10400,"10400","PERIGNY LA ROSE",25]
[10400,"10400","PLESSIS BARBUISE",25]
[10400,"10400","PONT SUR SEINE",25]
[10400,"10400","QUINCEY",25]
[10400,"10400","SOLIGNY LES ETANGS",25]
[10400,"10400","ST AUBIN",25]
[10400,"10400","ST NICOLAS LA CHAPELLE",25]
[10400,"10400","TRAINEL",25]
[10410,"10410","BELLEY",5]
[10410,"10410","RUVIGNY",5]
[10410,"10410","ST PARRES AUX TERTRES",5]
[10410,"10410","THENNELIERES",5]
[10410,"10410","VILLECHETIF",5]
[10420,"10420","LES NOES PRES TROYES",1]
[10430,"10430","ROSIERES PRES TROYES",2]
[10430,"10430","VIELAINES",2]
[10500,"10500","BETIGNICOURT",36]
[10500,"10500","BLAINCOURT SUR AUBE",36]
[10500,"10500","BLIGNICOURT",36]
[10500,"10500","BRAUX",36]
[10500,"10500","BRIENNE LA VIEILLE",36]
[10500,"10500","BRIENNE LE CHATEAU",36]
[10500,"10500","CHALETTE SUR VOIRE",36]
[10500,"10500","CHAUMESNIL",36]
[10500,"10500","COURCELLES SUR VOIRE",36]
[10500,"10500","CRESPY LE NEUF",36]
[10500,"10500","DIENVILLE",36]
[10500,"10500","EPAGNE",36]
[10500,"10500","EPOTHEMONT",36]
[10500,"10500","HAMPIGNY",36]
[10500,"10500","JUZANVIGNY",36]
[10500,"10500","LA CHAISE",36]
[10500,"10500","LA ROTHIERE",36]
[10500,"10500","LA VILLE AUX BOIS",36]
[10500,"10500","LASSICOURT",36]
[10500,"10500","LESMONT",36]
[10500,"10500","MAIZIERES LES BRIENNE",36]
[10500,"10500","MATHAUX",36]
[10500,"10500","MOLINS SUR AUBE",36]
[10500,"10500","MORVILLIERS",36]
[10500,"10500","PEL ET DER",36]
[10500,"10500","PERTHES LES BRIENNE",36]
[10500,"10500","PETIT MESNIL",{"$f":"COUNTIF($B$2:$B$5669,B898)","v":36}]
[10500,"10500","PRECY NOTRE DAME",36]
[10500,"10500","PRECY ST MARTIN",36]
[10500,"10500","RADONVILLIERS",36]
[10500,"10500","RANCES",36]
[10500,"10500","ROSNAY L'HOPITAL",36]
[10500,"10500","ST CHRISTOPHE DODINICOURT",36]
[10500,"10500","ST LEGER SOUS BRIENNE",36]
[10500,"10500","VALLENTIGNY",36]
[10500,"10500","YEVRES LE PETIT",36]
[10510,"10510","CHATRES",3]
[10510,"10510","MAIZIERES LA GRANDE PAROISSE",3]
[10510,"10510","ORIGNY LE SEC",3]
[10600,"10600","BARBEREY AUX MOINES",9]
[10600,"10600","BARBEREY ST SULPICE",9]
[10600,"10600","LA CHAPELLE ST LUC",9]
[10600,"10600","MERGEY",9]
[10600,"10600","PAYNS",9]
[10600,"10600","SAVIERES",9]
[10600,"10600","ST BENOIT SUR SEINE",9]
[10600,"10600","ST LYE",9]
[10600,"10600","VILLACERF",9]
[10700,"10700","ALLIBAUDIERES",29]
[10700,"10700","ARCIS SUR AUBE",29]
[10700,"10700","CHAMPFLEURY",29]
[10700,"10700","CHAMPIGNY SUR AUBE",29]
[10700,"10700","CHAPELLE VALLON",29]
[10700,"10700","DOSNON",29]
[10700,"10700","GRANDVILLE",29]
[10700,"10700","HERBISSE",29]
[10700,"10700","LE CHENE",29]
[10700,"10700","LHUITRE",29]
[10700,"10700","MESNIL LA COMTESSE",29]
[10700,"10700","NOZAY",29]
[10700,"10700","ORMES",29]
[10700,"10700","ORTILLON",29]
[10700,"10700","POIVRES",29]
[10700,"10700","POUAN LES VALLEES",29]
[10700,"10700","SALON",29]
[10700,"10700","SEMOINE",29]
[10700,"10700","ST ETIENNE SOUS BARBUISE",29]
[10700,"10700","ST NABORD SUR AUBE",29]
[10700,"10700","ST REMY SOUS BARBUISE",29]
[10700,"10700","TORCY LE GRAND",29]
[10700,"10700","TORCY LE PETIT",29]
[10700,"10700","TROUAN LE GRAND",29]
[10700,"10700","TROUANS",29]
[10700,"10700","VAUPOISSON",29]
[10700,"10700","VILLETTE SUR AUBE",29]
[10700,"10700","VILLIERS HERBISSE",29]
[10700,"10700","VINETS",29]
[10800,"10800","BREVIANDES",17]
[10800,"10800","BUCHERES",17]
[10800,"10800","CORMOST",17]
[10800,"10800","COURGERENNES",17]
[10800,"10800","ISLE AUMONT",17]
[10800,"10800","LA VENDUE MIGNOT",17]
[10800,"10800","LES BORDES AUMONT",17]
[10800,"10800","MOUSSEY",17]
[10800,"10800","ROUILLEROT",17]
[10800,"10800","ROUILLY ST LOUP",17]
[10800,"10800","ST JULIEN LES VILLAS",17]
[10800,"10800","ST LEGER PRES TROYES",17]
[10800,"10800","ST THIBAULT",17]
[10800,"10800","VILLEMEREUIL",{"$f":"COUNTIF($B$2:$B$5669,B962)","v":17}]
[10800,"10800","VILLEPART",17]
[10800,"10800","VILLY LE BOIS",17]
[10800,"10800","VILLY LE MARECHAL",17]
[51000,"51000","CHALONS SUR MARNE",16]
[51000,"51000","CHENIERS",16]
[51000,"51000","COMPERTRIX",16]
[51000,"51000","COOLUS",16]
[51000,"51000","FAGNIERES",16]
[51000,"51000","LA VEUVE",16]
[51000,"51000","RECY",16]
[51000,"51000","SARRY",16]
[51000,"51000","SOGNY AUX MOULINS",16]
[51000,"51000","ST ETIENNE AU TEMPLE",16]
[51000,"51000","ST GIBRIEN",16]
[51000,"51000","ST MARTIN SUR LE PRE",16]
[51000,"51000","ST MEMMIE",16]
[51000,"51000","ST PIERRE",16]
[51000,"51000","THIBIE",16]
[51000,"51000","VILLERS LE CHATEAU",16]
[51100,"51100","LA NEUVILLETTE",2]
[51100,"51100","REIMS",2]
[51110,"51110","BAZANCOURT",8]
[51110,"51110","BOULT SUR SUIPPE",8]
[51110,"51110","CAUREL",8]
[51110,"51110","HEUTREGIVILLE",8]
[51110,"51110","ISLES SUR SUIPPE",8]
[51110,"51110","LAVANNES",8]
[51110,"51110","POMACLE",8]
[51110,"51110","WARMERIVILLE",8]
[51120,"51120","ALLEMANT",27]
[51120,"51120","BARBONNE FAYEL",27]
[51120,"51120","BROYES",27]
[51120,"51120","CHARLEVILLE",27]
[51120,"51120","CHICHEY",27]
[51120,"51120","FONTAINE DENIS NUISY",27]
[51120,"51120","GAYE",27]
[51120,"51120","LA FORESTIERE",27]
[51120,"51120","LA VILLENEUVE LES CHARLEVILLE",27]
[51120,"51120","LACHY",27]
[51120,"51120","LE MEIX ST EPOING",27]
[51120,"51120","LES ESSARTS LES SEZANNE",27]
[51120,"51120","MOEURS VERDEY",27]
[51120,"51120","MONDEMENT MONTGIVROUX",27]
[51120,"51120","NESLE LA REPOSTE",27]
[51120,"51120","OYES",27]
[51120,"51120","PEAS",27]
[51120,"51120","QUEUDES",27]
[51120,"51120","REUVES",27]
[51120,"51120","SAUDOY",27]
[51120,"51120","SEZANNE",27]
[51120,"51120","SOIZY AUX BOIS",27]
[51120,"51120","ST LOUP",27]
[51120,"51120","ST QUENTIN LE VERGER",27]
[51120,"51120","ST REMY SOUS BROYES",27]
[51120,"51120","VILLENEUVE ST VISTRE VILLEVOT",27]
[51120,"51120","VINDEY",27]
[51130,"51130","AULNAY AUX PLANCHES",29]
[51130,"51130","AULNIZEUX",29]
[51130,"51130","BERGERES LES VERTUS",29]
[51130,"51130","CHAINTRIX BIERGES",29]
[51130,"51130","CHALTRAIT",29]
[51130,"51130","CLAMANGES",29]
[51130,"51130","ETRECHY",29]
[51130,"51130","GERMINON",{"$f":"COUNTIF($B$2:$B$5669,B1026)","v":29}]
[51130,"51130","GIONGES",29]
[51130,"51130","GIVRY LES LOISY",29]
[51130,"51130","LES ISTRES ET BURY",29]
[51130,"51130","LOISY EN BRIE",29]
[51130,"51130","MORAINS",29]
[51130,"51130","PIERRE MORAINS",29]
[51130,"51130","POCANCY",29]
[51130,"51130","ROUFFY",29]
[51130,"51130","SOULIERES",29]
[51130,"51130","ST MARD LES ROUFFY",29]
[51130,"51130","TOULON LA MONTAGNE",29]
[51130,"51130","TRECON",29]
[51130,"51130","VAL DES MARAIS",29]
[51130,"51130","VELYE",29]
[51130,"51130","VERT TOULON",29]
[51130,"51130","VERTUS",29]
[51130,"51130","VILLENEUVE RENNEVILLE CHEVIGN",29]
[51130,"51130","VILLERS AUX BOIS",29]
[51130,"51130","VILLESENEUX",29]
[51130,"51130","VOIPREUX",29]
[51130,"51130","VOUZY",29]
[51140,"51140","BOUVANCOURT",18]
[51140,"51140","BRANSCOURT",18]
[51140,"51140","BREUIL",18]
[51140,"51140","CHALONS SUR VESLE",18]
[51140,"51140","CHENAY",18]
[51140,"51140","COURCELLES SAPICOURT",18]
[51140,"51140","HOURGES",18]
[51140,"51140","JONCHERY SUR VESLE",18]
[51140,"51140","MONTIGNY SUR VESLE",18]
[51140,"51140","MUIZON",18]
[51140,"51140","PEVY",18]
[51140,"51140","PROUILLY",18]
[51140,"51140","ROMAIN",18]
[51140,"51140","SAVIGNY SUR ARDRES",18]
[51140,"51140","TRESLON",18]
[51140,"51140","TRIGNY",18]
[51140,"51140","VANDEUIL",18]
[51140,"51140","VENTELAY",18]
[51150,"51150","AIGNY",16]
[51150,"51150","AMBONNAY",16]
[51150,"51150","ATHIS",16]
[51150,"51150","AULNAY SUR MARNE",16]
[51150,"51150","BISSEUIL",16]
[51150,"51150","BOUZY",16]
[51150,"51150","CHAMPIGNEUL CHAMPAGNE",16]
[51150,"51150","CHERVILLE",16]
[51150,"51150","CONDE SUR MARNE",16]
[51150,"51150","ISSE",16]
[51150,"51150","JALONS",16]
[51150,"51150","JUVIGNY",16]
[51150,"51150","MATOUGUES",16]
[51150,"51150","PLIVOT",16]
[51150,"51150","TOURS SUR MARNE",16]
[51150,"51150","VRAUX",16]
[51160,"51160","AVENAY VAL D'OR",11]
[51160,"51160","AY",11]
[51160,"51160","CHAMPILLON",11]
[51160,"51160","FONTAINE SUR AY",11]
[51160,"51160","GERMAINE",11]
[51160,"51160","HAUTVILLERS",11]
[51160,"51160","LOUVOIS",11]
[51160,"51160","MAREUIL SUR AY",11]
[51160,"51160","MUTIGNY",{"$f":"COUNTIF($B$2:$B$5669,B1090)","v":11}]
[51160,"51160","ST IMOGES",11]
[51160,"51160","TAUXIERES MUTRY",11]
[51170,"51170","AOUGNY",27]
[51170,"51170","ARCIS LE PONSART",27]
[51170,"51170","AUBILLY",27]
[51170,"51170","BASLIEUX LES FISMES",27]
[51170,"51170","BLIGNY",27]
[51170,"51170","BOULEUSE",27]
[51170,"51170","BROUILLET",27]
[51170,"51170","CHAMBRECY",27]
[51170,"51170","CHAUMUZY",27]
[51170,"51170","COURLANDON",27]
[51170,"51170","COURVILLE",27]
[51170,"51170","CRUGNY",27]
[51170,"51170","FAVEROLLES ET COEMY",27]
[51170,"51170","FISMES",27]
[51170,"51170","LAGERY",27]
[51170,"51170","LHERY",27]
[51170,"51170","MAGNEUX",27]
[51170,"51170","MARFAUX",27]
[51170,"51170","MONT SUR COURVILLE",27]
[51170,"51170","POILLY",27]
[51170,"51170","ROMIGNY",27]
[51170,"51170","SARCY",27]
[51170,"51170","SERZY ET PRIN",27]
[51170,"51170","ST GILLES",27]
[51170,"51170","TRAMERY",27]
[51170,"51170","UNCHAIR",27]
[51170,"51170","VILLE EN TARDENOIS",27]
[51190,"51190","AVIZE",5]
[51190,"51190","FLAVIGNY",5]
[51190,"51190","GRAUVES",5]
[51190,"51190","LE MESNIL SUR OGER",5]
[51190,"51190","OGER",5]
[51200,"51200","BELVAL SOUS CHATILLON",25]
[51200,"51200","BOURSAULT",25]
[51200,"51200","BRUGNY VAUDANCOURT",25]
[51200,"51200","CHAVOT COURCOURT",25]
[51200,"51200","CHOUILLY",25]
[51200,"51200","CRAMANT",25]
[51200,"51200","CUIS",25]
[51200,"51200","DIZY",25]
[51200,"51200","EPERNAY",25]
[51200,"51200","FESTIGNY",25]
[51200,"51200","FLEURY LA RIVIERE",25]
[51200,"51200","LEUVRIGNY",25]
[51200,"51200","MAGENTA",25]
[51200,"51200","MANCY",25]
[51200,"51200","MARDEUIL",25]
[51200,"51200","MONTHELON",25]
[51200,"51200","MORANGIS",25]
[51200,"51200","MOSLINS",25]
[51200,"51200","MOUSSY",25]
[51200,"51200","OEUILLY",25]
[51200,"51200","OIRY",25]
[51200,"51200","PIERRY",25]
[51200,"51200","ST MARTIN D'ABLOIS",25]
[51200,"51200","VAUCIENNES",25]
[51200,"51200","VINAY",25]
[51210,"51210","BERGERES SOUS MONTMIRAIL",19]
[51210,"51210","BOISSY LE REPOS",19]
[51210,"51210","CORFELIX",19]
[51210,"51210","CORROBERT",19]
[51210,"51210","FROMENTIERES",{"$f":"COUNTIF($B$2:$B$5669,B1154)","v":19}]
[51210,"51210","JANVILLIERS",19]
[51210,"51210","LE BREUIL",19]
[51210,"51210","LE GAULT SOIGNY",19]
[51210,"51210","LE THOULT TROSNAY",19]
[51210,"51210","LE VEZIER",19]
[51210,"51210","MACLAUNAY",19]
[51210,"51210","MARGNY",19]
[51210,"51210","MECRINGES",19]
[51210,"51210","MONTMIRAIL",19]
[51210,"51210","MORSAINS",19]
[51210,"51210","RIEUX",19]
[51210,"51210","TREFOLS",19]
[51210,"51210","VAUCHAMPS",19]
[51210,"51210","VERDON",19]
[51220,"51220","AUMENANCOURT",16]
[51220,"51220","BERMERICOURT",16]
[51220,"51220","BOURGOGNE",16]
[51220,"51220","BRIMONT",16]
[51220,"51220","CAUROY LES HERMONVILLE",16]
[51220,"51220","CORMICY",16]
[51220,"51220","COURCY",16]
[51220,"51220","FRESNES LES REIMS",16]
[51220,"51220","HERMONVILLE",16]
[51220,"51220","LOIVRE",16]
[51220,"51220","MERFY",16]
[51220,"51220","POUILLON",16]
[51220,"51220","ST ETIENNE SUR SUIPPE",16]
[51220,"51220","ST THIERRY",16]
[51220,"51220","THIL",16]
[51220,"51220","VILLERS FRANQUEUX",16]
[51230,"51230","ANGLUZELLES ET COURCELLES",20]
[51230,"51230","BANNES",20]
[51230,"51230","BROUSSY LE GRAND",20]
[51230,"51230","BROUSSY LE PETIT",20]
[51230,"51230","CONNANTRAY VAUREFROY",20]
[51230,"51230","CONNANTRE",20]
[51230,"51230","CORROY",20]
[51230,"51230","ECURY LE REPOS",20]
[51230,"51230","EUVY",20]
[51230,"51230","FAUX FRESNAY",20]
[51230,"51230","FERE CHAMPENOISE",20]
[51230,"51230","GOURGANCON",20]
[51230,"51230","LENHARREE",20]
[51230,"51230","LINTHELLES",20]
[51230,"51230","LINTHES",20]
[51230,"51230","MARIGNY",20]
[51230,"51230","NORMEE",20]
[51230,"51230","OGNES",20]
[51230,"51230","PLEURS",20]
[51230,"51230","THAAS",20]
[51240,"51240","AULNAY L'AITRE",28]
[51240,"51240","BREUVERY SUR COOLE",28]
[51240,"51240","CERNON",28]
[51240,"51240","CHEPPES LA PRAIRIE",28]
[51240,"51240","CHEPY",28]
[51240,"51240","COUPETZ",28]
[51240,"51240","COUPEVILLE",28]
[51240,"51240","DAMPIERRE SUR MOIVRE",28]
[51240,"51240","ECURY SUR COOLE",28]
[51240,"51240","FRANCHEVILLE",28]
[51240,"51240","LA CHAUSSEE SUR MARNE",28]
[51240,"51240","LE FRESNE",28]
[51240,"51240","MAIRY SUR MARNE",28]
[51240,"51240","MARSON",{"$f":"COUNTIF($B$2:$B$5669,B1218)","v":28}]
[51240,"51240","MOIVRE",28]
[51240,"51240","NUISEMENT SUR COOLE",28]
[51240,"51240","OMEY",28]
[51240,"51240","POGNY",28]
[51240,"51240","SONGY",28]
[51240,"51240","ST GERMAIN LA VILLE",28]
[51240,"51240","ST JEAN SUR MOIVRE",28]
[51240,"51240","ST MARTIN AUX CHAMPS",28]
[51240,"51240","ST QUENTIN SUR COOLE",28]
[51240,"51240","TOGNY AUX BOEUFS",28]
[51240,"51240","VESIGNEUL SUR MARNE",28]
[51240,"51240","VITRY LA VILLE",28]
[51240,"51240","VOUCIENNES",28]
[51240,"51240","ABLANCOURT",28]
[51250,"51250","ALLIANCELLES",10]
[51250,"51250","BETTANCOURT LA LONGUE",10]
[51250,"51250","CHEMINON",10]
[51250,"51250","SERMAIZE LES BAINS",10]
[51250,"51250","SOGNY EN L'ANGLE",10]
[51250,"51250","VAL DE VIERE",10]
[51250,"51250","VANAULT LE CHATEL",10]
[51250,"51250","VANAULT LES DAMES",10]
[51250,"51250","VILLERS LE SEC",10]
[51250,"51250","VROIL",10]
[51260,"51260","ALLEMANCHE LAUNAY ET SOYER",22]
[51260,"51260","ANGLURE",22]
[51260,"51260","BAGNEUX",22]
[51260,"51260","BAUDEMENT",22]
[51260,"51260","BETHON",22]
[51260,"51260","CHANTEMERLE",22]
[51260,"51260","CLESLES",22]
[51260,"51260","CONFLANS SUR SEINE",22]
[51260,"51260","COURCEMAIN",22]
[51260,"51260","ESCLAVOLLES LUREY",22]
[51260,"51260","GRANGES SUR AUBE",22]
[51260,"51260","LA CELLE SOUS CHANTEMERLE",22]
[51260,"51260","LA CHAPELLE LASSON",22]
[51260,"51260","MARCILLY SUR SEINE",22]
[51260,"51260","MARSANGIS",22]
[51260,"51260","MONTGENOST",22]
[51260,"51260","POTANGIS",22]
[51260,"51260","SARON SUR AUBE",22]
[51260,"51260","ST JUST SAUVAGE",22]
[51260,"51260","ST SATURNIN",22]
[51260,"51260","VILLIERS AUX CORNEILLES",22]
[51260,"51260","VOUARCES",22]
[51270,"51270","BANNAY",21]
[51270,"51270","BAYE",21]
[51270,"51270","BEAUNAY",21]
[51270,"51270","CHAMPAUBERT",21]
[51270,"51270","COIZARD JOCHES",21]
[51270,"51270","CONGY",21]
[51270,"51270","CORRIBERT",21]
[51270,"51270","COURJEONNET",21]
[51270,"51270","ETOGES",21]
[51270,"51270","FEREBRIANGES",21]
[51270,"51270","LA CAURE",21]
[51270,"51270","LA CHAPELLE SOUS ORBAIS",21]
[51270,"51270","LA VILLE SOUS ORBAIS",21]
[51270,"51270","LE BAIZIL",21]
[51270,"51270","LUCY",21]
[51270,"51270","MAREUIL EN BRIE",21]
[51270,"51270","MONTMORT LUCY",21]
[51270,"51270","ORBAIS",{"$f":"COUNTIF($B$2:$B$5669,B1282)","v":21}]
[51270,"51270","SUIZY LE FRANC",21]
[51270,"51270","TALUS ST PRIX",21]
[51270,"51270","VILLEVENARD",21]
[51290,"51290","AMBRIERES",24]
[51290,"51290","ARRIGNY",24]
[51290,"51290","ARZILLIERES NEUVILLE",24]
[51290,"51290","BRANDONVILLERS",24]
[51290,"51290","CHAPELAINE",24]
[51290,"51290","CHATILLON SUR BROUE",24]
[51290,"51290","DROSNAY",24]
[51290,"51290","ECOLLEMONT",24]
[51290,"51290","GIFFAUMONT CHAMPAUBERT",24]
[51290,"51290","GIGNY BUSSY",24]
[51290,"51290","HAUTEVILLE",24]
[51290,"51290","ISLE SUR MARNE",24]
[51290,"51290","LANDRICOURT",24]
[51290,"51290","LARZICOURT",24]
[51290,"51290","LIGNON",24]
[51290,"51290","MARGERIE HANCOURT",24]
[51290,"51290","MONCETZ L'ABBAYE",24]
[51290,"51290","NEUVILLE SOUS ARZILLIERES",24]
[51290,"51290","OUTINES",24]
[51290,"51290","SOMSOIS",24]
[51290,"51290","ST CHERON",24]
[51290,"51290","ST REMY EN BOUZEMONT ST GENES",24]
[51290,"51290","ST UTIN",24]
[51290,"51290","STE MARIE DU LAC NUISEMENT",24]
[51300,"51300","BASSU",46]
[51300,"51300","BASSUET",46]
[51300,"51300","BIGNICOURT SUR MARNE",46]
[51300,"51300","BLACY",46]
[51300,"51300","BLAISE SOUS ARZILLIERES",46]
[51300,"51300","BRUSSON",46]
[51300,"51300","CHANGY",46]
[51300,"51300","CHATELRAOULD ST LOUVENT",46]
[51300,"51300","CLOYES SUR MARNE",46]
[51300,"51300","COURDEMANGES",46]
[51300,"51300","COUVROT",46]
[51300,"51300","DOMPREMY",46]
[51300,"51300","DROUILLY",46]
[51300,"51300","ECRIENNES",46]
[51300,"51300","FAVRESSE",46]
[51300,"51300","FRIGNICOURT",46]
[51300,"51300","GLANNES",46]
[51300,"51300","HAUSSIGNEMONT",46]
[51300,"51300","HEILTZ LE HUTIER",46]
[51300,"51300","HUIRON",46]
[51300,"51300","LE BUISSON",46]
[51300,"51300","LES RIVIERES HENRUEL",46]
[51300,"51300","LISSE EN CHAMPAGNE",46]
[51300,"51300","LOISY SUR MARNE",46]
[51300,"51300","LUXEMONT ET VILLOTTE",46]
[51300,"51300","MAISONS EN CHAMPAGNE",46]
[51300,"51300","MAROLLES",46]
[51300,"51300","MATIGNICOURT GONCOURT",46]
[51300,"51300","MERLAUT",46]
[51300,"51300","NORROIS",46]
[51300,"51300","ORCONTE",46]
[51300,"51300","OUTREPONT",46]
[51300,"51300","PLICHANCOURT",46]
[51300,"51300","PONTHION",46]
[51300,"51300","PRINGY",46]
[51300,"51300","REIMS LA BRULEE",46]
[51300,"51300","SOULANGES",{"$f":"COUNTIF($B$2:$B$5669,B1346)","v":46}]
[51300,"51300","ST AMAND SUR FION",46]
[51300,"51300","ST LUMIER EN CHAMPAGNE",46]
[51300,"51300","ST QUENTIN LES MARAIS",46]
[51300,"51300","THIEBLEMONT FAREMONT",46]
[51300,"51300","VAUCLERC",46]
[51300,"51300","VAVRAY LE GRAND",46]
[51300,"51300","VAVRAY LE PETIT",46]
[51300,"51300","VITRY EN PERTHOIS",46]
[51300,"51300","VITRY LE FRANCOIS",46]
[51310,"51310","BOUCHY ST GENEST",13]
[51310,"51310","CHAMPGUYON",13]
[51310,"51310","CHATILLON SUR MORIN",13]
[51310,"51310","COURGIVAUX",13]
[51310,"51310","ESCARDES",13]
[51310,"51310","ESTERNAY",13]
[51310,"51310","JOISELLE",13]
[51310,"51310","LA NOUE",13]
[51310,"51310","LES ESSARTS LE VICOMTE",13]
[51310,"51310","NEUVY",13]
[51310,"51310","REVEILLON",13]
[51310,"51310","ST BON",13]
[51310,"51310","VILLENEUVE LA LIONNE",13]
[51320,"51320","BREBAN",18]
[51320,"51320","BUSSY LETTREE",18]
[51320,"51320","COOLE",18]
[51320,"51320","CORBEIL",18]
[51320,"51320","DOMMARTIN LETTREE",18]
[51320,"51320","FAUX VESIGNEUL",18]
[51320,"51320","FONTAINE SUR COOLE",18]
[51320,"51320","HAUSSIMONT",18]
[51320,"51320","HUMBAUVILLE",18]
[51320,"51320","LE MEIX TIERCELIN",18]
[51320,"51320","MONTEPREUX",18]
[51320,"51320","SOMMESOUS",18]
[51320,"51320","SOMPUIS",18]
[51320,"51320","SOUDE",18]
[51320,"51320","SOUDRON",18]
[51320,"51320","ST OUEN DOMPROT",18]
[51320,"51320","VASSIMONT ET CHAPELAINE",18]
[51320,"51320","VATRY",18]
[51330,"51330","BELVAL EN ARGONNE",20]
[51330,"51330","BUSSY LE REPOS",20]
[51330,"51330","CHARMONT",20]
[51330,"51330","CONTAULT",20]
[51330,"51330","DAMPIERRE LE CHATEAU",20]
[51330,"51330","DOMMARTIN VARIMONT",20]
[51330,"51330","EPENSE",20]
[51330,"51330","GIVRY EN ARGONNE",20]
[51330,"51330","LA NEUVILLE AUX BOIS",20]
[51330,"51330","LE CHATELIER",20]
[51330,"51330","LE VIEIL DAMPIERRE",20]
[51330,"51330","LES CHARMONTOIS",20]
[51330,"51330","NOIRLIEU",20]
[51330,"51330","POSSESSE",20]
[51330,"51330","RAPSECOURT",20]
[51330,"51330","REMICOURT",20]
[51330,"51330","SOMME YEVRE",20]
[51330,"51330","ST JEAN DEVANT POSSESSE",20]
[51330,"51330","ST MARD SUR LE MONT",20]
[51330,"51330","VERNANCOURT",20]
[51340,"51340","BIGNICOURT SUR SAULX",13]
[51340,"51340","BLESME",13]
[51340,"51340","ETREPY",13]
[51340,"51340","HEILTZ L'EVEQUE",{"$f":"COUNTIF($B$2:$B$5669,B1410)","v":13}]
[51340,"51340","HEILTZ LE MAURUPT",13]
[51340,"51340","JUSSECOURT MINECOURT",13]
[51340,"51340","MAURUPT LE MONTOIS",13]
[51340,"51340","PARGNY SUR SAULX",13]
[51340,"51340","SCRUPT",13]
[51340,"51340","ST LUMIER LA POPULEUSE",13]
[51340,"51340","ST VRAIN",13]
[51340,"51340","TROIS FONTAINES L'ABBAYE",13]
[51340,"51340","VOUILLERS",13]
[51350,"51350","CORMONTREUIL",1]
[51360,"51360","BEAUMONT SUR VESLE",4]
[51360,"51360","PRUNAY",4]
[51360,"51360","VAL DE VESLE",4]
[51360,"51360","VERZENAY",4]
[51370,"51370","CHAMPIGNY",5]
[51370,"51370","LES MESNEUX",5]
[51370,"51370","ORMES",5]
[51370,"51370","ST BRICE COURCELLES",5]
[51370,"51370","THILLOIS",5]
[51380,"51380","TREPAIL",4]
[51380,"51380","VAUDEMANGES",4]
[51380,"51380","VERZY",4]
[51380,"51380","VILLERS MARMERY",4]
[51390,"51390","BOUILLY",13]
[51390,"51390","COULOMMES LA MONTAGNE",13]
[51390,"51390","COURMAS",13]
[51390,"51390","GERMIGNY",13]
[51390,"51390","GUEUX",13]
[51390,"51390","JANVRY",13]
[51390,"51390","JOUY LES REIMS",13]
[51390,"51390","MERY PREMECY",13]
[51390,"51390","PARGNY LES REIMS",13]
[51390,"51390","ROSNAY",13]
[51390,"51390","ST EUPHRAISE ET CLAIRIZET",13]
[51390,"51390","VILLE DOMMANGE",13]
[51390,"51390","VRIGNY",13]
[51400,"51400","BACONNES",14]
[51400,"51400","BILLY LE GRAND",14]
[51400,"51400","BOUY",14]
[51400,"51400","CUPERLY",14]
[51400,"51400","DAMPIERRE AU TEMPLE",14]
[51400,"51400","LES GRANDES LOGES",14]
[51400,"51400","LES PETITES LOGES",14]
[51400,"51400","LIVRY LOUVERCY",14]
[51400,"51400","MOURMELON LE GRAND",14]
[51400,"51400","MOURMELON LE PETIT",14]
[51400,"51400","PROSNES",14]
[51400,"51400","SEPT SAULX",14]
[51400,"51400","ST HILAIRE AU TEMPLE",14]
[51400,"51400","VADENAY",14]
[51420,"51420","BERRU",4]
[51420,"51420","CERNAY LES REIMS",4]
[51420,"51420","NOGENT L'ABBESSE",4]
[51420,"51420","WITRY LES REIMS",4]
[51430,"51430","TINQUEUX",1]
[51450,"51450","BETHENY",1]
[51460,"51460","COURTISOLS",6]
[51460,"51460","HERPONT",6]
[51460,"51460","L'EPINE",6]
[51460,"51460","POIX",6]
[51460,"51460","SOMME VESLE",6]
[51460,"51460","TILLOY ET BELLAY",6]
[51470,"51470","MONCETZ LONGEVAS",1]
[51480,"51480","CHAMPLAT",{"$f":"COUNTIF($B$2:$B$5669,B1474)","v":12}]
[51480,"51480","CORMOYEUX",12]
[51480,"51480","COURTAGNON",12]
[51480,"51480","CUCHERY",12]
[51480,"51480","CUMIERES",12]
[51480,"51480","DAMERY",12]
[51480,"51480","LA NEUVILLE AUX LARRIS",12]
[51480,"51480","NANTEUIL LA FORET",12]
[51480,"51480","POURCY",12]
[51480,"51480","REUIL",12]
[51480,"51480","ROMERY",12]
[51480,"51480","VENTEUIL",12]
[51490,"51490","BEINE NAUROY",9]
[51490,"51490","BETHENIVILLE",9]
[51490,"51490","DONTRIEN",9]
[51490,"51490","EPOYE",9]
[51490,"51490","PONTFAVERGER MORONVILLIERS",9]
[51490,"51490","SELLES",9]
[51490,"51490","ST HILAIRE LE PETIT",9]
[51490,"51490","ST MARTIN L'HEUREUX",9]
[51490,"51490","ST MASMES",9]
[51500,"51500","BEZANNES",19]
[51500,"51500","CHAMERY",19]
[51500,"51500","CHAMPFLEURY",19]
[51500,"51500","CHIGNY LES ROSES",19]
[51500,"51500","ECUEIL",19]
[51500,"51500","LUDES",19]
[51500,"51500","MAILLY CHAMPAGNE",19]
[51500,"51500","MONTBRE",19]
[51500,"51500","PUISIEULX",19]
[51500,"51500","RILLY LA MONTAGNE",19]
[51500,"51500","SACY",19]
[51500,"51500","SERMIERS",19]
[51500,"51500","SILLERY",19]
[51500,"51500","ST LEONARD",19]
[51500,"51500","TAISSY",19]
[51500,"51500","TROIS PUITS",19]
[51500,"51500","VILLE EN SELVE",19]
[51500,"51500","VILLERS ALLERAND",19]
[51500,"51500","VILLERS AUX NOEUDS",19]
[51600,"51600","AUBERIVE",17]
[51600,"51600","BUSSY LE CHATEAU",17]
[51600,"51600","JONCHERY SUR SUIPPE",17]
[51600,"51600","LA CHEPPE",17]
[51600,"51600","LA CROIX EN CHAMPAGNE",17]
[51600,"51600","LAVAL SUR TOURBE",17]
[51600,"51600","SOMME SUIPPE",17]
[51600,"51600","SOMME TOURBE",17]
[51600,"51600","SOMMEPY TAHURE",17]
[51600,"51600","SOUAIN PERTHES LES HURLUS",17]
[51600,"51600","ST HILAIRE LE GRAND",17]
[51600,"51600","ST JEAN SUR TOURBE",17]
[51600,"51600","ST REMY SUR BUSSY",17]
[51600,"51600","ST SOUPLET SUR PY",17]
[51600,"51600","STE MARIE A PY",17]
[51600,"51600","SUIPPES",17]
[51600,"51600","VAUDESINCOURT",17]
[51700,"51700","ANTHENAY",22]
[51700,"51700","BASLIEUX SOUS CHATILLON",22]
[51700,"51700","BINSON ET ORQUIGNY",22]
[51700,"51700","CHAMPVOISY",22]
[51700,"51700","CHATILLON SUR MARNE",22]
[51700,"51700","COURTHIEZY",22]
[51700,"51700","CUISLES",22]
[51700,"51700","DORMANS",{"$f":"COUNTIF($B$2:$B$5669,B1538)","v":22}]
[51700,"51700","IGNY COMBLIZY",22]
[51700,"51700","JONQUERY",22]
[51700,"51700","MAREUIL LE PORT",22]
[51700,"51700","NESLE LE REPONS",22]
[51700,"51700","OLIZY",22]
[51700,"51700","PASSY GRIGNY",22]
[51700,"51700","PORT A BINSON",22]
[51700,"51700","SOILLY",22]
[51700,"51700","STE GEMME",22]
[51700,"51700","TROISSY",22]
[51700,"51700","VANDIERES",22]
[51700,"51700","VERNEUIL",22]
[51700,"51700","VILLERS SOUS CHATILLON",22]
[51700,"51700","VINCELLES",22]
[51800,"51800","ARGERS",44]
[51800,"51800","AUVE",44]
[51800,"51800","BERZIEUX",44]
[51800,"51800","BINARVILLE",44]
[51800,"51800","BRAUX ST REMY",44]
[51800,"51800","BRAUX STE COHIERE",44]
[51800,"51800","CERNAY EN DORMOIS",44]
[51800,"51800","CHATRICES",44]
[51800,"51800","CHAUDEFONTAINE",44]
[51800,"51800","COURTEMONT",44]
[51800,"51800","DOMMARTIN DAMPIERRE",44]
[51800,"51800","DOMMARTIN SOUS HANS",44]
[51800,"51800","ECLAIRES",44]
[51800,"51800","ELISE DAUCOURT",44]
[51800,"51800","FLORENT EN ARGONNE",44]
[51800,"51800","FONTAINE EN DORMOIS",44]
[51800,"51800","GIZAUCOURT",44]
[51800,"51800","GRATREUIL",44]
[51800,"51800","HANS",44]
[51800,"51800","LA CHAPELLE FELCOURT",44]
[51800,"51800","LA NEUVILLE AU PONT",44]
[51800,"51800","LE CHEMIN",44]
[51800,"51800","MAFFRECOURT",44]
[51800,"51800","MALMY",44]
[51800,"51800","MASSIGES",44]
[51800,"51800","MINAUCOURT LE MESNIL LES HURL",44]
[51800,"51800","MOIREMONT",44]
[51800,"51800","PASSAVANT EN ARGONNE",44]
[51800,"51800","ROUVROY RIPONT",44]
[51800,"51800","SERVON MELZICOURT",44]
[51800,"51800","SIVRY ANTE",44]
[51800,"51800","SOMME BIONNE",44]
[51800,"51800","ST MARD SUR AUVE",44]
[51800,"51800","ST THOMAS EN ARGONNE",44]
[51800,"51800","STE MENEHOULD",44]
[51800,"51800","VALMY",44]
[51800,"51800","VERRIERES",44]
[51800,"51800","VIENNE LA VILLE",44]
[51800,"51800","VIENNE LE CHATEAU",44]
[51800,"51800","VILLE SUR TOURBE",44]
[51800,"51800","VILLERS EN ARGONNE",44]
[51800,"51800","VIRGINY",44]
[51800,"51800","VOILEMONT",44]
[51800,"51800","WARGEMOULIN HURLUS",44]
[52000,"52000","BRETHENAY",22]
[52000,"52000","BROTTES",22]
[52000,"52000","BUXIERES LES VILLIERS",22]
[52000,"52000","CHAMARANDES",22]
[52000,"52000","CHAMARANDES CHOIGNES",22]
[52000,"52000","CHAUMONT",{"$f":"COUNTIF($B$2:$B$5669,B1602)","v":22}]
[52000,"52000","CHOIGNES",22]
[52000,"52000","CONDES",22]
[52000,"52000","CRENAY",22]
[52000,"52000","EUFFIGNEIX",22]
[52000,"52000","JONCHERY",22]
[52000,"52000","LAHARMAND",22]
[52000,"52000","LAVILLE AUX BOIS",22]
[52000,"52000","LUZY SUR MARNE",22]
[52000,"52000","MONTSAON",22]
[52000,"52000","NEUILLY SUR SUIZE",22]
[52000,"52000","RIAUCOURT",22]
[52000,"52000","SARCICOURT",22]
[52000,"52000","SEMOUTIERS MONTSAON",22]
[52000,"52000","TREIX",22]
[52000,"52000","VERBIESLES",22]
[52000,"52000","VILLIERS LE SEC",22]
[52100,"52100","BETTANCOURT LA FERREE",11]
[52100,"52100","CHANCENAY",11]
[52100,"52100","HALLIGNICOURT",11]
[52100,"52100","LANEUVILLE AU PONT",11]
[52100,"52100","MOESLAINS",11]
[52100,"52100","PERTHES",11]
[52100,"52100","SAPIGNICOURT",11]
[52100,"52100","ST DIZIER",11]
[52100,"52100","ST EULIEN",11]
[52100,"52100","VALCOURT",11]
[52100,"52100","VILLIERS EN LIEU",11]
[52110,"52110","AMBONVILLE",23]
[52110,"52110","ARNANCOURT",23]
[52110,"52110","BAUDRECOURT",23]
[52110,"52110","BEURVILLE",23]
[52110,"52110","BLAISERIVES",23]
[52110,"52110","BLUMERAY",23]
[52110,"52110","BOUZANCOURT",23]
[52110,"52110","BRACHAY",23]
[52110,"52110","CHARMES EN L'ANGLE",23]
[52110,"52110","CHARMES LA GRANDE",23]
[52110,"52110","CIREY SUR BLAISE",23]
[52110,"52110","COURCELLES SUR BLAISE",23]
[52110,"52110","DAILLANCOURT",23]
[52110,"52110","DOMMARTIN LE FRANC",23]
[52110,"52110","DOMMARTIN LE ST PERE",23]
[52110,"52110","DOULEVANT LE CHATEAU",23]
[52110,"52110","FLAMMERECOURT",23]
[52110,"52110","LESCHERES SUR LE BLAISERON",23]
[52110,"52110","MERTRUD",23]
[52110,"52110","MORANCOURT",23]
[52110,"52110","NULLY TREMILLY",23]
[52110,"52110","TREMILLY",23]
[52110,"52110","VILLIERS AUX CHENES",23]
[52120,"52120","AIZANVILLE",20]
[52120,"52120","AUTREVILLE SUR LA RENNE",20]
[52120,"52120","BLESSONVILLE",20]
[52120,"52120","BRAUX LE CHATEL",20]
[52120,"52120","BRICON",20]
[52120,"52120","CHATEAUVILLAIN",20]
[52120,"52120","CREANCEY",20]
[52120,"52120","DINTEVILLE",20]
[52120,"52120","ESSEY LES PONTS",20]
[52120,"52120","LAFERTE SUR AUBE",20]
[52120,"52120","LANTY SUR AUBE",20]
[52120,"52120","LATRECEY ORMOY SUR AUBE",20]
[52120,"52120","MARMESSE",20]
[52120,"52120","ORGES",{"$f":"COUNTIF($B$2:$B$5669,B1666)","v":20}]
[52120,"52120","ORMOY SUR AUBE",20]
[52120,"52120","PONT LA VILLE",20]
[52120,"52120","RICHEBOURG",20]
[52120,"52120","SILVAROUVRES",20]
[52120,"52120","VALDELANCOURT",20]
[52120,"52120","VILLARS EN AZOIS",20]
[52130,"52130","ALLICHAMPS",21]
[52130,"52130","ATTANCOURT",21]
[52130,"52130","AVRAINVILLE",21]
[52130,"52130","BAILLY AUX FORGES",21]
[52130,"52130","BROUSSEVAL",21]
[52130,"52130","DOMBLAIN",21]
[52130,"52130","DOULEVANT LE PETIT",21]
[52130,"52130","FAYS",21]
[52130,"52130","FLORNOY",21]
[52130,"52130","LOUVEMONT",21]
[52130,"52130","MAGNEUX",21]
[52130,"52130","MONTREUIL SUR BLAISE",21]
[52130,"52130","RACHECOURT SUZEMONT",21]
[52130,"52130","SOMMANCOURT",21]
[52130,"52130","TROISFONTAINES LA VILLE",21]
[52130,"52130","VALLERET",21]
[52130,"52130","VAUX SUR BLAISE",21]
[52130,"52130","VILLE EN BLAISOIS",21]
[52130,"52130","VILLIERS AUX BOIS",21]
[52130,"52130","VOILLECOMTE",21]
[52130,"52130","WASSY",21]
[52140,"52140","AVRECOURT",18]
[52140,"52140","CHAUFFOURT",18]
[52140,"52140","DAMMARTIN SUR MEUSE",18]
[52140,"52140","EPINANT",18]
[52140,"52140","IS EN BASSIGNY",18]
[52140,"52140","LAVERNOY",18]
[52140,"52140","LAVILLENEUVE",18]
[52140,"52140","LECOURT",18]
[52140,"52140","MAULAIN",18]
[52140,"52140","MONTIGNY LE ROI",18]
[52140,"52140","PROVENCHERES SUR MEUSE",18]
[52140,"52140","RANCONNIERES",18]
[52140,"52140","RANGECOURT",18]
[52140,"52140","RAVENNEFONTAINES",18]
[52140,"52140","RECOURT",18]
[52140,"52140","SARREY",18]
[52140,"52140","SAULXURES",18]
[52140,"52140","VAL DE MEUSE",18]
[52150,"52150","BOURG STE MARIE",23]
[52150,"52150","BOURMONT",23]
[52150,"52150","BRAINVILLE SUR MEUSE",23]
[52150,"52150","CHAMPIGNEULLES EN BASSIGNY",23]
[52150,"52150","CHAUMONT LA VILLE",23]
[52150,"52150","DONCOURT SUR MEUSE",23]
[52150,"52150","GERMAINVILLIERS",23]
[52150,"52150","GONAINCOURT",23]
[52150,"52150","GONCOURT",23]
[52150,"52150","GRAFFIGNY CHEMIN",23]
[52150,"52150","HACOURT",23]
[52150,"52150","HARREVILLE LES CHANTEURS",23]
[52150,"52150","HUILLIECOURT",23]
[52150,"52150","ILLOUD",23]
[52150,"52150","LEVECOURT",23]
[52150,"52150","MALAINCOURT SUR MEUSE",23]
[52150,"52150","NIJON",23]
[52150,"52150","OUTREMECOURT",23]
[52150,"52150","ROMAIN SUR MEUSE",{"$f":"COUNTIF($B$2:$B$5669,B1730)","v":23}]
[52150,"52150","SOMMERECOURT",23]
[52150,"52150","SOULAUCOURT SUR MOUZON",23]
[52150,"52150","ST THIEBAULT",23]
[52150,"52150","VAUDRECOURT",23]
[52160,"52160","ARBOT",28]
[52160,"52160","AUBERIVE",28]
[52160,"52160","AULNOY SUR AUBE",28]
[52160,"52160","BAY SUR AUBE",28]
[52160,"52160","CHALANCEY",28]
[52160,"52160","CHALMESSIN",28]
[52160,"52160","COLMIER LE BAS",28]
[52160,"52160","COLMIER LE HAUT",28]
[52160,"52160","GERMAINES",28]
[52160,"52160","LAMARGELLE AUX BOIS",28]
[52160,"52160","MOUILLERON",28]
[52160,"52160","MUSSEAU",28]
[52160,"52160","PERROGNEY LES FONTAINES",28]
[52160,"52160","PIERREFONTAINES",28]
[52160,"52160","POINSENOT",28]
[52160,"52160","POINSON LES GRANCEY",28]
[52160,"52160","PRASLAY",28]
[52160,"52160","ROUELLES",28]
[52160,"52160","ROUVRES SUR AUBE",28]
[52160,"52160","SANTENOGE",28]
[52160,"52160","VAILLANT",28]
[52160,"52160","VALS DES TILLES",28]
[52160,"52160","VILLARS MONTROYER",28]
[52160,"52160","VILLARS SANTENOGE",28]
[52160,"52160","VILLEMERVRY",28]
[52160,"52160","VILLEMORON",28]
[52160,"52160","VITRY EN MONTAGNE",28]
[52160,"52160","VIVEY",28]
[52170,"52170","BAYARD SUR MARNE",10]
[52170,"52170","BREUIL SUR MARNE",10]
[52170,"52170","CHEVILLON",10]
[52170,"52170","FONTAINES SUR MARNE",10]
[52170,"52170","GOURZON",10]
[52170,"52170","LANEUVILLE A BAYARD",10]
[52170,"52170","NARCY",10]
[52170,"52170","PREZ SUR MARNE",10]
[52170,"52170","RACHECOURT SUR MARNE",10]
[52170,"52170","SOMMEVILLE",10]
[52190,"52190","AUJEURRES",26]
[52190,"52190","CHASSIGNY AISEY",26]
[52190,"52190","CHATOILLENOT",26]
[52190,"52190","CHOILLEY DARDENAY",26]
[52190,"52190","COURCELLES VAL D'ESNOMS",26]
[52190,"52190","CUSEY",26]
[52190,"52190","DARDENAY",26]
[52190,"52190","DOMMARIEN",26]
[52190,"52190","ESNOMS AU VAL",26]
[52190,"52190","ISOMES",26]
[52190,"52190","LE VAL D'ESNOMS",26]
[52190,"52190","LEUCHEY",26]
[52190,"52190","MONTSAUGEON",26]
[52190,"52190","OCCEY",26]
[52190,"52190","PERCEY SOUS MONTORMENTIER",26]
[52190,"52190","PIEPAPE",26]
[52190,"52190","PRANGEY",26]
[52190,"52190","PRAUTHOY",26]
[52190,"52190","RIVIERE LES FOSSES",26]
[52190,"52190","ST BROINGT LE BOIS",26]
[52190,"52190","ST BROINGT LES FOSSES",26]
[52190,"52190","ST MICHEL",{"$f":"COUNTIF($B$2:$B$5669,B1794)","v":26}]
[52190,"52190","VAUX SOUS AUBIGNY",26]
[52190,"52190","VESVRES SOUS CHALANCEY",26]
[52190,"52190","VILLEGUSIEN LE LAC",26]
[52190,"52190","VILLIERS LES APREY",26]
[52200,"52200","BALESMES SUR MARNE",23]
[52200,"52200","BOURG",23]
[52200,"52200","BRENNES",23]
[52200,"52200","CHAMPIGNY LES LANGRES",23]
[52200,"52200","CHATENAY MACHERON",23]
[52200,"52200","CORLEE",23]
[52200,"52200","COURCELLES EN MONTAGNE",23]
[52200,"52200","HUMES JORQUENAY",23]
[52200,"52200","JORQUENAY",23]
[52200,"52200","LANGRES",23]
[52200,"52200","MARDOR",23]
[52200,"52200","NOIDANT LE ROCHEUX",23]
[52200,"52200","ORMANCEY",23]
[52200,"52200","PEIGNEY",23]
[52200,"52200","PERRANCEY LES VIEUX MOULINS",23]
[52200,"52200","ST CIERGUES",23]
[52200,"52200","ST GEOSMES",23]
[52200,"52200","ST MARTIN LES LANGRES",23]
[52200,"52200","ST MAURICE",23]
[52200,"52200","ST VALLIER SUR MARNE",23]
[52200,"52200","VAUXBONS",23]
[52200,"52200","VIEUX MOULINS",23]
[52200,"52200","VOISINES",23]
[52210,"52210","ARC EN BARROIS",15]
[52210,"52210","AUBEPIERRE SUR AUBE",15]
[52210,"52210","BUGNIERES",15]
[52210,"52210","CHAMEROY",15]
[52210,"52210","COUPRAY",15]
[52210,"52210","COUR L'EVEQUE",15]
[52210,"52210","COURCELLES SUR AUJON",15]
[52210,"52210","DANCEVOIR",15]
[52210,"52210","ERISEUL",15]
[52210,"52210","GIEY SUR AUJON",15]
[52210,"52210","LEFFONDS",15]
[52210,"52210","ROCHETAILLEE",15]
[52210,"52210","ST LOUP SUR AUJON",15]
[52210,"52210","TERNAT",15]
[52210,"52210","VILLIERS SUR SUIZE",15]
[52220,"52220","ANGLUS",15]
[52220,"52220","CEFFONDS",15]
[52220,"52220","DROYES",15]
[52220,"52220","FRAMPAS",15]
[52220,"52220","LANEUVILLE A REMY",15]
[52220,"52220","LONGEVILLE SUR LA LAINES",15]
[52220,"52220","LOUZE",15]
[52220,"52220","MONTIER EN DER",15]
[52220,"52220","PLANRUPT",15]
[52220,"52220","PUELLEMONTIER",15]
[52220,"52220","ROBERT MAGNY LANEUVILLE A REM",15]
[52220,"52220","ROZIERES",15]
[52220,"52220","SAUVAGE MAGNY",15]
[52220,"52220","SOMMEVOIRE",15]
[52220,"52220","THILLEUX",15]
[52230,"52230","AINGOULAINCOURT",22]
[52230,"52230","ANNONVILLE",22]
[52230,"52230","BETTONCOURT LE HAUT",22]
[52230,"52230","BRESSONCOURT",22]
[52230,"52230","BROUTHIERES",22]
[52230,"52230","CIRFONTAINES EN ORNOIS",22]
[52230,"52230","ECHENAY",{"$f":"COUNTIF($B$2:$B$5669,B1858)","v":22}]
[52230,"52230","EPIZON",22]
[52230,"52230","GERMAY",22]
[52230,"52230","GERMISAY",22]
[52230,"52230","GILLAUME",22]
[52230,"52230","HARMEVILLE",22]
[52230,"52230","LANEUVILLE AU BOIS",22]
[52230,"52230","LEZEVILLE",22]
[52230,"52230","MONTREUIL SUR THONNANCE",22]
[52230,"52230","NONCOURT SUR LE RONGEANT",22]
[52230,"52230","PANCEY",22]
[52230,"52230","POISSONS",22]
[52230,"52230","SAILLY",22]
[52230,"52230","SAUDRON",22]
[52230,"52230","SOULAINCOURT",22]
[52230,"52230","THONNANCE LES MOULINS",22]
[52240,"52240","AUDELONCOURT",20]
[52240,"52240","BASSONCOURT",20]
[52240,"52240","BREUVANNES EN BASSIGNY",20]
[52240,"52240","BUXIERES LES CLEFMONT",20]
[52240,"52240","CHOISEUL",20]
[52240,"52240","CLEFMONT",20]
[52240,"52240","COLOMBEY LES CHOISEUL",20]
[52240,"52240","CUVES",20]
[52240,"52240","DAILLECOURT",20]
[52240,"52240","LENIZEUL",20]
[52240,"52240","LONGCHAMP",20]
[52240,"52240","MAISONCELLES",20]
[52240,"52240","MENNOUVEAUX",20]
[52240,"52240","MERREY",20]
[52240,"52240","MEUVY",20]
[52240,"52240","MILLIERES",20]
[52240,"52240","NOYERS",20]
[52240,"52240","PERRUSSE",20]
[52240,"52240","THOL LES MILLIERES",20]
[52240,"52240","VRONCOURT LA COTE",20]
[52250,"52250","APREY",9]
[52250,"52250","BAISSEY",9]
[52250,"52250","FLAGEY",9]
[52250,"52250","LONGEAU",9]
[52250,"52250","LONGEAU PERCEY",9]
[52250,"52250","ORCEVAUX",9]
[52250,"52250","PERCEY LE PAUTEL",9]
[52250,"52250","VERSEILLES LE BAS",9]
[52250,"52250","VERSEILLES LE HAUT",9]
[52260,"52260","BEAUCHEMIN",8]
[52260,"52260","CHANOY",8]
[52260,"52260","CHARMOILLES",8]
[52260,"52260","FAVEROLLES",8]
[52260,"52260","LANNES",8]
[52260,"52260","MARAC",8]
[52260,"52260","ROLAMPONT",8]
[52260,"52260","TRONCHOY",8]
[52270,"52270","AUGEVILLE",9]
[52270,"52270","BETTAINCOURT SUR ROGNON",9]
[52270,"52270","DOMREMY LANDEVILLE",9]
[52270,"52270","DOULAINCOURT SAUCOURT",9]
[52270,"52270","LANDEVILLE",9]
[52270,"52270","PAUTAINES AUGEVILLE",9]
[52270,"52270","ROCHES BETTAINCOURT",9]
[52270,"52270","ROCHES SUR ROGNON",9]
[52270,"52270","SAUCOURT SUR ROGNON",9]
[52290,"52290","BRAUCOURT",4]
[52290,"52290","ECLARON BRAUCOURT STE LIVIERE",4]
[52290,"52290","HUMBECOURT",{"$f":"COUNTIF($B$2:$B$5669,B1922)","v":4}]
[52290,"52290","STE LIVIERE",4]
[52300,"52300","AUTIGNY LE GRAND",26]
[52300,"52300","AUTIGNY LE PETIT",26]
[52300,"52300","BLECOURT",26]
[52300,"52300","CHATONRUPT SOMMERMONT",26]
[52300,"52300","CUREL",26]
[52300,"52300","DONJEUX",26]
[52300,"52300","EFFINCOURT",26]
[52300,"52300","FERRIERE ET LAFOLIE",26]
[52300,"52300","FRONVILLE",26]
[52300,"52300","GUINDRECOURT AUX ORMES",26]
[52300,"52300","JOINVILLE",26]
[52300,"52300","MACONCOURT",26]
[52300,"52300","MAIZIERES",26]
[52300,"52300","MATHONS",26]
[52300,"52300","MUSSEY SUR MARNE",26]
[52300,"52300","NOMECOURT",26]
[52300,"52300","OSNE LE VAL",26]
[52300,"52300","PAROY SUR SAULX",26]
[52300,"52300","ROUVROY SUR MARNE",26]
[52300,"52300","RUPT",26]
[52300,"52300","SOMMERMONT",26]
[52300,"52300","ST URBAIN MACONCOURT",26]
[52300,"52300","SUZANNECOURT",26]
[52300,"52300","THONNANCE LES JOINVILLE",26]
[52300,"52300","VAUX SUR ST URBAIN",26]
[52300,"52300","VECQUEVILLE",26]
[52310,"52310","ANNEVILLE LA PRAIRIE",10]
[52310,"52310","BOLOGNE",10]
[52310,"52310","LAMANCINE",10]
[52310,"52310","MARAULT",10]
[52310,"52310","MEURES",10]
[52310,"52310","ORMOY LES SEXFONTAINES",10]
[52310,"52310","OUDINCOURT",10]
[52310,"52310","ROOCOURT LA COTE",10]
[52310,"52310","VIEVILLE",10]
[52310,"52310","VRAINCOURT",10]
[52320,"52320","BUXIERES LES FRONCLES",13]
[52320,"52320","CERISIERES",13]
[52320,"52320","FRONCLES",13]
[52320,"52320","GUDMONT VILLIERS",13]
[52320,"52320","LA GENEVROYE",13]
[52320,"52320","MARBEVILLE",13]
[52320,"52320","MIRBEL",13]
[52320,"52320","PROVENCHERES SUR MARNE",13]
[52320,"52320","ROUECOURT",13]
[52320,"52320","SONCOURT SUR MARNE",13]
[52320,"52320","VIGNORY",13]
[52320,"52320","VILLIERS SUR MARNE",13]
[52320,"52320","VOUECOURT",13]
[52330,"52330","ARGENTOLLES",22]
[52330,"52330","BIERNES",22]
[52330,"52330","BLAISE",22]
[52330,"52330","BLAISY",22]
[52330,"52330","BUCHEY",22]
[52330,"52330","CHAMPCOURT",22]
[52330,"52330","COLOMBEY LES DEUX EGLISES",22]
[52330,"52330","CURMONT",22]
[52330,"52330","GILLANCOURT",22]
[52330,"52330","GUINDRECOURT SUR BLAISE",22]
[52330,"52330","HARRICOURT",22]
[52330,"52330","JUZENNECOURT",22]
[52330,"52330","LACHAPELLE EN BLAISY",22]
[52330,"52330","LAMOTHE EN BLAISY",{"$f":"COUNTIF($B$2:$B$5669,B1986)","v":22}]
[52330,"52330","LAVILLENEUVE AU ROI",22]
[52330,"52330","LAVILLENEUVE AUX FRESNES",22]
[52330,"52330","MONTHERIES",22]
[52330,"52330","PRATZ",22]
[52330,"52330","RIZAUCOURT BUCHEY",22]
[52330,"52330","SEXFONTAINES",22]
[52330,"52330","ST MARTIN SUR LA RENNE",22]
[52330,"52330","VAUDREMONT",22]
[52340,"52340","AGEVILLE",4]
[52340,"52340","BIESLES",4]
[52340,"52340","ESNOUVEAUX",4]
[52340,"52340","LE PUITS DES MEZES",4]
[52360,"52360","ANDILLY EN BASSIGNY",16]
[52360,"52360","BANNES",16]
[52360,"52360","BONNECOURT",16]
[52360,"52360","CELLES EN BASSIGNY",16]
[52360,"52360","CHANGEY",16]
[52360,"52360","CHARMES",16]
[52360,"52360","CHATENAY VAUDIN",16]
[52360,"52360","DAMPIERRE",16]
[52360,"52360","FRECOURT",16]
[52360,"52360","LECEY",16]
[52360,"52360","MARCILLY EN BASSIGNY",16]
[52360,"52360","NEUILLY L'EVEQUE",16]
[52360,"52360","ORBIGNY AU MONT",16]
[52360,"52360","ORBIGNY AU VAL",16]
[52360,"52360","PLESNOY",16]
[52360,"52360","POISEUL",16]
[52370,"52370","CIRFONTAINES EN AZOIS",3]
[52370,"52370","MARANVILLE",3]
[52370,"52370","RENNEPONT",3]
[52400,"52400","AIGREMONT",31]
[52400,"52400","ARNONCOURT SUR APANCE",31]
[52400,"52400","BEAUCHARMOY",31]
[52400,"52400","BOURBONNE LES BAINS",31]
[52400,"52400","CHAMPIGNY SOUS VARENNES",31]
[52400,"52400","CHEZEAUX",31]
[52400,"52400","COIFFY LE BAS",31]
[52400,"52400","COIFFY LE HAUT",31]
[52400,"52400","DAMREMONT",31]
[52400,"52400","ENFONVELLE",31]
[52400,"52400","FRESNES SUR APANCE",31]
[52400,"52400","FRESNOY EN BASSIGNY",31]
[52400,"52400","GENRUPT",31]
[52400,"52400","GUYONVELLE",31]
[52400,"52400","LANEUVELLE",31]
[52400,"52400","LARIVIERE ARNONCOURT",31]
[52400,"52400","LE CHATELET SUR MEUSE",31]
[52400,"52400","MELAY",31]
[52400,"52400","MONTCHARVOT",31]
[52400,"52400","NEUVELLE LES VOISEY",31]
[52400,"52400","PARNOT",31]
[52400,"52400","PARNOY EN BASSIGNY",31]
[52400,"52400","POUILLY EN BASSIGNY",31]
[52400,"52400","SERQUEUX",31]
[52400,"52400","SOYERS",31]
[52400,"52400","TERRE NATALE",31]
[52400,"52400","VARENNES SUR AMANCE",31]
[52400,"52400","VAUX LA DOUCE",31]
[52400,"52400","VICQ",31]
[52400,"52400","VILLARS ST MARCELLIN",31]
[52400,"52400","VOISEY",31]
[52410,"52410","BIENVILLE",4]
[52410,"52410","CHAMOUILLEY",{"$f":"COUNTIF($B$2:$B$5669,B2050)","v":4}]
[52410,"52410","EURVILLE BIENVILLE",4]
[52410,"52410","ROCHES SUR MARNE",4]
[52500,"52500","ANROSEY",33]
[52500,"52500","ARBIGNY SOUS VARENNES",33]
[52500,"52500","BELMONT",33]
[52500,"52500","BIZE",33]
[52500,"52500","BRONCOURT",33]
[52500,"52500","BUSSIERES LES BELMONT",33]
[52500,"52500","CHAMPSEVRAINE",33]
[52500,"52500","CHARMOY",33]
[52500,"52500","CORGIRNON",33]
[52500,"52500","COUBLANC",33]
[52500,"52500","FARINCOURT",33]
[52500,"52500","FAYL BILLOT",33]
[52500,"52500","FAYL LA FORET",33]
[52500,"52500","GENEVRIERES",33]
[52500,"52500","GILLEY",33]
[52500,"52500","GRENANT",33]
[52500,"52500","LAFERTE SUR AMANCE",33]
[52500,"52500","LES LOGES",33]
[52500,"52500","MAATZ",33]
[52500,"52500","MAIZIERES SUR AMANCE",33]
[52500,"52500","MONTESSON",33]
[52500,"52500","PIERREFAITES",33]
[52500,"52500","PIERREMONT SUR AMANCE",33]
[52500,"52500","PISSELOUP",33]
[52500,"52500","POINSON LES FAYL",33]
[52500,"52500","PRESSIGNY",33]
[52500,"52500","ROUGEUX",33]
[52500,"52500","SAULLES",33]
[52500,"52500","SAVIGNY",33]
[52500,"52500","TORNAY",33]
[52500,"52500","VALLEROY",33]
[52500,"52500","VELLES",33]
[52500,"52500","VONCOURT",33]
[52600,"52600","CELSOY",20]
[52600,"52600","CHALINDREY",20]
[52600,"52600","CHAUDENAY",20]
[52600,"52600","COHONS",20]
[52600,"52600","CULMONT",20]
[52600,"52600","GRANDCHAMP",20]
[52600,"52600","HAUTE AMANCE",20]
[52600,"52600","HAUTS VALS SOUS NOUROY",20]
[52600,"52600","HEUILLEY COTTON",20]
[52600,"52600","HEUILLEY LE GRAND",20]
[52600,"52600","HORTES",20]
[52600,"52600","LE PAILLY",20]
[52600,"52600","MONTLANDON",20]
[52600,"52600","NOIDANT CHATENOY",20]
[52600,"52600","PALAISEUL",20]
[52600,"52600","RIVIERES LE BOIS",20]
[52600,"52600","ROSOY SUR AMANCE",20]
[52600,"52600","TORCENAY",20]
[52600,"52600","TROISCHAMPS",20]
[52600,"52600","VIOLOT",20]
[52700,"52700","AILLIANVILLE",34]
[52700,"52700","ANDELOT BLANCHEVILLE",34]
[52700,"52700","BLANCHEVILLE",34]
[52700,"52700","BOURDONS SUR ROGNON",34]
[52700,"52700","BRIAUCOURT",34]
[52700,"52700","BUSSON",34]
[52700,"52700","CHALVRAINES",34]
[52700,"52700","CHAMBRONCOURT",34]
[52700,"52700","CHANTRAINES",{"$f":"COUNTIF($B$2:$B$5669,B2114)","v":34}]
[52700,"52700","CIREY LES MAREILLES",34]
[52700,"52700","CLINCHAMP",34]
[52700,"52700","CONSIGNY",34]
[52700,"52700","DARMANNES",34]
[52700,"52700","ECOT LA COMBE",34]
[52700,"52700","FORCEY",34]
[52700,"52700","HUMBERVILLE",34]
[52700,"52700","LAFAUCHE",34]
[52700,"52700","LEURVILLE",34]
[52700,"52700","LIFFOL LE PETIT",34]
[52700,"52700","MANOIS",34]
[52700,"52700","MAREILLES",34]
[52700,"52700","MONTOT SUR ROGNON",34]
[52700,"52700","MORIONVILLIERS",34]
[52700,"52700","ORQUEVAUX",34]
[52700,"52700","OZIERES",34]
[52700,"52700","PREZ SOUS LAFAUCHE",34]
[52700,"52700","REYNEL",34]
[52700,"52700","RIMAUCOURT",34]
[52700,"52700","ROCHEFORT SUR LA COTE",34]
[52700,"52700","SEMILLY",34]
[52700,"52700","SIGNEVILLE",34]
[52700,"52700","ST BLIN SEMILLY",34]
[52700,"52700","VESAIGNES SOUS LAFAUCHE",34]
[52700,"52700","VIGNES LA COTE",34]
[52800,"52800","DONNEMARIE",16]
[52800,"52800","ESSEY LES EAUX",16]
[52800,"52800","FOULAIN",16]
[52800,"52800","LANQUES SUR ROGNON",16]
[52800,"52800","LOUVIERES",16]
[52800,"52800","MANDRES LA COTE",16]
[52800,"52800","MARNAY SUR MARNE",16]
[52800,"52800","NINVILLE",16]
[52800,"52800","NOGENT",16]
[52800,"52800","ODIVAL",16]
[52800,"52800","POINSON LES NOGENT",16]
[52800,"52800","POULANGY",16]
[52800,"52800","SARCEY",16]
[52800,"52800","THIVET",16]
[52800,"52800","VESAIGNES SUR MARNE",16]
[52800,"52800","VITRY LES NOGENT",16]
[54000,"54000","NANCY",1]
[54110,"54110","ANTHELUPT",14]
[54110,"54110","BUISSONCOURT",14]
[54110,"54110","COURBESSEAUX",14]
[54110,"54110","CREVIC",14]
[54110,"54110","DOMBASLE SUR MEURTHE",14]
[54110,"54110","FLAINVAL",14]
[54110,"54110","GELLENONCOURT",14]
[54110,"54110","HARAUCOURT",14]
[54110,"54110","HUDIVILLER",14]
[54110,"54110","LENONCOURT",14]
[54110,"54110","REMEREVILLE",14]
[54110,"54110","ROSIERES AUX SALINES",14]
[54110,"54110","SOMMERVILLER",14]
[54110,"54110","VARANGEVILLE",14]
[54111,"54111","MONT BONVILLERS",1]
[54112,"54112","ALLAMPS",4]
[54112,"54112","GIBEAUMEIX",4]
[54112,"54112","URUFFE",4]
[54112,"54112","VANNES LE CHATEL",4]
[54113,"54113","BLENOD LES TOUL",7]
[54113,"54113","BULLIGNY",7]
[54113,"54113","CHARMES LA COTE",{"$f":"COUNTIF($B$2:$B$5669,B2178)","v":7}]
[54113,"54113","CREZILLES",7]
[54113,"54113","GYE",7]
[54113,"54113","MONT LE VIGNOBLE",7]
[54113,"54113","MOUTROT",7]
[54114,"54114","JEANDELAINCOURT",1]
[54115,"54115","ABONCOURT",17]
[54115,"54115","BATTIGNY",17]
[54115,"54115","BEUVEZIN",17]
[54115,"54115","DOMMARIE EULMONT",17]
[54115,"54115","FAVIERES",17]
[54115,"54115","FECOCOURT",17]
[54115,"54115","GELAUCOURT",17]
[54115,"54115","GEMONVILLE",17]
[54115,"54115","GRIMONVILLER",17]
[54115,"54115","LALOEUF",17]
[54115,"54115","PULNEY",17]
[54115,"54115","SAULXEROTTE",17]
[54115,"54115","THOREY LYAUTEY",17]
[54115,"54115","TRAMONT EMY",17]
[54115,"54115","TRAMONT LASSUS",17]
[54115,"54115","TRAMONT ST ANDRE",17]
[54115,"54115","VANDELEVILLE",17]
[54116,"54116","TANTONVILLE",1]
[54118,"54118","MOYEN",1]
[54119,"54119","DOMGERMAIN",1]
[54120,"54120","BACCARAT",14]
[54120,"54120","BADMENIL",14]
[54120,"54120","BERTRICHAMPS",14]
[54120,"54120","BROUVILLE",14]
[54120,"54120","CRIVILLER",14]
[54120,"54120","DENEUVRE",14]
[54120,"54120","GELACOURT",14]
[54120,"54120","HABLAINVILLE",14]
[54120,"54120","LACHAPELLE",14]
[54120,"54120","MERVILLER",14]
[54120,"54120","PETTONVILLE",14]
[54120,"54120","REHERREY",14]
[54120,"54120","THIAVILLE SUR MEURTHE",14]
[54120,"54120","VAXAINVILLE",14]
[54121,"54121","VANDIERES",1]
[54122,"54122","AZERAILLES",6]
[54122,"54122","CHENEVIERES",6]
[54122,"54122","FLIN",6]
[54122,"54122","FONTENOY LA JOUTE",6]
[54122,"54122","GLONVILLE",6]
[54122,"54122","VATHIMENIL",6]
[54123,"54123","VITERNE",1]
[54125,"54125","FROLOIS",1]
[54126,"54126","PRAYE",1]
[54129,"54129","MAGNIERES",1]
[54130,"54130","DOMMARTEMONT",2]
[54130,"54130","ST MAX",2]
[54133,"54133","OCHEY AIR",1]
[54134,"54134","CEINTREY",2]
[54134,"54134","VOINEMONT",2]
[54135,"54135","MEXY",1]
[54136,"54136","BOUXIERES AUX DAMES",1]
[54140,"54140","JARVILLE LA MALGRANGE",1]
[54150,"54150","ANOUX",14]
[54150,"54150","AVRIL",14]
[54150,"54150","BRIEY",14]
[54150,"54150","FLEVILLE LIXIERES",14]
[54150,"54150","GENAVILLE",14]
[54150,"54150","IMMONVILLE",{"$f":"COUNTIF($B$2:$B$5669,B2242)","v":14}]
[54150,"54150","LANTEFONTAINE",14]
[54150,"54150","LES BAROCHES",14]
[54150,"54150","LUBEY",14]
[54150,"54150","MAINVILLE",14]
[54150,"54150","MAIRY MAINVILLE",14]
[54150,"54150","MANCE",14]
[54150,"54150","NORROY LE SEC",14]
[54150,"54150","OZERAILLES",14]
[54160,"54160","PULLIGNY",1]
[54170,"54170","ALLAIN",13]
[54170,"54170","BAGNEUX",13]
[54170,"54170","BARISEY AU PLAIN",13]
[54170,"54170","BARISEY LA COTE",13]
[54170,"54170","COLOMBEY LES BELLES",13]
[54170,"54170","CREPEY",13]
[54170,"54170","DOLCOURT",13]
[54170,"54170","GERMINY",13]
[54170,"54170","MONT L'ETROIT",13]
[54170,"54170","OCHEY",13]
[54170,"54170","SAULXURES LES VANNES",13]
[54170,"54170","SELAINCOURT",13]
[54170,"54170","THUILLEY AUX GROSEILLES",13]
[54180,"54180","HEILLECOURT",2]
[54180,"54180","HOUDEMONT",2]
[54190,"54190","BREHAIN LA VILLE",4]
[54190,"54190","CANTEBONNE",4]
[54190,"54190","TIERCELET",4]
[54190,"54190","VILLERUPT",4]
[54200,"54200","ANDILLY",22]
[54200,"54200","BICQUELEY",22]
[54200,"54200","BOUCQ",22]
[54200,"54200","BOUVRON",22]
[54200,"54200","BRULEY",22]
[54200,"54200","CHAUDENEY SUR MOSELLE",22]
[54200,"54200","CHOLOY MENILLOT",22]
[54200,"54200","DOMMARTIN LES TOUL",22]
[54200,"54200","ECROUVES",22]
[54200,"54200","FRANCHEVILLE",22]
[54200,"54200","GRAND MENIL",22]
[54200,"54200","JAILLON",22]
[54200,"54200","LAGNEY",22]
[54200,"54200","LUCEY",22]
[54200,"54200","MENIL LA TOUR",22]
[54200,"54200","MENILLOT",22]
[54200,"54200","PAGNEY DERRIERE BARINE",22]
[54200,"54200","PIERRE LA TREICHE",22]
[54200,"54200","ROYAUMEIX",22]
[54200,"54200","SANZEY",22]
[54200,"54200","TOUL",22]
[54200,"54200","VILLEY ST ETIENNE",22]
[54210,"54210","AZELOT",10]
[54210,"54210","BURTHECOURT AUX CHENES",10]
[54210,"54210","COYVILLER",10]
[54210,"54210","FERRIERES",10]
[54210,"54210","LUPCOURT",10]
[54210,"54210","MANONCOURT EN VERMOIS",10]
[54210,"54210","SAFFAIS",10]
[54210,"54210","ST NICOLAS DE PORT",10]
[54210,"54210","TONNOY",10]
[54210,"54210","VILLE EN VERMOIS",10]
[54220,"54220","MALZEVILLE",1]
[54230,"54230","CHALIGNY",4]
[54230,"54230","CHAVIGNY",4]
[54230,"54230","MARON",{"$f":"COUNTIF($B$2:$B$5669,B2306)","v":4}]
[54230,"54230","NEUVES MAISONS",4]
[54240,"54240","JOEUF",1]
[54250,"54250","CHAMPIGNEULLES",1]
[54260,"54260","ALLONDRELLE LA MALMAISON",21]
[54260,"54260","BRAUMONT",21]
[54260,"54260","CHARENCY VEZIN",21]
[54260,"54260","COLMEY",21]
[54260,"54260","EPIEZ SUR CHIERS",21]
[54260,"54260","FLABEUVILLE",21]
[54260,"54260","FRESNOIS LA MONTAGNE",21]
[54260,"54260","GRAND FAILLY",21]
[54260,"54260","HAM LES ST JEAN",21]
[54260,"54260","LONGUYON",21]
[54260,"54260","NOERS",21]
[54260,"54260","OTHE",21]
[54260,"54260","PETIT FAILLY",21]
[54260,"54260","PETIT XIVRY",21]
[54260,"54260","REVEMONT",21]
[54260,"54260","ST JEAN LES LONGUYON",21]
[54260,"54260","TELLANCOURT",21]
[54260,"54260","VILLANCY",21]
[54260,"54260","VILLERS LE ROND",21]
[54260,"54260","VILLETTE",21]
[54260,"54260","VIVIERS SUR CHIERS",21]
[54270,"54270","ESSEY LES NANCY",1]
[54280,"54280","BRIN SUR SEILLE",9]
[54280,"54280","CHAMPENOUX",9]
[54280,"54280","ERBEVILLER SUR AMEZULE",9]
[54280,"54280","LANEUVELOTTE",9]
[54280,"54280","MAZERULLES",9]
[54280,"54280","MONCEL SUR SEILLE",9]
[54280,"54280","SEICHAMPS",9]
[54280,"54280","SORNEVILLE",9]
[54280,"54280","VELAINE SOUS AMANCE",9]
[54290,"54290","BAINVILLE AUX MIROIRS",24]
[54290,"54290","BAYON",24]
[54290,"54290","BORVILLE",24]
[54290,"54290","BREMONCOURT",24]
[54290,"54290","CLAYEURES",24]
[54290,"54290","CREVECHAMPS",24]
[54290,"54290","DOMPTAIL EN L'AIR",24]
[54290,"54290","FROVILLE",24]
[54290,"54290","GRIPPORT",24]
[54290,"54290","HAIGNEVILLE",24]
[54290,"54290","HAUSSONVILLE",24]
[54290,"54290","LOREY",24]
[54290,"54290","LOROMONTZEY",24]
[54290,"54290","MANGONVILLE",24]
[54290,"54290","NEUVILLER SUR MOSELLE",24]
[54290,"54290","ROVILLE DEVANT BAYON",24]
[54290,"54290","ROZELIEURES",24]
[54290,"54290","ST BOINGT",24]
[54290,"54290","ST GERMAIN",24]
[54290,"54290","ST MARD",24]
[54290,"54290","ST REMY AUX BOIS",24]
[54290,"54290","VELLE SUR MOSELLE",24]
[54290,"54290","VILLACOURT",24]
[54290,"54290","VIRECOURT",24]
[54300,"54300","BIENVILLE LA PETITE",18]
[54300,"54300","BONVILLER",18]
[54300,"54300","CHANTEHEUX",18]
[54300,"54300","CRION",18]
[54300,"54300","CROISMARE",18]
[54300,"54300","FRAIMBOIS",{"$f":"COUNTIF($B$2:$B$5669,B2370)","v":18}]
[54300,"54300","HERIMENIL",18]
[54300,"54300","JOLIVET",18]
[54300,"54300","LAMATH",18]
[54300,"54300","LUNEVILLE",18]
[54300,"54300","MANONVILLER",18]
[54300,"54300","MARAINVILLER",18]
[54300,"54300","MONCEL LES LUNEVILLE",18]
[54300,"54300","REHAINVILLER",18]
[54300,"54300","SIONVILLER",18]
[54300,"54300","THIEBAUMENIL",18]
[54300,"54300","VITRIMONT",18]
[54300,"54300","XERMAMENIL",18]
[54310,"54310","HOMECOURT",1]
[54320,"54320","MAXEVILLE",2]
[54320,"54320","MAXEVILLE CHAMPLEBOEUF",2]
[54330,"54330","AUTREY",21]
[54330,"54330","CHAOUILLEY",21]
[54330,"54330","CLEREY SUR BRENON",21]
[54330,"54330","ETREVAL",21]
[54330,"54330","FORCELLES ST GORGON",21]
[54330,"54330","GOVILLER",21]
[54330,"54330","HAMMEVILLE",21]
[54330,"54330","HOUDELMONT",21]
[54330,"54330","HOUDREVILLE",21]
[54330,"54330","MARTHEMONT",21]
[54330,"54330","OGNEVILLE",21]
[54330,"54330","OMELMONT",21]
[54330,"54330","PAREY ST CESAIRE",21]
[54330,"54330","PIERREVILLE",21]
[54330,"54330","QUEVILLONCOURT",21]
[54330,"54330","SAXON SION",21]
[54330,"54330","THELOD",21]
[54330,"54330","VAUDEMONT",21]
[54330,"54330","VEZELISE",21]
[54330,"54330","VITREY",21]
[54330,"54330","VRONCOURT",21]
[54340,"54340","POMPEY",1]
[54350,"54350","MONT ST MARTIN",1]
[54360,"54360","BARBONVILLE",10]
[54360,"54360","BLAINVILLE SUR L'EAU",10]
[54360,"54360","CHARMOIS",10]
[54360,"54360","DAMELEVIERES",10]
[54360,"54360","EINVAUX",10]
[54360,"54360","LANDECOURT",10]
[54360,"54360","MEHONCOURT",10]
[54360,"54360","MONT SUR MEURTHE",10]
[54360,"54360","ROMAIN",10]
[54360,"54360","VIGNEULLES",10]
[54370,"54370","ARRACOURT",26]
[54370,"54370","ATHIENVILLE",26]
[54370,"54370","BATHELEMONT LES BAUZEMONT",26]
[54370,"54370","BAUZEMONT",26]
[54370,"54370","BEZANGE LA GRANDE",26]
[54370,"54370","BURES",26]
[54370,"54370","COINCOURT",26]
[54370,"54370","DEUXVILLE",26]
[54370,"54370","DROUVILLE",26]
[54370,"54370","EINVILLE AU JARD",26]
[54370,"54370","EMBERMENIL",26]
[54370,"54370","HENAMENIL",26]
[54370,"54370","HOEVILLE",26]
[54370,"54370","JUVRECOURT",26]
[54370,"54370","LANEUVEVILLE AUX BOIS",26]
[54370,"54370","MAIXE",{"$f":"COUNTIF($B$2:$B$5669,B2434)","v":26}]
[54370,"54370","MOUACOURT",26]
[54370,"54370","PARROY",26]
[54370,"54370","RAVILLE SUR SANON",26]
[54370,"54370","RECHICOURT LA PETITE",26]
[54370,"54370","REMONCOURT",26]
[54370,"54370","SERRES",26]
[54370,"54370","VALHEY",26]
[54370,"54370","VAUCOURT",26]
[54370,"54370","XOUSSE",26]
[54370,"54370","XURES",26]
[54380,"54380","AUTREVILLE SUR MOSELLE",20]
[54380,"54380","AVRAINVILLE",20]
[54380,"54380","BEZAUMONT",20]
[54380,"54380","DIEULOUARD",20]
[54380,"54380","DOMEVRE EN HAYE",20]
[54380,"54380","GEZONCOURT",20]
[54380,"54380","GRISCOURT",20]
[54380,"54380","LANDREMONT",20]
[54380,"54380","MANONCOURT EN WOEVRE",20]
[54380,"54380","MANONVILLE",20]
[54380,"54380","MARTINCOURT",20]
[54380,"54380","MILLERY",20]
[54380,"54380","MINORVILLE",20]
[54380,"54380","NOVIANT AUX PRES",20]
[54380,"54380","ROGEVILLE",20]
[54380,"54380","ROSIERES EN HAYE",20]
[54380,"54380","SAIZERAIS",20]
[54380,"54380","TREMBLECOURT",20]
[54380,"54380","VILLE AU VAL",20]
[54380,"54380","VILLERS EN HAYE",20]
[54390,"54390","FROUARD",1]
[54400,"54400","COSNES ET ROMAIN",3]
[54400,"54400","LONGWY",3]
[54400,"54400","VAUX WARNIMONT",3]
[54410,"54410","LA MADELEINE",2]
[54410,"54410","LANEUVEVILLE DEVANT NANCY",2]
[54420,"54420","CERVILLE",3]
[54420,"54420","PULNOY",3]
[54420,"54420","SAULXURES LES NANCY",3]
[54430,"54430","HEUMONT",2]
[54430,"54430","REHON",2]
[54440,"54440","HERSERANGE",1]
[54450,"54450","AMENONCOURT",30]
[54450,"54450","ANCERVILLER",30]
[54450,"54450","AUTREPIERRE",30]
[54450,"54450","AVRICOURT",30]
[54450,"54450","BARBAS",30]
[54450,"54450","BENAMENIL",30]
[54450,"54450","BLAMONT",30]
[54450,"54450","BLEMEREY",30]
[54450,"54450","BURIVILLE",30]
[54450,"54450","CHAZELLES SUR ALBE",30]
[54450,"54450","DOMEVRE SUR VEZOUZE",30]
[54450,"54450","DOMJEVIN",30]
[54450,"54450","FREMENIL",30]
[54450,"54450","FREMONVILLE",30]
[54450,"54450","GOGNEY",30]
[54450,"54450","GONDREXON",30]
[54450,"54450","HALLOVILLE",30]
[54450,"54450","HARBOUEY",30]
[54450,"54450","HERBEVILLER",30]
[54450,"54450","IGNEY",30]
[54450,"54450","LEINTREY",30]
[54450,"54450","MONTREUX",{"$f":"COUNTIF($B$2:$B$5669,B2498)","v":30}]
[54450,"54450","NONHIGNY",30]
[54450,"54450","OGEVILLER",30]
[54450,"54450","RECLONVILLE",30]
[54450,"54450","REILLON",30]
[54450,"54450","REPAIX",30]
[54450,"54450","ST MARTIN",30]
[54450,"54450","VEHO",30]
[54450,"54450","VERDENAL",30]
[54460,"54460","AINGERAY",2]
[54460,"54460","LIVERDUN",2]
[54470,"54470","ANSAUVILLE",27]
[54470,"54470","BEAUMONT",27]
[54470,"54470","BERNECOURT",27]
[54470,"54470","BOUILLONVILLE",27]
[54470,"54470","CHAREY",27]
[54470,"54470","DAMPVITOUX",27]
[54470,"54470","DOMMARTIN LA CHAUSSEE",27]
[54470,"54470","ESSEY ET MAIZERAIS",27]
[54470,"54470","EUVEZIN",27]
[54470,"54470","FEY EN HAYE",27]
[54470,"54470","FLIREY",27]
[54470,"54470","GROSROUVRES",27]
[54470,"54470","HAGEVILLE",27]
[54470,"54470","HAMONVILLE",27]
[54470,"54470","JAULNY",27]
[54470,"54470","LIMEY REMENAUVILLE",27]
[54470,"54470","LIRONVILLE",27]
[54470,"54470","MAMEY",27]
[54470,"54470","MANDRES AUX QUATRE TOURS",27]
[54470,"54470","PANNES",27]
[54470,"54470","REMBERCOURT SUR MAD",27]
[54470,"54470","SEICHEPREY",27]
[54470,"54470","ST BAUSSANT",27]
[54470,"54470","ST JULIEN LES GORZE",27]
[54470,"54470","THIAUCOURT",27]
[54470,"54470","VIEVILLE EN HAYE",27]
[54470,"54470","XAMMES",27]
[54480,"54480","BERTRAMBOIS",7]
[54480,"54480","CIREY SUR VEZOUZE",7]
[54480,"54480","PARUX",7]
[54480,"54480","PETITMONT",7]
[54480,"54480","ST SAUVEUR",7]
[54480,"54480","TANCONVILLE",7]
[54480,"54480","VAL ET CHATILLON",7]
[54490,"54490","AVILLERS",8]
[54490,"54490","BERTRAMEIX",8]
[54490,"54490","DOMPRIX",8]
[54490,"54490","JOUDREVILLE",8]
[54490,"54490","MURVILLE",8]
[54490,"54490","PIENNES",8]
[54490,"54490","PREUTIN HIGNY",8]
[54490,"54490","XIVRY CIRCOURT",8]
[54500,"54500","VANDOEUVRE LES NANCY",1]
[54510,"54510","ART SUR MEURTHE",3]
[54510,"54510","BOSSERVILLE",3]
[54510,"54510","TOMBLAINE",3]
[54520,"54520","LAXOU",2]
[54520,"54520","LAXOU CHAMPLEBOEUF",2]
[54530,"54530","ARNAVILLE",3]
[54530,"54530","PAGNY SUR MOSELLE",3]
[54530,"54530","PRENY",3]
[54540,"54540","ANGOMONT",16]
[54540,"54540","BADONVILLER",16]
[54540,"54540","BIONVILLE",{"$f":"COUNTIF($B$2:$B$5669,B2562)","v":16}]
[54540,"54540","BREMENIL",16]
[54540,"54540","FENNEVILLER",16]
[54540,"54540","MIGNEVILLE",16]
[54540,"54540","MONTIGNY",16]
[54540,"54540","NEUFMAISONS",16]
[54540,"54540","NEUVILLER LES BADONVILLER",16]
[54540,"54540","PEXONNE",16]
[54540,"54540","PIERRE PERCEE",16]
[54540,"54540","RAON LES LEAU",16]
[54540,"54540","ST MAURICE AUX FORGES",16]
[54540,"54540","STE POLE",16]
[54540,"54540","VACQUEVILLE",16]
[54540,"54540","VENEY",16]
[54550,"54550","BAINVILLE SUR MADON",4]
[54550,"54550","MAIZIERES",4]
[54550,"54550","PONT ST VINCENT",4]
[54550,"54550","SEXEY AUX FORGES",4]
[54560,"54560","ANDERNY",9]
[54560,"54560","AUDUN LE ROMAN",9]
[54560,"54560","BEUVILLERS",9]
[54560,"54560","BOUDREZY",9]
[54560,"54560","FILLIERES",9]
[54560,"54560","MALAVILLERS",9]
[54560,"54560","MERCY LE HAUT",9]
[54560,"54560","SANCY",9]
[54560,"54560","SERROUVILLE",9]
[54570,"54570","FOUG",4]
[54570,"54570","LANEUVEVILLE DERRIERE FOUG",4]
[54570,"54570","LAY ST REMY",4]
[54570,"54570","TRONDES",4]
[54580,"54580","AUBOUE",4]
[54580,"54580","HABONVILLE",4]
[54580,"54580","MOINEVILLE",4]
[54580,"54580","ST AIL",4]
[54590,"54590","HUSSIGNY GODBRANGE",1]
[54600,"54600","VILLERS LES NANCY",1]
[54610,"54610","BELLEAU",18]
[54610,"54610","BRATTE",18]
[54610,"54610","CHENICOURT",18]
[54610,"54610","CLEMERY",18]
[54610,"54610","EPLY",18]
[54610,"54610","LETRICOURT",18]
[54610,"54610","LIXIERES",18]
[54610,"54610","MAILLY SUR SEILLE",18]
[54610,"54610","MANONCOURT SUR SEILLE",18]
[54610,"54610","MOREY",18]
[54610,"54610","NOMENY",18]
[54610,"54610","PHLIN",18]
[54610,"54610","RAUCOURT",18]
[54610,"54610","ROUVES",18]
[54610,"54610","SERRIERES",18]
[54610,"54610","SIVRY",18]
[54610,"54610","THEZEY ST MARTIN",18]
[54610,"54610","ABAUCOURT SUR SEILLE",18]
[54620,"54620","BASLIEUX",10]
[54620,"54620","BAZAILLES",10]
[54620,"54620","BEUVEILLE",10]
[54620,"54620","BOISMONT",10]
[54620,"54620","DONCOURT LES LONGUYON",10]
[54620,"54620","HAN DEVANT PIERREPONT",10]
[54620,"54620","JOPPECOURT",10]
[54620,"54620","PIERREPONT",10]
[54620,"54620","ST SUPPLET",10]
[54620,"54620","VILLE AU MONTOIS",{"$f":"COUNTIF($B$2:$B$5669,B2626)","v":10}]
[54630,"54630","FLAVIGNY SUR MOSELLE",2]
[54630,"54630","RICHARDMENIL",2]
[54640,"54640","BETTAINVILLERS",2]
[54640,"54640","TUCQUEGNIEUX",2]
[54650,"54650","SAULNES",1]
[54660,"54660","MOUTIERS",1]
[54670,"54670","CUSTINES",2]
[54670,"54670","MALLELOY",2]
[54680,"54680","CRUSNES",2]
[54680,"54680","ERROUVILLE",2]
[54690,"54690","EULMONT",2]
[54690,"54690","LAY ST CHRISTOPHE",2]
[54700,"54700","ATTON",18]
[54700,"54700","BLENOD LES PONT A MOUSSON",18]
[54700,"54700","BOUXIERES SOUS FROIDMONT",18]
[54700,"54700","CHAMPEY SUR MOSELLE",18]
[54700,"54700","JEZAINVILLE",18]
[54700,"54700","LESMENILS",18]
[54700,"54700","LOISY",18]
[54700,"54700","MAIDIERES",18]
[54700,"54700","MONTAUVILLE",18]
[54700,"54700","MORVILLE SUR SEILLE",18]
[54700,"54700","MOUSSON",18]
[54700,"54700","NORROY LES PONT A MOUSSON",18]
[54700,"54700","PONT A MOUSSON",18]
[54700,"54700","PORT SUR SEILLE",18]
[54700,"54700","STE GENEVIEVE",18]
[54700,"54700","VILCEY SUR TREY",18]
[54700,"54700","VILLERS SOUS PRENY",18]
[54700,"54700","VITTONVILLE",18]
[54710,"54710","FLEVILLE DEVANT NANCY",2]
[54710,"54710","LUDRES",2]
[54720,"54720","CHENIERES",4]
[54720,"54720","CUTRY",4]
[54720,"54720","LAIX",4]
[54720,"54720","LEXY",4]
[54730,"54730","GORCY",3]
[54730,"54730","ST PANCRE",3]
[54730,"54730","VILLE HOUDLEMONT",3]
[54740,"54740","AFFRACOURT",18]
[54740,"54740","BENNEY",18]
[54740,"54740","BRALLEVILLE",18]
[54740,"54740","CRANTENOY",18]
[54740,"54740","GERBECOURT ET HAPLEMONT",18]
[54740,"54740","GERMONVILLE",18]
[54740,"54740","HAROUE",18]
[54740,"54740","JEVONCOURT",18]
[54740,"54740","LANEUVEVILLE DEVANT BAYON",18]
[54740,"54740","LEBEUVILLE",18]
[54740,"54740","LEMAINVILLE",18]
[54740,"54740","LEMENIL MITRY",18]
[54740,"54740","LES MESNILS SUR MADON",18]
[54740,"54740","ORMES ET VILLE",18]
[54740,"54740","ST REMIMONT",18]
[54740,"54740","VAUDEVILLE",18]
[54740,"54740","VAUDIGNY",18]
[54740,"54740","XIROCOURT",18]
[54750,"54750","TRIEUX",1]
[54760,"54760","ARMAUCOURT",9]
[54760,"54760","ARRAYE ET HAN",9]
[54760,"54760","BEY SUR SEILLE",9]
[54760,"54760","FAULX",9]
[54760,"54760","LANFROICOURT",9]
[54760,"54760","LEYR",{"$f":"COUNTIF($B$2:$B$5669,B2690)","v":9}]
[54760,"54760","MOIVRONS",9]
[54760,"54760","MONTENOY",9]
[54760,"54760","VILLERS LES MOIVRONS",9]
[54770,"54770","AGINCOURT",6]
[54770,"54770","AMANCE",6]
[54770,"54770","BOUXIERES AUX CHENES",6]
[54770,"54770","DOMMARTIN SOUS AMANCE",6]
[54770,"54770","LAITRE SOUS AMANCE",6]
[54770,"54770","MOULINS",6]
[54780,"54780","GIRAUMONT",1]
[54790,"54790","MANCIEULLES",1]
[54800,"54800","AFFLEVILLE",29]
[54800,"54800","ALLAMONT",29]
[54800,"54800","BECHAMPS",29]
[54800,"54800","BONCOURT",29]
[54800,"54800","BRAINVILLE",29]
[54800,"54800","BRUVILLE",29]
[54800,"54800","CONFLANS EN JARNISY",29]
[54800,"54800","DONCOURT LES CONFLANS",29]
[54800,"54800","DROITAUMONT",29]
[54800,"54800","FRIAUVILLE",29]
[54800,"54800","GONDRECOURT AIX",29]
[54800,"54800","HANNONVILLE SUZEMONT",29]
[54800,"54800","HATRIZE",29]
[54800,"54800","JARNY",29]
[54800,"54800","JEANDELIZE",29]
[54800,"54800","JOUAVILLE",29]
[54800,"54800","LABRY",29]
[54800,"54800","MARS LA TOUR",29]
[54800,"54800","MOUAVILLE",29]
[54800,"54800","OLLEY",29]
[54800,"54800","PUXE",29]
[54800,"54800","PUXIEUX",29]
[54800,"54800","SPONVILLE",29]
[54800,"54800","ST MARCEL",29]
[54800,"54800","THUMEREVILLE",29]
[54800,"54800","TRONVILLE",29]
[54800,"54800","VILLE SUR YRON",29]
[54800,"54800","XONVILLE",29]
[54800,"54800","ABBEVILLE LES CONFLANS",29]
[54810,"54810","LONGLAVILLE",1]
[54820,"54820","MARBACHE",1]
[54830,"54830","ESSEY LA COTE",11]
[54830,"54830","FRANCONVILLE",11]
[54830,"54830","GERBEVILLER",11]
[54830,"54830","GIRIVILLER",11]
[54830,"54830","HAUDONVILLE",11]
[54830,"54830","MATTEXEY",11]
[54830,"54830","MORIVILLER",11]
[54830,"54830","REMENOVILLE",11]
[54830,"54830","SERANVILLE",11]
[54830,"54830","VALLOIS",11]
[54830,"54830","VENNEZEY",11]
[54840,"54840","FONTENOY SUR MOSELLE",5]
[54840,"54840","GONDREVILLE",5]
[54840,"54840","SEXEY LES BOIS",5]
[54840,"54840","VELAINE EN HAYE",5]
[54840,"54840","VILLEY LE SEC",5]
[54850,"54850","MEREVILLE",2]
[54850,"54850","MESSEIN",2]
[54860,"54860","HAUCOURT MOULAINE",2]
[54860,"54860","ST CHARLES",2]
[54870,"54870","CONS LA GRANDVILLE",5]
[54870,"54870","FERMONT",{"$f":"COUNTIF($B$2:$B$5669,B2754)","v":5}]
[54870,"54870","MONTIGNY SUR CHIERS",5]
[54870,"54870","UGNY",5]
[54870,"54870","VILLERS LA CHEVRE",5]
[54880,"54880","THIL",1]
[54890,"54890","BAYONVILLE SUR MAD",6]
[54890,"54890","CHAMBLEY BUSSIERES",6]
[54890,"54890","ONVILLE",6]
[54890,"54890","VANDELAINVILLE",6]
[54890,"54890","VILLECEY SUR MAD",6]
[54890,"54890","WAVILLE",6]
[54910,"54910","VALLEROY",1]
[54920,"54920","MORFONTAINE",2]
[54920,"54920","VILLERS LA MONTAGNE",2]
[54930,"54930","BOUZANVILLE",9]
[54930,"54930","COURCELLES",9]
[54930,"54930","DIARVILLE",9]
[54930,"54930","FORCELLES SOUS GUGNEY",9]
[54930,"54930","FRAISNES EN SAINTOIS",9]
[54930,"54930","GUGNEY",9]
[54930,"54930","HOUSSEVILLE",9]
[54930,"54930","ST FIRMIN",9]
[54930,"54930","THEY SOUS VAUDEMONT",9]
[54940,"54940","BELLEVILLE",1]
[54950,"54950","LARONXE",2]
[54950,"54950","ST CLEMENT",2]
[54960,"54960","MERCY LE BAS",1]
[54970,"54970","LANDRES",1]
[54980,"54980","BATILLY",1]
[54990,"54990","XEUILLEY",1]
[55000,"55000","BAR LE DUC",39]
[55000,"55000","BEHONNE",39]
[55000,"55000","BEUREY SUR SAULX",39]
[55000,"55000","BRILLON EN BARROIS",39]
[55000,"55000","BUSSY LA COTE",39]
[55000,"55000","CHARDOGNE",39]
[55000,"55000","COMBLES EN BARROIS",39]
[55000,"55000","CULEY",39]
[55000,"55000","ERIZE ST DIZIER",39]
[55000,"55000","FAINS VEEL",39]
[55000,"55000","GENICOURT SOUS CONDE",39]
[55000,"55000","GERY",39]
[55000,"55000","GUERPONT",39]
[55000,"55000","HAIRONVILLE",39]
[55000,"55000","HARGEVILLE SUR CHEE",39]
[55000,"55000","LES HAUTS DE CHEE",39]
[55000,"55000","LES MARATS",39]
[55000,"55000","LISLE EN RIGAULT",39]
[55000,"55000","LOISEY CULEY",39]
[55000,"55000","LONGEVILLE EN BARROIS",39]
[55000,"55000","LOUPPY SUR CHEE",39]
[55000,"55000","MONTPLONNE",39]
[55000,"55000","NAIVES ROSIERES",39]
[55000,"55000","RESSON",39]
[55000,"55000","ROBERT ESPAGNE",39]
[55000,"55000","ROSIERES DEVANT BAR",39]
[55000,"55000","RUMONT",39]
[55000,"55000","SALMAGNE",39]
[55000,"55000","SAUDRUPT",39]
[55000,"55000","SAVONNIERES DEVANT BAR",39]
[55000,"55000","SEIGNEULLES",39]
[55000,"55000","SILMONT",39]
[55000,"55000","TANNOIS",39]
[55000,"55000","TREMONT SUR SAULX",39]
[55000,"55000","VAL D'ORNAIN",{"$f":"COUNTIF($B$2:$B$5669,B2818)","v":39}]
[55000,"55000","VARNEY",39]
[55000,"55000","VAVINCOURT",39]
[55000,"55000","VEEL",39]
[55000,"55000","VILLE SUR SAULX",39]
[55100,"55100","BELLERAY",25]
[55100,"55100","BELLEVILLE SUR MEUSE",25]
[55100,"55100","BELRUPT EN VERDUNOIS",25]
[55100,"55100","BETHELAINVILLE",25]
[55100,"55100","BRABANT SUR MEUSE",25]
[55100,"55100","BRAS SUR MEUSE",25]
[55100,"55100","CHAMPNEUVILLE",25]
[55100,"55100","CHARNY SUR MEUSE",25]
[55100,"55100","CHATTANCOURT",25]
[55100,"55100","CUMIERES LE MORT HOMME",25]
[55100,"55100","DOUAUMONT",25]
[55100,"55100","DUGNY SUR MEUSE",25]
[55100,"55100","ESNES EN ARGONNE",25]
[55100,"55100","FLEURY DEVANT DOUAUMONT",25]
[55100,"55100","FROMEREVILLE LES VALLONS",25]
[55100,"55100","HAUDAINVILLE",25]
[55100,"55100","LANDRECOURT LEMPIRE",25]
[55100,"55100","LEMPIRE AUX BOIS",25]
[55100,"55100","MARRE",25]
[55100,"55100","MONTZEVILLE",25]
[55100,"55100","SAMOGNEUX",25]
[55100,"55100","SIVRY LA PERCHE",25]
[55100,"55100","THIERVILLE SUR MEUSE",25]
[55100,"55100","VACHERAUVILLE",25]
[55100,"55100","VERDUN",25]
[55110,"55110","AINCREVILLE",28]
[55110,"55110","BANTHEVILLE",28]
[55110,"55110","BRIEULLES SUR MEUSE",28]
[55110,"55110","CLERY GRAND",28]
[55110,"55110","CLERY PETIT",28]
[55110,"55110","CONSENVOYE",28]
[55110,"55110","CUNEL",28]
[55110,"55110","DANNEVOUX",28]
[55110,"55110","DOULCON",28]
[55110,"55110","DUN SUR MEUSE",28]
[55110,"55110","FONTAINES ST CLAIR",28]
[55110,"55110","FORGES SUR MEUSE",28]
[55110,"55110","GERCOURT ET DRILLANCOURT",28]
[55110,"55110","GESNES EN ARGONNE",28]
[55110,"55110","HARAUMONT",28]
[55110,"55110","LINY DEVANT DUN",28]
[55110,"55110","LION DEVANT DUN",28]
[55110,"55110","MILLY SUR BRADON",28]
[55110,"55110","MONT DEVANT SASSEY",28]
[55110,"55110","MONTIGNY DEVANT SASSEY",28]
[55110,"55110","MURVAUX",28]
[55110,"55110","REGNEVILLE SUR MEUSE",28]
[55110,"55110","ROMAGNE SOUS MONTFAUCON",28]
[55110,"55110","SASSEY SUR MEUSE",28]
[55110,"55110","SAULMORY ET VILLEFRANCHE",28]
[55110,"55110","SIVRY SUR MEUSE",28]
[55110,"55110","VILLERS DEVANT DUN",28]
[55110,"55110","VILOSNES HARAUMONT",28]
[55120,"55120","AUBREVILLE",24]
[55120,"55120","AUTRECOURT SUR AIRE",24]
[55120,"55120","AUZEVILLE EN ARGONNE",24]
[55120,"55120","BLERCOURT",24]
[55120,"55120","BRABANT EN ARGONNE",24]
[55120,"55120","BROCOURT EN ARGONNE",24]
[55120,"55120","CLERMONT EN ARGONNE",{"$f":"COUNTIF($B$2:$B$5669,B2882)","v":24}]
[55120,"55120","DOMBASLE EN ARGONNE",24]
[55120,"55120","FROIDOS",24]
[55120,"55120","FUTEAU",24]
[55120,"55120","JOUY EN ARGONNE",24]
[55120,"55120","JUBECOURT",24]
[55120,"55120","JULVECOURT",24]
[55120,"55120","LACHALADE",24]
[55120,"55120","LAVOYE",24]
[55120,"55120","LE CLAON",24]
[55120,"55120","LE NEUFOUR",24]
[55120,"55120","LES ISLETTES",24]
[55120,"55120","NEUVILLY EN ARGONNE",24]
[55120,"55120","NIXEVILLE BLERCOURT",24]
[55120,"55120","PAROIS",24]
[55120,"55120","RARECOURT",24]
[55120,"55120","RECICOURT",24]
[55120,"55120","VILLE SUR COUSANCES",24]
[55130,"55130","AMANTY",22]
[55130,"55130","BADONVILLIERS GERAUVILLIERS",22]
[55130,"55130","BAUDIGNECOURT",22]
[55130,"55130","BONNET",22]
[55130,"55130","CHASSEY BEAUPRE",22]
[55130,"55130","DAINVILLE BERTHELEVILLE",22]
[55130,"55130","DELOUZE ROSIERES",22]
[55130,"55130","DEMANGE AUX EAUX",22]
[55130,"55130","GERAUVILLIERS",22]
[55130,"55130","GONDRECOURT LE CHATEAU",22]
[55130,"55130","HORVILLE EN ORNOIS",22]
[55130,"55130","HOUDELAINCOURT",22]
[55130,"55130","LES ROISES",22]
[55130,"55130","LUMEVILLE EN ORNOIS",22]
[55130,"55130","ROSIERES EN BLOIS",22]
[55130,"55130","ST JOIRE",22]
[55130,"55130","TOURAILLES SOUS BOIS",22]
[55130,"55130","TREVERAY",22]
[55130,"55130","VAUDEVILLE LE HAUT",22]
[55130,"55130","VOUTHON BAS",22]
[55130,"55130","VOUTHON HAUT",22]
[55130,"55130","ABAINVILLE",22]
[55140,"55140","BRIXEY AUX CHANOINES",20]
[55140,"55140","BUREY EN VAUX",20]
[55140,"55140","BUREY LA COTE",20]
[55140,"55140","CHALAINES",20]
[55140,"55140","CHAMPOUGNY",20]
[55140,"55140","EPIEZ SUR MEUSE",20]
[55140,"55140","GOUSSAINCOURT",20]
[55140,"55140","MAXEY SUR VAISE",20]
[55140,"55140","MONTBRAS",20]
[55140,"55140","MONTIGNY LES VAUCOULEURS",20]
[55140,"55140","NEUVILLE LES VAUCOULEURS",20]
[55140,"55140","PAGNY LA BLANCHE COTE",20]
[55140,"55140","RIGNY LA SALLE",20]
[55140,"55140","RIGNY ST MARTIN",20]
[55140,"55140","SAUVIGNY",20]
[55140,"55140","SEPVIGNY",20]
[55140,"55140","ST GERMAIN SUR MEUSE",20]
[55140,"55140","TAILLANCOURT",20]
[55140,"55140","UGNY SUR MEUSE",20]
[55140,"55140","VAUCOULEURS",20]
[55150,"55150","AZANNES ET SOUMAZANNES",26]
[55150,"55150","BRANDEVILLE",26]
[55150,"55150","BREHEVILLE",26]
[55150,"55150","CHAUMONT DEVANT DAMVILLERS",26]
[55150,"55150","CREPION",{"$f":"COUNTIF($B$2:$B$5669,B2946)","v":26}]
[55150,"55150","DAMVILLERS",26]
[55150,"55150","DELUT",26]
[55150,"55150","DOMBRAS",26]
[55150,"55150","ECUREY EN VERDUNOIS",26]
[55150,"55150","ETRAYE",26]
[55150,"55150","FLABAS",26]
[55150,"55150","GREMILLY",26]
[55150,"55150","LISSEY",26]
[55150,"55150","MANGIENNES",26]
[55150,"55150","MERLES SUR LOISON",26]
[55150,"55150","MOIREY FLABAS CREPION",26]
[55150,"55150","ORNES",26]
[55150,"55150","PEUVILLERS",26]
[55150,"55150","REVILLE AUX BOIS",26]
[55150,"55150","ROMAGNE SOUS LES COTES",26]
[55150,"55150","RUPT SUR OTHAIN",26]
[55150,"55150","ST LAURENT SUR OTHAIN",26]
[55150,"55150","VILLE DEVANT CHAUMONT",26]
[55150,"55150","VILLERS LES MANGIENNES",26]
[55150,"55150","VITTARVILLE",26]
[55150,"55150","WAVRILLE",26]
[55160,"55160","BONZEE",32]
[55160,"55160","BUTGNEVILLE",32]
[55160,"55160","CHAMPLON",32]
[55160,"55160","COMBRES SOUS LES COTES",32]
[55160,"55160","DOMMARTIN LA MONTAGNE",32]
[55160,"55160","DONCOURT AUX TEMPLIERS",32]
[55160,"55160","FRESNES EN WOEVRE",32]
[55160,"55160","HARVILLE",32]
[55160,"55160","HAUDIOMONT",32]
[55160,"55160","HENNEMONT",32]
[55160,"55160","JONVILLE EN WOEVRE",32]
[55160,"55160","LABEUVILLE",32]
[55160,"55160","LATOUR EN WOEVRE",32]
[55160,"55160","LES EPARGES",32]
[55160,"55160","MAIZERAY",32]
[55160,"55160","MANHEULLES",32]
[55160,"55160","MARCHEVILLE EN WOEVRE",32]
[55160,"55160","MESNIL SOUS LES COTES",32]
[55160,"55160","MONT VILLERS",32]
[55160,"55160","MOULOTTE",32]
[55160,"55160","PAREID",32]
[55160,"55160","PINTHEVILLE",32]
[55160,"55160","RIAVILLE",32]
[55160,"55160","RONVAUX",32]
[55160,"55160","SAULX LES CHAMPLON",32]
[55160,"55160","ST HILAIRE EN WOEVRE",32]
[55160,"55160","ST REMY LA CALONNE",32]
[55160,"55160","TRESAUVAUX",32]
[55160,"55160","VILLE EN WOEVRE",32]
[55160,"55160","VILLERS SOUS PAREID",32]
[55160,"55160","WADONVILLE EN WOEVRE",32]
[55160,"55160","WATRONVILLE",32]
[55170,"55170","ANCERVILLE",11]
[55170,"55170","AULNOIS EN PERTHOIS",11]
[55170,"55170","BAUDONVILLIERS",11]
[55170,"55170","BAZINCOURT SUR SAULX",11]
[55170,"55170","BRAUVILLIERS",11]
[55170,"55170","COUSANCES LES FORGES",11]
[55170,"55170","JUVIGNY EN PERTHOIS",11]
[55170,"55170","LAVINCOURT",11]
[55170,"55170","RUPT AUX NONAINS",11]
[55170,"55170","SAVONNIERES EN PERTHOIS",11]
[55170,"55170","SOMMELONNE",{"$f":"COUNTIF($B$2:$B$5669,B3010)","v":11}]
[55190,"55190","BOVEE SUR BARBOURE",18]
[55190,"55190","BROUSSEY EN BLOIS",18]
[55190,"55190","LANEUVILLE AU RUPT",18]
[55190,"55190","MARSON SUR BARBOURE",18]
[55190,"55190","MAUVAGES",18]
[55190,"55190","MELIGNY LE GRAND",18]
[55190,"55190","MELIGNY LE PETIT",18]
[55190,"55190","MENIL LA HORGNE",18]
[55190,"55190","NAIVES EN BLOIS",18]
[55190,"55190","OURCHES SUR MEUSE",18]
[55190,"55190","PAGNY SUR MEUSE",18]
[55190,"55190","REFFROY",18]
[55190,"55190","SAUVOY",18]
[55190,"55190","SORCY ST MARTIN",18]
[55190,"55190","TROUSSEY",18]
[55190,"55190","VACON",18]
[55190,"55190","VILLEROY SUR MEHOLLE",18]
[55190,"55190","VOID VACON",18]
[55200,"55200","AULNOIS SOUS VERTUZEY",20]
[55200,"55200","BONCOURT SUR MEUSE",20]
[55200,"55200","BROUSSEY RAULECOURT",20]
[55200,"55200","CHONVILLE MALAUMONT",20]
[55200,"55200","COMMERCY",20]
[55200,"55200","CORNIEVILLE",20]
[55200,"55200","EUVILLE",20]
[55200,"55200","FREMEREVILLE SOUS LES COTES",20]
[55200,"55200","GEVILLE",20]
[55200,"55200","GIRAUVOISIN",20]
[55200,"55200","GIRONVILLE SOUS LES COTES",20]
[55200,"55200","LEROUVILLE",20]
[55200,"55200","MALAUMONT",20]
[55200,"55200","PONT SUR MEUSE",20]
[55200,"55200","RAULECOURT",20]
[55200,"55200","ST JULIEN SOUS LES COTES",20]
[55200,"55200","VADONVILLE",20]
[55200,"55200","VERTUZEY",20]
[55200,"55200","VIGNOT",20]
[55200,"55200","VILLE ISSEY",20]
[55210,"55210","AVILLERS STE CROIX",21]
[55210,"55210","BENEY EN WOEVRE",21]
[55210,"55210","BILLY SOUS LES COTES",21]
[55210,"55210","CHAILLON",21]
[55210,"55210","CREUE",21]
[55210,"55210","HADONVILLE LES LACHAUSSEE",21]
[55210,"55210","HANNONVILLE SOUS LES COTES",21]
[55210,"55210","HATTONCHATEL",21]
[55210,"55210","HATTONVILLE",21]
[55210,"55210","HAUMONT LES LACHAUSSEE",21]
[55210,"55210","HERBEUVILLE",21]
[55210,"55210","HEUDICOURT SOUS LES COTES",21]
[55210,"55210","LACHAUSSEE",21]
[55210,"55210","LAMARCHE EN WOEVRE",21]
[55210,"55210","NONSARD LAMARCHE",21]
[55210,"55210","ST BENOIT EN WOEVRE",21]
[55210,"55210","ST MAURICE SOUS LES COTES",21]
[55210,"55210","THILLOT",21]
[55210,"55210","VIEVILLE SOUS LES COTES",21]
[55210,"55210","VIGNEULLES LES HATTONCHATEL",21]
[55210,"55210","WOEL",21]
[55220,"55220","HEIPPES",18]
[55220,"55220","IPPECOURT",18]
[55220,"55220","ISSONCOURT",18]
[55220,"55220","LEMMES",18]
[55220,"55220","LES SOUHESMES RAMPONT",{"$f":"COUNTIF($B$2:$B$5669,B3074)","v":18}]
[55220,"55220","LES TROIS DOMAINES",18]
[55220,"55220","MONDRECOURT",18]
[55220,"55220","OSCHES",18]
[55220,"55220","RAMBLUZIN ET BENOITE VAUX",18]
[55220,"55220","RAMPONT",18]
[55220,"55220","RECOURT LE CREUX",18]
[55220,"55220","RIGNAUCOURT",18]
[55220,"55220","SENONCOURT LES MAUJOUY",18]
[55220,"55220","SOUILLY",18]
[55220,"55220","ST ANDRE EN BARROIS",18]
[55220,"55220","TILLY SUR MEUSE",18]
[55220,"55220","VADELAINCOURT",18]
[55220,"55220","VILLERS SUR MEUSE",18]
[55230,"55230","AMEL SUR L'ETANG",19]
[55230,"55230","ARRANCY SUR CRUSNE",19]
[55230,"55230","BILLY SOUS MANGIENNES",19]
[55230,"55230","DUZEY",19]
[55230,"55230","GOURAINCOURT",19]
[55230,"55230","HAUCOURT LA RIGOLE",19]
[55230,"55230","HOUDELAUCOURT SUR OTHAIN",19]
[55230,"55230","LOISON",19]
[55230,"55230","MUZERAY",19]
[55230,"55230","NOUILLONPONT",19]
[55230,"55230","OLLIERES",19]
[55230,"55230","PILLON",19]
[55230,"55230","RECHICOURT",19]
[55230,"55230","ROUVROIS SUR OTHAIN",19]
[55230,"55230","SENON",19]
[55230,"55230","SORBEY",19]
[55230,"55230","SPINCOURT",19]
[55230,"55230","ST PIERREVILLERS",19]
[55230,"55230","VAUDONCOURT",19]
[55240,"55240","BOULIGNY",4]
[55240,"55240","DOMMARY BARONCOURT",4]
[55240,"55240","DOMREMY LA CANNE",4]
[55240,"55240","ETON",4]
[55250,"55250","AMBLAINCOURT",21]
[55250,"55250","BEAULIEU EN ARGONNE",21]
[55250,"55250","BEAUSITE",21]
[55250,"55250","BRIZEAUX",21]
[55250,"55250","BULAINVILLE",21]
[55250,"55250","DEUXNOUDS DEVANT BEAUZEE",21]
[55250,"55250","EVRES",21]
[55250,"55250","FLEURY SUR AIRE",21]
[55250,"55250","FOUCAUCOURT SUR THABAS",21]
[55250,"55250","LISLE EN BARROIS",21]
[55250,"55250","NUBECOURT",21]
[55250,"55250","PRETZ",21]
[55250,"55250","REMBERCOURT SOMMAISNE",21]
[55250,"55250","SENARD",21]
[55250,"55250","SERAUCOURT",21]
[55250,"55250","SEUIL D'ARGONNE",21]
[55250,"55250","SOMMAISNE",21]
[55250,"55250","TRIAUCOURT EN ARGONNE",21]
[55250,"55250","VAUBECOURT",21]
[55250,"55250","VILLOTTE DEVANT LOUPPY",21]
[55250,"55250","WALY",21]
[55260,"55260","BAUDREMONT",25]
[55260,"55260","BELRAIN",25]
[55260,"55260","CHAUMONT SUR AIRE",25]
[55260,"55260","COURCELLES EN BARROIS",25]
[55260,"55260","COURCELLES SUR AIRE",25]
[55260,"55260","COUROUVRE",25]
[55260,"55260","ERIZE LA BRULEE",{"$f":"COUNTIF($B$2:$B$5669,B3138)","v":25}]
[55260,"55260","ERIZE LA GRANDE",25]
[55260,"55260","ERIZE LA PETITE",25]
[55260,"55260","FRESNES AU MONT",25]
[55260,"55260","GIMECOURT",25]
[55260,"55260","LAHAYMEIX",25]
[55260,"55260","LAVALLEE",25]
[55260,"55260","LEVONCOURT",25]
[55260,"55260","LIGNIERES SUR AIRE",25]
[55260,"55260","LONGCHAMPS SUR AIRE",25]
[55260,"55260","MENIL AUX BOIS",25]
[55260,"55260","NEUVILLE EN VERDUNOIS",25]
[55260,"55260","NICEY SUR AIRE",25]
[55260,"55260","PIERREFITTE SUR AIRE",25]
[55260,"55260","RAIVAL",25]
[55260,"55260","RUPT DEVANT ST MIHIEL",25]
[55260,"55260","THILLOMBOIS",25]
[55260,"55260","VILLE DEVANT BELRAIN",25]
[55260,"55260","VILLOTTE SUR AIRE",25]
[55270,"55270","AVOCOURT",17]
[55270,"55270","BAULNY",17]
[55270,"55270","BETHINCOURT",17]
[55270,"55270","BOUREUILLES",17]
[55270,"55270","CHARPENTRY",17]
[55270,"55270","CHEPPY",17]
[55270,"55270","CIERGES SOUS MONTFAUCON",17]
[55270,"55270","CUISY",17]
[55270,"55270","EPINONVILLE",17]
[55270,"55270","MALANCOURT",17]
[55270,"55270","MONTBLAINVILLE",17]
[55270,"55270","MONTFAUCON",17]
[55270,"55270","NANTILLOIS",17]
[55270,"55270","SEPTSARGES",17]
[55270,"55270","VARENNES EN ARGONNE",17]
[55270,"55270","VAUQUOIS",17]
[55270,"55270","VERY",17]
[55290,"55290","BIENCOURT SUR ORGE",8]
[55290,"55290","BURE",8]
[55290,"55290","COUVERTPUIS",8]
[55290,"55290","HEVILLIERS",8]
[55290,"55290","MANDRES EN BARROIS",8]
[55290,"55290","MONTIERS SUR SAULX",8]
[55290,"55290","MORLEY",8]
[55290,"55290","RIBEAUCOURT",8]
[55300,"55300","AILLY SUR MEUSE",46]
[55300,"55300","AMBLY SUR MEUSE",46]
[55300,"55300","APREMONT LA FORET",46]
[55300,"55300","BANNONCOURT",46]
[55300,"55300","BISLEE",46]
[55300,"55300","BOUCONVILLE SUR MADT",46]
[55300,"55300","BOUQUEMONT",46]
[55300,"55300","BRASSEITTE",46]
[55300,"55300","BUXERULLES",46]
[55300,"55300","BUXIERES SOUS LES COTES",46]
[55300,"55300","CHAUVONCOURT",46]
[55300,"55300","DEUXNOUDS AUX BOIS",46]
[55300,"55300","DOMPCEVRIN",46]
[55300,"55300","DOMPIERRE AUX BOIS",46]
[55300,"55300","HAN SUR MEUSE",46]
[55300,"55300","KOEUR LA GRANDE",46]
[55300,"55300","KOEUR LA PETITE",46]
[55300,"55300","LACROIX SUR MEUSE",46]
[55300,"55300","LAHAYVILLE",46]
[55300,"55300","LAMORVILLE",46]
[55300,"55300","LAVIGNEVILLE",{"$f":"COUNTIF($B$2:$B$5669,B3202)","v":46}]
[55300,"55300","LES PAROCHES",46]
[55300,"55300","LIOUVILLE",46]
[55300,"55300","LOUPMONT",46]
[55300,"55300","MAIZEY",46]
[55300,"55300","MARBOTTE",46]
[55300,"55300","MECRIN",46]
[55300,"55300","MONTSEC",46]
[55300,"55300","RAMBUCOURT",46]
[55300,"55300","RANZIERES",46]
[55300,"55300","RICHECOURT",46]
[55300,"55300","ROUVROIS SUR MEUSE",46]
[55300,"55300","SAMPIGNY",46]
[55300,"55300","SAVONNIERES EN WOEVRE",46]
[55300,"55300","SENONVILLE",46]
[55300,"55300","SEUZEY",46]
[55300,"55300","SPADA",46]
[55300,"55300","ST AGNANT SOUS LES COTES",46]
[55300,"55300","ST MIHIEL",46]
[55300,"55300","TROYON",46]
[55300,"55300","VALBOIS",46]
[55300,"55300","VARNEVILLE",46]
[55300,"55300","VAUX LES PALAMEIX",46]
[55300,"55300","WOIMBEY",46]
[55300,"55300","WOINVILLE",46]
[55300,"55300","XIVRAY ET MARVOISIN",46]
[55310,"55310","TRONVILLE EN BARROIS",1]
[55320,"55320","ANCEMONT",7]
[55320,"55320","DIEUE SUR MEUSE",7]
[55320,"55320","GENICOURT SUR MEUSE",7]
[55320,"55320","LES MONTHAIRONS",7]
[55320,"55320","MOUILLY",7]
[55320,"55320","RUPT EN WOEVRE",7]
[55320,"55320","SOMMEDIEUE",7]
[55400,"55400","BLANZEE",30]
[55400,"55400","BOINVILLE EN WOEVRE",30]
[55400,"55400","BRAQUIS",30]
[55400,"55400","BUZY DARMONT",30]
[55400,"55400","CHATILLON SOUS LES COTES",30]
[55400,"55400","DAMLOUP",30]
[55400,"55400","DARMONT",30]
[55400,"55400","DIEPPE SOUS DOUAUMONT",30]
[55400,"55400","EIX",30]
[55400,"55400","ETAIN",30]
[55400,"55400","FOAMEIX ORNEL",30]
[55400,"55400","FROMEZEY",30]
[55400,"55400","GINCREY",30]
[55400,"55400","GRIMAUCOURT EN WOEVRE",30]
[55400,"55400","GUSSAINVILLE",30]
[55400,"55400","HAUTECOURT LES BROVILLE",30]
[55400,"55400","HERMEVILLE EN WOEVRE",30]
[55400,"55400","LANHERES",30]
[55400,"55400","MAUCOURT SUR ORNE",30]
[55400,"55400","MOGEVILLE",30]
[55400,"55400","MORANVILLE",30]
[55400,"55400","MORGEMOULIN",30]
[55400,"55400","MOULAINVILLE",30]
[55400,"55400","ORNEL",30]
[55400,"55400","PARFONDRUPT",30]
[55400,"55400","ROUVRES EN WOEVRE",30]
[55400,"55400","ST JEAN LES BUZY",30]
[55400,"55400","VAUX DEVANT DAMLOUP",30]
[55400,"55400","WARCQ",30]
[55400,"55400","ABAUCOURT HAUTECOURT",30]
[55500,"55500","BOVIOLLES",{"$f":"COUNTIF($B$2:$B$5669,B3266)","v":35}]
[55500,"55500","CHANTERAINE",35]
[55500,"55500","CHENNEVIERES",35]
[55500,"55500","COUSANCES AU BOIS",35]
[55500,"55500","COUSANCES LES TRICONVILLE",35]
[55500,"55500","DAGONVILLE",35]
[55500,"55500","DAMMARIE SUR SAULX",35]
[55500,"55500","DOMREMY AUX BOIS",35]
[55500,"55500","ERNEVILLE AUX BOIS",35]
[55500,"55500","FOUCHERES AUX BOIS",35]
[55500,"55500","GIVRAUVAL",35]
[55500,"55500","GRIMAUCOURT PRES SAMPIGNY",35]
[55500,"55500","LE BOUCHON SUR SAULX",35]
[55500,"55500","LIGNY EN BARROIS",35]
[55500,"55500","LONGEAUX",35]
[55500,"55500","LOXEVILLE",35]
[55500,"55500","MAULAN",35]
[55500,"55500","MENAUCOURT",35]
[55500,"55500","MENIL SUR SAULX",35]
[55500,"55500","NAIX AUX FORGES",35]
[55500,"55500","NANCOIS LE GRAND",35]
[55500,"55500","NANCOIS SUR ORNAIN",35]
[55500,"55500","NANT LE GRAND",35]
[55500,"55500","NANT LE PETIT",35]
[55500,"55500","NANTOIS",35]
[55500,"55500","OEY",35]
[55500,"55500","SAULVAUX",35]
[55500,"55500","ST AMAND SUR ORNAIN",35]
[55500,"55500","ST AUBIN SUR AIRE",35]
[55500,"55500","STAINVILLE",35]
[55500,"55500","VAUX LA GRANDE",35]
[55500,"55500","VAUX LA PETITE",35]
[55500,"55500","VELAINES",35]
[55500,"55500","VILLERS LE SEC",35]
[55500,"55500","WILLERONCOURT",35]
[55600,"55600","AVIOTH",25]
[55600,"55600","BAZEILLES SUR OTHAIN",25]
[55600,"55600","BREUX",25]
[55600,"55600","CHAUVENCY LE CHATEAU",25]
[55600,"55600","CHAUVENCY ST HUBERT",25]
[55600,"55600","ECOUVIEZ",25]
[55600,"55600","FLASSIGNY",25]
[55600,"55600","HAN LES JUVIGNY",25]
[55600,"55600","IRE LE SEC",25]
[55600,"55600","JAMETZ",25]
[55600,"55600","JUVIGNY SUR LOISON",25]
[55600,"55600","LOUPPY SUR LOISON",25]
[55600,"55600","MARVILLE",25]
[55600,"55600","MONTMEDY",25]
[55600,"55600","QUINCY LANDZECOURT",25]
[55600,"55600","REMOIVILLE",25]
[55600,"55600","THONNE LA LONG",25]
[55600,"55600","THONNE LE THIL",25]
[55600,"55600","THONNE LES PRES",25]
[55600,"55600","THONNELLE",25]
[55600,"55600","VELOSNES",25]
[55600,"55600","VERNEUIL GRAND",25]
[55600,"55600","VERNEUIL PETIT",25]
[55600,"55600","VIGNEUL SOUS MONTMEDY",25]
[55600,"55600","VILLECLOYE",25]
[55700,"55700","AUTREVILLE ST LAMBERT",19]
[55700,"55700","BAALON",19]
[55700,"55700","BEAUCLAIR",19]
[55700,"55700","BEAUFORT EN ARGONNE",19]
[55700,"55700","BROUENNES",{"$f":"COUNTIF($B$2:$B$5669,B3330)","v":19}]
[55700,"55700","CESSE",19]
[55700,"55700","HALLES SOUS LES COTES",19]
[55700,"55700","INOR",19]
[55700,"55700","LAMOUILLY",19]
[55700,"55700","LANEUVILLE SUR MEUSE",19]
[55700,"55700","LUZY ST MARTIN",19]
[55700,"55700","MARTINCOURT SUR MEUSE",19]
[55700,"55700","MOULINS ST HUBERT",19]
[55700,"55700","MOUZAY",19]
[55700,"55700","NEPVANT",19]
[55700,"55700","OLIZY SUR CHIERS",19]
[55700,"55700","POUILLY SUR MEUSE",19]
[55700,"55700","STENAY",19]
[55700,"55700","WISEPPE",19]
[55800,"55800","ANDERNAY",18]
[55800,"55800","AUZECOURT",18]
[55800,"55800","BRABANT LE ROI",18]
[55800,"55800","CONTRISSON",18]
[55800,"55800","COUVONGES",18]
[55800,"55800","LAHEYCOURT",18]
[55800,"55800","LAIMONT",18]
[55800,"55800","LOUPPY LE CHATEAU",18]
[55800,"55800","MOGNEVILLE",18]
[55800,"55800","NETTANCOURT",18]
[55800,"55800","NEUVILLE SUR ORNAIN",18]
[55800,"55800","NOYERS AUZECOURT",18]
[55800,"55800","RANCOURT SUR ORNAIN",18]
[55800,"55800","REMENNECOURT",18]
[55800,"55800","REVIGNY SUR ORNAIN",18]
[55800,"55800","SOMMEILLES",18]
[55800,"55800","VASSINCOURT",18]
[55800,"55800","VILLERS AUX VENTS",18]
[57000,"57000","METZ",1]
[57050,"57050","LE BAN ST MARTIN",4]
[57050,"57050","LONGEVILLE LES METZ",4]
[57050,"57050","LORRY LES METZ",4]
[57050,"57050","PLAPPEVILLE",4]
[57070,"57070","CHIEULLES",5]
[57070,"57070","MEY",5]
[57070,"57070","ST JULIEN LES METZ",5]
[57070,"57070","VANTOUX",5]
[57070,"57070","VANY",5]
[57100,"57100","GARCHE",5]
[57100,"57100","KOEKING",5]
[57100,"57100","MANOM",5]
[57100,"57100","OEUTRANGE",5]
[57100,"57100","THIONVILLE",5]
[57110,"57110","BASSE HAM",11]
[57110,"57110","BUDLING",11]
[57110,"57110","ELZANGE",11]
[57110,"57110","ILLANGE",11]
[57110,"57110","INGLANGE",11]
[57110,"57110","KOENIGSMACKER",11]
[57110,"57110","KUNTZIG",11]
[57110,"57110","OUDRENNE",11]
[57110,"57110","STUCKANGE",11]
[57110,"57110","VALMESTROFF",11]
[57110,"57110","YUTZ",11]
[57111,"57111","AMANVILLERS",1]
[57113,"57113","BOULANGE",1]
[57114,"57114","LAUDREFANG",3]
[57114,"57114","TETING SUR NIED",3]
[57114,"57114","TRITTELING",3]
[57115,"57115","SARREINSMING",{"$f":"COUNTIF($B$2:$B$5669,B3394)","v":2}]
[57115,"57115","ZETTING",2]
[57116,"57116","BROUDERDORFF",2]
[57116,"57116","NIDERVILLER",2]
[57117,"57117","MONTOY FLANVILLE",4]
[57117,"57117","NOISSEVILLE",4]
[57117,"57117","NOUILLY",4]
[57117,"57117","RETONFEY",4]
[57118,"57118","STE MARIE AUX CHENES",1]
[57119,"57119","BROUVILLER",6]
[57119,"57119","FLEISHEIM",6]
[57119,"57119","HERANGE",6]
[57119,"57119","LIXHEIM",6]
[57119,"57119","VIEUX LIXHEIM",6]
[57119,"57119","WINTERSBOURG",6]
[57120,"57120","CLOUANGE",4]
[57120,"57120","PIERREVILLERS",4]
[57120,"57120","ROMBAS",4]
[57120,"57120","VITRY SUR ORNE",4]
[57124,"57124","ST PRIVAT LA MONTAGNE",1]
[57130,"57130","ANCY SUR MOSELLE",11]
[57130,"57130","ARS SUR MOSELLE",11]
[57130,"57130","DORNOT",11]
[57130,"57130","GRAVELOTTE",11]
[57130,"57130","JOUY AUX ARCHES",11]
[57130,"57130","JUSSY",11]
[57130,"57130","REZONVILLE",11]
[57130,"57130","STE RUFFINE",11]
[57130,"57130","VAUX",11]
[57130,"57130","VERNEVILLE",11]
[57130,"57130","VIONVILLE",11]
[57134,"57134","DISTROFF",1]
[57136,"57136","ERCHING",2]
[57136,"57136","RIMLING",2]
[57137,"57137","WITTRING",1]
[57140,"57140","LA MAXE",5]
[57140,"57140","NORROY LE VENEUR",5]
[57140,"57140","PLESNOIS",5]
[57140,"57140","SAULNY",5]
[57140,"57140","WOIPPY",5]
[57142,"57142","GONDREXANGE",1]
[57144,"57144","LUTTANGE",1]
[57145,"57145","WOUSTVILLER",1]
[57150,"57150","CREUTZWALD",1]
[57157,"57157","AUGNY",4]
[57157,"57157","JURY",4]
[57157,"57157","MARLY",4]
[57157,"57157","PELTRE",4]
[57158,"57158","MONTIGNY LES METZ",1]
[57159,"57159","BRONVAUX",2]
[57159,"57159","MARANGE SILVANGE",2]
[57160,"57160","CHATEL ST GERMAIN",6]
[57160,"57160","LESSY",6]
[57160,"57160","MOULINS LES METZ",6]
[57160,"57160","MOULINS ST PIERRE",6]
[57160,"57160","ROZERIEULLES",6]
[57160,"57160","SCY CHAZELLES",6]
[57170,"57170","AMELECOURT",30]
[57170,"57170","ATTILLONCOURT",30]
[57170,"57170","BEZANGE LA PETITE",30]
[57170,"57170","BIONCOURT",30]
[57170,"57170","BURLIONCOURT",30]
[57170,"57170","CHAMBREY",30]
[57170,"57170","CHATEAU SALINS",30]
[57170,"57170","CHATEAU VOUE",{"$f":"COUNTIF($B$2:$B$5669,B3458)","v":30}]
[57170,"57170","COUTURES",30]
[57170,"57170","DEDELING",30]
[57170,"57170","FRESNES EN SAULNOIS",30]
[57170,"57170","GERBECOURT",30]
[57170,"57170","GREMECEY",30]
[57170,"57170","HAMPONT",30]
[57170,"57170","HARAUCOURT SUR SEILLE",30]
[57170,"57170","JUVELIZE",30]
[57170,"57170","LEZEY",30]
[57170,"57170","LUBECOURT",30]
[57170,"57170","MARSAL",30]
[57170,"57170","MORVILLE LES VIC",30]
[57170,"57170","MOYENVIC",30]
[57170,"57170","OBRECK",30]
[57170,"57170","PETTONCOURT",30]
[57170,"57170","PUTTIGNY",30]
[57170,"57170","SALONNES",30]
[57170,"57170","SOTZELING",30]
[57170,"57170","VAXY",30]
[57170,"57170","VIC SUR SEILLE",30]
[57170,"57170","WUISSE",30]
[57170,"57170","XANREY",30]
[57175,"57175","GANDRANGE",1]
[57180,"57180","TERVILLE",1]
[57190,"57190","EBANGE",2]
[57190,"57190","FLORANGE",2]
[57200,"57200","BLIES EBERSING",9]
[57200,"57200","BLIES GUERSVILLER",9]
[57200,"57200","BLIESBRUCK",9]
[57200,"57200","FOLPERSVILLER",9]
[57200,"57200","FRAUENBERG",9]
[57200,"57200","REMELFING",9]
[57200,"57200","SARREGUEMINES",9]
[57200,"57200","WIESVILLER",9]
[57200,"57200","WOELFLING LES SARREGUEMINES",9]
[57210,"57210","FEVES",4]
[57210,"57210","HAUCONCOURT",4]
[57210,"57210","MAIZIERES LES METZ",4]
[57210,"57210","SEMECOURT",4]
[57220,"57220","BAMBIDERSTROFF",42]
[57220,"57220","BANNAY",42]
[57220,"57220","BETTANGE",42]
[57220,"57220","BIONVILLE SUR NIED",42]
[57220,"57220","BISTEN EN LORRAINE",42]
[57220,"57220","BOUCHEPORN",42]
[57220,"57220","BOULAY MOSELLE",42]
[57220,"57220","BROUCK",42]
[57220,"57220","BURTONCOURT",42]
[57220,"57220","CHARLEVILLE SOUS BOIS",42]
[57220,"57220","CONDE NORTHEN",42]
[57220,"57220","COUME",42]
[57220,"57220","DENTING",42]
[57220,"57220","EBLANGE",42]
[57220,"57220","FOULIGNY",42]
[57220,"57220","GOMELANGE",42]
[57220,"57220","GUINKIRCHEN",42]
[57220,"57220","GUIRLANGE",42]
[57220,"57220","HALLERING",42]
[57220,"57220","HALLING LES BOULAY",42]
[57220,"57220","HAUTE VIGNEULLES",42]
[57220,"57220","HELSTROFF",42]
[57220,"57220","HINCKANGE",42]
[57220,"57220","HOLLING",42]
[57220,"57220","LOUTREMANGE",{"$f":"COUNTIF($B$2:$B$5669,B3522)","v":42}]
[57220,"57220","MARANGE ZONDRANGE",42]
[57220,"57220","MEGANGE",42]
[57220,"57220","MOMERSTROFF",42]
[57220,"57220","NARBEFONTAINE",42]
[57220,"57220","NIEDERVISSE",42]
[57220,"57220","OBERVISSE",42]
[57220,"57220","OTTONVILLE",42]
[57220,"57220","PIBLANGE",42]
[57220,"57220","ROUPELDANGE",42]
[57220,"57220","ST BERNARD",42]
[57220,"57220","TETERCHEN",42]
[57220,"57220","VALMUNSTER",42]
[57220,"57220","VARIZE",42]
[57220,"57220","VAUDONCOURT",42]
[57220,"57220","VELVING",42]
[57220,"57220","VOLMERANGE LES BOULAY",42]
[57220,"57220","ZIMMING",42]
[57230,"57230","BAERENTHAL",12]
[57230,"57230","BITCHE",12]
[57230,"57230","BOUSSEVILLER",12]
[57230,"57230","EGUELSHARDT",12]
[57230,"57230","HANVILLER",12]
[57230,"57230","HASPELSCHIEDT",12]
[57230,"57230","LIEDERSCHIEDT",12]
[57230,"57230","PHILIPPSBOURG",12]
[57230,"57230","REYERSVILLER",12]
[57230,"57230","ROPPEVILLER",12]
[57230,"57230","SCHORBACH",12]
[57230,"57230","STURZELBRONN",12]
[57240,"57240","KNUTANGE",2]
[57240,"57240","NILVANGE",2]
[57250,"57250","FROIDCUL",3]
[57250,"57250","MOYEUVRE GRANDE",3]
[57250,"57250","MOYEUVRE PETITE",3]
[57260,"57260","BASSING",21]
[57260,"57260","BIDESTROFF",21]
[57260,"57260","BLANCHE EGLISE",21]
[57260,"57260","BOURGALTROFF",21]
[57260,"57260","CUTTING",21]
[57260,"57260","DIEUZE",21]
[57260,"57260","DOMNOM LES DIEUZE",21]
[57260,"57260","GELUCOURT",21]
[57260,"57260","GUEBESTROFF",21]
[57260,"57260","GUEBLANGE LES DIEUZE",21]
[57260,"57260","GUEBLING",21]
[57260,"57260","KERPRICH LES DIEUZE",21]
[57260,"57260","LINDRE BASSE",21]
[57260,"57260","LINDRE HAUTE",21]
[57260,"57260","MULCEY",21]
[57260,"57260","RORBACH LES DIEUZE",21]
[57260,"57260","ST MEDARD",21]
[57260,"57260","TARQUIMPOL",21]
[57260,"57260","VAL DE BRIDE",21]
[57260,"57260","VERGAVILLE",21]
[57260,"57260","ZOMMANGE",21]
[57270,"57270","RICHEMONT",2]
[57270,"57270","UCKANGE",2]
[57290,"57290","FAMECK",4]
[57290,"57290","OURY",4]
[57290,"57290","REMELANGE",4]
[57290,"57290","SEREMANGE ERZANGE",4]
[57300,"57300","AY SUR MOSELLE",5]
[57300,"57300","HAGONDANGE",5]
[57300,"57300","MONDELANGE",{"$f":"COUNTIF($B$2:$B$5669,B3586)","v":5}]
[57300,"57300","TALANGE",5]
[57300,"57300","TREMERY",5]
[57310,"57310","BERTRANGE",4]
[57310,"57310","BOUSSE",4]
[57310,"57310","GUENANGE",4]
[57310,"57310","RURANGE LES THIONVILLE",4]
[57320,"57320","ALZING",26]
[57320,"57320","ANZELING",26]
[57320,"57320","BIBICHE",26]
[57320,"57320","BOUZONVILLE",26]
[57320,"57320","BRETTNACH",26]
[57320,"57320","CHATEAU ROUGE",26]
[57320,"57320","CHEMERY LES DEUX",26]
[57320,"57320","COLMEN",26]
[57320,"57320","DALSTEIN",26]
[57320,"57320","EBERSVILLER",26]
[57320,"57320","FILSTROFF",26]
[57320,"57320","FLASTROFF",26]
[57320,"57320","FREISTROFF",26]
[57320,"57320","GUERSTLING",26]
[57320,"57320","HEINING LES BOUZONVILLE",26]
[57320,"57320","HESTROFF",26]
[57320,"57320","MENSKIRCH",26]
[57320,"57320","NEUNKIRCHEN LES BOUZONVILLE",26]
[57320,"57320","OBERDORFF",26]
[57320,"57320","REMELFANG",26]
[57320,"57320","SCHWERDORFF",26]
[57320,"57320","ST FRANCOIS LACROIX",26]
[57320,"57320","TROMBORN",26]
[57320,"57320","VAUDRECHING",26]
[57320,"57320","VOELFLING LES BOUZONVILLE",26]
[57320,"57320","WALDWEISTROFF",26]
[57330,"57330","ENTRANGE",7]
[57330,"57330","ESCHERANGE",7]
[57330,"57330","HETTANGE GRANDE",7]
[57330,"57330","KANFEN",7]
[57330,"57330","ROUSSY LE VILLAGE",7]
[57330,"57330","VOLMERANGE LES MINES",7]
[57330,"57330","ZOUFFTGEN",7]
[57340,"57340","ACHAIN",28]
[57340,"57340","BARONVILLE",28]
[57340,"57340","BELLANGE",28]
[57340,"57340","BERMERING",28]
[57340,"57340","BREHAIN",28]
[57340,"57340","BRULANGE",28]
[57340,"57340","CHATEAU BREHAIN",28]
[57340,"57340","CONTHIL",28]
[57340,"57340","DALHAIN",28]
[57340,"57340","DESTRY",28]
[57340,"57340","EINCHEVILLE",28]
[57340,"57340","HABOUDANGE",28]
[57340,"57340","HARPRICH",28]
[57340,"57340","LANDROFF",28]
[57340,"57340","LIDREZING",28]
[57340,"57340","MARTHILLE",28]
[57340,"57340","MORHANGE",28]
[57340,"57340","PEVANGE",28]
[57340,"57340","RACRANGE",28]
[57340,"57340","RICHE",28]
[57340,"57340","RODALBE",28]
[57340,"57340","SUISSE",28]
[57340,"57340","VALLERANGE",28]
[57340,"57340","VANNECOURT",28]
[57340,"57340","VILLER",{"$f":"COUNTIF($B$2:$B$5669,B3650)","v":28}]
[57340,"57340","VILLERS SUR NIED",28]
[57340,"57340","VIRMING",28]
[57340,"57340","ZARBELING",28]
[57350,"57350","HABSTERDICK",5]
[57350,"57350","LA BREME D'OR",5]
[57350,"57350","SPICHEREN",5]
[57350,"57350","STIRING WENDEL",5]
[57350,"57350","VERRERIE SOPHIE",5]
[57360,"57360","AMNEVILLE",1]
[57370,"57370","BERLING",15]
[57370,"57370","BICKENHOLTZ",15]
[57370,"57370","BOURSCHEID",15]
[57370,"57370","DANNE ET QUATRE VENTS",15]
[57370,"57370","HANGVILLER",15]
[57370,"57370","METTING",15]
[57370,"57370","MITTELBRONN",15]
[57370,"57370","PHALSBOURG",15]
[57370,"57370","SCHALBACH",15]
[57370,"57370","ST JEAN KOURTZERODE",15]
[57370,"57370","VECKERSVILLER",15]
[57370,"57370","VESCHEIM",15]
[57370,"57370","VILSBERG",15]
[57370,"57370","WALTEMBOURG",15]
[57370,"57370","ZILLING",15]
[57380,"57380","ADELANGE",13]
[57380,"57380","ARRAINCOURT",13]
[57380,"57380","BOUSTROFF",13]
[57380,"57380","CHEMERY",13]
[57380,"57380","FAULQUEMONT",13]
[57380,"57380","GUESSLING HEMERING",13]
[57380,"57380","HOLACOURT",13]
[57380,"57380","MAINVILLERS",13]
[57380,"57380","MANY",13]
[57380,"57380","PONTPIERRE",13]
[57380,"57380","THICOURT",13]
[57380,"57380","THONVILLE",13]
[57380,"57380","VAHL LES FAULQUEMONT",13]
[57390,"57390","AUDUN LE TICHE",3]
[57390,"57390","REDANGE",3]
[57390,"57390","RUSSANGE",3]
[57400,"57400","ARZVILLER",14]
[57400,"57400","BUHL LORRAINE",14]
[57400,"57400","DOLVING",14]
[57400,"57400","GUNTZVILLER",14]
[57400,"57400","HAUT CLOCHER",14]
[57400,"57400","HESSE",14]
[57400,"57400","HILBESHEIM",14]
[57400,"57400","HOMMARTING",14]
[57400,"57400","IMLING",14]
[57400,"57400","LANGATTE",14]
[57400,"57400","REDING",14]
[57400,"57400","SARRALTROFF",14]
[57400,"57400","SARREBOURG",14]
[57400,"57400","SCHNECKENBUSCH",14]
[57410,"57410","ACHEN",14]
[57410,"57410","BETTVILLER",14]
[57410,"57410","BINING",14]
[57410,"57410","ENCHENBERG",14]
[57410,"57410","ETTING",14]
[57410,"57410","GROS REDERCHING",14]
[57410,"57410","KALHAUSEN",14]
[57410,"57410","LAMBACH",14]
[57410,"57410","MONTBRONN",14]
[57410,"57410","PETIT REDERCHING",{"$f":"COUNTIF($B$2:$B$5669,B3714)","v":14}]
[57410,"57410","RAHLING",14]
[57410,"57410","ROHRBACH LES BITCHE",14]
[57410,"57410","SCHMITTVILLER",14]
[57410,"57410","SIERSTHAL",14]
[57420,"57420","BUCHY",33]
[57420,"57420","CHEMINOT",33]
[57420,"57420","CHERISEY",33]
[57420,"57420","CHESNY",33]
[57420,"57420","COIN LES CUVRY",33]
[57420,"57420","COIN SUR SEILLE",33]
[57420,"57420","CUVRY",33]
[57420,"57420","FEY",33]
[57420,"57420","FLEURY",33]
[57420,"57420","FOVILLE",33]
[57420,"57420","GOIN",33]
[57420,"57420","LIEHON",33]
[57420,"57420","LORRY MARDIGNY",33]
[57420,"57420","LOUVIGNY",33]
[57420,"57420","MARIEULLES",33]
[57420,"57420","MECLEUVES",33]
[57420,"57420","MONCHEUX",33]
[57420,"57420","ORNY",33]
[57420,"57420","PAGNY LES GOIN",33]
[57420,"57420","POMMERIEUX",33]
[57420,"57420","PONTOY",33]
[57420,"57420","POUILLY",33]
[57420,"57420","POURNOY LA CHETIVE",33]
[57420,"57420","POURNOY LA GRASSE",33]
[57420,"57420","SAILLY ACHATEL",33]
[57420,"57420","SECOURT",33]
[57420,"57420","SILLEGNY",33]
[57420,"57420","SILLY EN SAULNOIS",33]
[57420,"57420","SOLGNE",33]
[57420,"57420","ST JURE",33]
[57420,"57420","VERNY",33]
[57420,"57420","VIGNY",33]
[57420,"57420","VULMONT",33]
[57430,"57430","HAZEMBOURG",6]
[57430,"57430","KAPPELKINGER",6]
[57430,"57430","KIRVILLER",6]
[57430,"57430","LE VAL DE GUEBLANGE",6]
[57430,"57430","SARRALBE",6]
[57430,"57430","WILLERWALD",6]
[57440,"57440","ALGRANGE",2]
[57440,"57440","ANGEVILLERS",2]
[57450,"57450","BARST",7]
[57450,"57450","CAPPEL",7]
[57450,"57450","FAREBERSVILLER",7]
[57450,"57450","FARSCHVILLER",7]
[57450,"57450","HENRIVILLE",7]
[57450,"57450","SEINGBOUSE",7]
[57450,"57450","THEDING",7]
[57460,"57460","BEHREN LES FORBACH",4]
[57460,"57460","BOUSBACH",4]
[57460,"57460","ETZLING",4]
[57460,"57460","KERBACH",4]
[57470,"57470","GUENVILLER",2]
[57470,"57470","HOMBOURG HAUT",2]
[57480,"57480","APACH",21]
[57480,"57480","CONTZ LES BAINS",21]
[57480,"57480","GRINDORFF",21]
[57480,"57480","HALSTROFF",21]
[57480,"57480","HAUTE KONTZ",21]
[57480,"57480","HUNTING",{"$f":"COUNTIF($B$2:$B$5669,B3778)","v":21}]
[57480,"57480","KERLING LES SIERCK",21]
[57480,"57480","KIRSCH LES SIERCK",21]
[57480,"57480","KIRSCHNAUMEN",21]
[57480,"57480","LAUMESFELD",21]
[57480,"57480","LAUNSTROFF",21]
[57480,"57480","MALLING",21]
[57480,"57480","MANDEREN",21]
[57480,"57480","MERSCHWEILLER",21]
[57480,"57480","MONTENACH",21]
[57480,"57480","REMELING",21]
[57480,"57480","RETTEL",21]
[57480,"57480","RITZING",21]
[57480,"57480","RUSTROFF",21]
[57480,"57480","SIERCK LES BAINS",21]
[57480,"57480","WALDWISSE",21]
[57490,"57490","CARLING",2]
[57490,"57490","L'HOPITAL",2]
[57500,"57500","ST AVOLD",1]
[57510,"57510","ERNESTVILLER",11]
[57510,"57510","GRUNDVILLER",11]
[57510,"57510","GUEBENHOUSE",11]
[57510,"57510","HILSPRICH",11]
[57510,"57510","HOLVING",11]
[57510,"57510","HOSTE",11]
[57510,"57510","LOUPERSHOUSE",11]
[57510,"57510","PUTTELANGE AUX LACS",11]
[57510,"57510","REMERING LES PUTTELANGE",11]
[57510,"57510","RICHELING",11]
[57510,"57510","ST JEAN ROHRBACH",11]
[57520,"57520","ALSTING",4]
[57520,"57520","GROSBLIEDERSTROFF",4]
[57520,"57520","LIXING LES ROUHLING",4]
[57520,"57520","ROUHLING",4]
[57530,"57530","ARS LAQUENEXY",21]
[57530,"57530","BAZONCOURT",21]
[57530,"57530","COINCY",21]
[57530,"57530","COLLIGNY",21]
[57530,"57530","COURCELLES CHAUSSY",21]
[57530,"57530","COURCELLES SUR NIED",21]
[57530,"57530","GLATIGNY",21]
[57530,"57530","HAYES",21]
[57530,"57530","LANDONVILLERS",21]
[57530,"57530","LAQUENEXY",21]
[57530,"57530","LES ETANGS",21]
[57530,"57530","MAIZEROY",21]
[57530,"57530","MAIZERY",21]
[57530,"57530","MARSILLY",21]
[57530,"57530","OGY",21]
[57530,"57530","PANGE",21]
[57530,"57530","RAVILLE",21]
[57530,"57530","SANRY SUR NIED",21]
[57530,"57530","SERVIGNY LES RAVILLE",21]
[57530,"57530","SILLY SUR NIED",21]
[57530,"57530","VILLERS STONCOURT",21]
[57540,"57540","PETITE ROSSELLE",1]
[57550,"57550","BERVILLER EN MOSELLE",7]
[57550,"57550","DALEM",7]
[57550,"57550","FALCK",7]
[57550,"57550","HARGARTEN AUX MINES",7]
[57550,"57550","MERTEN",7]
[57550,"57550","REMERING LES HARGARTEN",7]
[57550,"57550","VILLING",7]
[57560,"57560","ABRESCHVILLER",9]
[57560,"57560","LAFRIMBOLLE",{"$f":"COUNTIF($B$2:$B$5669,B3842)","v":9}]
[57560,"57560","METAIRIES ST QUIRIN",9]
[57560,"57560","NIDERHOFF",9]
[57560,"57560","NITTING",9]
[57560,"57560","ST QUIRIN",9]
[57560,"57560","TURQUESTEIN BLANCRUPT",9]
[57560,"57560","VASPERVILLER",9]
[57560,"57560","VOYER",9]
[57570,"57570","BASSE RENTGEN",13]
[57570,"57570","BERG SUR MOSELLE",13]
[57570,"57570","BEYREN LES SIERCK",13]
[57570,"57570","BOUST",13]
[57570,"57570","BREISTROFF LA GRANDE",13]
[57570,"57570","CATTENOM",13]
[57570,"57570","EVRANGE",13]
[57570,"57570","FIXEM",13]
[57570,"57570","GAVISSE",13]
[57570,"57570","HAGEN",13]
[57570,"57570","MONDORFF",13]
[57570,"57570","PUTTELANGE LES THIONVILLE",13]
[57570,"57570","RODEMACK",13]
[57580,"57580","ADAINCOURT",23]
[57580,"57580","ANCERVILLE",23]
[57580,"57580","ARRIANCE",23]
[57580,"57580","AUBE",23]
[57580,"57580","BAUDRECOURT",23]
[57580,"57580","BECHY",23]
[57580,"57580","BEUX",23]
[57580,"57580","CHANVILLE",23]
[57580,"57580","CHENOIS",23]
[57580,"57580","FLOCOURT",23]
[57580,"57580","HAN SUR NIED",23]
[57580,"57580","HERNY",23]
[57580,"57580","LEMUD",23]
[57580,"57580","LESSE",23]
[57580,"57580","LUPPY",23]
[57580,"57580","REMILLY",23]
[57580,"57580","SORBEY",23]
[57580,"57580","ST EPVRE",23]
[57580,"57580","THIMONVILLE",23]
[57580,"57580","TRAGNY",23]
[57580,"57580","VATIMONT",23]
[57580,"57580","VITTONCOURT",23]
[57580,"57580","VOIMHAUT",23]
[57590,"57590","ABONCOURT SUR SEILLE",29]
[57590,"57590","AJONCOURT",29]
[57590,"57590","ALAINCOURT LA COTE",29]
[57590,"57590","AULNOIS SUR SEILLE",29]
[57590,"57590","BACOURT",29]
[57590,"57590","CHICOURT",29]
[57590,"57590","CRAINCOURT",29]
[57590,"57590","DELME",29]
[57590,"57590","DONJEUX",29]
[57590,"57590","FONTENY",29]
[57590,"57590","FOSSIEUX",29]
[57590,"57590","FREMERY",29]
[57590,"57590","HANNOCOURT",29]
[57590,"57590","JALLAUCOURT",29]
[57590,"57590","JUVILLE",29]
[57590,"57590","LANEUVEVILLE EN SAULNOIS",29]
[57590,"57590","LEMONCOURT",29]
[57590,"57590","LIOCOURT",29]
[57590,"57590","LUCY",29]
[57590,"57590","MALAUCOURT SUR SEILLE",29]
[57590,"57590","MANHOUE",{"$f":"COUNTIF($B$2:$B$5669,B3906)","v":29}]
[57590,"57590","MORVILLE SUR NIED",29]
[57590,"57590","ORIOCOURT",29]
[57590,"57590","ORON",29]
[57590,"57590","PREVOCOURT",29]
[57590,"57590","PUZIEUX",29]
[57590,"57590","TINCRY",29]
[57590,"57590","VIVIERS",29]
[57590,"57590","XOCOURT",29]
[57600,"57600","FOLKLING",7]
[57600,"57600","FORBACH",7]
[57600,"57600","KREUTZBERG",7]
[57600,"57600","MARIENAU",7]
[57600,"57600","MORSBACH",7]
[57600,"57600","OETING",7]
[57600,"57600","SCHOENECK",7]
[57620,"57620","GOETZENBRUCK",5]
[57620,"57620","LEMBERG",5]
[57620,"57620","MOUTERHOUSE",5]
[57620,"57620","SARREINSBERG",5]
[57620,"57620","ST LOUIS LES BITCHE",5]
[57640,"57640","ANTILLY",16]
[57640,"57640","ARGANCY",16]
[57640,"57640","BETTELAINVILLE",16]
[57640,"57640","CHAILLY LES ENNERY",16]
[57640,"57640","CHARLY ORADOUR",16]
[57640,"57640","ENNERY",16]
[57640,"57640","FAILLY",16]
[57640,"57640","FLEVY",16]
[57640,"57640","MALROY",16]
[57640,"57640","SANRY LES VIGY",16]
[57640,"57640","SERVIGNY LES STE BARBE",16]
[57640,"57640","ST HUBERT",16]
[57640,"57640","STE BARBE",16]
[57640,"57640","VIGY",16]
[57640,"57640","VREMY",16]
[57640,"57640","VRY",16]
[57650,"57650","FONTOY",3]
[57650,"57650","HAVANGE",3]
[57650,"57650","LOMMERANGE",3]
[57660,"57660","ALTRIPPE",18]
[57660,"57660","BERIG VINTRANGE",18]
[57660,"57660","BIDING",18]
[57660,"57660","BISTROFF",18]
[57660,"57660","DIFFEMBACH LES HELLIMER",18]
[57660,"57660","ERSTROFF",18]
[57660,"57660","FREMESTROFF",18]
[57660,"57660","FREYBOUSE",18]
[57660,"57660","GRENING",18]
[57660,"57660","GROSTENQUIN",18]
[57660,"57660","HELLIMER",18]
[57660,"57660","LANING",18]
[57660,"57660","LELLING",18]
[57660,"57660","LEYVILLER",18]
[57660,"57660","LIXING LES ST AVOLD",18]
[57660,"57660","MAXSTADT",18]
[57660,"57660","PETIT TENQUIN",18]
[57660,"57660","VAHL EBERSING",18]
[57670,"57670","ALBESTROFF",24]
[57670,"57670","BENESTROFF",24]
[57670,"57670","FRANCALTROFF",24]
[57670,"57670","GIVRYCOURT",24]
[57670,"57670","GUINZELING",24]
[57670,"57670","HONSKIRCH",24]
[57670,"57670","INSMING",{"$f":"COUNTIF($B$2:$B$5669,B3970)","v":24}]
[57670,"57670","INSVILLER",24]
[57670,"57670","LENING",24]
[57670,"57670","LHOR",24]
[57670,"57670","LOSTROFF",24]
[57670,"57670","LOUDREFING",24]
[57670,"57670","MARIMONT LES BENESTROFF",24]
[57670,"57670","MOLRING",24]
[57670,"57670","MONTDIDIER",24]
[57670,"57670","MUNSTER",24]
[57670,"57670","NEBING",24]
[57670,"57670","NELLING",24]
[57670,"57670","NEUFVILLAGE",24]
[57670,"57670","RENING",24]
[57670,"57670","TORCHEVILLE",24]
[57670,"57670","VAHL LES BENESTROFF",24]
[57670,"57670","VIBERSVILLER",24]
[57670,"57670","VITTERSBOURG",24]
[57680,"57680","ARRY",4]
[57680,"57680","CORNY SUR MOSELLE",4]
[57680,"57680","GORZE",4]
[57680,"57680","NOVEANT SUR MOSELLE",4]
[57690,"57690","CREHANGE",5]
[57690,"57690","ELVANGE",5]
[57690,"57690","FLETRANGE",5]
[57690,"57690","GUINGLANGE",5]
[57690,"57690","HEMILLY",5]
[57700,"57700","HAYANGE",5]
[57700,"57700","MARSPICH",5]
[57700,"57700","NEUFCHEF",5]
[57700,"57700","RANGUEVAUX",5]
[57700,"57700","ST NICOLAS EN FORET",5]
[57710,"57710","AUMETZ",3]
[57710,"57710","BURE",3]
[57710,"57710","TRESSANGE",3]
[57720,"57720","BREIDENBACH",13]
[57720,"57720","EPPING",13]
[57720,"57720","HOTTVILLER",13]
[57720,"57720","LENGELSHEIM",13]
[57720,"57720","LOUTZVILLER",13]
[57720,"57720","NOUSSEVILLER LES BITCHE",13]
[57720,"57720","OBERGAILBACH",13]
[57720,"57720","ORMERSVILLER",13]
[57720,"57720","ROLBING",13]
[57720,"57720","SCHWEYEN",13]
[57720,"57720","VOLMUNSTER",13]
[57720,"57720","WALDHOUSE",13]
[57720,"57720","WALSCHBRONN",13]
[57730,"57730","ALTVILLER",6]
[57730,"57730","FOLSCHVILLER",6]
[57730,"57730","LACHAMBRE",6]
[57730,"57730","MACHEREN",6]
[57730,"57730","PETIT EBERSVILLER",6]
[57730,"57730","VALMONT",6]
[57740,"57740","LONGEVILLE LES ST AVOLD",1]
[57770,"57770","MOUSSEY",1]
[57780,"57780","ROSSELANGE",1]
[57790,"57790","HERMELANGE",2]
[57790,"57790","LORQUIN",2]
[57800,"57800","BELLE ROCHE",7]
[57800,"57800","BENING LES ST AVOLD",7]
[57800,"57800","BETTING LES ST AVOLD",7]
[57800,"57800","COCHEREN",7]
[57800,"57800","FREYMING MERLEBACH",7]
[57800,"57800","MERLEBACH",{"$f":"COUNTIF($B$2:$B$5669,B4034)","v":7}]
[57800,"57800","ROSBRUCK",7]
[57810,"57810","ASSENONCOURT",15]
[57810,"57810","AVRICOURT",15]
[57810,"57810","AZOUDANGE",15]
[57810,"57810","BOURDONNAY",15]
[57810,"57810","DONNELAY",15]
[57810,"57810","FRIBOURG",15]
[57810,"57810","GUERMANGE",15]
[57810,"57810","LAGARDE",15]
[57810,"57810","LANGUIMBERG",15]
[57810,"57810","LEY",15]
[57810,"57810","MAIZIERES LES VIC",15]
[57810,"57810","MONCOURT",15]
[57810,"57810","OMMERAY",15]
[57810,"57810","RECHICOURT LE CHATEAU",15]
[57810,"57810","RHODES",15]
[57820,"57820","DANNELBOURG",6]
[57820,"57820","GARREBOURG",6]
[57820,"57820","HENRIDORFF",6]
[57820,"57820","HULTEHOUSE",6]
[57820,"57820","LUTZELBOURG",6]
[57820,"57820","ST LOUIS",6]
[57830,"57830","ASPACH",17]
[57830,"57830","BARCHAIN",17]
[57830,"57830","BEBING",17]
[57830,"57830","DIANE CAPELLE",17]
[57830,"57830","FOULCREY",17]
[57830,"57830","FRAQUELFING",17]
[57830,"57830","HATTIGNY",17]
[57830,"57830","HEMING",17]
[57830,"57830","HERTZING",17]
[57830,"57830","IBIGNY",17]
[57830,"57830","KERPRICH AUX BOIS",17]
[57830,"57830","LANDANGE",17]
[57830,"57830","LANEUVEVILLE LES LORQUIN",17]
[57830,"57830","NEUFMOULINS",17]
[57830,"57830","RICHEVAL",17]
[57830,"57830","ST GEORGES",17]
[57830,"57830","XOUAXANGE",17]
[57840,"57840","OTTANGE",2]
[57840,"57840","ROCHONVILLERS",2]
[57850,"57850","DABO",3]
[57850,"57850","HASELBOURG",3]
[57850,"57850","SCHAEFERHOF",3]
[57860,"57860","MALANCOURT LA MONTAGNE",3]
[57860,"57860","MONTOIS LA MONTAGNE",3]
[57860,"57860","RONCOURT",3]
[57870,"57870","HARREBERG",7]
[57870,"57870","HARTZVILLER",7]
[57870,"57870","HOMMERT",7]
[57870,"57870","PLAINE DE WALSCH",7]
[57870,"57870","TROISFONTAINES",7]
[57870,"57870","VALLERYSTHAL",7]
[57870,"57870","WALSCHEID",7]
[57880,"57880","GUERTING",3]
[57880,"57880","HAM SOUS VARSBERG",3]
[57880,"57880","VARSBERG",3]
[57890,"57890","DIESEN",2]
[57890,"57890","PORCELETTE",2]
[57910,"57910","HAMBACH",2]
[57910,"57910","NEUFGRANGE",2]
[57920,"57920","ABONCOURT",9]
[57920,"57920","BUDING",9]
[57920,"57920","HOMBOURG BUDANGE",{"$f":"COUNTIF($B$2:$B$5669,B4098)","v":9}]
[57920,"57920","KEDANGE SUR CANNER",9]
[57920,"57920","KEMPLICH",9]
[57920,"57920","KLANG",9]
[57920,"57920","METZERESCHE",9]
[57920,"57920","MONNEREN",9]
[57920,"57920","VECKRING",9]
[57930,"57930","ANGVILLER LES BISPING",15]
[57930,"57930","BELLES FORETS",15]
[57930,"57930","BERTHELMING",15]
[57930,"57930","BETTBORN",15]
[57930,"57930","BISPING",15]
[57930,"57930","DESSELING",15]
[57930,"57930","FENETRANGE",15]
[57930,"57930","GOSSELMING",15]
[57930,"57930","HELLERING LES FENETRANGE",15]
[57930,"57930","MITTERSHEIM",15]
[57930,"57930","NIEDERSTINZEL",15]
[57930,"57930","OBERSTINZEL",15]
[57930,"57930","POSTROFF",15]
[57930,"57930","ROMELFING",15]
[57930,"57930","ST JEAN DE BASSEL",15]
[57940,"57940","METZERVISSE",2]
[57940,"57940","VOLSTROFF",2]
[57960,"57960","MEISENTHAL",2]
[57960,"57960","SOUCHT",2]
[57980,"57980","DIEBLING",3]
[57980,"57980","METZING",3]
[57980,"57980","TENTELING",3]
[57990,"57990","HUNDLING",3]
[57990,"57990","IPPLING",3]
[57990,"57990","NOUSSEVILLER ST NABOR",3]
[67000,"67000","STRASBOURG",1]
[67110,"67110","DAMBACH",15]
[67110,"67110","EBERBACH",15]
[67110,"67110","GRIESBACH",15]
[67110,"67110","GUMBRECHTSHOFFEN",15]
[67110,"67110","GUNDERSHOFFEN",15]
[67110,"67110","JAEGERTHAL",15]
[67110,"67110","NEHWILLER PRES WOERTH",15]
[67110,"67110","NEUNHOFFEN",15]
[67110,"67110","NIEDERBRONN LES BAINS",15]
[67110,"67110","OBERBRONN ZINSWILLER",15]
[67110,"67110","REICHSHOFFEN",15]
[67110,"67110","SCHIRLENHOF",15]
[67110,"67110","UTTENHOFFEN",15]
[67110,"67110","WINDSTEIN",15]
[67110,"67110","ZINSWILLER",15]
[67112,"67112","BREUSCHWICKERSHEIM",1]
[67113,"67113","BLAESHEIM",1]
[67114,"67114","ESCHAU",1]
[67115,"67115","PLOBSHEIM",1]
[67116,"67116","REICHSTETT",1]
[67117,"67117","DOSSENHEIM KOCHERSBERG",7]
[67117,"67117","FESSENHEIM LE BAS",7]
[67117,"67117","FURDENHEIM",7]
[67117,"67117","HANDSCHUHEIM",7]
[67117,"67117","HURTIGHEIM",7]
[67117,"67117","ITTENHEIM",7]
[67117,"67117","QUATZENHEIM",7]
[67120,"67120","ALTORF",13]
[67120,"67120","AVOLSHEIM",13]
[67120,"67120","CANAL",13]
[67120,"67120","DACHSTEIN",13]
[67120,"67120","DORLISHEIM",{"$f":"COUNTIF($B$2:$B$5669,B4162)","v":13}]
[67120,"67120","DUPPIGHEIM",13]
[67120,"67120","DUTTLENHEIM",13]
[67120,"67120","ERGERSHEIM",13]
[67120,"67120","ERNOLSHEIM BRUCHE",13]
[67120,"67120","KOLBSHEIM",13]
[67120,"67120","MOLSHEIM",13]
[67120,"67120","SOULTZ LES BAINS",13]
[67120,"67120","WOLXHEIM",13]
[67130,"67130","BAREMBACH",26]
[67130,"67130","BELLEFOSSE",26]
[67130,"67130","BELMONT",26]
[67130,"67130","BLANCHERUPT",26]
[67130,"67130","FOUDAY",26]
[67130,"67130","FRECONRUPT",26]
[67130,"67130","GRANDFONTAINE",26]
[67130,"67130","HAUTE GOUTTE",26]
[67130,"67130","HERSBACH",26]
[67130,"67130","LA BROQUE",26]
[67130,"67130","LE BAN DE LA ROCHE",26]
[67130,"67130","LUTZELHOUSE",26]
[67130,"67130","MUHLBACH SUR BRUCHE",26]
[67130,"67130","NATZWILLER",26]
[67130,"67130","NETZENBACH",26]
[67130,"67130","NEUVILLER LA ROCHE",26]
[67130,"67130","RUSS",26]
[67130,"67130","SCHIRMECK",26]
[67130,"67130","SCHWARZBACH",26]
[67130,"67130","SOLBACH",26]
[67130,"67130","STEINBACH",26]
[67130,"67130","WACKENBACH",26]
[67130,"67130","WACQUENOUX",26]
[67130,"67130","WALDERSBACH",26]
[67130,"67130","WILDERSBACH",26]
[67130,"67130","WISCHES",26]
[67140,"67140","ANDLAU",14]
[67140,"67140","BARR",14]
[67140,"67140","BERNARDVILLE",14]
[67140,"67140","BOURGHEIM",14]
[67140,"67140","EICHHOFFEN",14]
[67140,"67140","GERTWILLER",14]
[67140,"67140","HEILIGENSTEIN",14]
[67140,"67140","ITTERSWILLER",14]
[67140,"67140","LE HOHWALD",14]
[67140,"67140","MITTELBERGHEIM",14]
[67140,"67140","REICHSFELD",14]
[67140,"67140","ST PIERRE",14]
[67140,"67140","STOTZHEIM",14]
[67140,"67140","ZELLWILLER",14]
[67150,"67150","BOLSENHEIM",14]
[67150,"67150","DAUBENSAND",14]
[67150,"67150","ERSTEIN",14]
[67150,"67150","GERSTHEIM",14]
[67150,"67150","HAEUSERN",14]
[67150,"67150","HINDISHEIM",14]
[67150,"67150","HIPSHEIM",14]
[67150,"67150","KRAFFT",14]
[67150,"67150","LIMERSHEIM",14]
[67150,"67150","MATZENHEIM",14]
[67150,"67150","NORDHOUSE",14]
[67150,"67150","OSTHOUSE",14]
[67150,"67150","SCHAEFFERSHEIM",14]
[67150,"67150","UTTENHEIM",14]
[67160,"67160","ALTENSTADT",18]
[67160,"67160","BIRLENBACH",{"$f":"COUNTIF($B$2:$B$5669,B4226)","v":18}]
[67160,"67160","BREMMELBACH",18]
[67160,"67160","CLEEBOURG",18]
[67160,"67160","DRACHENBRONN BIRLENBACH",18]
[67160,"67160","NIEDERSEEBACH",18]
[67160,"67160","OBERHOFFEN LES WISSEMBOURG",18]
[67160,"67160","OBERLAUTERBACH",18]
[67160,"67160","OBERSEEBACH",18]
[67160,"67160","RIEDSELTZ",18]
[67160,"67160","ROTT",18]
[67160,"67160","SALMBACH",18]
[67160,"67160","SCHLEITHAL",18]
[67160,"67160","SEEBACH",18]
[67160,"67160","SIEGEN",18]
[67160,"67160","STEINSELTZ",18]
[67160,"67160","WEILER",18]
[67160,"67160","WISSEMBOURG",18]
[67170,"67170","BERNOLSHEIM",17]
[67170,"67170","BERSTHEIM",17]
[67170,"67170","BILWISHEIM",17]
[67170,"67170","BRUMATH",17]
[67170,"67170","DONNENHEIM",17]
[67170,"67170","GEUDERTHEIM",17]
[67170,"67170","HOCHSTETT",17]
[67170,"67170","HOHATZENHEIM",17]
[67170,"67170","KEFFENDORF",17]
[67170,"67170","KRAUTWILLER",17]
[67170,"67170","KRIEGSHEIM",17]
[67170,"67170","MITTELHAUSEN",17]
[67170,"67170","MITTELSCHAEFFOLSHEIM",17]
[67170,"67170","OLWISHEIM",17]
[67170,"67170","ROTTELSHEIM",17]
[67170,"67170","WAHLENHEIM",17]
[67170,"67170","WINGERSHEIM",17]
[67190,"67190","DINSHEIM",7]
[67190,"67190","GRENDELBRUCH",7]
[67190,"67190","GRESSWILLER",7]
[67190,"67190","HEILIGENBERG",7]
[67190,"67190","MOLLKIRCH",7]
[67190,"67190","MUTZIG",7]
[67190,"67190","STILL",7]
[67200,"67200","ACHENHEIM",7]
[67200,"67200","ECKBOLSHEIM",7]
[67200,"67200","MITTELHAUSBERGEN",7]
[67200,"67200","NIEDERHAUSBERGEN",7]
[67200,"67200","OBERHAUSBERGEN",7]
[67200,"67200","OBERSCHAEFFOLSHEIM",7]
[67200,"67200","WOLFISHEIM",7]
[67210,"67210","BERNARDSWILLER",7]
[67210,"67210","GOXWILLER",7]
[67210,"67210","GRIESHEIM PRES MOLSHEIM",7]
[67210,"67210","MEISTRATZHEIM",7]
[67210,"67210","NIEDERNAI",7]
[67210,"67210","OBERNAI",7]
[67210,"67210","VALFF",7]
[67220,"67220","ALBE",21]
[67220,"67220","BASSEMBERG",21]
[67220,"67220","BREITENAU",21]
[67220,"67220","BREITENBACH",21]
[67220,"67220","CHARBES",21]
[67220,"67220","DIEFFENBACH AU VAL",21]
[67220,"67220","FOUCHY",21]
[67220,"67220","HOHWART",21]
[67220,"67220","LALAYE",21]
[67220,"67220","MAISONSGOUTTE",{"$f":"COUNTIF($B$2:$B$5669,B4290)","v":21}]
[67220,"67220","NEUBOIS",21]
[67220,"67220","NEUVE EGLISE",21]
[67220,"67220","ST MARTIN",21]
[67220,"67220","ST MAURICE",21]
[67220,"67220","ST PIERRE BOIS",21]
[67220,"67220","STEIGE",21]
[67220,"67220","THANVILLE",21]
[67220,"67220","TRIEMBACH AU VAL",21]
[67220,"67220","URBEIS",21]
[67220,"67220","VILLE",21]
[67220,"67220","WAGENBACH",21]
[67230,"67230","BENFELD",12]
[67230,"67230","DIEBOLSHEIM",12]
[67230,"67230","HERBSHEIM",12]
[67230,"67230","HUTTENHEIM",12]
[67230,"67230","KERTZFELD",12]
[67230,"67230","KOGENHEIM",12]
[67230,"67230","OBENHEIM",12]
[67230,"67230","ROSSFELD",12]
[67230,"67230","SAND",12]
[67230,"67230","SERMERSHEIM",12]
[67230,"67230","WESTHOUSE",12]
[67230,"67230","WITTERNHEIM",12]
[67240,"67240","BISCHWILLER",8]
[67240,"67240","CAMP D'OBERHOFFEN",8]
[67240,"67240","GRIES",8]
[67240,"67240","KALTENHOUSE",8]
[67240,"67240","KURTZENHOUSE",8]
[67240,"67240","OBERHOFFEN SUR MODER",8]
[67240,"67240","SCHIRRHEIN",8]
[67240,"67240","SCHIRRHOFFEN",8]
[67250,"67250","ASCHBACH",22]
[67250,"67250","HERMERSWILLER",22]
[67250,"67250","HOELSCHLOCH",22]
[67250,"67250","HOFFEN",22]
[67250,"67250","HOHWILLER",22]
[67250,"67250","HUNSPACH",22]
[67250,"67250","INGOLSHEIM",22]
[67250,"67250","KEFFENACH",22]
[67250,"67250","KUTZENHAUSEN",22]
[67250,"67250","LAMPERTSLOCH",22]
[67250,"67250","LEITERSWILLER",22]
[67250,"67250","LOBSANN",22]
[67250,"67250","MEMMELSHOFFEN",22]
[67250,"67250","MERKWILLER PECHELBRONN",22]
[67250,"67250","OBERKUTZENHAUSEN",22]
[67250,"67250","OBERROEDERN",22]
[67250,"67250","PREUSCHDORF",22]
[67250,"67250","RETSCHWILLER",22]
[67250,"67250","SCHOENENBOURG",22]
[67250,"67250","SOULTZ SOUS FORETS",22]
[67250,"67250","STUNDWILLER",22]
[67250,"67250","SURBOURG",22]
[67260,"67260","ALTWILLER",16]
[67260,"67260","BISCHTROFF SUR SARRE",16]
[67260,"67260","BISSERT",16]
[67260,"67260","BURBACH",16]
[67260,"67260","DIEDENDORF",16]
[67260,"67260","HARSKIRCHEN",16]
[67260,"67260","HERBITZHEIM",16]
[67260,"67260","HINSINGEN",16]
[67260,"67260","KESKASTEL",16]
[67260,"67260","RIMSDORF",16]
[67260,"67260","SARRE UNION",{"$f":"COUNTIF($B$2:$B$5669,B4354)","v":16}]
[67260,"67260","SARREWERDEN",16]
[67260,"67260","SCHOPPERTEN",16]
[67260,"67260","SILTZHEIM",16]
[67260,"67260","WOLFSKIRCHEN",16]
[67260,"67260","ZOLLINGEN",16]
[67270,"67270","ALTECKENDORF",25]
[67270,"67270","BOSSENDORF",25]
[67270,"67270","DUNTZENHEIM",25]
[67270,"67270","DURNINGEN",25]
[67270,"67270","GEISWILLER",25]
[67270,"67270","GINGSHEIM",25]
[67270,"67270","GOUGENHEIM",25]
[67270,"67270","HOCHFELDEN",25]
[67270,"67270","HOHFRANKENHEIM",25]
[67270,"67270","HUTTENDORF",25]
[67270,"67270","INGENHEIM",25]
[67270,"67270","KIENHEIM",25]
[67270,"67270","LIXHAUSEN",25]
[67270,"67270","MELSHEIM",25]
[67270,"67270","MINVERSHEIM",25]
[67270,"67270","MUTZENHOUSE",25]
[67270,"67270","ROHR",25]
[67270,"67270","SAESSOLSHEIM",25]
[67270,"67270","SCHAFFHOUSE SUR ZORN",25]
[67270,"67270","SCHERLENHEIM",25]
[67270,"67270","SCHWINDRATZHEIM",25]
[67270,"67270","WICKERSHEIM WILSHAUSEN",25]
[67270,"67270","WILSHAUSEN",25]
[67270,"67270","WILWISHEIM",25]
[67270,"67270","ZOEBERSDORF",25]
[67280,"67280","NIEDERHASLACH",3]
[67280,"67280","OBERHASLACH",3]
[67280,"67280","URMATT",3]
[67290,"67290","ERCKARTSWILLER",15]
[67290,"67290","FROHMUHL",15]
[67290,"67290","HINSBOURG",15]
[67290,"67290","LA PETITE PIERRE",15]
[67290,"67290","LOHR",15]
[67290,"67290","PETERSBACH",15]
[67290,"67290","PUBERG",15]
[67290,"67290","ROSTEIG",15]
[67290,"67290","STRUTH",15]
[67290,"67290","TIEFFENBACH",15]
[67290,"67290","VOLKSBERG",15]
[67290,"67290","WEISLINGEN",15]
[67290,"67290","WIMMENAU",15]
[67290,"67290","WINGEN SUR MODER",15]
[67290,"67290","ZITTERSHEIM",15]
[67300,"67300","SCHILTIGHEIM",1]
[67310,"67310","ALLENWILLER",20]
[67310,"67310","BALBRONN",20]
[67310,"67310","BERGBIETEN",20]
[67310,"67310","BRECHLINGEN",20]
[67310,"67310","COSSWILLER",20]
[67310,"67310","CRASTATT",20]
[67310,"67310","DAHLENHEIM",20]
[67310,"67310","DANGOLSHEIM",20]
[67310,"67310","FLEXBOURG",20]
[67310,"67310","HOHENGOEFT",20]
[67310,"67310","IRMSTETT",20]
[67310,"67310","KNOERSHEIM",20]
[67310,"67310","RANGEN",20]
[67310,"67310","ROMANSWILLER",20]
[67310,"67310","SCHARRACHBERGHEIM IRMSTETT",{"$f":"COUNTIF($B$2:$B$5669,B4418)","v":20}]
[67310,"67310","TRAENHEIM",20]
[67310,"67310","WASSELONNE",20]
[67310,"67310","WESTHOFFEN",20]
[67310,"67310","ZEHNACKER",20]
[67310,"67310","ZEINHEIM",20]
[67320,"67320","ADAMSWILLER",24]
[67320,"67320","ASSWILLER",24]
[67320,"67320","BAERENDORF",24]
[67320,"67320","BERG",24]
[67320,"67320","BETTWILLER",24]
[67320,"67320","BUST",24]
[67320,"67320","DRULINGEN",24]
[67320,"67320","DURSTEL",24]
[67320,"67320","ESCHBOURG",24]
[67320,"67320","ESCHWILLER",24]
[67320,"67320","EYWILLER",24]
[67320,"67320","GOERLINGEN",24]
[67320,"67320","GRAUFTHAL",24]
[67320,"67320","GUNGWILLER",24]
[67320,"67320","HIRSCHLAND",24]
[67320,"67320","KIRRBERG",24]
[67320,"67320","OTTWILLER",24]
[67320,"67320","PFALZWEYER",24]
[67320,"67320","RAUWILLER",24]
[67320,"67320","REXINGEN",24]
[67320,"67320","SCHOENBOURG",24]
[67320,"67320","SIEWILLER",24]
[67320,"67320","THAL DRULINGEN",24]
[67320,"67320","WEYER",24]
[67330,"67330","BOSSELSHAUSEN",17]
[67330,"67330","BOUXWILLER",17]
[67330,"67330","DOSSENHEIM SUR ZINSEL",17]
[67330,"67330","ERNOLSHEIM LES SAVERNE",17]
[67330,"67330","GRIESBACH LE BASTBERG",17]
[67330,"67330","HATTMATT",17]
[67330,"67330","IMBSHEIM",17]
[67330,"67330","ISSENHAUSEN",17]
[67330,"67330","KIRRWILLER BOSSELSHAUSEN",17]
[67330,"67330","NEUWILLER LES SAVERNE",17]
[67330,"67330","NIEDERSOULTZBACH",17]
[67330,"67330","OBERMODERN",17]
[67330,"67330","OBERMODERN ZUTZENDORF",17]
[67330,"67330","OBERSOULTZBACH",17]
[67330,"67330","RIEDHEIM",17]
[67330,"67330","UTTWILLER",17]
[67330,"67330","ZUTZENDORF",17]
[67340,"67340","BISCHHOLTZ",11]
[67340,"67340","INGWILLER",11]
[67340,"67340","LICHTENBERG",11]
[67340,"67340","MENCHHOFFEN",11]
[67340,"67340","OFFWILLER",11]
[67340,"67340","REIPERTSWILLER",11]
[67340,"67340","ROTHBACH",11]
[67340,"67340","SCHILLERSDORF",11]
[67340,"67340","SPARSBACH",11]
[67340,"67340","WEINBOURG",11]
[67340,"67340","WEITERSWILLER",11]
[67350,"67350","BITSCHHOFFEN",20]
[67350,"67350","BUSWILLER",20]
[67350,"67350","DAUENDORF",20]
[67350,"67350","ENGWILLER",20]
[67350,"67350","ETTENDORF",20]
[67350,"67350","GRASSENDORF",20]
[67350,"67350","KINDWILLER",{"$f":"COUNTIF($B$2:$B$5669,B4482)","v":20}]
[67350,"67350","LA WALCK",20]
[67350,"67350","MORSCHWILLER",20]
[67350,"67350","MULHAUSEN",20]
[67350,"67350","NEUBOURG",20]
[67350,"67350","NIEDERALTDORF",20]
[67350,"67350","NIEDERMODERN",20]
[67350,"67350","PFAFFENHOFFEN",20]
[67350,"67350","RINGELDORF",20]
[67350,"67350","RINGENDORF",20]
[67350,"67350","SCHALKENDORF",20]
[67350,"67350","UBERACH",20]
[67350,"67350","UHLWILLER",20]
[67350,"67350","UHRWILLER",20]
[67360,"67360","BIBLISHEIM",14]
[67360,"67360","DIEFFENBACH LES WOERTH",14]
[67360,"67360","DURRENBACH",14]
[67360,"67360","ESCHBACH",14]
[67360,"67360","FROESCHWILLER",14]
[67360,"67360","GOERSDORF",14]
[67360,"67360","GUNSTETT",14]
[67360,"67360","HEGENEY",14]
[67360,"67360","LANGENSOULTZBACH",14]
[67360,"67360","MITSCHDORF",14]
[67360,"67360","MORSBRONN LES BAINS",14]
[67360,"67360","OBERDORF SPACHBACH",14]
[67360,"67360","WALBOURG",14]
[67360,"67360","WOERTH",14]
[67370,"67370","AVENHEIM",22]
[67370,"67370","BEHLENHEIM",22]
[67370,"67370","BERSTETT",22]
[67370,"67370","DINGSHEIM",22]
[67370,"67370","GIMBRETT",22]
[67370,"67370","GRIESHEIM SUR SOUFFEL",22]
[67370,"67370","ITTLENHEIM",22]
[67370,"67370","KLEINFRANKENHEIM",22]
[67370,"67370","NEUGARTHEIM",22]
[67370,"67370","NEUGARTHEIM ITTLENHEIM",22]
[67370,"67370","OFFENHEIM",22]
[67370,"67370","PFETTISHEIM",22]
[67370,"67370","PFULGRIESHEIM",22]
[67370,"67370","REITWILLER",22]
[67370,"67370","RUMERSHEIM",22]
[67370,"67370","SCHNERSHEIM",22]
[67370,"67370","STUTZHEIM OFFENHEIM",22]
[67370,"67370","TRUCHTERSHEIM",22]
[67370,"67370","WILLGOTTHEIM",22]
[67370,"67370","WINTZENHEIM KOCHERSBERG",22]
[67370,"67370","WIWERSHEIM",22]
[67370,"67370","WOELLENHEIM",22]
[67380,"67380","LINGOLSHEIM",1]
[67390,"67390","ARTOLSHEIM",13]
[67390,"67390","BOESENBIESEN",13]
[67390,"67390","BOOTZHEIM",13]
[67390,"67390","ELSENHEIM",13]
[67390,"67390","HEIDOLSHEIM",13]
[67390,"67390","HESSENHEIM",13]
[67390,"67390","MACKENHEIM",13]
[67390,"67390","MARCKOLSHEIM",13]
[67390,"67390","OHNENHEIM",13]
[67390,"67390","RICHTOLSHEIM",13]
[67390,"67390","SAASENHEIM",13]
[67390,"67390","SCHOENAU",13]
[67390,"67390","SCHWOBSHEIM",13]
[67400,"67400","GEISPOLSHEIM",{"$f":"COUNTIF($B$2:$B$5669,B4546)","v":2}]
[67400,"67400","ILLKIRCH GRAFFENSTADEN",2]
[67410,"67410","DRUSENHEIM",2]
[67410,"67410","ROHRWILLER",2]
[67420,"67420","BOURG",10]
[67420,"67420","BOURG BRUCHE",10]
[67420,"67420","CHAMPENAY",10]
[67420,"67420","COLROY LA ROCHE",10]
[67420,"67420","PLAINE",10]
[67420,"67420","POUTAY",10]
[67420,"67420","RANRUPT",10]
[67420,"67420","SAALES",10]
[67420,"67420","SAULXURES",10]
[67420,"67420","ST BLAISE LA ROCHE",10]
[67430,"67430","BUTTEN",9]
[67430,"67430","DEHLINGEN",9]
[67430,"67430","DIEMERINGEN",9]
[67430,"67430","DOMFESSEL",9]
[67430,"67430","LORENTZEN",9]
[67430,"67430","MACKWILLER",9]
[67430,"67430","RATZWILLER",9]
[67430,"67430","VOELLERDINGEN",9]
[67430,"67430","WALDHAMBACH",9]
[67440,"67440","BIRKENWALD",16]
[67440,"67440","DIMBSTHAL",16]
[67440,"67440","HENGWILLER",16]
[67440,"67440","JETTERSWILLER",16]
[67440,"67440","KLEINGOEFT",16]
[67440,"67440","LOCHWILLER",16]
[67440,"67440","MARMOUTIER",16]
[67440,"67440","REINHARDSMUNSTER",16]
[67440,"67440","REUTENBOURG",16]
[67440,"67440","SALENTHAL",16]
[67440,"67440","SCHWEBWILLER",16]
[67440,"67440","SCHWENHEIM",16]
[67440,"67440","SINGRIST",16]
[67440,"67440","ST GALL",16]
[67440,"67440","THAL MARMOUTIER",16]
[67440,"67440","WESTHOUSE MARMOUTIER",16]
[67450,"67450","LAMPERTHEIM",2]
[67450,"67450","MUNDOLSHEIM",2]
[67460,"67460","SOUFFELWEYERSHEIM",1]
[67470,"67470","BUHL",10]
[67470,"67470","CROETTWILLER",10]
[67470,"67470","EBERBACH SELTZ",10]
[67470,"67470","MOTHERN",10]
[67470,"67470","MUNCHHAUSEN",10]
[67470,"67470","NIEDERROEDERN",10]
[67470,"67470","SCHAFFHOUSE PRES SELTZ",10]
[67470,"67470","SELTZ",10]
[67470,"67470","TRIMBACH",10]
[67470,"67470","WINTZENBACH",10]
[67480,"67480","AUENHEIM",9]
[67480,"67480","FORSTFELD",9]
[67480,"67480","FORT LOUIS",9]
[67480,"67480","KAUFFENHEIM",9]
[67480,"67480","LEUTENHEIM",9]
[67480,"67480","NEUHAEUSEL",9]
[67480,"67480","ROESCHWOOG",9]
[67480,"67480","ROPPENHEIM",9]
[67480,"67480","ROUNTZENHEIM",9]
[67490,"67490","ALTENHEIM",7]
[67490,"67490","DETTWILLER",7]
[67490,"67490","FRIEDOLSHEIM",7]
[67490,"67490","GOTTESHEIM",{"$f":"COUNTIF($B$2:$B$5669,B4610)","v":7}]
[67490,"67490","LITTENHEIM",7]
[67490,"67490","LUPSTEIN",7]
[67490,"67490","PRINTZHEIM",7]
[67500,"67500","BATZENDORF",6]
[67500,"67500","HAGUENAU",6]
[67500,"67500","HARTHOUSE",6]
[67500,"67500","MARIENTHAL",6]
[67500,"67500","NIEDERSCHAEFFOLSHEIM",6]
[67500,"67500","WEITBRUCH",6]
[67510,"67510","CLIMBACH",7]
[67510,"67510","LEMBACH",7]
[67510,"67510","MATTSTALL",7]
[67510,"67510","NIEDERSTEINBACH",7]
[67510,"67510","OBERSTEINBACH",7]
[67510,"67510","PETIT WINGEN",7]
[67510,"67510","WINGEN",7]
[67520,"67520","KIRCHHEIM",6]
[67520,"67520","KUTTOLSHEIM",6]
[67520,"67520","MARLENHEIM",6]
[67520,"67520","NORDHEIM",6]
[67520,"67520","ODRATZHEIM",6]
[67520,"67520","WANGEN",6]
[67530,"67530","BOERSCH",4]
[67530,"67530","KLINGENTHAL",4]
[67530,"67530","OTTROTT",4]
[67530,"67530","ST NABOR",4]
[67540,"67540","OSTWALD",1]
[67550,"67550","ECKWERSHEIM",2]
[67550,"67550","VENDENHEIM",2]
[67560,"67560","ROSENWILLER",2]
[67560,"67560","ROSHEIM",2]
[67570,"67570","LA CLAQUETTE",2]
[67570,"67570","ROTHAU",2]
[67580,"67580","FORSTHEIM",4]
[67580,"67580","LAUBACH",4]
[67580,"67580","MERTZWILLER",4]
[67580,"67580","MIETESHEIM",4]
[67590,"67590","OHLUNGEN",3]
[67590,"67590","SCHWEIGHOUSE SUR MODER",3]
[67590,"67590","WINTERSHOUSE",3]
[67600,"67600","BALDENHEIM",12]
[67600,"67600","BINDERNHEIM",12]
[67600,"67600","EBERSHEIM",12]
[67600,"67600","EBERSMUNSTER",12]
[67600,"67600","EHNWIHR",12]
[67600,"67600","HILSENHEIM",12]
[67600,"67600","KINTZHEIM",12]
[67600,"67600","LA VANCELLE",12]
[67600,"67600","MUSSIG",12]
[67600,"67600","MUTTERSHOLTZ",12]
[67600,"67600","ORSCHWILLER",12]
[67600,"67600","SELESTAT",12]
[67610,"67610","LA WANTZENAU",1]
[67620,"67620","SOUFFLENHEIM",1]
[67630,"67630","LAUTERBOURG",4]
[67630,"67630","NEEWILLER PRES LAUTERBOURG",4]
[67630,"67630","NIEDERLAUTERBACH",4]
[67630,"67630","SCHEIBENHARD",4]
[67640,"67640","FEGERSHEIM",4]
[67640,"67640","ICHTRATZHEIM",4]
[67640,"67640","LIPSHEIM",4]
[67640,"67640","OHNHEIM",4]
[67650,"67650","BLIENSCHWILLER",3]
[67650,"67650","DAMBACH LA VILLE",{"$f":"COUNTIF($B$2:$B$5669,B4674)","v":3}]
[67650,"67650","DIEFFENTHAL",3]
[67660,"67660","BETSCHDORF",4]
[67660,"67660","KUHLENDORF",4]
[67660,"67660","REIMERSWILLER",4]
[67660,"67660","SCHWABWILLER",4]
[67670,"67670","MOMMENHEIM",3]
[67670,"67670","WALTENHEIM SUR ZORN",3]
[67670,"67670","WITTERSHEIM",3]
[67680,"67680","EPFIG",2]
[67680,"67680","NOTHALTEN",2]
[67690,"67690","HATTEN",2]
[67690,"67690","RITTERSHOFFEN",2]
[67700,"67700","ECKARTSWILLER",15]
[67700,"67700","FURCHHAUSEN",15]
[67700,"67700","GOTTENHOUSE",15]
[67700,"67700","HAEGEN",15]
[67700,"67700","LANDERSHEIM",15]
[67700,"67700","MAENNOLSHEIM",15]
[67700,"67700","MONSWILLER",15]
[67700,"67700","OTTERSTHAL",15]
[67700,"67700","OTTERSWILLER",15]
[67700,"67700","SAVERNE",15]
[67700,"67700","ST JEAN SAVERNE",15]
[67700,"67700","WALDOLWISHEIM",15]
[67700,"67700","WOLSCHHEIM",15]
[67700,"67700","ZORNHOF",15]
[67700,"67700","ZORNTHAL",15]
[67710,"67710","ENGENTHAL",5]
[67710,"67710","SCHNEETHAL",5]
[67710,"67710","WANGENBOURG",5]
[67710,"67710","WANGENBOURG ENGENTHAL",5]
[67710,"67710","WOLFSTHAL",5]
[67720,"67720","BIETLENHEIM",3]
[67720,"67720","HOERDT",3]
[67720,"67720","WEYERSHEIM",3]
[67730,"67730","CHATENOIS",1]
[67750,"67750","KIENTZVILLE",2]
[67750,"67750","SCHERWILLER",2]
[67760,"67760","GAMBSHEIM",1]
[67770,"67770","DALHUNDEN",3]
[67770,"67770","SESSENHEIM",3]
[67770,"67770","STATTMATTEN",3]
[67790,"67790","STEINBOURG",1]
[67800,"67800","BISCHHEIM",3]
[67800,"67800","HAGSTUCK",3]
[67800,"67800","HOENHEIM",3]
[67810,"67810","HOLTZHEIM",1]
[67820,"67820","WITTISHEIM",1]
[67840,"67840","KILSTETT",1]
[67850,"67850","HERRLISHEIM",2]
[67850,"67850","OFFENDORF",2]
[67860,"67860","BOOFZHEIM",3]
[67860,"67860","FRIESENHEIM",3]
[67860,"67860","RHINAU",3]
[67870,"67870","BISCHOFFSHEIM",1]
[67880,"67880","INNENHEIM",2]
[67880,"67880","KRAUTERGERSHEIM",2]
[67920,"67920","SUNDHOUSE",1]
[67930,"67930","BEINHEIM",2]
[67930,"67930","KESSELDORF",2]
[67960,"67960","ENTZHEIM",1]
[67970,"67970","OERMINGEN",1]
[67980,"67980","HANGENBIETEN",1]
[67990,"67990","OSTHOFFEN",{"$f":"COUNTIF($B$2:$B$5669,B4738)","v":1}]
[68000,"68000","COLMAR",1]
[68040,"68040","INGERSHEIM",1]
[68100,"68100","MULHOUSE",1]
[68110,"68110","ILLZACH",2]
[68110,"68110","MODENHEIM",2]
[68116,"68116","GUEWENHEIM",1]
[68118,"68118","HIRTZBACH",1]
[68120,"68120","PFASTATT",2]
[68120,"68120","RICHWILLER",2]
[68121,"68121","URBES",1]
[68124,"68124","LOGELBACH",1]
[68125,"68125","HOUSSEN",1]
[68126,"68126","BENNWIHR GARE",1]
[68127,"68127","STE CROIX EN PLAINE",1]
[68130,"68130","ALTKIRCH",17]
[68130,"68130","ASPACH",17]
[68130,"68130","BERENTZWILLER",17]
[68130,"68130","CARSPACH",17]
[68130,"68130","EMLINGEN",17]
[68130,"68130","FRANKEN",17]
[68130,"68130","HAUSGAUEN",17]
[68130,"68130","HEIWILLER",17]
[68130,"68130","HUNDSBACH",17]
[68130,"68130","JETTINGEN",17]
[68130,"68130","OBERMORSCHWILLER",17]
[68130,"68130","SCHWOBEN",17]
[68130,"68130","TAGSDORF",17]
[68130,"68130","WAHLBACH",17]
[68130,"68130","WALHEIM",17]
[68130,"68130","WITTERSDORF",17]
[68130,"68130","ZAESSINGUE",17]
[68140,"68140","ESCHBACH AU VAL",8]
[68140,"68140","GRIESBACH AU VAL",8]
[68140,"68140","GUNSBACH",8]
[68140,"68140","HOHROD",8]
[68140,"68140","LUTTENBACH PRES MUNSTER",8]
[68140,"68140","MUNSTER",8]
[68140,"68140","SOULTZEREN",8]
[68140,"68140","STOSSWIHR",8]
[68150,"68150","AUBURE",5]
[68150,"68150","HUNAWIHR",5]
[68150,"68150","ILLHAEUSERN",5]
[68150,"68150","OSTHEIM",5]
[68150,"68150","RIBEAUVILLE",5]
[68160,"68160","ECHERY",3]
[68160,"68160","STE CROIX AUX MINES",3]
[68160,"68160","STE MARIE AUX MINES",3]
[68170,"68170","RIXHEIM",1]
[68180,"68180","HORBOURG WIHR",2]
[68180,"68180","WIHR EN PLAINE",2]
[68190,"68190","ENSISHEIM",3]
[68190,"68190","RAEDERSHEIM",3]
[68190,"68190","UNGERSHEIM",3]
[68200,"68200","BOURTZWILLER",4]
[68200,"68200","BRUNSTATT",4]
[68200,"68200","DIDENHEIM",4]
[68200,"68200","DORNACH",4]
[68210,"68210","ALTENACH",34]
[68210,"68210","AMMERTZWILLER",34]
[68210,"68210","BALLERSDORF",34]
[68210,"68210","BALSCHWILLER",34]
[68210,"68210","BELLEMAGNY",34]
[68210,"68210","BERNWILLER",34]
[68210,"68210","BRECHAUMONT",{"$f":"COUNTIF($B$2:$B$5669,B4802)","v":34}]
[68210,"68210","BUETHWILLER",34]
[68210,"68210","CHAVANNES SUR L'ETANG",34]
[68210,"68210","DANNEMARIE",34]
[68210,"68210","ELBACH",34]
[68210,"68210","ETEIMBES",34]
[68210,"68210","FALKWILLER",34]
[68210,"68210","FULLEREN",34]
[68210,"68210","GILDWILLER",34]
[68210,"68210","GOMMERSDORF",34]
[68210,"68210","GUEVENATTEN",34]
[68210,"68210","HAGENBACH",34]
[68210,"68210","HECKEN",34]
[68210,"68210","MAGNY",34]
[68210,"68210","MANSPACH",34]
[68210,"68210","MERTZEN",34]
[68210,"68210","MONTREUX JEUNE",34]
[68210,"68210","MONTREUX VIEUX",34]
[68210,"68210","RETZWILLER",34]
[68210,"68210","ROMAGNY",34]
[68210,"68210","ST COSME",34]
[68210,"68210","ST ULRICH",34]
[68210,"68210","TRAUBACH LE BAS",34]
[68210,"68210","TRAUBACH LE HAUT",34]
[68210,"68210","UEBERKUMEN",34]
[68210,"68210","VALDIEU",34]
[68210,"68210","VALDIEU LUTRAN",34]
[68210,"68210","WOLFERSDORF",34]
[68220,"68220","ATTENSCHWILLER",15]
[68220,"68220","BUSCHWILLER",15]
[68220,"68220","FOLGENSBOURG",15]
[68220,"68220","HAGENTHAL LE BAS",15]
[68220,"68220","HAGENTHAL LE HAUT",15]
[68220,"68220","HEGENHEIM",15]
[68220,"68220","HESINGUE",15]
[68220,"68220","KNOERINGUE",15]
[68220,"68220","LEYMEN",15]
[68220,"68220","LIEBENSWILLER",15]
[68220,"68220","MICHELBACH LE HAUT",15]
[68220,"68220","NEUWILLER",15]
[68220,"68220","RANSPACH LE BAS",15]
[68220,"68220","RANSPACH LE HAUT",15]
[68220,"68220","WENTZWILLER",15]
[68230,"68230","KATZENTHAL",8]
[68230,"68230","NIEDERMORSCHWIHR",8]
[68230,"68230","SOULTZBACH LES BAINS",8]
[68230,"68230","TURCKHEIM",8]
[68230,"68230","WALBACH",8]
[68230,"68230","WASSERBOURG",8]
[68230,"68230","WIHR AU VAL",8]
[68230,"68230","ZIMMERBACH",8]
[68240,"68240","FRELAND",4]
[68240,"68240","KAYSERSBERG",4]
[68240,"68240","KIENTZHEIM",4]
[68240,"68240","SIGOLSHEIM",4]
[68250,"68250","BILZHEIM",10]
[68250,"68250","GUNDOLSHEIM",10]
[68250,"68250","MUNWILLER",10]
[68250,"68250","NIEDERENTZEN",10]
[68250,"68250","NIEDERHERGHEIM",10]
[68250,"68250","OBERENTZEN",10]
[68250,"68250","OBERHERGHEIM",10]
[68250,"68250","PFAFFENHEIM",10]
[68250,"68250","ROUFFACH",10]
[68250,"68250","WESTHALTEN",{"$f":"COUNTIF($B$2:$B$5669,B4866)","v":10}]
[68260,"68260","KINGERSHEIM",1]
[68270,"68270","RUELISHEIM",2]
[68270,"68270","WITTENHEIM",2]
[68280,"68280","ANDOLSHEIM",4]
[68280,"68280","APPENWIHR",4]
[68280,"68280","LOGELHEIM",4]
[68280,"68280","SUNDHOFFEN",4]
[68290,"68290","BOURBACH LE BAS",12]
[68290,"68290","BOURBACH LE HAUT",12]
[68290,"68290","DOLLEREN",12]
[68290,"68290","KIRCHBERG",12]
[68290,"68290","LAUW",12]
[68290,"68290","MASEVAUX",12]
[68290,"68290","NIEDERBRUCK",12]
[68290,"68290","OBERBRUCK",12]
[68290,"68290","RIMBACH PRES MASEVAUX",12]
[68290,"68290","SEWEN",12]
[68290,"68290","SICKERT",12]
[68290,"68290","WEGSCHEID",12]
[68300,"68300","BOURGFELDEN",5]
[68300,"68300","ROSENAU",5]
[68300,"68300","ST LOUIS",5]
[68300,"68300","ST LOUIS LA CHAUSSEE",5]
[68300,"68300","VILLAGE NEUF",5]
[68310,"68310","WITTELSHEIM",1]
[68320,"68320","ARTZENHEIM",14]
[68320,"68320","BALTZENHEIM",14]
[68320,"68320","BISCHWIHR",14]
[68320,"68320","DURRENENTZEN",14]
[68320,"68320","FORTSCHWIHR",14]
[68320,"68320","GRUSSENHEIM",14]
[68320,"68320","HOLTZWIHR",14]
[68320,"68320","JEBSHEIM",14]
[68320,"68320","KUNHEIM",14]
[68320,"68320","MUNTZENHEIM",14]
[68320,"68320","RIEDWIHR",14]
[68320,"68320","URSCHENHEIM",14]
[68320,"68320","WICKERSCHWIHR",14]
[68320,"68320","WIDENSOLEN",14]
[68330,"68330","HUNINGUE",1]
[68340,"68340","RIQUEWIHR",2]
[68340,"68340","ZELLENBERG",2]
[68360,"68360","SOULTZ HAUT RHIN",1]
[68370,"68370","ORBEY",1]
[68380,"68380","BREITENBACH",5]
[68380,"68380","METZERAL",5]
[68380,"68380","MITTLACH",5]
[68380,"68380","MUHLBACH SUR MUNSTER",5]
[68380,"68380","SONDERNACH",5]
[68390,"68390","BALDERSHEIM",3]
[68390,"68390","BATTENHEIM",3]
[68390,"68390","SAUSHEIM",3]
[68400,"68400","RIEDISHEIM",1]
[68410,"68410","LES TROIS EPIS",1]
[68420,"68420","EGUISHEIM",7]
[68420,"68420","GUEBERSCHWIHR",7]
[68420,"68420","HATTSTATT",7]
[68420,"68420","HERRLISHEIM PRES COLMAR",7]
[68420,"68420","HUSSEREN LES CHATEAUX",7]
[68420,"68420","OBERMORSCHWIHR",7]
[68420,"68420","VOEGTLINSHOFFEN",7]
[68440,"68440","BRUEBACH",9]
[68440,"68440","DIETWILLER",9]
[68440,"68440","ESCHENTZWILLER",{"$f":"COUNTIF($B$2:$B$5669,B4930)","v":9}]
[68440,"68440","HABSHEIM",9]
[68440,"68440","LANDSER",9]
[68440,"68440","SCHLIERBACH",9]
[68440,"68440","STEINBRUNN LE BAS",9]
[68440,"68440","STEINBRUNN LE HAUT",9]
[68440,"68440","ZIMMERSHEIM",9]
[68460,"68460","LUTTERBACH",1]
[68470,"68470","FELLERING",6]
[68470,"68470","HUSSEREN WESSERLING",6]
[68470,"68470","MITZACH",6]
[68470,"68470","MOLLAU",6]
[68470,"68470","STORCKENSOHN",6]
[68470,"68470","WESSERLING",6]
[68480,"68480","BENDORF",28]
[68480,"68480","BETTLACH",28]
[68480,"68480","BIEDERTHAL",28]
[68480,"68480","BOUXWILLER",28]
[68480,"68480","COURTAVON",28]
[68480,"68480","DURLINSDORF",28]
[68480,"68480","DURMENACH",28]
[68480,"68480","FERRETTE",28]
[68480,"68480","FISLIS",28]
[68480,"68480","KIFFIS",28]
[68480,"68480","KOESTLACH",28]
[68480,"68480","LEVONCOURT",28]
[68480,"68480","LIEBSDORF",28]
[68480,"68480","LIGSDORF",28]
[68480,"68480","LINSDORF",28]
[68480,"68480","LUCELLE",28]
[68480,"68480","LUTTER",28]
[68480,"68480","MOERNACH",28]
[68480,"68480","OBERLARG",28]
[68480,"68480","OLTINGUE",28]
[68480,"68480","PFETTERHOUSE",28]
[68480,"68480","RAEDERSDORF",28]
[68480,"68480","ROPPENTZWILLER",28]
[68480,"68480","SONDERSDORF",28]
[68480,"68480","VIEUX FERRETTE",28]
[68480,"68480","WERENTZHOUSE",28]
[68480,"68480","WINKEL",28]
[68480,"68480","WOLSCHWILLER",28]
[68490,"68490","BANTZENHEIM",5]
[68490,"68490","CHALAMPE",5]
[68490,"68490","HOMBOURG",5]
[68490,"68490","OTTMARSHEIM",5]
[68490,"68490","PETIT LANDAU",5]
[68500,"68500","BERGHOLTZ",12]
[68500,"68500","BERGHOLTZ ZELL",12]
[68500,"68500","BERRWILLER",12]
[68500,"68500","GUEBWILLER",12]
[68500,"68500","HARTMANNSWILLER",12]
[68500,"68500","ISSENHEIM",12]
[68500,"68500","JUNGHOLTZ",12]
[68500,"68500","MERXHEIM",12]
[68500,"68500","ORSCHWIR",12]
[68500,"68500","RIMBACH PRES GUEBWILLER",12]
[68500,"68500","RIMBACH ZELL",12]
[68500,"68500","WUENHEIM",12]
[68510,"68510","GEISPITZEN",11]
[68510,"68510","HELFRANTZKIRCH",11]
[68510,"68510","KAPPELEN",11]
[68510,"68510","KOETZINGUE",11]
[68510,"68510","MAGSTATT LE BAS",11]
[68510,"68510","MAGSTATT LE HAUT",{"$f":"COUNTIF($B$2:$B$5669,B4994)","v":11}]
[68510,"68510","RANTZWILLER",11]
[68510,"68510","SIERENTZ",11]
[68510,"68510","STETTEN",11]
[68510,"68510","UFFHEIM",11]
[68510,"68510","WALTENHEIM",11]
[68520,"68520","BURNHAUPT LE BAS",3]
[68520,"68520","BURNHAUPT LE HAUT",3]
[68520,"68520","SCHWEIGHOUSE PRES THANN",3]
[68530,"68530","BUHL",2]
[68530,"68530","MURBACH",2]
[68540,"68540","BOLLWILLER",2]
[68540,"68540","FELDKIRCH",2]
[68550,"68550","MALMERSPACH",2]
[68550,"68550","ST AMARIN",2]
[68560,"68560","BETTENDORF",4]
[68560,"68560","HEIMERSDORF",4]
[68560,"68560","HIRSINGUE",4]
[68560,"68560","RUEDERBACH",4]
[68570,"68570","OSENBACH",3]
[68570,"68570","SOULTZMATT",3]
[68570,"68570","WINTZFELDEN",3]
[68580,"68580","BISEL",10]
[68580,"68580","FRIESEN",10]
[68580,"68580","HINDLINGEN",10]
[68580,"68580","LARGITZEN",10]
[68580,"68580","MOOSLARGUE",10]
[68580,"68580","NIEDERLARG",10]
[68580,"68580","SEPPOIS LE BAS",10]
[68580,"68580","SEPPOIS LE HAUT",10]
[68580,"68580","STRUETH",10]
[68580,"68580","UEBERSTRASS",10]
[68590,"68590","RODERN",4]
[68590,"68590","RORSCHWIHR",4]
[68590,"68590","ST HIPPOLYTE",4]
[68590,"68590","THANNENKIRCH",4]
[68600,"68600","ALGOLSHEIM",12]
[68600,"68600","BIESHEIM",12]
[68600,"68600","DESSENHEIM",12]
[68600,"68600","GEISWASSER",12]
[68600,"68600","HEITEREN",12]
[68600,"68600","HETTENSCHLAG",12]
[68600,"68600","NEUF BRISACH",12]
[68600,"68600","OBERSAASHEIM",12]
[68600,"68600","VOGELGRUN",12]
[68600,"68600","VOLGELSHEIM",12]
[68600,"68600","WECKOLSHEIM",12]
[68600,"68600","WOLFGANTZEN",12]
[68610,"68610","LAUTENBACH",5]
[68610,"68610","LAUTENBACH ZELL",5]
[68610,"68610","LINTHAL",5]
[68610,"68610","MARKSTEIN",5]
[68610,"68610","SCHWEIGHOUSE",5]
[68620,"68620","BITSCHWILLER LES THANN",1]
[68630,"68630","BENNWIHR",2]
[68630,"68630","MITTELWIHR",2]
[68640,"68640","FELDBACH",7]
[68640,"68640","MOYEN MUESPACH",7]
[68640,"68640","MUESPACH",7]
[68640,"68640","MUESPACH LE HAUT",7]
[68640,"68640","RIESPACH",7]
[68640,"68640","STEINSOULTZ",7]
[68640,"68640","WALDIGHOFFEN",7]
[68650,"68650","LAPOUTROIE",2]
[68650,"68650","LE BONHOMME",{"$f":"COUNTIF($B$2:$B$5669,B5058)","v":2}]
[68660,"68660","LIEPVRE",2]
[68660,"68660","ROMBACH LE FRANC",2]
[68680,"68680","KEMBS",3]
[68680,"68680","KEMBS LOECHLE",3]
[68680,"68680","NIFFER",3]
[68690,"68690","GEISHOUSE",2]
[68690,"68690","MOOSCH",2]
[68700,"68700","ASPACH LE BAS",7]
[68700,"68700","ASPACH LE HAUT",7]
[68700,"68700","CERNAY",7]
[68700,"68700","MICHELBACH",7]
[68700,"68700","STEINBACH",7]
[68700,"68700","UFFHOLTZ",7]
[68700,"68700","WATTWILLER",7]
[68720,"68720","BRINIGHOFFEN",13]
[68720,"68720","EGLINGEN",13]
[68720,"68720","FLAXLANDEN",13]
[68720,"68720","FROENINGEN",13]
[68720,"68720","HEIDWILLER",13]
[68720,"68720","HOCHSTATT",13]
[68720,"68720","ILLFURTH",13]
[68720,"68720","LUEMSCHWILLER",13]
[68720,"68720","SPECHBACH LE BAS",13]
[68720,"68720","SPECHBACH LE HAUT",13]
[68720,"68720","ST BERNARD",13]
[68720,"68720","TAGOLSHEIM",13]
[68720,"68720","ZILLISHEIM",13]
[68730,"68730","BLOTZHEIM",3]
[68730,"68730","MICHELBACH LE BAS",3]
[68730,"68730","RANSPACH",3]
[68740,"68740","BALGAU",9]
[68740,"68740","BLODELSHEIM",9]
[68740,"68740","FESSENHEIM",9]
[68740,"68740","HIRTZFELDEN",9]
[68740,"68740","MUNCHHOUSE",9]
[68740,"68740","NAMBSHEIM",9]
[68740,"68740","ROGGENHOUSE",9]
[68740,"68740","RUMERSHEIM LE HAUT",9]
[68740,"68740","RUSTENHART",9]
[68750,"68750","BERGHEIM",1]
[68760,"68760","ALTENBACH",3]
[68760,"68760","GOLDBACH ALTENBACH",3]
[68760,"68760","WILLER SUR THUR",3]
[68770,"68770","AMMERSCHWIHR",1]
[68780,"68780","BRETTEN",7]
[68780,"68780","DIEFMATTEN",7]
[68780,"68780","MORTZWILLER",7]
[68780,"68780","SENTHEIM",7]
[68780,"68780","SOPPE LE BAS",7]
[68780,"68780","SOPPE LE HAUT",7]
[68780,"68780","STERNENBERG",7]
[68790,"68790","MORSCHWILLER LE BAS",1]
[68800,"68800","LEIMBACH",5]
[68800,"68800","RAMMERSMATT",5]
[68800,"68800","RODEREN",5]
[68800,"68800","THANN",5]
[68800,"68800","VIEUX THANN",5]
[68820,"68820","KRUTH",2]
[68820,"68820","WILDENSTEIN",2]
[68830,"68830","ODEREN",1]
[68840,"68840","PULVERSHEIM",1]
[68850,"68850","STAFFELFELDEN",1]
[68870,"68870","BARTENHEIM",3]
[68870,"68870","BARTENHEIM LA CHAUSSEE",{"$f":"COUNTIF($B$2:$B$5669,B5122)","v":3}]
[68870,"68870","BRINCKHEIM",3]
[68890,"68890","MEYENHEIM",2]
[68890,"68890","REGUISHEIM",2]
[68910,"68910","LABAROCHE",1]
[68920,"68920","WETTOLSHEIM",2]
[68920,"68920","WINTZENHEIM",2]
[68950,"68950","REININGUE",1]
[68960,"68960","GRENTZINGEN",4]
[68960,"68960","HENFLINGEN",4]
[68960,"68960","OBERDORF",4]
[68960,"68960","WILLER",4]
[68970,"68970","GUEMAR",1]
[68980,"68980","BEBLENHEIM",1]
[68990,"68990","GALFINGUE",2]
[68990,"68990","HEIMSBRUNN",2]
[88000,"88000","CHANTRAINE",9]
[88000,"88000","DEYVILLERS",9]
[88000,"88000","DIGNONVILLE",9]
[88000,"88000","DINOZE",9]
[88000,"88000","DOGNEVILLE",9]
[88000,"88000","EPINAL",9]
[88000,"88000","JEUXEY",9]
[88000,"88000","LONGCHAMP",9]
[88000,"88000","VAUDEVILLE",9]
[88100,"88100","COINCHES",8]
[88100,"88100","NAYEMONT LES FOSSES",8]
[88100,"88100","NEUVILLERS SUR FAVE",8]
[88100,"88100","PAIR ET GRANDRUPT",8]
[88100,"88100","REMOMEIX",8]
[88100,"88100","ST DIE",8]
[88100,"88100","STE MARGUERITE",8]
[88100,"88100","TAINTRUX",8]
[88110,"88110","ALLARMONT",7]
[88110,"88110","CELLES SUR PLAINE",7]
[88110,"88110","LA TROUCHE",7]
[88110,"88110","LUVIGNY",7]
[88110,"88110","RAON L'ETAPE",7]
[88110,"88110","RAON SUR PLAINE",7]
[88110,"88110","VEXAINCOURT",7]
[88120,"88120","BASSE SUR LE RUPT",9]
[88120,"88120","CLEURIE",9]
[88120,"88120","GERBAMONT",9]
[88120,"88120","JULIENRUPT",9]
[88120,"88120","LE SYNDICAT",9]
[88120,"88120","ROCHESSON",9]
[88120,"88120","SAPOIS",9]
[88120,"88120","ST AME",9]
[88120,"88120","VAGNEY",9]
[88130,"88130","AVRAINVILLE",17]
[88130,"88130","BATTEXEY",17]
[88130,"88130","BOUXURULLES",17]
[88130,"88130","BRANTIGNY",17]
[88130,"88130","CHAMAGNE",17]
[88130,"88130","CHARMES",17]
[88130,"88130","ESSEGNEY",17]
[88130,"88130","FLOREMONT",17]
[88130,"88130","HERGUGNEY",17]
[88130,"88130","LANGLEY",17]
[88130,"88130","MARAINVILLE SUR MADON",17]
[88130,"88130","RAPEY",17]
[88130,"88130","RUGNEY",17]
[88130,"88130","SAVIGNY",17]
[88130,"88130","SOCOURT",17]
[88130,"88130","UBEXY",{"$f":"COUNTIF($B$2:$B$5669,B5186)","v":17}]
[88130,"88130","XARONVAL",17]
[88140,"88140","AINGEVILLE",18]
[88140,"88140","AUZAINVILLIERS",18]
[88140,"88140","BULGNEVILLE",18]
[88140,"88140","CONTREXEVILLE",18]
[88140,"88140","CRAINVILLIERS",18]
[88140,"88140","DOMBROT LE SEC",18]
[88140,"88140","GENDREVILLE",18]
[88140,"88140","LA VACHERESSE ET LA ROUILLIE",18]
[88140,"88140","MALAINCOURT",18]
[88140,"88140","MEDONVILLE",18]
[88140,"88140","MORVILLE",18]
[88140,"88140","SAULXURES LES BULGNEVILLE",18]
[88140,"88140","SAUVILLE",18]
[88140,"88140","ST OUEN LES PAREY",18]
[88140,"88140","SURIAUVILLE",18]
[88140,"88140","URVILLE",18]
[88140,"88140","VAUDONCOURT",18]
[88140,"88140","VRECOURT",18]
[88150,"88150","BAYECOURT",8]
[88150,"88150","CHAVELOT",8]
[88150,"88150","GIRMONT",8]
[88150,"88150","IGNEY",8]
[88150,"88150","MAZELEY",8]
[88150,"88150","ONCOURT",8]
[88150,"88150","THAON LES VOSGES",8]
[88150,"88150","VILLONCOURT",8]
[88160,"88160","FRESSE SUR MOSELLE",4]
[88160,"88160","LE MENIL",4]
[88160,"88160","LE THILLOT",4]
[88160,"88160","RAMONCHAMP",4]
[88170,"88170","AOUZE",31]
[88170,"88170","AROFFE",31]
[88170,"88170","BALLEVILLE",31]
[88170,"88170","BIECOURT",31]
[88170,"88170","CHATENOIS",31]
[88170,"88170","COURCELLES SOUS CHATENOIS",31]
[88170,"88170","DARNEY AUX CHENES",31]
[88170,"88170","DOLAINCOURT",31]
[88170,"88170","DOMBROT SUR VAIR",31]
[88170,"88170","DOMMARTIN SUR VRAINE",31]
[88170,"88170","GEMMELAINCOURT",31]
[88170,"88170","GIRONCOURT SUR VRAINE",31]
[88170,"88170","HOUECOURT",31]
[88170,"88170","IMBRECOURT",31]
[88170,"88170","LA NEUVEVILLE SOUS CHATENOIS",31]
[88170,"88170","LONGCHAMP SOUS CHATENOIS",31]
[88170,"88170","MACONCOURT",31]
[88170,"88170","MORELMAISON",31]
[88170,"88170","OLLAINVILLE",31]
[88170,"88170","PLEUVEZAIN",31]
[88170,"88170","RAINVILLE",31]
[88170,"88170","REMOVILLE",31]
[88170,"88170","ROUVRES LA CHETIVE",31]
[88170,"88170","SANDAUCOURT",31]
[88170,"88170","SONCOURT",31]
[88170,"88170","ST MENGE",31]
[88170,"88170","ST PAUL",31]
[88170,"88170","VALAINCOURT",31]
[88170,"88170","VICHEREY",31]
[88170,"88170","VIOCOURT",31]
[88170,"88170","VOUXEY",31]
[88190,"88190","GOLBEY",1]
[88200,"88200","DOMMARTIN LES REMIREMONT",{"$f":"COUNTIF($B$2:$B$5669,B5250)","v":5}]
[88200,"88200","REMIREMONT",5]
[88200,"88200","ST ETIENNE LES REMIREMONT",5]
[88200,"88200","ST NABORD",5]
[88200,"88200","VECOUX",5]
[88210,"88210","BAN DE SAPT",17]
[88210,"88210","BELVAL",17]
[88210,"88210","CHATAS",17]
[88210,"88210","DENIPAIRE",17]
[88210,"88210","GRANDRUPT",17]
[88210,"88210","HURBACHE",17]
[88210,"88210","LA PETITE RAON",17]
[88210,"88210","LE MONT",17]
[88210,"88210","LE PUID",17]
[88210,"88210","LE SAULCY",17]
[88210,"88210","LE VERMONT",17]
[88210,"88210","MENIL DE SENONES",17]
[88210,"88210","MOUSSEY",17]
[88210,"88210","SENONES",17]
[88210,"88210","ST JEAN D'ORMONT",17]
[88210,"88210","ST STAIL",17]
[88210,"88210","VIEUX MOULIN",17]
[88220,"88220","AMEREY",7]
[88220,"88220","DOUNOUX",7]
[88220,"88220","HADOL",7]
[88220,"88220","RAON AUX BOIS",7]
[88220,"88220","URIMENIL",7]
[88220,"88220","UZEMAIN",7]
[88220,"88220","XERTIGNY",7]
[88230,"88230","ANOULD",9]
[88230,"88230","BAN SUR MEURTHE",9]
[88230,"88230","CLEFCY",9]
[88230,"88230","ENTRE DEUX EAUX",9]
[88230,"88230","FRAIZE",9]
[88230,"88230","LE VALTIN",9]
[88230,"88230","MANDRAY",9]
[88230,"88230","PLAINFAING",9]
[88230,"88230","ST LEONARD",9]
[88240,"88240","BAINS LES BAINS",16]
[88240,"88240","FONTENOY LE CHATEAU",16]
[88240,"88240","GRANDRUPT DE BAINS",16]
[88240,"88240","GREMIFONTAINE",16]
[88240,"88240","GRUEY LES SURANCE",16]
[88240,"88240","HARSAULT",16]
[88240,"88240","HAUTMOUGEY",16]
[88240,"88240","LA CHAPELLE AUX BOIS",16]
[88240,"88240","LA FORGE DE THUNIMONT",16]
[88240,"88240","LA HAYE",16]
[88240,"88240","LE CLERJUS",16]
[88240,"88240","LE MAGNY",16]
[88240,"88240","LES VOIVRES",16]
[88240,"88240","MONTMOTIER",16]
[88240,"88240","THUNIMONT",16]
[88240,"88240","TREMONZEY",16]
[88250,"88250","LA BRESSE",1]
[88260,"88260","ATTIGNY",23]
[88260,"88260","BELMONT LES DARNEY",23]
[88260,"88260","BELRUPT",23]
[88260,"88260","BONVILLET",23]
[88260,"88260","DARNEY",23]
[88260,"88260","DOMBASLE DEVANT DARNEY",23]
[88260,"88260","DOMMARTIN LES VALLOIS",23]
[88260,"88260","ESCLES",23]
[88260,"88260","ESLEY",23]
[88260,"88260","HENNEZEL",{"$f":"COUNTIF($B$2:$B$5669,B5314)","v":23}]
[88260,"88260","JESONVILLE",23]
[88260,"88260","LERRAIN",23]
[88260,"88260","LES VALLOIS",23]
[88260,"88260","NONVILLE",23]
[88260,"88260","PONT LES BONFAYS",23]
[88260,"88260","PROVENCHERES LES DARNEY",23]
[88260,"88260","RELANGES",23]
[88260,"88260","SANS VALLOIS",23]
[88260,"88260","SENONGES",23]
[88260,"88260","ST BASLEMONT",23]
[88260,"88260","THUILLIERES",23]
[88260,"88260","VIOMENIL",23]
[88260,"88260","VIVIERS LE GRAS",23]
[88270,"88270","ADOMPT",31]
[88270,"88270","BAINVILLE AUX SAULES",31]
[88270,"88270","BAZEGNEY",31]
[88270,"88270","BEGNECOURT",31]
[88270,"88270","BOCQUEGNEY",31]
[88270,"88270","BOUXIERES AUX BOIS",31]
[88270,"88270","BOUZEMONT",31]
[88270,"88270","CHARMOIS L'ORGUEILLEUX",31]
[88270,"88270","CIRCOURT",31]
[88270,"88270","DAMAS ET BETTEGNEY",31]
[88270,"88270","DERBAMONT",31]
[88270,"88270","DOMPAIRE",31]
[88270,"88270","FRENOIS",31]
[88270,"88270","GELVECOURT ET ADOMPT",31]
[88270,"88270","GORHEY",31]
[88270,"88270","HAGECOURT",31]
[88270,"88270","HAROL",31]
[88270,"88270","HENNECOURT",31]
[88270,"88270","LEGEVILLE ET BONFAYS",31]
[88270,"88270","LES ABLEUVENETTES",31]
[88270,"88270","MADECOURT",31]
[88270,"88270","MADONNE ET LAMEREY",31]
[88270,"88270","MARONCOURT",31]
[88270,"88270","PIERREFITTE",31]
[88270,"88270","RACECOURT",31]
[88270,"88270","RANCOURT",31]
[88270,"88270","ST VALLIER",31]
[88270,"88270","VALFROICOURT",31]
[88270,"88270","VALLEROY AUX SAULES",31]
[88270,"88270","VELOTTE ET TATIGNECOURT",31]
[88270,"88270","VILLE SUR ILLON",31]
[88290,"88290","SAULXURES SUR MOSELOTTE",2]
[88290,"88290","THIEFOSSE",2]
[88300,"88300","ATTIGNEVILLE",26]
[88300,"88300","AULNOIS",26]
[88300,"88300","AUTIGNY LA TOUR",26]
[88300,"88300","AUTREVILLE",26]
[88300,"88300","BARVILLE",26]
[88300,"88300","BAZOILLES SUR MEUSE",26]
[88300,"88300","BEAUFREMONT",26]
[88300,"88300","CERTILLEUX",26]
[88300,"88300","CIRCOURT SUR MOUZON",26]
[88300,"88300","HAGNEVILLE ET RONCOURT",26]
[88300,"88300","HARCHECHAMP",26]
[88300,"88300","HARMONVILLE",26]
[88300,"88300","HOUEVILLE",26]
[88300,"88300","JAINVILLOTTE",26]
[88300,"88300","LANDAVILLE",26]
[88300,"88300","LEMMECOURT",26]
[88300,"88300","MARTIGNY LES GERBONVAUX",26]
[88300,"88300","MONT LES NEUFCHATEAU",{"$f":"COUNTIF($B$2:$B$5669,B5378)","v":26}]
[88300,"88300","NEUFCHATEAU",26]
[88300,"88300","POMPIERRE",26]
[88300,"88300","REBEUVILLE",26]
[88300,"88300","ROLLAINVILLE",26]
[88300,"88300","RONCOURT",26]
[88300,"88300","SARTES",26]
[88300,"88300","TILLEUX",26]
[88300,"88300","TRANQUEVILLE GRAUX",26]
[88310,"88310","CORNIMONT",2]
[88310,"88310","VENTRON",2]
[88320,"88320","AINVELLE",22]
[88320,"88320","BLEVAINCOURT",22]
[88320,"88320","DAMBLAIN",22]
[88320,"88320","FOUCHECOURT",22]
[88320,"88320","FRAIN",22]
[88320,"88320","GIGNEVILLE",22]
[88320,"88320","ISCHES",22]
[88320,"88320","LAMARCHE",22]
[88320,"88320","MAREY",22]
[88320,"88320","MARTIGNY LES BAINS",22]
[88320,"88320","MONT LES LAMARCHE",22]
[88320,"88320","MORIZECOURT",22]
[88320,"88320","ROBECOURT",22]
[88320,"88320","ROCOURT",22]
[88320,"88320","ROMAIN AUX BOIS",22]
[88320,"88320","ROZIERES SUR MOUZON",22]
[88320,"88320","SENAIDE",22]
[88320,"88320","SERECOURT",22]
[88320,"88320","SEROCOURT",22]
[88320,"88320","TIGNECOURT",22]
[88320,"88320","TOLLAINCOURT",22]
[88320,"88320","VILLOTTE",22]
[88330,"88330","BADMENIL AUX BOIS",12]
[88330,"88330","CHATEL SUR MOSELLE",12]
[88330,"88330","DAMAS AUX BOIS",12]
[88330,"88330","DOMEVRE SUR DURBION",12]
[88330,"88330","HADIGNY LES VERRIERES",12]
[88330,"88330","HAILLAINVILLE",12]
[88330,"88330","MORIVILLE",12]
[88330,"88330","PALLEGNEY",12]
[88330,"88330","PORTIEUX",12]
[88330,"88330","REHAINCOURT",12]
[88330,"88330","VAXONCOURT",12]
[88330,"88330","ZINCOURT",12]
[88340,"88340","GIRMONT VAL D'AJOL",2]
[88340,"88340","LE VAL D'AJOL",2]
[88350,"88350","BRECHAINVILLE",7]
[88350,"88350","FREVILLE",7]
[88350,"88350","GRAND",7]
[88350,"88350","LIFFOL LE GRAND",7]
[88350,"88350","PARGNY SOUS MUREAU",7]
[88350,"88350","TRAMPOT",7]
[88350,"88350","VILLOUXEL",7]
[88360,"88360","FERDRUPT",2]
[88360,"88360","RUPT SUR MOSELLE",2]
[88370,"88370","BELLEFONTAINE",4]
[88370,"88370","GRANGES DE PLOMBIERES",4]
[88370,"88370","PLOMBIERES LES BAINS",4]
[88370,"88370","RUAUX",4]
[88380,"88380","ARCHES",2]
[88380,"88380","ARCHETTES",2]
[88390,"88390","CHAUMOUSEY",11]
[88390,"88390","DARNIEULLES",11]
[88390,"88390","DOMEVRE SUR AVIERE",{"$f":"COUNTIF($B$2:$B$5669,B5442)","v":11}]
[88390,"88390","DOMMARTIN AUX BOIS",11]
[88390,"88390","FOMEREY",11]
[88390,"88390","GIGNEY",11]
[88390,"88390","GIRANCOURT",11]
[88390,"88390","LES FORGES",11]
[88390,"88390","RENAUVOID",11]
[88390,"88390","SANCHEY",11]
[88390,"88390","UXEGNEY",11]
[88400,"88400","GERARDMER",3]
[88400,"88400","LIEZEY",3]
[88400,"88400","XONRUPT LONGEMER",3]
[88410,"88410","AMEUVELLE",13]
[88410,"88410","BLEURVILLE",13]
[88410,"88410","CHATILLON SUR SAONE",13]
[88410,"88410","CLAUDON",13]
[88410,"88410","FIGNEVELLE",13]
[88410,"88410","GODONCOURT",13]
[88410,"88410","GRIGNONCOURT",13]
[88410,"88410","LES THONS",13]
[88410,"88410","LIRONCOURT",13]
[88410,"88410","MARTINVELLE",13]
[88410,"88410","MONTHUREUX SUR SAONE",13]
[88410,"88410","REGNEVELLE",13]
[88410,"88410","ST JULIEN",13]
[88420,"88420","MOYENMOUTIER",1]
[88430,"88430","ARRENTES DE CORCIEUX",6]
[88430,"88430","BIFFONTAINE",6]
[88430,"88430","CORCIEUX",6]
[88430,"88430","GERBEPAL",6]
[88430,"88430","LA HOUSSIERE",6]
[88430,"88430","VIENVILLE",6]
[88440,"88440","FRIZON",2]
[88440,"88440","NOMEXY",2]
[88450,"88450","BETTEGNEY ST BRICE",7]
[88450,"88450","EVAUX ET MENIL",7]
[88450,"88450","GUGNEY AUX AULX",7]
[88450,"88450","MADEGNEY",7]
[88450,"88450","REGNEY",7]
[88450,"88450","VARMONZEY",7]
[88450,"88450","VINCEY",7]
[88460,"88460","CHARMOIS DEVANT BRUYERES",8]
[88460,"88460","CHENIMENIL",8]
[88460,"88460","DOCELLES",8]
[88460,"88460","FAUCOMPIERRE",8]
[88460,"88460","LA BAFFE",8]
[88460,"88460","LE ROULIER",8]
[88460,"88460","TENDON",8]
[88460,"88460","XAMONTARUPT",8]
[88470,"88470","LA BOURGONCE",5]
[88470,"88470","LA SALLE",5]
[88470,"88470","LA VOIVRE",5]
[88470,"88470","NOMPATELIZE",5]
[88470,"88470","ST MICHEL SUR MEURTHE",5]
[88480,"88480","ETIVAL CLAIREFONTAINE",2]
[88480,"88480","ST REMY",2]
[88490,"88490","COLROY LA GRANDE",10]
[88490,"88490","COMBRIMONT",10]
[88490,"88490","FRAPELLE",10]
[88490,"88490","LA GRANDE FOSSE",10]
[88490,"88490","LA PETITE FOSSE",10]
[88490,"88490","LE BEULAY",10]
[88490,"88490","LESSEUX",10]
[88490,"88490","LUBINE",10]
[88490,"88490","LUSSE",{"$f":"COUNTIF($B$2:$B$5669,B5506)","v":10}]
[88490,"88490","PROVENCHERES SUR FAVE",10]
[88500,"88500","AHEVILLE",42]
[88500,"88500","AMBACOURT",42]
[88500,"88500","AVILLERS",42]
[88500,"88500","BAUDRICOURT",42]
[88500,"88500","BAZOILLES ET MENIL",42]
[88500,"88500","BETTONCOURT",42]
[88500,"88500","BLEMEREY",42]
[88500,"88500","BOULAINCOURT",42]
[88500,"88500","CHAUFFECOURT",42]
[88500,"88500","CHEF HAUT",42]
[88500,"88500","DOMBASLE EN XAINTOIS",42]
[88500,"88500","DOMEVRE SOUS MONTFORT",42]
[88500,"88500","DOMVALLIER",42]
[88500,"88500","ESTRENNES",42]
[88500,"88500","FRENELLE LA GRANDE",42]
[88500,"88500","FRENELLE LA PETITE",42]
[88500,"88500","GIRCOURT LES VIEVILLE",42]
[88500,"88500","HYMONT",42]
[88500,"88500","JORXEY",42]
[88500,"88500","JUVAINCOURT",42]
[88500,"88500","MATTAINCOURT",42]
[88500,"88500","MAZIROT",42]
[88500,"88500","MENIL EN XAINTOIS",42]
[88500,"88500","MIRECOURT",42]
[88500,"88500","OELLEVILLE",42]
[88500,"88500","OFFROICOURT",42]
[88500,"88500","PONT SUR MADON",42]
[88500,"88500","POUSSAY",42]
[88500,"88500","PUZIEUX",42]
[88500,"88500","RAMECOURT",42]
[88500,"88500","REMICOURT",42]
[88500,"88500","REPEL",42]
[88500,"88500","ROUVRES EN XAINTOIS",42]
[88500,"88500","ROZEROTTE",42]
[88500,"88500","ST PRANCHER",42]
[88500,"88500","THIRAUCOURT",42]
[88500,"88500","TOTAINVILLE",42]
[88500,"88500","VAUBEXY",42]
[88500,"88500","VILLERS",42]
[88500,"88500","VIVIERS LES OFFROICOURT",42]
[88500,"88500","VOMECOURT SUR MADON",42]
[88500,"88500","VROVILLE",42]
[88510,"88510","ELOYES",1]
[88520,"88520","BAN DE LAVELINE",6]
[88520,"88520","BERTRIMOUTIER",6]
[88520,"88520","GEMAINGOUTTE",6]
[88520,"88520","LA CROIX AUX MINES",6]
[88520,"88520","RAVES",6]
[88520,"88520","WISEMBACH",6]
[88530,"88530","BOUVACOTE",3]
[88530,"88530","LA FORGE",3]
[88530,"88530","LE THOLY",3]
[88540,"88540","BUSSANG",1]
[88550,"88550","JARMENIL",2]
[88550,"88550","POUXEUX",2]
[88560,"88560","ST MAURICE SUR MOSELLE",1]
[88580,"88580","SAULCY SUR MEURTHE",1]
[88600,"88600","AYDOILLES",36]
[88600,"88600","BEAUMENIL",36]
[88600,"88600","BELMONT SUR BUTTANT",36]
[88600,"88600","BOIS DE CHAMP",36]
[88600,"88600","BROUVELIEURES",36]
[88600,"88600","BRUYERES",{"$f":"COUNTIF($B$2:$B$5669,B5570)","v":36}]
[88600,"88600","CHAMP LE DUC",36]
[88600,"88600","DESTORD",36]
[88600,"88600","DEYCIMONT",36]
[88600,"88600","DOMFAING",36]
[88600,"88600","DOMPIERRE",36]
[88600,"88600","FAYS",36]
[88600,"88600","FIMENIL",36]
[88600,"88600","FONTENAY",36]
[88600,"88600","FREMIFONTAINE",36]
[88600,"88600","GIRECOURT SUR DURBION",36]
[88600,"88600","GRANDVILLERS",36]
[88600,"88600","GUGNECOURT",36]
[88600,"88600","HERPELMONT",36]
[88600,"88600","LA CHAPELLE DEVANT BRUYERES",36]
[88600,"88600","LA NEUVEVILLE DEVANT LEPANGES",36]
[88600,"88600","LAVAL SUR VOLOGNE",36]
[88600,"88600","LAVELINE DEVANT BRUYERES",36]
[88600,"88600","LE BOULAY",36]
[88600,"88600","LEPANGES SUR VOLOGNE",36]
[88600,"88600","LES POULIERES",36]
[88600,"88600","LES ROUGES EAUX",36]
[88600,"88600","MEMENIL",36]
[88600,"88600","MORTAGNE",36]
[88600,"88600","NONZEVILLE",36]
[88600,"88600","PIERREPONT SUR L'ARENTELE",36]
[88600,"88600","PREY",36]
[88600,"88600","SERCOEUR",36]
[88600,"88600","ST JEAN DU MARCHE",36]
[88600,"88600","VERVEZELLE",36]
[88600,"88600","VIMENIL",36]
[88630,"88630","AVRANVILLE",16]
[88630,"88630","CHERMISEY",16]
[88630,"88630","CLEREY LA COTE",16]
[88630,"88630","COUSSEY",16]
[88630,"88630","DOMREMY LA PUCELLE",16]
[88630,"88630","FREBECOURT",16]
[88630,"88630","GREUX",16]
[88630,"88630","JUBAINVILLE",16]
[88630,"88630","MAXEY SUR MEUSE",16]
[88630,"88630","MIDREVAUX",16]
[88630,"88630","MONCEL SUR VAIR",16]
[88630,"88630","PUNEROT",16]
[88630,"88630","RUPPES",16]
[88630,"88630","SERAUMONT",16]
[88630,"88630","SIONNE",16]
[88630,"88630","SOULOSSE SOUS ST ELOPHE",16]
[88640,"88640","AUMONTZEY",7]
[88640,"88640","BARBEY SEROUX",7]
[88640,"88640","CHAMPDRAY",7]
[88640,"88640","GRANGES SUR VOLOGNE",7]
[88640,"88640","JUSSARUPT",7]
[88640,"88640","LAVELINE DU HOUX",7]
[88640,"88640","REHAUPAL",7]
[88700,"88700","ANGLEMONT",31]
[88700,"88700","AUTREY",31]
[88700,"88700","BAZIEN",31]
[88700,"88700","BRU",31]
[88700,"88700","BULT",31]
[88700,"88700","CLEZENTAINE",31]
[88700,"88700","DEINVILLERS",31]
[88700,"88700","DOMPTAIL",31]
[88700,"88700","DONCIERES",31]
[88700,"88700","FAUCONCOURT",31]
[88700,"88700","HARDANCOURT",{"$f":"COUNTIF($B$2:$B$5669,B5634)","v":31}]
[88700,"88700","HOUSSERAS",31]
[88700,"88700","JEANMENIL",31]
[88700,"88700","MENARMONT",31]
[88700,"88700","MENIL SUR BELVITTE",31]
[88700,"88700","MOYEMONT",31]
[88700,"88700","NOSSONCOURT",31]
[88700,"88700","ORTONCOURT",31]
[88700,"88700","PADOUX",31]
[88700,"88700","RAMBERVILLERS",31]
[88700,"88700","ROMONT",31]
[88700,"88700","ROVILLE AUX CHENES",31]
[88700,"88700","ST BENOIT LA CHIPOTTE",31]
[88700,"88700","ST GENEST",31]
[88700,"88700","ST GORGON",31]
[88700,"88700","ST MAURICE SUR MORTAGNE",31]
[88700,"88700","ST PIERREMONT",31]
[88700,"88700","STE BARBE",31]
[88700,"88700","STE HELENE",31]
[88700,"88700","VOMECOURT",31]
[88700,"88700","XAFFEVILLERS",31]
[88800,"88800","BELMONT SUR VAIR",15]
[88800,"88800","DOMJULIEN",15]
[88800,"88800","GIROVILLERS SOUS MONTFORT",15]
[88800,"88800","HAREVILLE",15]
[88800,"88800","LA NEUVEVILLE SOUS MONTFORT",15]
[88800,"88800","LIGNEVILLE",15]
[88800,"88800","MANDRES SUR VAIR",15]
[88800,"88800","MONTHUREUX LE SEC",15]
[88800,"88800","NORROY",15]
[88800,"88800","PAREY SOUS MONTFORT",15]
[88800,"88800","REMONCOURT",15]
[88800,"88800","ST REMIMONT",15]
[88800,"88800","THEY SOUS MONTFORT",15]
[88800,"88800","VALLEROY LE SEC",15]
[88800,"88800","VITTEL",15]

{"sheet":"Feuil1","index":7,"n_rows":37,"n_cols":34,"rows_kept":37,"cut":false,"hidden":false,"merged":[]}
["Code","Nom Parrain\nFilleul ","Année","MOIS",null,null,null,null,"Sem","N°-Parrain\nN°- filleul","Num Filleul","Parrain\nNb. filleul","Parrain\nfilleul","Date","Commercial","nom\nParrain","prénom\nParrain","Téléphone\nParrain","nom\nFilleul","Prénom\nFilleul","Téléphone\nFilleul","N°- Rue","Nom Rue","CP","Commune","Date\n Phonning","relance1","relance2","Résultat\nPhonning","date/rdv client","Vente","date de pose","Pose en M²","pose effectue"]
[null,{"$f":"IF(I2=\"vide\",0,IF($I2=\"P\",\"Parrain\"&\" \"&$L2&\" \"&$M2,IF($I2=\"F\",\"Parrain\"&\" \"&$L2&\" \"&$M2&\" Filleul\"&\" \"&$O2&\" \"&$P2)))","v":"Parrain client 104 Nom client 104 Prénom Filleul  "},{"$f":"YEAR($J$2)","v":2022},{"$f":"MONTH($J$2)","v":2},{"$f":"WEEKNUM($J$2,21)","v":8},{"$f":"IF(AND(L2<>\"\",M2<>\"\",I2<>\"\"),COUNTIF($I20:$I$210,I2),0)+1","v":1},{"$f":"IF(AND(L2=\"\",M2=\"\"),0,IF(I2=\"P\",COUNTIF($I$20:$I210,\"P\"),COUNTIF($L$20:$L210,$L20)-1))","v":-1},{"$f":"IF(AD2=\"\",0,IF(OR(I2=\"F\",I2=\"vide\"),0,COUNTIFS($L$20:$L$210,IF($I2=\"P\",$L2,0),$AD$20:$AD$210,\"OK\")-1))","v":0},"F","2022-02-21","JEAN","client 104 Nom","client 104 Prénom",680614822]
[null,"=SI($K2=\"\";0;$C$2&\"_\"&E2&\"_C\"&RECHERCHEV(K2;Grand_Est!$I$20:$J$34;2;0)&\"_P_\"&NB.SI($I2:$I$210;\"P\")&\"_\"&SI(I2=\"F\";\"F\"&NB.SI($I2:$I$210;\"F\");\"000\"))"]
[]
["CmD_Modification","2022-04-03",{"$f":"WEEKNUM(B5,2)","v":14}]
["CmD_Sauve"]
["cmdClose"]
["cmdDelete"]
["cmdReset",null,null,null,null,null,"        .Lbl_Date_Jour      'Ok date   10"]
["Frame3"]
["Lbl_Date_Jour",null,null,null,null,null,"        .TextB_Commercial = \"\"  ' ok    11"]
["OptB_Filleul"]
["OptB_Parrain",null,null,null,"P","F","        .OptB_Parrain = False       'ok     9","F"]
["TextB_CF",null,null,null,null,null,"        .OptB_Filleul = False        'ok     9"]
["TextB_Commercial"]
["TextB_CP",null,null,"        .TextB_NP = \"\"     'ok  12","P","F",null,"F","        .TextB_NF = \"\"     'ok  15"]
["TextB_CPF",null,null,"        .TextB_PP = \"\"  'ok 13","P","F",null,"F","        .TextB_PF = \"\"     'ok  16"]
["TextB_CPP",null,null,"        .TextB_PhoneP = \"\"     'ok  14","P","F",null,"F","        .TextB_PhoneF = \"\"     'ok  17"]
["TextB_DPh",null,null,"        .TextB_NRP = \"\"     'ok 18","P",null,null,"F","        .TextB_NRF = \"\"     'ok 18"]
["TextB_DPose",null,null,"        .TextB_RP = \"\"     'ok  19","P",null,null,"F","        .TextB_RF = \"\"     'ok  19"]
["TextB_DR1",null,null,"        .TextB_CPP = \"\"     'ok 20","P",null,null,"F","        .TextB_CPF = \"\"     'ok 20"]
["TextB_DR2",null,null,"        .TextB_CP = \"\"      'ok 21","P",null,null,"F","        .TextB_CF = \"\"      'ok 21"]
["TextB_DRDV"]
["TextB_NF",null,null,null,null,null,"        .TextB_DPh = \"\" '22"]
["TextB_NP",null,null,null,null,null,"        .TextB_DR1 = \"\" '23"]
["TextB_NRF",null,null,null,null,null,"        .TextB_DR2 = \"\" '24"]
["TextB_NRP",null,null,null,null,null,"        .TextB_RPh = \"\" '25"]
["TextB_PF",null,null,null,null,null,"        .TextB_DRDV = \"\"     '26"]
["TextB_PhoneF",null,null,null,null,null,"        .TextB_Vente = \"\"   '27"]
["TextB_PhoneP",null,null,null,null,null,"        .TextB_Pose_Ok = \"\" '30"]
["TextB_Pose_Ok",null,null,null,null,null,"        .TextB_PoseM = \"\"   '29"]
["TextB_PoseM",null,null,null,null,null,"        .TextB_DPose = \"\"   '28"]
["TextB_PP"]
["TextB_RF"]
["TextB_RP"]
["TextB_RPh"]
["TextB_Vente"]