{"text_format":"1","workbook":"xlsx","n_sheets":6,"sheets":["Choix de l'instrument ","Mes listes","Domaines de mesure","SOUS Domaines","Masse","Dim av contact 3d"],"not_rendered":{"charts":0,"images":0,"macros":1,"external_links":0,"defined_names":102,"comments":0,"pivot_tables":0},"unopened":[],"bounds":{"document_bytes":16777216,"sheet_cells":100000,"rows_first":2000,"rows_last":500,"rows_between":2000,"halvings":0,"cell_chars":16384,"cell_head_chars":4096},"cells_cut":0,"cells_raw":0,"read":"whole","date_system":"1900"}

{"sheet":"Choix de l'instrument ","index":0,"n_rows":3,"n_cols":6,"rows_kept":3,"cut":false,"hidden":false,"merged":[]}
[null,null,null,null,"Avec fonction RECHERCHEV"]
[null,"Domaine de mesure ","Sous domaine ","IT","Identification ","Lien "]
[null,"Pesage","Masse",8.0710000000000004E-2,{"$f":"IF($D$3<>\"\",VLOOKUP($D$3,INDIRECT(\"'cece-38_Copie-de-Choix-instruments-v4 (1).xlsm'!\"&$C$3 &\"_tab\"),3,FALSE),\"\")","v":"B.001"},{"$f":"IF($D$3<>\"\",VLOOKUP($D$3,INDIRECT(\"'cece-38_Copie-de-Choix-instruments-v4 (1).xlsm'!\"&$C$3 &\"_tab\"),2,FALSE),\"\")","v":"Afficher"}]

{"sheet":"Mes listes","index":1,"n_rows":18,"n_cols":33,"rows_kept":18,"cut":false,"hidden":false,"merged":[]}
["Angle","Aspect","Couple","Débit","Densité","Détection","Diamètre","Dimensionnel","Dureté","Electrique ","Etalonnage","Filetage","Force","Fréquence","Fuite","Géométrie","Hauteur","Hygrométrie","Lumière","Pesage","Physico_chimique","Pression","Propreté","Réctitude","Rugosité","Son","Spectrométrie","Taraudage","Température","Vitesse","Volumétrie",null,"Masse"]
["Angle_incliné","Aspect _avec_mesure","Couple","Débit_capteur","Densité","Détection_gaz","ø_exter","Epaisseur","Dureté_Hv_Hrc ","Electricité_Conductivité","Etalonnage _Epaisseur","Filetage","Force","Fréquence","Fuite","Géométrie","Hauteur","Hygrométrie","Lumière","Masse","Physico_chimique","Pression","Propreté_surface","Réctitude","Rugosité","Son","Spectrométrie","Taraudage","Température","Vitesse","Volume"]
["Angle_mesure ","Aspect_sans_mesure",null,"Débit_générateur",null,null,"ø_exter_longueur","Epaisseur_par_micromètre","Dureté_Shore_A","Electricité_Courant","Etalonnage_Rugosité",null,"Force_Jauge_de_Contrainte",null,null,null,null,null,null,null,null,null,null,"Réglage_réctitude",null,null,null,null,"Température_hygrométrie"]
[null,null,null,"Débit_quantifié",null,null,"ø_exter_ø_inter_longueur","Epaisseur_Ultrason",null,"Electricité_Résistance","Etalonnage_Dureté"]
[null,null,null,null,null,null,"ø_exter_longueur","Dimensionnel_sans_contact_2D",null,"Electricité_Rotophase","Etalonnage_Battement"]
[null,null,null,null,null,null,"ø_inter","Dimensions_avec_contact_3D",null,"Electricité_Statique","Etalonnage_Dimensionnel"]
[null,null,null,null,null,null,"ø_inter_exter_longueur","Dimensions_sans_contact_2D",null,"Electrique_Puissance","Etalonnage_Dureté"]
[null,null,null,null,null,null,null,null,null,null,"Etalonnage_Epaisseur"]
[null,null,null,null,null,null,null,null,null,null,"Etalonnage_Fluorescence"]
[null,null,null,null,null,null,null,null,null,null,"Etalonnage_Fuite"]
[null,null,null,null,null,null,null,null,null,null,"Etalonnage_Instrument_optique"]
[null,null,null,null,null,null,null,null,null,null,"Etalonnage_Mesure_étalon"]
[null,null,null,null,null,null,null,null,null,null,"Etalonnage_Micromètre"]
[null,null,null,null,null,null,null,null,null,null,"Etalonnage_Perte_de_charge"]
[null,null,null,null,null,null,null,null,null,null,"Etalonnage_Pesage"]
[null,null,null,null,null,null,null,null,null,null,"Etalonnage_Pression"]
[null,null,null,null,null,null,null,null,null,null,"Etalonnage_Projecteur"]
[null,null,null,null,null,null,null,null,null,null,"Etalonnage_Rugosité"]

{"sheet":"Domaines de mesure","index":2,"n_rows":32,"n_cols":1,"rows_kept":32,"cut":false,"hidden":false,"merged":[[0,0,0,2]]}
["Domaines_de_mesure"]
["Angle"]
["Aspect"]
["Couple"]
["Débit"]
["Densité"]
["Détection"]
["Diamètre"]
["Dimensionnel"]
["Dureté"]
["Electrique "]
["Etalonnage"]
["Filetage"]
["Force"]
["Fréquence"]
["Fuite"]
["Géométrie"]
["Hauteur"]
["Hygrométrie"]
["Lumière"]
["Pesage"]
["Physico_chimique"]
["Pression"]
["Propreté"]
["Réctitude"]
["Rugosité"]
["Son"]
["Spectrométrie"]
["Taraudage"]
["Température"]
["Vitesse"]
["Volumétrie"]

{"sheet":"SOUS Domaines","index":3,"n_rows":73,"n_cols":1,"rows_kept":73,"cut":false,"hidden":false,"merged":[[0,0,0,2]]}
["Sous_Domaines"]
["Angle_incliné"]
["Angle_mesure "]
["Aspect _avec_mesure"]
["Aspect_sans_mesure"]
["Couple"]
["Débit_capteur"]
["Débit_générateur"]
["Débit_quantifié"]
["Densité"]
["Détection_gaz"]
["Dimensionnel_Epaisseur"]
["Dimensionnel_sans_contact_2D"]
["Dimensions_avec_contact_3D"]
["Dimensions_sans_contact_2D"]
["Dureté_Hv_Hrc "]
["Dureté_Shore_A"]
["Electricité_Conductivité"]
["Electricité_Courant"]
["Electricité_Résistance"]
["Electricité_Rotophase"]
["Electricité_Statique"]
["Electrique_Puissance"]
["Epaisseur"]
["Epaisseur_par_micromètre"]
["Epaisseur_Ultrason"]
["Etalonnage _Epaisseur"]
["Etalonnage_Rugosité"]
["Etalonnage_Dureté"]
["Etalonnage_Battement"]
["Etalonnage_Dimensionnel"]
["Etalonnage_Dureté"]
["Etalonnage_Epaisseur"]
["Etalonnage_Fluorescence"]
["Etalonnage_Fuite"]
["Etalonnage_Instrument_optique"]
["Etalonnage_Mesure_étalon"]
["Etalonnage_Micromètre"]
["Etalonnage_Perte_de_charge"]
["Etalonnage_Pesage"]
["Etalonnage_Pression"]
["Etalonnage_Projecteur"]
["Etalonnage_Rugosité"]
["Filetage"]
["Force"]
["Force_Jauge_de_Contrainte"]
["Fréquence"]
["Fuite"]
["Géométrie"]
["Hauteur"]
["Hygrométrie"]
["ø_exter"]
["ø_exter_longueur"]
["ø_exter_ø_inter_longueur"]
["ø_exter_longueur"]
["ø_inter"]
["ø_inter_exter_longueur"]
["Lumière"]
["Masse"]
["Physico_chimique"]
["Pression"]
["Propreté_surface"]
["Réctitude"]
["Réglage_réctitude"]
["Rugosité"]
["Son"]
["Spectrométrie"]
["Taraudage"]
["Température"]
["Température_hygrométrie"]
["Temps"]
["Vitesse"]
["Volume"]

{"sheet":"Masse","index":4,"n_rows":61,"n_cols":17,"rows_kept":61,"cut":false,"hidden":false,"merged":[[0,0,0,11]]}
["PESAGE"]
["Pesage",null,null,null,null,null,"résolution g","Incertitude g","Justesse g","IT mini détectable g","Capacité mini g","Capacité Maxi g"]
["B.078","Peson","Production / 8403 / Bull-blocks","1 / 300 kg",null,"Afficher",50,null,null,"AAA",0,300000,null,"B.078","AAA","Afficher","B.078"]
["MAS_0027","Peson","Technique / 7700 / Armoire Métrologie M1 A","0 / 1000 kg",null,"Afficher",500,null,null,"BBB",1,100000,null,"MAS_0027","BBB","Afficher","MAS_0027"]
["B.072","Balance","Production / 8403 / Etirage Couronnes","1 / 30 kg",null,"Afficher",50,null,null,"CCC",1,100000,null,"B.072","CCC","Afficher","B.072"]
["MAS-0020","Balance","Production / 8403 / Bull-blocks",null,null,"Afficher",1,null,null,null,0,60000,null,"MAS-0020",null,"Afficher","MAS-0020"]
["MAS-0040 /D","Balance","Production / 8404 / Soudure","10 / 30000 g",null,"Afficher",10,null,null,null,0,30000,null,"MAS-0040 /D",null,"Afficher","MAS-0040 /D"]
["B_042","Balance","Client / SERA",null,null,"Afficher",0.1,8.5110000000000005E-2,-2.0500000000000001E-2,"_1_02134A",0,22000,null,"B_042","_1_02134A","Afficher","B_042"]
["MAS-0023","Balance","Client / SERA","24 KG",null,"Afficher",0.1,null,null,null,0,24000,null,"MAS-0023",null,"Afficher","MAS-0023"]
["B.006","Balance","Technique / 7700 / Armoire Prototype P1 D","50 / 31000 g",null,"Afficher",1,null,null,null,50,31000,null,"B.006",null,"Afficher","B.006"]
["B.020","Balance","Technique / 7700 / Armoire Métrologie M1 A","1000 / 125000 mg",null,"Afficher",1E-4,9.5E-4,-9.4000000000000004E-3,1.142E-2,0,125,null,"B.020",1.142E-2,"Afficher","B.020"]
["B.059","Balance","Production / 7700","22000 / 10 g",null,"Afficher",1E-4,0.08,0.1948,0.96,5,22000,null,"B.059",0.96,"Afficher","B.059"]
["B.066","Balance","Technique / 7700 / Armoire Prototype P1 B","10 / 620 g",null,"Afficher",0.01,null,null,null,0.02,620,null,"B.066",null,"Afficher","B.066"]
["B.069","Balance","Technique / 7700 / Table des prototypes","1000 / 60000 g",null,"Afficher",10,null,null,null,400,60000,null,"B.069",null,"Afficher","B.069"]
["B.070","Balance","Production / 7700 / armoir métrologie M2B","0 / 2100 g",null,"Afficher",0.1,null,null,null,0,2100,null,"B.070",null,"Afficher","B.070"]
["B.001","Balance","Production / 8507 / Micro Assemblage","1000 / 410000 mg",null,"Afficher",0.1,6.7299999999999999E-3,8.4799999999999997E-3,8.0710000000000004E-2,0.2,410,null,"B.001",8.0710000000000004E-2,"Afficher","B.001"]
["B.016","Balance","Production / 8016 / Magasin Pièces","10 / 30000 g",null,"Afficher",1,0.17509,4.6800000000000001E-2,"2.10106",5,30000,null,"B.016",2.1010599999999999,"Afficher","B.016"]
["B.018","Balance","Production / 8553 / PRESSE C/C","1 / 100 kg",null,"Afficher",50,null,null,null,1000,100000,null,"B.018",null,"Afficher","B.018"]
["B.023","Balance","Production / 8016 / magasin tubes","1 / 120 g",null,"Afficher",1E-3,5.8E-4,7.3999999999999999E-4,6.9699999999999996E-3,1,120,null,"B.023",6.9699999999999996E-3,"Afficher","B.023"]
["B.025","Balance","Administratif / 8016 / Magasin Tubes","1 / 600 kg",null,"Afficher",10,0,-6.4999999999999997E-3,0,1000,600000,null,"B.025",0,"Afficher","B.025"]
["B.027","Balance","Production / 8510 / Tour de Reprise","0,001 / 15 kg",null,"Afficher",1,null,null,null,50,15000,null,"B.027",null,"Afficher","B.027"]
["B.041","Balance","Administratif / 8016 / Magasin Tubes","10 / 22000 g",null,"Afficher",0.1,9.9500000000000005E-2,-5.7000000000000002E-2,1.19398,5,22000,null,"B.041",1.19398,"Afficher","B.041"]
["B.043","Balance","Production / 8414IMP / contrôle tube implant","50 / 22000 g",null,"Afficher",0.1,0.15548999999999999,0.2288,1.86564,0.5,22000,null,"B.043",1.86564,"Afficher","B.043"]
["B.044","Balance","Production / 8513 / Contrôle Final Pièces","0,01 / 610 g",null,"Afficher",0.01,null,null,null,null,610,null,"B.044",null,"Afficher","B.044"]
["B.049","Balance","Production / 8414 IMP / Laboratoire + local Tubes Impl","1 / 810 g",null,"Afficher",0.01,1.804E-2,-1.0800000000000001E-2,0.21648000000000001,0.5,810,null,"B.049",0.21648000000000001,"Afficher","B.049"]
["B.050","Balance","Production / 8016 / magasin tubes","1 / 22000 g",null,"Afficher",0.1,0.10156999999999999,0.35449999999999998,1.2188099999999999,5,22000,null,"B.050",1.2188099999999999,"Afficher","B.050"]
["B.054","Balance","Production / 8346","1 / 610 g",null,"Afficher",1E-3,2.3999999999999998E-3,-4.0000000000000002E-4,2.8799999999999999E-2,5.0000000000000001E-3,610,null,"B.054",2.8799999999999999E-2,"Afficher","B.054"]
["B.055","Balance","Administratif / 8016 / Magasin Tubes","1 / 610 g",null,"Afficher",0.01,1.1199999999999999E-3,2.3000000000000001E-4,1.3440000000000001E-2,0.05,610,null,"B.055",1.3440000000000001E-2,"Afficher","B.055"]
["B.057","Balance","Production / 8016 / Magasin Pièces","0,5 / 2100 g",null,"Afficher",0.1,null,null,null,0.5,2100,null,"B.057",null,"Afficher","B.057"]
["B.060","Balance","Administratif / 8016 / Magasin Tubes","2 / 300 kg",null,"Afficher",0.1,1.9900000000000001E-2,1E-3,0.23880000000000001,2000,300000,null,"B.060",0.23880000000000001,"Afficher","B.060"]
["B.061","Balance","Production / 8346","0,01 / 210 g",null,"Afficher",1E-3,1E-4,0,8.9999999999999998E-4,0.01,210,null,"B.061",8.9999999999999998E-4,"Afficher","B.061"]
["B.062","Balance","Production / 8444 / Interopérations","1 / 22000 g",null,"Afficher",0.1,null,null,null,5,22000,null,"B.062",null,"Afficher","B.062"]
["B.063","Balance","Production / 8414DIV / Contrôle Final Tubes","50 / 62000 g",null,"Afficher",10,0.99919999999999998,-0.78,11.990399999999999,50,62000,null,"B.063",11.990399999999999,"Afficher","B.063"]
["B.064","Balance","Production / 8414IMP / Local PCA","50 / 34100 g",null,"Afficher",1,0.08,-5.1999999999999998E-3,0.96,50,34000,null,"B.064",0.96,"Afficher","B.064"]
["B.065","Balance","Technique / 7245 / Prototype","100 / 31000 mg",null,"Afficher",1,null,null,null,5,31000,null,"B.065",null,"Afficher","B.065"]
["B.067","Balance","Production / 8016 / magasin pièce","500 / 210000 mg",null,"Afficher",0.01,2.9999999999999997E-4,-5.0000000000000002E-5,3.5500000000000002E-3,0.1,210,null,"B.067",3.5500000000000002E-3,"Afficher","B.067"]
["B.068","Balance","Production / 8400 / Etirage Bancs droits","10 / 2000 g",null,"Afficher",0.1,null,null,null,0.5,2000,null,"B.068",null,"Afficher","B.068"]
["B.071","Balance","Production / 8515 / Production laboratoire","1 / 6200 g",null,"Afficher",0.1,null,null,null,1,6200,null,"B.071",null,"Afficher","B.071"]
["B.076","Balance","Production / 8403 / Redressage Couronnes","200 / 60000 g",null,"Afficher",10,null,null,null,200,60000,null,"B.076",null,"Afficher","B.076"]
["B.077","Balance","Production / 8414IMP","1 / 34100 g",null,"Afficher",0.1,0.2482,-2.52E-2,2.9782999999999999,5,24000,null,"B.077",2.9782999999999999,"Afficher","B.077"]
["B.079","Balance","Production / 8404 / Soudure","1 / 150 kg",null,"Afficher",1000,null,null,null,5000,150000,null,"B.079",null,"Afficher","B.079"]
["BAL-002","Balance","Production / 8444 / Interopérations","100 / 30000 g",null,"Afficher",10,null,null,null,200,30000,null,"BAL-002",null,"Afficher","BAL-002"]
["BAL-003","Balance","Production / 8414IMP",null,null,"Afficher",1E-4,5.9999999999999995E-4,2E-3,7.1000000000000004E-3,0.05,220,null,"BAL-003",7.1000000000000004E-3,"Afficher","BAL-003"]
["BAL-005","Balance","Production / 8507 / Micro Assemblage","0,2 / 30 kg",null,"Afficher",10,null,null,null,100,30000,null,"BAL-005",null,"Afficher","BAL-005"]
["BAL-121","Balance","Production / 8515 / Laboratoire",null,null,"Afficher",20,2.8300000000000001E-3,0,3.3939999999999998E-2,400,60000,null,"BAL-121",3.3939999999999998E-2,"Afficher","BAL-121"]
["CF.482","Balance","Production / 8414DIV / Contrôle tube divers","20 / 3000 g",null,"Afficher",1,4.3589999999999997E-2,-5.0000000000000001E-3,0.52307000000000003,20,3000,null,"CF.482",0.52307000000000003,"Afficher","CF.482"]
["MAS-0001","Balance","Production / 8403 / Etirage Couronnes","0 / 300 kg",null,"Afficher",50,null,null,null,1000,300000,null,"MAS-0001",null,"Afficher","MAS-0001"]
["MAS-0002","Balance","Production / 8552 / Presse Automatique",null,null,"Afficher",1,null,null,null,20,3000,null,"MAS-0002",null,"Afficher","MAS-0002"]
["MAS-0007","Balance","Production / 8404 / Soudure","10 / 30000 g",null,"Afficher",10,null,null,null,200,30000,null,"MAS-0007",null,"Afficher","MAS-0007"]
["MAS-0008","Balance","Production / 8403 / Bull-blocks","0,2 / 60 kg",null,"Afficher",20,null,null,null,400,60000,null,"MAS-0008",null,"Afficher","MAS-0008"]
["MAS-0009","Balance","Production / 8346 / Contrôle SPECIAUX","0,1 / 1000 g",null,"Afficher",0.1,null,null,null,2,1000,null,"MAS-0009",null,"Afficher","MAS-0009"]
["MAS-0019","Balance","Production / 8403 / TT904",null,null,"Afficher",10,null,null,null,1000,60000,null,"MAS-0019",null,"Afficher","MAS-0019"]
["MAS-0021","Balance","Production / 8509 / Tronconnage","20 g/ 30000 g",null,"Afficher",1,0.96250000000000002,-0.78849999999999998,11.54996,10,30000,null,"MAS-0021",11.54996,"Afficher","MAS-0021"]
["MAS-0025","Balance","Production / 8016 / magasin pièce",null,null,"Afficher",0.01,1.9E-3,7.6000000000000004E-4,2.2759999999999999E-2,0.02,620,null,"MAS-0025",2.2759999999999999E-2,"Afficher","MAS-0025"]
["MAS-0028","Balance","Technique / 7245 / Prototype","5 / 24100 g",null,"Afficher",5,0.14799999999999999,-1.2244999999999999,1.776,100,24100,null,"MAS-0028",1.776,"Afficher","MAS-0028"]
["MAS-0029","Balance","Production / 8016 / magasin tubes","5 / 24100 g",null,"Afficher",5,0.30984,-2.1204999999999998,3.7180599999999999,20,24100,null,"MAS-0029",3.7180599999999999,"Afficher","MAS-0029"]
["MAS-0030","Balance","Production / 8403 / Laboratoire","20 / 30000 g",null,"Afficher",20,null,null,null,400,30000,null,"MAS-0030",null,"Afficher","MAS-0030"]
["MAS-0037","Balance","Technique / 7700","0,02 / 620 g",null,"Afficher",1E-3,null,null,null,0.02,620,null,"MAS-0037",null,"Afficher","MAS-0037"]
["MAS-0038","Balance","Technique / 7700","50 / 34100 g",null,"Afficher",0.1,null,null,null,50,34100,null,"MAS-0038",null,"Afficher","MAS-0038"]
["MAS-0039","Balance","Technique / 7700 / Bureau de Laurent SENEE","0,01 / 120 g",null,"Afficher",1E-4,1.3999999999999999E-4,-5.0000000000000002E-5,1.67E-3,0.01,120,null,"MAS-0039",1.67E-3,"Afficher","MAS-0039"]
["MAS-0041","Balance","Production / 8404 / Soudure","10 / 30000 g",null,"Afficher",null,null,null,null,null,30000,null,"MAS-0041",null,"Afficher","MAS-0041"]

{"sheet":"Dim av contact 3d","index":5,"n_rows":0,"n_cols":0,"rows_kept":0,"cut":false,"hidden":true,"merged":[]}