{"text_format":"1","workbook":"xlsx","n_sheets":3,"sheets":["Suivi","Paramétres","Pour_Impression"],"not_rendered":{"charts":0,"images":1,"macros":1,"external_links":1,"defined_names":3,"comments":1,"pivot_tables":0},"unopened":[],"bounds":{"document_bytes":16777216,"sheet_cells":100000,"rows_first":2000,"rows_last":500,"rows_between":2000,"halvings":0,"cell_chars":16384,"cell_head_chars":4096},"cells_cut":0,"cells_raw":0,"read":"whole","date_system":"1900"}

{"sheet":"Suivi","index":0,"n_rows":39,"n_cols":65,"rows_kept":39,"cut":false,"hidden":false,"merged":[[10,55,12,59],[10,60,12,64],[4,2,4,3],[1,2,1,6],[2,2,2,3],[2,4,2,6],[3,2,3,3],[3,4,3,6],[10,30,12,34],[10,10,12,14],[10,40,12,44],[10,45,12,49],[10,50,12,54],[10,15,12,19],[10,20,12,24],[10,35,12,39],[17,0,17,1],[18,0,18,1],[20,0,20,1],[0,10,1,18],[5,2,5,4],[8,2,8,4],[8,6,8,8],[13,3,13,4],[13,5,13,6],[15,7,15,8],[38,0,38,1],[31,0,31,1],[32,0,32,1],[33,0,33,1],[34,0,34,1],[35,0,35,1],[10,25,12,29],[29,0,29,1],[30,0,30,1],[36,0,36,1],[37,0,37,1],[24,0,24,1],[25,0,25,1],[26,0,26,1],[27,0,27,1],[28,0,28,1],[21,0,21,1],[19,0,19,1],[22,0,22,1],[23,0,23,1],[16,0,16,1]]}
[null,null,"Nous sommes le : ",{"$f":"TODAY()","v":"2022-03-14"},null,null,null,null,null,null,"COMMENTAIRES"]
[null,null,"Détails du projet"]
[null,null,"Projet",null,"Mafalda",null,null,null,"$D$21"]
[null,null,"Chef de projet"]
[null,null,"Date de préparation ",null,"2022-03-07"]
[null,null,"INSCRIPTION AU  PROJET "]
[null,null,"Date du début","Date de fin ","Durée",null,null,null,null,null,null,null," Inscription au projet"]
[null,null,"2022-02-23","2022-03-25",{"$f":"IF(OR(C8=\"\",D8=\"\"),\"\",NETWORKDAYS(C8,D8)& \" jour(s)\")","v":"23 jour(s)"}]
[null,null,"LANCEMENT DU PROJET ",null,null,null,"LANCEMENT DE LA PREPARATION",null,null,null,null,null,"Tâches en cours",null,null,null,null,null,"Tâches terminées",null,null,null,null,null,null,"Préparation",null,null,null,null,"Lancement du projet",null,null,null,null,null,null,"Sous-tâches"]
[null,null,"Date du début","Date de fin ","Durée",null,"Date du début","Date de fin ","Durée"]
[null,null,"2022-04-25","2022-05-06",{"$f":"IF(OR(C11=\"\",D11=\"\"),\"\",NETWORKDAYS(C11,D11)& \" jour(s)\")","v":"10 jour(s)"},null,"2022-03-07","2022-04-22",{"$f":"IF(OR(G11=\"\",H11=\"\"),\"\",NETWORKDAYS(G11,H11)& \" jour(s)\")","v":"35 jour(s)"},null,{"$f":"CHOOSE(WEEKDAY(D14+(Paramétres!B2-1)*7),5,4,3,2,1,0,6)+D14+(Paramétres!B2-1)*7","v":"2022-03-04"},null,null,null,null,{"$f":"K11+7","v":"2022-03-11"},null,null,null,null,{"$f":"P11+7","v":"2022-03-18"},null,null,null,null,{"$f":"U11+7","v":"2022-03-25"},null,null,null,null,{"$f":"Z11+7","v":"2022-04-01"},null,null,null,null,{"$f":"AE11+7","v":"2022-04-08"},null,null,null,null,{"$f":"AJ11+7","v":"2022-04-15"},null,null,null,null,{"$f":"AO11+7","v":"2022-04-22"},null,null,null,null,{"$f":"AT11+7","v":"2022-04-29"},null,null,null,null,{"$f":"AY11+7","v":"2022-05-06"},null,null,null,null,{"$f":"BD11+7","v":"2022-05-13"}]
[]
[]
[null,null,"Lancement de préparation ","2022-03-07",null,"Défiler la semaine ",null,null,null,null,{"$f":"L14-1","v":"2022-02-28"},"2022-03-01","2022-03-02","2022-03-03",{"$f":"K11","v":"2022-03-04"},{"$f":"WORKDAY(O14,1)","v":"2022-03-07"},"2022-03-08","2022-03-09","2022-03-10","2022-03-11","2022-03-14","2022-03-15","2022-03-16","2022-03-17","2022-03-18","2022-03-21","2022-03-22","2022-03-23","2022-03-24","2022-03-25","2022-03-28","2022-03-29","2022-03-30","2022-03-31","2022-04-01","2022-04-04","2022-04-05","2022-04-06","2022-04-07","2022-04-08","2022-04-11","2022-04-12","2022-04-13","2022-04-14","2022-04-15","2022-04-18","2022-04-19",{"$f":"WORKDAY(AU14,1)","v":"2022-04-20"},"2022-04-21","2022-04-22","2022-04-25","2022-04-26","2022-04-27","2022-04-28","2022-04-29","2022-05-02","2022-05-03","2022-05-04","2022-05-05","2022-05-06","2022-05-09","2022-05-10","2022-05-11","2022-05-12","2022-05-13"]
[null,null,null,null,null,null,null,null,null,null,{"$f":"CHOOSE(WEEKDAY(K14,1),\"D\",\"L\",\"M\",\"Me\",\"J\",\"V\",\"S\")","v":"L"},{"$f":"CHOOSE(WEEKDAY(L14,1),\"D\",\"L\",\"M\",\"Me\",\"J\",\"V\",\"S\")","v":"M"},"Me","J","V","L","M","Me","J","V","L","M","Me","J","V","L","M","Me","J","V","L","M","Me","J","V","L","M","Me","J","V","L","M","Me","J","V","L","M","Me","J","V","L","M","Me","J","V",{"$f":"CHOOSE(WEEKDAY(BD14,1),\"D\",\"L\",\"M\",\"Me\",\"J\",\"V\",\"S\")","v":"L"},"M","Me","J","V","L","M","Me","J","V"]
[null,null,null,null,null,null,null,"Pourcentage de travail effectué",null,3.3650793650793653E-2]
["Equipe ",null,"Les Taches demandées ","Sous-tâches","Priorité","Début","Fin","Durée","Status","% "]
[null,null,"Du thème aux questions",null,"Faible","2022-03-09","2022-03-18",{"$f":"IF(OR(F18=0,G18=0),\"\",NETWORKDAYS(F18,G18))","v":8},"Non commencé",0.26500000000000001]
[null,null,null,"SJVD (Point de départ)","Faible","2022-03-14","2022-03-16",3,"Non commencé",0.3]
[null,null,null,"Exploration des ressources","Priorité","2022-03-14","2022-03-18",5,"Non commencé",0.05]
[null,null,null,"Lister/retenir les grandes questions","Priorité","2022-03-14","2022-03-18",5,"Non commencé",0.1]
[null,null,null,"Pistes d'ateliers","Modéré","2022-03-15","2022-03-18",4,"Non commencé",0.35]
[null,null,null,"Organisation générale","Faible","2022-03-16","2022-03-18",3,"Non commencé",0.75]
[null,null,"Ateliers de recherche",null,"Faible","2022-03-23","2022-04-06",11,"Non commencé",0]
[null,null,"Ateliers de recherche",null,"Faible","2022-03-23","2022-04-06",11,"Non commencé",0]
[null,null,"Réseaux",null,"Faible","2022-03-23","2022-04-06",11,"Non commencé",0]
[null,null,"Point du Jour",null,"Faible","2022-03-23","2022-04-06",11,"Non commencé",0]
[null,null,"Organisation des salles, de l'accueil",null,"Faible","2022-03-23","2022-04-06",11,"Non commencé",0]
[null,null,null,"Réunion de préparation (inscrits)","Faible",null,null,"","Non commencé",0]
[null,null,null,null,"Faible",null,null,"","Non commencé",0]
[null,null,null,null,"Faible",null,null,"","Non commencé",0]
[null,null,null,null,"Faible ",null,null,"","Non commencé",0]
[null,null,null,null,"Faible ",null,null,"","Non commencé",0]
[null,null,null,null,"Faible ",null,null,"","Non commencé",0]
[null,null,null,null,"Faible ",null,null,"","Non commencé",0]
[null,null,null,null,"Faible ",null,null,"","Non commencé",0]
[null,null,null,null,"Faible ",null,null,"","Non commencé",0]
[null,null,null,null,"Faible ",null,null,"","Non commencé",0]
[null,null,null,null,"Faible ",null,null,"","Non commencé",0]

{"sheet":"Paramétres","index":1,"n_rows":10,"n_cols":4,"rows_kept":10,"cut":false,"hidden":false,"merged":[]}
["état ","changement de semaine","Utilisateur","Priorité"]
["Achevé",0,"All","Étape 1"]
["En retard",null,"Alice","Étape 2"]
["Statut",null,"Sophie","Étape 3"]
["En cours",null,"Sylvie","Étape 4"]
["non commencé",null,null,"Étape 5"]
[null,null,null,"Priorité"]
[null,null,null,"Faible "]
[null,null,null,"Modéré"]
[null,0,null,"Elevée"]

{"sheet":"Pour_Impression","index":2,"n_rows":20,"n_cols":47,"rows_kept":20,"cut":false,"hidden":false,"merged":[[0,32,2,36],[0,37,2,41],[0,42,2,46],[0,2,2,6],[0,7,2,11],[0,12,2,16],[0,17,2,21],[0,22,2,26],[0,27,2,31]]}
["2022-04-25","2022-05-06","2022-03-04",null,null,null,null,"2022-03-11",null,null,null,null,"2022-03-18",null,null,null,null,"2022-03-25",null,null,null,null,"2022-04-01",null,null,null,null,"2022-04-08",null,null,null,null,"2022-04-15",null,null,null,null,"2022-04-22",null,null,null,null,"2022-04-29"]
[]
[]
["Lancement de préparation ","2022-03-07","2022-02-28","2022-03-01","2022-03-02","2022-03-03","2022-03-04","2022-03-07","2022-03-08","2022-03-09","2022-03-10","2022-03-11","2022-03-14","2022-03-15","2022-03-16","2022-03-17","2022-03-18","2022-03-21","2022-03-22","2022-03-23","2022-03-24","2022-03-25","2022-03-28","2022-03-29","2022-03-30","2022-03-31","2022-04-01","2022-04-04","2022-04-05","2022-04-06","2022-04-07","2022-04-08","2022-04-11","2022-04-12","2022-04-13","2022-04-14","2022-04-15","2022-04-18","2022-04-19","2022-04-20","2022-04-21","2022-04-22","2022-04-25","2022-04-26","2022-04-27","2022-04-28","2022-04-29"]
[null,null,{"$f":"CHOOSE(WEEKDAY(C4,1),\"D\",\"L\",\"M\",\"Me\",\"J\",\"V\",\"S\")","v":"L"},{"$f":"CHOOSE(WEEKDAY(D4,1),\"D\",\"L\",\"M\",\"Me\",\"J\",\"V\",\"S\")","v":"M"},"Me","J","V","L","M","Me","J","V","L","M","Me","J","V","L","M","Me","J","V","L","M","Me","J","V","L","M","Me","J","V","L","M","Me","J","V","L","M","Me","J","V","L","M","Me","J","V"]
[]
["Les Taches demandées ","Sous-tâches"]
["Du thème aux questions",null,null,null,null,null,null,null,null,null,null,null,null,null,null,null,null,"Du thème aux questions - "]
[null,"SJVD (Point de départ)",null,null,null,null,null,null,null,null,null,null,null,null,null," - SJVD (Point de départ)"]
[null,"Exploration des ressources",null,null,null,null,null,null,null,null,null,null,null,null,null,null,null," - Exploration des ressources"]
[null,"Lister/retenir les grandes questions",null,null,null,null,null,null,null,null,null,null,null,null,null,null,null," - Lister/retenir les grandes questions"]
[null,"Pistes d'ateliers",null,null,null,null,null,null,null,null,null,null,null,null,null,null,null," - Pistes d'ateliers"]
[null,"Organisation générale",null,null,null,null,null,null,null,null,null,null,null,null,null,null,null," - Organisation générale"]
[null,"Organisation générale",null,null,null,null,null,null,null,null,null,null,null,null,null,null," - Organisation générale"]
["Ateliers de recherche",null,null,null,null,null,null,null,null,null,null,null,null,null,null,null,null,null,null,null,null,null,null,null,null,null,null,null,null,null,"Ateliers de recherche - "]
["Ateliers de recherche",null,null,null,null,null,null,null,null,null,null,null,null,null,null,null,null,null,null,null,null,null,null,null,null,null,null,null,null,null,"Ateliers de recherche - "]
["Réseaux",null,null,null,null,null,null,null,null,null,null,null,null,null,null,null,null,null,null,null,null,null,null,null,null,null,null,null,null,null,"Réseaux - "]
["Point du Jour",null,null,null,null,null,null,null,null,null,null,null,null,null,null,null,null,null,null,null,null,null,null,null,null,null,null,null,null,null,"Point du Jour - "]
["Organisation des salles, de l'accueil",null,null,null,null,null,null,null,null,null,null,null,null,null,null,null,null,null,null,null,null,null,null,null,null,null,null,null,null,null,"Organisation des salles, de l'accueil - "]
[null,"Réunion de préparation (inscrits)"," - Réunion de préparation (inscrits)"]