{"text_format":"1","workbook":"xlsx","n_sheets":5,"sheets":["PARTICULIER","BL","AVOIR","CLIENT","TARIF"],"not_rendered":{"charts":0,"images":2,"macros":1,"external_links":1,"defined_names":23,"comments":0,"pivot_tables":0},"unopened":[],"bounds":{"document_bytes":16777216,"sheet_cells":100000,"rows_first":2000,"rows_last":500,"rows_between":2000,"halvings":0,"cell_chars":16384,"cell_head_chars":4096},"cells_cut":0,"cells_raw":0,"read":"whole","date_system":"1900"}

{"sheet":"PARTICULIER","index":0,"n_rows":57,"n_cols":24,"rows_kept":57,"cut":false,"hidden":false,"merged":[[4,0,4,3],[5,0,5,3],[6,0,6,3],[7,0,7,3],[0,8,1048575,8],[0,0,0,3],[40,4,40,7],[39,4,39,7],[33,6,33,7],[35,6,35,7],[37,6,37,7],[33,4,33,5],[35,4,35,5],[37,4,37,5],[3,5,3,7],[36,0,36,2],[33,0,33,2],[34,0,34,2],[35,0,35,2],[3,0,3,3]]}
[null,null,null,null,"F A C T U R E",null,null,null,null,null,{"$f":"[1]CHEMIN!$C$6","v":"D:\\PDF\\FACTURES\\"}]
[null,null,null,null,null,null,null,null,null,null,{"$f":"[1]CHEMIN!$C$7","v":"D:\\FACTURES\\"}]
[null,null,null,null,"N° CLIENT : ",{"$f":"IFERROR(VLOOKUP(F4,Tableau1[],2,FALSE),\"\")","v":""},null,null,null,null,null,null,null,null,null,null,null,null,null,null,null,null,null,{"$f":"YEAR(TODAY())","v":2022}]
[null,null,null,null,"Destinataire :",null,null,null,null,null,{"$f":"IFERROR(VLOOKUP(F4,Tableau1[],8,FALSE),\"\")","v":""},null,null,null,null,null,null,null,null,null,null,null,{"$f":"_xlfn.ISOWEEKNUM(G9)","v":52},{"$f":"UPPER(TEXT(G9,\"-AAAA\"))","v":"-1900"}]
[null,null,null,null,"Adresse :",{"$f":"IFERROR(VLOOKUP(F4,Tableau1[],3,FALSE),\"\")","v":""}]
[null,null,null,null,"CP - VILLE :",{"$f":"IFERROR(VLOOKUP(F4,Tableau1[],4,FALSE),\"\")","v":""},null,null,null,null,"2022-03-03"]
[null,null,null,null,"Téléphone :",{"$f":"IFERROR(VLOOKUP(F4,Tableau1[],5,FALSE),\"\")","v":""}]
[]
[null,null,null,null,"Date :"]
[null,null,null,null,"Numéro :",null,{"$f":"\"FAC-\"&F3&\"-S\"&W4&\"-\"&K4&X4","v":"FAC--S52--1900"}]
[]
["PRODUIT","BL1","BL2","BL3","BL4","BL5","Prix au Kg","Prix TT - HT"]
["Bavette",null,null,null,null,null,{"$f":"IFERROR(VLOOKUP(A13,Tableau2[],2,FALSE),\"\")","v":25.5},{"$f":"IFERROR(SUM(B13+C13+D13+E13+F13)*(G13),\"\")","v":0}]
["Caillette",null,null,null,null,null,{"$f":"IFERROR(VLOOKUP(A14,Tableau2[],2,FALSE),\"\")","v":15.07},0]
["Caissette de viande 15 kg",null,null,null,null,null,{"$f":"IFERROR(VLOOKUP(A15,Tableau2[],2,FALSE),\"\")","v":10.43},0]
[null,null,null,null,null,null,{"$f":"IFERROR(VLOOKUP(A16,Tableau2[],2,FALSE),\"\")","v":""},""]
[null,null,null,null,null,null,{"$f":"IFERROR(VLOOKUP(A17,Tableau2[],2,FALSE),\"\")","v":""},""]
[null,null,null,null,null,null,{"$f":"IFERROR(VLOOKUP(A18,Tableau2[],2,FALSE),\"\")","v":""},""]
[null,null,null,null,null,null,{"$f":"IFERROR(VLOOKUP(A19,Tableau2[],2,FALSE),\"\")","v":""},""]
[null,null,null,null,null,null,{"$f":"IFERROR(VLOOKUP(A20,Tableau2[],2,FALSE),\"\")","v":""},""]
[null,null,null,null,null,null,{"$f":"IFERROR(VLOOKUP(A21,Tableau2[],2,FALSE),\"\")","v":""},""]
[null,null,null,null,null,null,{"$f":"IFERROR(VLOOKUP(A22,Tableau2[],2,FALSE),\"\")","v":""},""]
[null,null,null,null,null,null,{"$f":"IFERROR(VLOOKUP(A23,Tableau2[],2,FALSE),\"\")","v":""},""]
[null,null,null,null,null,null,{"$f":"IFERROR(VLOOKUP(A24,Tableau2[],2,FALSE),\"\")","v":""},""]
[null,null,null,null,null,null,{"$f":"IFERROR(VLOOKUP(A25,Tableau2[],2,FALSE),\"\")","v":""},""]
[null,null,null,null,null,null,{"$f":"IFERROR(VLOOKUP(A26,Tableau2[],2,FALSE),\"\")","v":""},""]
[null,null,null,null,null,null,{"$f":"IFERROR(VLOOKUP(A27,Tableau2[],2,FALSE),\"\")","v":""},""]
[null,null,null,null,null,null,{"$f":"IFERROR(VLOOKUP(A28,Tableau2[],2,FALSE),\"\")","v":""},""]
[null,null,null,null,null,null,{"$f":"IFERROR(VLOOKUP(A29,Tableau2[],2,FALSE),\"\")","v":""},""]
[null,null,null,null,null,null,{"$f":"IFERROR(VLOOKUP(A30,Tableau2[],2,FALSE),\"\")","v":""},""]
[null,null,null,null,null,null,{"$f":"IFERROR(VLOOKUP(A31,Tableau2[],2,FALSE),\"\")","v":""},""]
[null,null,null,null,null,null,{"$f":"IFERROR(VLOOKUP(A32,Tableau2[],2,FALSE),\"\")","v":""},""]
[]
["Coordonnées bancaires",null,null,null,"TOTAL HT",null,{"$f":"SUM(H13:H32)","v":0}]
["Banque : CREDIT AGRICOLE"]
["IBAN : FR76 1390 6001 2685 0398 7336 807",null,null,null,"TOTAL TVA",null,{"$f":"SUM(G34*5.5%)","v":0}]
["BIC : AGRIFRPP839"]
[null,null,null,null,"TOTAL TTC",null,{"$f":"SUM(G34+G36)","v":0}]
["Liste des bordereaux de livraison"]
[null,null,null,null,"En votre aimable règlement,"]
[null,null,null,null,"Cordialement."]
[]
[]
[]
[]
[]
[]
[]
[]
[]
[]
[]
[]
[]
[]
[null,null,"Ligne pour sauvegarder le récapitulatif de la facture",null,null,null,null,null,null,"NON PAYEE"]
[{"$f":"F3","v":""},{"$f":"F4","v":0},{"$f":"G9","v":"00:00:00"},{"$f":"G10","v":"FAC--S52--1900"},{"$f":"G34","v":0},{"$f":"G36","v":0},{"$f":"G38","v":0},"NON PAYEE",null,"PAYEE"]

{"sheet":"BL","index":1,"n_rows":35,"n_cols":24,"rows_kept":35,"cut":false,"hidden":false,"merged":[[25,5,25,6],[26,5,26,6],[21,3,21,4],[22,3,22,4],[23,3,23,4],[24,3,24,4],[25,3,25,4],[31,7,31,8],[33,5,33,7],[25,7,25,8],[26,7,26,8],[27,7,27,8],[28,7,28,8],[29,7,29,8],[30,7,30,8],[27,5,27,6],[28,5,28,6],[29,5,29,6],[30,5,30,6],[31,5,31,6],[27,3,27,4],[28,3,28,4],[19,5,19,6],[18,7,18,8],[21,5,21,6],[22,5,22,6],[23,5,23,6],[24,5,24,6],[20,5,20,6],[13,7,13,8],[14,7,14,8],[15,7,15,8],[16,7,16,8],[17,7,17,8],[19,7,19,8],[20,7,20,8],[21,7,21,8],[22,7,22,8],[23,7,23,8],[24,7,24,8],[15,5,15,6],[16,5,16,6],[17,5,17,6],[18,5,18,6],[27,0,27,2],[28,0,28,2],[29,0,29,2],[30,0,30,2],[31,0,31,2],[26,3,26,4],[15,3,15,4],[16,3,16,4],[17,3,17,4],[18,3,18,4],[19,3,19,4],[20,3,20,4],[29,3,29,4],[30,3,30,4],[31,3,31,4],[21,0,21,2],[20,0,20,2],[15,0,15,2],[16,0,16,2],[17,0,17,2],[18,0,18,2],[19,0,19,2],[11,5,11,6],[11,7,11,8],[12,3,12,4],[12,5,12,6],[13,0,13,2],[14,0,14,2],[13,3,13,4],[14,3,14,4],[13,5,13,6],[14,5,14,6],[12,7,12,8],[34,5,34,6],[12,0,12,2],[33,1,33,3],[34,1,34,3],[5,0,5,4],[6,0,6,4],[7,0,7,4],[0,0,0,3],[0,5,0,8],[4,6,4,8],[2,6,2,8],[3,6,3,8],[2,0,2,4],[3,0,3,4],[4,0,4,4],[26,0,26,2],[5,6,5,8],[6,6,6,8],[22,0,22,2],[23,0,23,2],[24,0,24,2],[25,0,25,2],[11,0,11,2],[11,3,11,4]]}
[null,null,null,null,null,"L I V R A I S O N",null,null,null,null,{"$f":"[1]CHEMIN!$C$5","v":"D:\\PDF\\BL\\"}]
[]
[null,null,null,null,null,"N° de CLIENT :",{"$f":"PARTICULIER!F3","v":""},null,null,null,null,null,null,null,null,null,null,null,null,null,null,null,null,{"$f":"YEAR(TODAY())","v":2022}]
[null,null,null,null,null,"Destinataire :",{"$f":"PARTICULIER!F4","v":0},null,null,null,{"$f":"IFERROR(VLOOKUP(G4,Tableau1[],8,FALSE),\"\")","v":""},null,null,null,null,null,null,null,null,null,null,null,{"$f":"_xlfn.ISOWEEKNUM(H9)","v":52},{"$f":"UPPER(TEXT(H9,\"-AAAA\"))","v":"-1900"}]
[null,null,null,null,null,"Adresse :",{"$f":"PARTICULIER!F5","v":""}]
[null,null,null,null,null,"CP -  VILLE",{"$f":"PARTICULIER!F6","v":""}]
[null,null,null,null,null,"Téléphone :",{"$f":"PARTICULIER!F7","v":""},null,null,null,null,"Choisir le BL"]
[null,null,null,null,null,null,null,null,null,null,null,"BL1"]
[null,null,null,null,null,"Date :"," "]
[null,null,null,null,null,"Numéro :",null,{"$f":"\"BL-S\"&W4&\"-\"&K4&X4","v":"BL-S52--1900"}]
[]
["DESIGNATION DU PRODUIT",null,null,"POIDS",null,"DLC",null,"LOT"]
[{"$f":"IF(COUNTA(SEMAINES)>=ROWS($11:11),INDEX(PARTICULIER!$A$13:$A$36,SMALL(IF(SEMAINES>0,ROW(SEMAINES)-12),ROWS($11:11))),\"\")","v":""},null,null,{"$f":"IF(A13=\"\",\"\",INDEX(SEMAINES,SMALL(IF(SEMAINES>0,ROW(SEMAINES)-12),ROWS($11:11))))","v":""}]
[{"$f":"IF(COUNTA(SEMAINES)>=ROWS($11:12),INDEX(PARTICULIER!$A$13:$A$36,SMALL(IF(SEMAINES>0,ROW(SEMAINES)-12),ROWS($11:12))),\"\")","v":""},null,null,{"$f":"IF(A14=\"\",\"\",INDEX(SEMAINES,SMALL(IF(SEMAINES>0,ROW(SEMAINES)-12),ROWS($11:12))))","v":""}]
[{"$f":"IF(COUNTA(SEMAINES)>=ROWS($11:13),INDEX(PARTICULIER!$A$13:$A$36,SMALL(IF(SEMAINES>0,ROW(SEMAINES)-12),ROWS($11:13))),\"\")","v":""},null,null,{"$f":"IF(A15=\"\",\"\",INDEX(SEMAINES,SMALL(IF(SEMAINES>0,ROW(SEMAINES)-12),ROWS($11:13))))","v":""}]
[{"$f":"IF(COUNTA(SEMAINES)>=ROWS($11:14),INDEX(PARTICULIER!$A$13:$A$36,SMALL(IF(SEMAINES>0,ROW(SEMAINES)-12),ROWS($11:14))),\"\")","v":""},null,null,{"$f":"IF(A16=\"\",\"\",INDEX(SEMAINES,SMALL(IF(SEMAINES>0,ROW(SEMAINES)-12),ROWS($11:14))))","v":""}]
[{"$f":"IF(COUNTA(SEMAINES)>=ROWS($11:15),INDEX(PARTICULIER!$A$13:$A$36,SMALL(IF(SEMAINES>0,ROW(SEMAINES)-12),ROWS($11:15))),\"\")","v":""},null,null,{"$f":"IF(A17=\"\",\"\",INDEX(SEMAINES,SMALL(IF(SEMAINES>0,ROW(SEMAINES)-12),ROWS($11:15))))","v":""}]
[{"$f":"IF(COUNTA(SEMAINES)>=ROWS($11:16),INDEX(PARTICULIER!$A$13:$A$36,SMALL(IF(SEMAINES>0,ROW(SEMAINES)-12),ROWS($11:16))),\"\")","v":""},null,null,{"$f":"IF(A18=\"\",\"\",INDEX(SEMAINES,SMALL(IF(SEMAINES>0,ROW(SEMAINES)-12),ROWS($11:16))))","v":""}]
[{"$f":"IF(COUNTA(SEMAINES)>=ROWS($11:17),INDEX(PARTICULIER!$A$13:$A$36,SMALL(IF(SEMAINES>0,ROW(SEMAINES)-12),ROWS($11:17))),\"\")","v":""},null,null,{"$f":"IF(A19=\"\",\"\",INDEX(SEMAINES,SMALL(IF(SEMAINES>0,ROW(SEMAINES)-12),ROWS($11:17))))","v":""}]
[{"$f":"IF(COUNTA(SEMAINES)>=ROWS($11:18),INDEX(PARTICULIER!$A$13:$A$36,SMALL(IF(SEMAINES>0,ROW(SEMAINES)-12),ROWS($11:18))),\"\")","v":""},null,null,{"$f":"IF(A20=\"\",\"\",INDEX(SEMAINES,SMALL(IF(SEMAINES>0,ROW(SEMAINES)-12),ROWS($11:18))))","v":""}]
[{"$f":"IF(COUNTA(SEMAINES)>=ROWS($11:19),INDEX(PARTICULIER!$A$13:$A$36,SMALL(IF(SEMAINES>0,ROW(SEMAINES)-12),ROWS($11:19))),\"\")","v":""},null,null,{"$f":"IF(A21=\"\",\"\",INDEX(SEMAINES,SMALL(IF(SEMAINES>0,ROW(SEMAINES)-12),ROWS($11:19))))","v":""}]
[{"$f":"IF(COUNTA(SEMAINES)>=ROWS($11:20),INDEX(PARTICULIER!$A$13:$A$36,SMALL(IF(SEMAINES>0,ROW(SEMAINES)-12),ROWS($11:20))),\"\")","v":""},null,null,{"$f":"IF(A22=\"\",\"\",INDEX(SEMAINES,SMALL(IF(SEMAINES>0,ROW(SEMAINES)-12),ROWS($11:20))))","v":""}]
[{"$f":"IF(COUNTA(SEMAINES)>=ROWS($11:21),INDEX(PARTICULIER!$A$13:$A$36,SMALL(IF(SEMAINES>0,ROW(SEMAINES)-12),ROWS($11:21))),\"\")","v":""},null,null,{"$f":"IF(A23=\"\",\"\",INDEX(SEMAINES,SMALL(IF(SEMAINES>0,ROW(SEMAINES)-12),ROWS($11:21))))","v":""}]
[{"$f":"IF(COUNTA(SEMAINES)>=ROWS($11:22),INDEX(PARTICULIER!$A$13:$A$36,SMALL(IF(SEMAINES>0,ROW(SEMAINES)-12),ROWS($11:22))),\"\")","v":""},null,null,{"$f":"IF(A24=\"\",\"\",INDEX(SEMAINES,SMALL(IF(SEMAINES>0,ROW(SEMAINES)-12),ROWS($11:22))))","v":""}]
[{"$f":"IF(COUNTA(SEMAINES)>=ROWS($11:23),INDEX(PARTICULIER!$A$13:$A$36,SMALL(IF(SEMAINES>0,ROW(SEMAINES)-12),ROWS($11:23))),\"\")","v":""},null,null,{"$f":"IF(A25=\"\",\"\",INDEX(SEMAINES,SMALL(IF(SEMAINES>0,ROW(SEMAINES)-12),ROWS($11:23))))","v":""}]
[{"$f":"IF(COUNTA(SEMAINES)>=ROWS($11:24),INDEX(PARTICULIER!$A$13:$A$36,SMALL(IF(SEMAINES>0,ROW(SEMAINES)-12),ROWS($11:24))),\"\")","v":""},null,null,{"$f":"IF(A26=\"\",\"\",INDEX(SEMAINES,SMALL(IF(SEMAINES>0,ROW(SEMAINES)-12),ROWS($11:24))))","v":""}]
[{"$f":"IF(COUNTA(SEMAINES)>=ROWS($11:25),INDEX(PARTICULIER!$A$13:$A$36,SMALL(IF(SEMAINES>0,ROW(SEMAINES)-12),ROWS($11:25))),\"\")","v":""},null,null,{"$f":"IF(A27=\"\",\"\",INDEX(SEMAINES,SMALL(IF(SEMAINES>0,ROW(SEMAINES)-12),ROWS($11:25))))","v":""}]
[{"$f":"IF(COUNTA(SEMAINES)>=ROWS($11:26),INDEX(PARTICULIER!$A$13:$A$36,SMALL(IF(SEMAINES>0,ROW(SEMAINES)-12),ROWS($11:26))),\"\")","v":""},null,null,{"$f":"IF(A28=\"\",\"\",INDEX(SEMAINES,SMALL(IF(SEMAINES>0,ROW(SEMAINES)-12),ROWS($11:26))))","v":""}]
[{"$f":"IF(COUNTA(SEMAINES)>=ROWS($11:27),INDEX(PARTICULIER!$A$13:$A$36,SMALL(IF(SEMAINES>0,ROW(SEMAINES)-12),ROWS($11:27))),\"\")","v":""},null,null,{"$f":"IF(A29=\"\",\"\",INDEX(SEMAINES,SMALL(IF(SEMAINES>0,ROW(SEMAINES)-12),ROWS($11:27))))","v":""}]
[{"$f":"IF(COUNTA(SEMAINES)>=ROWS($11:28),INDEX(PARTICULIER!$A$13:$A$36,SMALL(IF(SEMAINES>0,ROW(SEMAINES)-12),ROWS($11:28))),\"\")","v":""},null,null,{"$f":"IF(A30=\"\",\"\",INDEX(SEMAINES,SMALL(IF(SEMAINES>0,ROW(SEMAINES)-12),ROWS($11:28))))","v":""}]
[{"$f":"IF(COUNTA(SEMAINES)>=ROWS($11:29),INDEX(PARTICULIER!$A$13:$A$36,SMALL(IF(SEMAINES>0,ROW(SEMAINES)-12),ROWS($11:29))),\"\")","v":""},null,null,{"$f":"IF(A31=\"\",\"\",INDEX(SEMAINES,SMALL(IF(SEMAINES>0,ROW(SEMAINES)-12),ROWS($11:29))))","v":""}]
[{"$f":"IF(COUNTA(SEMAINES)>=ROWS($11:30),INDEX(PARTICULIER!$A$13:$A$36,SMALL(IF(SEMAINES>0,ROW(SEMAINES)-12),ROWS($11:30))),\"\")","v":""},null,null,{"$f":"IF(A32=\"\",\"\",INDEX(SEMAINES,SMALL(IF(SEMAINES>0,ROW(SEMAINES)-12),ROWS($11:30))))","v":""}]
[]
[null,"NOMBRE DE PRODUIT",null,null,null,"POIDS TOTAL"]
[null,{"$f":"COUNTA(F13:G32)","v":0},null,null,null,{"$f":"SUM(D13:E32)","v":0},null,"Kg(s)"]

{"sheet":"AVOIR","index":2,"n_rows":26,"n_cols":24,"rows_kept":26,"cut":false,"hidden":false,"merged":[[19,0,19,2],[18,0,18,2],[18,5,18,6],[18,7,18,8],[14,0,14,5],[15,0,15,5],[24,5,24,8],[25,5,25,8],[22,5,22,6],[22,7,22,8],[20,0,20,2],[20,5,20,6],[20,7,20,8],[21,0,21,2],[0,0,0,3],[0,5,0,8],[2,0,2,4],[2,6,2,8],[3,0,3,4],[3,6,3,8],[12,0,12,8],[7,0,7,4],[4,0,4,4],[4,6,4,8],[5,0,5,4],[5,6,5,8],[6,0,6,4],[6,6,6,8]]}
[null,null,null,null,null,"A V O I R",null,null,null,null,{"$f":"[1]CHEMIN!$C$8","v":"D:\\PDF\\AVOIR\\"}]
[]
[null,null,null,null,null,"N° de CLIENT :",{"$f":"PARTICULIER!F3","v":""},null,null,null,null,null,null,null,null,null,null,null,null,null,null,null,null,{"$f":"YEAR(TODAY())","v":2022}]
[null,null,null,null,null,"Destinataire :",{"$f":"PARTICULIER!F4","v":0},null,null,null,{"$f":"IFERROR(VLOOKUP(G4,Tableau1[],8,FALSE),\"\")","v":""},null,null,null,null,null,null,null,null,null,null,null,{"$f":"_xlfn.ISOWEEKNUM(H9)","v":52},{"$f":"UPPER(TEXT(H9,\"-AAAA\"))","v":"-1900"}]
[null,null,null,null,null,"Adresse :",{"$f":"PARTICULIER!F5","v":""}]
[null,null,null,null,null,"CP -  VILLE",{"$f":"PARTICULIER!F6","v":""}]
[null,null,null,null,null,"Téléphone :",{"$f":"PARTICULIER!F7","v":""}]
[]
[null,null,null,null,null,"Date :"]
[null,null,null,null,null,"Numéro :",null,{"$f":"\"AV-S\"&W4&\"-\"&K4&X4","v":"AV-S52--1900"}]
[null,null,null,null,null,null,null,null,null,null,null,null,null,null,"TVA"]
[null,null,null,null,null,null,null,null,null,null,null,null,null,null,5.5E-2]
[{"$f":"\"Avoir sur la facture n° \"&PARTICULIER!G10&\" du \"&G9","v":"Avoir sur la facture n° FAC--S52--1900 du "},null,null,null,null,null,null,null,null,null,null,null,null,null,"Aide au calcul du HT"]
[null,null,null,null,null,null,null,null,null,null,null,null,null,null,"Saisir le montant TTC"]
["PRESTATION",null,null,null,null,null,"Qté","TVA","TT HT",null,null,null,null,null,100]
["Avoir sur la facture mentionnée ci-dessus",null,null,null,null,null,1,5.5E-2," 0,00",null,null,null,null,null,"Montant HT"]
[{"$f":"PARTICULIER!A14","v":"Caillette"},null,null,{"$f":"PARTICULIER!B14","v":0},null,null,null,null,null,null,null,null,null,null,{"$f":"O15/(O12+1)","v":94.786729857819907}]
[]
["Coordonnées bancaires",null,null,null,null,"TOTAL HT",null,{"$f":"I16&\" €\"","v":" 0,00 €"}]
["Banque : CREDIT AGRICOLE"]
["IBAN : FR76 1390 6001 2685 0398 7336 807",null,null,null,null,"TOTAL TVA",null,{"$f":"SUM(H19*5.5%)","v":0}]
["BIC : AGRIFRPP839"]
[null,null,null,null,null,"TOTAL TTC",null,{"$f":"SUM(H19+H21)","v":0}]
[]
[null,null,null,null,null,"En votre aimable réception,"]
[null,null,null,null,null,"Cordialement."]

{"sheet":"CLIENT","index":3,"n_rows":2,"n_cols":10,"rows_kept":2,"cut":false,"hidden":false,"merged":[]}
["RAISON SOCIALE","CODE","ADRESSE1","ADRESSE2","TELEPHONE","Sup '","Sup Espace","12 Caractères",null,"N° Client"]
["PERREE Lucie",300,"10 Rue de L'armellerie","26150 DIE",0,{"$f":"SUBSTITUTE(A2,\"'\",\"\")","v":"PERREE Lucie"},{"$f":"SUBSTITUTE(F2,\" \",\"\")","v":"PERREELucie"},{"$f":"MID(G2,1,12)","v":"PERREELucie"},null,300]

{"sheet":"TARIF","index":4,"n_rows":56,"n_cols":2,"rows_kept":56,"cut":false,"hidden":true,"merged":[]}
["PRODUIT","PRIX"]
["Araignée",25.5]
["Bavette",25.5]
["Boudin",15.07]
["Caillette",15.07]
["Caissette de viande 15 kg",10.43]
["Chair à saucisse",12.23]
["Coppa"]
["Côte de porc",12.23]
["Côtis salé",9.76]
["Demi porc",3.79]
["Echine de porc",14.12]
["Epaule entière 3D",9.3800000000000008]
["Escalope de porc",16.02]
["Filet mignon de porc",20.76]
["Fromage de tête",16.02]
["Godiveaux aux herbes",16.02]
["Godiveaux nature",14.12]
["Godiveaux aux olives de Nyons",16.97]
["Godiveaux picodon AOC",16.97]
["Gorges de porc",3.79]
["Grillade Parisienne",16.97]
["Groin",0.95]
["Hampes",25.5]
["Jambon cuit",27.39]
["Jambon entier",8.06]
["Jarret de porc",7.11]
["Jarret demi sel",8.06]
["Joues",17.91]
["Longe entière",11.28]
["Merguez de porc",15.07]
["Murson",15.07]
["Murson verrine",5.9]
["Oreilles",0.95]
["Pâté croûte",23.6]
["Pâté de campagne",23.6]
["Pied  de porc",0.95]
["Poitrine de porc",12.23]
["Poitrine demi sel",13.18]
["Porc entier",3.79]
["Queue",0.95]
["Rôti de porc (épaule)",14.12]
["Rôti de porc (filet)",14.12]
["Rôti échine",16.02]
["Rôti farci",17.91]
["Rouelle de porc",14.12]
["Saucisse à cuire nature","14,12"]
["Saucisse à cuire olives de Nyons",16.97]
["Saucisse à griller herbes","15,07"]
["Saucisse à griller nature",14.12]
["Saucisse d'herbe",16.02]
["Saucisson brioché","23,60"]
["Saucisson sec pur porc",29.29]
["Sauté de porc",12.23]
["Surprise",16.97]
["Travers de porc",8.82]