{"text_format":"1","workbook":"xlsx","n_sheets":2,"sheets":["Suivi","Paramétres"],"not_rendered":{"charts":0,"images":1,"macros":1,"external_links":1,"defined_names":1,"comments":1,"pivot_tables":0},"unopened":[],"bounds":{"document_bytes":16777216,"sheet_cells":100000,"rows_first":2000,"rows_last":500,"rows_between":2000,"halvings":0,"cell_chars":16384,"cell_head_chars":4096},"cells_cut":0,"cells_raw":0,"read":"whole","date_system":"1900"}

{"sheet":"Suivi","index":0,"n_rows":40,"n_cols":65,"rows_kept":40,"cut":false,"hidden":false,"merged":[[10,55,12,59],[10,60,12,64],[4,2,4,3],[1,2,1,6],[2,2,2,3],[2,4,2,6],[3,2,3,3],[3,4,3,6],[10,30,12,34],[10,10,12,14],[10,40,12,44],[10,45,12,49],[10,50,12,54],[10,15,12,19],[10,20,12,24],[10,35,12,39],[17,0,17,1],[18,0,18,1],[20,0,20,1],[0,10,1,18],[5,2,5,4],[8,2,8,4],[8,6,8,8],[13,3,13,4],[13,5,13,6],[15,7,15,8],[39,0,39,1],[32,0,32,1],[33,0,33,1],[34,0,34,1],[35,0,35,1],[36,0,36,1],[10,25,12,29],[30,0,30,1],[31,0,31,1],[37,0,37,1],[38,0,38,1],[25,0,25,1],[26,0,26,1],[27,0,27,1],[28,0,28,1],[29,0,29,1],[21,0,21,1],[19,0,19,1],[22,0,22,1],[23,0,23,1],[24,0,24,1],[16,0,16,1]]}
[null,null,"Nous sommes le : ",{"$f":"TODAY()","v":"2022-03-06"},null,null,null,null,null,null,"COMMENTAIRES"]
[null,null,"Détails du projet"]
[null,null,"Projet",null,"picasso",null,null,null,"$D$21"]
[null,null,"Chef de projet",null,"farouk"]
[null,null,"Date de préparation ",null,"2022-02-28"]
[null,null,"INSCRIPTION AU  PROJET "]
[null,null,"Date du début","Date de fin ","Durée",null,null,null,null,null,null,null," Inscription au projet"]
[null,null,"2022-03-07","2022-03-21",{"$f":"IF(OR(C8=\"\",D8=\"\"),\"\",NETWORKDAYS(C8,D8)& \" jour(s)\")","v":"11 jour(s)"}]
[null,null,"LANCEMENT DU PROJET ",null,null,null,"LANCEMENT DE LA PREPARATION",null,null,null,null,null,"Tâches en cours",null,null,null,null,null,"Tâches terminées",null,null,null,null,null,null,"Préparation",null,null,null,null,"Lancement du projet",null,null,null,null,null,null,"Sous-tâches"]
[null,null,"Date du début","Date de fin ","Durée",null,"Date du début","Date de fin ","Durée"]
[null,null,"2022-03-21","2022-04-05",{"$f":"IF(OR(C11=\"\",D11=\"\"),\"\",NETWORKDAYS(C11,D11)& \" jour(s)\")","v":"12 jour(s)"},null,"2022-02-28","2022-03-25",{"$f":"IF(OR(G11=\"\",H11=\"\"),\"\",NETWORKDAYS(G11,H11)& \" jour(s)\")","v":"20 jour(s)"},null,{"$f":"CHOOSE(WEEKDAY(D14+(Paramétres!B2-1)*7),5,4,3,2,1,0,6)+D14+(Paramétres!B2-1)*7","v":"2022-02-18"},null,null,null,null,{"$f":"K11+7","v":"2022-02-25"},null,null,null,null,{"$f":"P11+7","v":"2022-03-04"},null,null,null,null,{"$f":"U11+7","v":"2022-03-11"},null,null,null,null,{"$f":"Z11+7","v":"2022-03-18"},null,null,null,null,{"$f":"AE11+7","v":"2022-03-25"},null,null,null,null,{"$f":"AJ11+7","v":"2022-04-01"},null,null,null,null,{"$f":"AO11+7","v":"2022-04-08"},null,null,null,null,{"$f":"AT11+7","v":"2022-04-15"},null,null,null,null,{"$f":"AY11+7","v":"2022-04-22"},null,null,null,null,{"$f":"BD11+7","v":"2022-04-29"}]
[]
[]
[null,null,"Lancement de préparation ","2022-02-23",null,"Défiler la semaine ",null,null,null,null,{"$f":"L14-1","v":"2022-02-14"},"2022-02-15","2022-02-16","2022-02-17",{"$f":"K11","v":"2022-02-18"},{"$f":"WORKDAY(O14,1)","v":"2022-02-21"},"2022-02-22","2022-02-23","2022-02-24","2022-02-25","2022-02-28","2022-03-01","2022-03-02","2022-03-03","2022-03-04","2022-03-07","2022-03-08","2022-03-09","2022-03-10","2022-03-11","2022-03-14","2022-03-15","2022-03-16","2022-03-17","2022-03-18","2022-03-21","2022-03-22","2022-03-23","2022-03-24","2022-03-25","2022-03-28","2022-03-29","2022-03-30","2022-03-31","2022-04-01","2022-04-04","2022-04-05",{"$f":"WORKDAY(AU14,1)","v":"2022-04-06"},"2022-04-07","2022-04-08","2022-04-11","2022-04-12","2022-04-13","2022-04-14","2022-04-15","2022-04-18","2022-04-19","2022-04-20","2022-04-21","2022-04-22","2022-04-25","2022-04-26","2022-04-27","2022-04-28","2022-04-29"]
[null,null,null,null,null,null,null,null,null,null,{"$f":"CHOOSE(WEEKDAY(K14,1),\"D\",\"L\",\"M\",\"Me\",\"J\",\"V\",\"S\")","v":"L"},{"$f":"CHOOSE(WEEKDAY(L14,1),\"D\",\"L\",\"M\",\"Me\",\"J\",\"V\",\"S\")","v":"M"},"Me","J","V","L","M","Me","J","V","L","M","Me","J","V","L","M","Me","J","V","L","M","Me","J","V","L","M","Me","J","V","L","M","Me","J","V","L","M","Me","J","V","L","M","Me","J","V",{"$f":"CHOOSE(WEEKDAY(BD14,1),\"D\",\"L\",\"M\",\"Me\",\"J\",\"V\",\"S\")","v":"L"},"M","Me","J","V","L","M","Me","J","V"]
[null,null,null,null,null,null,null,"Pourcentage de travail effectué",null,0.3378632478632479]
["Equipe ",null,"Les Taches demandées ","Sous-tâches","Priorité","Début","Fin","Durée","Status","% "]
["All",null,"carte petit cailloux",null,"Étape 1","2022-02-28","2022-02-28",{"$f":"IF(OR(F18=0,G18=0),\"\",NETWORKDAYS(F18,G18))","v":1},"Achevé",0.23333333333333331]
[null,null,null,"sjvd picaso","Étape 2","2022-02-28","2022-02-28",1,"Achevé",0.1]
[null,null,null,"contruction carte","Étape 3","2022-02-28","2022-02-28",1,"Achevé",0.5]
[null,null,null,"Mise en commun","Étape 3","2022-02-28","2022-02-28",1,"Achevé",0.1]
[null,null,"recherche des ressources",null,null,"2022-03-01","2022-03-04",4,"Achevé",0.39615384615384613]
["Sylvie",null,null,"Livre","Priorité","2022-03-01","2022-03-04",4,"En cours",0.2]
["Alice",null,null,"Réseau ",null,"2022-03-01","2022-03-04",4,"Achevé",0.8]
["Sylvie",null,null,"film","Faible ","2022-03-01","2022-03-07",5,"Achevé",0.3]
["Sophie",null,null,"Image",null,"2022-03-01","2022-03-07",5,"En cours",0.8]
["Sophie",null,null,"dossier presse",null,"2022-03-01","2022-03-04",4,"En cours",0.1]
["All",null,null,"Mise en commun",null,"2022-03-01","2022-03-04",4,"En cours",0.1]
["Sophie",null,"contruction activitées ",null,null,"2022-03-07","2022-03-11",5,"En cours",0.15]
[null,null,null,"contruction activitées ",null,"2022-03-07","2022-03-11",5,"En cours",0.2]
["Sylvie",null,null,"contruction activitées ",null,"2022-03-07","2022-03-11",5,"En cours",0.1]
["All",null,"Réunion","validation des activité","Priorité","2022-03-14","2022-03-18",5,"En cours",0.5]
[null,null,null,null,null,null,null,"","Non commencé",0]
[null,null,null,null,null,null,null,"","Non commencé",0]
[null,null,null,null,null,null,null,"","Non commencé",0]
[null,null,null,null,null,null,null,"","Non commencé",0]
[null,null,null,null,null,null,null,"","Non commencé",0]
[null,null,null,null,null,null,null,"","Non commencé",0]
[null,null,null,null,null,null,null,"","Non commencé",0]
[null,null,null,null,null,null,null,"","Non commencé",0]

{"sheet":"Paramétres","index":1,"n_rows":11,"n_cols":4,"rows_kept":11,"cut":false,"hidden":false,"merged":[]}
["état ","changement de semaine","Utilisateur","Priorité"]
["Achevé",0,"All"]
["En retard",null,"Alice","Étape 1"]
["Statut",null,"Sophie","Étape 2"]
["En cours",null,"Sylvie","Étape 3"]
["non commencé",null,null,"Étape 4"]
[null,null,null,"Étape 5"]
[null,null,null,"Priorité"]
[null,null,null,"Faible "]
[null,0,null,"Modéré"]
[null,null,null,"Elevée"]