{"text_format":"1","workbook":"xlsx","n_sheets":2,"sheets":["Liste","Travail"],"not_rendered":{"charts":0,"images":0,"macros":1,"external_links":0,"defined_names":0,"comments":0,"pivot_tables":0},"unopened":[],"bounds":{"document_bytes":16777216,"sheet_cells":100000,"rows_first":2000,"rows_last":500,"rows_between":2000,"halvings":0,"cell_chars":16384,"cell_head_chars":4096},"cells_cut":0,"cells_raw":0,"read":"whole","date_system":"1900"}

{"sheet":"Liste","index":0,"n_rows":29,"n_cols":11,"rows_kept":29,"cut":false,"hidden":false,"merged":[]}
["Concat","Test","ID","Prénom","Nom","Evenement","An","Mois","Jour","Date","Heure"]
["3Pierre Fernand Albert CHAUVET1- Naissance",null,3,"Pierre Fernand Albert  ","CHAUVET","1- Naissance",1912,7,17,"2021-01-06","14:49:00"]
["4Marcelle Henria QUINKAL1- Naissance",null,4,"Marcelle Henria   ","QUINKAL","1- Naissance",1913,2,6,"2021-01-06","14:38:00"]
["10Henri Louis QUINKAL1- Naissance",null,10,"Henri Louis   ","QUINKAL","1- Naissance",1889,2,23,"2019-08-23","13:32:00"]
["10Henri Louis QUINKAL2- Mariage",null,10,"Henri Louis   ","QUINKAL","2- Mariage",1910,9,20,"2021-12-06","09:14:00"]
["12Louise Rose AUBERT1- Naissance",null,12,"Louise Rose   ","AUBERT","1- Naissance",1889,11,15,"2019-08-23","13:35:00"]
["12Louise Rose AUBERT2- Mariage",null,12,"Louise Rose   ","AUBERT","2- Mariage",1910,9,20,"2021-12-06","09:15:00"]
["13Séverin Gustave Etienne CHAUVET1- Naissance",null,13,"Séverin Gustave Etienne  ","CHAUVET","1- Naissance",1878,6,8,"2019-08-23","13:37:00"]
["13Séverin Gustave Etienne CHAUVET2- Mariage",null,13,"Séverin Gustave Etienne  ","CHAUVET","2- Mariage",1911,8,19,"2020-12-06","10:48:00"]
["14Marie Juliette PIERCY1- Naissance",null,14,"Marie Juliette   ","PIERCY","1- Naissance",1886,3,16,"2019-08-23","13:39:00"]
["14Marie Juliette PIERCY2- Mariage",null,14,"Marie Juliette   ","PIERCY","2- Mariage",1911,8,19,"2021-12-06","09:18:00"]
["33Souverain Alexandre CHAUVET1- Naissance",null,14,"Souverain Alexandre   ","CHAUVET","1- Naissance",1840,2,11,"2019-08-23","13:49:00"]
["33Souverain Alexandre CHAUVET2- Mariage",null,33,"Souverain Alexandre   ","CHAUVET","2- Mariage",1877,8,29,"2021-12-06","09:21:00"]
["33Souverain Alexandre CHAUVET3- Sépulture",null,33,"Souverain Alexandre   ","CHAUVET","3- Sépulture",1920,12,23,"2021-01-06","16:04:00"]
["34Thérèse Amélie MANCELON1- Naissance",null,34,"Thérèse Amélie   ","MANCELON","1- Naissance",1851,1,31,"2019-08-23","13:43:00"]
["34Thérèse Amélie MANCELON2- Mariage",null,34,"Thérèse Amélie   ","MANCELON","2- Mariage",1877,8,29,"2021-12-06","09:21:00"]
["35Félix Abel CHAUVET1- Naissance",null,35,"Félix Abel   ","CHAUVET","1- Naissance",1882,5,14,"2019-01-21","15:08:00"]
["35Félix Abel CHAUVET3- Sépulture",null,35,"Félix Abel   ","CHAUVET","3- Sépulture",1916,4,22,"2019-08-23","13:43:00"]
["36Fernand Louis Elie CHAUVET1- Naissance",null,36,"Fernand Louis Elie  ","CHAUVET","1- Naissance",1884,12,3,"2019-08-23","13:48:00"]
["37Joseph Simon CHAUVET1- Naissance",null,37,"Joseph Simon   ","CHAUVET","1- Naissance",1803,11,27,"2021-02-24","07:05:00"]
["37Joseph Simon CHAUVET2- Mariage",null,37,"Joseph Simon   ","CHAUVET","2- Mariage",1836,4,20,"2021-12-06","09:23:00"]
["37Joseph Simon CHAUVET3- Sépulture",null,37,"Joseph Simon   ","CHAUVET","3- Sépulture",1872,10,14,"2019-08-23","13:57:00"]
["38Thérèse Joséphine SEVIDRE1- Naissance",null,38,"Thérèse Joséphine   ","SEVIDRE","1- Naissance",1807,3,25,"2019-08-23","14:29:00"]
["38Thérèse Joséphine SEVIDRE2- Mariage",null,38,"Thérèse Joséphine   ","SEVIDRE","2- Mariage",1836,4,20,"2021-12-06","09:24:00"]
["38Thérèse Joséphine SEVIDRE3- Sépulture",null,38,"Thérèse Joséphine   ","SEVIDRE","3- Sépulture",1883,3,26,"2019-08-23","14:25:00"]
["39Etienne Joseph CHAUVET1- Naissance",null,39,"Etienne Joseph   ","CHAUVET","1- Naissance",1836,12,21,"2019-08-25","07:41:00"]
["39Etienne Joseph CHAUVET2- Mariage",null,39,"Etienne Joseph   ","CHAUVET","2- Mariage",1864,1,26,"2021-12-06","10:51:00"]
["40Auguste Félix CHAUVET1- Naissance",null,40,"Auguste Félix   ","CHAUVET","1- Naissance",1841,11,20,"2019-08-25","07:46:00"]
["40Auguste Félix CHAUVET3- Sépulture",null,40,"Auguste Félix   ","CHAUVET","3- Sépulture",1843,8,15,"2020-12-08","11:18:00"]

{"sheet":"Travail","index":1,"n_rows":104,"n_cols":6,"rows_kept":104,"cut":false,"hidden":false,"merged":[]}
["Concat","Test","ID","Prénom","Nom","Evènements "]
["1Robert Jean AlbertCHAUVET-1 Naissance",{"$f":"VLOOKUP(Nomcherché,Liste!1:1048576,2)","v":{"$error":"#NAME?"}},1,"Robert Jean Albert","CHAUVET","-1 Naissance"]
["1Robert Jean AlbertCHAUVET-2 Mariage",{"$f":"VLOOKUP(Nomcherché,Liste!1:2,2)","v":{"$error":"#NAME?"}},1,"Robert Jean Albert","CHAUVET","-2 Mariage"]
["1Robert Jean AlbertCHAUVET-2 Mariage",{"$f":"VLOOKUP(Nomcherché,Liste!2:3,2)","v":{"$error":"#NAME?"}},1,"Robert Jean Albert","CHAUVET","-2 Mariage"]
["1Robert Jean AlbertCHAUVET-3 Décès",{"$f":"VLOOKUP(Nomcherché,Liste!3:4,2)","v":{"$error":"#NAME?"}},1,"Robert Jean Albert","CHAUVET","-3 Décès"]
["2Monique Frida MadeleineMALEZIEUX-1 Naissance",{"$f":"VLOOKUP(Nomcherché,Liste!4:5,2)","v":{"$error":"#NAME?"}},2,"Monique Frida Madeleine","MALEZIEUX","-1 Naissance"]
["2Monique Frida MadeleineMALEZIEUX-2 Mariage",{"$f":"VLOOKUP(Nomcherché,Liste!5:6,2)","v":{"$error":"#NAME?"}},2,"Monique Frida Madeleine","MALEZIEUX","-2 Mariage"]
["2Monique Frida MadeleineMALEZIEUX-2 Mariage",{"$f":"VLOOKUP(Nomcherché,Liste!6:7,2)","v":{"$error":"#NAME?"}},2,"Monique Frida Madeleine","MALEZIEUX","-2 Mariage"]
["2Monique Frida MadeleineMALEZIEUX-2 Mariage",{"$f":"VLOOKUP(Nomcherché,Liste!7:8,2)","v":{"$error":"#NAME?"}},2,"Monique Frida Madeleine","MALEZIEUX","-2 Mariage"]
["2Monique Frida MadeleineMALEZIEUX-3 Décès",{"$f":"VLOOKUP(Nomcherché,Liste!8:9,2)","v":{"$error":"#NAME?"}},2,"Monique Frida Madeleine","MALEZIEUX","-3 Décès"]
["3Pierre Fernand Albert CHAUVET1- Naissance",{"$f":"VLOOKUP(Nomcherché,Liste!9:10,2)","v":{"$error":"#NAME?"}},3,"Pierre Fernand Albert","CHAUVET","-1 Naissance"]
["3Pierre Fernand AlbertCHAUVET-2 Mariage",{"$f":"VLOOKUP(Nomcherché,Liste!10:11,2)","v":{"$error":"#NAME?"}},3,"Pierre Fernand Albert","CHAUVET","-2 Mariage"]
["3Pierre Fernand AlbertCHAUVET-3 Décès",{"$f":"VLOOKUP(Nomcherché,Liste!11:12,2)","v":{"$error":"#NAME?"}},3,"Pierre Fernand Albert","CHAUVET","-3 Décès"]
["4Marcelle HenriaQUINKAL-1 Naissance",{"$f":"VLOOKUP(Nomcherché,Liste!12:13,2)","v":{"$error":"#NAME?"}},4,"Marcelle Henria","QUINKAL","-1 Naissance"]
["4Marcelle HenriaQUINKAL-2 Mariage",{"$f":"VLOOKUP(Nomcherché,Liste!13:14,2)","v":{"$error":"#NAME?"}},4,"Marcelle Henria","QUINKAL","-2 Mariage"]
["4Marcelle HenriaQUINKAL-3 Décès",null,4,"Marcelle Henria","QUINKAL","-3 Décès"]
["5Anne Marie Rose JulietteCHAUVET-1 Naissance",null,5,"Anne Marie Rose Juliette","CHAUVET","-1 Naissance"]
["5Anne Marie Rose JulietteCHAUVET-2 Mariage",null,5,"Anne Marie Rose Juliette","CHAUVET","-2 Mariage"]
["5Anne Marie Rose JulietteCHAUVET-3 Décès",null,5,"Anne Marie Rose Juliette","CHAUVET","-3 Décès"]
["6Isabelle Marguerite MarcelleCHAUVET-1 Naissance",null,6,"Isabelle Marguerite Marcelle","CHAUVET","-1 Naissance"]
["6Isabelle Marguerite MarcelleCHAUVET-2 Mariage",null,6,"Isabelle Marguerite Marcelle","CHAUVET","-2 Mariage"]
["6Isabelle Marguerite MarcelleCHAUVET-2 Mariage",null,6,"Isabelle Marguerite Marcelle","CHAUVET","-2 Mariage"]
["6Isabelle Marguerite MarcelleCHAUVET-3 Décès",null,6,"Isabelle Marguerite Marcelle","CHAUVET","-3 Décès"]
["7Cécile Anne MarieCHAUVET-1 Naissance",null,7,"Cécile Anne Marie","CHAUVET","-1 Naissance"]
["7Cécile Anne MarieCHAUVET-2 Mariage",null,7,"Cécile Anne Marie","CHAUVET","-2 Mariage"]
["7Cécile Anne MarieCHAUVET-3 Décès",null,7,"Cécile Anne Marie","CHAUVET","-3 Décès"]
["8Sylvain Pierre AndréCHAUVET-1 Naissance",null,8,"Sylvain Pierre André","CHAUVET","-1 Naissance"]
["8Sylvain Pierre AndréCHAUVET-2 Mariage",null,8,"Sylvain Pierre André","CHAUVET","-2 Mariage"]
["8Sylvain Pierre AndréCHAUVET-3 Décès",null,8,"Sylvain Pierre André","CHAUVET","-3 Décès"]
["9Roselyne Marie JeanneCHEILLAN-1 Naissance",null,9,"Roselyne Marie Jeanne","CHEILLAN","-1 Naissance"]
["9Roselyne Marie JeanneCHEILLAN-2 Mariage",null,9,"Roselyne Marie Jeanne","CHEILLAN","-2 Mariage"]
["9Roselyne Marie JeanneCHEILLAN-3 Décès",null,9,"Roselyne Marie Jeanne","CHEILLAN","-3 Décès"]
["10Henri LouisQUINKAL-1 Naissance",null,10,"Henri Louis","QUINKAL","-1 Naissance"]
["10Henri LouisQUINKAL-2 Mariage",null,10,"Henri Louis","QUINKAL","-2 Mariage"]
["10Henri LouisQUINKAL-3 Décès",null,10,"Henri Louis","QUINKAL","-3 Décès"]
["11Henri Pierre GustaveCHAUVET-1 Naissance",null,11,"Henri Pierre Gustave","CHAUVET","-1 Naissance"]
["11Henri Pierre GustaveCHAUVET-2 Mariage",null,11,"Henri Pierre Gustave","CHAUVET","-2 Mariage"]
["11Henri Pierre GustaveCHAUVET-3 Décès",null,11,"Henri Pierre Gustave","CHAUVET","-3 Décès"]
["12Louise RoseAUBERT-1 Naissance",null,12,"Louise Rose","AUBERT","-1 Naissance"]
["12Louise RoseAUBERT-2 Mariage",null,12,"Louise Rose","AUBERT","-2 Mariage"]
["12Louise RoseAUBERT-3 Décès",null,12,"Louise Rose","AUBERT","-3 Décès"]
["13Severin Gustave EtienneCHAUVET-1 Naissance",null,13,"Severin Gustave Etienne","CHAUVET","-1 Naissance"]
["13Severin Gustave EtienneCHAUVET-2 Mariage",null,13,"Severin Gustave Etienne","CHAUVET","-2 Mariage"]
["13Severin Gustave EtienneCHAUVET-3 Décès",null,13,"Severin Gustave Etienne","CHAUVET","-3 Décès"]
["14Marie JuliettePIERCY-1 Naissance",null,14,"Marie Juliette","PIERCY","-1 Naissance"]
["14Marie JuliettePIERCY-2 Mariage",null,14,"Marie Juliette","PIERCY","-2 Mariage"]
["14Marie JuliettePIERCY-3 Décès",null,14,"Marie Juliette","PIERCY","-3 Décès"]
["15Jean Albert AugusteCHAUVET-1 Naissance",null,15,"Jean Albert Auguste","CHAUVET","-1 Naissance"]
["15Jean Albert AugusteCHAUVET-2 Mariage",null,15,"Jean Albert Auguste","CHAUVET","-2 Mariage"]
["15Jean Albert AugusteCHAUVET-3 Décès",null,15,"Jean Albert Auguste","CHAUVET","-3 Décès"]
["16André Louis Fernand AlbinCHAUVET-1 Naissance",null,16,"André Louis Fernand Albin","CHAUVET","-1 Naissance"]
["16André Louis Fernand AlbinCHAUVET-2 Mariage",null,16,"André Louis Fernand Albin","CHAUVET","-2 Mariage"]
["16André Louis Fernand AlbinCHAUVET-3 Décès",null,16,"André Louis Fernand Albin","CHAUVET","-3 Décès"]
["17Albert Severin EtienneCHAUVET-1 Naissance",null,17,"Albert Severin Etienne","CHAUVET","-1 Naissance"]
["17Albert Severin EtienneCHAUVET-2 Mariage",null,17,"Albert Severin Etienne","CHAUVET","-2 Mariage"]
["17Albert Severin EtienneCHAUVET-3 Décès",null,17,"Albert Severin Etienne","CHAUVET","-3 Décès"]
["18Jean FrançoisDUPONT-1 Naissance",null,18,"Jean François","DUPONT","-1 Naissance"]
["18Jean FrançoisDUPONT-2 Mariage",null,18,"Jean François","DUPONT","-2 Mariage"]
["18Jean FrançoisDUPONT-3 Décès",null,18,"Jean François","DUPONT","-3 Décès"]
["19André JosephCHEILLAN-1 Naissance",null,19,"André Joseph","CHEILLAN","-1 Naissance"]
["19André JosephCHEILLAN-2 Mariage",null,19,"André Joseph","CHEILLAN","-2 Mariage"]
["19André JosephCHEILLAN-3 Décès",null,19,"André Joseph","CHEILLAN","-3 Décès"]
["20Maria CéciliaCALA-1 Naissance",null,20,"Maria Cécilia","CALA","-1 Naissance"]
["20Maria CéciliaCALA-2 Mariage",null,20,"Maria Cécilia","CALA","-2 Mariage"]
["20Maria CéciliaCALA-3 Décès",null,20,"Maria Cécilia","CALA","-3 Décès"]
["21ClaudineCHEILLAN-1 Naissance",null,21,"Claudine","CHEILLAN","-1 Naissance"]
["21ClaudineCHEILLAN-2 Mariage",null,21,"Claudine","CHEILLAN","-2 Mariage"]
["21ClaudineCHEILLAN-3 Décès",null,21,"Claudine","CHEILLAN","-3 Décès"]
["22MargueritteCHEILLAN-1 Naissance",null,22,"Margueritte","CHEILLAN","-1 Naissance"]
["22MargueritteCHEILLAN-2 Mariage",null,22,"Margueritte","CHEILLAN","-2 Mariage"]
["22MargueritteCHEILLAN-3 Décès",null,22,"Margueritte","CHEILLAN","-3 Décès"]
["23AlainLOPEZ-1 Naissance",null,23,"Alain","LOPEZ","-1 Naissance"]
["23AlainLOPEZ-2 Mariage",null,23,"Alain","LOPEZ","-2 Mariage"]
["23AlainLOPEZ-3 Décès",null,23,"Alain","LOPEZ","-3 Décès"]
["24Jean Louis Jacques MarcelPISANO-1 Naissance",null,24,"Jean Louis Jacques Marcel","PISANO","-1 Naissance"]
["24Jean Louis Jacques MarcelPISANO-2 Mariage",null,24,"Jean Louis Jacques Marcel","PISANO","-2 Mariage"]
["24Jean Louis Jacques MarcelPISANO-3 Décès",null,24,"Jean Louis Jacques Marcel","PISANO","-3 Décès"]
["25Alexandra IrmgardPISANO-1 Naissance",null,25,"Alexandra Irmgard","PISANO","-1 Naissance"]
["25Alexandra IrmgardPISANO-2 Mariage",null,25,"Alexandra Irmgard","PISANO","-2 Mariage"]
["25Alexandra IrmgardPISANO-3 Décès",null,25,"Alexandra Irmgard","PISANO","-3 Décès"]
["26Gustave AlbertMALEZIEUX-1 Naissance",null,26,"Gustave Albert","MALEZIEUX","-1 Naissance"]
["26Gustave AlbertMALEZIEUX-2 Mariage",null,26,"Gustave Albert","MALEZIEUX","-2 Mariage"]
["26Gustave AlbertMALEZIEUX-3 Décès",null,26,"Gustave Albert","MALEZIEUX","-3 Décès"]
["27Gertrude EdwigeKURZ-1 Naissance",null,27,"Gertrude Edwige","KURZ","-1 Naissance"]
["27Gertrude EdwigeKURZ-2 Mariage",null,27,"Gertrude Edwige","KURZ","-2 Mariage"]
["27Gertrude EdwigeKURZ-3 Décès",null,27,"Gertrude Edwige","KURZ","-3 Décès"]
["28Emmanuelle Marcelle Geneviève MarieCHAUVET-1 Naissance",null,28,"Emmanuelle Marcelle Geneviève Marie","CHAUVET","-1 Naissance"]
["28Emmanuelle Marcelle Geneviève MarieCHAUVET-2 Mariage",null,28,"Emmanuelle Marcelle Geneviève Marie","CHAUVET","-2 Mariage"]
["28Emmanuelle Marcelle Geneviève MarieCHAUVET-3 Décès",null,28,"Emmanuelle Marcelle Geneviève Marie","CHAUVET","-3 Décès"]
["29Félix LouisCHAUVET-1 Naissance",null,29,"Félix Louis","CHAUVET","-1 Naissance"]
["29Félix LouisCHAUVET-2 Mariage",null,29,"Félix Louis","CHAUVET","-2 Mariage"]
["29Félix LouisCHAUVET-3 Décès",null,29,"Félix Louis","CHAUVET","-3 Décès"]
["30Hélene Lydie GermaineGANIVET-1 Naissance",null,30,"Hélene Lydie Germaine","GANIVET","-1 Naissance"]
["30Hélene Lydie GermaineGANIVET-2 Mariage",null,30,"Hélene Lydie Germaine","GANIVET","-2 Mariage"]
["30Hélene Lydie GermaineGANIVET-3 Décès",null,30,"Hélene Lydie Germaine","GANIVET","-3 Décès"]
["31BernardCHAUVET-1 Naissance",null,31,"Bernard","CHAUVET","-1 Naissance"]
["31BernardCHAUVET-2 Mariage",null,31,"Bernard","CHAUVET","-2 Mariage"]
["31BernardCHAUVET-3 Décès",null,31,"Bernard","CHAUVET","-3 Décès"]
["32JacquelineCHAUVET-1 Naissance",null,32,"Jacqueline","CHAUVET","-1 Naissance"]
["32JacquelineCHAUVET-2 Mariage",null,32,"Jacqueline","CHAUVET","-2 Mariage"]
["32JacquelineCHAUVET-3 Décès",null,32,"Jacqueline","CHAUVET","-3 Décès"]
["33Souverain AlexandreCHAUVET-1 Naissance",null,33,"Souverain Alexandre","CHAUVET","-1 Naissance"]
["33Souverain AlexandreCHAUVET-2 Mariage",null,33,"Souverain Alexandre","CHAUVET","-2 Mariage"]
["33Souverain AlexandreCHAUVET-3 Décès",null,33,"Souverain Alexandre","CHAUVET","-3 Décès"]