{"text_format":"1","workbook":"xlsx","n_sheets":8,"sheets":["TABLES","RECAP","Arnou Bienvenue","Arridano Talon","Auriville Hervieux","Bevis Tessier","Byron Daviau","Chappell Chartré"],"not_rendered":{"charts":0,"images":0,"macros":1,"external_links":0,"defined_names":6,"comments":0,"pivot_tables":0},"unopened":[],"bounds":{"document_bytes":16777216,"sheet_cells":100000,"rows_first":2000,"rows_last":500,"rows_between":2000,"halvings":0,"cell_chars":16384,"cell_head_chars":4096},"cells_cut":0,"cells_raw":0,"read":"whole","date_system":"1900"}

{"sheet":"TABLES","index":0,"n_rows":50,"n_cols":54,"rows_kept":50,"cut":false,"hidden":false,"merged":[[1,2,1,4]]}
[]
[null,null,"SEMAINE FINISSANT LE"]
["NOMS",null,"2022-01-08","2022-01-15","2022-01-22","2022-01-29","2022-02-05","2022-02-12","2022-02-19","2022-02-26","2022-03-05","2022-03-12","2022-03-19","2022-03-26","2022-04-02","2022-04-09","2022-04-16","2022-04-23","2022-04-30","2022-05-07","2022-05-14","2022-05-21","2022-05-28","2022-06-04","2022-06-11","2022-06-18","2022-06-25","2022-07-02","2022-07-09","2022-07-16","2022-07-23","2022-07-30","2022-08-06","2022-08-13","2022-08-20","2022-08-27","2022-09-03","2022-09-10","2022-09-17","2022-09-24","2022-10-01","2022-10-08","2022-10-15","2022-10-22","2022-10-29","2022-11-05","2022-11-12","2022-11-19","2022-11-26","2022-12-03","2022-12-10","2022-12-17","2022-12-24","2022-12-31"]
[]
["Arnou Bienvenue","2022",23.5,16,32,32]
["Arridano Talon","2022",5,24,42,42,40,37]
["Auriville Hervieux","2022",null,15.5]
["Bevis Tessier","2022",40,40,35,40,32,41]
["Byron Daviau","2022",40,40,32,40,8,32]
["Chappell Chartré","2022",40,40,40,40,40,40]
{"$rows_left_out":41}
{"sheet":"RECAP","index":1,"n_rows":80,"n_cols":6,"rows_kept":80,"cut":false,"hidden":false,"merged":[]}
[]
[]
["NOMS","TOTAL"]
[]
["Arnou Bienvenue",{"$f":"INDIRECT(\"'\" & $A5 & \"'!F55\")","v":{"$error":"#N/A"}},null,{"$f":"INDIRECT(\"'\" & A$5&\"'!\"&\"F55\")","v":{"$error":"#N/A"}},{"$f":"INDIRECT(\"'Sheet\"&_xludf.ROW()-1&\"'!\"&$F$55)","v":{"$error":"#NAME?"}},{"$f":"INDIRECT(\"'\"&A5&\"'!F55\")","v":{"$error":"#N/A"}}]
["Arridano Talon",{"$f":"INDIRECT(\"'\" & $A6 & \"'!F55\")","v":{"$error":"#N/A"}},null,null,null,{"$f":"INDIRECT(\"'\"&A6&\"'!F55\")","v":{"$error":"#N/A"}}]
["Auriville Hervieux",{"$error":"#N/A"},null,null,null,{"$error":"#N/A"}]
["Bevis Tessier",{"$error":"#N/A"},null,null,null,{"$error":"#N/A"}]
["Byron Daviau",{"$error":"#N/A"},null,null,null,{"$error":"#N/A"}]
["Chappell Chartré",{"$error":"#N/A"},null,null,null,{"$error":"#N/A"}]
{"$rows_left_out":71}
{"sheet":"Arnou Bienvenue","index":2,"n_rows":55,"n_cols":8,"rows_kept":55,"cut":false,"hidden":false,"merged":[[0,0,1,0]]}
["Semaine commencant le","SEMAINES","HRS TRAVAILLÉES","HRS PAYÉES","DIFFÉRENCE","ACCUMULÉES","COMMENTAIRE 1","COMMENTAIRE 2"]
[null,2022]
[{"$f":"DATE($B$2,1,3)-WEEKDAY(DATE($B$2,1,3))+1","v":"2022-01-02"},{"$f":"UPPER(TEXT(A3,\"j mmmm\"))&\" - \"&UPPER(TEXT(A3+6,\"j mmmm\"))","v":"2 JANVIER - 8 JANVIER"},{"$f":"INDEX(TABLES!$A$3:$BB$200,MATCH(MID(CELL(\"nomfichier\",A1),FIND(\"]\",CELL(\"nomfichier\",A1))+1,20),TABLES!$A$3:$A$200,0),MATCH((TEXT(A3+6,\"j mmmm\")&\" \"&B$2)*1,TABLES!$A$3:$BB$3,0))","v":23.5},null,{"$f":"C3-D3","v":23.5},{"$f":"IF(AND(C3<>\"\",D3<>\"\"),E3+F2,\"\")","v":""}]
[{"$f":"A3+7","v":"2022-01-09"},{"$f":"UPPER(TEXT(A4,\"j mmmm\"))&\" - \"&UPPER(TEXT(A4+6,\"j mmmm\"))","v":"9 JANVIER - 15 JANVIER"},{"$f":"INDEX(TABLES!$A$3:$BB$200,MATCH(MID(CELL(\"nomfichier\",A2),FIND(\"]\",CELL(\"nomfichier\",A2))+1,20),TABLES!$A$3:$A$200,0),MATCH((TEXT(A4+6,\"j mmmm\")&\" \"&B$2)*1,TABLES!$A$3:$BB$3,0))","v":16},null,{"$f":"C4-D4","v":16},""]
[{"$f":"A4+7","v":"2022-01-16"},"16 JANVIER - 22 JANVIER",{"$f":"INDEX(TABLES!$A$3:$BB$200,MATCH(MID(CELL(\"nomfichier\",A3),FIND(\"]\",CELL(\"nomfichier\",A3))+1,20),TABLES!$A$3:$A$200,0),MATCH((TEXT(A5+6,\"j mmmm\")&\" \"&B$2)*1,TABLES!$A$3:$BB$3,0))","v":32},null,32,""]
["2022-01-23","23 JANVIER - 29 JANVIER",{"$f":"INDEX(TABLES!$A$3:$BB$200,MATCH(MID(CELL(\"nomfichier\",A4),FIND(\"]\",CELL(\"nomfichier\",A4))+1,20),TABLES!$A$3:$A$200,0),MATCH((TEXT(A6+6,\"j mmmm\")&\" \"&B$2)*1,TABLES!$A$3:$BB$3,0))","v":32},null,32,""]
["2022-01-30","30 JANVIER - 5 FÉVRIER",{"$f":"INDEX(TABLES!$A$3:$BB$200,MATCH(MID(CELL(\"nomfichier\",A5),FIND(\"]\",CELL(\"nomfichier\",A5))+1,20),TABLES!$A$3:$A$200,0),MATCH((TEXT(A7+6,\"j mmmm\")&\" \"&B$2)*1,TABLES!$A$3:$BB$3,0))","v":0},null,0,""]
["2022-02-06","6 FÉVRIER - 12 FÉVRIER",{"$f":"INDEX(TABLES!$A$3:$BB$200,MATCH(MID(CELL(\"nomfichier\",A6),FIND(\"]\",CELL(\"nomfichier\",A6))+1,20),TABLES!$A$3:$A$200,0),MATCH((TEXT(A8+6,\"j mmmm\")&\" \"&B$2)*1,TABLES!$A$3:$BB$3,0))","v":0},null,0,""]
["2022-02-13","13 FÉVRIER - 19 FÉVRIER",{"$f":"INDEX(TABLES!$A$3:$BB$200,MATCH(MID(CELL(\"nomfichier\",A7),FIND(\"]\",CELL(\"nomfichier\",A7))+1,20),TABLES!$A$3:$A$200,0),MATCH((TEXT(A9+6,\"j mmmm\")&\" \"&B$2)*1,TABLES!$A$3:$BB$3,0))","v":0},null,0,""]
["2022-02-20","20 FÉVRIER - 26 FÉVRIER",{"$f":"INDEX(TABLES!$A$3:$BB$200,MATCH(MID(CELL(\"nomfichier\",A8),FIND(\"]\",CELL(\"nomfichier\",A8))+1,20),TABLES!$A$3:$A$200,0),MATCH((TEXT(A10+6,\"j mmmm\")&\" \"&B$2)*1,TABLES!$A$3:$BB$3,0))","v":0},null,0,""]
{"$rows_left_out":46}
{"sheet":"Arridano Talon","index":3,"n_rows":55,"n_cols":11,"rows_kept":55,"cut":false,"hidden":false,"merged":[[0,0,1,0]]}
["Semaine commencant le","SEMAINES","HRS TRAVAILLÉES","HRS PAYÉES","DIFFÉRENCE","ACCUMULÉES","COMMENTAIRE 1","COMMENTAIRE 2"]
[null,2022]
[{"$f":"DATE($B$2,1,3)-WEEKDAY(DATE($B$2,1,3))+1","v":"2022-01-02"},{"$f":"UPPER(TEXT(A3,\"j mmmm\"))&\" - \"&UPPER(TEXT(A3+6,\"j mmmm\"))","v":"2 JANVIER - 8 JANVIER"},{"$f":"INDEX(TABLES!$A$3:$BB$200,MATCH(MID(CELL(\"nomfichier\",A1),FIND(\"]\",CELL(\"nomfichier\",A1))+1,20),TABLES!$A$3:$A$200,0),MATCH((TEXT(A3+6,\"j mmmm\")&\" \"&B$2)*1,TABLES!$A$3:$BB$3,0))","v":5},null,{"$f":"C3-D3","v":5},{"$f":"IF(AND(C3<>\"\",D3<>\"\"),E3+F2,\"\")","v":""}]
[{"$f":"A3+7","v":"2022-01-09"},{"$f":"UPPER(TEXT(A4,\"j mmmm\"))&\" - \"&UPPER(TEXT(A4+6,\"j mmmm\"))","v":"9 JANVIER - 15 JANVIER"},{"$f":"INDEX(TABLES!$A$3:$BB$200,MATCH(MID(CELL(\"nomfichier\",A2),FIND(\"]\",CELL(\"nomfichier\",A2))+1,20),TABLES!$A$3:$A$200,0),MATCH((TEXT(A4+6,\"j mmmm\")&\" \"&B$2)*1,TABLES!$A$3:$BB$3,0))","v":24},null,{"$f":"C4-D4","v":24},""]
[{"$f":"A4+7","v":"2022-01-16"},"16 JANVIER - 22 JANVIER",{"$f":"INDEX(TABLES!$A$3:$BB$200,MATCH(MID(CELL(\"nomfichier\",A3),FIND(\"]\",CELL(\"nomfichier\",A3))+1,20),TABLES!$A$3:$A$200,0),MATCH((TEXT(A5+6,\"j mmmm\")&\" \"&B$2)*1,TABLES!$A$3:$BB$3,0))","v":42},null,42,""]
["2022-01-23","23 JANVIER - 29 JANVIER",{"$f":"INDEX(TABLES!$A$3:$BB$200,MATCH(MID(CELL(\"nomfichier\",A4),FIND(\"]\",CELL(\"nomfichier\",A4))+1,20),TABLES!$A$3:$A$200,0),MATCH((TEXT(A6+6,\"j mmmm\")&\" \"&B$2)*1,TABLES!$A$3:$BB$3,0))","v":42},null,42,""]
["2022-01-30","30 JANVIER - 5 FÉVRIER",{"$f":"INDEX(TABLES!$A$3:$BB$200,MATCH(MID(CELL(\"nomfichier\",A5),FIND(\"]\",CELL(\"nomfichier\",A5))+1,20),TABLES!$A$3:$A$200,0),MATCH((TEXT(A7+6,\"j mmmm\")&\" \"&B$2)*1,TABLES!$A$3:$BB$3,0))","v":40},null,40,""]
["2022-02-06","6 FÉVRIER - 12 FÉVRIER",{"$f":"INDEX(TABLES!$A$3:$BB$200,MATCH(MID(CELL(\"nomfichier\",A6),FIND(\"]\",CELL(\"nomfichier\",A6))+1,20),TABLES!$A$3:$A$200,0),MATCH((TEXT(A8+6,\"j mmmm\")&\" \"&B$2)*1,TABLES!$A$3:$BB$3,0))","v":37},null,37,""]
["2022-02-13","13 FÉVRIER - 19 FÉVRIER",{"$f":"INDEX(TABLES!$A$3:$BB$200,MATCH(MID(CELL(\"nomfichier\",A7),FIND(\"]\",CELL(\"nomfichier\",A7))+1,20),TABLES!$A$3:$A$200,0),MATCH((TEXT(A9+6,\"j mmmm\")&\" \"&B$2)*1,TABLES!$A$3:$BB$3,0))","v":0},null,0,""]
["2022-02-20","20 FÉVRIER - 26 FÉVRIER",{"$f":"INDEX(TABLES!$A$3:$BB$200,MATCH(MID(CELL(\"nomfichier\",A8),FIND(\"]\",CELL(\"nomfichier\",A8))+1,20),TABLES!$A$3:$A$200,0),MATCH((TEXT(A10+6,\"j mmmm\")&\" \"&B$2)*1,TABLES!$A$3:$BB$3,0))","v":0},null,0,""]
{"$rows_left_out":46}
{"sheet":"Auriville Hervieux","index":4,"n_rows":55,"n_cols":11,"rows_kept":55,"cut":false,"hidden":false,"merged":[[0,0,1,0]]}
["Semaine commencant le","SEMAINES","HRS TRAVAILLÉES","HRS PAYÉES","DIFFÉRENCE","ACCUMULÉES","COMMENTAIRE 1","COMMENTAIRE 2"]
[null,2022,null,null,null,0]
[{"$f":"DATE($B$2,1,3)-WEEKDAY(DATE($B$2,1,3))+1","v":"2022-01-02"},{"$f":"UPPER(TEXT(A3,\"j mmmm\"))&\" - \"&UPPER(TEXT(A3+6,\"j mmmm\"))","v":"2 JANVIER - 8 JANVIER"},{"$f":"INDEX(TABLES!$A$3:$BB$200,MATCH(MID(CELL(\"nomfichier\",A1),FIND(\"]\",CELL(\"nomfichier\",A1))+1,20),TABLES!$A$3:$A$200,0),MATCH((TEXT(A3+6,\"j mmmm\")&\" \"&B$2)*1,TABLES!$A$3:$BB$3,0))","v":0},null,{"$f":"C3-D3","v":0},{"$f":"IF(AND(C3<>\"\",D3<>\"\"),E3+F2,\"\")","v":""}]
[{"$f":"A3+7","v":"2022-01-09"},{"$f":"UPPER(TEXT(A4,\"j mmmm\"))&\" - \"&UPPER(TEXT(A4+6,\"j mmmm\"))","v":"9 JANVIER - 15 JANVIER"},{"$f":"INDEX(TABLES!$A$3:$BB$200,MATCH(MID(CELL(\"nomfichier\",A2),FIND(\"]\",CELL(\"nomfichier\",A2))+1,20),TABLES!$A$3:$A$200,0),MATCH((TEXT(A4+6,\"j mmmm\")&\" \"&B$2)*1,TABLES!$A$3:$BB$3,0))","v":15.5},null,{"$f":"C4-D4","v":15.5},""]
[{"$f":"A4+7","v":"2022-01-16"},"16 JANVIER - 22 JANVIER",{"$f":"INDEX(TABLES!$A$3:$BB$200,MATCH(MID(CELL(\"nomfichier\",A3),FIND(\"]\",CELL(\"nomfichier\",A3))+1,20),TABLES!$A$3:$A$200,0),MATCH((TEXT(A5+6,\"j mmmm\")&\" \"&B$2)*1,TABLES!$A$3:$BB$3,0))","v":0},null,0,""]
["2022-01-23","23 JANVIER - 29 JANVIER",{"$f":"INDEX(TABLES!$A$3:$BB$200,MATCH(MID(CELL(\"nomfichier\",A4),FIND(\"]\",CELL(\"nomfichier\",A4))+1,20),TABLES!$A$3:$A$200,0),MATCH((TEXT(A6+6,\"j mmmm\")&\" \"&B$2)*1,TABLES!$A$3:$BB$3,0))","v":0},null,0,""]
["2022-01-30","30 JANVIER - 5 FÉVRIER",{"$f":"INDEX(TABLES!$A$3:$BB$200,MATCH(MID(CELL(\"nomfichier\",A5),FIND(\"]\",CELL(\"nomfichier\",A5))+1,20),TABLES!$A$3:$A$200,0),MATCH((TEXT(A7+6,\"j mmmm\")&\" \"&B$2)*1,TABLES!$A$3:$BB$3,0))","v":0},null,0,""]
["2022-02-06","6 FÉVRIER - 12 FÉVRIER",{"$f":"INDEX(TABLES!$A$3:$BB$200,MATCH(MID(CELL(\"nomfichier\",A6),FIND(\"]\",CELL(\"nomfichier\",A6))+1,20),TABLES!$A$3:$A$200,0),MATCH((TEXT(A8+6,\"j mmmm\")&\" \"&B$2)*1,TABLES!$A$3:$BB$3,0))","v":0},null,0,""]
["2022-02-13","13 FÉVRIER - 19 FÉVRIER",{"$f":"INDEX(TABLES!$A$3:$BB$200,MATCH(MID(CELL(\"nomfichier\",A7),FIND(\"]\",CELL(\"nomfichier\",A7))+1,20),TABLES!$A$3:$A$200,0),MATCH((TEXT(A9+6,\"j mmmm\")&\" \"&B$2)*1,TABLES!$A$3:$BB$3,0))","v":0},null,0,""]
["2022-02-20","20 FÉVRIER - 26 FÉVRIER",{"$f":"INDEX(TABLES!$A$3:$BB$200,MATCH(MID(CELL(\"nomfichier\",A8),FIND(\"]\",CELL(\"nomfichier\",A8))+1,20),TABLES!$A$3:$A$200,0),MATCH((TEXT(A10+6,\"j mmmm\")&\" \"&B$2)*1,TABLES!$A$3:$BB$3,0))","v":0},null,0,""]
{"$rows_left_out":46}
{"sheet":"Bevis Tessier","index":5,"n_rows":55,"n_cols":11,"rows_kept":55,"cut":false,"hidden":false,"merged":[[0,0,1,0]]}
["Semaine commencant le","SEMAINES","HRS TRAVAILLÉES","HRS PAYÉES","DIFFÉRENCE","ACCUMULÉES","COMMENTAIRE 1","COMMENTAIRE 2"]
[null,2022,null,null,null,0]
[{"$f":"DATE($B$2,1,3)-WEEKDAY(DATE($B$2,1,3))+1","v":"2022-01-02"},{"$f":"UPPER(TEXT(A3,\"j mmmm\"))&\" - \"&UPPER(TEXT(A3+6,\"j mmmm\"))","v":"2 JANVIER - 8 JANVIER"},{"$f":"INDEX(TABLES!$A$3:$BB$200,MATCH(MID(CELL(\"nomfichier\",A1),FIND(\"]\",CELL(\"nomfichier\",A1))+1,20),TABLES!$A$3:$A$200,0),MATCH((TEXT(A3+6,\"j mmmm\")&\" \"&B$2)*1,TABLES!$A$3:$BB$3,0))","v":40},null,{"$f":"C3-D3","v":40},{"$f":"IF(AND(C3<>\"\",D3<>\"\"),E3+F2,\"\")","v":""}]
[{"$f":"A3+7","v":"2022-01-09"},{"$f":"UPPER(TEXT(A4,\"j mmmm\"))&\" - \"&UPPER(TEXT(A4+6,\"j mmmm\"))","v":"9 JANVIER - 15 JANVIER"},{"$f":"INDEX(TABLES!$A$3:$BB$200,MATCH(MID(CELL(\"nomfichier\",A2),FIND(\"]\",CELL(\"nomfichier\",A2))+1,20),TABLES!$A$3:$A$200,0),MATCH((TEXT(A4+6,\"j mmmm\")&\" \"&B$2)*1,TABLES!$A$3:$BB$3,0))","v":40},null,{"$f":"C4-D4","v":40},""]
[{"$f":"A4+7","v":"2022-01-16"},"16 JANVIER - 22 JANVIER",{"$f":"INDEX(TABLES!$A$3:$BB$200,MATCH(MID(CELL(\"nomfichier\",A3),FIND(\"]\",CELL(\"nomfichier\",A3))+1,20),TABLES!$A$3:$A$200,0),MATCH((TEXT(A5+6,\"j mmmm\")&\" \"&B$2)*1,TABLES!$A$3:$BB$3,0))","v":35},null,35,""]
["2022-01-23","23 JANVIER - 29 JANVIER",{"$f":"INDEX(TABLES!$A$3:$BB$200,MATCH(MID(CELL(\"nomfichier\",A4),FIND(\"]\",CELL(\"nomfichier\",A4))+1,20),TABLES!$A$3:$A$200,0),MATCH((TEXT(A6+6,\"j mmmm\")&\" \"&B$2)*1,TABLES!$A$3:$BB$3,0))","v":40},null,40,""]
["2022-01-30","30 JANVIER - 5 FÉVRIER",{"$f":"INDEX(TABLES!$A$3:$BB$200,MATCH(MID(CELL(\"nomfichier\",A5),FIND(\"]\",CELL(\"nomfichier\",A5))+1,20),TABLES!$A$3:$A$200,0),MATCH((TEXT(A7+6,\"j mmmm\")&\" \"&B$2)*1,TABLES!$A$3:$BB$3,0))","v":32},null,32,""]
["2022-02-06","6 FÉVRIER - 12 FÉVRIER",{"$f":"INDEX(TABLES!$A$3:$BB$200,MATCH(MID(CELL(\"nomfichier\",A6),FIND(\"]\",CELL(\"nomfichier\",A6))+1,20),TABLES!$A$3:$A$200,0),MATCH((TEXT(A8+6,\"j mmmm\")&\" \"&B$2)*1,TABLES!$A$3:$BB$3,0))","v":41},null,41,""]
["2022-02-13","13 FÉVRIER - 19 FÉVRIER",{"$f":"INDEX(TABLES!$A$3:$BB$200,MATCH(MID(CELL(\"nomfichier\",A7),FIND(\"]\",CELL(\"nomfichier\",A7))+1,20),TABLES!$A$3:$A$200,0),MATCH((TEXT(A9+6,\"j mmmm\")&\" \"&B$2)*1,TABLES!$A$3:$BB$3,0))","v":0},null,0,""]
["2022-02-20","20 FÉVRIER - 26 FÉVRIER",{"$f":"INDEX(TABLES!$A$3:$BB$200,MATCH(MID(CELL(\"nomfichier\",A8),FIND(\"]\",CELL(\"nomfichier\",A8))+1,20),TABLES!$A$3:$A$200,0),MATCH((TEXT(A10+6,\"j mmmm\")&\" \"&B$2)*1,TABLES!$A$3:$BB$3,0))","v":0},null,0,""]
{"$rows_left_out":46}
{"sheet":"Byron Daviau","index":6,"n_rows":55,"n_cols":11,"rows_kept":55,"cut":false,"hidden":false,"merged":[[0,0,1,0]]}
["Semaine commencant le","SEMAINES","HRS TRAVAILLÉES","HRS PAYÉES","DIFFÉRENCE","ACCUMULÉES","COMMENTAIRE 1","COMMENTAIRE 2"]
[null,2022,null,null,null,0]
[{"$f":"DATE($B$2,1,3)-WEEKDAY(DATE($B$2,1,3))+1","v":"2022-01-02"},{"$f":"UPPER(TEXT(A3,\"j mmmm\"))&\" - \"&UPPER(TEXT(A3+6,\"j mmmm\"))","v":"2 JANVIER - 8 JANVIER"},{"$f":"INDEX(TABLES!$A$3:$BB$200,MATCH(MID(CELL(\"nomfichier\",A1),FIND(\"]\",CELL(\"nomfichier\",A1))+1,20),TABLES!$A$3:$A$200,0),MATCH((TEXT(A3+6,\"j mmmm\")&\" \"&B$2)*1,TABLES!$A$3:$BB$3,0))","v":40},null,{"$f":"C3-D3","v":40},{"$f":"IF(AND(C3<>\"\",D3<>\"\"),E3+F2,\"\")","v":""}]
[{"$f":"A3+7","v":"2022-01-09"},{"$f":"UPPER(TEXT(A4,\"j mmmm\"))&\" - \"&UPPER(TEXT(A4+6,\"j mmmm\"))","v":"9 JANVIER - 15 JANVIER"},{"$f":"INDEX(TABLES!$A$3:$BB$200,MATCH(MID(CELL(\"nomfichier\",A2),FIND(\"]\",CELL(\"nomfichier\",A2))+1,20),TABLES!$A$3:$A$200,0),MATCH((TEXT(A4+6,\"j mmmm\")&\" \"&B$2)*1,TABLES!$A$3:$BB$3,0))","v":40},null,{"$f":"C4-D4","v":40},""]
[{"$f":"A4+7","v":"2022-01-16"},"16 JANVIER - 22 JANVIER",{"$f":"INDEX(TABLES!$A$3:$BB$200,MATCH(MID(CELL(\"nomfichier\",A3),FIND(\"]\",CELL(\"nomfichier\",A3))+1,20),TABLES!$A$3:$A$200,0),MATCH((TEXT(A5+6,\"j mmmm\")&\" \"&B$2)*1,TABLES!$A$3:$BB$3,0))","v":32},null,32,""]
["2022-01-23","23 JANVIER - 29 JANVIER",{"$f":"INDEX(TABLES!$A$3:$BB$200,MATCH(MID(CELL(\"nomfichier\",A4),FIND(\"]\",CELL(\"nomfichier\",A4))+1,20),TABLES!$A$3:$A$200,0),MATCH((TEXT(A6+6,\"j mmmm\")&\" \"&B$2)*1,TABLES!$A$3:$BB$3,0))","v":40},null,40,""]
["2022-01-30","30 JANVIER - 5 FÉVRIER",{"$f":"INDEX(TABLES!$A$3:$BB$200,MATCH(MID(CELL(\"nomfichier\",A5),FIND(\"]\",CELL(\"nomfichier\",A5))+1,20),TABLES!$A$3:$A$200,0),MATCH((TEXT(A7+6,\"j mmmm\")&\" \"&B$2)*1,TABLES!$A$3:$BB$3,0))","v":8},null,8,""]
["2022-02-06","6 FÉVRIER - 12 FÉVRIER",{"$f":"INDEX(TABLES!$A$3:$BB$200,MATCH(MID(CELL(\"nomfichier\",A6),FIND(\"]\",CELL(\"nomfichier\",A6))+1,20),TABLES!$A$3:$A$200,0),MATCH((TEXT(A8+6,\"j mmmm\")&\" \"&B$2)*1,TABLES!$A$3:$BB$3,0))","v":32},null,32,""]
["2022-02-13","13 FÉVRIER - 19 FÉVRIER",{"$f":"INDEX(TABLES!$A$3:$BB$200,MATCH(MID(CELL(\"nomfichier\",A7),FIND(\"]\",CELL(\"nomfichier\",A7))+1,20),TABLES!$A$3:$A$200,0),MATCH((TEXT(A9+6,\"j mmmm\")&\" \"&B$2)*1,TABLES!$A$3:$BB$3,0))","v":0},null,0,""]
["2022-02-20","20 FÉVRIER - 26 FÉVRIER",{"$f":"INDEX(TABLES!$A$3:$BB$200,MATCH(MID(CELL(\"nomfichier\",A8),FIND(\"]\",CELL(\"nomfichier\",A8))+1,20),TABLES!$A$3:$A$200,0),MATCH((TEXT(A10+6,\"j mmmm\")&\" \"&B$2)*1,TABLES!$A$3:$BB$3,0))","v":0},null,0,""]
{"$rows_left_out":46}
{"sheet":"Chappell Chartré","index":7,"n_rows":55,"n_cols":11,"rows_kept":55,"cut":false,"hidden":false,"merged":[[0,0,1,0]]}
["Semaine commencant le","SEMAINES","HRS TRAVAILLÉES","HRS PAYÉES","DIFFÉRENCE","ACCUMULÉES","COMMENTAIRE 1","COMMENTAIRE 2"]
[null,2022,null,null,null,0]
[{"$f":"DATE($B$2,1,3)-WEEKDAY(DATE($B$2,1,3))+1","v":"2022-01-02"},{"$f":"UPPER(TEXT(A3,\"j mmmm\"))&\" - \"&UPPER(TEXT(A3+6,\"j mmmm\"))","v":"2 JANVIER - 8 JANVIER"},{"$f":"INDEX(TABLES!$A$3:$BB$200,MATCH(MID(CELL(\"nomfichier\",A1),FIND(\"]\",CELL(\"nomfichier\",A1))+1,20),TABLES!$A$3:$A$200,0),MATCH((TEXT(A3+6,\"j mmmm\")&\" \"&B$2)*1,TABLES!$A$3:$BB$3,0))","v":40},null,{"$f":"C3-D3","v":40},{"$f":"IF(AND(C3<>\"\",D3<>\"\"),E3+F2,\"\")","v":""}]
[{"$f":"A3+7","v":"2022-01-09"},{"$f":"UPPER(TEXT(A4,\"j mmmm\"))&\" - \"&UPPER(TEXT(A4+6,\"j mmmm\"))","v":"9 JANVIER - 15 JANVIER"},{"$f":"INDEX(TABLES!$A$3:$BB$200,MATCH(MID(CELL(\"nomfichier\",A2),FIND(\"]\",CELL(\"nomfichier\",A2))+1,20),TABLES!$A$3:$A$200,0),MATCH((TEXT(A4+6,\"j mmmm\")&\" \"&B$2)*1,TABLES!$A$3:$BB$3,0))","v":40},null,{"$f":"C4-D4","v":40},""]
[{"$f":"A4+7","v":"2022-01-16"},"16 JANVIER - 22 JANVIER",{"$f":"INDEX(TABLES!$A$3:$BB$200,MATCH(MID(CELL(\"nomfichier\",A3),FIND(\"]\",CELL(\"nomfichier\",A3))+1,20),TABLES!$A$3:$A$200,0),MATCH((TEXT(A5+6,\"j mmmm\")&\" \"&B$2)*1,TABLES!$A$3:$BB$3,0))","v":40},null,40,""]
["2022-01-23","23 JANVIER - 29 JANVIER",{"$f":"INDEX(TABLES!$A$3:$BB$200,MATCH(MID(CELL(\"nomfichier\",A4),FIND(\"]\",CELL(\"nomfichier\",A4))+1,20),TABLES!$A$3:$A$200,0),MATCH((TEXT(A6+6,\"j mmmm\")&\" \"&B$2)*1,TABLES!$A$3:$BB$3,0))","v":40},null,40,""]
["2022-01-30","30 JANVIER - 5 FÉVRIER",{"$f":"INDEX(TABLES!$A$3:$BB$200,MATCH(MID(CELL(\"nomfichier\",A5),FIND(\"]\",CELL(\"nomfichier\",A5))+1,20),TABLES!$A$3:$A$200,0),MATCH((TEXT(A7+6,\"j mmmm\")&\" \"&B$2)*1,TABLES!$A$3:$BB$3,0))","v":40},null,40,""]
["2022-02-06","6 FÉVRIER - 12 FÉVRIER",{"$f":"INDEX(TABLES!$A$3:$BB$200,MATCH(MID(CELL(\"nomfichier\",A6),FIND(\"]\",CELL(\"nomfichier\",A6))+1,20),TABLES!$A$3:$A$200,0),MATCH((TEXT(A8+6,\"j mmmm\")&\" \"&B$2)*1,TABLES!$A$3:$BB$3,0))","v":40},null,40,""]
["2022-02-13","13 FÉVRIER - 19 FÉVRIER",{"$f":"INDEX(TABLES!$A$3:$BB$200,MATCH(MID(CELL(\"nomfichier\",A7),FIND(\"]\",CELL(\"nomfichier\",A7))+1,20),TABLES!$A$3:$A$200,0),MATCH((TEXT(A9+6,\"j mmmm\")&\" \"&B$2)*1,TABLES!$A$3:$BB$3,0))","v":0},null,0,""]
["2022-02-20","20 FÉVRIER - 26 FÉVRIER",{"$f":"INDEX(TABLES!$A$3:$BB$200,MATCH(MID(CELL(\"nomfichier\",A8),FIND(\"]\",CELL(\"nomfichier\",A8))+1,20),TABLES!$A$3:$A$200,0),MATCH((TEXT(A10+6,\"j mmmm\")&\" \"&B$2)*1,TABLES!$A$3:$BB$3,0))","v":0},null,0,""]
{"$rows_left_out":45}