{"text_format":"1","workbook":"xlsx","n_sheets":6,"sheets":["Saisie Table","Table 4","Table 3","Table 2","Table 1","Kutools_Chart"],"not_rendered":{"charts":0,"images":9,"macros":1,"external_links":0,"defined_names":33,"comments":0,"pivot_tables":0},"unopened":[],"bounds":{"document_bytes":16777216,"sheet_cells":100000,"rows_first":2000,"rows_last":500,"rows_between":2000,"halvings":0,"cell_chars":16384,"cell_head_chars":4096},"cells_cut":0,"cells_raw":0,"read":"whole","date_system":"1900"}

{"sheet":"Saisie Table","index":0,"n_rows":8,"n_cols":12,"rows_kept":8,"cut":false,"hidden":false,"merged":[[4,1,4,3],[11,0,11,11],[2,0,2,7],[3,1,3,3],[4,9,4,10],[5,1,5,3],[6,1,6,3],[7,1,7,3],[18,0,18,11],[27,3,27,5],[29,3,29,5],[28,3,28,5],[22,0,22,11],[25,8,26,11],[27,8,27,9],[27,10,27,11],[30,3,30,5],[40,10,40,11],[31,3,31,5],[32,3,32,5],[33,3,33,5],[34,8,35,11],[36,8,36,9],[36,10,36,11],[37,8,37,9],[37,10,37,11],[38,8,38,9],[38,10,38,11],[39,8,39,9],[39,10,39,11],[40,8,40,9]]}
[]
[]
[]
["Types ","Photos"]
["Table 1",0,null,null,null,null,null,null,null,"Sélectionnez votre choix ",null,"Table 4"]
["Table 2"]
["Table 3"]
["Table 4"]

{"sheet":"Table 4","index":1,"n_rows":10,"n_cols":4,"rows_kept":10,"cut":false,"hidden":false,"merged":[[19,8,19,9],[19,10,19,11],[20,8,20,9],[20,10,20,11],[21,8,21,9],[21,10,21,11],[18,8,18,9],[18,10,18,11],[9,3,9,5],[10,3,10,5],[11,3,11,5],[12,3,12,5],[13,3,13,5],[14,3,14,5],[15,3,15,6],[15,8,16,11],[16,3,16,5],[17,8,17,9],[17,10,17,11],[8,3,8,5],[8,8,8,9],[8,10,8,11],[3,0,3,11],[6,3,6,5],[6,8,7,11],[7,3,7,6]]}
[]
[]
[]
[]
[]
[]
[null,null,null,"Couvert "]
[null,null,null,"assiette "]
[null,null,null,"Assietes "]
[null,null,null,"plat "]

{"sheet":"Table 3","index":2,"n_rows":11,"n_cols":5,"rows_kept":11,"cut":false,"hidden":false,"merged":[[19,8,19,9],[19,10,19,11],[20,8,20,9],[20,10,20,11],[21,8,21,9],[21,10,21,11],[15,8,16,11],[17,8,17,9],[17,10,17,11],[18,8,18,9],[18,10,18,11],[14,3,14,5],[3,0,3,11],[6,8,7,11],[8,3,8,5],[8,8,8,9],[8,10,8,11],[12,3,12,5],[9,3,9,5],[10,3,10,5],[11,3,11,5],[13,3,13,5]]}
[]
[]
[]
[]
[]
[]
[]
[null,null,null,null,"table "]
[null,null,null,"verdure "]
[]
[null,null,null,"verre "]

{"sheet":"Table 2","index":3,"n_rows":11,"n_cols":4,"rows_kept":11,"cut":false,"hidden":false,"merged":[[20,8,20,9],[20,10,20,11],[21,8,21,9],[21,10,21,11],[17,8,17,9],[17,10,17,11],[18,8,18,9],[18,10,18,11],[19,8,19,9],[19,10,19,11],[13,3,13,5],[14,3,14,5],[15,3,15,6],[15,8,16,11],[16,3,16,5],[12,3,12,5],[11,3,11,5],[3,0,3,11],[6,3,6,5],[6,8,7,11],[7,3,7,6],[8,3,8,5],[8,8,8,9],[8,10,8,11],[9,3,9,5],[10,3,10,5]]}
[]
[]
[]
[]
[]
[]
[]
[null,null,null,"chaise "]
[null,null,null,"citrouille "]
[null,null,null,"cuillere "]
[null,null,null,"carafe"]

{"sheet":"Table 1","index":4,"n_rows":10,"n_cols":4,"rows_kept":10,"cut":false,"hidden":false,"merged":[[20,8,20,9],[20,10,20,11],[21,8,21,9],[21,10,21,11],[17,8,17,9],[17,10,17,11],[18,8,18,9],[18,10,18,11],[19,8,19,9],[19,10,19,11],[15,3,15,6],[15,8,16,11],[16,3,16,5],[11,3,11,5],[3,0,3,11],[6,3,6,5],[6,8,7,11],[7,3,7,6],[8,3,8,5],[8,8,8,9],[8,10,8,11],[9,3,9,5],[10,3,10,5],[12,3,12,5],[13,3,13,5],[14,3,14,5]]}
[]
[]
[]
[]
[]
[]
[]
[null,null,null,"fleur "]
[null,null,null,"coupe "]
[null,null,null,"assiette"]

{"sheet":"Kutools_Chart","index":5,"n_rows":23,"n_cols":2,"rows_kept":23,"cut":false,"hidden":true,"merged":[[4,0,21,0]]}
["Pointeur","Échelle"]
[{"$f":"IF((180/(#REF!-'Saisie Table'!#REF!))*('Saisie Table'!$C$51-'Saisie Table'!#REF!)>180,180,(IF((180/(#REF!-'Saisie Table'!#REF!))*('Saisie Table'!$C$51-'Saisie Table'!#REF!)<0,0,(180/(#REF!-'Saisie Table'!#REF!))*('Saisie Table'!$C$51-'Saisie Table'!#REF!))))","v":{"$error":"#REF!"}},{"$f":"'Saisie Table'!#REF!+(#REF!-'Saisie Table'!#REF!)/10*0","v":{"$error":"#REF!"}}]
[1.5]
[{"$f":"360-1.5-Kutools_Chart!A2","v":{"$error":"#REF!"}},{"$f":"'Saisie Table'!#REF!+(#REF!-'Saisie Table'!#REF!)/10*1","v":{"$error":"#REF!"}}]
["Données intermédiaires du graphique du compteur de vitesse (veuillez ne pas supprimer ou modifier les données, sinon, une erreur se produira dans le graphique du compteur de vitesse)"]
[null,{"$f":"'Saisie Table'!#REF!+(#REF!-'Saisie Table'!#REF!)/10*2","v":{"$error":"#REF!"}}]
[]
[null,{"$f":"'Saisie Table'!#REF!+(#REF!-'Saisie Table'!#REF!)/10*3","v":{"$error":"#REF!"}}]
[]
[null,{"$f":"'Saisie Table'!#REF!+(#REF!-'Saisie Table'!#REF!)/10*4","v":{"$error":"#REF!"}}]
[]
[null,{"$f":"'Saisie Table'!#REF!+(#REF!-'Saisie Table'!#REF!)/10*5","v":{"$error":"#REF!"}}]
[]
[null,{"$f":"'Saisie Table'!#REF!+(#REF!-'Saisie Table'!#REF!)/10*6","v":{"$error":"#REF!"}}]
[]
[null,{"$f":"'Saisie Table'!#REF!+(#REF!-'Saisie Table'!#REF!)/10*7","v":{"$error":"#REF!"}}]
[]
[null,{"$f":"'Saisie Table'!#REF!+(#REF!-'Saisie Table'!#REF!)/10*8","v":{"$error":"#REF!"}}]
[]
[null,{"$f":"'Saisie Table'!#REF!+(#REF!-'Saisie Table'!#REF!)/10*9","v":{"$error":"#REF!"}}]
[]
[null,{"$f":"'Saisie Table'!#REF!+(#REF!-'Saisie Table'!#REF!)/10*10","v":{"$error":"#REF!"}}]
["Valeur actuelle:",{"$f":"'Saisie Table'!$C$51","v":0}]