{"text_format":"1","workbook":"xlsx","n_sheets":2,"sheets":["Numérologie Matrice","Annexe"],"not_rendered":{"charts":0,"images":0,"macros":1,"external_links":0,"defined_names":0,"comments":0,"pivot_tables":0},"unopened":[],"bounds":{"document_bytes":16777216,"sheet_cells":100000,"rows_first":2000,"rows_last":500,"rows_between":2000,"halvings":0,"cell_chars":16384,"cell_head_chars":4096},"cells_cut":0,"cells_raw":0,"read":"whole","date_system":"1900"}

{"sheet":"Numérologie Matrice","index":0,"n_rows":105,"n_cols":51,"rows_kept":105,"cut":false,"hidden":false,"merged":[[26,0,27,14],[26,31,27,38],[0,0,2,51],[3,17,5,33],[14,47,15,51],[14,0,15,14],[14,31,15,38],[7,0,12,1],[7,25,12,26],[16,0,16,2],[17,0,17,2],[18,0,18,2],[20,0,21,14],[20,31,21,38],[50,0,51,14],[50,31,51,38],[56,0,57,14],[56,31,57,38],[32,0,33,14],[32,31,33,38],[38,0,39,14],[38,31,39,38],[44,0,45,14],[44,31,45,38]]}
["LE TEMPLE DES ENERGIES"]
[]
[]
[null,null,null,null,null,null,null,null,null,null,null,null,null,null,null,null,null,"NUMEROLOGIE"]
[]
[]
[]
["PRENOM",null,"A","L","A","I","N",null,null,null,null,null,null,null,null,null,null,null,null,null,null,null,null,null,null,"NOM",null,"Q","U","E","N","A","V","E","A","U"]
[null,null,"J","A","C","Q","U","E","S"]
[null,null,"P","I","E","R","R","E"]
[]
[]
[]
[]
["CHEMIN DE VIE",null,null,null,null,null,null,null,null,null,null,null,null,null,null,null,null,null,null,null,null,null,null,null,null,null,null,null,null,null,null,{"$f":"IFERROR(VLOOKUP(AV19,Annexe!$E$1:'Annexe'!$F$33,2,FALSE),\"\")","v":""},null,null,null,null,null,null,null,null,null,null,null,null,null," ",null,"TOTAL"]
[]
["JOUR"]
["MOIS",null,null,null,null,null,{"$f":"SUM(D17:D19)","v":0}]
["ANNE",null,null,null,null,null,null,null,null,null,null,null,null,null,null,null,null,null,null,null,null,null,null,null,null,null,null,null,null,null,null,null,null,null,null,null,null,null,null,null,null,null,null,null,null,null,null,{"$f":"SUM(VALUE(MID(SUBSTITUTE(G18,\"+\",\"\")*1,ROW($A$1:OFFSET($A$1,LEN(SUBSTITUTE(G18,\"+\",\"\")*1)-1,,,)),1)))","v":0}]
[]
["DE BASE",null,null,null,null,null,null,null,null,null,null,null,null,null,null,null,null,null,null,null,null,null,null,null,null,null,null,null,null,null,null,{"$f":"IFERROR(VLOOKUP(AV25,Annexe!$E$1:'Annexe'!$F$33,2,FALSE),\"\")","v":"TURQUOISE"}]
[]
[]
[{"$f":"C8","v":"A"},{"$f":"C9","v":"J"},{"$f":"C10","v":"P"},{"$f":"C11","v":0},{"$f":"C12","v":0},{"$f":"C13","v":0},{"$f":"AB8","v":"Q"},{"$f":"AB9","v":0},{"$f":"AB10","v":0},{"$f":"AB11","v":0},{"$f":"AB12","v":0},{"$f":"AB13","v":0}]
[{"$f":"IFERROR(VLOOKUP(A24,Annexe!$A$1:'Annexe'!$B$56,2,FALSE),\"\")","v":1},{"$f":"IFERROR(VLOOKUP(B24,Annexe!$A$1:'Annexe'!$B$56,2,FALSE),\"\")","v":1},{"$f":"IFERROR(VLOOKUP(C24,Annexe!$A$1:'Annexe'!$B$56,2,FALSE),\"\")","v":7},{"$f":"IFERROR(VLOOKUP(D24,Annexe!$A$1:'Annexe'!$B$56,2,FALSE),\"\")","v":""},{"$f":"IFERROR(VLOOKUP(E24,Annexe!$A$1:'Annexe'!$B$56,2,FALSE),\"\")","v":""},{"$f":"IFERROR(VLOOKUP(F24,Annexe!$A$1:'Annexe'!$B$56,2,FALSE),\"\")","v":""},{"$f":"IFERROR(VLOOKUP(G24,Annexe!$A$1:'Annexe'!$B$56,2,FALSE),\"\")","v":8},{"$f":"IFERROR(VLOOKUP(H24,Annexe!$A$1:'Annexe'!$B$56,2,FALSE),\"\")","v":""},{"$f":"IFERROR(VLOOKUP(I24,Annexe!$A$1:'Annexe'!$B$56,2,FALSE),\"\")","v":""},{"$f":"IFERROR(VLOOKUP(J24,Annexe!$A$1:'Annexe'!$B$56,2,FALSE),\"\")","v":""},{"$f":"IFERROR(VLOOKUP(K24,Annexe!$A$1:'Annexe'!$B$56,2,FALSE),\"\")","v":""},{"$f":"IFERROR(VLOOKUP(L24,Annexe!$A$1:'Annexe'!$B$56,2,FALSE),\"\")","v":""},{"$f":"IFERROR(VLOOKUP(M24,Annexe!$A$1:'Annexe'!$B$56,2,FALSE),\"\")","v":""},{"$f":"IFERROR(VLOOKUP(N24,Annexe!$A$1:'Annexe'!$B$56,2,FALSE),\"\")","v":""},{"$f":"IFERROR(VLOOKUP(O24,Annexe!$A$1:'Annexe'!$B$56,2,FALSE),\"\")","v":""},{"$f":"IFERROR(VLOOKUP(P24,Annexe!$A$1:'Annexe'!$B$56,2,FALSE),\"\")","v":""},{"$f":"IFERROR(VLOOKUP(Q24,Annexe!$A$1:'Annexe'!$B$56,2,FALSE),\"\")","v":""},{"$f":"IFERROR(VLOOKUP(R24,Annexe!$A$1:'Annexe'!$B$56,2,FALSE),\"\")","v":""},{"$f":"IFERROR(VLOOKUP(S24,Annexe!$A$1:'Annexe'!$B$56,2,FALSE),\"\")","v":""},{"$f":"IFERROR(VLOOKUP(T24,Annexe!$A$1:'Annexe'!$B$56,2,FALSE),\"\")","v":""},{"$f":"IFERROR(VLOOKUP(U24,Annexe!$A$1:'Annexe'!$B$56,2,FALSE),\"\")","v":""},{"$f":"IFERROR(VLOOKUP(V24,Annexe!$A$1:'Annexe'!$B$56,2,FALSE),\"\")","v":""},{"$f":"IFERROR(VLOOKUP(W24,Annexe!$A$1:'Annexe'!$B$56,2,FALSE),\"\")","v":""},{"$f":"IFERROR(VLOOKUP(X24,Annexe!$A$1:'Annexe'!$B$56,2,FALSE),\"\")","v":""},{"$f":"IFERROR(VLOOKUP(Y24,Annexe!$A$1:'Annexe'!$B$56,2,FALSE),\"\")","v":""},{"$f":"IFERROR(VLOOKUP(Z24,Annexe!$A$1:'Annexe'!$B$56,2,FALSE),\"\")","v":""},{"$f":"IFERROR(VLOOKUP(AA24,Annexe!$A$1:'Annexe'!$B$56,2,FALSE),\"\")","v":""}," ",null,null,null,null,null,null,null,null,null,null,null,null,null,null,null,null,null,null,{"$f":"SUM(A25:AA25)","v":17},{"$f":"IF(SUM(A25:AA25)<34,SUM(A25:AA25),VALUE(LEFT(SUM(A25:AA25),1)+VALUE(MID(SUM(A25:AA25),2,1))+IF(LEN(SUM(A25:AA25))=3,VALUE(MID(SUM(A25:AA25),3,1)))))","v":17}]
[]
["DE SOMMET",null,null,null,null,null,null,null,null,null,null,null,null,null,null,null,null,null,null,null,null,null,null,null,null,null,null,null,null,null,null,{"$f":"IFERROR(VLOOKUP(AV31,Annexe!$E$1:'Annexe'!$F$33,2,FALSE),\"\")","v":"AMETHYSTE"}]
[]
[]
[{"$f":"OFFSET($C8,,COUNTA($C8:$Y8)-1)","v":"N"},{"$f":"OFFSET($C9,,COUNTA($C9:$Y9)-1)","v":"S"},{"$f":"OFFSET($C10,,COUNTA($C10:$Y10)-1)","v":"E"},{"$f":"OFFSET($C11,,COUNTA($C11:$Y11)-1)","v":0},{"$f":"OFFSET($C12,,COUNTA($C12:$Y12)-1)","v":0},{"$f":"OFFSET($C13,,COUNTA($C13:$Y13)-1)","v":0},{"$f":"OFFSET($AB8,,COUNTA($AB8:$AX8)-1)","v":"U"},{"$f":"OFFSET($AB9,,COUNTA($AB9:$AX9)-1)","v":0},{"$f":"OFFSET($AB10,,COUNTA($AB10:$AX10)-1)","v":0},{"$f":"OFFSET($AB11,,COUNTA($AB11:$AX11)-1)","v":0},{"$f":"OFFSET($AB12,,COUNTA($AB12:$AX12)-1)","v":0},{"$f":"OFFSET($AB13,,COUNTA($AB13:$AX13)-1)","v":0}]
[{"$f":"IFERROR(VLOOKUP(A30,Annexe!$A$1:'Annexe'!$B$56,2,FALSE),\"\")","v":5},{"$f":"IFERROR(VLOOKUP(B30,Annexe!$A$1:'Annexe'!$B$56,2,FALSE),\"\")","v":1},{"$f":"IFERROR(VLOOKUP(C30,Annexe!$A$1:'Annexe'!$B$56,2,FALSE),\"\")","v":5},{"$f":"IFERROR(VLOOKUP(D30,Annexe!$A$1:'Annexe'!$B$56,2,FALSE),\"\")","v":""},{"$f":"IFERROR(VLOOKUP(E30,Annexe!$A$1:'Annexe'!$B$56,2,FALSE),\"\")","v":""},{"$f":"IFERROR(VLOOKUP(F30,Annexe!$A$1:'Annexe'!$B$56,2,FALSE),\"\")","v":""},{"$f":"IFERROR(VLOOKUP(G30,Annexe!$A$1:'Annexe'!$B$56,2,FALSE),\"\")","v":3},{"$f":"IFERROR(VLOOKUP(H30,Annexe!$A$1:'Annexe'!$B$56,2,FALSE),\"\")","v":""},{"$f":"IFERROR(VLOOKUP(I30,Annexe!$A$1:'Annexe'!$B$56,2,FALSE),\"\")","v":""},{"$f":"IFERROR(VLOOKUP(J30,Annexe!$A$1:'Annexe'!$B$56,2,FALSE),\"\")","v":""},{"$f":"IFERROR(VLOOKUP(K30,Annexe!$A$1:'Annexe'!$B$56,2,FALSE),\"\")","v":""},{"$f":"IFERROR(VLOOKUP(L30,Annexe!$A$1:'Annexe'!$B$56,2,FALSE),\"\")","v":""},{"$f":"IFERROR(VLOOKUP(M30,Annexe!$A$1:'Annexe'!$B$56,2,FALSE),\"\")","v":""},{"$f":"IFERROR(VLOOKUP(N30,Annexe!$A$1:'Annexe'!$B$56,2,FALSE),\"\")","v":""},{"$f":"IFERROR(VLOOKUP(O30,Annexe!$A$1:'Annexe'!$B$56,2,FALSE),\"\")","v":""},{"$f":"IFERROR(VLOOKUP(P30,Annexe!$A$1:'Annexe'!$B$56,2,FALSE),\"\")","v":""},{"$f":"IFERROR(VLOOKUP(Q30,Annexe!$A$1:'Annexe'!$B$56,2,FALSE),\"\")","v":""},{"$f":"IFERROR(VLOOKUP(R30,Annexe!$A$1:'Annexe'!$B$56,2,FALSE),\"\")","v":""},{"$f":"IFERROR(VLOOKUP(S30,Annexe!$A$1:'Annexe'!$B$56,2,FALSE),\"\")","v":""},{"$f":"IFERROR(VLOOKUP(T30,Annexe!$A$1:'Annexe'!$B$56,2,FALSE),\"\")","v":""},{"$f":"IFERROR(VLOOKUP(U30,Annexe!$A$1:'Annexe'!$B$56,2,FALSE),\"\")","v":""},{"$f":"IFERROR(VLOOKUP(V30,Annexe!$A$1:'Annexe'!$B$56,2,FALSE),\"\")","v":""},{"$f":"IFERROR(VLOOKUP(W30,Annexe!$A$1:'Annexe'!$B$56,2,FALSE),\"\")","v":""},{"$f":"IFERROR(VLOOKUP(X30,Annexe!$A$1:'Annexe'!$B$56,2,FALSE),\"\")","v":""},{"$f":"IFERROR(VLOOKUP(Y30,Annexe!$A$1:'Annexe'!$B$56,2,FALSE),\"\")","v":""},{"$f":"IFERROR(VLOOKUP(Z30,Annexe!$A$1:'Annexe'!$B$56,2,FALSE),\"\")","v":""},{"$f":"IFERROR(VLOOKUP(AA30,Annexe!$A$1:'Annexe'!$B$56,2,FALSE),\"\")","v":""},null,null,null,null,null,null,null,null,null,null,null,null,null,null,null,null,null,null,null,{"$f":"SUM(A31:AA31)","v":14},{"$f":"IF(SUM(A31:AA31)<34,SUM(A31:AA31),VALUE(LEFT(SUM(A31:AA31),1)+VALUE(MID(SUM(A31:AA31),2,1))+IF(LEN(SUM(A31:AA31))=3,VALUE(MID(SUM(A31:AA31),3,1)))))","v":14}]
[]
["D'APPEL",null,null,null,null,null,null,null,null,null,null,null,null,null,null,null,null,null,null,null,null,null,null,null,null,null,null,null,null,null,null,{"$f":"IFERROR(VLOOKUP(AV37,Annexe!$E$1:'Annexe'!$F$33,2,FALSE),\"\")","v":"AMBRE"}]
[]
[]
[{"$f":"MID($Q$94,COLUMN(),1)","v":"A"},{"$f":"MID($Q$94,COLUMN(),1)","v":"A"},"I","A","U","E","I","E","E","U","E","A","E","A","U","","","","","","","","","","","",""]
[{"$f":"IFERROR(VLOOKUP(A36,Annexe!$A$1:'Annexe'!$B$56,2,FALSE),\"\")","v":1},{"$f":"IFERROR(VLOOKUP(B36,Annexe!$A$1:'Annexe'!$B$56,2,FALSE),\"\")","v":1},{"$f":"IFERROR(VLOOKUP(C36,Annexe!$A$1:'Annexe'!$B$56,2,FALSE),\"\")","v":9},{"$f":"IFERROR(VLOOKUP(D36,Annexe!$A$1:'Annexe'!$B$56,2,FALSE),\"\")","v":1},{"$f":"IFERROR(VLOOKUP(E36,Annexe!$A$1:'Annexe'!$B$56,2,FALSE),\"\")","v":3},{"$f":"IFERROR(VLOOKUP(F36,Annexe!$A$1:'Annexe'!$B$56,2,FALSE),\"\")","v":5},{"$f":"IFERROR(VLOOKUP(G36,Annexe!$A$1:'Annexe'!$B$56,2,FALSE),\"\")","v":9},{"$f":"IFERROR(VLOOKUP(H36,Annexe!$A$1:'Annexe'!$B$56,2,FALSE),\"\")","v":5},{"$f":"IFERROR(VLOOKUP(I36,Annexe!$A$1:'Annexe'!$B$56,2,FALSE),\"\")","v":5},{"$f":"IFERROR(VLOOKUP(J36,Annexe!$A$1:'Annexe'!$B$56,2,FALSE),\"\")","v":3},{"$f":"IFERROR(VLOOKUP(K36,Annexe!$A$1:'Annexe'!$B$56,2,FALSE),\"\")","v":5},{"$f":"IFERROR(VLOOKUP(L36,Annexe!$A$1:'Annexe'!$B$56,2,FALSE),\"\")","v":1},{"$f":"IFERROR(VLOOKUP(M36,Annexe!$A$1:'Annexe'!$B$56,2,FALSE),\"\")","v":5},{"$f":"IFERROR(VLOOKUP(N36,Annexe!$A$1:'Annexe'!$B$56,2,FALSE),\"\")","v":1},{"$f":"IFERROR(VLOOKUP(O36,Annexe!$A$1:'Annexe'!$B$56,2,FALSE),\"\")","v":3},{"$f":"IFERROR(VLOOKUP(P36,Annexe!$A$1:'Annexe'!$B$56,2,FALSE),\"\")","v":""},{"$f":"IFERROR(VLOOKUP(Q36,Annexe!$A$1:'Annexe'!$B$56,2,FALSE),\"\")","v":""},{"$f":"IFERROR(VLOOKUP(R36,Annexe!$A$1:'Annexe'!$B$56,2,FALSE),\"\")","v":""},{"$f":"IFERROR(VLOOKUP(S36,Annexe!$A$1:'Annexe'!$B$56,2,FALSE),\"\")","v":""},{"$f":"IFERROR(VLOOKUP(T36,Annexe!$A$1:'Annexe'!$B$56,2,FALSE),\"\")","v":""},{"$f":"IFERROR(VLOOKUP(U36,Annexe!$A$1:'Annexe'!$B$56,2,FALSE),\"\")","v":""},{"$f":"IFERROR(VLOOKUP(V36,Annexe!$A$1:'Annexe'!$B$56,2,FALSE),\"\")","v":""},{"$f":"IFERROR(VLOOKUP(W36,Annexe!$A$1:'Annexe'!$B$56,2,FALSE),\"\")","v":""},{"$f":"IFERROR(VLOOKUP(X36,Annexe!$A$1:'Annexe'!$B$56,2,FALSE),\"\")","v":""},{"$f":"IFERROR(VLOOKUP(Y36,Annexe!$A$1:'Annexe'!$B$56,2,FALSE),\"\")","v":""},{"$f":"IFERROR(VLOOKUP(Z36,Annexe!$A$1:'Annexe'!$B$56,2,FALSE),\"\")","v":""},{"$f":"IFERROR(VLOOKUP(AA36,Annexe!$A$1:'Annexe'!$B$56,2,FALSE),\"\")","v":""},null,null,null,null,null,null,null,null,null,null,null,null,null,null,null,null,null,null,null,{"$f":"SUM(A37:AA37)","v":57},{"$f":"IF(SUM(A37:AA37)<34,SUM(A37:AA37),VALUE(LEFT(SUM(A37:AA37),1)+VALUE(MID(SUM(A37:AA37),2,1))+IF(LEN(SUM(A37:AA37))=3,VALUE(MID(SUM(A37:AA37),3,1)))))","v":12}]
[]
["DE PERSONNALITE",null,null,null,null,null,null,null,null,null,null,null,null,null,null,null,null,null,null,null,null,null,null,null,null,null,null,null,null,null,null,{"$f":"IFERROR(VLOOKUP(AV43,Annexe!$E$1:'Annexe'!$F$33,2,FALSE),\"\")","v":"ALGUE MARINE"}]
[]
[]
[{"$f":"MID($Q$105,COLUMN(),1)","v":"L"},{"$f":"MID($Q$105,COLUMN(),1)","v":"N"},"J","C","Q","S","P","R","R","Q","N","V","","","","","","","","","","","","","","",""]
[{"$f":"IFERROR(VLOOKUP(A42,Annexe!$A$1:'Annexe'!$B$56,2,FALSE),\"\")","v":3},{"$f":"IFERROR(VLOOKUP(B42,Annexe!$A$1:'Annexe'!$B$56,2,FALSE),\"\")","v":5},{"$f":"IFERROR(VLOOKUP(C42,Annexe!$A$1:'Annexe'!$B$56,2,FALSE),\"\")","v":1},{"$f":"IFERROR(VLOOKUP(D42,Annexe!$A$1:'Annexe'!$B$56,2,FALSE),\"\")","v":3},{"$f":"IFERROR(VLOOKUP(E42,Annexe!$A$1:'Annexe'!$B$56,2,FALSE),\"\")","v":8},{"$f":"IFERROR(VLOOKUP(F42,Annexe!$A$1:'Annexe'!$B$56,2,FALSE),\"\")","v":1},{"$f":"IFERROR(VLOOKUP(G42,Annexe!$A$1:'Annexe'!$B$56,2,FALSE),\"\")","v":7},{"$f":"IFERROR(VLOOKUP(H42,Annexe!$A$1:'Annexe'!$B$56,2,FALSE),\"\")","v":9},{"$f":"IFERROR(VLOOKUP(I42,Annexe!$A$1:'Annexe'!$B$56,2,FALSE),\"\")","v":9},{"$f":"IFERROR(VLOOKUP(J42,Annexe!$A$1:'Annexe'!$B$56,2,FALSE),\"\")","v":8},{"$f":"IFERROR(VLOOKUP(K42,Annexe!$A$1:'Annexe'!$B$56,2,FALSE),\"\")","v":5},{"$f":"IFERROR(VLOOKUP(L42,Annexe!$A$1:'Annexe'!$B$56,2,FALSE),\"\")","v":4},{"$f":"IFERROR(VLOOKUP(M42,Annexe!$A$1:'Annexe'!$B$56,2,FALSE),\"\")","v":""},{"$f":"IFERROR(VLOOKUP(N42,Annexe!$A$1:'Annexe'!$B$56,2,FALSE),\"\")","v":""},{"$f":"IFERROR(VLOOKUP(O42,Annexe!$A$1:'Annexe'!$B$56,2,FALSE),\"\")","v":""},{"$f":"IFERROR(VLOOKUP(P42,Annexe!$A$1:'Annexe'!$B$56,2,FALSE),\"\")","v":""},{"$f":"IFERROR(VLOOKUP(Q42,Annexe!$A$1:'Annexe'!$B$56,2,FALSE),\"\")","v":""},{"$f":"IFERROR(VLOOKUP(R42,Annexe!$A$1:'Annexe'!$B$56,2,FALSE),\"\")","v":""},{"$f":"IFERROR(VLOOKUP(S42,Annexe!$A$1:'Annexe'!$B$56,2,FALSE),\"\")","v":""},{"$f":"IFERROR(VLOOKUP(T42,Annexe!$A$1:'Annexe'!$B$56,2,FALSE),\"\")","v":""},{"$f":"IFERROR(VLOOKUP(U42,Annexe!$A$1:'Annexe'!$B$56,2,FALSE),\"\")","v":""},{"$f":"IFERROR(VLOOKUP(V42,Annexe!$A$1:'Annexe'!$B$56,2,FALSE),\"\")","v":""},{"$f":"IFERROR(VLOOKUP(W42,Annexe!$A$1:'Annexe'!$B$56,2,FALSE),\"\")","v":""},{"$f":"IFERROR(VLOOKUP(X42,Annexe!$A$1:'Annexe'!$B$56,2,FALSE),\"\")","v":""},{"$f":"IFERROR(VLOOKUP(Y42,Annexe!$A$1:'Annexe'!$B$56,2,FALSE),\"\")","v":""},{"$f":"IFERROR(VLOOKUP(Z42,Annexe!$A$1:'Annexe'!$B$56,2,FALSE),\"\")","v":""},{"$f":"IFERROR(VLOOKUP(AA42,Annexe!$A$1:'Annexe'!$B$56,2,FALSE),\"\")","v":""},null,null,null,null,null,null,null,null,null,null,null,null,null,null,null,null,null,null,null,{"$f":"SUM(A43:AA43)","v":63},9]
[]
["D'EXPRESSION",null,null,null,null,null,null,null,null,null,null,null,null,null,null,null,null,null,null,null,null,null,null,null,null,null,null,null,null,null,null,{"$f":"IFERROR(VLOOKUP(AV48,Annexe!$E$1:'Annexe'!$F$33,2,FALSE),\"\")","v":"CALCEDOINE"}]
[]
[]
[{"$f":"AU37","v":57},{"$f":"AU43","v":63},null,null,null,null,null,null,null,null,null,null,null,null,null,null,null,null,null,null,null,null,null,null,null,null,null,null,null,null,null,null,null,null,null,null,null,null,null,null,null,null,null,null,null,null,{"$f":"SUM(A48:AB48)","v":120},3]
[]
[]
["DE TOUCHE",null,null,null,null,null,null,null,null,null,null,null,null,null,null,null,null,null,null,null,null,null,null,null,null,null,null,null,null,null,null,{"$f":"IFERROR(VLOOKUP(AV54,Annexe!$E$1:'Annexe'!$F$33,2,FALSE),\"\")","v":"RHODOCROSITE"}]
[]
[]
[{"$f":"AU25","v":17},{"$f":"AU31","v":14},{"$f":"AU37","v":57},{"$f":"AU43","v":63},{"$f":"AU48","v":120},null,null,null,null,null,null,null,null,null,null,null,null,null,null,null,null,null,null,null,null,null,null,null,null,null,null,null,null,null,null,null,null,null,null,null,null,null,null,null,null,null,{"$f":"SUM(A54:AA54)","v":271},10]
[]
[]
["DE VŒUX",null,null,null,null,null,null,null,null,null,null,null,null,null,null,null,null,null,null,null,null,null,null,null,null,null,null,null,null,null,null,{"$f":"IFERROR(VLOOKUP(AV61,Annexe!$E$1:'Annexe'!$F$33,2,FALSE),\"\")","v":"AMETHYSTE"}]
[]
[]
[{"$f":"MID($Q96,COLUMN(),1)","v":"A"},{"$f":"MID($Q96,COLUMN(),1)","v":"A"},"I","U","","","","","","","","","","","","","","","","","","","","","","",""]
{"$rows_left_out":46}
{"sheet":"Annexe","index":1,"n_rows":57,"n_cols":9,"rows_kept":57,"cut":false,"hidden":false,"merged":[]}
["A",1,null,null,1,"QUARTZ ROSE",null,null,"A"]
["B",2,null,null,2,"JASPE ROUGE",null,null,"E"]
["C",3,null,null,3,"CALCEDOINE",null,null,"I"]
["D",4,null,null,4,"JADE",null,null,"O"]
["E",5,null,null,5,"EMERAUDE",null,null,"U"]
["F",6,null,null,6,"GRENAT",null,null,"Y"]
["G",7,null,null,7,"CITRINE",null,null,"À"]
["H",8,null,null,8,"OBSIDIENNE",null,null,"Â"]
["I",9,null,null,9,"ALGUE MARINE",null,null,"Ä"]
["J",1,null,null,10,"RHODOCROSITE",null,null,"à"]
["K",2,null,null,11,"CORNALINE",null,null,"â"]
["L",3,null,null,12,"AMBRE",null,null,"ä"]
["M",4,null,null,13,"HEMATITE",null,null,"È"]
["N",5,null,null,14,"AMETHYSTE",null,null,"É"]
["O",6,null,null,15,"MALACHITE",null,null,"Ê"]
["P",7,null,null,16,"OPALE",null,null,"Ë"]
["Q",8,null,null,17,"TURQUOISE",null,null,"è"]
["R",9,null,null,18,"PIERRE DE LUNE",null,null,"é"]
["S",1,null,null,19,"TOPAZE",null,null,"ê"]
["T",2,null,null,20,"LAPIS LAZULI",null,null,"ë"]
["U",3,null,null,21,"TOURMALINE",null,null,"Î"]
["V",4,null,null,22,"CRISTAL DE ROCHE",null,null,"Ï"]
["W",5,null,null,23,"AZURITE",null,null,"î"]
["X",6,null,null,24,"AMAZONITE",null,null,"ï"]
["Y",7,null,null,25,"ŒIL DE TIGRE",null,null,"Ô"]
["Z",8,null,null,26,"PYRITE",null,null,"Ö"]
["À",9,null,null,27,"FLUORITE / FLUORINE",null,null,"ô"]
["Â",9,null,null,28,"PERLE",null,null,"ö"]
["Ä",6,null,null,29,"SODALITE",null,null,"Ù"]
["à",9,null,null,30,"QUARTZ FUME",null,null,"Û"]
["â",9,null,null,31,"SOUFRE",null,null,"Ü"]
["ä",9,null,null,32,"MERCURE",null,null,"ù"]
["È",1,null,null,33,"SEL",null,null,"û"]
["É",1,null,null,null,null,null,null,"ü"]
["Ê",1]
["Ë",5]
["è",1]
["é",1]
["ê",1]
["ë",5]
["Î",5]
["Ï",9]
["î",5]
["ï",9]
["Ô",6]
["Ö",2]
["ô",6]
["ö",2]
["Ù",3]
["Û",3]
["Ü",8]
["ù",3]
["û",3]
["ü",8]
["Ç",1]
["ç",1]
[{"$f":"LEN(D2)","v":0},{"$f":"SEARCH(\" \",D2)","v":{"$error":"#VALUE!"}}]