{"text_format":"1","workbook":"xlsx","n_sheets":16,"sheets":["P1","P2","P3","P4","P5","P6","P7","P8","P9","P10","P11","P12","P13","P14","P15","P16"],"not_rendered":{"charts":0,"images":0,"macros":1,"external_links":0,"defined_names":9,"comments":0,"pivot_tables":0},"unopened":[],"bounds":{"document_bytes":16777216,"sheet_cells":100000,"rows_first":2000,"rows_last":500,"rows_between":2000,"halvings":0,"cell_chars":16384,"cell_head_chars":4096},"cells_cut":0,"cells_raw":0,"read":"whole","date_system":"1900"}

{"sheet":"P1","index":0,"n_rows":103,"n_cols":26,"rows_kept":103,"cut":false,"hidden":false,"merged":[[0,0,0,5],[1,0,1,5],[2,0,2,5],[3,0,3,5],[23,6,24,6],[69,7,69,25],[69,2,69,5],[69,6,70,6],[3,8,3,10],[15,6,16,6],[63,6,64,6],[31,6,32,6],[39,6,40,6],[47,6,48,6],[55,6,56,6]]}
[null,null,null,null,null,null,3]
["CHAMPIONNAT DES CLUBS"]
[]
["POULE 1"]
["EQUIPES",null,"POINTS","Pour","Contre","Diff"]
["AA","1A",{"$f":"SUMIF($A$18:$A$69,A6,$E$18:$E$69)+SUMIF($C$18:$C$69,A6,$F$18:$F$69)","v":17},{"$f":"SUMIF($A$18:$A$69,$A6,$B$18:$B$69)+SUMIF($C$18:$C$69,$A6,$D$18:$D$69)","v":148},{"$f":"SUMIF($C$18:$C$69,$A6,$B$18:$B$69)+SUMIF($A$18:$A$69,$A6,$D$18:$D$69)","v":104},{"$f":"D6-E6","v":44}]
["AB","1B",{"$f":"SUMIF($A$18:$A$69,A7,$E$18:$E$69)+SUMIF($C$18:$C$69,A7,$F$18:$F$69)","v":17},{"$f":"SUMIF($A$18:$A$69,$A7,$B$18:$B$69)+SUMIF($C$18:$C$69,$A7,$D$18:$D$69)","v":162},{"$f":"SUMIF($C$18:$C$69,$A7,$B$18:$B$69)+SUMIF($A$18:$A$69,$A7,$D$18:$D$69)","v":90},72]
["AC","1C",{"$f":"SUMIF($A$18:$A$69,A8,$E$18:$E$69)+SUMIF($C$18:$C$69,A8,$F$18:$F$69)","v":15},112,140,-28]
["AD","1D",15,154,98,56]
["AE","1E",17,140,112,28]
["AF","1F",11,94,158,-64]
["AG","1G",13,120,132,{"$f":"D12-E12","v":-12}]
["AH","1H",7,{"$f":"SUMIF($A$18:$A$69,$A13,$B$18:$B$69)+SUMIF($C$18:$C$69,$A13,$D$18:$D$69)","v":78},174,{"$f":"D13-E13","v":-96}]
[]
["1er MATCH le ","à","AA"]
[null,null,null,null,null,null,"SI forfait éq recevante"]
["Equipes","score","Equipes","score","Points","Points"]
["AA",20,"AB",{"$f":"IF(G18=19,19,IF(ISBLANK(B18),\"\",IF(B18=19,0,36-B18)))","v":16},{"$f":"IF(G18=19,0,IF(ISBLANK(B18),\"\",IF(B18<18,1,IF(B18=18,2,IF(B18>18,3)))))","v":3},{"$f":"IF(G18=19,3,IF(ISBLANK(B18),\"\",IF(B18=19,0,IF(D18<18,1,IF(D18=18,2,IF(D18>=20,3))))))","v":1},null,null,null,null,null,{"$f":"IF(B18>D18,A18&C18,IF(D18>B18,C18&A18,\"/\"))","v":"AAAB"},null,{"$f":"A18&C18","v":"AAAB"},{"$f":"E18","v":3},{"$f":"C18&A18","v":"ABAA"},{"$f":"F18","v":1},{"$f":"B18","v":20},{"$f":"D18","v":16}]
["AC",30,"AD",{"$f":"IF(G19=19,19,IF(ISBLANK(B19),\"\",IF(B19=19,0,36-B19)))","v":6},{"$f":"IF(G19=19,0,IF(ISBLANK(B19),\"\",IF(B19<18,1,IF(B19=18,2,IF(B19>18,3)))))","v":3},{"$f":"IF(G19=19,3,IF(ISBLANK(B19),\"\",IF(B19=19,0,IF(D19<18,1,IF(D19=18,2,IF(D19>=20,3))))))","v":1},null,null,null,null,null,{"$f":"IF(B19>D19,A19&C19,IF(D19>B19,C19&A19,\"/\"))","v":"ACAD"},null,{"$f":"A19&C19","v":"ACAD"},{"$f":"E19","v":3},{"$f":"C19&A19","v":"ADAC"},{"$f":"F19","v":1},{"$f":"B19","v":30},{"$f":"D19","v":6}]
["AE",22,"AF",{"$f":"IF(G20=19,19,IF(ISBLANK(B20),\"\",IF(B20=19,0,36-B20)))","v":14},{"$f":"IF(G20=19,0,IF(ISBLANK(B20),\"\",IF(B20<18,1,IF(B20=18,2,IF(B20>18,3)))))","v":3},{"$f":"IF(G20=19,3,IF(ISBLANK(B20),\"\",IF(B20=19,0,IF(D20<18,1,IF(D20=18,2,IF(D20>=20,3))))))","v":1},null,null,null,null,null,{"$f":"IF(B20>D20,A20&C20,IF(D20>B20,C20&A20,\"/\"))","v":"AEAF"},null,{"$f":"A20&C20","v":"AEAF"},{"$f":"E20","v":3},{"$f":"C20&A20","v":"AFAE"},{"$f":"F20","v":1},{"$f":"B20","v":22},{"$f":"D20","v":14}]
["AG",30,"AH",{"$f":"IF(G21=19,19,IF(ISBLANK(B21),\"\",IF(B21=19,0,36-B21)))","v":6},{"$f":"IF(G21=19,0,IF(ISBLANK(B21),\"\",IF(B21<18,1,IF(B21=18,2,IF(B21>18,3)))))","v":3},{"$f":"IF(G21=19,3,IF(ISBLANK(B21),\"\",IF(B21=19,0,IF(D21<18,1,IF(D21=18,2,IF(D21>=20,3))))))","v":1},null,null,null,null,null,{"$f":"IF(B21>D21,A21&C21,IF(D21>B21,C21&A21,\"/\"))","v":"AGAH"},null,{"$f":"A21&C21","v":"AGAH"},{"$f":"E21","v":3},{"$f":"C21&A21","v":"AHAG"},{"$f":"F21","v":1},{"$f":"B21","v":30},{"$f":"D21","v":6}]
[]
["2 éme MATCH le ","à","AB"]
[null,null,null,null,null,null,"SI forfait éq recevante"]
["Equipes","score","Equipes","score","Points","Points"]
["AA",24,"AC",{"$f":"IF(G26=19,19,IF(ISBLANK(B26),\"\",IF(B26=19,0,36-B26)))","v":12},{"$f":"IF(G26=19,0,IF(ISBLANK(B26),\"\",IF(B26<18,1,IF(B26=18,2,IF(B26>18,3)))))","v":3},{"$f":"IF(G26=19,3,IF(ISBLANK(B26),\"\",IF(B26=19,0,IF(D26<18,1,IF(D26=18,2,IF(D26>=20,3))))))","v":1},null,null,null,null,null,{"$f":"IF(B26>D26,A26&C26,IF(D26>B26,C26&A26,\"/\"))","v":"AAAC"},null,{"$f":"A26&C26","v":"AAAC"},{"$f":"E26","v":3},{"$f":"C26&A26","v":"ACAA"},{"$f":"F26","v":1},{"$f":"B26","v":24},{"$f":"D26","v":12}]
["AB",26,"AH",{"$f":"IF(G27=19,19,IF(ISBLANK(B27),\"\",IF(B27=19,0,36-B27)))","v":10},{"$f":"IF(G27=19,0,IF(ISBLANK(B27),\"\",IF(B27<18,1,IF(B27=18,2,IF(B27>18,3)))))","v":3},{"$f":"IF(G27=19,3,IF(ISBLANK(B27),\"\",IF(B27=19,0,IF(D27<18,1,IF(D27=18,2,IF(D27>=20,3))))))","v":1},null,null,null,null,null,{"$f":"IF(B27>D27,A27&C27,IF(D27>B27,C27&A27,\"/\"))","v":"ABAH"},null,{"$f":"A27&C27","v":"ABAH"},{"$f":"E27","v":3},{"$f":"C27&A27","v":"AHAB"},{"$f":"F27","v":1},{"$f":"B27","v":26},{"$f":"D27","v":10}]
["AD",28,"AF",{"$f":"IF(G28=19,19,IF(ISBLANK(B28),\"\",IF(B28=19,0,36-B28)))","v":8},{"$f":"IF(G28=19,0,IF(ISBLANK(B28),\"\",IF(B28<18,1,IF(B28=18,2,IF(B28>18,3)))))","v":3},{"$f":"IF(G28=19,3,IF(ISBLANK(B28),\"\",IF(B28=19,0,IF(D28<18,1,IF(D28=18,2,IF(D28>=20,3))))))","v":1},null,null,null,null,null,{"$f":"IF(B28>D28,A28&C28,IF(D28>B28,C28&A28,\"/\"))","v":"ADAF"},null,{"$f":"A28&C28","v":"ADAF"},{"$f":"E28","v":3},{"$f":"C28&A28","v":"AFAD"},{"$f":"F28","v":1},{"$f":"B28","v":28},{"$f":"D28","v":8}]
["AE",28,"AG",{"$f":"IF(G29=19,19,IF(ISBLANK(B29),\"\",IF(B29=19,0,36-B29)))","v":8},{"$f":"IF(G29=19,0,IF(ISBLANK(B29),\"\",IF(B29<18,1,IF(B29=18,2,IF(B29>18,3)))))","v":3},{"$f":"IF(G29=19,3,IF(ISBLANK(B29),\"\",IF(B29=19,0,IF(D29<18,1,IF(D29=18,2,IF(D29>=20,3))))))","v":1},null,null,null,null,null,{"$f":"IF(B29>D29,A29&C29,IF(D29>B29,C29&A29,\"/\"))","v":"AEAG"},null,{"$f":"A29&C29","v":"AEAG"},{"$f":"E29","v":3},{"$f":"C29&A29","v":"AGAE"},{"$f":"F29","v":1},{"$f":"B29","v":28},{"$f":"D29","v":8}]
[]
["3 éme MATCH le ","à","AC"]
[null,null,null,null,null,null,"SI forfait éq recevante"]
["Equipes","score","Equipes","score","Points","Points"]
["AA",20,"AH",{"$f":"IF(G34=19,19,IF(ISBLANK(B34),\"\",IF(B34=19,0,36-B34)))","v":16},{"$f":"IF(G34=19,0,IF(ISBLANK(B34),\"\",IF(B34<18,1,IF(B34=18,2,IF(B34>18,3)))))","v":3},{"$f":"IF(G34=19,3,IF(ISBLANK(B34),\"\",IF(B34=19,0,IF(D34<18,1,IF(D34=18,2,IF(D34>=20,3))))))","v":1},null,null,null,null,null,{"$f":"IF(B34>D34,A34&C34,IF(D34>B34,C34&A34,\"/\"))","v":"AAAH"},null,{"$f":"A34&C34","v":"AAAH"},{"$f":"E34","v":3},{"$f":"C34&A34","v":"AHAA"},{"$f":"F34","v":1},{"$f":"B34","v":20},{"$f":"D34","v":16}]
["AB",26,"AE",{"$f":"IF(G35=19,19,IF(ISBLANK(B35),\"\",IF(B35=19,0,36-B35)))","v":10},{"$f":"IF(G35=19,0,IF(ISBLANK(B35),\"\",IF(B35<18,1,IF(B35=18,2,IF(B35>18,3)))))","v":3},{"$f":"IF(G35=19,3,IF(ISBLANK(B35),\"\",IF(B35=19,0,IF(D35<18,1,IF(D35=18,2,IF(D35>=20,3))))))","v":1},null,null,null,null,null,{"$f":"IF(B35>D35,A35&C35,IF(D35>B35,C35&A35,\"/\"))","v":"ABAE"},null,{"$f":"A35&C35","v":"ABAE"},{"$f":"E35","v":3},{"$f":"C35&A35","v":"AEAB"},{"$f":"F35","v":1},{"$f":"B35","v":26},{"$f":"D35","v":10}]
["AC",20,"AF",{"$f":"IF(G36=19,19,IF(ISBLANK(B36),\"\",IF(B36=19,0,36-B36)))","v":16},{"$f":"IF(G36=19,0,IF(ISBLANK(B36),\"\",IF(B36<18,1,IF(B36=18,2,IF(B36>18,3)))))","v":3},{"$f":"IF(G36=19,3,IF(ISBLANK(B36),\"\",IF(B36=19,0,IF(D36<18,1,IF(D36=18,2,IF(D36>=20,3))))))","v":1},null,null,null,null,null,{"$f":"IF(B36>D36,A36&C36,IF(D36>B36,C36&A36,\"/\"))","v":"ACAF"},null,{"$f":"A36&C36","v":"ACAF"},{"$f":"E36","v":3},{"$f":"C36&A36","v":"AFAC"},{"$f":"F36","v":1},{"$f":"B36","v":20},{"$f":"D36","v":16}]
["AD",30,"AG",{"$f":"IF(G37=19,19,IF(ISBLANK(B37),\"\",IF(B37=19,0,36-B37)))","v":6},{"$f":"IF(G37=19,0,IF(ISBLANK(B37),\"\",IF(B37<18,1,IF(B37=18,2,IF(B37>18,3)))))","v":3},{"$f":"IF(G37=19,3,IF(ISBLANK(B37),\"\",IF(B37=19,0,IF(D37<18,1,IF(D37=18,2,IF(D37>=20,3))))))","v":1},null,null,null,null,null,{"$f":"IF(B37>D37,A37&C37,IF(D37>B37,C37&A37,\"/\"))","v":"ADAG"},null,{"$f":"A37&C37","v":"ADAG"},{"$f":"E37","v":3},{"$f":"C37&A37","v":"AGAD"},{"$f":"F37","v":1},{"$f":"B37","v":30},{"$f":"D37","v":6}]
[]
["4 éme MATCH le ","à","AD"]
[null,null,null,null,null,null,"SI forfait éq recevante"]
["Equipes","score","Equipes","score","Points","Points"]
["AA",20,"AD",{"$f":"IF(G42=19,19,IF(ISBLANK(B42),\"\",IF(B42=19,0,36-B42)))","v":16},{"$f":"IF(G42=19,0,IF(ISBLANK(B42),\"\",IF(B42<18,1,IF(B42=18,2,IF(B42>18,3)))))","v":3},{"$f":"IF(G42=19,3,IF(ISBLANK(B42),\"\",IF(B42=19,0,IF(D42<18,1,IF(D42=18,2,IF(D42>=20,3))))))","v":1},null,null,null,null,null,{"$f":"IF(B42>D42,A42&C42,IF(D42>B42,C42&A42,\"/\"))","v":"AAAD"},null,{"$f":"A42&C42","v":"AAAD"},{"$f":"E42","v":3},{"$f":"C42&A42","v":"ADAA"},{"$f":"F42","v":1},{"$f":"B42","v":20},{"$f":"D42","v":16}]
["AF",24,"AG",{"$f":"IF(G43=19,19,IF(ISBLANK(B43),\"\",IF(B43=19,0,36-B43)))","v":12},{"$f":"IF(G43=19,0,IF(ISBLANK(B43),\"\",IF(B43<18,1,IF(B43=18,2,IF(B43>18,3)))))","v":3},{"$f":"IF(G43=19,3,IF(ISBLANK(B43),\"\",IF(B43=19,0,IF(D43<18,1,IF(D43=18,2,IF(D43>=20,3))))))","v":1},null,null,null,null,null,{"$f":"IF(B43>D43,A43&C43,IF(D43>B43,C43&A43,\"/\"))","v":"AFAG"},null,{"$f":"A43&C43","v":"AFAG"},{"$f":"E43","v":3},{"$f":"C43&A43","v":"AGAF"},{"$f":"F43","v":1},{"$f":"B43","v":24},{"$f":"D43","v":12}]
["AB",32,"AC",{"$f":"IF(G44=19,19,IF(ISBLANK(B44),\"\",IF(B44=19,0,36-B44)))","v":4},{"$f":"IF(G44=19,0,IF(ISBLANK(B44),\"\",IF(B44<18,1,IF(B44=18,2,IF(B44>18,3)))))","v":3},{"$f":"IF(G44=19,3,IF(ISBLANK(B44),\"\",IF(B44=19,0,IF(D44<18,1,IF(D44=18,2,IF(D44>=20,3))))))","v":1},null,null,null,null,null,{"$f":"IF(B44>D44,A44&C44,IF(D44>B44,C44&A44,\"/\"))","v":"ABAC"},null,{"$f":"A44&C44","v":"ABAC"},{"$f":"E44","v":3},{"$f":"C44&A44","v":"ACAB"},{"$f":"F44","v":1},{"$f":"B44","v":32},{"$f":"D44","v":4}]
["AE",20,"AH",{"$f":"IF(G45=19,19,IF(ISBLANK(B45),\"\",IF(B45=19,0,36-B45)))","v":16},{"$f":"IF(G45=19,0,IF(ISBLANK(B45),\"\",IF(B45<18,1,IF(B45=18,2,IF(B45>18,3)))))","v":3},{"$f":"IF(G45=19,3,IF(ISBLANK(B45),\"\",IF(B45=19,0,IF(D45<18,1,IF(D45=18,2,IF(D45>=20,3))))))","v":1},null,null,null,null,null,{"$f":"IF(B45>D45,A45&C45,IF(D45>B45,C45&A45,\"/\"))","v":"AEAH"},null,{"$f":"A45&C45","v":"AEAH"},{"$f":"E45","v":3},{"$f":"C45&A45","v":"AHAE"},{"$f":"F45","v":1},{"$f":"B45","v":20},{"$f":"D45","v":16}]
[]
["5 éme MATCH le ","à","AE"]
[null,null,null,null,null,null,"SI forfait éq recevante"]
["Equipes","score","Equipes","score","Points","Points"]
["AA",36,"AF",{"$f":"IF(G50=19,19,IF(ISBLANK(B50),\"\",IF(B50=19,0,36-B50)))","v":0},{"$f":"IF(G50=19,0,IF(ISBLANK(B50),\"\",IF(B50<18,1,IF(B50=18,2,IF(B50>18,3)))))","v":3},{"$f":"IF(G50=19,3,IF(ISBLANK(B50),\"\",IF(B50=19,0,IF(D50<18,1,IF(D50=18,2,IF(D50>=20,3))))))","v":1},null,null,null,null,null,{"$f":"IF(B50>D50,A50&C50,IF(D50>B50,C50&A50,\"/\"))","v":"AAAF"},null,{"$f":"A50&C50","v":"AAAF"},{"$f":"E50","v":3},{"$f":"C50&A50","v":"AFAA"},{"$f":"F50","v":1},{"$f":"B50","v":36},{"$f":"D50","v":0}]
["AD",34,"AH",{"$f":"IF(G51=19,19,IF(ISBLANK(B51),\"\",IF(B51=19,0,36-B51)))","v":2},{"$f":"IF(G51=19,0,IF(ISBLANK(B51),\"\",IF(B51<18,1,IF(B51=18,2,IF(B51>18,3)))))","v":3},{"$f":"IF(G51=19,3,IF(ISBLANK(B51),\"\",IF(B51=19,0,IF(D51<18,1,IF(D51=18,2,IF(D51>=20,3))))))","v":1},null,null,null,null,null,{"$f":"IF(B51>D51,A51&C51,IF(D51>B51,C51&A51,\"/\"))","v":"ADAH"},null,{"$f":"A51&C51","v":"ADAH"},{"$f":"E51","v":3},{"$f":"C51&A51","v":"AHAD"},{"$f":"F51","v":1},{"$f":"B51","v":34},{"$f":"D51","v":2}]
["AB",24,"AG",{"$f":"IF(G52=19,19,IF(ISBLANK(B52),\"\",IF(B52=19,0,36-B52)))","v":12},{"$f":"IF(G52=19,0,IF(ISBLANK(B52),\"\",IF(B52<18,1,IF(B52=18,2,IF(B52>18,3)))))","v":3},{"$f":"IF(G52=19,3,IF(ISBLANK(B52),\"\",IF(B52=19,0,IF(D52<18,1,IF(D52=18,2,IF(D52>=20,3))))))","v":1},null,null,null,null,null,{"$f":"IF(B52>D52,A52&C52,IF(D52>B52,C52&A52,\"/\"))","v":"ABAG"},null,{"$f":"A52&C52","v":"ABAG"},{"$f":"E52","v":3},{"$f":"C52&A52","v":"AGAB"},{"$f":"F52","v":1},{"$f":"B52","v":24},{"$f":"D52","v":12}]
["AC",20,"AE",{"$f":"IF(G53=19,19,IF(ISBLANK(B53),\"\",IF(B53=19,0,36-B53)))","v":16},{"$f":"IF(G53=19,0,IF(ISBLANK(B53),\"\",IF(B53<18,1,IF(B53=18,2,IF(B53>18,3)))))","v":3},{"$f":"IF(G53=19,3,IF(ISBLANK(B53),\"\",IF(B53=19,0,IF(D53<18,1,IF(D53=18,2,IF(D53>=20,3))))))","v":1},null,null,null,null,null,{"$f":"IF(B53>D53,A53&C53,IF(D53>B53,C53&A53,\"/\"))","v":"ACAE"},null,{"$f":"A53&C53","v":"ACAE"},{"$f":"E53","v":3},{"$f":"C53&A53","v":"AEAC"},{"$f":"F53","v":1},{"$f":"B53","v":20},{"$f":"D53","v":16}]
[]
["6 éme MATCH le ","à","AF"]
[null,null,null,null,null,null,"SI forfait éq recevante"]
["Equipes","score","Equipes","score","Points","Points"]
["AB",12,"AD",{"$f":"IF(G58=19,19,IF(ISBLANK(B58),\"\",IF(B58=19,0,36-B58)))","v":24},{"$f":"IF(G58=19,0,IF(ISBLANK(B58),\"\",IF(B58<18,1,IF(B58=18,2,IF(B58>18,3)))))","v":1},{"$f":"IF(G58=19,3,IF(ISBLANK(B58),\"\",IF(B58=19,0,IF(D58<18,1,IF(D58=18,2,IF(D58>=20,3))))))","v":3},null,null,null,null,null,{"$f":"IF(B58>D58,A58&C58,IF(D58>B58,C58&A58,\"/\"))","v":"ADAB"},null,{"$f":"A58&C58","v":"ABAD"},{"$f":"E58","v":1},{"$f":"C58&A58","v":"ADAB"},{"$f":"F58","v":3},{"$f":"B58","v":12},{"$f":"D58","v":24}]
["AE",24,"AA",{"$f":"IF(G59=19,19,IF(ISBLANK(B59),\"\",IF(B59=19,0,36-B59)))","v":12},{"$f":"IF(G59=19,0,IF(ISBLANK(B59),\"\",IF(B59<18,1,IF(B59=18,2,IF(B59>18,3)))))","v":3},{"$f":"IF(G59=19,3,IF(ISBLANK(B59),\"\",IF(B59=19,0,IF(D59<18,1,IF(D59=18,2,IF(D59>=20,3))))))","v":1},null,null,null,null,null,{"$f":"IF(B59>D59,A59&C59,IF(D59>B59,C59&A59,\"/\"))","v":"AEAA"},null,{"$f":"A59&C59","v":"AEAA"},{"$f":"E59","v":3},{"$f":"C59&A59","v":"AAAE"},{"$f":"F59","v":1},{"$f":"B59","v":24},{"$f":"D59","v":12}]
["AG",32,"AC",{"$f":"IF(G60=19,19,IF(ISBLANK(B60),\"\",IF(B60=19,0,36-B60)))","v":4},{"$f":"IF(G60=19,0,IF(ISBLANK(B60),\"\",IF(B60<18,1,IF(B60=18,2,IF(B60>18,3)))))","v":3},{"$f":"IF(G60=19,3,IF(ISBLANK(B60),\"\",IF(B60=19,0,IF(D60<18,1,IF(D60=18,2,IF(D60>=20,3))))))","v":1},null,null,null,null,null,{"$f":"IF(B60>D60,A60&C60,IF(D60>B60,C60&A60,\"/\"))","v":"AGAC"},null,{"$f":"A60&C60","v":"AGAC"},{"$f":"E60","v":3},{"$f":"C60&A60","v":"ACAG"},{"$f":"F60","v":1},{"$f":"B60","v":32},{"$f":"D60","v":4}]
["AF",22,"AH",{"$f":"IF(G61=19,19,IF(ISBLANK(B61),\"\",IF(B61=19,0,36-B61)))","v":14},{"$f":"IF(G61=19,0,IF(ISBLANK(B61),\"\",IF(B61<18,1,IF(B61=18,2,IF(B61>18,3)))))","v":3},{"$f":"IF(G61=19,3,IF(ISBLANK(B61),\"\",IF(B61=19,0,IF(D61<18,1,IF(D61=18,2,IF(D61>=20,3))))))","v":1},null,null,null,null,null,{"$f":"IF(B61>D61,A61&C61,IF(D61>B61,C61&A61,\"/\"))","v":"AFAH"},null,{"$f":"A61&C61","v":"AFAH"},{"$f":"E61","v":3},{"$f":"C61&A61","v":"AHAF"},{"$f":"F61","v":1},{"$f":"B61","v":22},{"$f":"D61","v":14}]
[]
["7 éme MATCH le","à","AG"]
[null,null,null,null,null,null,"SI forfait éq recevante",null," "]
["Equipes","score","Equipes","score","Points","Points"]
["AA",16,"AG",{"$f":"IF(G66=19,19,IF(ISBLANK(B66),\"\",IF(B66=19,0,36-B66)))","v":20},{"$f":"IF(G66=19,0,IF(ISBLANK(B66),\"\",IF(B66<18,1,IF(B66=18,2,IF(B66>18,3)))))","v":1},{"$f":"IF(G66=19,3,IF(ISBLANK(B66),\"\",IF(B66=19,0,IF(D66<18,1,IF(D66=18,2,IF(D66>=20,3))))))","v":3},null,null,null,null,null,{"$f":"IF(B66>D66,A66&C66,IF(D66>B66,C66&A66,\"/\"))","v":"AGAA"},null,{"$f":"A66&C66","v":"AAAG"},{"$f":"E66","v":1},{"$f":"C66&A66","v":"AGAA"},{"$f":"F66","v":3},{"$f":"B66","v":16},{"$f":"D66","v":20}]
["AB",26,"AF",{"$f":"IF(G67=19,19,IF(ISBLANK(B67),\"\",IF(B67=19,0,36-B67)))","v":10},{"$f":"IF(G67=19,0,IF(ISBLANK(B67),\"\",IF(B67<18,1,IF(B67=18,2,IF(B67>18,3)))))","v":3},{"$f":"IF(G67=19,3,IF(ISBLANK(B67),\"\",IF(B67=19,0,IF(D67<18,1,IF(D67=18,2,IF(D67>=20,3))))))","v":1},null,null,null,null,null,{"$f":"IF(B67>D67,A67&C67,IF(D67>B67,C67&A67,\"/\"))","v":"ABAF"},null,{"$f":"A67&C67","v":"ABAF"},{"$f":"E67","v":3},{"$f":"C67&A67","v":"AFAB"},{"$f":"F67","v":1},{"$f":"B67","v":26},{"$f":"D67","v":10}]
["AE",20,"AD",{"$f":"IF(G68=19,19,IF(ISBLANK(B68),\"\",IF(B68=19,0,36-B68)))","v":16},{"$f":"IF(G68=19,0,IF(ISBLANK(B68),\"\",IF(B68<18,1,IF(B68=18,2,IF(B68>18,3)))))","v":3},{"$f":"IF(G68=19,3,IF(ISBLANK(B68),\"\",IF(B68=19,0,IF(D68<18,1,IF(D68=18,2,IF(D68>=20,3))))))","v":1},null,null,null,null,null,{"$f":"IF(B68>D68,A68&C68,IF(D68>B68,C68&A68,\"/\"))","v":"AEAD"},null,{"$f":"A68&C68","v":"AEAD"},{"$f":"E68","v":3},{"$f":"C68&A68","v":"ADAE"},{"$f":"F68","v":1},{"$f":"B68","v":20},{"$f":"D68","v":16}]
["AC",22,"AH",{"$f":"IF(G69=19,19,IF(ISBLANK(B69),\"\",IF(B69=19,0,36-B69)))","v":14},{"$f":"IF(G69=19,0,IF(ISBLANK(B69),\"\",IF(B69<18,1,IF(B69=18,2,IF(B69>18,3)))))","v":3},{"$f":"IF(G69=19,3,IF(ISBLANK(B69),\"\",IF(B69=19,0,IF(D69<18,1,IF(D69=18,2,IF(D69>=20,3))))))","v":1},null,null,null,null,null,{"$f":"IF(B69>D69,A69&C69,IF(D69>B69,C69&A69,\"/\"))","v":"ACAH"},null,{"$f":"A69&C69","v":"ACAH"},{"$f":"E69","v":3},{"$f":"C69&A69","v":"AHAC"},{"$f":"F69","v":1},{"$f":"B69","v":22},{"$f":"D69","v":14}]
[null,null,"Si pas d'exaequo",null,null,null,"Classt        Final","Rencontres entre exaequos"]
["EQUIPES",null,"POINTS","POUR","CONTRE","DIFF",null,"POINTS Exaequos","Exaq","n°","AA","AB","AC","AD","AE","AF","AG","AH","Pts matchs",null,null,null,"1000000*Pts matchs +1000 (Diff +  abs(diff mini) )+Pour ","RANG","DIFF Exaequos","POUR Exaequos"]
["AB","1B",17,162,90,72,1,{"$f":"IF(S72>0,S72,\"\")","v":4},{"$f":"COUNTIF($C$72:$C$79,C72)","v":3},{"$f":"IF(AND(I72>1,COUNTIFS(I$72:I72,I72,C$72:C72,C72)=1),MAX(J$71:J71)+1,\"\")","v":1},{"$f":"IF($A72=K$71,\"\",IF(INDEX($C$72:$C$79,MATCH(K$71,$A$72:$A$79,0))=$C72,IFERROR(VLOOKUP($A72&K$71,$N$18:$O$69,2,0),  VLOOKUP(K$71&$A72,$N$18:$Q$69,4,0)),          \"\"))","v":1},"","","",3,"","","",{"$f":"SUM(K72:R72)","v":4},null,null,null,{"$f":"IF(I72<3,S72*1000000+(F72+ABS(MIN($F$72:$F$79)))*1000+D72,S72*1000000+U96*1000+Z72)","v":4036042},{"$f":"IF(I72>2,RANK(W72,OFFSET(W$71,MATCH(I72,$I$72:$I$79,0),,I72)))","v":1},{"$f":"IF(S96=0,\"\",S96)","v":12},{"$f":"IF(S80=0,\"\",S80)","v":42}]
["AE","1E",17,140,112,28,2,4,3,{"$f":"IF(AND(I73>1,COUNTIFS(I$72:I73,I73,C$72:C73,C73)=1),MAX(J$71:J72)+1,\"\")","v":""},3,1,"","","","","","",{"$f":"SUM(K73:R73)","v":4},null,null,null,{"$f":"IF(I73<3,S73*1000000+(F73+ABS(MIN($F$72:$F$79)))*1000+D73,S73*1000000+U97*1000+Z73)","v":4020034},{"$f":"IF(I73>2,RANK(W73,OFFSET(W$71,MATCH(I73,$I$72:$I$79,0),,I73)))","v":2},-4,34]
["AA","1A",17,148,104,44,3,4,3,{"$f":"IF(AND(I74>1,COUNTIFS(I$72:I74,I74,C$72:C74,C74)=1),MAX(J$71:J73)+1,\"\")","v":""},"",3,"","",1,"","","",4,null,null,null,4016032,3,-8,32]
["AC","1C",15,112,140,-28,4,3,2,{"$f":"IF(AND(I75>1,COUNTIFS(I$72:I75,I75,C$72:C75,C75)=1),MAX(J$71:J74)+1,\"\")","v":2},"","","",3,"","","","",3,null,null,null,3068112,false,24,30]
["AD","1D",15,154,98,56,5,1,2,{"$f":"IF(AND(I76>1,COUNTIFS(I$72:I76,I76,C$72:C76,C76)=1),MAX(J$71:J75)+1,\"\")","v":""},"","",1,"","","","","",1,null,null,null,1152154,false,-24,6]
["AG","1G",13,120,132,-12,6,"",1,{"$f":"IF(AND(I77>1,COUNTIFS(I$72:I77,I77,C$72:C77,C77)=1),MAX(J$71:J76)+1,\"\")","v":""},"","","","","","","","",0,null,null,null,84120,false,"",""]
["AF","1F",11,94,158,-64,7,"",1,{"$f":"IF(AND(I78>1,COUNTIFS(I$72:I78,I78,C$72:C78,C78)=1),MAX(J$71:J77)+1,\"\")","v":""},"","","","","","","","",0,null,null,null,32094,false,"",""]
["AH","1H",7,78,174,-96,8,"",1,{"$f":"IF(AND(I79>1,COUNTIFS(I$72:I79,I79,C$72:C79,C79)=1),MAX(J$71:J78)+1,\"\")","v":""},"","","","","","","","",0,null,null,null,78,false,"",""]
[null,null,null,null,null,null,null,null,"POUR",{"$f":"A72","v":"AB"},{"$f":"IF($A72=K$71,\"\",IF(INDEX($C$72:$C$79,MATCH(K$71,$A$72:$A$79,0))=$C72,IFERROR(VLOOKUP($A72&K$71,$N$18:$R$69,5,0),  VLOOKUP(K$71&$A72,$N$18:$S$69,6,0)),          \"\"))","v":16},"","","",26,"","","",42]
[null,null,null,null,null,null,null,null,null,"AE",24,10,"","","","","","",34]
[null,null,null,null,null,null,null,null,null,"AA","",20,"","",12,"","","",32]
[null,null,null,null,null,null,null,null,null,"AC","","","",30,"","","","",30]
[null,null,null,null,null,null,null,null,null,"AD","","",6,"","","","","",6,null,null,null,null,null,"  "]
[null,null,null,null,null,null,null,null,null,"AG","","","","","","","","",0]
[null,null,null,null,null,null,null,null,null,"AF","","","","","","","","",0]
[null,null,null,null,null,null,null,null,null,"AH","","","","","","","","",0]
[null,null,null,null,null,null,null,null,"CONTRE",{"$f":"J80","v":"AB"},{"$f":"INDEX($K$80:$R$87,MATCH(K$71,$J$80:$J$87,0),MATCH($J80,$K$71:$R$71,0))","v":20},{"$f":"INDEX($K$80:$R$87,MATCH(L$71,$J$80:$J$87,0),MATCH($J80,$K$71:$R$71,0))","v":""},"","",10,"","","",30]
[null,null,null,null,null,null,null,null,null,{"$f":"J81","v":"AE"},{"$f":"INDEX($K$80:$R$87,MATCH(K$71,$J$80:$J$87,0),MATCH($J81,$K$71:$R$71,0))","v":12},26,"","","","","","",38]
[null,null,null,null,null,null,null,null,null,"AA","",16,"","",24,"","","",40]
[null,null,null,null,null,null,null,null,null,"AC","","","",6,"","","","",6]
[null,null,null,null,null,null,null,null,null,"AD","","",30,"","","","","",30]
[null,null,null,null,null,null,null,null,null,"AG","","","","","","","","",0]
[null,null,null,null,null,null,null,null,null,"AF","","","","","","","","",0]
[null,null,null,null,null,null,null,null,null,"AH","","","","","","","","",0,null,"Diff pondérée"]
[null,null,null,null,null,null,null,null,"DIFF",{"$f":"J88","v":"AB"},null,null,null,null,null,null,null,null,{"$f":"S80-S88","v":12},null,{"$f":"S96+ABS(MIN($S$96:$S$103))","v":36}]
[null,null,null,null,null,null,null,null,null,{"$f":"J89","v":"AE"},null,null,null,null,null,null,null,null,{"$f":"S81-S89","v":-4},null,20]
[null,null,null,null,null,null,null,null,null,"AA",null,null,null,null,null,null,null,null,-8,null,16]
[null,null,null,null,null,null,null,null,null,"AC",null,null,null,null,null,null,null,null,24,null,48]
[null,null,null,null,null,null,null,null,null,"AD",null,null,null,null,null,null,null,null,-24,null,0]
[null,null,null,null,null,null,null,null,null,"AG",null,null,null,null,null,null,null,null,0,null,24]
[null,null,null,null,null,null,null,null,null,"AF",null,null,null,null,null,null,null,null,0,null,{"$f":"S102+ABS(MIN($S$96:$S$103))","v":24}]
[null,null,null,null,null,null,null,null,null,"AH",null,null,null,null,null,null,null,null,0,null,{"$f":"S103+ABS(MIN($S$96:$S$103))","v":24}]

{"sheet":"P2","index":1,"n_rows":103,"n_cols":26,"rows_kept":103,"cut":false,"hidden":false,"merged":[[0,0,0,5],[1,0,1,5],[2,0,2,5],[3,0,3,5],[3,8,3,10],[15,6,16,6],[69,2,69,5],[69,6,70,6],[69,7,69,25],[23,6,24,6],[31,6,32,6],[39,6,40,6],[47,6,48,6],[55,6,56,6],[63,6,64,6]]}
[null,null,null,null,null,null,3]
["CHAMPIONNAT DES CLUBS"]
[]
["POULE 1"]
["EQUIPES",null,"POINTS","Pour","Contre","Diff"]
["AA","1A",{"$f":"SUMIF($A$18:$A$69,A6,$E$18:$E$69)+SUMIF($C$18:$C$69,A6,$F$18:$F$69)","v":17},{"$f":"SUMIF($A$18:$A$69,$A6,$B$18:$B$69)+SUMIF($C$18:$C$69,$A6,$D$18:$D$69)","v":134},{"$f":"SUMIF($C$18:$C$69,$A6,$B$18:$B$69)+SUMIF($A$18:$A$69,$A6,$D$18:$D$69)","v":118},{"$f":"D6-E6","v":16}]
["AB","1B",{"$f":"SUMIF($A$18:$A$69,A7,$E$18:$E$69)+SUMIF($C$18:$C$69,A7,$F$18:$F$69)","v":12},{"$f":"SUMIF($A$18:$A$69,$A7,$B$18:$B$69)+SUMIF($C$18:$C$69,$A7,$D$18:$D$69)","v":102},{"$f":"SUMIF($C$18:$C$69,$A7,$B$18:$B$69)+SUMIF($A$18:$A$69,$A7,$D$18:$D$69)","v":150},-48]
["AC","1C",{"$f":"SUMIF($A$18:$A$69,A8,$E$18:$E$69)+SUMIF($C$18:$C$69,A8,$F$18:$F$69)","v":17},152,100,52]
["AD","1D",10,86,166,-80]
["AE","1E",18,158,94,64]
["AF","1F",16,144,108,36]
["AG","1G",12,120,132,{"$f":"D12-E12","v":-12}]
["AH","1H",10,{"$f":"SUMIF($A$18:$A$69,$A13,$B$18:$B$69)+SUMIF($C$18:$C$69,$A13,$D$18:$D$69)","v":112},140,{"$f":"D13-E13","v":-28}]
[]
["1er MATCH le ","à","AA"]
[null,null,null,null,null,null,"SI forfait éq recevante"]
["Equipes","score","Equipes","score","Points","Points"]
["AA",16,"AB",{"$f":"IF(G18=19,19,IF(ISBLANK(B18),\"\",IF(B18=19,0,36-B18)))","v":20},{"$f":"IF(G18=19,0,IF(ISBLANK(B18),\"\",IF(B18<18,1,IF(B18=18,2,IF(B18>18,3)))))","v":1},{"$f":"IF(G18=19,3,IF(ISBLANK(B18),\"\",IF(B18=19,0,IF(D18<18,1,IF(D18=18,2,IF(D18>=20,3))))))","v":3},null,null,null,null,null,{"$f":"IF(B18>D18,A18&C18,IF(D18>B18,C18&A18,\"/\"))","v":"ABAA"},null,{"$f":"A18&C18","v":"AAAB"},{"$f":"E18","v":1},{"$f":"C18&A18","v":"ABAA"},{"$f":"F18","v":3},{"$f":"B18","v":16},{"$f":"D18","v":20}]
["AC",30,"AD",{"$f":"IF(G19=19,19,IF(ISBLANK(B19),\"\",IF(B19=19,0,36-B19)))","v":6},{"$f":"IF(G19=19,0,IF(ISBLANK(B19),\"\",IF(B19<18,1,IF(B19=18,2,IF(B19>18,3)))))","v":3},{"$f":"IF(G19=19,3,IF(ISBLANK(B19),\"\",IF(B19=19,0,IF(D19<18,1,IF(D19=18,2,IF(D19>=20,3))))))","v":1},null,null,null,null,null,{"$f":"IF(B19>D19,A19&C19,IF(D19>B19,C19&A19,\"/\"))","v":"ACAD"},null,{"$f":"A19&C19","v":"ACAD"},{"$f":"E19","v":3},{"$f":"C19&A19","v":"ADAC"},{"$f":"F19","v":1},{"$f":"B19","v":30},{"$f":"D19","v":6}]
["AE",16,"AF",{"$f":"IF(G20=19,19,IF(ISBLANK(B20),\"\",IF(B20=19,0,36-B20)))","v":20},{"$f":"IF(G20=19,0,IF(ISBLANK(B20),\"\",IF(B20<18,1,IF(B20=18,2,IF(B20>18,3)))))","v":1},{"$f":"IF(G20=19,3,IF(ISBLANK(B20),\"\",IF(B20=19,0,IF(D20<18,1,IF(D20=18,2,IF(D20>=20,3))))))","v":3},null,null,null,null,null,{"$f":"IF(B20>D20,A20&C20,IF(D20>B20,C20&A20,\"/\"))","v":"AFAE"},null,{"$f":"A20&C20","v":"AEAF"},{"$f":"E20","v":1},{"$f":"C20&A20","v":"AFAE"},{"$f":"F20","v":3},{"$f":"B20","v":16},{"$f":"D20","v":20}]
["AG",18,"AH",{"$f":"IF(G21=19,19,IF(ISBLANK(B21),\"\",IF(B21=19,0,36-B21)))","v":18},{"$f":"IF(G21=19,0,IF(ISBLANK(B21),\"\",IF(B21<18,1,IF(B21=18,2,IF(B21>18,3)))))","v":2},{"$f":"IF(G21=19,3,IF(ISBLANK(B21),\"\",IF(B21=19,0,IF(D21<18,1,IF(D21=18,2,IF(D21>=20,3))))))","v":2},null,null,null,null,null,{"$f":"IF(B21>D21,A21&C21,IF(D21>B21,C21&A21,\"/\"))","v":"/"},null,{"$f":"A21&C21","v":"AGAH"},{"$f":"E21","v":2},{"$f":"C21&A21","v":"AHAG"},{"$f":"F21","v":2},{"$f":"B21","v":18},{"$f":"D21","v":18}]
[]
["2 éme MATCH le ","à","AB"]
[null,null,null,null,null,null,"SI forfait éq recevante"]
["Equipes","score","Equipes","score","Points","Points"]
["AA",18,"AC",{"$f":"IF(G26=19,19,IF(ISBLANK(B26),\"\",IF(B26=19,0,36-B26)))","v":18},{"$f":"IF(G26=19,0,IF(ISBLANK(B26),\"\",IF(B26<18,1,IF(B26=18,2,IF(B26>18,3)))))","v":2},{"$f":"IF(G26=19,3,IF(ISBLANK(B26),\"\",IF(B26=19,0,IF(D26<18,1,IF(D26=18,2,IF(D26>=20,3))))))","v":2},null,null,null,null,null,{"$f":"IF(B26>D26,A26&C26,IF(D26>B26,C26&A26,\"/\"))","v":"/"},null,{"$f":"A26&C26","v":"AAAC"},{"$f":"E26","v":2},{"$f":"C26&A26","v":"ACAA"},{"$f":"F26","v":2},{"$f":"B26","v":18},{"$f":"D26","v":18}]
["AB",18,"AH",{"$f":"IF(G27=19,19,IF(ISBLANK(B27),\"\",IF(B27=19,0,36-B27)))","v":18},{"$f":"IF(G27=19,0,IF(ISBLANK(B27),\"\",IF(B27<18,1,IF(B27=18,2,IF(B27>18,3)))))","v":2},{"$f":"IF(G27=19,3,IF(ISBLANK(B27),\"\",IF(B27=19,0,IF(D27<18,1,IF(D27=18,2,IF(D27>=20,3))))))","v":2},null,null,null,null,null,{"$f":"IF(B27>D27,A27&C27,IF(D27>B27,C27&A27,\"/\"))","v":"/"},null,{"$f":"A27&C27","v":"ABAH"},{"$f":"E27","v":2},{"$f":"C27&A27","v":"AHAB"},{"$f":"F27","v":2},{"$f":"B27","v":18},{"$f":"D27","v":18}]
["AD",18,"AF",{"$f":"IF(G28=19,19,IF(ISBLANK(B28),\"\",IF(B28=19,0,36-B28)))","v":18},{"$f":"IF(G28=19,0,IF(ISBLANK(B28),\"\",IF(B28<18,1,IF(B28=18,2,IF(B28>18,3)))))","v":2},{"$f":"IF(G28=19,3,IF(ISBLANK(B28),\"\",IF(B28=19,0,IF(D28<18,1,IF(D28=18,2,IF(D28>=20,3))))))","v":2},null,null,null,null,null,{"$f":"IF(B28>D28,A28&C28,IF(D28>B28,C28&A28,\"/\"))","v":"/"},null,{"$f":"A28&C28","v":"ADAF"},{"$f":"E28","v":2},{"$f":"C28&A28","v":"AFAD"},{"$f":"F28","v":2},{"$f":"B28","v":18},{"$f":"D28","v":18}]
["AE",28,"AG",{"$f":"IF(G29=19,19,IF(ISBLANK(B29),\"\",IF(B29=19,0,36-B29)))","v":8},{"$f":"IF(G29=19,0,IF(ISBLANK(B29),\"\",IF(B29<18,1,IF(B29=18,2,IF(B29>18,3)))))","v":3},{"$f":"IF(G29=19,3,IF(ISBLANK(B29),\"\",IF(B29=19,0,IF(D29<18,1,IF(D29=18,2,IF(D29>=20,3))))))","v":1},null,null,null,null,null,{"$f":"IF(B29>D29,A29&C29,IF(D29>B29,C29&A29,\"/\"))","v":"AEAG"},null,{"$f":"A29&C29","v":"AEAG"},{"$f":"E29","v":3},{"$f":"C29&A29","v":"AGAE"},{"$f":"F29","v":1},{"$f":"B29","v":28},{"$f":"D29","v":8}]
[]
["3 éme MATCH le ","à","AC"]
[null,null,null,null,null,null,"SI forfait éq recevante"]
["Equipes","score","Equipes","score","Points","Points"]
["AA",20,"AH",{"$f":"IF(G34=19,19,IF(ISBLANK(B34),\"\",IF(B34=19,0,36-B34)))","v":16},{"$f":"IF(G34=19,0,IF(ISBLANK(B34),\"\",IF(B34<18,1,IF(B34=18,2,IF(B34>18,3)))))","v":3},{"$f":"IF(G34=19,3,IF(ISBLANK(B34),\"\",IF(B34=19,0,IF(D34<18,1,IF(D34=18,2,IF(D34>=20,3))))))","v":1},null,null,null,null,null,{"$f":"IF(B34>D34,A34&C34,IF(D34>B34,C34&A34,\"/\"))","v":"AAAH"},null,{"$f":"A34&C34","v":"AAAH"},{"$f":"E34","v":3},{"$f":"C34&A34","v":"AHAA"},{"$f":"F34","v":1},{"$f":"B34","v":20},{"$f":"D34","v":16}]
["AB",10,"AE",{"$f":"IF(G35=19,19,IF(ISBLANK(B35),\"\",IF(B35=19,0,36-B35)))","v":26},{"$f":"IF(G35=19,0,IF(ISBLANK(B35),\"\",IF(B35<18,1,IF(B35=18,2,IF(B35>18,3)))))","v":1},{"$f":"IF(G35=19,3,IF(ISBLANK(B35),\"\",IF(B35=19,0,IF(D35<18,1,IF(D35=18,2,IF(D35>=20,3))))))","v":3},null,null,null,null,null,{"$f":"IF(B35>D35,A35&C35,IF(D35>B35,C35&A35,\"/\"))","v":"AEAB"},null,{"$f":"A35&C35","v":"ABAE"},{"$f":"E35","v":1},{"$f":"C35&A35","v":"AEAB"},{"$f":"F35","v":3},{"$f":"B35","v":10},{"$f":"D35","v":26}]
["AC",20,"AF",{"$f":"IF(G36=19,19,IF(ISBLANK(B36),\"\",IF(B36=19,0,36-B36)))","v":16},{"$f":"IF(G36=19,0,IF(ISBLANK(B36),\"\",IF(B36<18,1,IF(B36=18,2,IF(B36>18,3)))))","v":3},{"$f":"IF(G36=19,3,IF(ISBLANK(B36),\"\",IF(B36=19,0,IF(D36<18,1,IF(D36=18,2,IF(D36>=20,3))))))","v":1},null,null,null,null,null,{"$f":"IF(B36>D36,A36&C36,IF(D36>B36,C36&A36,\"/\"))","v":"ACAF"},null,{"$f":"A36&C36","v":"ACAF"},{"$f":"E36","v":3},{"$f":"C36&A36","v":"AFAC"},{"$f":"F36","v":1},{"$f":"B36","v":20},{"$f":"D36","v":16}]
["AD",6,"AG",{"$f":"IF(G37=19,19,IF(ISBLANK(B37),\"\",IF(B37=19,0,36-B37)))","v":30},{"$f":"IF(G37=19,0,IF(ISBLANK(B37),\"\",IF(B37<18,1,IF(B37=18,2,IF(B37>18,3)))))","v":1},{"$f":"IF(G37=19,3,IF(ISBLANK(B37),\"\",IF(B37=19,0,IF(D37<18,1,IF(D37=18,2,IF(D37>=20,3))))))","v":3},null,null,null,null,null,{"$f":"IF(B37>D37,A37&C37,IF(D37>B37,C37&A37,\"/\"))","v":"AGAD"},null,{"$f":"A37&C37","v":"ADAG"},{"$f":"E37","v":1},{"$f":"C37&A37","v":"AGAD"},{"$f":"F37","v":3},{"$f":"B37","v":6},{"$f":"D37","v":30}]
[]
["4 éme MATCH le ","à","AD"]
[null,null,null,null,null,null,"SI forfait éq recevante"]
["Equipes","score","Equipes","score","Points","Points"]
["AA",20,"AD",{"$f":"IF(G42=19,19,IF(ISBLANK(B42),\"\",IF(B42=19,0,36-B42)))","v":16},{"$f":"IF(G42=19,0,IF(ISBLANK(B42),\"\",IF(B42<18,1,IF(B42=18,2,IF(B42>18,3)))))","v":3},{"$f":"IF(G42=19,3,IF(ISBLANK(B42),\"\",IF(B42=19,0,IF(D42<18,1,IF(D42=18,2,IF(D42>=20,3))))))","v":1},null,null,null,null,null,{"$f":"IF(B42>D42,A42&C42,IF(D42>B42,C42&A42,\"/\"))","v":"AAAD"},null,{"$f":"A42&C42","v":"AAAD"},{"$f":"E42","v":3},{"$f":"C42&A42","v":"ADAA"},{"$f":"F42","v":1},{"$f":"B42","v":20},{"$f":"D42","v":16}]
["AF",30,"AG",{"$f":"IF(G43=19,19,IF(ISBLANK(B43),\"\",IF(B43=19,0,36-B43)))","v":6},{"$f":"IF(G43=19,0,IF(ISBLANK(B43),\"\",IF(B43<18,1,IF(B43=18,2,IF(B43>18,3)))))","v":3},{"$f":"IF(G43=19,3,IF(ISBLANK(B43),\"\",IF(B43=19,0,IF(D43<18,1,IF(D43=18,2,IF(D43>=20,3))))))","v":1},null,null,null,null,null,{"$f":"IF(B43>D43,A43&C43,IF(D43>B43,C43&A43,\"/\"))","v":"AFAG"},null,{"$f":"A43&C43","v":"AFAG"},{"$f":"E43","v":3},{"$f":"C43&A43","v":"AGAF"},{"$f":"F43","v":1},{"$f":"B43","v":30},{"$f":"D43","v":6}]
["AB",8,"AC",{"$f":"IF(G44=19,19,IF(ISBLANK(B44),\"\",IF(B44=19,0,36-B44)))","v":28},{"$f":"IF(G44=19,0,IF(ISBLANK(B44),\"\",IF(B44<18,1,IF(B44=18,2,IF(B44>18,3)))))","v":1},{"$f":"IF(G44=19,3,IF(ISBLANK(B44),\"\",IF(B44=19,0,IF(D44<18,1,IF(D44=18,2,IF(D44>=20,3))))))","v":3},null,null,null,null,null,{"$f":"IF(B44>D44,A44&C44,IF(D44>B44,C44&A44,\"/\"))","v":"ACAB"},null,{"$f":"A44&C44","v":"ABAC"},{"$f":"E44","v":1},{"$f":"C44&A44","v":"ACAB"},{"$f":"F44","v":3},{"$f":"B44","v":8},{"$f":"D44","v":28}]
["AE",20,"AH",{"$f":"IF(G45=19,19,IF(ISBLANK(B45),\"\",IF(B45=19,0,36-B45)))","v":16},{"$f":"IF(G45=19,0,IF(ISBLANK(B45),\"\",IF(B45<18,1,IF(B45=18,2,IF(B45>18,3)))))","v":3},{"$f":"IF(G45=19,3,IF(ISBLANK(B45),\"\",IF(B45=19,0,IF(D45<18,1,IF(D45=18,2,IF(D45>=20,3))))))","v":1},null,null,null,null,null,{"$f":"IF(B45>D45,A45&C45,IF(D45>B45,C45&A45,\"/\"))","v":"AEAH"},null,{"$f":"A45&C45","v":"AEAH"},{"$f":"E45","v":3},{"$f":"C45&A45","v":"AHAE"},{"$f":"F45","v":1},{"$f":"B45","v":20},{"$f":"D45","v":16}]
[]
["5 éme MATCH le ","à","AE"]
[null,null,null,null,null,null,"SI forfait éq recevante"]
["Equipes","score","Equipes","score","Points","Points"]
["AA",22,"AF",{"$f":"IF(G50=19,19,IF(ISBLANK(B50),\"\",IF(B50=19,0,36-B50)))","v":14},{"$f":"IF(G50=19,0,IF(ISBLANK(B50),\"\",IF(B50<18,1,IF(B50=18,2,IF(B50>18,3)))))","v":3},{"$f":"IF(G50=19,3,IF(ISBLANK(B50),\"\",IF(B50=19,0,IF(D50<18,1,IF(D50=18,2,IF(D50>=20,3))))))","v":1},null,null,null,null,null,{"$f":"IF(B50>D50,A50&C50,IF(D50>B50,C50&A50,\"/\"))","v":"AAAF"},null,{"$f":"A50&C50","v":"AAAF"},{"$f":"E50","v":3},{"$f":"C50&A50","v":"AFAA"},{"$f":"F50","v":1},{"$f":"B50","v":22},{"$f":"D50","v":14}]
["AD",24,"AH",{"$f":"IF(G51=19,19,IF(ISBLANK(B51),\"\",IF(B51=19,0,36-B51)))","v":12},{"$f":"IF(G51=19,0,IF(ISBLANK(B51),\"\",IF(B51<18,1,IF(B51=18,2,IF(B51>18,3)))))","v":3},{"$f":"IF(G51=19,3,IF(ISBLANK(B51),\"\",IF(B51=19,0,IF(D51<18,1,IF(D51=18,2,IF(D51>=20,3))))))","v":1},null,null,null,null,null,{"$f":"IF(B51>D51,A51&C51,IF(D51>B51,C51&A51,\"/\"))","v":"ADAH"},null,{"$f":"A51&C51","v":"ADAH"},{"$f":"E51","v":3},{"$f":"C51&A51","v":"AHAD"},{"$f":"F51","v":1},{"$f":"B51","v":24},{"$f":"D51","v":12}]
["AB",4,"AG",{"$f":"IF(G52=19,19,IF(ISBLANK(B52),\"\",IF(B52=19,0,36-B52)))","v":32},{"$f":"IF(G52=19,0,IF(ISBLANK(B52),\"\",IF(B52<18,1,IF(B52=18,2,IF(B52>18,3)))))","v":1},{"$f":"IF(G52=19,3,IF(ISBLANK(B52),\"\",IF(B52=19,0,IF(D52<18,1,IF(D52=18,2,IF(D52>=20,3))))))","v":3},null,null,null,null,null,{"$f":"IF(B52>D52,A52&C52,IF(D52>B52,C52&A52,\"/\"))","v":"AGAB"},null,{"$f":"A52&C52","v":"ABAG"},{"$f":"E52","v":1},{"$f":"C52&A52","v":"AGAB"},{"$f":"F52","v":3},{"$f":"B52","v":4},{"$f":"D52","v":32}]
["AC",12,"AE",{"$f":"IF(G53=19,19,IF(ISBLANK(B53),\"\",IF(B53=19,0,36-B53)))","v":24},{"$f":"IF(G53=19,0,IF(ISBLANK(B53),\"\",IF(B53<18,1,IF(B53=18,2,IF(B53>18,3)))))","v":1},{"$f":"IF(G53=19,3,IF(ISBLANK(B53),\"\",IF(B53=19,0,IF(D53<18,1,IF(D53=18,2,IF(D53>=20,3))))))","v":3},null,null,null,null,null,{"$f":"IF(B53>D53,A53&C53,IF(D53>B53,C53&A53,\"/\"))","v":"AEAC"},null,{"$f":"A53&C53","v":"ACAE"},{"$f":"E53","v":1},{"$f":"C53&A53","v":"AEAC"},{"$f":"F53","v":3},{"$f":"B53","v":12},{"$f":"D53","v":24}]
[]
["6 éme MATCH le ","à","AF"]
[null,null,null,null,null,null,"SI forfait éq recevante"]
["Equipes","score","Equipes","score","Points","Points"]
["AB",30,"AD",{"$f":"IF(G58=19,19,IF(ISBLANK(B58),\"\",IF(B58=19,0,36-B58)))","v":6},{"$f":"IF(G58=19,0,IF(ISBLANK(B58),\"\",IF(B58<18,1,IF(B58=18,2,IF(B58>18,3)))))","v":3},{"$f":"IF(G58=19,3,IF(ISBLANK(B58),\"\",IF(B58=19,0,IF(D58<18,1,IF(D58=18,2,IF(D58>=20,3))))))","v":1},null,null,null,null,null,{"$f":"IF(B58>D58,A58&C58,IF(D58>B58,C58&A58,\"/\"))","v":"ABAD"},null,{"$f":"A58&C58","v":"ABAD"},{"$f":"E58","v":3},{"$f":"C58&A58","v":"ADAB"},{"$f":"F58","v":1},{"$f":"B58","v":30},{"$f":"D58","v":6}]
["AE",18,"AA",{"$f":"IF(G59=19,19,IF(ISBLANK(B59),\"\",IF(B59=19,0,36-B59)))","v":18},{"$f":"IF(G59=19,0,IF(ISBLANK(B59),\"\",IF(B59<18,1,IF(B59=18,2,IF(B59>18,3)))))","v":2},{"$f":"IF(G59=19,3,IF(ISBLANK(B59),\"\",IF(B59=19,0,IF(D59<18,1,IF(D59=18,2,IF(D59>=20,3))))))","v":2},null,null,null,null,null,{"$f":"IF(B59>D59,A59&C59,IF(D59>B59,C59&A59,\"/\"))","v":"/"},null,{"$f":"A59&C59","v":"AEAA"},{"$f":"E59","v":2},{"$f":"C59&A59","v":"AAAE"},{"$f":"F59","v":2},{"$f":"B59","v":18},{"$f":"D59","v":18}]
["AG",10,"AC",{"$f":"IF(G60=19,19,IF(ISBLANK(B60),\"\",IF(B60=19,0,36-B60)))","v":26},{"$f":"IF(G60=19,0,IF(ISBLANK(B60),\"\",IF(B60<18,1,IF(B60=18,2,IF(B60>18,3)))))","v":1},{"$f":"IF(G60=19,3,IF(ISBLANK(B60),\"\",IF(B60=19,0,IF(D60<18,1,IF(D60=18,2,IF(D60>=20,3))))))","v":3},null,null,null,null,null,{"$f":"IF(B60>D60,A60&C60,IF(D60>B60,C60&A60,\"/\"))","v":"ACAG"},null,{"$f":"A60&C60","v":"AGAC"},{"$f":"E60","v":1},{"$f":"C60&A60","v":"ACAG"},{"$f":"F60","v":3},{"$f":"B60","v":10},{"$f":"D60","v":26}]
["AF",22,"AH",{"$f":"IF(G61=19,19,IF(ISBLANK(B61),\"\",IF(B61=19,0,36-B61)))","v":14},{"$f":"IF(G61=19,0,IF(ISBLANK(B61),\"\",IF(B61<18,1,IF(B61=18,2,IF(B61>18,3)))))","v":3},{"$f":"IF(G61=19,3,IF(ISBLANK(B61),\"\",IF(B61=19,0,IF(D61<18,1,IF(D61=18,2,IF(D61>=20,3))))))","v":1},null,null,null,null,null,{"$f":"IF(B61>D61,A61&C61,IF(D61>B61,C61&A61,\"/\"))","v":"AFAH"},null,{"$f":"A61&C61","v":"AFAH"},{"$f":"E61","v":3},{"$f":"C61&A61","v":"AHAF"},{"$f":"F61","v":1},{"$f":"B61","v":22},{"$f":"D61","v":14}]
[]
["7 éme MATCH le","à","AG"]
[null,null,null,null,null,null,"SI forfait éq recevante",null," "]
["Equipes","score","Equipes","score","Points","Points"]
["AA",20,"AG",{"$f":"IF(G66=19,19,IF(ISBLANK(B66),\"\",IF(B66=19,0,36-B66)))","v":16},{"$f":"IF(G66=19,0,IF(ISBLANK(B66),\"\",IF(B66<18,1,IF(B66=18,2,IF(B66>18,3)))))","v":3},{"$f":"IF(G66=19,3,IF(ISBLANK(B66),\"\",IF(B66=19,0,IF(D66<18,1,IF(D66=18,2,IF(D66>=20,3))))))","v":1},null,null,null,null,null,{"$f":"IF(B66>D66,A66&C66,IF(D66>B66,C66&A66,\"/\"))","v":"AAAG"},null,{"$f":"A66&C66","v":"AAAG"},{"$f":"E66","v":3},{"$f":"C66&A66","v":"AGAA"},{"$f":"F66","v":1},{"$f":"B66","v":20},{"$f":"D66","v":16}]
["AB",12,"AF",{"$f":"IF(G67=19,19,IF(ISBLANK(B67),\"\",IF(B67=19,0,36-B67)))","v":24},{"$f":"IF(G67=19,0,IF(ISBLANK(B67),\"\",IF(B67<18,1,IF(B67=18,2,IF(B67>18,3)))))","v":1},{"$f":"IF(G67=19,3,IF(ISBLANK(B67),\"\",IF(B67=19,0,IF(D67<18,1,IF(D67=18,2,IF(D67>=20,3))))))","v":3},null,null,null,null,null,{"$f":"IF(B67>D67,A67&C67,IF(D67>B67,C67&A67,\"/\"))","v":"AFAB"},null,{"$f":"A67&C67","v":"ABAF"},{"$f":"E67","v":1},{"$f":"C67&A67","v":"AFAB"},{"$f":"F67","v":3},{"$f":"B67","v":12},{"$f":"D67","v":24}]
["AE",26,"AD",{"$f":"IF(G68=19,19,IF(ISBLANK(B68),\"\",IF(B68=19,0,36-B68)))","v":10},{"$f":"IF(G68=19,0,IF(ISBLANK(B68),\"\",IF(B68<18,1,IF(B68=18,2,IF(B68>18,3)))))","v":3},{"$f":"IF(G68=19,3,IF(ISBLANK(B68),\"\",IF(B68=19,0,IF(D68<18,1,IF(D68=18,2,IF(D68>=20,3))))))","v":1},null,null,null,null,null,{"$f":"IF(B68>D68,A68&C68,IF(D68>B68,C68&A68,\"/\"))","v":"AEAD"},null,{"$f":"A68&C68","v":"AEAD"},{"$f":"E68","v":3},{"$f":"C68&A68","v":"ADAE"},{"$f":"F68","v":1},{"$f":"B68","v":26},{"$f":"D68","v":10}]
["AC",18,"AH",{"$f":"IF(G69=19,19,IF(ISBLANK(B69),\"\",IF(B69=19,0,36-B69)))","v":18},{"$f":"IF(G69=19,0,IF(ISBLANK(B69),\"\",IF(B69<18,1,IF(B69=18,2,IF(B69>18,3)))))","v":2},{"$f":"IF(G69=19,3,IF(ISBLANK(B69),\"\",IF(B69=19,0,IF(D69<18,1,IF(D69=18,2,IF(D69>=20,3))))))","v":2},null,null,null,null,null,{"$f":"IF(B69>D69,A69&C69,IF(D69>B69,C69&A69,\"/\"))","v":"/"},null,{"$f":"A69&C69","v":"ACAH"},{"$f":"E69","v":2},{"$f":"C69&A69","v":"AHAC"},{"$f":"F69","v":2},{"$f":"B69","v":18},{"$f":"D69","v":18}]
[null,null,"Si pas d'exaequo",null,null,null,"Classt        Final","Rencontres entre exaequos"]
["EQUIPES",null,"POINTS","POUR","CONTRE","DIFF",null,"POINTS Exaequos","Exaq","n°","AA","AB","AC","AD","AE","AF","AG","AH","Pts matchs",null,null,null,"1000000*Pts matchs +1000 (Diff +  abs(diff mini) )+Pour ","RANG","DIFF Exaequos","POUR Exaequos"]
["AE","1E",18,158,94,64,1,{"$f":"IF(S72>0,S72,\"\")","v":""},{"$f":"COUNTIF($C$72:$C$79,C72)","v":1},{"$f":"IF(AND(I72>1,COUNTIFS(I$72:I72,I72,C$72:C72,C72)=1),MAX(J$71:J71)+1,\"\")","v":""},{"$f":"IF($A72=K$71,\"\",IF(INDEX($C$72:$C$79,MATCH(K$71,$A$72:$A$79,0))=$C72,IFERROR(VLOOKUP($A72&K$71,$N$18:$O$69,2,0),  VLOOKUP(K$71&$A72,$N$18:$Q$69,4,0)),          \"\"))","v":""},"","","","","","","",{"$f":"SUM(K72:R72)","v":0},null,null,null,{"$f":"IF(I72<3,S72*1000000+(F72+ABS(MIN($F$72:$F$79)))*1000+D72,S72*1000000+U96*1000+Z72)","v":144158},{"$f":"IF(I72>2,RANK(W72,OFFSET(W$71,MATCH(I72,$I$72:$I$79,0),,I72)))","v":false},{"$f":"IF(S96=0,\"\",S96)","v":""},{"$f":"IF(S80=0,\"\",S80)","v":""}]
["AC","1C",17,152,100,52,2,2,2,{"$f":"IF(AND(I73>1,COUNTIFS(I$72:I73,I73,C$72:C73,C73)=1),MAX(J$71:J72)+1,\"\")","v":1},2,"","","","","","","",{"$f":"SUM(K73:R73)","v":2},null,null,null,{"$f":"IF(I73<3,S73*1000000+(F73+ABS(MIN($F$72:$F$79)))*1000+D73,S73*1000000+U97*1000+Z73)","v":2132152},{"$f":"IF(I73>2,RANK(W73,OFFSET(W$71,MATCH(I73,$I$72:$I$79,0),,I73)))","v":false},"",18]
["AA","1A",17,134,118,16,3,2,2,{"$f":"IF(AND(I74>1,COUNTIFS(I$72:I74,I74,C$72:C74,C74)=1),MAX(J$71:J73)+1,\"\")","v":""},"","",2,"","","","","",2,null,null,null,2096134,false,"",18]
["AF","1F",16,144,108,36,4,"",1,{"$f":"IF(AND(I75>1,COUNTIFS(I$72:I75,I75,C$72:C75,C75)=1),MAX(J$71:J74)+1,\"\")","v":""},"","","","","","","","",0,null,null,null,116144,false,"",""]
["AG","1G",12,120,132,-12,5,3,2,{"$f":"IF(AND(I76>1,COUNTIFS(I$72:I76,I76,C$72:C76,C76)=1),MAX(J$71:J75)+1,\"\")","v":2},"",3,"","","","","","",3,null,null,null,3068120,false,28,32]
["AB","1B",12,102,150,-48,6,1,2,{"$f":"IF(AND(I77>1,COUNTIFS(I$72:I77,I77,C$72:C77,C77)=1),MAX(J$71:J76)+1,\"\")","v":""},"","","","","","",1,"",1,null,null,null,1032102,false,-28,4]
["AD","1D",10,86,166,-80,7,3,2,{"$f":"IF(AND(I78>1,COUNTIFS(I$72:I78,I78,C$72:C78,C78)=1),MAX(J$71:J77)+1,\"\")","v":3},"","","","","","","",3,3,null,null,null,3000086,false,12,24]
["AH","1H",10,112,140,-28,8,1,2,{"$f":"IF(AND(I79>1,COUNTIFS(I$72:I79,I79,C$72:C79,C79)=1),MAX(J$71:J78)+1,\"\")","v":""},"","","",1,"","","","",1,null,null,null,1052112,false,-12,12]
[null,null,null,null,null,null,null,null,"POUR",{"$f":"A72","v":"AE"},{"$f":"IF($A72=K$71,\"\",IF(INDEX($C$72:$C$79,MATCH(K$71,$A$72:$A$79,0))=$C72,IFERROR(VLOOKUP($A72&K$71,$N$18:$R$69,5,0),  VLOOKUP(K$71&$A72,$N$18:$S$69,6,0)),          \"\"))","v":""},"","","","","","","",0]
[null,null,null,null,null,null,null,null,null,"AC",18,"","","","","","","",18]
[null,null,null,null,null,null,null,null,null,"AA","","",18,"","","","","",18]
[null,null,null,null,null,null,null,null,null,"AF","","","","","","","","",0]
[null,null,null,null,null,null,null,null,null,"AG","",32,"","","","","","",32,null,null,null,null,null,"  "]
[null,null,null,null,null,null,null,null,null,"AB","","","","","","",4,"",4]
[null,null,null,null,null,null,null,null,null,"AD","","","","","","","",24,24]
[null,null,null,null,null,null,null,null,null,"AH","","","",12,"","","","",12]
[null,null,null,null,null,null,null,null,"CONTRE",{"$f":"J80","v":"AE"},{"$f":"INDEX($K$80:$R$87,MATCH(K$71,$J$80:$J$87,0),MATCH($J80,$K$71:$R$71,0))","v":""},{"$f":"INDEX($K$80:$R$87,MATCH(L$71,$J$80:$J$87,0),MATCH($J80,$K$71:$R$71,0))","v":""},"","","","","","",0]
[null,null,null,null,null,null,null,null,null,{"$f":"J81","v":"AC"},{"$f":"INDEX($K$80:$R$87,MATCH(K$71,$J$80:$J$87,0),MATCH($J81,$K$71:$R$71,0))","v":18},"","","","","","","",18]
[null,null,null,null,null,null,null,null,null,"AA","","",18,"","","","","",18]
[null,null,null,null,null,null,null,null,null,"AF","","","","","","","","",0]
[null,null,null,null,null,null,null,null,null,"AG","",4,"","","","","","",4]
[null,null,null,null,null,null,null,null,null,"AB","","","","","","",32,"",32]
[null,null,null,null,null,null,null,null,null,"AD","","","","","","","",12,12]
[null,null,null,null,null,null,null,null,null,"AH","","","",24,"","","","",24,null,"Diff pondérée"]
[null,null,null,null,null,null,null,null,"DIFF",{"$f":"J88","v":"AE"},null,null,null,null,null,null,null,null,{"$f":"S80-S88","v":0},null,{"$f":"S96+ABS(MIN($S$96:$S$103))","v":28}]
[null,null,null,null,null,null,null,null,null,{"$f":"J89","v":"AC"},null,null,null,null,null,null,null,null,{"$f":"S81-S89","v":0},null,28]
[null,null,null,null,null,null,null,null,null,"AA",null,null,null,null,null,null,null,null,0,null,28]
[null,null,null,null,null,null,null,null,null,"AF",null,null,null,null,null,null,null,null,0,null,28]
[null,null,null,null,null,null,null,null,null,"AG",null,null,null,null,null,null,null,null,28,null,56]
[null,null,null,null,null,null,null,null,null,"AB",null,null,null,null,null,null,null,null,-28,null,0]
[null,null,null,null,null,null,null,null,null,"AD",null,null,null,null,null,null,null,null,12,null,{"$f":"S102+ABS(MIN($S$96:$S$103))","v":40}]
[null,null,null,null,null,null,null,null,null,"AH",null,null,null,null,null,null,null,null,-12,null,{"$f":"S103+ABS(MIN($S$96:$S$103))","v":16}]

{"sheet":"P3","index":2,"n_rows":103,"n_cols":26,"rows_kept":103,"cut":false,"hidden":false,"merged":[[0,0,0,5],[1,0,1,5],[2,0,2,5],[3,0,3,5],[3,8,3,10],[15,6,16,6],[69,2,69,5],[69,6,70,6],[69,7,69,25],[23,6,24,6],[31,6,32,6],[39,6,40,6],[47,6,48,6],[55,6,56,6],[63,6,64,6]]}
[null,null,null,null,null,null,3]
["CHAMPIONNAT DES CLUBS"]
[]
["POULE 1"]
["EQUIPES",null,"POINTS","Pour","Contre","Diff"]
["AA","1A",{"$f":"SUMIF($A$18:$A$69,A6,$E$18:$E$69)+SUMIF($C$18:$C$69,A6,$F$18:$F$69)","v":14},{"$f":"SUMIF($A$18:$A$69,$A6,$B$18:$B$69)+SUMIF($C$18:$C$69,$A6,$D$18:$D$69)","v":112},{"$f":"SUMIF($C$18:$C$69,$A6,$B$18:$B$69)+SUMIF($A$18:$A$69,$A6,$D$18:$D$69)","v":140},{"$f":"D6-E6","v":-28}]
["AB","1B",{"$f":"SUMIF($A$18:$A$69,A7,$E$18:$E$69)+SUMIF($C$18:$C$69,A7,$F$18:$F$69)","v":13},{"$f":"SUMIF($A$18:$A$69,$A7,$B$18:$B$69)+SUMIF($C$18:$C$69,$A7,$D$18:$D$69)","v":110},{"$f":"SUMIF($C$18:$C$69,$A7,$B$18:$B$69)+SUMIF($A$18:$A$69,$A7,$D$18:$D$69)","v":142},-32]
["AC","1C",{"$f":"SUMIF($A$18:$A$69,A8,$E$18:$E$69)+SUMIF($C$18:$C$69,A8,$F$18:$F$69)","v":20},180,72,108]
["AD","1D",12,120,132,-12]
["AE","1E",16,148,104,44]
["AF","1F",15,128,124,4]
["AG","1G",13,116,136,{"$f":"D12-E12","v":-20}]
["AH","1H",9,{"$f":"SUMIF($A$18:$A$69,$A13,$B$18:$B$69)+SUMIF($C$18:$C$69,$A13,$D$18:$D$69)","v":94},158,{"$f":"D13-E13","v":-64}]
[]
["1er MATCH le ","à","AA"]
[null,null,null,null,null,null,"SI forfait éq recevante"]
["Equipes","score","Equipes","score","Points","Points"]
["AA",16,"AB",{"$f":"IF(G18=19,19,IF(ISBLANK(B18),\"\",IF(B18=19,0,36-B18)))","v":20},{"$f":"IF(G18=19,0,IF(ISBLANK(B18),\"\",IF(B18<18,1,IF(B18=18,2,IF(B18>18,3)))))","v":1},{"$f":"IF(G18=19,3,IF(ISBLANK(B18),\"\",IF(B18=19,0,IF(D18<18,1,IF(D18=18,2,IF(D18>=20,3))))))","v":3},null,null,null,null,null,{"$f":"IF(B18>D18,A18&C18,IF(D18>B18,C18&A18,\"/\"))","v":"ABAA"},null,{"$f":"A18&C18","v":"AAAB"},{"$f":"E18","v":1},{"$f":"C18&A18","v":"ABAA"},{"$f":"F18","v":3},{"$f":"B18","v":16},{"$f":"D18","v":20}]
["AC",30,"AD",{"$f":"IF(G19=19,19,IF(ISBLANK(B19),\"\",IF(B19=19,0,36-B19)))","v":6},{"$f":"IF(G19=19,0,IF(ISBLANK(B19),\"\",IF(B19<18,1,IF(B19=18,2,IF(B19>18,3)))))","v":3},{"$f":"IF(G19=19,3,IF(ISBLANK(B19),\"\",IF(B19=19,0,IF(D19<18,1,IF(D19=18,2,IF(D19>=20,3))))))","v":1},null,null,null,null,null,{"$f":"IF(B19>D19,A19&C19,IF(D19>B19,C19&A19,\"/\"))","v":"ACAD"},null,{"$f":"A19&C19","v":"ACAD"},{"$f":"E19","v":3},{"$f":"C19&A19","v":"ADAC"},{"$f":"F19","v":1},{"$f":"B19","v":30},{"$f":"D19","v":6}]
["AE",16,"AF",{"$f":"IF(G20=19,19,IF(ISBLANK(B20),\"\",IF(B20=19,0,36-B20)))","v":20},{"$f":"IF(G20=19,0,IF(ISBLANK(B20),\"\",IF(B20<18,1,IF(B20=18,2,IF(B20>18,3)))))","v":1},{"$f":"IF(G20=19,3,IF(ISBLANK(B20),\"\",IF(B20=19,0,IF(D20<18,1,IF(D20=18,2,IF(D20>=20,3))))))","v":3},null,null,null,null,null,{"$f":"IF(B20>D20,A20&C20,IF(D20>B20,C20&A20,\"/\"))","v":"AFAE"},null,{"$f":"A20&C20","v":"AEAF"},{"$f":"E20","v":1},{"$f":"C20&A20","v":"AFAE"},{"$f":"F20","v":3},{"$f":"B20","v":16},{"$f":"D20","v":20}]
["AG",22,"AH",{"$f":"IF(G21=19,19,IF(ISBLANK(B21),\"\",IF(B21=19,0,36-B21)))","v":14},{"$f":"IF(G21=19,0,IF(ISBLANK(B21),\"\",IF(B21<18,1,IF(B21=18,2,IF(B21>18,3)))))","v":3},{"$f":"IF(G21=19,3,IF(ISBLANK(B21),\"\",IF(B21=19,0,IF(D21<18,1,IF(D21=18,2,IF(D21>=20,3))))))","v":1},null,null,null,null,null,{"$f":"IF(B21>D21,A21&C21,IF(D21>B21,C21&A21,\"/\"))","v":"AGAH"},null,{"$f":"A21&C21","v":"AGAH"},{"$f":"E21","v":3},{"$f":"C21&A21","v":"AHAG"},{"$f":"F21","v":1},{"$f":"B21","v":22},{"$f":"D21","v":14}]
[]
["2 éme MATCH le ","à","AB"]
[null,null,null,null,null,null,"SI forfait éq recevante"]
["Equipes","score","Equipes","score","Points","Points"]
["AA",6,"AC",{"$f":"IF(G26=19,19,IF(ISBLANK(B26),\"\",IF(B26=19,0,36-B26)))","v":30},{"$f":"IF(G26=19,0,IF(ISBLANK(B26),\"\",IF(B26<18,1,IF(B26=18,2,IF(B26>18,3)))))","v":1},{"$f":"IF(G26=19,3,IF(ISBLANK(B26),\"\",IF(B26=19,0,IF(D26<18,1,IF(D26=18,2,IF(D26>=20,3))))))","v":3},null,null,null,null,null,{"$f":"IF(B26>D26,A26&C26,IF(D26>B26,C26&A26,\"/\"))","v":"ACAA"},null,{"$f":"A26&C26","v":"AAAC"},{"$f":"E26","v":1},{"$f":"C26&A26","v":"ACAA"},{"$f":"F26","v":3},{"$f":"B26","v":6},{"$f":"D26","v":30}]
["AB",24,"AH",{"$f":"IF(G27=19,19,IF(ISBLANK(B27),\"\",IF(B27=19,0,36-B27)))","v":12},{"$f":"IF(G27=19,0,IF(ISBLANK(B27),\"\",IF(B27<18,1,IF(B27=18,2,IF(B27>18,3)))))","v":3},{"$f":"IF(G27=19,3,IF(ISBLANK(B27),\"\",IF(B27=19,0,IF(D27<18,1,IF(D27=18,2,IF(D27>=20,3))))))","v":1},null,null,null,null,null,{"$f":"IF(B27>D27,A27&C27,IF(D27>B27,C27&A27,\"/\"))","v":"ABAH"},null,{"$f":"A27&C27","v":"ABAH"},{"$f":"E27","v":3},{"$f":"C27&A27","v":"AHAB"},{"$f":"F27","v":1},{"$f":"B27","v":24},{"$f":"D27","v":12}]
["AD",18,"AF",{"$f":"IF(G28=19,19,IF(ISBLANK(B28),\"\",IF(B28=19,0,36-B28)))","v":18},{"$f":"IF(G28=19,0,IF(ISBLANK(B28),\"\",IF(B28<18,1,IF(B28=18,2,IF(B28>18,3)))))","v":2},{"$f":"IF(G28=19,3,IF(ISBLANK(B28),\"\",IF(B28=19,0,IF(D28<18,1,IF(D28=18,2,IF(D28>=20,3))))))","v":2},null,null,null,null,null,{"$f":"IF(B28>D28,A28&C28,IF(D28>B28,C28&A28,\"/\"))","v":"/"},null,{"$f":"A28&C28","v":"ADAF"},{"$f":"E28","v":2},{"$f":"C28&A28","v":"AFAD"},{"$f":"F28","v":2},{"$f":"B28","v":18},{"$f":"D28","v":18}]
["AE",28,"AG",{"$f":"IF(G29=19,19,IF(ISBLANK(B29),\"\",IF(B29=19,0,36-B29)))","v":8},{"$f":"IF(G29=19,0,IF(ISBLANK(B29),\"\",IF(B29<18,1,IF(B29=18,2,IF(B29>18,3)))))","v":3},{"$f":"IF(G29=19,3,IF(ISBLANK(B29),\"\",IF(B29=19,0,IF(D29<18,1,IF(D29=18,2,IF(D29>=20,3))))))","v":1},null,null,null,null,null,{"$f":"IF(B29>D29,A29&C29,IF(D29>B29,C29&A29,\"/\"))","v":"AEAG"},null,{"$f":"A29&C29","v":"AEAG"},{"$f":"E29","v":3},{"$f":"C29&A29","v":"AGAE"},{"$f":"F29","v":1},{"$f":"B29","v":28},{"$f":"D29","v":8}]
[]
["3 éme MATCH le ","à","AC"]
[null,null,null,null,null,null,"SI forfait éq recevante"]
["Equipes","score","Equipes","score","Points","Points"]
["AA",20,"AH",{"$f":"IF(G34=19,19,IF(ISBLANK(B34),\"\",IF(B34=19,0,36-B34)))","v":16},{"$f":"IF(G34=19,0,IF(ISBLANK(B34),\"\",IF(B34<18,1,IF(B34=18,2,IF(B34>18,3)))))","v":3},{"$f":"IF(G34=19,3,IF(ISBLANK(B34),\"\",IF(B34=19,0,IF(D34<18,1,IF(D34=18,2,IF(D34>=20,3))))))","v":1},null,null,null,null,null,{"$f":"IF(B34>D34,A34&C34,IF(D34>B34,C34&A34,\"/\"))","v":"AAAH"},null,{"$f":"A34&C34","v":"AAAH"},{"$f":"E34","v":3},{"$f":"C34&A34","v":"AHAA"},{"$f":"F34","v":1},{"$f":"B34","v":20},{"$f":"D34","v":16}]
["AB",18,"AE",{"$f":"IF(G35=19,19,IF(ISBLANK(B35),\"\",IF(B35=19,0,36-B35)))","v":18},{"$f":"IF(G35=19,0,IF(ISBLANK(B35),\"\",IF(B35<18,1,IF(B35=18,2,IF(B35>18,3)))))","v":2},{"$f":"IF(G35=19,3,IF(ISBLANK(B35),\"\",IF(B35=19,0,IF(D35<18,1,IF(D35=18,2,IF(D35>=20,3))))))","v":2},null,null,null,null,null,{"$f":"IF(B35>D35,A35&C35,IF(D35>B35,C35&A35,\"/\"))","v":"/"},null,{"$f":"A35&C35","v":"ABAE"},{"$f":"E35","v":2},{"$f":"C35&A35","v":"AEAB"},{"$f":"F35","v":2},{"$f":"B35","v":18},{"$f":"D35","v":18}]
["AC",20,"AF",{"$f":"IF(G36=19,19,IF(ISBLANK(B36),\"\",IF(B36=19,0,36-B36)))","v":16},{"$f":"IF(G36=19,0,IF(ISBLANK(B36),\"\",IF(B36<18,1,IF(B36=18,2,IF(B36>18,3)))))","v":3},{"$f":"IF(G36=19,3,IF(ISBLANK(B36),\"\",IF(B36=19,0,IF(D36<18,1,IF(D36=18,2,IF(D36>=20,3))))))","v":1},null,null,null,null,null,{"$f":"IF(B36>D36,A36&C36,IF(D36>B36,C36&A36,\"/\"))","v":"ACAF"},null,{"$f":"A36&C36","v":"ACAF"},{"$f":"E36","v":3},{"$f":"C36&A36","v":"AFAC"},{"$f":"F36","v":1},{"$f":"B36","v":20},{"$f":"D36","v":16}]
["AD",32,"AG",{"$f":"IF(G37=19,19,IF(ISBLANK(B37),\"\",IF(B37=19,0,36-B37)))","v":4},{"$f":"IF(G37=19,0,IF(ISBLANK(B37),\"\",IF(B37<18,1,IF(B37=18,2,IF(B37>18,3)))))","v":3},{"$f":"IF(G37=19,3,IF(ISBLANK(B37),\"\",IF(B37=19,0,IF(D37<18,1,IF(D37=18,2,IF(D37>=20,3))))))","v":1},null,null,null,null,null,{"$f":"IF(B37>D37,A37&C37,IF(D37>B37,C37&A37,\"/\"))","v":"ADAG"},null,{"$f":"A37&C37","v":"ADAG"},{"$f":"E37","v":3},{"$f":"C37&A37","v":"AGAD"},{"$f":"F37","v":1},{"$f":"B37","v":32},{"$f":"D37","v":4}]
[]
["4 éme MATCH le ","à","AD"]
[null,null,null,null,null,null,"SI forfait éq recevante"]
["Equipes","score","Equipes","score","Points","Points"]
["AA",20,"AD",{"$f":"IF(G42=19,19,IF(ISBLANK(B42),\"\",IF(B42=19,0,36-B42)))","v":16},{"$f":"IF(G42=19,0,IF(ISBLANK(B42),\"\",IF(B42<18,1,IF(B42=18,2,IF(B42>18,3)))))","v":3},{"$f":"IF(G42=19,3,IF(ISBLANK(B42),\"\",IF(B42=19,0,IF(D42<18,1,IF(D42=18,2,IF(D42>=20,3))))))","v":1},null,null,null,null,null,{"$f":"IF(B42>D42,A42&C42,IF(D42>B42,C42&A42,\"/\"))","v":"AAAD"},null,{"$f":"A42&C42","v":"AAAD"},{"$f":"E42","v":3},{"$f":"C42&A42","v":"ADAA"},{"$f":"F42","v":1},{"$f":"B42","v":20},{"$f":"D42","v":16}]
["AF",10,"AG",{"$f":"IF(G43=19,19,IF(ISBLANK(B43),\"\",IF(B43=19,0,36-B43)))","v":26},{"$f":"IF(G43=19,0,IF(ISBLANK(B43),\"\",IF(B43<18,1,IF(B43=18,2,IF(B43>18,3)))))","v":1},{"$f":"IF(G43=19,3,IF(ISBLANK(B43),\"\",IF(B43=19,0,IF(D43<18,1,IF(D43=18,2,IF(D43>=20,3))))))","v":3},null,null,null,null,null,{"$f":"IF(B43>D43,A43&C43,IF(D43>B43,C43&A43,\"/\"))","v":"AGAF"},null,{"$f":"A43&C43","v":"AFAG"},{"$f":"E43","v":1},{"$f":"C43&A43","v":"AGAF"},{"$f":"F43","v":3},{"$f":"B43","v":10},{"$f":"D43","v":26}]
["AB",18,"AC",{"$f":"IF(G44=19,19,IF(ISBLANK(B44),\"\",IF(B44=19,0,36-B44)))","v":18},{"$f":"IF(G44=19,0,IF(ISBLANK(B44),\"\",IF(B44<18,1,IF(B44=18,2,IF(B44>18,3)))))","v":2},{"$f":"IF(G44=19,3,IF(ISBLANK(B44),\"\",IF(B44=19,0,IF(D44<18,1,IF(D44=18,2,IF(D44>=20,3))))))","v":2},null,null,null,null,null,{"$f":"IF(B44>D44,A44&C44,IF(D44>B44,C44&A44,\"/\"))","v":"/"},null,{"$f":"A44&C44","v":"ABAC"},{"$f":"E44","v":2},{"$f":"C44&A44","v":"ACAB"},{"$f":"F44","v":2},{"$f":"B44","v":18},{"$f":"D44","v":18}]
["AE",20,"AH",{"$f":"IF(G45=19,19,IF(ISBLANK(B45),\"\",IF(B45=19,0,36-B45)))","v":16},{"$f":"IF(G45=19,0,IF(ISBLANK(B45),\"\",IF(B45<18,1,IF(B45=18,2,IF(B45>18,3)))))","v":3},{"$f":"IF(G45=19,3,IF(ISBLANK(B45),\"\",IF(B45=19,0,IF(D45<18,1,IF(D45=18,2,IF(D45>=20,3))))))","v":1},null,null,null,null,null,{"$f":"IF(B45>D45,A45&C45,IF(D45>B45,C45&A45,\"/\"))","v":"AEAH"},null,{"$f":"A45&C45","v":"AEAH"},{"$f":"E45","v":3},{"$f":"C45&A45","v":"AHAE"},{"$f":"F45","v":1},{"$f":"B45","v":20},{"$f":"D45","v":16}]
[]
["5 éme MATCH le ","à","AE"]
[null,null,null,null,null,null,"SI forfait éq recevante"]
["Equipes","score","Equipes","score","Points","Points"]
["AA",18,"AF",{"$f":"IF(G50=19,19,IF(ISBLANK(B50),\"\",IF(B50=19,0,36-B50)))","v":18},{"$f":"IF(G50=19,0,IF(ISBLANK(B50),\"\",IF(B50<18,1,IF(B50=18,2,IF(B50>18,3)))))","v":2},{"$f":"IF(G50=19,3,IF(ISBLANK(B50),\"\",IF(B50=19,0,IF(D50<18,1,IF(D50=18,2,IF(D50>=20,3))))))","v":2},null,null,null,null,null,{"$f":"IF(B50>D50,A50&C50,IF(D50>B50,C50&A50,\"/\"))","v":"/"},null,{"$f":"A50&C50","v":"AAAF"},{"$f":"E50","v":2},{"$f":"C50&A50","v":"AFAA"},{"$f":"F50","v":2},{"$f":"B50","v":18},{"$f":"D50","v":18}]
["AD",16,"AH",{"$f":"IF(G51=19,19,IF(ISBLANK(B51),\"\",IF(B51=19,0,36-B51)))","v":20},{"$f":"IF(G51=19,0,IF(ISBLANK(B51),\"\",IF(B51<18,1,IF(B51=18,2,IF(B51>18,3)))))","v":1},{"$f":"IF(G51=19,3,IF(ISBLANK(B51),\"\",IF(B51=19,0,IF(D51<18,1,IF(D51=18,2,IF(D51>=20,3))))))","v":3},null,null,null,null,null,{"$f":"IF(B51>D51,A51&C51,IF(D51>B51,C51&A51,\"/\"))","v":"AHAD"},null,{"$f":"A51&C51","v":"ADAH"},{"$f":"E51","v":1},{"$f":"C51&A51","v":"AHAD"},{"$f":"F51","v":3},{"$f":"B51","v":16},{"$f":"D51","v":20}]
["AB",4,"AG",{"$f":"IF(G52=19,19,IF(ISBLANK(B52),\"\",IF(B52=19,0,36-B52)))","v":32},{"$f":"IF(G52=19,0,IF(ISBLANK(B52),\"\",IF(B52<18,1,IF(B52=18,2,IF(B52>18,3)))))","v":1},{"$f":"IF(G52=19,3,IF(ISBLANK(B52),\"\",IF(B52=19,0,IF(D52<18,1,IF(D52=18,2,IF(D52>=20,3))))))","v":3},null,null,null,null,null,{"$f":"IF(B52>D52,A52&C52,IF(D52>B52,C52&A52,\"/\"))","v":"AGAB"},null,{"$f":"A52&C52","v":"ABAG"},{"$f":"E52","v":1},{"$f":"C52&A52","v":"AGAB"},{"$f":"F52","v":3},{"$f":"B52","v":4},{"$f":"D52","v":32}]
["AC",20,"AE",{"$f":"IF(G53=19,19,IF(ISBLANK(B53),\"\",IF(B53=19,0,36-B53)))","v":16},{"$f":"IF(G53=19,0,IF(ISBLANK(B53),\"\",IF(B53<18,1,IF(B53=18,2,IF(B53>18,3)))))","v":3},{"$f":"IF(G53=19,3,IF(ISBLANK(B53),\"\",IF(B53=19,0,IF(D53<18,1,IF(D53=18,2,IF(D53>=20,3))))))","v":1},null,null,null,null,null,{"$f":"IF(B53>D53,A53&C53,IF(D53>B53,C53&A53,\"/\"))","v":"ACAE"},null,{"$f":"A53&C53","v":"ACAE"},{"$f":"E53","v":3},{"$f":"C53&A53","v":"AEAC"},{"$f":"F53","v":1},{"$f":"B53","v":20},{"$f":"D53","v":16}]
[]
["6 éme MATCH le ","à","AF"]
[null,null,null,null,null,null,"SI forfait éq recevante"]
["Equipes","score","Equipes","score","Points","Points"]
["AB",14,"AD",{"$f":"IF(G58=19,19,IF(ISBLANK(B58),\"\",IF(B58=19,0,36-B58)))","v":22},{"$f":"IF(G58=19,0,IF(ISBLANK(B58),\"\",IF(B58<18,1,IF(B58=18,2,IF(B58>18,3)))))","v":1},{"$f":"IF(G58=19,3,IF(ISBLANK(B58),\"\",IF(B58=19,0,IF(D58<18,1,IF(D58=18,2,IF(D58>=20,3))))))","v":3},null,null,null,null,null,{"$f":"IF(B58>D58,A58&C58,IF(D58>B58,C58&A58,\"/\"))","v":"ADAB"},null,{"$f":"A58&C58","v":"ABAD"},{"$f":"E58","v":1},{"$f":"C58&A58","v":"ADAB"},{"$f":"F58","v":3},{"$f":"B58","v":14},{"$f":"D58","v":22}]
["AE",24,"AA",{"$f":"IF(G59=19,19,IF(ISBLANK(B59),\"\",IF(B59=19,0,36-B59)))","v":12},{"$f":"IF(G59=19,0,IF(ISBLANK(B59),\"\",IF(B59<18,1,IF(B59=18,2,IF(B59>18,3)))))","v":3},{"$f":"IF(G59=19,3,IF(ISBLANK(B59),\"\",IF(B59=19,0,IF(D59<18,1,IF(D59=18,2,IF(D59>=20,3))))))","v":1},null,null,null,null,null,{"$f":"IF(B59>D59,A59&C59,IF(D59>B59,C59&A59,\"/\"))","v":"AEAA"},null,{"$f":"A59&C59","v":"AEAA"},{"$f":"E59","v":3},{"$f":"C59&A59","v":"AAAE"},{"$f":"F59","v":1},{"$f":"B59","v":24},{"$f":"D59","v":12}]
["AG",8,"AC",{"$f":"IF(G60=19,19,IF(ISBLANK(B60),\"\",IF(B60=19,0,36-B60)))","v":28},{"$f":"IF(G60=19,0,IF(ISBLANK(B60),\"\",IF(B60<18,1,IF(B60=18,2,IF(B60>18,3)))))","v":1},{"$f":"IF(G60=19,3,IF(ISBLANK(B60),\"\",IF(B60=19,0,IF(D60<18,1,IF(D60=18,2,IF(D60>=20,3))))))","v":3},null,null,null,null,null,{"$f":"IF(B60>D60,A60&C60,IF(D60>B60,C60&A60,\"/\"))","v":"ACAG"},null,{"$f":"A60&C60","v":"AGAC"},{"$f":"E60","v":1},{"$f":"C60&A60","v":"ACAG"},{"$f":"F60","v":3},{"$f":"B60","v":8},{"$f":"D60","v":28}]
["AF",22,"AH",{"$f":"IF(G61=19,19,IF(ISBLANK(B61),\"\",IF(B61=19,0,36-B61)))","v":14},{"$f":"IF(G61=19,0,IF(ISBLANK(B61),\"\",IF(B61<18,1,IF(B61=18,2,IF(B61>18,3)))))","v":3},{"$f":"IF(G61=19,3,IF(ISBLANK(B61),\"\",IF(B61=19,0,IF(D61<18,1,IF(D61=18,2,IF(D61>=20,3))))))","v":1},null,null,null,null,null,{"$f":"IF(B61>D61,A61&C61,IF(D61>B61,C61&A61,\"/\"))","v":"AFAH"},null,{"$f":"A61&C61","v":"AFAH"},{"$f":"E61","v":3},{"$f":"C61&A61","v":"AHAF"},{"$f":"F61","v":1},{"$f":"B61","v":22},{"$f":"D61","v":14}]
[]
["7 éme MATCH le","à","AG"]
[null,null,null,null,null,null,"SI forfait éq recevante",null," "]
["Equipes","score","Equipes","score","Points","Points"]
["AA",20,"AG",{"$f":"IF(G66=19,19,IF(ISBLANK(B66),\"\",IF(B66=19,0,36-B66)))","v":16},{"$f":"IF(G66=19,0,IF(ISBLANK(B66),\"\",IF(B66<18,1,IF(B66=18,2,IF(B66>18,3)))))","v":3},{"$f":"IF(G66=19,3,IF(ISBLANK(B66),\"\",IF(B66=19,0,IF(D66<18,1,IF(D66=18,2,IF(D66>=20,3))))))","v":1},null,null,null,null,null,{"$f":"IF(B66>D66,A66&C66,IF(D66>B66,C66&A66,\"/\"))","v":"AAAG"},null,{"$f":"A66&C66","v":"AAAG"},{"$f":"E66","v":3},{"$f":"C66&A66","v":"AGAA"},{"$f":"F66","v":1},{"$f":"B66","v":20},{"$f":"D66","v":16}]
["AB",12,"AF",{"$f":"IF(G67=19,19,IF(ISBLANK(B67),\"\",IF(B67=19,0,36-B67)))","v":24},{"$f":"IF(G67=19,0,IF(ISBLANK(B67),\"\",IF(B67<18,1,IF(B67=18,2,IF(B67>18,3)))))","v":1},{"$f":"IF(G67=19,3,IF(ISBLANK(B67),\"\",IF(B67=19,0,IF(D67<18,1,IF(D67=18,2,IF(D67>=20,3))))))","v":3},null,null,null,null,null,{"$f":"IF(B67>D67,A67&C67,IF(D67>B67,C67&A67,\"/\"))","v":"AFAB"},null,{"$f":"A67&C67","v":"ABAF"},{"$f":"E67","v":1},{"$f":"C67&A67","v":"AFAB"},{"$f":"F67","v":3},{"$f":"B67","v":12},{"$f":"D67","v":24}]
["AE",26,"AD",{"$f":"IF(G68=19,19,IF(ISBLANK(B68),\"\",IF(B68=19,0,36-B68)))","v":10},{"$f":"IF(G68=19,0,IF(ISBLANK(B68),\"\",IF(B68<18,1,IF(B68=18,2,IF(B68>18,3)))))","v":3},{"$f":"IF(G68=19,3,IF(ISBLANK(B68),\"\",IF(B68=19,0,IF(D68<18,1,IF(D68=18,2,IF(D68>=20,3))))))","v":1},null,null,null,null,null,{"$f":"IF(B68>D68,A68&C68,IF(D68>B68,C68&A68,\"/\"))","v":"AEAD"},null,{"$f":"A68&C68","v":"AEAD"},{"$f":"E68","v":3},{"$f":"C68&A68","v":"ADAE"},{"$f":"F68","v":1},{"$f":"B68","v":26},{"$f":"D68","v":10}]
["AC",34,"AH",{"$f":"IF(G69=19,19,IF(ISBLANK(B69),\"\",IF(B69=19,0,36-B69)))","v":2},{"$f":"IF(G69=19,0,IF(ISBLANK(B69),\"\",IF(B69<18,1,IF(B69=18,2,IF(B69>18,3)))))","v":3},{"$f":"IF(G69=19,3,IF(ISBLANK(B69),\"\",IF(B69=19,0,IF(D69<18,1,IF(D69=18,2,IF(D69>=20,3))))))","v":1},null,null,null,null,null,{"$f":"IF(B69>D69,A69&C69,IF(D69>B69,C69&A69,\"/\"))","v":"ACAH"},null,{"$f":"A69&C69","v":"ACAH"},{"$f":"E69","v":3},{"$f":"C69&A69","v":"AHAC"},{"$f":"F69","v":1},{"$f":"B69","v":34},{"$f":"D69","v":2}]
[null,null,"Si pas d'exaequo",null,null,null,"Classt        Final","Rencontres entre exaequos"]
["EQUIPES",null,"POINTS","POUR","CONTRE","DIFF",null,"POINTS Exaequos","Exaq","n°","AA","AB","AC","AD","AE","AF","AG","AH","Pts matchs",null,null,null,"1000000*Pts matchs +1000 (Diff +  abs(diff mini) )+Pour ","RANG","DIFF Exaequos","POUR Exaequos"]
["AC","1C",20,180,72,108,1,{"$f":"IF(S72>0,S72,\"\")","v":""},{"$f":"COUNTIF($C$72:$C$79,C72)","v":1},{"$f":"IF(AND(I72>1,COUNTIFS(I$72:I72,I72,C$72:C72,C72)=1),MAX(J$71:J71)+1,\"\")","v":""},{"$f":"IF($A72=K$71,\"\",IF(INDEX($C$72:$C$79,MATCH(K$71,$A$72:$A$79,0))=$C72,IFERROR(VLOOKUP($A72&K$71,$N$18:$O$69,2,0),  VLOOKUP(K$71&$A72,$N$18:$Q$69,4,0)),          \"\"))","v":""},"","","","","","","",{"$f":"SUM(K72:R72)","v":0},null,null,null,{"$f":"IF(I72<3,S72*1000000+(F72+ABS(MIN($F$72:$F$79)))*1000+D72,S72*1000000+U96*1000+Z72)","v":172180},{"$f":"IF(I72>2,RANK(W72,OFFSET(W$71,MATCH(I72,$I$72:$I$79,0),,I72)))","v":false},{"$f":"IF(S96=0,\"\",S96)","v":""},{"$f":"IF(S80=0,\"\",S80)","v":""}]
["AE","1E",16,148,104,44,2,"",1,{"$f":"IF(AND(I73>1,COUNTIFS(I$72:I73,I73,C$72:C73,C73)=1),MAX(J$71:J72)+1,\"\")","v":""},"","","","","","","","",{"$f":"SUM(K73:R73)","v":0},null,null,null,{"$f":"IF(I73<3,S73*1000000+(F73+ABS(MIN($F$72:$F$79)))*1000+D73,S73*1000000+U97*1000+Z73)","v":108148},{"$f":"IF(I73>2,RANK(W73,OFFSET(W$71,MATCH(I73,$I$72:$I$79,0),,I73)))","v":false},"",""]
["AF","1F",15,128,124,4,3,"",1,{"$f":"IF(AND(I74>1,COUNTIFS(I$72:I74,I74,C$72:C74,C74)=1),MAX(J$71:J73)+1,\"\")","v":""},"","","","","","","","",0,null,null,null,68128,false,"",""]
["AA","1A",14,112,140,-28,4,"",1,{"$f":"IF(AND(I75>1,COUNTIFS(I$72:I75,I75,C$72:C75,C75)=1),MAX(J$71:J74)+1,\"\")","v":""},"","","","","","","","",0,null,null,null,36112,false,"",""]
["AG","1G",13,116,136,-20,5,3,2,{"$f":"IF(AND(I76>1,COUNTIFS(I$72:I76,I76,C$72:C76,C76)=1),MAX(J$71:J75)+1,\"\")","v":1},"",3,"","","","","","",3,null,null,null,3044116,false,28,32]
["AB","1B",13,110,142,-32,6,1,2,{"$f":"IF(AND(I77>1,COUNTIFS(I$72:I77,I77,C$72:C77,C77)=1),MAX(J$71:J76)+1,\"\")","v":""},"","","","","","",1,"",1,null,null,null,1032110,false,-28,4]
["AD","1D",12,120,132,-12,7,"",1,{"$f":"IF(AND(I78>1,COUNTIFS(I$72:I78,I78,C$72:C78,C78)=1),MAX(J$71:J77)+1,\"\")","v":""},"","","","","","","","",0,null,null,null,52120,false,"",""]
["AH","1H",9,94,158,-64,8,"",1,{"$f":"IF(AND(I79>1,COUNTIFS(I$72:I79,I79,C$72:C79,C79)=1),MAX(J$71:J78)+1,\"\")","v":""},"","","","","","","","",0,null,null,null,94,false,"",""]
[null,null,null,null,null,null,null,null,"POUR",{"$f":"A72","v":"AC"},{"$f":"IF($A72=K$71,\"\",IF(INDEX($C$72:$C$79,MATCH(K$71,$A$72:$A$79,0))=$C72,IFERROR(VLOOKUP($A72&K$71,$N$18:$R$69,5,0),  VLOOKUP(K$71&$A72,$N$18:$S$69,6,0)),          \"\"))","v":""},"","","","","","","",0]
[null,null,null,null,null,null,null,null,null,"AE","","","","","","","","",0]
[null,null,null,null,null,null,null,null,null,"AF","","","","","","","","",0]
[null,null,null,null,null,null,null,null,null,"AA","","","","","","","","",0]
[null,null,null,null,null,null,null,null,null,"AG","",32,"","","","","","",32,null,null,null,null,null,"  "]
[null,null,null,null,null,null,null,null,null,"AB","","","","","","",4,"",4]
[null,null,null,null,null,null,null,null,null,"AD","","","","","","","","",0]
[null,null,null,null,null,null,null,null,null,"AH","","","","","","","","",0]
[null,null,null,null,null,null,null,null,"CONTRE",{"$f":"J80","v":"AC"},{"$f":"INDEX($K$80:$R$87,MATCH(K$71,$J$80:$J$87,0),MATCH($J80,$K$71:$R$71,0))","v":""},{"$f":"INDEX($K$80:$R$87,MATCH(L$71,$J$80:$J$87,0),MATCH($J80,$K$71:$R$71,0))","v":""},"","","","","","",0]
[null,null,null,null,null,null,null,null,null,{"$f":"J81","v":"AE"},{"$f":"INDEX($K$80:$R$87,MATCH(K$71,$J$80:$J$87,0),MATCH($J81,$K$71:$R$71,0))","v":""},"","","","","","","",0]
[null,null,null,null,null,null,null,null,null,"AF","","","","","","","","",0]
[null,null,null,null,null,null,null,null,null,"AA","","","","","","","","",0]
[null,null,null,null,null,null,null,null,null,"AG","",4,"","","","","","",4]
[null,null,null,null,null,null,null,null,null,"AB","","","","","","",32,"",32]
[null,null,null,null,null,null,null,null,null,"AD","","","","","","","","",0]
[null,null,null,null,null,null,null,null,null,"AH","","","","","","","","",0,null,"Diff pondérée"]
[null,null,null,null,null,null,null,null,"DIFF",{"$f":"J88","v":"AC"},null,null,null,null,null,null,null,null,{"$f":"S80-S88","v":0},null,{"$f":"S96+ABS(MIN($S$96:$S$103))","v":28}]
[null,null,null,null,null,null,null,null,null,{"$f":"J89","v":"AE"},null,null,null,null,null,null,null,null,{"$f":"S81-S89","v":0},null,28]
[null,null,null,null,null,null,null,null,null,"AF",null,null,null,null,null,null,null,null,0,null,28]
[null,null,null,null,null,null,null,null,null,"AA",null,null,null,null,null,null,null,null,0,null,28]
[null,null,null,null,null,null,null,null,null,"AG",null,null,null,null,null,null,null,null,28,null,56]
[null,null,null,null,null,null,null,null,null,"AB",null,null,null,null,null,null,null,null,-28,null,0]
[null,null,null,null,null,null,null,null,null,"AD",null,null,null,null,null,null,null,null,0,null,{"$f":"S102+ABS(MIN($S$96:$S$103))","v":28}]
[null,null,null,null,null,null,null,null,null,"AH",null,null,null,null,null,null,null,null,0,null,{"$f":"S103+ABS(MIN($S$96:$S$103))","v":28}]

{"sheet":"P4","index":3,"n_rows":103,"n_cols":26,"rows_kept":103,"cut":false,"hidden":false,"merged":[[0,0,0,5],[1,0,1,5],[2,0,2,5],[3,0,3,5],[3,8,3,10],[15,6,16,6],[69,2,69,5],[69,6,70,6],[69,7,69,25],[23,6,24,6],[31,6,32,6],[39,6,40,6],[47,6,48,6],[55,6,56,6],[63,6,64,6]]}
[null,null,null,null,null,null,3]
["CHAMPIONNAT DES CLUBS"]
[]
["POULE 1"]
["EQUIPES",null,"POINTS","Pour","Contre","Diff"]
["AA","1A",{"$f":"SUMIF($A$18:$A$69,A6,$E$18:$E$69)+SUMIF($C$18:$C$69,A6,$F$18:$F$69)","v":15},{"$f":"SUMIF($A$18:$A$69,$A6,$B$18:$B$69)+SUMIF($C$18:$C$69,$A6,$D$18:$D$69)","v":134},{"$f":"SUMIF($C$18:$C$69,$A6,$B$18:$B$69)+SUMIF($A$18:$A$69,$A6,$D$18:$D$69)","v":118},{"$f":"D6-E6","v":16}]
["AB","1B",{"$f":"SUMIF($A$18:$A$69,A7,$E$18:$E$69)+SUMIF($C$18:$C$69,A7,$F$18:$F$69)","v":16},{"$f":"SUMIF($A$18:$A$69,$A7,$B$18:$B$69)+SUMIF($C$18:$C$69,$A7,$D$18:$D$69)","v":136},{"$f":"SUMIF($C$18:$C$69,$A7,$B$18:$B$69)+SUMIF($A$18:$A$69,$A7,$D$18:$D$69)","v":116},20]
["AC","1C",{"$f":"SUMIF($A$18:$A$69,A8,$E$18:$E$69)+SUMIF($C$18:$C$69,A8,$F$18:$F$69)","v":16},132,120,12]
["AD","1D",11,102,150,-48]
["AE","1E",10,100,152,-52]
["AF","1F",16,136,116,20]
["AG","1G",16,158,94,{"$f":"D12-E12","v":64}]
["AH","1H",12,{"$f":"SUMIF($A$18:$A$69,$A13,$B$18:$B$69)+SUMIF($C$18:$C$69,$A13,$D$18:$D$69)","v":110},142,{"$f":"D13-E13","v":-32}]
[]
["1er MATCH le ","à","AA"]
[null,null,null,null,null,null,"SI forfait éq recevante"]
["Equipes","score","Equipes","score","Points","Points"]
["AA",16,"AB",{"$f":"IF(G18=19,19,IF(ISBLANK(B18),\"\",IF(B18=19,0,36-B18)))","v":20},{"$f":"IF(G18=19,0,IF(ISBLANK(B18),\"\",IF(B18<18,1,IF(B18=18,2,IF(B18>18,3)))))","v":1},{"$f":"IF(G18=19,3,IF(ISBLANK(B18),\"\",IF(B18=19,0,IF(D18<18,1,IF(D18=18,2,IF(D18>=20,3))))))","v":3},null,null,null,null,null,{"$f":"IF(B18>D18,A18&C18,IF(D18>B18,C18&A18,\"/\"))","v":"ABAA"},null,{"$f":"A18&C18","v":"AAAB"},{"$f":"E18","v":1},{"$f":"C18&A18","v":"ABAA"},{"$f":"F18","v":3},{"$f":"B18","v":16},{"$f":"D18","v":20}]
["AC",30,"AD",{"$f":"IF(G19=19,19,IF(ISBLANK(B19),\"\",IF(B19=19,0,36-B19)))","v":6},{"$f":"IF(G19=19,0,IF(ISBLANK(B19),\"\",IF(B19<18,1,IF(B19=18,2,IF(B19>18,3)))))","v":3},{"$f":"IF(G19=19,3,IF(ISBLANK(B19),\"\",IF(B19=19,0,IF(D19<18,1,IF(D19=18,2,IF(D19>=20,3))))))","v":1},null,null,null,null,null,{"$f":"IF(B19>D19,A19&C19,IF(D19>B19,C19&A19,\"/\"))","v":"ACAD"},null,{"$f":"A19&C19","v":"ACAD"},{"$f":"E19","v":3},{"$f":"C19&A19","v":"ADAC"},{"$f":"F19","v":1},{"$f":"B19","v":30},{"$f":"D19","v":6}]
["AE",16,"AF",{"$f":"IF(G20=19,19,IF(ISBLANK(B20),\"\",IF(B20=19,0,36-B20)))","v":20},{"$f":"IF(G20=19,0,IF(ISBLANK(B20),\"\",IF(B20<18,1,IF(B20=18,2,IF(B20>18,3)))))","v":1},{"$f":"IF(G20=19,3,IF(ISBLANK(B20),\"\",IF(B20=19,0,IF(D20<18,1,IF(D20=18,2,IF(D20>=20,3))))))","v":3},null,null,null,null,null,{"$f":"IF(B20>D20,A20&C20,IF(D20>B20,C20&A20,\"/\"))","v":"AFAE"},null,{"$f":"A20&C20","v":"AEAF"},{"$f":"E20","v":1},{"$f":"C20&A20","v":"AFAE"},{"$f":"F20","v":3},{"$f":"B20","v":16},{"$f":"D20","v":20}]
["AG",18,"AH",{"$f":"IF(G21=19,19,IF(ISBLANK(B21),\"\",IF(B21=19,0,36-B21)))","v":18},{"$f":"IF(G21=19,0,IF(ISBLANK(B21),\"\",IF(B21<18,1,IF(B21=18,2,IF(B21>18,3)))))","v":2},{"$f":"IF(G21=19,3,IF(ISBLANK(B21),\"\",IF(B21=19,0,IF(D21<18,1,IF(D21=18,2,IF(D21>=20,3))))))","v":2},null,null,null,null,null,{"$f":"IF(B21>D21,A21&C21,IF(D21>B21,C21&A21,\"/\"))","v":"/"},null,{"$f":"A21&C21","v":"AGAH"},{"$f":"E21","v":2},{"$f":"C21&A21","v":"AHAG"},{"$f":"F21","v":2},{"$f":"B21","v":18},{"$f":"D21","v":18}]
[]
["2 éme MATCH le ","à","AB"]
[null,null,null,null,null,null,"SI forfait éq recevante"]
["Equipes","score","Equipes","score","Points","Points"]
["AA",26,"AC",{"$f":"IF(G26=19,19,IF(ISBLANK(B26),\"\",IF(B26=19,0,36-B26)))","v":10},{"$f":"IF(G26=19,0,IF(ISBLANK(B26),\"\",IF(B26<18,1,IF(B26=18,2,IF(B26>18,3)))))","v":3},{"$f":"IF(G26=19,3,IF(ISBLANK(B26),\"\",IF(B26=19,0,IF(D26<18,1,IF(D26=18,2,IF(D26>=20,3))))))","v":1},null,null,null,null,null,{"$f":"IF(B26>D26,A26&C26,IF(D26>B26,C26&A26,\"/\"))","v":"AAAC"},null,{"$f":"A26&C26","v":"AAAC"},{"$f":"E26","v":3},{"$f":"C26&A26","v":"ACAA"},{"$f":"F26","v":1},{"$f":"B26","v":26},{"$f":"D26","v":10}]
["AB",28,"AH",{"$f":"IF(G27=19,19,IF(ISBLANK(B27),\"\",IF(B27=19,0,36-B27)))","v":8},{"$f":"IF(G27=19,0,IF(ISBLANK(B27),\"\",IF(B27<18,1,IF(B27=18,2,IF(B27>18,3)))))","v":3},{"$f":"IF(G27=19,3,IF(ISBLANK(B27),\"\",IF(B27=19,0,IF(D27<18,1,IF(D27=18,2,IF(D27>=20,3))))))","v":1},null,null,null,null,null,{"$f":"IF(B27>D27,A27&C27,IF(D27>B27,C27&A27,\"/\"))","v":"ABAH"},null,{"$f":"A27&C27","v":"ABAH"},{"$f":"E27","v":3},{"$f":"C27&A27","v":"AHAB"},{"$f":"F27","v":1},{"$f":"B27","v":28},{"$f":"D27","v":8}]
["AD",18,"AF",{"$f":"IF(G28=19,19,IF(ISBLANK(B28),\"\",IF(B28=19,0,36-B28)))","v":18},{"$f":"IF(G28=19,0,IF(ISBLANK(B28),\"\",IF(B28<18,1,IF(B28=18,2,IF(B28>18,3)))))","v":2},{"$f":"IF(G28=19,3,IF(ISBLANK(B28),\"\",IF(B28=19,0,IF(D28<18,1,IF(D28=18,2,IF(D28>=20,3))))))","v":2},null,null,null,null,null,{"$f":"IF(B28>D28,A28&C28,IF(D28>B28,C28&A28,\"/\"))","v":"/"},null,{"$f":"A28&C28","v":"ADAF"},{"$f":"E28","v":2},{"$f":"C28&A28","v":"AFAD"},{"$f":"F28","v":2},{"$f":"B28","v":18},{"$f":"D28","v":18}]
["AE",10,"AG",{"$f":"IF(G29=19,19,IF(ISBLANK(B29),\"\",IF(B29=19,0,36-B29)))","v":26},{"$f":"IF(G29=19,0,IF(ISBLANK(B29),\"\",IF(B29<18,1,IF(B29=18,2,IF(B29>18,3)))))","v":1},{"$f":"IF(G29=19,3,IF(ISBLANK(B29),\"\",IF(B29=19,0,IF(D29<18,1,IF(D29=18,2,IF(D29>=20,3))))))","v":3},null,null,null,null,null,{"$f":"IF(B29>D29,A29&C29,IF(D29>B29,C29&A29,\"/\"))","v":"AGAE"},null,{"$f":"A29&C29","v":"AEAG"},{"$f":"E29","v":1},{"$f":"C29&A29","v":"AGAE"},{"$f":"F29","v":3},{"$f":"B29","v":10},{"$f":"D29","v":26}]
[]
["3 éme MATCH le ","à","AC"]
[null,null,null,null,null,null,"SI forfait éq recevante"]
["Equipes","score","Equipes","score","Points","Points"]
["AA",30,"AH",{"$f":"IF(G34=19,19,IF(ISBLANK(B34),\"\",IF(B34=19,0,36-B34)))","v":6},{"$f":"IF(G34=19,0,IF(ISBLANK(B34),\"\",IF(B34<18,1,IF(B34=18,2,IF(B34>18,3)))))","v":3},{"$f":"IF(G34=19,3,IF(ISBLANK(B34),\"\",IF(B34=19,0,IF(D34<18,1,IF(D34=18,2,IF(D34>=20,3))))))","v":1},null,null,null,null,null,{"$f":"IF(B34>D34,A34&C34,IF(D34>B34,C34&A34,\"/\"))","v":"AAAH"},null,{"$f":"A34&C34","v":"AAAH"},{"$f":"E34","v":3},{"$f":"C34&A34","v":"AHAA"},{"$f":"F34","v":1},{"$f":"B34","v":30},{"$f":"D34","v":6}]
["AB",18,"AE",{"$f":"IF(G35=19,19,IF(ISBLANK(B35),\"\",IF(B35=19,0,36-B35)))","v":18},{"$f":"IF(G35=19,0,IF(ISBLANK(B35),\"\",IF(B35<18,1,IF(B35=18,2,IF(B35>18,3)))))","v":2},{"$f":"IF(G35=19,3,IF(ISBLANK(B35),\"\",IF(B35=19,0,IF(D35<18,1,IF(D35=18,2,IF(D35>=20,3))))))","v":2},null,null,null,null,null,{"$f":"IF(B35>D35,A35&C35,IF(D35>B35,C35&A35,\"/\"))","v":"/"},null,{"$f":"A35&C35","v":"ABAE"},{"$f":"E35","v":2},{"$f":"C35&A35","v":"AEAB"},{"$f":"F35","v":2},{"$f":"B35","v":18},{"$f":"D35","v":18}]
["AC",20,"AF",{"$f":"IF(G36=19,19,IF(ISBLANK(B36),\"\",IF(B36=19,0,36-B36)))","v":16},{"$f":"IF(G36=19,0,IF(ISBLANK(B36),\"\",IF(B36<18,1,IF(B36=18,2,IF(B36>18,3)))))","v":3},{"$f":"IF(G36=19,3,IF(ISBLANK(B36),\"\",IF(B36=19,0,IF(D36<18,1,IF(D36=18,2,IF(D36>=20,3))))))","v":1},null,null,null,null,null,{"$f":"IF(B36>D36,A36&C36,IF(D36>B36,C36&A36,\"/\"))","v":"ACAF"},null,{"$f":"A36&C36","v":"ACAF"},{"$f":"E36","v":3},{"$f":"C36&A36","v":"AFAC"},{"$f":"F36","v":1},{"$f":"B36","v":20},{"$f":"D36","v":16}]
["AD",10,"AG",{"$f":"IF(G37=19,19,IF(ISBLANK(B37),\"\",IF(B37=19,0,36-B37)))","v":26},{"$f":"IF(G37=19,0,IF(ISBLANK(B37),\"\",IF(B37<18,1,IF(B37=18,2,IF(B37>18,3)))))","v":1},{"$f":"IF(G37=19,3,IF(ISBLANK(B37),\"\",IF(B37=19,0,IF(D37<18,1,IF(D37=18,2,IF(D37>=20,3))))))","v":3},null,null,null,null,null,{"$f":"IF(B37>D37,A37&C37,IF(D37>B37,C37&A37,\"/\"))","v":"AGAD"},null,{"$f":"A37&C37","v":"ADAG"},{"$f":"E37","v":1},{"$f":"C37&A37","v":"AGAD"},{"$f":"F37","v":3},{"$f":"B37","v":10},{"$f":"D37","v":26}]
[]
["4 éme MATCH le ","à","AD"]
[null,null,null,null,null,null,"SI forfait éq recevante"]
["Equipes","score","Equipes","score","Points","Points"]
["AA",6,"AD",{"$f":"IF(G42=19,19,IF(ISBLANK(B42),\"\",IF(B42=19,0,36-B42)))","v":30},{"$f":"IF(G42=19,0,IF(ISBLANK(B42),\"\",IF(B42<18,1,IF(B42=18,2,IF(B42>18,3)))))","v":1},{"$f":"IF(G42=19,3,IF(ISBLANK(B42),\"\",IF(B42=19,0,IF(D42<18,1,IF(D42=18,2,IF(D42>=20,3))))))","v":3},null,null,null,null,null,{"$f":"IF(B42>D42,A42&C42,IF(D42>B42,C42&A42,\"/\"))","v":"ADAA"},null,{"$f":"A42&C42","v":"AAAD"},{"$f":"E42","v":1},{"$f":"C42&A42","v":"ADAA"},{"$f":"F42","v":3},{"$f":"B42","v":6},{"$f":"D42","v":30}]
["AF",10,"AG",{"$f":"IF(G43=19,19,IF(ISBLANK(B43),\"\",IF(B43=19,0,36-B43)))","v":26},{"$f":"IF(G43=19,0,IF(ISBLANK(B43),\"\",IF(B43<18,1,IF(B43=18,2,IF(B43>18,3)))))","v":1},{"$f":"IF(G43=19,3,IF(ISBLANK(B43),\"\",IF(B43=19,0,IF(D43<18,1,IF(D43=18,2,IF(D43>=20,3))))))","v":3},null,null,null,null,null,{"$f":"IF(B43>D43,A43&C43,IF(D43>B43,C43&A43,\"/\"))","v":"AGAF"},null,{"$f":"A43&C43","v":"AFAG"},{"$f":"E43","v":1},{"$f":"C43&A43","v":"AGAF"},{"$f":"F43","v":3},{"$f":"B43","v":10},{"$f":"D43","v":26}]
["AB",24,"AC",{"$f":"IF(G44=19,19,IF(ISBLANK(B44),\"\",IF(B44=19,0,36-B44)))","v":12},{"$f":"IF(G44=19,0,IF(ISBLANK(B44),\"\",IF(B44<18,1,IF(B44=18,2,IF(B44>18,3)))))","v":3},{"$f":"IF(G44=19,3,IF(ISBLANK(B44),\"\",IF(B44=19,0,IF(D44<18,1,IF(D44=18,2,IF(D44>=20,3))))))","v":1},null,null,null,null,null,{"$f":"IF(B44>D44,A44&C44,IF(D44>B44,C44&A44,\"/\"))","v":"ABAC"},null,{"$f":"A44&C44","v":"ABAC"},{"$f":"E44","v":3},{"$f":"C44&A44","v":"ACAB"},{"$f":"F44","v":1},{"$f":"B44","v":24},{"$f":"D44","v":12}]
["AE",8,"AH",{"$f":"IF(G45=19,19,IF(ISBLANK(B45),\"\",IF(B45=19,0,36-B45)))","v":28},{"$f":"IF(G45=19,0,IF(ISBLANK(B45),\"\",IF(B45<18,1,IF(B45=18,2,IF(B45>18,3)))))","v":1},{"$f":"IF(G45=19,3,IF(ISBLANK(B45),\"\",IF(B45=19,0,IF(D45<18,1,IF(D45=18,2,IF(D45>=20,3))))))","v":3},null,null,null,null,null,{"$f":"IF(B45>D45,A45&C45,IF(D45>B45,C45&A45,\"/\"))","v":"AHAE"},null,{"$f":"A45&C45","v":"AEAH"},{"$f":"E45","v":1},{"$f":"C45&A45","v":"AHAE"},{"$f":"F45","v":3},{"$f":"B45","v":8},{"$f":"D45","v":28}]
[]
["5 éme MATCH le ","à","AE"]
[null,null,null,null,null,null,"SI forfait éq recevante"]
["Equipes","score","Equipes","score","Points","Points"]
["AA",10,"AF",{"$f":"IF(G50=19,19,IF(ISBLANK(B50),\"\",IF(B50=19,0,36-B50)))","v":26},{"$f":"IF(G50=19,0,IF(ISBLANK(B50),\"\",IF(B50<18,1,IF(B50=18,2,IF(B50>18,3)))))","v":1},{"$f":"IF(G50=19,3,IF(ISBLANK(B50),\"\",IF(B50=19,0,IF(D50<18,1,IF(D50=18,2,IF(D50>=20,3))))))","v":3},null,null,null,null,null,{"$f":"IF(B50>D50,A50&C50,IF(D50>B50,C50&A50,\"/\"))","v":"AFAA"},null,{"$f":"A50&C50","v":"AAAF"},{"$f":"E50","v":1},{"$f":"C50&A50","v":"AFAA"},{"$f":"F50","v":3},{"$f":"B50","v":10},{"$f":"D50","v":26}]
["AD",18,"AH",{"$f":"IF(G51=19,19,IF(ISBLANK(B51),\"\",IF(B51=19,0,36-B51)))","v":18},{"$f":"IF(G51=19,0,IF(ISBLANK(B51),\"\",IF(B51<18,1,IF(B51=18,2,IF(B51>18,3)))))","v":2},{"$f":"IF(G51=19,3,IF(ISBLANK(B51),\"\",IF(B51=19,0,IF(D51<18,1,IF(D51=18,2,IF(D51>=20,3))))))","v":2},null,null,null,null,null,{"$f":"IF(B51>D51,A51&C51,IF(D51>B51,C51&A51,\"/\"))","v":"/"},null,{"$f":"A51&C51","v":"ADAH"},{"$f":"E51","v":2},{"$f":"C51&A51","v":"AHAD"},{"$f":"F51","v":2},{"$f":"B51","v":18},{"$f":"D51","v":18}]
["AB",4,"AG",{"$f":"IF(G52=19,19,IF(ISBLANK(B52),\"\",IF(B52=19,0,36-B52)))","v":32},{"$f":"IF(G52=19,0,IF(ISBLANK(B52),\"\",IF(B52<18,1,IF(B52=18,2,IF(B52>18,3)))))","v":1},{"$f":"IF(G52=19,3,IF(ISBLANK(B52),\"\",IF(B52=19,0,IF(D52<18,1,IF(D52=18,2,IF(D52>=20,3))))))","v":3},null,null,null,null,null,{"$f":"IF(B52>D52,A52&C52,IF(D52>B52,C52&A52,\"/\"))","v":"AGAB"},null,{"$f":"A52&C52","v":"ABAG"},{"$f":"E52","v":1},{"$f":"C52&A52","v":"AGAB"},{"$f":"F52","v":3},{"$f":"B52","v":4},{"$f":"D52","v":32}]
["AC",20,"AE",{"$f":"IF(G53=19,19,IF(ISBLANK(B53),\"\",IF(B53=19,0,36-B53)))","v":16},{"$f":"IF(G53=19,0,IF(ISBLANK(B53),\"\",IF(B53<18,1,IF(B53=18,2,IF(B53>18,3)))))","v":3},{"$f":"IF(G53=19,3,IF(ISBLANK(B53),\"\",IF(B53=19,0,IF(D53<18,1,IF(D53=18,2,IF(D53>=20,3))))))","v":1},null,null,null,null,null,{"$f":"IF(B53>D53,A53&C53,IF(D53>B53,C53&A53,\"/\"))","v":"ACAE"},null,{"$f":"A53&C53","v":"ACAE"},{"$f":"E53","v":3},{"$f":"C53&A53","v":"AEAC"},{"$f":"F53","v":1},{"$f":"B53","v":20},{"$f":"D53","v":16}]
[]
["6 éme MATCH le ","à","AF"]
[null,null,null,null,null,null,"SI forfait éq recevante"]
["Equipes","score","Equipes","score","Points","Points"]
["AB",30,"AD",{"$f":"IF(G58=19,19,IF(ISBLANK(B58),\"\",IF(B58=19,0,36-B58)))","v":6},{"$f":"IF(G58=19,0,IF(ISBLANK(B58),\"\",IF(B58<18,1,IF(B58=18,2,IF(B58>18,3)))))","v":3},{"$f":"IF(G58=19,3,IF(ISBLANK(B58),\"\",IF(B58=19,0,IF(D58<18,1,IF(D58=18,2,IF(D58>=20,3))))))","v":1},null,null,null,null,null,{"$f":"IF(B58>D58,A58&C58,IF(D58>B58,C58&A58,\"/\"))","v":"ABAD"},null,{"$f":"A58&C58","v":"ABAD"},{"$f":"E58","v":3},{"$f":"C58&A58","v":"ADAB"},{"$f":"F58","v":1},{"$f":"B58","v":30},{"$f":"D58","v":6}]
["AE",10,"AA",{"$f":"IF(G59=19,19,IF(ISBLANK(B59),\"\",IF(B59=19,0,36-B59)))","v":26},{"$f":"IF(G59=19,0,IF(ISBLANK(B59),\"\",IF(B59<18,1,IF(B59=18,2,IF(B59>18,3)))))","v":1},{"$f":"IF(G59=19,3,IF(ISBLANK(B59),\"\",IF(B59=19,0,IF(D59<18,1,IF(D59=18,2,IF(D59>=20,3))))))","v":3},null,null,null,null,null,{"$f":"IF(B59>D59,A59&C59,IF(D59>B59,C59&A59,\"/\"))","v":"AAAE"},null,{"$f":"A59&C59","v":"AEAA"},{"$f":"E59","v":1},{"$f":"C59&A59","v":"AAAE"},{"$f":"F59","v":3},{"$f":"B59","v":10},{"$f":"D59","v":26}]
["AG",14,"AC",{"$f":"IF(G60=19,19,IF(ISBLANK(B60),\"\",IF(B60=19,0,36-B60)))","v":22},{"$f":"IF(G60=19,0,IF(ISBLANK(B60),\"\",IF(B60<18,1,IF(B60=18,2,IF(B60>18,3)))))","v":1},{"$f":"IF(G60=19,3,IF(ISBLANK(B60),\"\",IF(B60=19,0,IF(D60<18,1,IF(D60=18,2,IF(D60>=20,3))))))","v":3},null,null,null,null,null,{"$f":"IF(B60>D60,A60&C60,IF(D60>B60,C60&A60,\"/\"))","v":"ACAG"},null,{"$f":"A60&C60","v":"AGAC"},{"$f":"E60","v":1},{"$f":"C60&A60","v":"ACAG"},{"$f":"F60","v":3},{"$f":"B60","v":14},{"$f":"D60","v":22}]
["AF",22,"AH",{"$f":"IF(G61=19,19,IF(ISBLANK(B61),\"\",IF(B61=19,0,36-B61)))","v":14},{"$f":"IF(G61=19,0,IF(ISBLANK(B61),\"\",IF(B61<18,1,IF(B61=18,2,IF(B61>18,3)))))","v":3},{"$f":"IF(G61=19,3,IF(ISBLANK(B61),\"\",IF(B61=19,0,IF(D61<18,1,IF(D61=18,2,IF(D61>=20,3))))))","v":1},null,null,null,null,null,{"$f":"IF(B61>D61,A61&C61,IF(D61>B61,C61&A61,\"/\"))","v":"AFAH"},null,{"$f":"A61&C61","v":"AFAH"},{"$f":"E61","v":3},{"$f":"C61&A61","v":"AHAF"},{"$f":"F61","v":1},{"$f":"B61","v":22},{"$f":"D61","v":14}]
[]
["7 éme MATCH le","à","AG"]
[null,null,null,null,null,null,"SI forfait éq recevante",null," "]
["Equipes","score","Equipes","score","Points","Points"]
["AA",20,"AG",{"$f":"IF(G66=19,19,IF(ISBLANK(B66),\"\",IF(B66=19,0,36-B66)))","v":16},{"$f":"IF(G66=19,0,IF(ISBLANK(B66),\"\",IF(B66<18,1,IF(B66=18,2,IF(B66>18,3)))))","v":3},{"$f":"IF(G66=19,3,IF(ISBLANK(B66),\"\",IF(B66=19,0,IF(D66<18,1,IF(D66=18,2,IF(D66>=20,3))))))","v":1},null,null,null,null,null,{"$f":"IF(B66>D66,A66&C66,IF(D66>B66,C66&A66,\"/\"))","v":"AAAG"},null,{"$f":"A66&C66","v":"AAAG"},{"$f":"E66","v":3},{"$f":"C66&A66","v":"AGAA"},{"$f":"F66","v":1},{"$f":"B66","v":20},{"$f":"D66","v":16}]
["AB",12,"AF",{"$f":"IF(G67=19,19,IF(ISBLANK(B67),\"\",IF(B67=19,0,36-B67)))","v":24},{"$f":"IF(G67=19,0,IF(ISBLANK(B67),\"\",IF(B67<18,1,IF(B67=18,2,IF(B67>18,3)))))","v":1},{"$f":"IF(G67=19,3,IF(ISBLANK(B67),\"\",IF(B67=19,0,IF(D67<18,1,IF(D67=18,2,IF(D67>=20,3))))))","v":3},null,null,null,null,null,{"$f":"IF(B67>D67,A67&C67,IF(D67>B67,C67&A67,\"/\"))","v":"AFAB"},null,{"$f":"A67&C67","v":"ABAF"},{"$f":"E67","v":1},{"$f":"C67&A67","v":"AFAB"},{"$f":"F67","v":3},{"$f":"B67","v":12},{"$f":"D67","v":24}]
["AE",22,"AD",{"$f":"IF(G68=19,19,IF(ISBLANK(B68),\"\",IF(B68=19,0,36-B68)))","v":14},{"$f":"IF(G68=19,0,IF(ISBLANK(B68),\"\",IF(B68<18,1,IF(B68=18,2,IF(B68>18,3)))))","v":3},{"$f":"IF(G68=19,3,IF(ISBLANK(B68),\"\",IF(B68=19,0,IF(D68<18,1,IF(D68=18,2,IF(D68>=20,3))))))","v":1},null,null,null,null,null,{"$f":"IF(B68>D68,A68&C68,IF(D68>B68,C68&A68,\"/\"))","v":"AEAD"},null,{"$f":"A68&C68","v":"AEAD"},{"$f":"E68","v":3},{"$f":"C68&A68","v":"ADAE"},{"$f":"F68","v":1},{"$f":"B68","v":22},{"$f":"D68","v":14}]
["AC",18,"AH",{"$f":"IF(G69=19,19,IF(ISBLANK(B69),\"\",IF(B69=19,0,36-B69)))","v":18},{"$f":"IF(G69=19,0,IF(ISBLANK(B69),\"\",IF(B69<18,1,IF(B69=18,2,IF(B69>18,3)))))","v":2},{"$f":"IF(G69=19,3,IF(ISBLANK(B69),\"\",IF(B69=19,0,IF(D69<18,1,IF(D69=18,2,IF(D69>=20,3))))))","v":2},null,null,null,null,null,{"$f":"IF(B69>D69,A69&C69,IF(D69>B69,C69&A69,\"/\"))","v":"/"},null,{"$f":"A69&C69","v":"ACAH"},{"$f":"E69","v":2},{"$f":"C69&A69","v":"AHAC"},{"$f":"F69","v":2},{"$f":"B69","v":18},{"$f":"D69","v":18}]
[null,null,"Si pas d'exaequo",null,null,null,"Classt        Final","Rencontres entre exaequos"]
["EQUIPES",null,"POINTS","POUR","CONTRE","DIFF",null,"POINTS Exaequos","Exaq","n°","AA","AB","AC","AD","AE","AF","AG","AH","Pts matchs",null,null,null,"1000000*Pts matchs +1000 (Diff +  abs(diff mini) )+Pour ","RANG","DIFF Exaequos","POUR Exaequos"]
["AC","1C",16,132,120,12,1,{"$f":"IF(S72>0,S72,\"\")","v":7},{"$f":"COUNTIF($C$72:$C$79,C72)","v":4},{"$f":"IF(AND(I72>1,COUNTIFS(I$72:I72,I72,C$72:C72,C72)=1),MAX(J$71:J71)+1,\"\")","v":1},{"$f":"IF($A72=K$71,\"\",IF(INDEX($C$72:$C$79,MATCH(K$71,$A$72:$A$79,0))=$C72,IFERROR(VLOOKUP($A72&K$71,$N$18:$O$69,2,0),  VLOOKUP(K$71&$A72,$N$18:$Q$69,4,0)),          \"\"))","v":""},1,"","","",3,3,"",{"$f":"SUM(K72:R72)","v":7},null,null,null,{"$f":"IF(I72<3,S72*1000000+(F72+ABS(MIN($F$72:$F$79)))*1000+D72,S72*1000000+U96*1000+Z72)","v":7028054},{"$f":"IF(I72>2,RANK(W72,OFFSET(W$71,MATCH(I72,$I$72:$I$79,0),,I72)))","v":2},{"$f":"IF(S96=0,\"\",S96)","v":""},{"$f":"IF(S80=0,\"\",S80)","v":54}]
["AG","1G",16,158,94,64,2,7,4,{"$f":"IF(AND(I73>1,COUNTIFS(I$72:I73,I73,C$72:C73,C73)=1),MAX(J$71:J72)+1,\"\")","v":""},"",3,1,"","",3,"","",{"$f":"SUM(K73:R73)","v":7},null,null,null,{"$f":"IF(I73<3,S73*1000000+(F73+ABS(MIN($F$72:$F$79)))*1000+D73,S73*1000000+U97*1000+Z73)","v":7064072},{"$f":"IF(I73>2,RANK(W73,OFFSET(W$71,MATCH(I73,$I$72:$I$79,0),,I73)))","v":1},36,72]
["AF","1F",16,136,116,20,3,5,4,{"$f":"IF(AND(I74>1,COUNTIFS(I$72:I74,I74,C$72:C74,C74)=1),MAX(J$71:J73)+1,\"\")","v":""},"",3,1,"","","",1,"",5,null,null,null,5020050,3,-8,50]
["AB","1B",16,136,116,20,4,5,4,{"$f":"IF(AND(I75>1,COUNTIFS(I$72:I75,I75,C$72:C75,C75)=1),MAX(J$71:J74)+1,\"\")","v":""},"","",3,"","",1,1,"",5,null,null,null,5000040,4,-28,40]
["AA","1A",15,134,118,16,5,"",1,{"$f":"IF(AND(I76>1,COUNTIFS(I$72:I76,I76,C$72:C76,C76)=1),MAX(J$71:J75)+1,\"\")","v":""},"","","","","","","","",0,null,null,null,68134,false,"",""]
["AH","1H",12,110,142,-32,6,"",1,{"$f":"IF(AND(I77>1,COUNTIFS(I$72:I77,I77,C$72:C77,C77)=1),MAX(J$71:J76)+1,\"\")","v":""},"","","","","","","","",0,null,null,null,20110,false,"",""]
["AD","1D",11,102,150,-48,7,"",1,{"$f":"IF(AND(I78>1,COUNTIFS(I$72:I78,I78,C$72:C78,C78)=1),MAX(J$71:J77)+1,\"\")","v":""},"","","","","","","","",0,null,null,null,4102,false,"",""]
["AE","1E",10,100,152,-52,8,"",1,{"$f":"IF(AND(I79>1,COUNTIFS(I$72:I79,I79,C$72:C79,C79)=1),MAX(J$71:J78)+1,\"\")","v":""},"","","","","","","","",0,null,null,null,100,false,"",""]
[null,null,null,null,null,null,null,null,"POUR",{"$f":"A72","v":"AC"},{"$f":"IF($A72=K$71,\"\",IF(INDEX($C$72:$C$79,MATCH(K$71,$A$72:$A$79,0))=$C72,IFERROR(VLOOKUP($A72&K$71,$N$18:$R$69,5,0),  VLOOKUP(K$71&$A72,$N$18:$S$69,6,0)),          \"\"))","v":""},12,"","","",20,22,"",54]
[null,null,null,null,null,null,null,null,null,"AG","",32,14,"","",26,"","",72]
[null,null,null,null,null,null,null,null,null,"AF","",24,16,"","","",10,"",50]
[null,null,null,null,null,null,null,null,null,"AB","","",24,"","",12,4,"",40]
[null,null,null,null,null,null,null,null,null,"AA","","","","","","","","",0,null,null,null,null,null,"  "]
[null,null,null,null,null,null,null,null,null,"AH","","","","","","","","",0]
[null,null,null,null,null,null,null,null,null,"AD","","","","","","","","",0]
[null,null,null,null,null,null,null,null,null,"AE","","","","","","","","",0]
[null,null,null,null,null,null,null,null,"CONTRE",{"$f":"J80","v":"AC"},{"$f":"INDEX($K$80:$R$87,MATCH(K$71,$J$80:$J$87,0),MATCH($J80,$K$71:$R$71,0))","v":""},{"$f":"INDEX($K$80:$R$87,MATCH(L$71,$J$80:$J$87,0),MATCH($J80,$K$71:$R$71,0))","v":24},"","","",16,14,"",54]
[null,null,null,null,null,null,null,null,null,{"$f":"J81","v":"AG"},{"$f":"INDEX($K$80:$R$87,MATCH(K$71,$J$80:$J$87,0),MATCH($J81,$K$71:$R$71,0))","v":""},4,22,"","",10,"","",36]
[null,null,null,null,null,null,null,null,null,"AF","",12,20,"","","",26,"",58]
[null,null,null,null,null,null,null,null,null,"AB","","",12,"","",24,32,"",68]
[null,null,null,null,null,null,null,null,null,"AA","","","","","","","","",0]
[null,null,null,null,null,null,null,null,null,"AH","","","","","","","","",0]
[null,null,null,null,null,null,null,null,null,"AD","","","","","","","","",0]
[null,null,null,null,null,null,null,null,null,"AE","","","","","","","","",0,null,"Diff pondérée"]
[null,null,null,null,null,null,null,null,"DIFF",{"$f":"J88","v":"AC"},null,null,null,null,null,null,null,null,{"$f":"S80-S88","v":0},null,{"$f":"S96+ABS(MIN($S$96:$S$103))","v":28}]
[null,null,null,null,null,null,null,null,null,{"$f":"J89","v":"AG"},null,null,null,null,null,null,null,null,{"$f":"S81-S89","v":36},null,64]
[null,null,null,null,null,null,null,null,null,"AF",null,null,null,null,null,null,null,null,-8,null,20]
[null,null,null,null,null,null,null,null,null,"AB",null,null,null,null,null,null,null,null,-28,null,0]
[null,null,null,null,null,null,null,null,null,"AA",null,null,null,null,null,null,null,null,0,null,28]
[null,null,null,null,null,null,null,null,null,"AH",null,null,null,null,null,null,null,null,0,null,28]
[null,null,null,null,null,null,null,null,null,"AD",null,null,null,null,null,null,null,null,0,null,{"$f":"S102+ABS(MIN($S$96:$S$103))","v":28}]
[null,null,null,null,null,null,null,null,null,"AE",null,null,null,null,null,null,null,null,0,null,{"$f":"S103+ABS(MIN($S$96:$S$103))","v":28}]

{"sheet":"P5","index":4,"n_rows":103,"n_cols":26,"rows_kept":103,"cut":false,"hidden":false,"merged":[[0,0,0,5],[1,0,1,5],[2,0,2,5],[3,0,3,5],[3,8,3,10],[15,6,16,6],[69,2,69,5],[69,6,70,6],[69,7,69,25],[23,6,24,6],[31,6,32,6],[39,6,40,6],[47,6,48,6],[55,6,56,6],[63,6,64,6]]}
[null,null,null,null,null,null,3]
["CHAMPIONNAT DES CLUBS"]
[]
["POULE 1"]
["EQUIPES",null,"POINTS","Pour","Contre","Diff"]
["AA","1A",{"$f":"SUMIF($A$18:$A$69,A6,$E$18:$E$69)+SUMIF($C$18:$C$69,A6,$F$18:$F$69)","v":16},{"$f":"SUMIF($A$18:$A$69,$A6,$B$18:$B$69)+SUMIF($C$18:$C$69,$A6,$D$18:$D$69)","v":120},{"$f":"SUMIF($C$18:$C$69,$A6,$B$18:$B$69)+SUMIF($A$18:$A$69,$A6,$D$18:$D$69)","v":132},{"$f":"D6-E6","v":-12}]
["AB","1B",{"$f":"SUMIF($A$18:$A$69,A7,$E$18:$E$69)+SUMIF($C$18:$C$69,A7,$F$18:$F$69)","v":11},{"$f":"SUMIF($A$18:$A$69,$A7,$B$18:$B$69)+SUMIF($C$18:$C$69,$A7,$D$18:$D$69)","v":114},{"$f":"SUMIF($C$18:$C$69,$A7,$B$18:$B$69)+SUMIF($A$18:$A$69,$A7,$D$18:$D$69)","v":138},-24]
["AC","1C",{"$f":"SUMIF($A$18:$A$69,A8,$E$18:$E$69)+SUMIF($C$18:$C$69,A8,$F$18:$F$69)","v":16},122,130,-8]
["AD","1D",11,100,152,-52]
["AE","1E",18,158,94,64]
["AF","1F",13,122,130,-8]
["AG","1G",15,150,102,{"$f":"D12-E12","v":48}]
["AH","1H",12,{"$f":"SUMIF($A$18:$A$69,$A13,$B$18:$B$69)+SUMIF($C$18:$C$69,$A13,$D$18:$D$69)","v":122},130,{"$f":"D13-E13","v":-8}]
[]
["1er MATCH le ","à","AA"]
[null,null,null,null,null,null,"SI forfait éq recevante"]
["Equipes","score","Equipes","score","Points","Points"]
["AA",20,"AB",{"$f":"IF(G18=19,19,IF(ISBLANK(B18),\"\",IF(B18=19,0,36-B18)))","v":16},{"$f":"IF(G18=19,0,IF(ISBLANK(B18),\"\",IF(B18<18,1,IF(B18=18,2,IF(B18>18,3)))))","v":3},{"$f":"IF(G18=19,3,IF(ISBLANK(B18),\"\",IF(B18=19,0,IF(D18<18,1,IF(D18=18,2,IF(D18>=20,3))))))","v":1},null,null,null,null,null,{"$f":"IF(B18>D18,A18&C18,IF(D18>B18,C18&A18,\"/\"))","v":"AAAB"},null,{"$f":"A18&C18","v":"AAAB"},{"$f":"E18","v":3},{"$f":"C18&A18","v":"ABAA"},{"$f":"F18","v":1},{"$f":"B18","v":20},{"$f":"D18","v":16}]
["AC",30,"AD",{"$f":"IF(G19=19,19,IF(ISBLANK(B19),\"\",IF(B19=19,0,36-B19)))","v":6},{"$f":"IF(G19=19,0,IF(ISBLANK(B19),\"\",IF(B19<18,1,IF(B19=18,2,IF(B19>18,3)))))","v":3},{"$f":"IF(G19=19,3,IF(ISBLANK(B19),\"\",IF(B19=19,0,IF(D19<18,1,IF(D19=18,2,IF(D19>=20,3))))))","v":1},null,null,null,null,null,{"$f":"IF(B19>D19,A19&C19,IF(D19>B19,C19&A19,\"/\"))","v":"ACAD"},null,{"$f":"A19&C19","v":"ACAD"},{"$f":"E19","v":3},{"$f":"C19&A19","v":"ADAC"},{"$f":"F19","v":1},{"$f":"B19","v":30},{"$f":"D19","v":6}]
["AE",22,"AF",{"$f":"IF(G20=19,19,IF(ISBLANK(B20),\"\",IF(B20=19,0,36-B20)))","v":14},{"$f":"IF(G20=19,0,IF(ISBLANK(B20),\"\",IF(B20<18,1,IF(B20=18,2,IF(B20>18,3)))))","v":3},{"$f":"IF(G20=19,3,IF(ISBLANK(B20),\"\",IF(B20=19,0,IF(D20<18,1,IF(D20=18,2,IF(D20>=20,3))))))","v":1},null,null,null,null,null,{"$f":"IF(B20>D20,A20&C20,IF(D20>B20,C20&A20,\"/\"))","v":"AEAF"},null,{"$f":"A20&C20","v":"AEAF"},{"$f":"E20","v":3},{"$f":"C20&A20","v":"AFAE"},{"$f":"F20","v":1},{"$f":"B20","v":22},{"$f":"D20","v":14}]
["AG",18,"AH",{"$f":"IF(G21=19,19,IF(ISBLANK(B21),\"\",IF(B21=19,0,36-B21)))","v":18},{"$f":"IF(G21=19,0,IF(ISBLANK(B21),\"\",IF(B21<18,1,IF(B21=18,2,IF(B21>18,3)))))","v":2},{"$f":"IF(G21=19,3,IF(ISBLANK(B21),\"\",IF(B21=19,0,IF(D21<18,1,IF(D21=18,2,IF(D21>=20,3))))))","v":2},null,null,null,null,null,{"$f":"IF(B21>D21,A21&C21,IF(D21>B21,C21&A21,\"/\"))","v":"/"},null,{"$f":"A21&C21","v":"AGAH"},{"$f":"E21","v":2},{"$f":"C21&A21","v":"AHAG"},{"$f":"F21","v":2},{"$f":"B21","v":18},{"$f":"D21","v":18}]
[]
["2 éme MATCH le ","à","AB"]
[null,null,null,null,null,null,"SI forfait éq recevante"]
["Equipes","score","Equipes","score","Points","Points"]
["AA",10,"AC",{"$f":"IF(G26=19,19,IF(ISBLANK(B26),\"\",IF(B26=19,0,36-B26)))","v":26},{"$f":"IF(G26=19,0,IF(ISBLANK(B26),\"\",IF(B26<18,1,IF(B26=18,2,IF(B26>18,3)))))","v":1},{"$f":"IF(G26=19,3,IF(ISBLANK(B26),\"\",IF(B26=19,0,IF(D26<18,1,IF(D26=18,2,IF(D26>=20,3))))))","v":3},null,null,null,null,null,{"$f":"IF(B26>D26,A26&C26,IF(D26>B26,C26&A26,\"/\"))","v":"ACAA"},null,{"$f":"A26&C26","v":"AAAC"},{"$f":"E26","v":1},{"$f":"C26&A26","v":"ACAA"},{"$f":"F26","v":3},{"$f":"B26","v":10},{"$f":"D26","v":26}]
["AB",14,"AH",{"$f":"IF(G27=19,19,IF(ISBLANK(B27),\"\",IF(B27=19,0,36-B27)))","v":22},{"$f":"IF(G27=19,0,IF(ISBLANK(B27),\"\",IF(B27<18,1,IF(B27=18,2,IF(B27>18,3)))))","v":1},{"$f":"IF(G27=19,3,IF(ISBLANK(B27),\"\",IF(B27=19,0,IF(D27<18,1,IF(D27=18,2,IF(D27>=20,3))))))","v":3},null,null,null,null,null,{"$f":"IF(B27>D27,A27&C27,IF(D27>B27,C27&A27,\"/\"))","v":"AHAB"},null,{"$f":"A27&C27","v":"ABAH"},{"$f":"E27","v":1},{"$f":"C27&A27","v":"AHAB"},{"$f":"F27","v":3},{"$f":"B27","v":14},{"$f":"D27","v":22}]
["AD",18,"AF",{"$f":"IF(G28=19,19,IF(ISBLANK(B28),\"\",IF(B28=19,0,36-B28)))","v":18},{"$f":"IF(G28=19,0,IF(ISBLANK(B28),\"\",IF(B28<18,1,IF(B28=18,2,IF(B28>18,3)))))","v":2},{"$f":"IF(G28=19,3,IF(ISBLANK(B28),\"\",IF(B28=19,0,IF(D28<18,1,IF(D28=18,2,IF(D28>=20,3))))))","v":2},null,null,null,null,null,{"$f":"IF(B28>D28,A28&C28,IF(D28>B28,C28&A28,\"/\"))","v":"/"},null,{"$f":"A28&C28","v":"ADAF"},{"$f":"E28","v":2},{"$f":"C28&A28","v":"AFAD"},{"$f":"F28","v":2},{"$f":"B28","v":18},{"$f":"D28","v":18}]
["AE",28,"AG",{"$f":"IF(G29=19,19,IF(ISBLANK(B29),\"\",IF(B29=19,0,36-B29)))","v":8},{"$f":"IF(G29=19,0,IF(ISBLANK(B29),\"\",IF(B29<18,1,IF(B29=18,2,IF(B29>18,3)))))","v":3},{"$f":"IF(G29=19,3,IF(ISBLANK(B29),\"\",IF(B29=19,0,IF(D29<18,1,IF(D29=18,2,IF(D29>=20,3))))))","v":1},null,null,null,null,null,{"$f":"IF(B29>D29,A29&C29,IF(D29>B29,C29&A29,\"/\"))","v":"AEAG"},null,{"$f":"A29&C29","v":"AEAG"},{"$f":"E29","v":3},{"$f":"C29&A29","v":"AGAE"},{"$f":"F29","v":1},{"$f":"B29","v":28},{"$f":"D29","v":8}]
[]
["3 éme MATCH le ","à","AC"]
[null,null,null,null,null,null,"SI forfait éq recevante"]
["Equipes","score","Equipes","score","Points","Points"]
["AA",20,"AH",{"$f":"IF(G34=19,19,IF(ISBLANK(B34),\"\",IF(B34=19,0,36-B34)))","v":16},{"$f":"IF(G34=19,0,IF(ISBLANK(B34),\"\",IF(B34<18,1,IF(B34=18,2,IF(B34>18,3)))))","v":3},{"$f":"IF(G34=19,3,IF(ISBLANK(B34),\"\",IF(B34=19,0,IF(D34<18,1,IF(D34=18,2,IF(D34>=20,3))))))","v":1},null,null,null,null,null,{"$f":"IF(B34>D34,A34&C34,IF(D34>B34,C34&A34,\"/\"))","v":"AAAH"},null,{"$f":"A34&C34","v":"AAAH"},{"$f":"E34","v":3},{"$f":"C34&A34","v":"AHAA"},{"$f":"F34","v":1},{"$f":"B34","v":20},{"$f":"D34","v":16}]
["AB",6,"AE",{"$f":"IF(G35=19,19,IF(ISBLANK(B35),\"\",IF(B35=19,0,36-B35)))","v":30},{"$f":"IF(G35=19,0,IF(ISBLANK(B35),\"\",IF(B35<18,1,IF(B35=18,2,IF(B35>18,3)))))","v":1},{"$f":"IF(G35=19,3,IF(ISBLANK(B35),\"\",IF(B35=19,0,IF(D35<18,1,IF(D35=18,2,IF(D35>=20,3))))))","v":3},null,null,null,null,null,{"$f":"IF(B35>D35,A35&C35,IF(D35>B35,C35&A35,\"/\"))","v":"AEAB"},null,{"$f":"A35&C35","v":"ABAE"},{"$f":"E35","v":1},{"$f":"C35&A35","v":"AEAB"},{"$f":"F35","v":3},{"$f":"B35","v":6},{"$f":"D35","v":30}]
["AC",20,"AF",{"$f":"IF(G36=19,19,IF(ISBLANK(B36),\"\",IF(B36=19,0,36-B36)))","v":16},{"$f":"IF(G36=19,0,IF(ISBLANK(B36),\"\",IF(B36<18,1,IF(B36=18,2,IF(B36>18,3)))))","v":3},{"$f":"IF(G36=19,3,IF(ISBLANK(B36),\"\",IF(B36=19,0,IF(D36<18,1,IF(D36=18,2,IF(D36>=20,3))))))","v":1},null,null,null,null,null,{"$f":"IF(B36>D36,A36&C36,IF(D36>B36,C36&A36,\"/\"))","v":"ACAF"},null,{"$f":"A36&C36","v":"ACAF"},{"$f":"E36","v":3},{"$f":"C36&A36","v":"AFAC"},{"$f":"F36","v":1},{"$f":"B36","v":20},{"$f":"D36","v":16}]
["AD",18,"AG",{"$f":"IF(G37=19,19,IF(ISBLANK(B37),\"\",IF(B37=19,0,36-B37)))","v":18},{"$f":"IF(G37=19,0,IF(ISBLANK(B37),\"\",IF(B37<18,1,IF(B37=18,2,IF(B37>18,3)))))","v":2},{"$f":"IF(G37=19,3,IF(ISBLANK(B37),\"\",IF(B37=19,0,IF(D37<18,1,IF(D37=18,2,IF(D37>=20,3))))))","v":2},null,null,null,null,null,{"$f":"IF(B37>D37,A37&C37,IF(D37>B37,C37&A37,\"/\"))","v":"/"},null,{"$f":"A37&C37","v":"ADAG"},{"$f":"E37","v":2},{"$f":"C37&A37","v":"AGAD"},{"$f":"F37","v":2},{"$f":"B37","v":18},{"$f":"D37","v":18}]
[]
["4 éme MATCH le ","à","AD"]
[null,null,null,null,null,null,"SI forfait éq recevante"]
["Equipes","score","Equipes","score","Points","Points"]
["AA",20,"AD",{"$f":"IF(G42=19,19,IF(ISBLANK(B42),\"\",IF(B42=19,0,36-B42)))","v":16},{"$f":"IF(G42=19,0,IF(ISBLANK(B42),\"\",IF(B42<18,1,IF(B42=18,2,IF(B42>18,3)))))","v":3},{"$f":"IF(G42=19,3,IF(ISBLANK(B42),\"\",IF(B42=19,0,IF(D42<18,1,IF(D42=18,2,IF(D42>=20,3))))))","v":1},null,null,null,null,null,{"$f":"IF(B42>D42,A42&C42,IF(D42>B42,C42&A42,\"/\"))","v":"AAAD"},null,{"$f":"A42&C42","v":"AAAD"},{"$f":"E42","v":3},{"$f":"C42&A42","v":"ADAA"},{"$f":"F42","v":1},{"$f":"B42","v":20},{"$f":"D42","v":16}]
["AF",10,"AG",{"$f":"IF(G43=19,19,IF(ISBLANK(B43),\"\",IF(B43=19,0,36-B43)))","v":26},{"$f":"IF(G43=19,0,IF(ISBLANK(B43),\"\",IF(B43<18,1,IF(B43=18,2,IF(B43>18,3)))))","v":1},{"$f":"IF(G43=19,3,IF(ISBLANK(B43),\"\",IF(B43=19,0,IF(D43<18,1,IF(D43=18,2,IF(D43>=20,3))))))","v":3},null,null,null,null,null,{"$f":"IF(B43>D43,A43&C43,IF(D43>B43,C43&A43,\"/\"))","v":"AGAF"},null,{"$f":"A43&C43","v":"AFAG"},{"$f":"E43","v":1},{"$f":"C43&A43","v":"AGAF"},{"$f":"F43","v":3},{"$f":"B43","v":10},{"$f":"D43","v":26}]
["AB",32,"AC",{"$f":"IF(G44=19,19,IF(ISBLANK(B44),\"\",IF(B44=19,0,36-B44)))","v":4},{"$f":"IF(G44=19,0,IF(ISBLANK(B44),\"\",IF(B44<18,1,IF(B44=18,2,IF(B44>18,3)))))","v":3},{"$f":"IF(G44=19,3,IF(ISBLANK(B44),\"\",IF(B44=19,0,IF(D44<18,1,IF(D44=18,2,IF(D44>=20,3))))))","v":1},null,null,null,null,null,{"$f":"IF(B44>D44,A44&C44,IF(D44>B44,C44&A44,\"/\"))","v":"ABAC"},null,{"$f":"A44&C44","v":"ABAC"},{"$f":"E44","v":3},{"$f":"C44&A44","v":"ACAB"},{"$f":"F44","v":1},{"$f":"B44","v":32},{"$f":"D44","v":4}]
["AE",20,"AH",{"$f":"IF(G45=19,19,IF(ISBLANK(B45),\"\",IF(B45=19,0,36-B45)))","v":16},{"$f":"IF(G45=19,0,IF(ISBLANK(B45),\"\",IF(B45<18,1,IF(B45=18,2,IF(B45>18,3)))))","v":3},{"$f":"IF(G45=19,3,IF(ISBLANK(B45),\"\",IF(B45=19,0,IF(D45<18,1,IF(D45=18,2,IF(D45>=20,3))))))","v":1},null,null,null,null,null,{"$f":"IF(B45>D45,A45&C45,IF(D45>B45,C45&A45,\"/\"))","v":"AEAH"},null,{"$f":"A45&C45","v":"AEAH"},{"$f":"E45","v":3},{"$f":"C45&A45","v":"AHAE"},{"$f":"F45","v":1},{"$f":"B45","v":20},{"$f":"D45","v":16}]
[]
["5 éme MATCH le ","à","AE"]
[null,null,null,null,null,null,"SI forfait éq recevante"]
["Equipes","score","Equipes","score","Points","Points"]
["AA",18,"AF",{"$f":"IF(G50=19,19,IF(ISBLANK(B50),\"\",IF(B50=19,0,36-B50)))","v":18},{"$f":"IF(G50=19,0,IF(ISBLANK(B50),\"\",IF(B50<18,1,IF(B50=18,2,IF(B50>18,3)))))","v":2},{"$f":"IF(G50=19,3,IF(ISBLANK(B50),\"\",IF(B50=19,0,IF(D50<18,1,IF(D50=18,2,IF(D50>=20,3))))))","v":2},null,null,null,null,null,{"$f":"IF(B50>D50,A50&C50,IF(D50>B50,C50&A50,\"/\"))","v":"/"},null,{"$f":"A50&C50","v":"AAAF"},{"$f":"E50","v":2},{"$f":"C50&A50","v":"AFAA"},{"$f":"F50","v":2},{"$f":"B50","v":18},{"$f":"D50","v":18}]
["AD",18,"AH",{"$f":"IF(G51=19,19,IF(ISBLANK(B51),\"\",IF(B51=19,0,36-B51)))","v":18},{"$f":"IF(G51=19,0,IF(ISBLANK(B51),\"\",IF(B51<18,1,IF(B51=18,2,IF(B51>18,3)))))","v":2},{"$f":"IF(G51=19,3,IF(ISBLANK(B51),\"\",IF(B51=19,0,IF(D51<18,1,IF(D51=18,2,IF(D51>=20,3))))))","v":2},null,null,null,null,null,{"$f":"IF(B51>D51,A51&C51,IF(D51>B51,C51&A51,\"/\"))","v":"/"},null,{"$f":"A51&C51","v":"ADAH"},{"$f":"E51","v":2},{"$f":"C51&A51","v":"AHAD"},{"$f":"F51","v":2},{"$f":"B51","v":18},{"$f":"D51","v":18}]
["AB",4,"AG",{"$f":"IF(G52=19,19,IF(ISBLANK(B52),\"\",IF(B52=19,0,36-B52)))","v":32},{"$f":"IF(G52=19,0,IF(ISBLANK(B52),\"\",IF(B52<18,1,IF(B52=18,2,IF(B52>18,3)))))","v":1},{"$f":"IF(G52=19,3,IF(ISBLANK(B52),\"\",IF(B52=19,0,IF(D52<18,1,IF(D52=18,2,IF(D52>=20,3))))))","v":3},null,null,null,null,null,{"$f":"IF(B52>D52,A52&C52,IF(D52>B52,C52&A52,\"/\"))","v":"AGAB"},null,{"$f":"A52&C52","v":"ABAG"},{"$f":"E52","v":1},{"$f":"C52&A52","v":"AGAB"},{"$f":"F52","v":3},{"$f":"B52","v":4},{"$f":"D52","v":32}]
["AC",20,"AE",{"$f":"IF(G53=19,19,IF(ISBLANK(B53),\"\",IF(B53=19,0,36-B53)))","v":16},{"$f":"IF(G53=19,0,IF(ISBLANK(B53),\"\",IF(B53<18,1,IF(B53=18,2,IF(B53>18,3)))))","v":3},{"$f":"IF(G53=19,3,IF(ISBLANK(B53),\"\",IF(B53=19,0,IF(D53<18,1,IF(D53=18,2,IF(D53>=20,3))))))","v":1},null,null,null,null,null,{"$f":"IF(B53>D53,A53&C53,IF(D53>B53,C53&A53,\"/\"))","v":"ACAE"},null,{"$f":"A53&C53","v":"ACAE"},{"$f":"E53","v":3},{"$f":"C53&A53","v":"AEAC"},{"$f":"F53","v":1},{"$f":"B53","v":20},{"$f":"D53","v":16}]
[]
["6 éme MATCH le ","à","AF"]
[null,null,null,null,null,null,"SI forfait éq recevante"]
["Equipes","score","Equipes","score","Points","Points"]
["AB",30,"AD",{"$f":"IF(G58=19,19,IF(ISBLANK(B58),\"\",IF(B58=19,0,36-B58)))","v":6},{"$f":"IF(G58=19,0,IF(ISBLANK(B58),\"\",IF(B58<18,1,IF(B58=18,2,IF(B58>18,3)))))","v":3},{"$f":"IF(G58=19,3,IF(ISBLANK(B58),\"\",IF(B58=19,0,IF(D58<18,1,IF(D58=18,2,IF(D58>=20,3))))))","v":1},null,null,null,null,null,{"$f":"IF(B58>D58,A58&C58,IF(D58>B58,C58&A58,\"/\"))","v":"ABAD"},null,{"$f":"A58&C58","v":"ABAD"},{"$f":"E58","v":3},{"$f":"C58&A58","v":"ADAB"},{"$f":"F58","v":1},{"$f":"B58","v":30},{"$f":"D58","v":6}]
["AE",24,"AA",{"$f":"IF(G59=19,19,IF(ISBLANK(B59),\"\",IF(B59=19,0,36-B59)))","v":12},{"$f":"IF(G59=19,0,IF(ISBLANK(B59),\"\",IF(B59<18,1,IF(B59=18,2,IF(B59>18,3)))))","v":3},{"$f":"IF(G59=19,3,IF(ISBLANK(B59),\"\",IF(B59=19,0,IF(D59<18,1,IF(D59=18,2,IF(D59>=20,3))))))","v":1},null,null,null,null,null,{"$f":"IF(B59>D59,A59&C59,IF(D59>B59,C59&A59,\"/\"))","v":"AEAA"},null,{"$f":"A59&C59","v":"AEAA"},{"$f":"E59","v":3},{"$f":"C59&A59","v":"AAAE"},{"$f":"F59","v":1},{"$f":"B59","v":24},{"$f":"D59","v":12}]
["AG",32,"AC",{"$f":"IF(G60=19,19,IF(ISBLANK(B60),\"\",IF(B60=19,0,36-B60)))","v":4},{"$f":"IF(G60=19,0,IF(ISBLANK(B60),\"\",IF(B60<18,1,IF(B60=18,2,IF(B60>18,3)))))","v":3},{"$f":"IF(G60=19,3,IF(ISBLANK(B60),\"\",IF(B60=19,0,IF(D60<18,1,IF(D60=18,2,IF(D60>=20,3))))))","v":1},null,null,null,null,null,{"$f":"IF(B60>D60,A60&C60,IF(D60>B60,C60&A60,\"/\"))","v":"AGAC"},null,{"$f":"A60&C60","v":"AGAC"},{"$f":"E60","v":3},{"$f":"C60&A60","v":"ACAG"},{"$f":"F60","v":1},{"$f":"B60","v":32},{"$f":"D60","v":4}]
["AF",22,"AH",{"$f":"IF(G61=19,19,IF(ISBLANK(B61),\"\",IF(B61=19,0,36-B61)))","v":14},{"$f":"IF(G61=19,0,IF(ISBLANK(B61),\"\",IF(B61<18,1,IF(B61=18,2,IF(B61>18,3)))))","v":3},{"$f":"IF(G61=19,3,IF(ISBLANK(B61),\"\",IF(B61=19,0,IF(D61<18,1,IF(D61=18,2,IF(D61>=20,3))))))","v":1},null,null,null,null,null,{"$f":"IF(B61>D61,A61&C61,IF(D61>B61,C61&A61,\"/\"))","v":"AFAH"},null,{"$f":"A61&C61","v":"AFAH"},{"$f":"E61","v":3},{"$f":"C61&A61","v":"AHAF"},{"$f":"F61","v":1},{"$f":"B61","v":22},{"$f":"D61","v":14}]
[]
["7 éme MATCH le","à","AG"]
[null,null,null,null,null,null,"SI forfait éq recevante",null," "]
["Equipes","score","Equipes","score","Points","Points"]
["AA",20,"AG",{"$f":"IF(G66=19,19,IF(ISBLANK(B66),\"\",IF(B66=19,0,36-B66)))","v":16},{"$f":"IF(G66=19,0,IF(ISBLANK(B66),\"\",IF(B66<18,1,IF(B66=18,2,IF(B66>18,3)))))","v":3},{"$f":"IF(G66=19,3,IF(ISBLANK(B66),\"\",IF(B66=19,0,IF(D66<18,1,IF(D66=18,2,IF(D66>=20,3))))))","v":1},null,null,null,null,null,{"$f":"IF(B66>D66,A66&C66,IF(D66>B66,C66&A66,\"/\"))","v":"AAAG"},null,{"$f":"A66&C66","v":"AAAG"},{"$f":"E66","v":3},{"$f":"C66&A66","v":"AGAA"},{"$f":"F66","v":1},{"$f":"B66","v":20},{"$f":"D66","v":16}]
["AB",12,"AF",{"$f":"IF(G67=19,19,IF(ISBLANK(B67),\"\",IF(B67=19,0,36-B67)))","v":24},{"$f":"IF(G67=19,0,IF(ISBLANK(B67),\"\",IF(B67<18,1,IF(B67=18,2,IF(B67>18,3)))))","v":1},{"$f":"IF(G67=19,3,IF(ISBLANK(B67),\"\",IF(B67=19,0,IF(D67<18,1,IF(D67=18,2,IF(D67>=20,3))))))","v":3},null,null,null,null,null,{"$f":"IF(B67>D67,A67&C67,IF(D67>B67,C67&A67,\"/\"))","v":"AFAB"},null,{"$f":"A67&C67","v":"ABAF"},{"$f":"E67","v":1},{"$f":"C67&A67","v":"AFAB"},{"$f":"F67","v":3},{"$f":"B67","v":12},{"$f":"D67","v":24}]
["AE",18,"AD",{"$f":"IF(G68=19,19,IF(ISBLANK(B68),\"\",IF(B68=19,0,36-B68)))","v":18},{"$f":"IF(G68=19,0,IF(ISBLANK(B68),\"\",IF(B68<18,1,IF(B68=18,2,IF(B68>18,3)))))","v":2},{"$f":"IF(G68=19,3,IF(ISBLANK(B68),\"\",IF(B68=19,0,IF(D68<18,1,IF(D68=18,2,IF(D68>=20,3))))))","v":2},null,null,null,null,null,{"$f":"IF(B68>D68,A68&C68,IF(D68>B68,C68&A68,\"/\"))","v":"/"},null,{"$f":"A68&C68","v":"AEAD"},{"$f":"E68","v":2},{"$f":"C68&A68","v":"ADAE"},{"$f":"F68","v":2},{"$f":"B68","v":18},{"$f":"D68","v":18}]
["AC",18,"AH",{"$f":"IF(G69=19,19,IF(ISBLANK(B69),\"\",IF(B69=19,0,36-B69)))","v":18},{"$f":"IF(G69=19,0,IF(ISBLANK(B69),\"\",IF(B69<18,1,IF(B69=18,2,IF(B69>18,3)))))","v":2},{"$f":"IF(G69=19,3,IF(ISBLANK(B69),\"\",IF(B69=19,0,IF(D69<18,1,IF(D69=18,2,IF(D69>=20,3))))))","v":2},null,null,null,null,null,{"$f":"IF(B69>D69,A69&C69,IF(D69>B69,C69&A69,\"/\"))","v":"/"},null,{"$f":"A69&C69","v":"ACAH"},{"$f":"E69","v":2},{"$f":"C69&A69","v":"AHAC"},{"$f":"F69","v":2},{"$f":"B69","v":18},{"$f":"D69","v":18}]
[null,null,"Si pas d'exaequo",null,null,null,"Classt        Final","Rencontres entre exaequos"]
["EQUIPES",null,"POINTS","POUR","CONTRE","DIFF",null,"POINTS Exaequos","Exaq","n°","AA","AB","AC","AD","AE","AF","AG","AH","Pts matchs",null,null,null,"1000000*Pts matchs +1000 (Diff +  abs(diff mini) )+Pour ","RANG","DIFF Exaequos","POUR Exaequos"]
["AE","1E",18,158,94,64,1,{"$f":"IF(S72>0,S72,\"\")","v":""},{"$f":"COUNTIF($C$72:$C$79,C72)","v":1},{"$f":"IF(AND(I72>1,COUNTIFS(I$72:I72,I72,C$72:C72,C72)=1),MAX(J$71:J71)+1,\"\")","v":""},{"$f":"IF($A72=K$71,\"\",IF(INDEX($C$72:$C$79,MATCH(K$71,$A$72:$A$79,0))=$C72,IFERROR(VLOOKUP($A72&K$71,$N$18:$O$69,2,0),  VLOOKUP(K$71&$A72,$N$18:$Q$69,4,0)),          \"\"))","v":""},"","","","","","","",{"$f":"SUM(K72:R72)","v":0},null,null,null,{"$f":"IF(I72<3,S72*1000000+(F72+ABS(MIN($F$72:$F$79)))*1000+D72,S72*1000000+U96*1000+Z72)","v":116158},{"$f":"IF(I72>2,RANK(W72,OFFSET(W$71,MATCH(I72,$I$72:$I$79,0),,I72)))","v":false},{"$f":"IF(S96=0,\"\",S96)","v":""},{"$f":"IF(S80=0,\"\",S80)","v":""}]
["AC","1C",16,122,130,-8,2,3,2,{"$f":"IF(AND(I73>1,COUNTIFS(I$72:I73,I73,C$72:C73,C73)=1),MAX(J$71:J72)+1,\"\")","v":1},3,"","","","","","","",{"$f":"SUM(K73:R73)","v":3},null,null,null,{"$f":"IF(I73<3,S73*1000000+(F73+ABS(MIN($F$72:$F$79)))*1000+D73,S73*1000000+U97*1000+Z73)","v":3044122},{"$f":"IF(I73>2,RANK(W73,OFFSET(W$71,MATCH(I73,$I$72:$I$79,0),,I73)))","v":false},16,26]
["AA","1A",16,120,132,-12,3,1,2,{"$f":"IF(AND(I74>1,COUNTIFS(I$72:I74,I74,C$72:C74,C74)=1),MAX(J$71:J73)+1,\"\")","v":""},"","",1,"","","","","",1,null,null,null,1040120,false,-16,10]
["AG","1G",15,150,102,48,4,"",1,{"$f":"IF(AND(I75>1,COUNTIFS(I$72:I75,I75,C$72:C75,C75)=1),MAX(J$71:J74)+1,\"\")","v":""},"","","","","","","","",0,null,null,null,100150,false,"",""]
["AF","1F",13,122,130,-8,5,"",1,{"$f":"IF(AND(I76>1,COUNTIFS(I$72:I76,I76,C$72:C76,C76)=1),MAX(J$71:J75)+1,\"\")","v":""},"","","","","","","","",0,null,null,null,44122,false,"",""]
["AH","1H",12,122,130,-8,6,"",1,{"$f":"IF(AND(I77>1,COUNTIFS(I$72:I77,I77,C$72:C77,C77)=1),MAX(J$71:J76)+1,\"\")","v":""},"","","","","","","","",0,null,null,null,44122,false,"",""]
["AB","1B",11,114,138,-24,7,3,2,{"$f":"IF(AND(I78>1,COUNTIFS(I$72:I78,I78,C$72:C78,C78)=1),MAX(J$71:J77)+1,\"\")","v":2},"","","",3,"","","","",3,null,null,null,3028114,false,24,30]
["AD","1D",11,100,152,-52,8,1,2,{"$f":"IF(AND(I79>1,COUNTIFS(I$72:I79,I79,C$72:C79,C79)=1),MAX(J$71:J78)+1,\"\")","v":""},"",1,"","","","","","",1,null,null,null,1000100,false,-24,6]
[null,null,null,null,null,null,null,null,"POUR",{"$f":"A72","v":"AE"},{"$f":"IF($A72=K$71,\"\",IF(INDEX($C$72:$C$79,MATCH(K$71,$A$72:$A$79,0))=$C72,IFERROR(VLOOKUP($A72&K$71,$N$18:$R$69,5,0),  VLOOKUP(K$71&$A72,$N$18:$S$69,6,0)),          \"\"))","v":""},"","","","","","","",0]
[null,null,null,null,null,null,null,null,null,"AC",26,"","","","","","","",26]
[null,null,null,null,null,null,null,null,null,"AA","","",10,"","","","","",10]
[null,null,null,null,null,null,null,null,null,"AG","","","","","","","","",0]
[null,null,null,null,null,null,null,null,null,"AF","","","","","","","","",0,null,null,null,null,null,"  "]
[null,null,null,null,null,null,null,null,null,"AH","","","","","","","","",0]
[null,null,null,null,null,null,null,null,null,"AB","","","",30,"","","","",30]
[null,null,null,null,null,null,null,null,null,"AD","",6,"","","","","","",6]
[null,null,null,null,null,null,null,null,"CONTRE",{"$f":"J80","v":"AE"},{"$f":"INDEX($K$80:$R$87,MATCH(K$71,$J$80:$J$87,0),MATCH($J80,$K$71:$R$71,0))","v":""},{"$f":"INDEX($K$80:$R$87,MATCH(L$71,$J$80:$J$87,0),MATCH($J80,$K$71:$R$71,0))","v":""},"","","","","","",0]
[null,null,null,null,null,null,null,null,null,{"$f":"J81","v":"AC"},{"$f":"INDEX($K$80:$R$87,MATCH(K$71,$J$80:$J$87,0),MATCH($J81,$K$71:$R$71,0))","v":10},"","","","","","","",10]
[null,null,null,null,null,null,null,null,null,"AA","","",26,"","","","","",26]
[null,null,null,null,null,null,null,null,null,"AG","","","","","","","","",0]
[null,null,null,null,null,null,null,null,null,"AF","","","","","","","","",0]
[null,null,null,null,null,null,null,null,null,"AH","","","","","","","","",0]
[null,null,null,null,null,null,null,null,null,"AB","","","",6,"","","","",6]
[null,null,null,null,null,null,null,null,null,"AD","",30,"","","","","","",30,null,"Diff pondérée"]
[null,null,null,null,null,null,null,null,"DIFF",{"$f":"J88","v":"AE"},null,null,null,null,null,null,null,null,{"$f":"S80-S88","v":0},null,{"$f":"S96+ABS(MIN($S$96:$S$103))","v":24}]
[null,null,null,null,null,null,null,null,null,{"$f":"J89","v":"AC"},null,null,null,null,null,null,null,null,{"$f":"S81-S89","v":16},null,40]
[null,null,null,null,null,null,null,null,null,"AA",null,null,null,null,null,null,null,null,-16,null,8]
[null,null,null,null,null,null,null,null,null,"AG",null,null,null,null,null,null,null,null,0,null,24]
[null,null,null,null,null,null,null,null,null,"AF",null,null,null,null,null,null,null,null,0,null,24]
[null,null,null,null,null,null,null,null,null,"AH",null,null,null,null,null,null,null,null,0,null,24]
[null,null,null,null,null,null,null,null,null,"AB",null,null,null,null,null,null,null,null,24,null,{"$f":"S102+ABS(MIN($S$96:$S$103))","v":48}]
[null,null,null,null,null,null,null,null,null,"AD",null,null,null,null,null,null,null,null,-24,null,{"$f":"S103+ABS(MIN($S$96:$S$103))","v":0}]

{"sheet":"P6","index":5,"n_rows":103,"n_cols":26,"rows_kept":103,"cut":false,"hidden":false,"merged":[[0,0,0,5],[1,0,1,5],[2,0,2,5],[3,0,3,5],[3,8,3,10],[15,6,16,6],[69,2,69,5],[69,6,70,6],[69,7,69,25],[23,6,24,6],[31,6,32,6],[39,6,40,6],[47,6,48,6],[55,6,56,6],[63,6,64,6]]}
[null,null,null,null,null,null,3]
["CHAMPIONNAT DES CLUBS"]
[]
["POULE 1"]
["EQUIPES",null,"POINTS","Pour","Contre","Diff"]
["AA","1A",{"$f":"SUMIF($A$18:$A$69,A6,$E$18:$E$69)+SUMIF($C$18:$C$69,A6,$F$18:$F$69)","v":17},{"$f":"SUMIF($A$18:$A$69,$A6,$B$18:$B$69)+SUMIF($C$18:$C$69,$A6,$D$18:$D$69)","v":134},{"$f":"SUMIF($C$18:$C$69,$A6,$B$18:$B$69)+SUMIF($A$18:$A$69,$A6,$D$18:$D$69)","v":118},{"$f":"D6-E6","v":16}]
["AB","1B",{"$f":"SUMIF($A$18:$A$69,A7,$E$18:$E$69)+SUMIF($C$18:$C$69,A7,$F$18:$F$69)","v":15},{"$f":"SUMIF($A$18:$A$69,$A7,$B$18:$B$69)+SUMIF($C$18:$C$69,$A7,$D$18:$D$69)","v":142},{"$f":"SUMIF($C$18:$C$69,$A7,$B$18:$B$69)+SUMIF($A$18:$A$69,$A7,$D$18:$D$69)","v":110},32]
["AC","1C",{"$f":"SUMIF($A$18:$A$69,A8,$E$18:$E$69)+SUMIF($C$18:$C$69,A8,$F$18:$F$69)","v":15},122,130,-8]
["AD","1D",11,110,142,-32]
["AE","1E",14,128,124,4]
["AF","1F",17,136,116,20]
["AG","1G",14,136,116,{"$f":"D12-E12","v":20}]
["AH","1H",9,{"$f":"SUMIF($A$18:$A$69,$A13,$B$18:$B$69)+SUMIF($C$18:$C$69,$A13,$D$18:$D$69)","v":100},152,{"$f":"D13-E13","v":-52}]
[]
["1er MATCH le ","à","AA"]
[null,null,null,null,null,null,"SI forfait éq recevante"]
["Equipes","score","Equipes","score","Points","Points"]
["AA",26,"AB",{"$f":"IF(G18=19,19,IF(ISBLANK(B18),\"\",IF(B18=19,0,36-B18)))","v":10},{"$f":"IF(G18=19,0,IF(ISBLANK(B18),\"\",IF(B18<18,1,IF(B18=18,2,IF(B18>18,3)))))","v":3},{"$f":"IF(G18=19,3,IF(ISBLANK(B18),\"\",IF(B18=19,0,IF(D18<18,1,IF(D18=18,2,IF(D18>=20,3))))))","v":1},null,null,null,null,null,{"$f":"IF(B18>D18,A18&C18,IF(D18>B18,C18&A18,\"/\"))","v":"AAAB"},null,{"$f":"A18&C18","v":"AAAB"},{"$f":"E18","v":3},{"$f":"C18&A18","v":"ABAA"},{"$f":"F18","v":1},{"$f":"B18","v":26},{"$f":"D18","v":10}]
["AC",30,"AD",{"$f":"IF(G19=19,19,IF(ISBLANK(B19),\"\",IF(B19=19,0,36-B19)))","v":6},{"$f":"IF(G19=19,0,IF(ISBLANK(B19),\"\",IF(B19<18,1,IF(B19=18,2,IF(B19>18,3)))))","v":3},{"$f":"IF(G19=19,3,IF(ISBLANK(B19),\"\",IF(B19=19,0,IF(D19<18,1,IF(D19=18,2,IF(D19>=20,3))))))","v":1},null,null,null,null,null,{"$f":"IF(B19>D19,A19&C19,IF(D19>B19,C19&A19,\"/\"))","v":"ACAD"},null,{"$f":"A19&C19","v":"ACAD"},{"$f":"E19","v":3},{"$f":"C19&A19","v":"ADAC"},{"$f":"F19","v":1},{"$f":"B19","v":30},{"$f":"D19","v":6}]
["AE",16,"AF",{"$f":"IF(G20=19,19,IF(ISBLANK(B20),\"\",IF(B20=19,0,36-B20)))","v":20},{"$f":"IF(G20=19,0,IF(ISBLANK(B20),\"\",IF(B20<18,1,IF(B20=18,2,IF(B20>18,3)))))","v":1},{"$f":"IF(G20=19,3,IF(ISBLANK(B20),\"\",IF(B20=19,0,IF(D20<18,1,IF(D20=18,2,IF(D20>=20,3))))))","v":3},null,null,null,null,null,{"$f":"IF(B20>D20,A20&C20,IF(D20>B20,C20&A20,\"/\"))","v":"AFAE"},null,{"$f":"A20&C20","v":"AEAF"},{"$f":"E20","v":1},{"$f":"C20&A20","v":"AFAE"},{"$f":"F20","v":3},{"$f":"B20","v":16},{"$f":"D20","v":20}]
["AG",18,"AH",{"$f":"IF(G21=19,19,IF(ISBLANK(B21),\"\",IF(B21=19,0,36-B21)))","v":18},{"$f":"IF(G21=19,0,IF(ISBLANK(B21),\"\",IF(B21<18,1,IF(B21=18,2,IF(B21>18,3)))))","v":2},{"$f":"IF(G21=19,3,IF(ISBLANK(B21),\"\",IF(B21=19,0,IF(D21<18,1,IF(D21=18,2,IF(D21>=20,3))))))","v":2},null,null,null,null,null,{"$f":"IF(B21>D21,A21&C21,IF(D21>B21,C21&A21,\"/\"))","v":"/"},null,{"$f":"A21&C21","v":"AGAH"},{"$f":"E21","v":2},{"$f":"C21&A21","v":"AHAG"},{"$f":"F21","v":2},{"$f":"B21","v":18},{"$f":"D21","v":18}]
[]
["2 éme MATCH le ","à","AB"]
[null,null,null,null,null,null,"SI forfait éq recevante"]
["Equipes","score","Equipes","score","Points","Points"]
["AA",22,"AC",{"$f":"IF(G26=19,19,IF(ISBLANK(B26),\"\",IF(B26=19,0,36-B26)))","v":14},{"$f":"IF(G26=19,0,IF(ISBLANK(B26),\"\",IF(B26<18,1,IF(B26=18,2,IF(B26>18,3)))))","v":3},{"$f":"IF(G26=19,3,IF(ISBLANK(B26),\"\",IF(B26=19,0,IF(D26<18,1,IF(D26=18,2,IF(D26>=20,3))))))","v":1},null,null,null,null,null,{"$f":"IF(B26>D26,A26&C26,IF(D26>B26,C26&A26,\"/\"))","v":"AAAC"},null,{"$f":"A26&C26","v":"AAAC"},{"$f":"E26","v":3},{"$f":"C26&A26","v":"ACAA"},{"$f":"F26","v":1},{"$f":"B26","v":22},{"$f":"D26","v":14}]
["AB",24,"AH",{"$f":"IF(G27=19,19,IF(ISBLANK(B27),\"\",IF(B27=19,0,36-B27)))","v":12},{"$f":"IF(G27=19,0,IF(ISBLANK(B27),\"\",IF(B27<18,1,IF(B27=18,2,IF(B27>18,3)))))","v":3},{"$f":"IF(G27=19,3,IF(ISBLANK(B27),\"\",IF(B27=19,0,IF(D27<18,1,IF(D27=18,2,IF(D27>=20,3))))))","v":1},null,null,null,null,null,{"$f":"IF(B27>D27,A27&C27,IF(D27>B27,C27&A27,\"/\"))","v":"ABAH"},null,{"$f":"A27&C27","v":"ABAH"},{"$f":"E27","v":3},{"$f":"C27&A27","v":"AHAB"},{"$f":"F27","v":1},{"$f":"B27","v":24},{"$f":"D27","v":12}]
["AD",14,"AF",{"$f":"IF(G28=19,19,IF(ISBLANK(B28),\"\",IF(B28=19,0,36-B28)))","v":22},{"$f":"IF(G28=19,0,IF(ISBLANK(B28),\"\",IF(B28<18,1,IF(B28=18,2,IF(B28>18,3)))))","v":1},{"$f":"IF(G28=19,3,IF(ISBLANK(B28),\"\",IF(B28=19,0,IF(D28<18,1,IF(D28=18,2,IF(D28>=20,3))))))","v":3},null,null,null,null,null,{"$f":"IF(B28>D28,A28&C28,IF(D28>B28,C28&A28,\"/\"))","v":"AFAD"},null,{"$f":"A28&C28","v":"ADAF"},{"$f":"E28","v":1},{"$f":"C28&A28","v":"AFAD"},{"$f":"F28","v":3},{"$f":"B28","v":14},{"$f":"D28","v":22}]
["AE",28,"AG",{"$f":"IF(G29=19,19,IF(ISBLANK(B29),\"\",IF(B29=19,0,36-B29)))","v":8},{"$f":"IF(G29=19,0,IF(ISBLANK(B29),\"\",IF(B29<18,1,IF(B29=18,2,IF(B29>18,3)))))","v":3},{"$f":"IF(G29=19,3,IF(ISBLANK(B29),\"\",IF(B29=19,0,IF(D29<18,1,IF(D29=18,2,IF(D29>=20,3))))))","v":1},null,null,null,null,null,{"$f":"IF(B29>D29,A29&C29,IF(D29>B29,C29&A29,\"/\"))","v":"AEAG"},null,{"$f":"A29&C29","v":"AEAG"},{"$f":"E29","v":3},{"$f":"C29&A29","v":"AGAE"},{"$f":"F29","v":1},{"$f":"B29","v":28},{"$f":"D29","v":8}]
[]
["3 éme MATCH le ","à","AC"]
[null,null,null,null,null,null,"SI forfait éq recevante"]
["Equipes","score","Equipes","score","Points","Points"]
["AA",20,"AH",{"$f":"IF(G34=19,19,IF(ISBLANK(B34),\"\",IF(B34=19,0,36-B34)))","v":16},{"$f":"IF(G34=19,0,IF(ISBLANK(B34),\"\",IF(B34<18,1,IF(B34=18,2,IF(B34>18,3)))))","v":3},{"$f":"IF(G34=19,3,IF(ISBLANK(B34),\"\",IF(B34=19,0,IF(D34<18,1,IF(D34=18,2,IF(D34>=20,3))))))","v":1},null,null,null,null,null,{"$f":"IF(B34>D34,A34&C34,IF(D34>B34,C34&A34,\"/\"))","v":"AAAH"},null,{"$f":"A34&C34","v":"AAAH"},{"$f":"E34","v":3},{"$f":"C34&A34","v":"AHAA"},{"$f":"F34","v":1},{"$f":"B34","v":20},{"$f":"D34","v":16}]
["AB",30,"AE",{"$f":"IF(G35=19,19,IF(ISBLANK(B35),\"\",IF(B35=19,0,36-B35)))","v":6},{"$f":"IF(G35=19,0,IF(ISBLANK(B35),\"\",IF(B35<18,1,IF(B35=18,2,IF(B35>18,3)))))","v":3},{"$f":"IF(G35=19,3,IF(ISBLANK(B35),\"\",IF(B35=19,0,IF(D35<18,1,IF(D35=18,2,IF(D35>=20,3))))))","v":1},null,null,null,null,null,{"$f":"IF(B35>D35,A35&C35,IF(D35>B35,C35&A35,\"/\"))","v":"ABAE"},null,{"$f":"A35&C35","v":"ABAE"},{"$f":"E35","v":3},{"$f":"C35&A35","v":"AEAB"},{"$f":"F35","v":1},{"$f":"B35","v":30},{"$f":"D35","v":6}]
["AC",20,"AF",{"$f":"IF(G36=19,19,IF(ISBLANK(B36),\"\",IF(B36=19,0,36-B36)))","v":16},{"$f":"IF(G36=19,0,IF(ISBLANK(B36),\"\",IF(B36<18,1,IF(B36=18,2,IF(B36>18,3)))))","v":3},{"$f":"IF(G36=19,3,IF(ISBLANK(B36),\"\",IF(B36=19,0,IF(D36<18,1,IF(D36=18,2,IF(D36>=20,3))))))","v":1},null,null,null,null,null,{"$f":"IF(B36>D36,A36&C36,IF(D36>B36,C36&A36,\"/\"))","v":"ACAF"},null,{"$f":"A36&C36","v":"ACAF"},{"$f":"E36","v":3},{"$f":"C36&A36","v":"AFAC"},{"$f":"F36","v":1},{"$f":"B36","v":20},{"$f":"D36","v":16}]
["AD",32,"AG",{"$f":"IF(G37=19,19,IF(ISBLANK(B37),\"\",IF(B37=19,0,36-B37)))","v":4},{"$f":"IF(G37=19,0,IF(ISBLANK(B37),\"\",IF(B37<18,1,IF(B37=18,2,IF(B37>18,3)))))","v":3},{"$f":"IF(G37=19,3,IF(ISBLANK(B37),\"\",IF(B37=19,0,IF(D37<18,1,IF(D37=18,2,IF(D37>=20,3))))))","v":1},null,null,null,null,null,{"$f":"IF(B37>D37,A37&C37,IF(D37>B37,C37&A37,\"/\"))","v":"ADAG"},null,{"$f":"A37&C37","v":"ADAG"},{"$f":"E37","v":3},{"$f":"C37&A37","v":"AGAD"},{"$f":"F37","v":1},{"$f":"B37","v":32},{"$f":"D37","v":4}]
[]
["4 éme MATCH le ","à","AD"]
[null,null,null,null,null,null,"SI forfait éq recevante"]
["Equipes","score","Equipes","score","Points","Points"]
["AA",20,"AD",{"$f":"IF(G42=19,19,IF(ISBLANK(B42),\"\",IF(B42=19,0,36-B42)))","v":16},{"$f":"IF(G42=19,0,IF(ISBLANK(B42),\"\",IF(B42<18,1,IF(B42=18,2,IF(B42>18,3)))))","v":3},{"$f":"IF(G42=19,3,IF(ISBLANK(B42),\"\",IF(B42=19,0,IF(D42<18,1,IF(D42=18,2,IF(D42>=20,3))))))","v":1},null,null,null,null,null,{"$f":"IF(B42>D42,A42&C42,IF(D42>B42,C42&A42,\"/\"))","v":"AAAD"},null,{"$f":"A42&C42","v":"AAAD"},{"$f":"E42","v":3},{"$f":"C42&A42","v":"ADAA"},{"$f":"F42","v":1},{"$f":"B42","v":20},{"$f":"D42","v":16}]
["AF",10,"AG",{"$f":"IF(G43=19,19,IF(ISBLANK(B43),\"\",IF(B43=19,0,36-B43)))","v":26},{"$f":"IF(G43=19,0,IF(ISBLANK(B43),\"\",IF(B43<18,1,IF(B43=18,2,IF(B43>18,3)))))","v":1},{"$f":"IF(G43=19,3,IF(ISBLANK(B43),\"\",IF(B43=19,0,IF(D43<18,1,IF(D43=18,2,IF(D43>=20,3))))))","v":3},null,null,null,null,null,{"$f":"IF(B43>D43,A43&C43,IF(D43>B43,C43&A43,\"/\"))","v":"AGAF"},null,{"$f":"A43&C43","v":"AFAG"},{"$f":"E43","v":1},{"$f":"C43&A43","v":"AGAF"},{"$f":"F43","v":3},{"$f":"B43","v":10},{"$f":"D43","v":26}]
["AB",32,"AC",{"$f":"IF(G44=19,19,IF(ISBLANK(B44),\"\",IF(B44=19,0,36-B44)))","v":4},{"$f":"IF(G44=19,0,IF(ISBLANK(B44),\"\",IF(B44<18,1,IF(B44=18,2,IF(B44>18,3)))))","v":3},{"$f":"IF(G44=19,3,IF(ISBLANK(B44),\"\",IF(B44=19,0,IF(D44<18,1,IF(D44=18,2,IF(D44>=20,3))))))","v":1},null,null,null,null,null,{"$f":"IF(B44>D44,A44&C44,IF(D44>B44,C44&A44,\"/\"))","v":"ABAC"},null,{"$f":"A44&C44","v":"ABAC"},{"$f":"E44","v":3},{"$f":"C44&A44","v":"ACAB"},{"$f":"F44","v":1},{"$f":"B44","v":32},{"$f":"D44","v":4}]
["AE",20,"AH",{"$f":"IF(G45=19,19,IF(ISBLANK(B45),\"\",IF(B45=19,0,36-B45)))","v":16},{"$f":"IF(G45=19,0,IF(ISBLANK(B45),\"\",IF(B45<18,1,IF(B45=18,2,IF(B45>18,3)))))","v":3},{"$f":"IF(G45=19,3,IF(ISBLANK(B45),\"\",IF(B45=19,0,IF(D45<18,1,IF(D45=18,2,IF(D45>=20,3))))))","v":1},null,null,null,null,null,{"$f":"IF(B45>D45,A45&C45,IF(D45>B45,C45&A45,\"/\"))","v":"AEAH"},null,{"$f":"A45&C45","v":"AEAH"},{"$f":"E45","v":3},{"$f":"C45&A45","v":"AHAE"},{"$f":"F45","v":1},{"$f":"B45","v":20},{"$f":"D45","v":16}]
[]
["5 éme MATCH le ","à","AE"]
[null,null,null,null,null,null,"SI forfait éq recevante"]
["Equipes","score","Equipes","score","Points","Points"]
["AA",14,"AF",{"$f":"IF(G50=19,19,IF(ISBLANK(B50),\"\",IF(B50=19,0,36-B50)))","v":22},{"$f":"IF(G50=19,0,IF(ISBLANK(B50),\"\",IF(B50<18,1,IF(B50=18,2,IF(B50>18,3)))))","v":1},{"$f":"IF(G50=19,3,IF(ISBLANK(B50),\"\",IF(B50=19,0,IF(D50<18,1,IF(D50=18,2,IF(D50>=20,3))))))","v":3},null,null,null,null,null,{"$f":"IF(B50>D50,A50&C50,IF(D50>B50,C50&A50,\"/\"))","v":"AFAA"},null,{"$f":"A50&C50","v":"AAAF"},{"$f":"E50","v":1},{"$f":"C50&A50","v":"AFAA"},{"$f":"F50","v":3},{"$f":"B50","v":14},{"$f":"D50","v":22}]
["AD",18,"AH",{"$f":"IF(G51=19,19,IF(ISBLANK(B51),\"\",IF(B51=19,0,36-B51)))","v":18},{"$f":"IF(G51=19,0,IF(ISBLANK(B51),\"\",IF(B51<18,1,IF(B51=18,2,IF(B51>18,3)))))","v":2},{"$f":"IF(G51=19,3,IF(ISBLANK(B51),\"\",IF(B51=19,0,IF(D51<18,1,IF(D51=18,2,IF(D51>=20,3))))))","v":2},null,null,null,null,null,{"$f":"IF(B51>D51,A51&C51,IF(D51>B51,C51&A51,\"/\"))","v":"/"},null,{"$f":"A51&C51","v":"ADAH"},{"$f":"E51","v":2},{"$f":"C51&A51","v":"AHAD"},{"$f":"F51","v":2},{"$f":"B51","v":18},{"$f":"D51","v":18}]
["AB",4,"AG",{"$f":"IF(G52=19,19,IF(ISBLANK(B52),\"\",IF(B52=19,0,36-B52)))","v":32},{"$f":"IF(G52=19,0,IF(ISBLANK(B52),\"\",IF(B52<18,1,IF(B52=18,2,IF(B52>18,3)))))","v":1},{"$f":"IF(G52=19,3,IF(ISBLANK(B52),\"\",IF(B52=19,0,IF(D52<18,1,IF(D52=18,2,IF(D52>=20,3))))))","v":3},null,null,null,null,null,{"$f":"IF(B52>D52,A52&C52,IF(D52>B52,C52&A52,\"/\"))","v":"AGAB"},null,{"$f":"A52&C52","v":"ABAG"},{"$f":"E52","v":1},{"$f":"C52&A52","v":"AGAB"},{"$f":"F52","v":3},{"$f":"B52","v":4},{"$f":"D52","v":32}]
["AC",20,"AE",{"$f":"IF(G53=19,19,IF(ISBLANK(B53),\"\",IF(B53=19,0,36-B53)))","v":16},{"$f":"IF(G53=19,0,IF(ISBLANK(B53),\"\",IF(B53<18,1,IF(B53=18,2,IF(B53>18,3)))))","v":3},{"$f":"IF(G53=19,3,IF(ISBLANK(B53),\"\",IF(B53=19,0,IF(D53<18,1,IF(D53=18,2,IF(D53>=20,3))))))","v":1},null,null,null,null,null,{"$f":"IF(B53>D53,A53&C53,IF(D53>B53,C53&A53,\"/\"))","v":"ACAE"},null,{"$f":"A53&C53","v":"ACAE"},{"$f":"E53","v":3},{"$f":"C53&A53","v":"AEAC"},{"$f":"F53","v":1},{"$f":"B53","v":20},{"$f":"D53","v":16}]
[]
["6 éme MATCH le ","à","AF"]
[null,null,null,null,null,null,"SI forfait éq recevante"]
["Equipes","score","Equipes","score","Points","Points"]
["AB",30,"AD",{"$f":"IF(G58=19,19,IF(ISBLANK(B58),\"\",IF(B58=19,0,36-B58)))","v":6},{"$f":"IF(G58=19,0,IF(ISBLANK(B58),\"\",IF(B58<18,1,IF(B58=18,2,IF(B58>18,3)))))","v":3},{"$f":"IF(G58=19,3,IF(ISBLANK(B58),\"\",IF(B58=19,0,IF(D58<18,1,IF(D58=18,2,IF(D58>=20,3))))))","v":1},null,null,null,null,null,{"$f":"IF(B58>D58,A58&C58,IF(D58>B58,C58&A58,\"/\"))","v":"ABAD"},null,{"$f":"A58&C58","v":"ABAD"},{"$f":"E58","v":3},{"$f":"C58&A58","v":"ADAB"},{"$f":"F58","v":1},{"$f":"B58","v":30},{"$f":"D58","v":6}]
["AE",24,"AA",{"$f":"IF(G59=19,19,IF(ISBLANK(B59),\"\",IF(B59=19,0,36-B59)))","v":12},{"$f":"IF(G59=19,0,IF(ISBLANK(B59),\"\",IF(B59<18,1,IF(B59=18,2,IF(B59>18,3)))))","v":3},{"$f":"IF(G59=19,3,IF(ISBLANK(B59),\"\",IF(B59=19,0,IF(D59<18,1,IF(D59=18,2,IF(D59>=20,3))))))","v":1},null,null,null,null,null,{"$f":"IF(B59>D59,A59&C59,IF(D59>B59,C59&A59,\"/\"))","v":"AEAA"},null,{"$f":"A59&C59","v":"AEAA"},{"$f":"E59","v":3},{"$f":"C59&A59","v":"AAAE"},{"$f":"F59","v":1},{"$f":"B59","v":24},{"$f":"D59","v":12}]
["AG",32,"AC",{"$f":"IF(G60=19,19,IF(ISBLANK(B60),\"\",IF(B60=19,0,36-B60)))","v":4},{"$f":"IF(G60=19,0,IF(ISBLANK(B60),\"\",IF(B60<18,1,IF(B60=18,2,IF(B60>18,3)))))","v":3},{"$f":"IF(G60=19,3,IF(ISBLANK(B60),\"\",IF(B60=19,0,IF(D60<18,1,IF(D60=18,2,IF(D60>=20,3))))))","v":1},null,null,null,null,null,{"$f":"IF(B60>D60,A60&C60,IF(D60>B60,C60&A60,\"/\"))","v":"AGAC"},null,{"$f":"A60&C60","v":"AGAC"},{"$f":"E60","v":3},{"$f":"C60&A60","v":"ACAG"},{"$f":"F60","v":1},{"$f":"B60","v":32},{"$f":"D60","v":4}]
["AF",22,"AH",{"$f":"IF(G61=19,19,IF(ISBLANK(B61),\"\",IF(B61=19,0,36-B61)))","v":14},{"$f":"IF(G61=19,0,IF(ISBLANK(B61),\"\",IF(B61<18,1,IF(B61=18,2,IF(B61>18,3)))))","v":3},{"$f":"IF(G61=19,3,IF(ISBLANK(B61),\"\",IF(B61=19,0,IF(D61<18,1,IF(D61=18,2,IF(D61>=20,3))))))","v":1},null,null,null,null,null,{"$f":"IF(B61>D61,A61&C61,IF(D61>B61,C61&A61,\"/\"))","v":"AFAH"},null,{"$f":"A61&C61","v":"AFAH"},{"$f":"E61","v":3},{"$f":"C61&A61","v":"AHAF"},{"$f":"F61","v":1},{"$f":"B61","v":22},{"$f":"D61","v":14}]
[]
["7 éme MATCH le","à","AG"]
[null,null,null,null,null,null,"SI forfait éq recevante",null," "]
["Equipes","score","Equipes","score","Points","Points"]
["AA",20,"AG",{"$f":"IF(G66=19,19,IF(ISBLANK(B66),\"\",IF(B66=19,0,36-B66)))","v":16},{"$f":"IF(G66=19,0,IF(ISBLANK(B66),\"\",IF(B66<18,1,IF(B66=18,2,IF(B66>18,3)))))","v":3},{"$f":"IF(G66=19,3,IF(ISBLANK(B66),\"\",IF(B66=19,0,IF(D66<18,1,IF(D66=18,2,IF(D66>=20,3))))))","v":1},null,null,null,null,null,{"$f":"IF(B66>D66,A66&C66,IF(D66>B66,C66&A66,\"/\"))","v":"AAAG"},null,{"$f":"A66&C66","v":"AAAG"},{"$f":"E66","v":3},{"$f":"C66&A66","v":"AGAA"},{"$f":"F66","v":1},{"$f":"B66","v":20},{"$f":"D66","v":16}]
["AB",12,"AF",{"$f":"IF(G67=19,19,IF(ISBLANK(B67),\"\",IF(B67=19,0,36-B67)))","v":24},{"$f":"IF(G67=19,0,IF(ISBLANK(B67),\"\",IF(B67<18,1,IF(B67=18,2,IF(B67>18,3)))))","v":1},{"$f":"IF(G67=19,3,IF(ISBLANK(B67),\"\",IF(B67=19,0,IF(D67<18,1,IF(D67=18,2,IF(D67>=20,3))))))","v":3},null,null,null,null,null,{"$f":"IF(B67>D67,A67&C67,IF(D67>B67,C67&A67,\"/\"))","v":"AFAB"},null,{"$f":"A67&C67","v":"ABAF"},{"$f":"E67","v":1},{"$f":"C67&A67","v":"AFAB"},{"$f":"F67","v":3},{"$f":"B67","v":12},{"$f":"D67","v":24}]
["AE",18,"AD",{"$f":"IF(G68=19,19,IF(ISBLANK(B68),\"\",IF(B68=19,0,36-B68)))","v":18},{"$f":"IF(G68=19,0,IF(ISBLANK(B68),\"\",IF(B68<18,1,IF(B68=18,2,IF(B68>18,3)))))","v":2},{"$f":"IF(G68=19,3,IF(ISBLANK(B68),\"\",IF(B68=19,0,IF(D68<18,1,IF(D68=18,2,IF(D68>=20,3))))))","v":2},null,null,null,null,null,{"$f":"IF(B68>D68,A68&C68,IF(D68>B68,C68&A68,\"/\"))","v":"/"},null,{"$f":"A68&C68","v":"AEAD"},{"$f":"E68","v":2},{"$f":"C68&A68","v":"ADAE"},{"$f":"F68","v":2},{"$f":"B68","v":18},{"$f":"D68","v":18}]
["AC",30,"AH",{"$f":"IF(G69=19,19,IF(ISBLANK(B69),\"\",IF(B69=19,0,36-B69)))","v":6},{"$f":"IF(G69=19,0,IF(ISBLANK(B69),\"\",IF(B69<18,1,IF(B69=18,2,IF(B69>18,3)))))","v":3},{"$f":"IF(G69=19,3,IF(ISBLANK(B69),\"\",IF(B69=19,0,IF(D69<18,1,IF(D69=18,2,IF(D69>=20,3))))))","v":1},null,null,null,null,null,{"$f":"IF(B69>D69,A69&C69,IF(D69>B69,C69&A69,\"/\"))","v":"ACAH"},null,{"$f":"A69&C69","v":"ACAH"},{"$f":"E69","v":3},{"$f":"C69&A69","v":"AHAC"},{"$f":"F69","v":1},{"$f":"B69","v":30},{"$f":"D69","v":6}]
[null,null,"Si pas d'exaequo",null,null,null,"Classt        Final","Rencontres entre exaequos"]
["EQUIPES",null,"POINTS","POUR","CONTRE","DIFF",null,"POINTS Exaequos","Exaq","n°","AA","AB","AC","AD","AE","AF","AG","AH","Pts matchs",null,null,null,"1000000*Pts matchs +1000 (Diff +  abs(diff mini) )+Pour ","RANG","DIFF Exaequos","POUR Exaequos"]
["AF","1F",17,136,116,20,1,{"$f":"IF(S72>0,S72,\"\")","v":3},{"$f":"COUNTIF($C$72:$C$79,C72)","v":2},{"$f":"IF(AND(I72>1,COUNTIFS(I$72:I72,I72,C$72:C72,C72)=1),MAX(J$71:J71)+1,\"\")","v":1},{"$f":"IF($A72=K$71,\"\",IF(INDEX($C$72:$C$79,MATCH(K$71,$A$72:$A$79,0))=$C72,IFERROR(VLOOKUP($A72&K$71,$N$18:$O$69,2,0),  VLOOKUP(K$71&$A72,$N$18:$Q$69,4,0)),          \"\"))","v":3},"","","","","","","",{"$f":"SUM(K72:R72)","v":3},null,null,null,{"$f":"IF(I72<3,S72*1000000+(F72+ABS(MIN($F$72:$F$79)))*1000+D72,S72*1000000+U96*1000+Z72)","v":3072136},{"$f":"IF(I72>2,RANK(W72,OFFSET(W$71,MATCH(I72,$I$72:$I$79,0),,I72)))","v":false},{"$f":"IF(S96=0,\"\",S96)","v":8},{"$f":"IF(S80=0,\"\",S80)","v":22}]
["AA","1A",17,134,118,16,2,1,2,{"$f":"IF(AND(I73>1,COUNTIFS(I$72:I73,I73,C$72:C73,C73)=1),MAX(J$71:J72)+1,\"\")","v":""},"","","","","",1,"","",{"$f":"SUM(K73:R73)","v":1},null,null,null,{"$f":"IF(I73<3,S73*1000000+(F73+ABS(MIN($F$72:$F$79)))*1000+D73,S73*1000000+U97*1000+Z73)","v":1068134},{"$f":"IF(I73>2,RANK(W73,OFFSET(W$71,MATCH(I73,$I$72:$I$79,0),,I73)))","v":false},-8,14]
["AB","1B",15,142,110,32,3,3,2,{"$f":"IF(AND(I74>1,COUNTIFS(I$72:I74,I74,C$72:C74,C74)=1),MAX(J$71:J73)+1,\"\")","v":2},"","",3,"","","","","",3,null,null,null,3084142,false,28,32]
["AC","1C",15,122,130,-8,4,1,2,{"$f":"IF(AND(I75>1,COUNTIFS(I$72:I75,I75,C$72:C75,C75)=1),MAX(J$71:J74)+1,\"\")","v":""},"",1,"","","","","","",1,null,null,null,1044122,false,-28,4]
["AE","1E",14,128,124,4,5,3,2,{"$f":"IF(AND(I76>1,COUNTIFS(I$72:I76,I76,C$72:C76,C76)=1),MAX(J$71:J75)+1,\"\")","v":3},"","","","","","",3,"",3,null,null,null,3056128,false,20,28]
["AG","1G",14,136,116,20,6,1,2,{"$f":"IF(AND(I77>1,COUNTIFS(I$72:I77,I77,C$72:C77,C77)=1),MAX(J$71:J76)+1,\"\")","v":""},"","","","",1,"","","",1,null,null,null,1072136,false,-20,8]
["AD","1D",11,110,142,-32,7,"",1,{"$f":"IF(AND(I78>1,COUNTIFS(I$72:I78,I78,C$72:C78,C78)=1),MAX(J$71:J77)+1,\"\")","v":""},"","","","","","","","",0,null,null,null,20110,false,"",""]
["AH","1H",9,100,152,-52,8,"",1,{"$f":"IF(AND(I79>1,COUNTIFS(I$72:I79,I79,C$72:C79,C79)=1),MAX(J$71:J78)+1,\"\")","v":""},"","","","","","","","",0,null,null,null,100,false,"",""]
[null,null,null,null,null,null,null,null,"POUR",{"$f":"A72","v":"AF"},{"$f":"IF($A72=K$71,\"\",IF(INDEX($C$72:$C$79,MATCH(K$71,$A$72:$A$79,0))=$C72,IFERROR(VLOOKUP($A72&K$71,$N$18:$R$69,5,0),  VLOOKUP(K$71&$A72,$N$18:$S$69,6,0)),          \"\"))","v":22},"","","","","","","",22]
[null,null,null,null,null,null,null,null,null,"AA","","","","","",14,"","",14]
[null,null,null,null,null,null,null,null,null,"AB","","",32,"","","","","",32]
[null,null,null,null,null,null,null,null,null,"AC","",4,"","","","","","",4]
[null,null,null,null,null,null,null,null,null,"AE","","","","","","",28,"",28,null,null,null,null,null,"  "]
[null,null,null,null,null,null,null,null,null,"AG","","","","",8,"","","",8]
[null,null,null,null,null,null,null,null,null,"AD","","","","","","","","",0]
[null,null,null,null,null,null,null,null,null,"AH","","","","","","","","",0]
[null,null,null,null,null,null,null,null,"CONTRE",{"$f":"J80","v":"AF"},{"$f":"INDEX($K$80:$R$87,MATCH(K$71,$J$80:$J$87,0),MATCH($J80,$K$71:$R$71,0))","v":14},{"$f":"INDEX($K$80:$R$87,MATCH(L$71,$J$80:$J$87,0),MATCH($J80,$K$71:$R$71,0))","v":""},"","","","","","",14]
[null,null,null,null,null,null,null,null,null,{"$f":"J81","v":"AA"},{"$f":"INDEX($K$80:$R$87,MATCH(K$71,$J$80:$J$87,0),MATCH($J81,$K$71:$R$71,0))","v":""},"","","","",22,"","",22]
[null,null,null,null,null,null,null,null,null,"AB","","",4,"","","","","",4]
[null,null,null,null,null,null,null,null,null,"AC","",32,"","","","","","",32]
[null,null,null,null,null,null,null,null,null,"AE","","","","","","",8,"",8]
[null,null,null,null,null,null,null,null,null,"AG","","","","",28,"","","",28]
[null,null,null,null,null,null,null,null,null,"AD","","","","","","","","",0]
[null,null,null,null,null,null,null,null,null,"AH","","","","","","","","",0,null,"Diff pondérée"]
[null,null,null,null,null,null,null,null,"DIFF",{"$f":"J88","v":"AF"},null,null,null,null,null,null,null,null,{"$f":"S80-S88","v":8},null,{"$f":"S96+ABS(MIN($S$96:$S$103))","v":36}]
[null,null,null,null,null,null,null,null,null,{"$f":"J89","v":"AA"},null,null,null,null,null,null,null,null,{"$f":"S81-S89","v":-8},null,20]
[null,null,null,null,null,null,null,null,null,"AB",null,null,null,null,null,null,null,null,28,null,56]
[null,null,null,null,null,null,null,null,null,"AC",null,null,null,null,null,null,null,null,-28,null,0]
[null,null,null,null,null,null,null,null,null,"AE",null,null,null,null,null,null,null,null,20,null,48]
[null,null,null,null,null,null,null,null,null,"AG",null,null,null,null,null,null,null,null,-20,null,8]
[null,null,null,null,null,null,null,null,null,"AD",null,null,null,null,null,null,null,null,0,null,{"$f":"S102+ABS(MIN($S$96:$S$103))","v":28}]
[null,null,null,null,null,null,null,null,null,"AH",null,null,null,null,null,null,null,null,0,null,{"$f":"S103+ABS(MIN($S$96:$S$103))","v":28}]

{"sheet":"P7","index":6,"n_rows":103,"n_cols":26,"rows_kept":103,"cut":false,"hidden":false,"merged":[[0,0,0,5],[1,0,1,5],[2,0,2,5],[3,0,3,5],[3,8,3,10],[15,6,16,6],[69,2,69,5],[69,6,70,6],[69,7,69,25],[23,6,24,6],[31,6,32,6],[39,6,40,6],[47,6,48,6],[55,6,56,6],[63,6,64,6]]}
[null,null,null,null,null,null,3]
["CHAMPIONNAT DES CLUBS"]
[]
["POULE 1"]
["EQUIPES",null,"POINTS","Pour","Contre","Diff"]
["AA","1A",{"$f":"SUMIF($A$18:$A$69,A6,$E$18:$E$69)+SUMIF($C$18:$C$69,A6,$F$18:$F$69)","v":12},{"$f":"SUMIF($A$18:$A$69,$A6,$B$18:$B$69)+SUMIF($C$18:$C$69,$A6,$D$18:$D$69)","v":110},{"$f":"SUMIF($C$18:$C$69,$A6,$B$18:$B$69)+SUMIF($A$18:$A$69,$A6,$D$18:$D$69)","v":142},{"$f":"D6-E6","v":-32}]
["AB","1B",{"$f":"SUMIF($A$18:$A$69,A7,$E$18:$E$69)+SUMIF($C$18:$C$69,A7,$F$18:$F$69)","v":13},{"$f":"SUMIF($A$18:$A$69,$A7,$B$18:$B$69)+SUMIF($C$18:$C$69,$A7,$D$18:$D$69)","v":100},{"$f":"SUMIF($C$18:$C$69,$A7,$B$18:$B$69)+SUMIF($A$18:$A$69,$A7,$D$18:$D$69)","v":152},-52]
["AC","1C",{"$f":"SUMIF($A$18:$A$69,A8,$E$18:$E$69)+SUMIF($C$18:$C$69,A8,$F$18:$F$69)","v":16},144,108,36]
["AD","1D",15,114,138,-24]
["AE","1E",12,116,136,-20]
["AF","1F",18,158,94,64]
["AG","1G",12,128,124,{"$f":"D12-E12","v":4}]
["AH","1H",14,{"$f":"SUMIF($A$18:$A$69,$A13,$B$18:$B$69)+SUMIF($C$18:$C$69,$A13,$D$18:$D$69)","v":138},114,{"$f":"D13-E13","v":24}]
[]
["1er MATCH le ","à","AA"]
[null,null,null,null,null,null,"SI forfait éq recevante"]
["Equipes","score","Equipes","score","Points","Points"]
["AA",12,"AB",{"$f":"IF(G18=19,19,IF(ISBLANK(B18),\"\",IF(B18=19,0,36-B18)))","v":24},{"$f":"IF(G18=19,0,IF(ISBLANK(B18),\"\",IF(B18<18,1,IF(B18=18,2,IF(B18>18,3)))))","v":1},{"$f":"IF(G18=19,3,IF(ISBLANK(B18),\"\",IF(B18=19,0,IF(D18<18,1,IF(D18=18,2,IF(D18>=20,3))))))","v":3},null,null,null,null,null,{"$f":"IF(B18>D18,A18&C18,IF(D18>B18,C18&A18,\"/\"))","v":"ABAA"},null,{"$f":"A18&C18","v":"AAAB"},{"$f":"E18","v":1},{"$f":"C18&A18","v":"ABAA"},{"$f":"F18","v":3},{"$f":"B18","v":12},{"$f":"D18","v":24}]
["AC",16,"AD",{"$f":"IF(G19=19,19,IF(ISBLANK(B19),\"\",IF(B19=19,0,36-B19)))","v":20},{"$f":"IF(G19=19,0,IF(ISBLANK(B19),\"\",IF(B19<18,1,IF(B19=18,2,IF(B19>18,3)))))","v":1},{"$f":"IF(G19=19,3,IF(ISBLANK(B19),\"\",IF(B19=19,0,IF(D19<18,1,IF(D19=18,2,IF(D19>=20,3))))))","v":3},null,null,null,null,null,{"$f":"IF(B19>D19,A19&C19,IF(D19>B19,C19&A19,\"/\"))","v":"ADAC"},null,{"$f":"A19&C19","v":"ACAD"},{"$f":"E19","v":1},{"$f":"C19&A19","v":"ADAC"},{"$f":"F19","v":3},{"$f":"B19","v":16},{"$f":"D19","v":20}]
["AE",16,"AF",{"$f":"IF(G20=19,19,IF(ISBLANK(B20),\"\",IF(B20=19,0,36-B20)))","v":20},{"$f":"IF(G20=19,0,IF(ISBLANK(B20),\"\",IF(B20<18,1,IF(B20=18,2,IF(B20>18,3)))))","v":1},{"$f":"IF(G20=19,3,IF(ISBLANK(B20),\"\",IF(B20=19,0,IF(D20<18,1,IF(D20=18,2,IF(D20>=20,3))))))","v":3},null,null,null,null,null,{"$f":"IF(B20>D20,A20&C20,IF(D20>B20,C20&A20,\"/\"))","v":"AFAE"},null,{"$f":"A20&C20","v":"AEAF"},{"$f":"E20","v":1},{"$f":"C20&A20","v":"AFAE"},{"$f":"F20","v":3},{"$f":"B20","v":16},{"$f":"D20","v":20}]
["AG",18,"AH",{"$f":"IF(G21=19,19,IF(ISBLANK(B21),\"\",IF(B21=19,0,36-B21)))","v":18},{"$f":"IF(G21=19,0,IF(ISBLANK(B21),\"\",IF(B21<18,1,IF(B21=18,2,IF(B21>18,3)))))","v":2},{"$f":"IF(G21=19,3,IF(ISBLANK(B21),\"\",IF(B21=19,0,IF(D21<18,1,IF(D21=18,2,IF(D21>=20,3))))))","v":2},null,null,null,null,null,{"$f":"IF(B21>D21,A21&C21,IF(D21>B21,C21&A21,\"/\"))","v":"/"},null,{"$f":"A21&C21","v":"AGAH"},{"$f":"E21","v":2},{"$f":"C21&A21","v":"AHAG"},{"$f":"F21","v":2},{"$f":"B21","v":18},{"$f":"D21","v":18}]
[]
["2 éme MATCH le ","à","AB"]
[null,null,null,null,null,null,"SI forfait éq recevante"]
["Equipes","score","Equipes","score","Points","Points"]
["AA",4,"AC",{"$f":"IF(G26=19,19,IF(ISBLANK(B26),\"\",IF(B26=19,0,36-B26)))","v":32},{"$f":"IF(G26=19,0,IF(ISBLANK(B26),\"\",IF(B26<18,1,IF(B26=18,2,IF(B26>18,3)))))","v":1},{"$f":"IF(G26=19,3,IF(ISBLANK(B26),\"\",IF(B26=19,0,IF(D26<18,1,IF(D26=18,2,IF(D26>=20,3))))))","v":3},null,null,null,null,null,{"$f":"IF(B26>D26,A26&C26,IF(D26>B26,C26&A26,\"/\"))","v":"ACAA"},null,{"$f":"A26&C26","v":"AAAC"},{"$f":"E26","v":1},{"$f":"C26&A26","v":"ACAA"},{"$f":"F26","v":3},{"$f":"B26","v":4},{"$f":"D26","v":32}]
["AB",2,"AH",{"$f":"IF(G27=19,19,IF(ISBLANK(B27),\"\",IF(B27=19,0,36-B27)))","v":34},{"$f":"IF(G27=19,0,IF(ISBLANK(B27),\"\",IF(B27<18,1,IF(B27=18,2,IF(B27>18,3)))))","v":1},{"$f":"IF(G27=19,3,IF(ISBLANK(B27),\"\",IF(B27=19,0,IF(D27<18,1,IF(D27=18,2,IF(D27>=20,3))))))","v":3},null,null,null,null,null,{"$f":"IF(B27>D27,A27&C27,IF(D27>B27,C27&A27,\"/\"))","v":"AHAB"},null,{"$f":"A27&C27","v":"ABAH"},{"$f":"E27","v":1},{"$f":"C27&A27","v":"AHAB"},{"$f":"F27","v":3},{"$f":"B27","v":2},{"$f":"D27","v":34}]
["AD",6,"AF",{"$f":"IF(G28=19,19,IF(ISBLANK(B28),\"\",IF(B28=19,0,36-B28)))","v":30},{"$f":"IF(G28=19,0,IF(ISBLANK(B28),\"\",IF(B28<18,1,IF(B28=18,2,IF(B28>18,3)))))","v":1},{"$f":"IF(G28=19,3,IF(ISBLANK(B28),\"\",IF(B28=19,0,IF(D28<18,1,IF(D28=18,2,IF(D28>=20,3))))))","v":3},null,null,null,null,null,{"$f":"IF(B28>D28,A28&C28,IF(D28>B28,C28&A28,\"/\"))","v":"AFAD"},null,{"$f":"A28&C28","v":"ADAF"},{"$f":"E28","v":1},{"$f":"C28&A28","v":"AFAD"},{"$f":"F28","v":3},{"$f":"B28","v":6},{"$f":"D28","v":30}]
["AE",28,"AG",{"$f":"IF(G29=19,19,IF(ISBLANK(B29),\"\",IF(B29=19,0,36-B29)))","v":8},{"$f":"IF(G29=19,0,IF(ISBLANK(B29),\"\",IF(B29<18,1,IF(B29=18,2,IF(B29>18,3)))))","v":3},{"$f":"IF(G29=19,3,IF(ISBLANK(B29),\"\",IF(B29=19,0,IF(D29<18,1,IF(D29=18,2,IF(D29>=20,3))))))","v":1},null,null,null,null,null,{"$f":"IF(B29>D29,A29&C29,IF(D29>B29,C29&A29,\"/\"))","v":"AEAG"},null,{"$f":"A29&C29","v":"AEAG"},{"$f":"E29","v":3},{"$f":"C29&A29","v":"AGAE"},{"$f":"F29","v":1},{"$f":"B29","v":28},{"$f":"D29","v":8}]
[]
["3 éme MATCH le ","à","AC"]
[null,null,null,null,null,null,"SI forfait éq recevante"]
["Equipes","score","Equipes","score","Points","Points"]
["AA",32,"AH",{"$f":"IF(G34=19,19,IF(ISBLANK(B34),\"\",IF(B34=19,0,36-B34)))","v":4},{"$f":"IF(G34=19,0,IF(ISBLANK(B34),\"\",IF(B34<18,1,IF(B34=18,2,IF(B34>18,3)))))","v":3},{"$f":"IF(G34=19,3,IF(ISBLANK(B34),\"\",IF(B34=19,0,IF(D34<18,1,IF(D34=18,2,IF(D34>=20,3))))))","v":1},null,null,null,null,null,{"$f":"IF(B34>D34,A34&C34,IF(D34>B34,C34&A34,\"/\"))","v":"AAAH"},null,{"$f":"A34&C34","v":"AAAH"},{"$f":"E34","v":3},{"$f":"C34&A34","v":"AHAA"},{"$f":"F34","v":1},{"$f":"B34","v":32},{"$f":"D34","v":4}]
["AB",26,"AE",{"$f":"IF(G35=19,19,IF(ISBLANK(B35),\"\",IF(B35=19,0,36-B35)))","v":10},{"$f":"IF(G35=19,0,IF(ISBLANK(B35),\"\",IF(B35<18,1,IF(B35=18,2,IF(B35>18,3)))))","v":3},{"$f":"IF(G35=19,3,IF(ISBLANK(B35),\"\",IF(B35=19,0,IF(D35<18,1,IF(D35=18,2,IF(D35>=20,3))))))","v":1},null,null,null,null,null,{"$f":"IF(B35>D35,A35&C35,IF(D35>B35,C35&A35,\"/\"))","v":"ABAE"},null,{"$f":"A35&C35","v":"ABAE"},{"$f":"E35","v":3},{"$f":"C35&A35","v":"AEAB"},{"$f":"F35","v":1},{"$f":"B35","v":26},{"$f":"D35","v":10}]
["AC",20,"AF",{"$f":"IF(G36=19,19,IF(ISBLANK(B36),\"\",IF(B36=19,0,36-B36)))","v":16},{"$f":"IF(G36=19,0,IF(ISBLANK(B36),\"\",IF(B36<18,1,IF(B36=18,2,IF(B36>18,3)))))","v":3},{"$f":"IF(G36=19,3,IF(ISBLANK(B36),\"\",IF(B36=19,0,IF(D36<18,1,IF(D36=18,2,IF(D36>=20,3))))))","v":1},null,null,null,null,null,{"$f":"IF(B36>D36,A36&C36,IF(D36>B36,C36&A36,\"/\"))","v":"ACAF"},null,{"$f":"A36&C36","v":"ACAF"},{"$f":"E36","v":3},{"$f":"C36&A36","v":"AFAC"},{"$f":"F36","v":1},{"$f":"B36","v":20},{"$f":"D36","v":16}]
["AD",22,"AG",{"$f":"IF(G37=19,19,IF(ISBLANK(B37),\"\",IF(B37=19,0,36-B37)))","v":14},{"$f":"IF(G37=19,0,IF(ISBLANK(B37),\"\",IF(B37<18,1,IF(B37=18,2,IF(B37>18,3)))))","v":3},{"$f":"IF(G37=19,3,IF(ISBLANK(B37),\"\",IF(B37=19,0,IF(D37<18,1,IF(D37=18,2,IF(D37>=20,3))))))","v":1},null,null,null,null,null,{"$f":"IF(B37>D37,A37&C37,IF(D37>B37,C37&A37,\"/\"))","v":"ADAG"},null,{"$f":"A37&C37","v":"ADAG"},{"$f":"E37","v":3},{"$f":"C37&A37","v":"AGAD"},{"$f":"F37","v":1},{"$f":"B37","v":22},{"$f":"D37","v":14}]
[]
["4 éme MATCH le ","à","AD"]
[null,null,null,null,null,null,"SI forfait éq recevante"]
["Equipes","score","Equipes","score","Points","Points"]
["AA",12,"AD",{"$f":"IF(G42=19,19,IF(ISBLANK(B42),\"\",IF(B42=19,0,36-B42)))","v":24},{"$f":"IF(G42=19,0,IF(ISBLANK(B42),\"\",IF(B42<18,1,IF(B42=18,2,IF(B42>18,3)))))","v":1},{"$f":"IF(G42=19,3,IF(ISBLANK(B42),\"\",IF(B42=19,0,IF(D42<18,1,IF(D42=18,2,IF(D42>=20,3))))))","v":3},null,null,null,null,null,{"$f":"IF(B42>D42,A42&C42,IF(D42>B42,C42&A42,\"/\"))","v":"ADAA"},null,{"$f":"A42&C42","v":"AAAD"},{"$f":"E42","v":1},{"$f":"C42&A42","v":"ADAA"},{"$f":"F42","v":3},{"$f":"B42","v":12},{"$f":"D42","v":24}]
["AF",28,"AG",{"$f":"IF(G43=19,19,IF(ISBLANK(B43),\"\",IF(B43=19,0,36-B43)))","v":8},{"$f":"IF(G43=19,0,IF(ISBLANK(B43),\"\",IF(B43<18,1,IF(B43=18,2,IF(B43>18,3)))))","v":3},{"$f":"IF(G43=19,3,IF(ISBLANK(B43),\"\",IF(B43=19,0,IF(D43<18,1,IF(D43=18,2,IF(D43>=20,3))))))","v":1},null,null,null,null,null,{"$f":"IF(B43>D43,A43&C43,IF(D43>B43,C43&A43,\"/\"))","v":"AFAG"},null,{"$f":"A43&C43","v":"AFAG"},{"$f":"E43","v":3},{"$f":"C43&A43","v":"AGAF"},{"$f":"F43","v":1},{"$f":"B43","v":28},{"$f":"D43","v":8}]
["AB",2,"AC",{"$f":"IF(G44=19,19,IF(ISBLANK(B44),\"\",IF(B44=19,0,36-B44)))","v":34},{"$f":"IF(G44=19,0,IF(ISBLANK(B44),\"\",IF(B44<18,1,IF(B44=18,2,IF(B44>18,3)))))","v":1},{"$f":"IF(G44=19,3,IF(ISBLANK(B44),\"\",IF(B44=19,0,IF(D44<18,1,IF(D44=18,2,IF(D44>=20,3))))))","v":3},null,null,null,null,null,{"$f":"IF(B44>D44,A44&C44,IF(D44>B44,C44&A44,\"/\"))","v":"ACAB"},null,{"$f":"A44&C44","v":"ABAC"},{"$f":"E44","v":1},{"$f":"C44&A44","v":"ACAB"},{"$f":"F44","v":3},{"$f":"B44","v":2},{"$f":"D44","v":34}]
["AE",4,"AH",{"$f":"IF(G45=19,19,IF(ISBLANK(B45),\"\",IF(B45=19,0,36-B45)))","v":32},{"$f":"IF(G45=19,0,IF(ISBLANK(B45),\"\",IF(B45<18,1,IF(B45=18,2,IF(B45>18,3)))))","v":1},{"$f":"IF(G45=19,3,IF(ISBLANK(B45),\"\",IF(B45=19,0,IF(D45<18,1,IF(D45=18,2,IF(D45>=20,3))))))","v":3},null,null,null,null,null,{"$f":"IF(B45>D45,A45&C45,IF(D45>B45,C45&A45,\"/\"))","v":"AHAE"},null,{"$f":"A45&C45","v":"AEAH"},{"$f":"E45","v":1},{"$f":"C45&A45","v":"AHAE"},{"$f":"F45","v":3},{"$f":"B45","v":4},{"$f":"D45","v":32}]
[]
["5 éme MATCH le ","à","AE"]
[null,null,null,null,null,null,"SI forfait éq recevante"]
["Equipes","score","Equipes","score","Points","Points"]
["AA",18,"AF",{"$f":"IF(G50=19,19,IF(ISBLANK(B50),\"\",IF(B50=19,0,36-B50)))","v":18},{"$f":"IF(G50=19,0,IF(ISBLANK(B50),\"\",IF(B50<18,1,IF(B50=18,2,IF(B50>18,3)))))","v":2},{"$f":"IF(G50=19,3,IF(ISBLANK(B50),\"\",IF(B50=19,0,IF(D50<18,1,IF(D50=18,2,IF(D50>=20,3))))))","v":2},null,null,null,null,null,{"$f":"IF(B50>D50,A50&C50,IF(D50>B50,C50&A50,\"/\"))","v":"/"},null,{"$f":"A50&C50","v":"AAAF"},{"$f":"E50","v":2},{"$f":"C50&A50","v":"AFAA"},{"$f":"F50","v":2},{"$f":"B50","v":18},{"$f":"D50","v":18}]
["AD",18,"AH",{"$f":"IF(G51=19,19,IF(ISBLANK(B51),\"\",IF(B51=19,0,36-B51)))","v":18},{"$f":"IF(G51=19,0,IF(ISBLANK(B51),\"\",IF(B51<18,1,IF(B51=18,2,IF(B51>18,3)))))","v":2},{"$f":"IF(G51=19,3,IF(ISBLANK(B51),\"\",IF(B51=19,0,IF(D51<18,1,IF(D51=18,2,IF(D51>=20,3))))))","v":2},null,null,null,null,null,{"$f":"IF(B51>D51,A51&C51,IF(D51>B51,C51&A51,\"/\"))","v":"/"},null,{"$f":"A51&C51","v":"ADAH"},{"$f":"E51","v":2},{"$f":"C51&A51","v":"AHAD"},{"$f":"F51","v":2},{"$f":"B51","v":18},{"$f":"D51","v":18}]
["AB",4,"AG",{"$f":"IF(G52=19,19,IF(ISBLANK(B52),\"\",IF(B52=19,0,36-B52)))","v":32},{"$f":"IF(G52=19,0,IF(ISBLANK(B52),\"\",IF(B52<18,1,IF(B52=18,2,IF(B52>18,3)))))","v":1},{"$f":"IF(G52=19,3,IF(ISBLANK(B52),\"\",IF(B52=19,0,IF(D52<18,1,IF(D52=18,2,IF(D52>=20,3))))))","v":3},null,null,null,null,null,{"$f":"IF(B52>D52,A52&C52,IF(D52>B52,C52&A52,\"/\"))","v":"AGAB"},null,{"$f":"A52&C52","v":"ABAG"},{"$f":"E52","v":1},{"$f":"C52&A52","v":"AGAB"},{"$f":"F52","v":3},{"$f":"B52","v":4},{"$f":"D52","v":32}]
["AC",20,"AE",{"$f":"IF(G53=19,19,IF(ISBLANK(B53),\"\",IF(B53=19,0,36-B53)))","v":16},{"$f":"IF(G53=19,0,IF(ISBLANK(B53),\"\",IF(B53<18,1,IF(B53=18,2,IF(B53>18,3)))))","v":3},{"$f":"IF(G53=19,3,IF(ISBLANK(B53),\"\",IF(B53=19,0,IF(D53<18,1,IF(D53=18,2,IF(D53>=20,3))))))","v":1},null,null,null,null,null,{"$f":"IF(B53>D53,A53&C53,IF(D53>B53,C53&A53,\"/\"))","v":"ACAE"},null,{"$f":"A53&C53","v":"ACAE"},{"$f":"E53","v":3},{"$f":"C53&A53","v":"AEAC"},{"$f":"F53","v":1},{"$f":"B53","v":20},{"$f":"D53","v":16}]
[]
["6 éme MATCH le ","à","AF"]
[null,null,null,null,null,null,"SI forfait éq recevante"]
["Equipes","score","Equipes","score","Points","Points"]
["AB",30,"AD",{"$f":"IF(G58=19,19,IF(ISBLANK(B58),\"\",IF(B58=19,0,36-B58)))","v":6},{"$f":"IF(G58=19,0,IF(ISBLANK(B58),\"\",IF(B58<18,1,IF(B58=18,2,IF(B58>18,3)))))","v":3},{"$f":"IF(G58=19,3,IF(ISBLANK(B58),\"\",IF(B58=19,0,IF(D58<18,1,IF(D58=18,2,IF(D58>=20,3))))))","v":1},null,null,null,null,null,{"$f":"IF(B58>D58,A58&C58,IF(D58>B58,C58&A58,\"/\"))","v":"ABAD"},null,{"$f":"A58&C58","v":"ABAD"},{"$f":"E58","v":3},{"$f":"C58&A58","v":"ADAB"},{"$f":"F58","v":1},{"$f":"B58","v":30},{"$f":"D58","v":6}]
["AE",24,"AA",{"$f":"IF(G59=19,19,IF(ISBLANK(B59),\"\",IF(B59=19,0,36-B59)))","v":12},{"$f":"IF(G59=19,0,IF(ISBLANK(B59),\"\",IF(B59<18,1,IF(B59=18,2,IF(B59>18,3)))))","v":3},{"$f":"IF(G59=19,3,IF(ISBLANK(B59),\"\",IF(B59=19,0,IF(D59<18,1,IF(D59=18,2,IF(D59>=20,3))))))","v":1},null,null,null,null,null,{"$f":"IF(B59>D59,A59&C59,IF(D59>B59,C59&A59,\"/\"))","v":"AEAA"},null,{"$f":"A59&C59","v":"AEAA"},{"$f":"E59","v":3},{"$f":"C59&A59","v":"AAAE"},{"$f":"F59","v":1},{"$f":"B59","v":24},{"$f":"D59","v":12}]
["AG",32,"AC",{"$f":"IF(G60=19,19,IF(ISBLANK(B60),\"\",IF(B60=19,0,36-B60)))","v":4},{"$f":"IF(G60=19,0,IF(ISBLANK(B60),\"\",IF(B60<18,1,IF(B60=18,2,IF(B60>18,3)))))","v":3},{"$f":"IF(G60=19,3,IF(ISBLANK(B60),\"\",IF(B60=19,0,IF(D60<18,1,IF(D60=18,2,IF(D60>=20,3))))))","v":1},null,null,null,null,null,{"$f":"IF(B60>D60,A60&C60,IF(D60>B60,C60&A60,\"/\"))","v":"AGAC"},null,{"$f":"A60&C60","v":"AGAC"},{"$f":"E60","v":3},{"$f":"C60&A60","v":"ACAG"},{"$f":"F60","v":1},{"$f":"B60","v":32},{"$f":"D60","v":4}]
["AF",22,"AH",{"$f":"IF(G61=19,19,IF(ISBLANK(B61),\"\",IF(B61=19,0,36-B61)))","v":14},{"$f":"IF(G61=19,0,IF(ISBLANK(B61),\"\",IF(B61<18,1,IF(B61=18,2,IF(B61>18,3)))))","v":3},{"$f":"IF(G61=19,3,IF(ISBLANK(B61),\"\",IF(B61=19,0,IF(D61<18,1,IF(D61=18,2,IF(D61>=20,3))))))","v":1},null,null,null,null,null,{"$f":"IF(B61>D61,A61&C61,IF(D61>B61,C61&A61,\"/\"))","v":"AFAH"},null,{"$f":"A61&C61","v":"AFAH"},{"$f":"E61","v":3},{"$f":"C61&A61","v":"AHAF"},{"$f":"F61","v":1},{"$f":"B61","v":22},{"$f":"D61","v":14}]
[]
["7 éme MATCH le","à","AG"]
[null,null,null,null,null,null,"SI forfait éq recevante",null," "]
["Equipes","score","Equipes","score","Points","Points"]
["AA",20,"AG",{"$f":"IF(G66=19,19,IF(ISBLANK(B66),\"\",IF(B66=19,0,36-B66)))","v":16},{"$f":"IF(G66=19,0,IF(ISBLANK(B66),\"\",IF(B66<18,1,IF(B66=18,2,IF(B66>18,3)))))","v":3},{"$f":"IF(G66=19,3,IF(ISBLANK(B66),\"\",IF(B66=19,0,IF(D66<18,1,IF(D66=18,2,IF(D66>=20,3))))))","v":1},null,null,null,null,null,{"$f":"IF(B66>D66,A66&C66,IF(D66>B66,C66&A66,\"/\"))","v":"AAAG"},null,{"$f":"A66&C66","v":"AAAG"},{"$f":"E66","v":3},{"$f":"C66&A66","v":"AGAA"},{"$f":"F66","v":1},{"$f":"B66","v":20},{"$f":"D66","v":16}]
["AB",12,"AF",{"$f":"IF(G67=19,19,IF(ISBLANK(B67),\"\",IF(B67=19,0,36-B67)))","v":24},{"$f":"IF(G67=19,0,IF(ISBLANK(B67),\"\",IF(B67<18,1,IF(B67=18,2,IF(B67>18,3)))))","v":1},{"$f":"IF(G67=19,3,IF(ISBLANK(B67),\"\",IF(B67=19,0,IF(D67<18,1,IF(D67=18,2,IF(D67>=20,3))))))","v":3},null,null,null,null,null,{"$f":"IF(B67>D67,A67&C67,IF(D67>B67,C67&A67,\"/\"))","v":"AFAB"},null,{"$f":"A67&C67","v":"ABAF"},{"$f":"E67","v":1},{"$f":"C67&A67","v":"AFAB"},{"$f":"F67","v":3},{"$f":"B67","v":12},{"$f":"D67","v":24}]
["AE",18,"AD",{"$f":"IF(G68=19,19,IF(ISBLANK(B68),\"\",IF(B68=19,0,36-B68)))","v":18},{"$f":"IF(G68=19,0,IF(ISBLANK(B68),\"\",IF(B68<18,1,IF(B68=18,2,IF(B68>18,3)))))","v":2},{"$f":"IF(G68=19,3,IF(ISBLANK(B68),\"\",IF(B68=19,0,IF(D68<18,1,IF(D68=18,2,IF(D68>=20,3))))))","v":2},null,null,null,null,null,{"$f":"IF(B68>D68,A68&C68,IF(D68>B68,C68&A68,\"/\"))","v":"/"},null,{"$f":"A68&C68","v":"AEAD"},{"$f":"E68","v":2},{"$f":"C68&A68","v":"ADAE"},{"$f":"F68","v":2},{"$f":"B68","v":18},{"$f":"D68","v":18}]
["AC",18,"AH",{"$f":"IF(G69=19,19,IF(ISBLANK(B69),\"\",IF(B69=19,0,36-B69)))","v":18},{"$f":"IF(G69=19,0,IF(ISBLANK(B69),\"\",IF(B69<18,1,IF(B69=18,2,IF(B69>18,3)))))","v":2},{"$f":"IF(G69=19,3,IF(ISBLANK(B69),\"\",IF(B69=19,0,IF(D69<18,1,IF(D69=18,2,IF(D69>=20,3))))))","v":2},null,null,null,null,null,{"$f":"IF(B69>D69,A69&C69,IF(D69>B69,C69&A69,\"/\"))","v":"/"},null,{"$f":"A69&C69","v":"ACAH"},{"$f":"E69","v":2},{"$f":"C69&A69","v":"AHAC"},{"$f":"F69","v":2},{"$f":"B69","v":18},{"$f":"D69","v":18}]
[null,null,"Si pas d'exaequo",null,null,null,"Classt        Final","Rencontres entre exaequos"]
["EQUIPES",null,"POINTS","POUR","CONTRE","DIFF",null,"POINTS Exaequos","Exaq","n°","AA","AB","AC","AD","AE","AF","AG","AH","Pts matchs",null,null,null,"1000000*Pts matchs +1000 (Diff +  abs(diff mini) )+Pour ","RANG","DIFF Exaequos","POUR Exaequos"]
["AF","1F",18,158,94,64,1,{"$f":"IF(S72>0,S72,\"\")","v":""},{"$f":"COUNTIF($C$72:$C$79,C72)","v":1},{"$f":"IF(AND(I72>1,COUNTIFS(I$72:I72,I72,C$72:C72,C72)=1),MAX(J$71:J71)+1,\"\")","v":""},{"$f":"IF($A72=K$71,\"\",IF(INDEX($C$72:$C$79,MATCH(K$71,$A$72:$A$79,0))=$C72,IFERROR(VLOOKUP($A72&K$71,$N$18:$O$69,2,0),  VLOOKUP(K$71&$A72,$N$18:$Q$69,4,0)),          \"\"))","v":""},"","","","","","","",{"$f":"SUM(K72:R72)","v":0},null,null,null,{"$f":"IF(I72<3,S72*1000000+(F72+ABS(MIN($F$72:$F$79)))*1000+D72,S72*1000000+U96*1000+Z72)","v":116158},{"$f":"IF(I72>2,RANK(W72,OFFSET(W$71,MATCH(I72,$I$72:$I$79,0),,I72)))","v":false},{"$f":"IF(S96=0,\"\",S96)","v":""},{"$f":"IF(S80=0,\"\",S80)","v":""}]
["AC","1C",16,144,108,36,2,"",1,{"$f":"IF(AND(I73>1,COUNTIFS(I$72:I73,I73,C$72:C73,C73)=1),MAX(J$71:J72)+1,\"\")","v":""},"","","","","","","","",{"$f":"SUM(K73:R73)","v":0},null,null,null,{"$f":"IF(I73<3,S73*1000000+(F73+ABS(MIN($F$72:$F$79)))*1000+D73,S73*1000000+U97*1000+Z73)","v":88144},{"$f":"IF(I73>2,RANK(W73,OFFSET(W$71,MATCH(I73,$I$72:$I$79,0),,I73)))","v":false},"",""]
["AD","1D",15,114,138,-24,3,"",1,{"$f":"IF(AND(I74>1,COUNTIFS(I$72:I74,I74,C$72:C74,C74)=1),MAX(J$71:J73)+1,\"\")","v":""},"","","","","","","","",0,null,null,null,28114,false,"",""]
["AH","1H",14,138,114,24,4,"",1,{"$f":"IF(AND(I75>1,COUNTIFS(I$72:I75,I75,C$72:C75,C75)=1),MAX(J$71:J74)+1,\"\")","v":""},"","","","","","","","",0,null,null,null,76138,false,"",""]
["AB","1B",13,100,152,-52,5,"",1,{"$f":"IF(AND(I76>1,COUNTIFS(I$72:I76,I76,C$72:C76,C76)=1),MAX(J$71:J75)+1,\"\")","v":""},"","","","","","","","",0,null,null,null,100,false,"",""]
["AE","1E",12,116,136,-20,6,6,3,{"$f":"IF(AND(I77>1,COUNTIFS(I$72:I77,I77,C$72:C77,C77)=1),MAX(J$71:J76)+1,\"\")","v":1},3,"","","","","",3,"",6,null,null,null,6056052,1,32,52]
["AA","1A",12,110,142,-32,7,4,3,{"$f":"IF(AND(I78>1,COUNTIFS(I$72:I78,I78,C$72:C78,C78)=1),MAX(J$71:J77)+1,\"\")","v":""},"","","","",1,"",3,"",4,null,null,null,4016032,2,-8,32]
["AG","1G",12,128,124,4,8,2,3,{"$f":"IF(AND(I79>1,COUNTIFS(I$72:I79,I79,C$72:C79,C79)=1),MAX(J$71:J78)+1,\"\")","v":""},1,"","","",1,"","","",2,null,null,null,2000024,3,-24,24]
[null,null,null,null,null,null,null,null,"POUR",{"$f":"A72","v":"AF"},{"$f":"IF($A72=K$71,\"\",IF(INDEX($C$72:$C$79,MATCH(K$71,$A$72:$A$79,0))=$C72,IFERROR(VLOOKUP($A72&K$71,$N$18:$R$69,5,0),  VLOOKUP(K$71&$A72,$N$18:$S$69,6,0)),          \"\"))","v":""},"","","","","","","",0]
[null,null,null,null,null,null,null,null,null,"AC","","","","","","","","",0]
[null,null,null,null,null,null,null,null,null,"AD","","","","","","","","",0]
[null,null,null,null,null,null,null,null,null,"AH","","","","","","","","",0]
[null,null,null,null,null,null,null,null,null,"AB","","","","","","","","",0,null,null,null,null,null,"  "]
[null,null,null,null,null,null,null,null,null,"AE",24,"","","","","",28,"",52]
[null,null,null,null,null,null,null,null,null,"AA","","","","",12,"",20,"",32]
[null,null,null,null,null,null,null,null,null,"AG",16,"","","",8,"","","",24]
[null,null,null,null,null,null,null,null,"CONTRE",{"$f":"J80","v":"AF"},{"$f":"INDEX($K$80:$R$87,MATCH(K$71,$J$80:$J$87,0),MATCH($J80,$K$71:$R$71,0))","v":""},{"$f":"INDEX($K$80:$R$87,MATCH(L$71,$J$80:$J$87,0),MATCH($J80,$K$71:$R$71,0))","v":""},"","","","","","",0]
[null,null,null,null,null,null,null,null,null,{"$f":"J81","v":"AC"},{"$f":"INDEX($K$80:$R$87,MATCH(K$71,$J$80:$J$87,0),MATCH($J81,$K$71:$R$71,0))","v":""},"","","","","","","",0]
[null,null,null,null,null,null,null,null,null,"AD","","","","","","","","",0]
[null,null,null,null,null,null,null,null,null,"AH","","","","","","","","",0]
[null,null,null,null,null,null,null,null,null,"AB","","","","","","","","",0]
[null,null,null,null,null,null,null,null,null,"AE",12,"","","","","",8,"",20]
[null,null,null,null,null,null,null,null,null,"AA","","","","",24,"",16,"",40]
[null,null,null,null,null,null,null,null,null,"AG",20,"","","",28,"","","",48,null,"Diff pondérée"]
[null,null,null,null,null,null,null,null,"DIFF",{"$f":"J88","v":"AF"},null,null,null,null,null,null,null,null,{"$f":"S80-S88","v":0},null,{"$f":"S96+ABS(MIN($S$96:$S$103))","v":24}]
[null,null,null,null,null,null,null,null,null,{"$f":"J89","v":"AC"},null,null,null,null,null,null,null,null,{"$f":"S81-S89","v":0},null,24]
[null,null,null,null,null,null,null,null,null,"AD",null,null,null,null,null,null,null,null,0,null,24]
[null,null,null,null,null,null,null,null,null,"AH",null,null,null,null,null,null,null,null,0,null,24]
[null,null,null,null,null,null,null,null,null,"AB",null,null,null,null,null,null,null,null,0,null,24]
[null,null,null,null,null,null,null,null,null,"AE",null,null,null,null,null,null,null,null,32,null,56]
[null,null,null,null,null,null,null,null,null,"AA",null,null,null,null,null,null,null,null,-8,null,{"$f":"S102+ABS(MIN($S$96:$S$103))","v":16}]
[null,null,null,null,null,null,null,null,null,"AG",null,null,null,null,null,null,null,null,-24,null,{"$f":"S103+ABS(MIN($S$96:$S$103))","v":0}]

{"sheet":"P8","index":7,"n_rows":103,"n_cols":26,"rows_kept":103,"cut":false,"hidden":false,"merged":[[0,0,0,5],[1,0,1,5],[2,0,2,5],[3,0,3,5],[3,8,3,10],[15,6,16,6],[69,2,69,5],[69,6,70,6],[69,7,69,25],[23,6,24,6],[31,6,32,6],[39,6,40,6],[47,6,48,6],[55,6,56,6],[63,6,64,6]]}
[null,null,null,null,null,null,3]
["CHAMPIONNAT DES CLUBS"]
[]
["POULE 1"]
["EQUIPES",null,"POINTS","Pour","Contre","Diff"]
["AA","1A",{"$f":"SUMIF($A$18:$A$69,A6,$E$18:$E$69)+SUMIF($C$18:$C$69,A6,$F$18:$F$69)","v":19},{"$f":"SUMIF($A$18:$A$69,$A6,$B$18:$B$69)+SUMIF($C$18:$C$69,$A6,$D$18:$D$69)","v":148},{"$f":"SUMIF($C$18:$C$69,$A6,$B$18:$B$69)+SUMIF($A$18:$A$69,$A6,$D$18:$D$69)","v":104},{"$f":"D6-E6","v":44}]
["AB","1B",{"$f":"SUMIF($A$18:$A$69,A7,$E$18:$E$69)+SUMIF($C$18:$C$69,A7,$F$18:$F$69)","v":19},{"$f":"SUMIF($A$18:$A$69,$A7,$B$18:$B$69)+SUMIF($C$18:$C$69,$A7,$D$18:$D$69)","v":194},{"$f":"SUMIF($C$18:$C$69,$A7,$B$18:$B$69)+SUMIF($A$18:$A$69,$A7,$D$18:$D$69)","v":58},136]
["AC","1C",{"$f":"SUMIF($A$18:$A$69,A8,$E$18:$E$69)+SUMIF($C$18:$C$69,A8,$F$18:$F$69)","v":15},92,160,-68]
["AD","1D",13,128,124,4]
["AE","1E",17,146,106,40]
["AF","1F",11,102,150,-48]
["AG","1G",11,114,138,{"$f":"D12-E12","v":-24}]
["AH","1H",7,{"$f":"SUMIF($A$18:$A$69,$A13,$B$18:$B$69)+SUMIF($C$18:$C$69,$A13,$D$18:$D$69)","v":84},168,{"$f":"D13-E13","v":-84}]
[]
["1er MATCH le ","à","AA"]
[null,null,null,null,null,null,"SI forfait éq recevante"]
["Equipes","score","Equipes","score","Points","Points"]
["AA",20,"AB",{"$f":"IF(G18=19,19,IF(ISBLANK(B18),\"\",IF(B18=19,0,36-B18)))","v":16},{"$f":"IF(G18=19,0,IF(ISBLANK(B18),\"\",IF(B18<18,1,IF(B18=18,2,IF(B18>18,3)))))","v":3},{"$f":"IF(G18=19,3,IF(ISBLANK(B18),\"\",IF(B18=19,0,IF(D18<18,1,IF(D18=18,2,IF(D18>=20,3))))))","v":1},null,null,null,null,null,{"$f":"IF(B18>D18,A18&C18,IF(D18>B18,C18&A18,\"/\"))","v":"AAAB"},null,{"$f":"A18&C18","v":"AAAB"},{"$f":"E18","v":3},{"$f":"C18&A18","v":"ABAA"},{"$f":"F18","v":1},{"$f":"B18","v":20},{"$f":"D18","v":16}]
["AC",22,"AD",{"$f":"IF(G19=19,19,IF(ISBLANK(B19),\"\",IF(B19=19,0,36-B19)))","v":14},{"$f":"IF(G19=19,0,IF(ISBLANK(B19),\"\",IF(B19<18,1,IF(B19=18,2,IF(B19>18,3)))))","v":3},{"$f":"IF(G19=19,3,IF(ISBLANK(B19),\"\",IF(B19=19,0,IF(D19<18,1,IF(D19=18,2,IF(D19>=20,3))))))","v":1},null,null,null,null,null,{"$f":"IF(B19>D19,A19&C19,IF(D19>B19,C19&A19,\"/\"))","v":"ACAD"},null,{"$f":"A19&C19","v":"ACAD"},{"$f":"E19","v":3},{"$f":"C19&A19","v":"ADAC"},{"$f":"F19","v":1},{"$f":"B19","v":22},{"$f":"D19","v":14}]
["AE",30,"AF",{"$f":"IF(G20=19,19,IF(ISBLANK(B20),\"\",IF(B20=19,0,36-B20)))","v":6},{"$f":"IF(G20=19,0,IF(ISBLANK(B20),\"\",IF(B20<18,1,IF(B20=18,2,IF(B20>18,3)))))","v":3},{"$f":"IF(G20=19,3,IF(ISBLANK(B20),\"\",IF(B20=19,0,IF(D20<18,1,IF(D20=18,2,IF(D20>=20,3))))))","v":1},null,null,null,null,null,{"$f":"IF(B20>D20,A20&C20,IF(D20>B20,C20&A20,\"/\"))","v":"AEAF"},null,{"$f":"A20&C20","v":"AEAF"},{"$f":"E20","v":3},{"$f":"C20&A20","v":"AFAE"},{"$f":"F20","v":1},{"$f":"B20","v":30},{"$f":"D20","v":6}]
["AG",24,"AH",{"$f":"IF(G21=19,19,IF(ISBLANK(B21),\"\",IF(B21=19,0,36-B21)))","v":12},{"$f":"IF(G21=19,0,IF(ISBLANK(B21),\"\",IF(B21<18,1,IF(B21=18,2,IF(B21>18,3)))))","v":3},{"$f":"IF(G21=19,3,IF(ISBLANK(B21),\"\",IF(B21=19,0,IF(D21<18,1,IF(D21=18,2,IF(D21>=20,3))))))","v":1},null,null,null,null,null,{"$f":"IF(B21>D21,A21&C21,IF(D21>B21,C21&A21,\"/\"))","v":"AGAH"},null,{"$f":"A21&C21","v":"AGAH"},{"$f":"E21","v":3},{"$f":"C21&A21","v":"AHAG"},{"$f":"F21","v":1},{"$f":"B21","v":24},{"$f":"D21","v":12}]
[]
["2 éme MATCH le ","à","AB"]
[null,null,null,null,null,null,"SI forfait éq recevante"]
["Equipes","score","Equipes","score","Points","Points"]
["AA",36,"AC",{"$f":"IF(G26=19,19,IF(ISBLANK(B26),\"\",IF(B26=19,0,36-B26)))","v":0},{"$f":"IF(G26=19,0,IF(ISBLANK(B26),\"\",IF(B26<18,1,IF(B26=18,2,IF(B26>18,3)))))","v":3},{"$f":"IF(G26=19,3,IF(ISBLANK(B26),\"\",IF(B26=19,0,IF(D26<18,1,IF(D26=18,2,IF(D26>=20,3))))))","v":1},null,null,null,null,null,{"$f":"IF(B26>D26,A26&C26,IF(D26>B26,C26&A26,\"/\"))","v":"AAAC"},null,{"$f":"A26&C26","v":"AAAC"},{"$f":"E26","v":3},{"$f":"C26&A26","v":"ACAA"},{"$f":"F26","v":1},{"$f":"B26","v":36},{"$f":"D26","v":0}]
["AB",32,"AH",{"$f":"IF(G27=19,19,IF(ISBLANK(B27),\"\",IF(B27=19,0,36-B27)))","v":4},{"$f":"IF(G27=19,0,IF(ISBLANK(B27),\"\",IF(B27<18,1,IF(B27=18,2,IF(B27>18,3)))))","v":3},{"$f":"IF(G27=19,3,IF(ISBLANK(B27),\"\",IF(B27=19,0,IF(D27<18,1,IF(D27=18,2,IF(D27>=20,3))))))","v":1},null,null,null,null,null,{"$f":"IF(B27>D27,A27&C27,IF(D27>B27,C27&A27,\"/\"))","v":"ABAH"},null,{"$f":"A27&C27","v":"ABAH"},{"$f":"E27","v":3},{"$f":"C27&A27","v":"AHAB"},{"$f":"F27","v":1},{"$f":"B27","v":32},{"$f":"D27","v":4}]
["AD",30,"AF",{"$f":"IF(G28=19,19,IF(ISBLANK(B28),\"\",IF(B28=19,0,36-B28)))","v":6},{"$f":"IF(G28=19,0,IF(ISBLANK(B28),\"\",IF(B28<18,1,IF(B28=18,2,IF(B28>18,3)))))","v":3},{"$f":"IF(G28=19,3,IF(ISBLANK(B28),\"\",IF(B28=19,0,IF(D28<18,1,IF(D28=18,2,IF(D28>=20,3))))))","v":1},null,null,null,null,null,{"$f":"IF(B28>D28,A28&C28,IF(D28>B28,C28&A28,\"/\"))","v":"ADAF"},null,{"$f":"A28&C28","v":"ADAF"},{"$f":"E28","v":3},{"$f":"C28&A28","v":"AFAD"},{"$f":"F28","v":1},{"$f":"B28","v":30},{"$f":"D28","v":6}]
["AE",20,"AG",{"$f":"IF(G29=19,19,IF(ISBLANK(B29),\"\",IF(B29=19,0,36-B29)))","v":16},{"$f":"IF(G29=19,0,IF(ISBLANK(B29),\"\",IF(B29<18,1,IF(B29=18,2,IF(B29>18,3)))))","v":3},{"$f":"IF(G29=19,3,IF(ISBLANK(B29),\"\",IF(B29=19,0,IF(D29<18,1,IF(D29=18,2,IF(D29>=20,3))))))","v":1},null,null,null,null,null,{"$f":"IF(B29>D29,A29&C29,IF(D29>B29,C29&A29,\"/\"))","v":"AEAG"},null,{"$f":"A29&C29","v":"AEAG"},{"$f":"E29","v":3},{"$f":"C29&A29","v":"AGAE"},{"$f":"F29","v":1},{"$f":"B29","v":20},{"$f":"D29","v":16}]
[]
["3 éme MATCH le ","à","AC"]
[null,null,null,null,null,null,"SI forfait éq recevante"]
["Equipes","score","Equipes","score","Points","Points"]
["AA",20,"AH",{"$f":"IF(G34=19,19,IF(ISBLANK(B34),\"\",IF(B34=19,0,36-B34)))","v":16},{"$f":"IF(G34=19,0,IF(ISBLANK(B34),\"\",IF(B34<18,1,IF(B34=18,2,IF(B34>18,3)))))","v":3},{"$f":"IF(G34=19,3,IF(ISBLANK(B34),\"\",IF(B34=19,0,IF(D34<18,1,IF(D34=18,2,IF(D34>=20,3))))))","v":1},null,null,null,null,null,{"$f":"IF(B34>D34,A34&C34,IF(D34>B34,C34&A34,\"/\"))","v":"AAAH"},null,{"$f":"A34&C34","v":"AAAH"},{"$f":"E34","v":3},{"$f":"C34&A34","v":"AHAA"},{"$f":"F34","v":1},{"$f":"B34","v":20},{"$f":"D34","v":16}]
["AB",24,"AE",{"$f":"IF(G35=19,19,IF(ISBLANK(B35),\"\",IF(B35=19,0,36-B35)))","v":12},{"$f":"IF(G35=19,0,IF(ISBLANK(B35),\"\",IF(B35<18,1,IF(B35=18,2,IF(B35>18,3)))))","v":3},{"$f":"IF(G35=19,3,IF(ISBLANK(B35),\"\",IF(B35=19,0,IF(D35<18,1,IF(D35=18,2,IF(D35>=20,3))))))","v":1},null,null,null,null,null,{"$f":"IF(B35>D35,A35&C35,IF(D35>B35,C35&A35,\"/\"))","v":"ABAE"},null,{"$f":"A35&C35","v":"ABAE"},{"$f":"E35","v":3},{"$f":"C35&A35","v":"AEAB"},{"$f":"F35","v":1},{"$f":"B35","v":24},{"$f":"D35","v":12}]
["AC",20,"AF",{"$f":"IF(G36=19,19,IF(ISBLANK(B36),\"\",IF(B36=19,0,36-B36)))","v":16},{"$f":"IF(G36=19,0,IF(ISBLANK(B36),\"\",IF(B36<18,1,IF(B36=18,2,IF(B36>18,3)))))","v":3},{"$f":"IF(G36=19,3,IF(ISBLANK(B36),\"\",IF(B36=19,0,IF(D36<18,1,IF(D36=18,2,IF(D36>=20,3))))))","v":1},null,null,null,null,null,{"$f":"IF(B36>D36,A36&C36,IF(D36>B36,C36&A36,\"/\"))","v":"ACAF"},null,{"$f":"A36&C36","v":"ACAF"},{"$f":"E36","v":3},{"$f":"C36&A36","v":"AFAC"},{"$f":"F36","v":1},{"$f":"B36","v":20},{"$f":"D36","v":16}]
["AD",22,"AG",{"$f":"IF(G37=19,19,IF(ISBLANK(B37),\"\",IF(B37=19,0,36-B37)))","v":14},{"$f":"IF(G37=19,0,IF(ISBLANK(B37),\"\",IF(B37<18,1,IF(B37=18,2,IF(B37>18,3)))))","v":3},{"$f":"IF(G37=19,3,IF(ISBLANK(B37),\"\",IF(B37=19,0,IF(D37<18,1,IF(D37=18,2,IF(D37>=20,3))))))","v":1},null,null,null,null,null,{"$f":"IF(B37>D37,A37&C37,IF(D37>B37,C37&A37,\"/\"))","v":"ADAG"},null,{"$f":"A37&C37","v":"ADAG"},{"$f":"E37","v":3},{"$f":"C37&A37","v":"AGAD"},{"$f":"F37","v":1},{"$f":"B37","v":22},{"$f":"D37","v":14}]
[]
["4 éme MATCH le ","à","AD"]
[null,null,null,null,null,null,"SI forfait éq recevante"]
["Equipes","score","Equipes","score","Points","Points"]
["AA",20,"AD",{"$f":"IF(G42=19,19,IF(ISBLANK(B42),\"\",IF(B42=19,0,36-B42)))","v":16},{"$f":"IF(G42=19,0,IF(ISBLANK(B42),\"\",IF(B42<18,1,IF(B42=18,2,IF(B42>18,3)))))","v":3},{"$f":"IF(G42=19,3,IF(ISBLANK(B42),\"\",IF(B42=19,0,IF(D42<18,1,IF(D42=18,2,IF(D42>=20,3))))))","v":1},null,null,null,null,null,{"$f":"IF(B42>D42,A42&C42,IF(D42>B42,C42&A42,\"/\"))","v":"AAAD"},null,{"$f":"A42&C42","v":"AAAD"},{"$f":"E42","v":3},{"$f":"C42&A42","v":"ADAA"},{"$f":"F42","v":1},{"$f":"B42","v":20},{"$f":"D42","v":16}]
["AF",26,"AG",{"$f":"IF(G43=19,19,IF(ISBLANK(B43),\"\",IF(B43=19,0,36-B43)))","v":10},{"$f":"IF(G43=19,0,IF(ISBLANK(B43),\"\",IF(B43<18,1,IF(B43=18,2,IF(B43>18,3)))))","v":3},{"$f":"IF(G43=19,3,IF(ISBLANK(B43),\"\",IF(B43=19,0,IF(D43<18,1,IF(D43=18,2,IF(D43>=20,3))))))","v":1},null,null,null,null,null,{"$f":"IF(B43>D43,A43&C43,IF(D43>B43,C43&A43,\"/\"))","v":"AFAG"},null,{"$f":"A43&C43","v":"AFAG"},{"$f":"E43","v":3},{"$f":"C43&A43","v":"AGAF"},{"$f":"F43","v":1},{"$f":"B43","v":26},{"$f":"D43","v":10}]
["AB",32,"AC",{"$f":"IF(G44=19,19,IF(ISBLANK(B44),\"\",IF(B44=19,0,36-B44)))","v":4},{"$f":"IF(G44=19,0,IF(ISBLANK(B44),\"\",IF(B44<18,1,IF(B44=18,2,IF(B44>18,3)))))","v":3},{"$f":"IF(G44=19,3,IF(ISBLANK(B44),\"\",IF(B44=19,0,IF(D44<18,1,IF(D44=18,2,IF(D44>=20,3))))))","v":1},null,null,null,null,null,{"$f":"IF(B44>D44,A44&C44,IF(D44>B44,C44&A44,\"/\"))","v":"ABAC"},null,{"$f":"A44&C44","v":"ABAC"},{"$f":"E44","v":3},{"$f":"C44&A44","v":"ACAB"},{"$f":"F44","v":1},{"$f":"B44","v":32},{"$f":"D44","v":4}]
["AE",20,"AH",{"$f":"IF(G45=19,19,IF(ISBLANK(B45),\"\",IF(B45=19,0,36-B45)))","v":16},{"$f":"IF(G45=19,0,IF(ISBLANK(B45),\"\",IF(B45<18,1,IF(B45=18,2,IF(B45>18,3)))))","v":3},{"$f":"IF(G45=19,3,IF(ISBLANK(B45),\"\",IF(B45=19,0,IF(D45<18,1,IF(D45=18,2,IF(D45>=20,3))))))","v":1},null,null,null,null,null,{"$f":"IF(B45>D45,A45&C45,IF(D45>B45,C45&A45,\"/\"))","v":"AEAH"},null,{"$f":"A45&C45","v":"AEAH"},{"$f":"E45","v":3},{"$f":"C45&A45","v":"AHAE"},{"$f":"F45","v":1},{"$f":"B45","v":20},{"$f":"D45","v":16}]
[]
["5 éme MATCH le ","à","AE"]
[null,null,null,null,null,null,"SI forfait éq recevante"]
["Equipes","score","Equipes","score","Points","Points"]
["AA",20,"AF",{"$f":"IF(G50=19,19,IF(ISBLANK(B50),\"\",IF(B50=19,0,36-B50)))","v":16},{"$f":"IF(G50=19,0,IF(ISBLANK(B50),\"\",IF(B50<18,1,IF(B50=18,2,IF(B50>18,3)))))","v":3},{"$f":"IF(G50=19,3,IF(ISBLANK(B50),\"\",IF(B50=19,0,IF(D50<18,1,IF(D50=18,2,IF(D50>=20,3))))))","v":1},null,null,null,null,null,{"$f":"IF(B50>D50,A50&C50,IF(D50>B50,C50&A50,\"/\"))","v":"AAAF"},null,{"$f":"A50&C50","v":"AAAF"},{"$f":"E50","v":3},{"$f":"C50&A50","v":"AFAA"},{"$f":"F50","v":1},{"$f":"B50","v":20},{"$f":"D50","v":16}]
["AD",28,"AH",{"$f":"IF(G51=19,19,IF(ISBLANK(B51),\"\",IF(B51=19,0,36-B51)))","v":8},{"$f":"IF(G51=19,0,IF(ISBLANK(B51),\"\",IF(B51<18,1,IF(B51=18,2,IF(B51>18,3)))))","v":3},{"$f":"IF(G51=19,3,IF(ISBLANK(B51),\"\",IF(B51=19,0,IF(D51<18,1,IF(D51=18,2,IF(D51>=20,3))))))","v":1},null,null,null,null,null,{"$f":"IF(B51>D51,A51&C51,IF(D51>B51,C51&A51,\"/\"))","v":"ADAH"},null,{"$f":"A51&C51","v":"ADAH"},{"$f":"E51","v":3},{"$f":"C51&A51","v":"AHAD"},{"$f":"F51","v":1},{"$f":"B51","v":28},{"$f":"D51","v":8}]
["AB",34,"AG",{"$f":"IF(G52=19,19,IF(ISBLANK(B52),\"\",IF(B52=19,0,36-B52)))","v":2},{"$f":"IF(G52=19,0,IF(ISBLANK(B52),\"\",IF(B52<18,1,IF(B52=18,2,IF(B52>18,3)))))","v":3},{"$f":"IF(G52=19,3,IF(ISBLANK(B52),\"\",IF(B52=19,0,IF(D52<18,1,IF(D52=18,2,IF(D52>=20,3))))))","v":1},null,null,null,null,null,{"$f":"IF(B52>D52,A52&C52,IF(D52>B52,C52&A52,\"/\"))","v":"ABAG"},null,{"$f":"A52&C52","v":"ABAG"},{"$f":"E52","v":3},{"$f":"C52&A52","v":"AGAB"},{"$f":"F52","v":1},{"$f":"B52","v":34},{"$f":"D52","v":2}]
["AC",20,"AE",{"$f":"IF(G53=19,19,IF(ISBLANK(B53),\"\",IF(B53=19,0,36-B53)))","v":16},{"$f":"IF(G53=19,0,IF(ISBLANK(B53),\"\",IF(B53<18,1,IF(B53=18,2,IF(B53>18,3)))))","v":3},{"$f":"IF(G53=19,3,IF(ISBLANK(B53),\"\",IF(B53=19,0,IF(D53<18,1,IF(D53=18,2,IF(D53>=20,3))))))","v":1},null,null,null,null,null,{"$f":"IF(B53>D53,A53&C53,IF(D53>B53,C53&A53,\"/\"))","v":"ACAE"},null,{"$f":"A53&C53","v":"ACAE"},{"$f":"E53","v":3},{"$f":"C53&A53","v":"AEAC"},{"$f":"F53","v":1},{"$f":"B53","v":20},{"$f":"D53","v":16}]
[]
["6 éme MATCH le ","à","AF"]
[null,null,null,null,null,null,"SI forfait éq recevante"]
["Equipes","score","Equipes","score","Points","Points"]
["AB",30,"AD",{"$f":"IF(G58=19,19,IF(ISBLANK(B58),\"\",IF(B58=19,0,36-B58)))","v":6},{"$f":"IF(G58=19,0,IF(ISBLANK(B58),\"\",IF(B58<18,1,IF(B58=18,2,IF(B58>18,3)))))","v":3},{"$f":"IF(G58=19,3,IF(ISBLANK(B58),\"\",IF(B58=19,0,IF(D58<18,1,IF(D58=18,2,IF(D58>=20,3))))))","v":1},null,null,null,null,null,{"$f":"IF(B58>D58,A58&C58,IF(D58>B58,C58&A58,\"/\"))","v":"ABAD"},null,{"$f":"A58&C58","v":"ABAD"},{"$f":"E58","v":3},{"$f":"C58&A58","v":"ADAB"},{"$f":"F58","v":1},{"$f":"B58","v":30},{"$f":"D58","v":6}]
["AE",24,"AA",{"$f":"IF(G59=19,19,IF(ISBLANK(B59),\"\",IF(B59=19,0,36-B59)))","v":12},{"$f":"IF(G59=19,0,IF(ISBLANK(B59),\"\",IF(B59<18,1,IF(B59=18,2,IF(B59>18,3)))))","v":3},{"$f":"IF(G59=19,3,IF(ISBLANK(B59),\"\",IF(B59=19,0,IF(D59<18,1,IF(D59=18,2,IF(D59>=20,3))))))","v":1},null,null,null,null,null,{"$f":"IF(B59>D59,A59&C59,IF(D59>B59,C59&A59,\"/\"))","v":"AEAA"},null,{"$f":"A59&C59","v":"AEAA"},{"$f":"E59","v":3},{"$f":"C59&A59","v":"AAAE"},{"$f":"F59","v":1},{"$f":"B59","v":24},{"$f":"D59","v":12}]
["AG",32,"AC",{"$f":"IF(G60=19,19,IF(ISBLANK(B60),\"\",IF(B60=19,0,36-B60)))","v":4},{"$f":"IF(G60=19,0,IF(ISBLANK(B60),\"\",IF(B60<18,1,IF(B60=18,2,IF(B60>18,3)))))","v":3},{"$f":"IF(G60=19,3,IF(ISBLANK(B60),\"\",IF(B60=19,0,IF(D60<18,1,IF(D60=18,2,IF(D60>=20,3))))))","v":1},null,null,null,null,null,{"$f":"IF(B60>D60,A60&C60,IF(D60>B60,C60&A60,\"/\"))","v":"AGAC"},null,{"$f":"A60&C60","v":"AGAC"},{"$f":"E60","v":3},{"$f":"C60&A60","v":"ACAG"},{"$f":"F60","v":1},{"$f":"B60","v":32},{"$f":"D60","v":4}]
["AF",22,"AH",{"$f":"IF(G61=19,19,IF(ISBLANK(B61),\"\",IF(B61=19,0,36-B61)))","v":14},{"$f":"IF(G61=19,0,IF(ISBLANK(B61),\"\",IF(B61<18,1,IF(B61=18,2,IF(B61>18,3)))))","v":3},{"$f":"IF(G61=19,3,IF(ISBLANK(B61),\"\",IF(B61=19,0,IF(D61<18,1,IF(D61=18,2,IF(D61>=20,3))))))","v":1},null,null,null,null,null,{"$f":"IF(B61>D61,A61&C61,IF(D61>B61,C61&A61,\"/\"))","v":"AFAH"},null,{"$f":"A61&C61","v":"AFAH"},{"$f":"E61","v":3},{"$f":"C61&A61","v":"AHAF"},{"$f":"F61","v":1},{"$f":"B61","v":22},{"$f":"D61","v":14}]
[]
["7 éme MATCH le","à","AG"]
[null,null,null,null,null,null,"SI forfait éq recevante",null," "]
["Equipes","score","Equipes","score","Points","Points"]
["AA",20,"AG",{"$f":"IF(G66=19,19,IF(ISBLANK(B66),\"\",IF(B66=19,0,36-B66)))","v":16},{"$f":"IF(G66=19,0,IF(ISBLANK(B66),\"\",IF(B66<18,1,IF(B66=18,2,IF(B66>18,3)))))","v":3},{"$f":"IF(G66=19,3,IF(ISBLANK(B66),\"\",IF(B66=19,0,IF(D66<18,1,IF(D66=18,2,IF(D66>=20,3))))))","v":1},null,null,null,null,null,{"$f":"IF(B66>D66,A66&C66,IF(D66>B66,C66&A66,\"/\"))","v":"AAAG"},null,{"$f":"A66&C66","v":"AAAG"},{"$f":"E66","v":3},{"$f":"C66&A66","v":"AGAA"},{"$f":"F66","v":1},{"$f":"B66","v":20},{"$f":"D66","v":16}]
["AB",26,"AF",{"$f":"IF(G67=19,19,IF(ISBLANK(B67),\"\",IF(B67=19,0,36-B67)))","v":10},{"$f":"IF(G67=19,0,IF(ISBLANK(B67),\"\",IF(B67<18,1,IF(B67=18,2,IF(B67>18,3)))))","v":3},{"$f":"IF(G67=19,3,IF(ISBLANK(B67),\"\",IF(B67=19,0,IF(D67<18,1,IF(D67=18,2,IF(D67>=20,3))))))","v":1},null,null,null,null,null,{"$f":"IF(B67>D67,A67&C67,IF(D67>B67,C67&A67,\"/\"))","v":"ABAF"},null,{"$f":"A67&C67","v":"ABAF"},{"$f":"E67","v":3},{"$f":"C67&A67","v":"AFAB"},{"$f":"F67","v":1},{"$f":"B67","v":26},{"$f":"D67","v":10}]
["AE",24,"AD",{"$f":"IF(G68=19,19,IF(ISBLANK(B68),\"\",IF(B68=19,0,36-B68)))","v":12},{"$f":"IF(G68=19,0,IF(ISBLANK(B68),\"\",IF(B68<18,1,IF(B68=18,2,IF(B68>18,3)))))","v":3},{"$f":"IF(G68=19,3,IF(ISBLANK(B68),\"\",IF(B68=19,0,IF(D68<18,1,IF(D68=18,2,IF(D68>=20,3))))))","v":1},null,null,null,null,null,{"$f":"IF(B68>D68,A68&C68,IF(D68>B68,C68&A68,\"/\"))","v":"AEAD"},null,{"$f":"A68&C68","v":"AEAD"},{"$f":"E68","v":3},{"$f":"C68&A68","v":"ADAE"},{"$f":"F68","v":1},{"$f":"B68","v":24},{"$f":"D68","v":12}]
["AC",22,"AH",{"$f":"IF(G69=19,19,IF(ISBLANK(B69),\"\",IF(B69=19,0,36-B69)))","v":14},{"$f":"IF(G69=19,0,IF(ISBLANK(B69),\"\",IF(B69<18,1,IF(B69=18,2,IF(B69>18,3)))))","v":3},{"$f":"IF(G69=19,3,IF(ISBLANK(B69),\"\",IF(B69=19,0,IF(D69<18,1,IF(D69=18,2,IF(D69>=20,3))))))","v":1},null,null,null,null,null,{"$f":"IF(B69>D69,A69&C69,IF(D69>B69,C69&A69,\"/\"))","v":"ACAH"},null,{"$f":"A69&C69","v":"ACAH"},{"$f":"E69","v":3},{"$f":"C69&A69","v":"AHAC"},{"$f":"F69","v":1},{"$f":"B69","v":22},{"$f":"D69","v":14}]
[null,null,"Si pas d'exaequo",null,null,null,"Classt        Final","Rencontres entre exaequos"]
["EQUIPES",null,"POINTS","POUR","CONTRE","DIFF",null,"POINTS Exaequos","Exaq","n°","AA","AB","AC","AD","AE","AF","AG","AH","Pts matchs",null,null,null,"1000000*Pts matchs +1000 (Diff +  abs(diff mini) )+Pour ","RANG","DIFF Exaequos","POUR Exaequos"]
["AA","1A",19,148,104,44,1,{"$f":"IF(S72>0,S72,\"\")","v":3},{"$f":"COUNTIF($C$72:$C$79,C72)","v":2},{"$f":"IF(AND(I72>1,COUNTIFS(I$72:I72,I72,C$72:C72,C72)=1),MAX(J$71:J71)+1,\"\")","v":1},{"$f":"IF($A72=K$71,\"\",IF(INDEX($C$72:$C$79,MATCH(K$71,$A$72:$A$79,0))=$C72,IFERROR(VLOOKUP($A72&K$71,$N$18:$O$69,2,0),  VLOOKUP(K$71&$A72,$N$18:$Q$69,4,0)),          \"\"))","v":""},3,"","","","","","",{"$f":"SUM(K72:R72)","v":3},null,null,null,{"$f":"IF(I72<3,S72*1000000+(F72+ABS(MIN($F$72:$F$79)))*1000+D72,S72*1000000+U96*1000+Z72)","v":3128148},{"$f":"IF(I72>2,RANK(W72,OFFSET(W$71,MATCH(I72,$I$72:$I$79,0),,I72)))","v":false},{"$f":"IF(S96=0,\"\",S96)","v":4},{"$f":"IF(S80=0,\"\",S80)","v":20}]
["AB","1B",19,194,58,136,2,1,2,{"$f":"IF(AND(I73>1,COUNTIFS(I$72:I73,I73,C$72:C73,C73)=1),MAX(J$71:J72)+1,\"\")","v":""},1,"","","","","","","",{"$f":"SUM(K73:R73)","v":1},null,null,null,{"$f":"IF(I73<3,S73*1000000+(F73+ABS(MIN($F$72:$F$79)))*1000+D73,S73*1000000+U97*1000+Z73)","v":1220194},{"$f":"IF(I73>2,RANK(W73,OFFSET(W$71,MATCH(I73,$I$72:$I$79,0),,I73)))","v":false},-4,16]
["AE","1E",17,146,106,40,3,"",1,{"$f":"IF(AND(I74>1,COUNTIFS(I$72:I74,I74,C$72:C74,C74)=1),MAX(J$71:J73)+1,\"\")","v":""},"","","","","","","","",0,null,null,null,124146,false,"",""]
["AC","1C",15,92,160,-68,4,"",1,{"$f":"IF(AND(I75>1,COUNTIFS(I$72:I75,I75,C$72:C75,C75)=1),MAX(J$71:J74)+1,\"\")","v":""},"","","","","","","","",0,null,null,null,16092,false,"",""]
["AD","1D",13,128,124,4,5,"",1,{"$f":"IF(AND(I76>1,COUNTIFS(I$72:I76,I76,C$72:C76,C76)=1),MAX(J$71:J75)+1,\"\")","v":""},"","","","","","","","",0,null,null,null,88128,false,"",""]
["AF","1F",11,102,150,-48,6,3,2,{"$f":"IF(AND(I77>1,COUNTIFS(I$72:I77,I77,C$72:C77,C77)=1),MAX(J$71:J76)+1,\"\")","v":2},"","","","","","",3,"",3,null,null,null,3036102,false,16,26]
["AG","1G",11,114,138,-24,7,1,2,{"$f":"IF(AND(I78>1,COUNTIFS(I$72:I78,I78,C$72:C78,C78)=1),MAX(J$71:J77)+1,\"\")","v":""},"","","","","",1,"","",1,null,null,null,1060114,false,-16,10]
["AH","1H",7,84,168,-84,8,"",1,{"$f":"IF(AND(I79>1,COUNTIFS(I$72:I79,I79,C$72:C79,C79)=1),MAX(J$71:J78)+1,\"\")","v":""},"","","","","","","","",0,null,null,null,84,false,"",""]
[null,null,null,null,null,null,null,null,"POUR",{"$f":"A72","v":"AA"},{"$f":"IF($A72=K$71,\"\",IF(INDEX($C$72:$C$79,MATCH(K$71,$A$72:$A$79,0))=$C72,IFERROR(VLOOKUP($A72&K$71,$N$18:$R$69,5,0),  VLOOKUP(K$71&$A72,$N$18:$S$69,6,0)),          \"\"))","v":""},20,"","","","","","",20]
[null,null,null,null,null,null,null,null,null,"AB",16,"","","","","","","",16]
[null,null,null,null,null,null,null,null,null,"AE","","","","","","","","",0]
[null,null,null,null,null,null,null,null,null,"AC","","","","","","","","",0]
[null,null,null,null,null,null,null,null,null,"AD","","","","","","","","",0,null,null,null,null,null,"  "]
[null,null,null,null,null,null,null,null,null,"AF","","","","","","",26,"",26]
[null,null,null,null,null,null,null,null,null,"AG","","","","","",10,"","",10]
[null,null,null,null,null,null,null,null,null,"AH","","","","","","","","",0]
[null,null,null,null,null,null,null,null,"CONTRE",{"$f":"J80","v":"AA"},{"$f":"INDEX($K$80:$R$87,MATCH(K$71,$J$80:$J$87,0),MATCH($J80,$K$71:$R$71,0))","v":""},{"$f":"INDEX($K$80:$R$87,MATCH(L$71,$J$80:$J$87,0),MATCH($J80,$K$71:$R$71,0))","v":16},"","","","","","",16]
[null,null,null,null,null,null,null,null,null,{"$f":"J81","v":"AB"},{"$f":"INDEX($K$80:$R$87,MATCH(K$71,$J$80:$J$87,0),MATCH($J81,$K$71:$R$71,0))","v":20},"","","","","","","",20]
[null,null,null,null,null,null,null,null,null,"AE","","","","","","","","",0]
[null,null,null,null,null,null,null,null,null,"AC","","","","","","","","",0]
[null,null,null,null,null,null,null,null,null,"AD","","","","","","","","",0]
[null,null,null,null,null,null,null,null,null,"AF","","","","","","",10,"",10]
[null,null,null,null,null,null,null,null,null,"AG","","","","","",26,"","",26]
[null,null,null,null,null,null,null,null,null,"AH","","","","","","","","",0,null,"Diff pondérée"]
[null,null,null,null,null,null,null,null,"DIFF",{"$f":"J88","v":"AA"},null,null,null,null,null,null,null,null,{"$f":"S80-S88","v":4},null,{"$f":"S96+ABS(MIN($S$96:$S$103))","v":20}]
[null,null,null,null,null,null,null,null,null,{"$f":"J89","v":"AB"},null,null,null,null,null,null,null,null,{"$f":"S81-S89","v":-4},null,12]
[null,null,null,null,null,null,null,null,null,"AE",null,null,null,null,null,null,null,null,0,null,16]
[null,null,null,null,null,null,null,null,null,"AC",null,null,null,null,null,null,null,null,0,null,16]
[null,null,null,null,null,null,null,null,null,"AD",null,null,null,null,null,null,null,null,0,null,16]
[null,null,null,null,null,null,null,null,null,"AF",null,null,null,null,null,null,null,null,16,null,32]
[null,null,null,null,null,null,null,null,null,"AG",null,null,null,null,null,null,null,null,-16,null,{"$f":"S102+ABS(MIN($S$96:$S$103))","v":0}]
[null,null,null,null,null,null,null,null,null,"AH",null,null,null,null,null,null,null,null,0,null,{"$f":"S103+ABS(MIN($S$96:$S$103))","v":16}]

{"sheet":"P9","index":8,"n_rows":103,"n_cols":26,"rows_kept":103,"cut":false,"hidden":false,"merged":[[0,0,0,5],[1,0,1,5],[2,0,2,5],[3,0,3,5],[3,8,3,10],[15,6,16,6],[69,2,69,5],[69,6,70,6],[69,7,69,25],[23,6,24,6],[31,6,32,6],[39,6,40,6],[47,6,48,6],[55,6,56,6],[63,6,64,6]]}
[null,null,null,null,null,null,3]
["CHAMPIONNAT DES CLUBS"]
[]
["POULE 1"]
["EQUIPES",null,"POINTS","Pour","Contre","Diff"]
["AA","1A",{"$f":"SUMIF($A$18:$A$69,A6,$E$18:$E$69)+SUMIF($C$18:$C$69,A6,$F$18:$F$69)","v":9},{"$f":"SUMIF($A$18:$A$69,$A6,$B$18:$B$69)+SUMIF($C$18:$C$69,$A6,$D$18:$D$69)","v":100},{"$f":"SUMIF($C$18:$C$69,$A6,$B$18:$B$69)+SUMIF($A$18:$A$69,$A6,$D$18:$D$69)","v":152},{"$f":"D6-E6","v":-52}]
["AB","1B",{"$f":"SUMIF($A$18:$A$69,A7,$E$18:$E$69)+SUMIF($C$18:$C$69,A7,$F$18:$F$69)","v":9},{"$f":"SUMIF($A$18:$A$69,$A7,$B$18:$B$69)+SUMIF($C$18:$C$69,$A7,$D$18:$D$69)","v":52},{"$f":"SUMIF($C$18:$C$69,$A7,$B$18:$B$69)+SUMIF($A$18:$A$69,$A7,$D$18:$D$69)","v":200},-148]
["AC","1C",{"$f":"SUMIF($A$18:$A$69,A8,$E$18:$E$69)+SUMIF($C$18:$C$69,A8,$F$18:$F$69)","v":13},120,132,-12]
["AD","1D",15,126,126,0]
["AE","1E",11,112,140,-28]
["AF","1F",17,150,102,48]
["AG","1G",17,154,98,{"$f":"D12-E12","v":56}]
["AH","1H",21,{"$f":"SUMIF($A$18:$A$69,$A13,$B$18:$B$69)+SUMIF($C$18:$C$69,$A13,$D$18:$D$69)","v":194},58,{"$f":"D13-E13","v":136}]
[]
["1er MATCH le ","à","AA"]
[null,null,null,null,null,null,"SI forfait éq recevante"]
["Equipes","score","Equipes","score","Points","Points"]
["AA",16,"AB",{"$f":"IF(G18=19,19,IF(ISBLANK(B18),\"\",IF(B18=19,0,36-B18)))","v":20},{"$f":"IF(G18=19,0,IF(ISBLANK(B18),\"\",IF(B18<18,1,IF(B18=18,2,IF(B18>18,3)))))","v":1},{"$f":"IF(G18=19,3,IF(ISBLANK(B18),\"\",IF(B18=19,0,IF(D18<18,1,IF(D18=18,2,IF(D18>=20,3))))))","v":3},null,null,null,null,null,{"$f":"IF(B18>D18,A18&C18,IF(D18>B18,C18&A18,\"/\"))","v":"ABAA"},null,{"$f":"A18&C18","v":"AAAB"},{"$f":"E18","v":1},{"$f":"C18&A18","v":"ABAA"},{"$f":"F18","v":3},{"$f":"B18","v":16},{"$f":"D18","v":20}]
["AC",14,"AD",{"$f":"IF(G19=19,19,IF(ISBLANK(B19),\"\",IF(B19=19,0,36-B19)))","v":22},{"$f":"IF(G19=19,0,IF(ISBLANK(B19),\"\",IF(B19<18,1,IF(B19=18,2,IF(B19>18,3)))))","v":1},{"$f":"IF(G19=19,3,IF(ISBLANK(B19),\"\",IF(B19=19,0,IF(D19<18,1,IF(D19=18,2,IF(D19>=20,3))))))","v":3},null,null,null,null,null,{"$f":"IF(B19>D19,A19&C19,IF(D19>B19,C19&A19,\"/\"))","v":"ADAC"},null,{"$f":"A19&C19","v":"ACAD"},{"$f":"E19","v":1},{"$f":"C19&A19","v":"ADAC"},{"$f":"F19","v":3},{"$f":"B19","v":14},{"$f":"D19","v":22}]
["AE",12,"AF",{"$f":"IF(G20=19,19,IF(ISBLANK(B20),\"\",IF(B20=19,0,36-B20)))","v":24},{"$f":"IF(G20=19,0,IF(ISBLANK(B20),\"\",IF(B20<18,1,IF(B20=18,2,IF(B20>18,3)))))","v":1},{"$f":"IF(G20=19,3,IF(ISBLANK(B20),\"\",IF(B20=19,0,IF(D20<18,1,IF(D20=18,2,IF(D20>=20,3))))))","v":3},null,null,null,null,null,{"$f":"IF(B20>D20,A20&C20,IF(D20>B20,C20&A20,\"/\"))","v":"AFAE"},null,{"$f":"A20&C20","v":"AEAF"},{"$f":"E20","v":1},{"$f":"C20&A20","v":"AFAE"},{"$f":"F20","v":3},{"$f":"B20","v":12},{"$f":"D20","v":24}]
["AG",16,"AH",{"$f":"IF(G21=19,19,IF(ISBLANK(B21),\"\",IF(B21=19,0,36-B21)))","v":20},{"$f":"IF(G21=19,0,IF(ISBLANK(B21),\"\",IF(B21<18,1,IF(B21=18,2,IF(B21>18,3)))))","v":1},{"$f":"IF(G21=19,3,IF(ISBLANK(B21),\"\",IF(B21=19,0,IF(D21<18,1,IF(D21=18,2,IF(D21>=20,3))))))","v":3},null,null,null,null,null,{"$f":"IF(B21>D21,A21&C21,IF(D21>B21,C21&A21,\"/\"))","v":"AHAG"},null,{"$f":"A21&C21","v":"AGAH"},{"$f":"E21","v":1},{"$f":"C21&A21","v":"AHAG"},{"$f":"F21","v":3},{"$f":"B21","v":16},{"$f":"D21","v":20}]
[]
["2 éme MATCH le ","à","AB"]
[null,null,null,null,null,null,"SI forfait éq recevante"]
["Equipes","score","Equipes","score","Points","Points"]
["AA",10,"AC",{"$f":"IF(G26=19,19,IF(ISBLANK(B26),\"\",IF(B26=19,0,36-B26)))","v":26},{"$f":"IF(G26=19,0,IF(ISBLANK(B26),\"\",IF(B26<18,1,IF(B26=18,2,IF(B26>18,3)))))","v":1},{"$f":"IF(G26=19,3,IF(ISBLANK(B26),\"\",IF(B26=19,0,IF(D26<18,1,IF(D26=18,2,IF(D26>=20,3))))))","v":3},null,null,null,null,null,{"$f":"IF(B26>D26,A26&C26,IF(D26>B26,C26&A26,\"/\"))","v":"ACAA"},null,{"$f":"A26&C26","v":"AAAC"},{"$f":"E26","v":1},{"$f":"C26&A26","v":"ACAA"},{"$f":"F26","v":3},{"$f":"B26","v":10},{"$f":"D26","v":26}]
["AB",2,"AH",{"$f":"IF(G27=19,19,IF(ISBLANK(B27),\"\",IF(B27=19,0,36-B27)))","v":34},{"$f":"IF(G27=19,0,IF(ISBLANK(B27),\"\",IF(B27<18,1,IF(B27=18,2,IF(B27>18,3)))))","v":1},{"$f":"IF(G27=19,3,IF(ISBLANK(B27),\"\",IF(B27=19,0,IF(D27<18,1,IF(D27=18,2,IF(D27>=20,3))))))","v":3},null,null,null,null,null,{"$f":"IF(B27>D27,A27&C27,IF(D27>B27,C27&A27,\"/\"))","v":"AHAB"},null,{"$f":"A27&C27","v":"ABAH"},{"$f":"E27","v":1},{"$f":"C27&A27","v":"AHAB"},{"$f":"F27","v":3},{"$f":"B27","v":2},{"$f":"D27","v":34}]
["AD",6,"AF",{"$f":"IF(G28=19,19,IF(ISBLANK(B28),\"\",IF(B28=19,0,36-B28)))","v":30},{"$f":"IF(G28=19,0,IF(ISBLANK(B28),\"\",IF(B28<18,1,IF(B28=18,2,IF(B28>18,3)))))","v":1},{"$f":"IF(G28=19,3,IF(ISBLANK(B28),\"\",IF(B28=19,0,IF(D28<18,1,IF(D28=18,2,IF(D28>=20,3))))))","v":3},null,null,null,null,null,{"$f":"IF(B28>D28,A28&C28,IF(D28>B28,C28&A28,\"/\"))","v":"AFAD"},null,{"$f":"A28&C28","v":"ADAF"},{"$f":"E28","v":1},{"$f":"C28&A28","v":"AFAD"},{"$f":"F28","v":3},{"$f":"B28","v":6},{"$f":"D28","v":30}]
["AE",14,"AG",{"$f":"IF(G29=19,19,IF(ISBLANK(B29),\"\",IF(B29=19,0,36-B29)))","v":22},{"$f":"IF(G29=19,0,IF(ISBLANK(B29),\"\",IF(B29<18,1,IF(B29=18,2,IF(B29>18,3)))))","v":1},{"$f":"IF(G29=19,3,IF(ISBLANK(B29),\"\",IF(B29=19,0,IF(D29<18,1,IF(D29=18,2,IF(D29>=20,3))))))","v":3},null,null,null,null,null,{"$f":"IF(B29>D29,A29&C29,IF(D29>B29,C29&A29,\"/\"))","v":"AGAE"},null,{"$f":"A29&C29","v":"AEAG"},{"$f":"E29","v":1},{"$f":"C29&A29","v":"AGAE"},{"$f":"F29","v":3},{"$f":"B29","v":14},{"$f":"D29","v":22}]
[]
["3 éme MATCH le ","à","AC"]
[null,null,null,null,null,null,"SI forfait éq recevante"]
["Equipes","score","Equipes","score","Points","Points"]
["AA",8,"AH",{"$f":"IF(G34=19,19,IF(ISBLANK(B34),\"\",IF(B34=19,0,36-B34)))","v":28},{"$f":"IF(G34=19,0,IF(ISBLANK(B34),\"\",IF(B34<18,1,IF(B34=18,2,IF(B34>18,3)))))","v":1},{"$f":"IF(G34=19,3,IF(ISBLANK(B34),\"\",IF(B34=19,0,IF(D34<18,1,IF(D34=18,2,IF(D34>=20,3))))))","v":3},null,null,null,null,null,{"$f":"IF(B34>D34,A34&C34,IF(D34>B34,C34&A34,\"/\"))","v":"AHAA"},null,{"$f":"A34&C34","v":"AAAH"},{"$f":"E34","v":1},{"$f":"C34&A34","v":"AHAA"},{"$f":"F34","v":3},{"$f":"B34","v":8},{"$f":"D34","v":28}]
["AB",0,"AE",{"$f":"IF(G35=19,19,IF(ISBLANK(B35),\"\",IF(B35=19,0,36-B35)))","v":36},{"$f":"IF(G35=19,0,IF(ISBLANK(B35),\"\",IF(B35<18,1,IF(B35=18,2,IF(B35>18,3)))))","v":1},{"$f":"IF(G35=19,3,IF(ISBLANK(B35),\"\",IF(B35=19,0,IF(D35<18,1,IF(D35=18,2,IF(D35>=20,3))))))","v":3},null,null,null,null,null,{"$f":"IF(B35>D35,A35&C35,IF(D35>B35,C35&A35,\"/\"))","v":"AEAB"},null,{"$f":"A35&C35","v":"ABAE"},{"$f":"E35","v":1},{"$f":"C35&A35","v":"AEAB"},{"$f":"F35","v":3},{"$f":"B35","v":0},{"$f":"D35","v":36}]
["AC",6,"AF",{"$f":"IF(G36=19,19,IF(ISBLANK(B36),\"\",IF(B36=19,0,36-B36)))","v":30},{"$f":"IF(G36=19,0,IF(ISBLANK(B36),\"\",IF(B36<18,1,IF(B36=18,2,IF(B36>18,3)))))","v":1},{"$f":"IF(G36=19,3,IF(ISBLANK(B36),\"\",IF(B36=19,0,IF(D36<18,1,IF(D36=18,2,IF(D36>=20,3))))))","v":3},null,null,null,null,null,{"$f":"IF(B36>D36,A36&C36,IF(D36>B36,C36&A36,\"/\"))","v":"AFAC"},null,{"$f":"A36&C36","v":"ACAF"},{"$f":"E36","v":1},{"$f":"C36&A36","v":"AFAC"},{"$f":"F36","v":3},{"$f":"B36","v":6},{"$f":"D36","v":30}]
["AD",4,"AG",{"$f":"IF(G37=19,19,IF(ISBLANK(B37),\"\",IF(B37=19,0,36-B37)))","v":32},{"$f":"IF(G37=19,0,IF(ISBLANK(B37),\"\",IF(B37<18,1,IF(B37=18,2,IF(B37>18,3)))))","v":1},{"$f":"IF(G37=19,3,IF(ISBLANK(B37),\"\",IF(B37=19,0,IF(D37<18,1,IF(D37=18,2,IF(D37>=20,3))))))","v":3},null,null,null,null,null,{"$f":"IF(B37>D37,A37&C37,IF(D37>B37,C37&A37,\"/\"))","v":"AGAD"},null,{"$f":"A37&C37","v":"ADAG"},{"$f":"E37","v":1},{"$f":"C37&A37","v":"AGAD"},{"$f":"F37","v":3},{"$f":"B37","v":4},{"$f":"D37","v":32}]
[]
["4 éme MATCH le ","à","AD"]
[null,null,null,null,null,null,"SI forfait éq recevante"]
["Equipes","score","Equipes","score","Points","Points"]
["AA",8,"AD",{"$f":"IF(G42=19,19,IF(ISBLANK(B42),\"\",IF(B42=19,0,36-B42)))","v":28},{"$f":"IF(G42=19,0,IF(ISBLANK(B42),\"\",IF(B42<18,1,IF(B42=18,2,IF(B42>18,3)))))","v":1},{"$f":"IF(G42=19,3,IF(ISBLANK(B42),\"\",IF(B42=19,0,IF(D42<18,1,IF(D42=18,2,IF(D42>=20,3))))))","v":3},null,null,null,null,null,{"$f":"IF(B42>D42,A42&C42,IF(D42>B42,C42&A42,\"/\"))","v":"ADAA"},null,{"$f":"A42&C42","v":"AAAD"},{"$f":"E42","v":1},{"$f":"C42&A42","v":"ADAA"},{"$f":"F42","v":3},{"$f":"B42","v":8},{"$f":"D42","v":28}]
["AF",10,"AG",{"$f":"IF(G43=19,19,IF(ISBLANK(B43),\"\",IF(B43=19,0,36-B43)))","v":26},{"$f":"IF(G43=19,0,IF(ISBLANK(B43),\"\",IF(B43<18,1,IF(B43=18,2,IF(B43>18,3)))))","v":1},{"$f":"IF(G43=19,3,IF(ISBLANK(B43),\"\",IF(B43=19,0,IF(D43<18,1,IF(D43=18,2,IF(D43>=20,3))))))","v":3},null,null,null,null,null,{"$f":"IF(B43>D43,A43&C43,IF(D43>B43,C43&A43,\"/\"))","v":"AGAF"},null,{"$f":"A43&C43","v":"AFAG"},{"$f":"E43","v":1},{"$f":"C43&A43","v":"AGAF"},{"$f":"F43","v":3},{"$f":"B43","v":10},{"$f":"D43","v":26}]
["AB",14,"AC",{"$f":"IF(G44=19,19,IF(ISBLANK(B44),\"\",IF(B44=19,0,36-B44)))","v":22},{"$f":"IF(G44=19,0,IF(ISBLANK(B44),\"\",IF(B44<18,1,IF(B44=18,2,IF(B44>18,3)))))","v":1},{"$f":"IF(G44=19,3,IF(ISBLANK(B44),\"\",IF(B44=19,0,IF(D44<18,1,IF(D44=18,2,IF(D44>=20,3))))))","v":3},null,null,null,null,null,{"$f":"IF(B44>D44,A44&C44,IF(D44>B44,C44&A44,\"/\"))","v":"ACAB"},null,{"$f":"A44&C44","v":"ABAC"},{"$f":"E44","v":1},{"$f":"C44&A44","v":"ACAB"},{"$f":"F44","v":3},{"$f":"B44","v":14},{"$f":"D44","v":22}]
["AE",16,"AH",{"$f":"IF(G45=19,19,IF(ISBLANK(B45),\"\",IF(B45=19,0,36-B45)))","v":20},{"$f":"IF(G45=19,0,IF(ISBLANK(B45),\"\",IF(B45<18,1,IF(B45=18,2,IF(B45>18,3)))))","v":1},{"$f":"IF(G45=19,3,IF(ISBLANK(B45),\"\",IF(B45=19,0,IF(D45<18,1,IF(D45=18,2,IF(D45>=20,3))))))","v":3},null,null,null,null,null,{"$f":"IF(B45>D45,A45&C45,IF(D45>B45,C45&A45,\"/\"))","v":"AHAE"},null,{"$f":"A45&C45","v":"AEAH"},{"$f":"E45","v":1},{"$f":"C45&A45","v":"AHAE"},{"$f":"F45","v":3},{"$f":"B45","v":16},{"$f":"D45","v":20}]
[]
["5 éme MATCH le ","à","AE"]
[null,null,null,null,null,null,"SI forfait éq recevante"]
["Equipes","score","Equipes","score","Points","Points"]
["AA",10,"AF",{"$f":"IF(G50=19,19,IF(ISBLANK(B50),\"\",IF(B50=19,0,36-B50)))","v":26},{"$f":"IF(G50=19,0,IF(ISBLANK(B50),\"\",IF(B50<18,1,IF(B50=18,2,IF(B50>18,3)))))","v":1},{"$f":"IF(G50=19,3,IF(ISBLANK(B50),\"\",IF(B50=19,0,IF(D50<18,1,IF(D50=18,2,IF(D50>=20,3))))))","v":3},null,null,null,null,null,{"$f":"IF(B50>D50,A50&C50,IF(D50>B50,C50&A50,\"/\"))","v":"AFAA"},null,{"$f":"A50&C50","v":"AAAF"},{"$f":"E50","v":1},{"$f":"C50&A50","v":"AFAA"},{"$f":"F50","v":3},{"$f":"B50","v":10},{"$f":"D50","v":26}]
["AD",4,"AH",{"$f":"IF(G51=19,19,IF(ISBLANK(B51),\"\",IF(B51=19,0,36-B51)))","v":32},{"$f":"IF(G51=19,0,IF(ISBLANK(B51),\"\",IF(B51<18,1,IF(B51=18,2,IF(B51>18,3)))))","v":1},{"$f":"IF(G51=19,3,IF(ISBLANK(B51),\"\",IF(B51=19,0,IF(D51<18,1,IF(D51=18,2,IF(D51>=20,3))))))","v":3},null,null,null,null,null,{"$f":"IF(B51>D51,A51&C51,IF(D51>B51,C51&A51,\"/\"))","v":"AHAD"},null,{"$f":"A51&C51","v":"ADAH"},{"$f":"E51","v":1},{"$f":"C51&A51","v":"AHAD"},{"$f":"F51","v":3},{"$f":"B51","v":4},{"$f":"D51","v":32}]
["AB",4,"AG",{"$f":"IF(G52=19,19,IF(ISBLANK(B52),\"\",IF(B52=19,0,36-B52)))","v":32},{"$f":"IF(G52=19,0,IF(ISBLANK(B52),\"\",IF(B52<18,1,IF(B52=18,2,IF(B52>18,3)))))","v":1},{"$f":"IF(G52=19,3,IF(ISBLANK(B52),\"\",IF(B52=19,0,IF(D52<18,1,IF(D52=18,2,IF(D52>=20,3))))))","v":3},null,null,null,null,null,{"$f":"IF(B52>D52,A52&C52,IF(D52>B52,C52&A52,\"/\"))","v":"AGAB"},null,{"$f":"A52&C52","v":"ABAG"},{"$f":"E52","v":1},{"$f":"C52&A52","v":"AGAB"},{"$f":"F52","v":3},{"$f":"B52","v":4},{"$f":"D52","v":32}]
["AC",14,"AE",{"$f":"IF(G53=19,19,IF(ISBLANK(B53),\"\",IF(B53=19,0,36-B53)))","v":22},{"$f":"IF(G53=19,0,IF(ISBLANK(B53),\"\",IF(B53<18,1,IF(B53=18,2,IF(B53>18,3)))))","v":1},{"$f":"IF(G53=19,3,IF(ISBLANK(B53),\"\",IF(B53=19,0,IF(D53<18,1,IF(D53=18,2,IF(D53>=20,3))))))","v":3},null,null,null,null,null,{"$f":"IF(B53>D53,A53&C53,IF(D53>B53,C53&A53,\"/\"))","v":"AEAC"},null,{"$f":"A53&C53","v":"ACAE"},{"$f":"E53","v":1},{"$f":"C53&A53","v":"AEAC"},{"$f":"F53","v":3},{"$f":"B53","v":14},{"$f":"D53","v":22}]
[]
["6 éme MATCH le ","à","AF"]
[null,null,null,null,null,null,"SI forfait éq recevante"]
["Equipes","score","Equipes","score","Points","Points"]
["AB",0,"AD",{"$f":"IF(G58=19,19,IF(ISBLANK(B58),\"\",IF(B58=19,0,36-B58)))","v":36},{"$f":"IF(G58=19,0,IF(ISBLANK(B58),\"\",IF(B58<18,1,IF(B58=18,2,IF(B58>18,3)))))","v":1},{"$f":"IF(G58=19,3,IF(ISBLANK(B58),\"\",IF(B58=19,0,IF(D58<18,1,IF(D58=18,2,IF(D58>=20,3))))))","v":3},null,null,null,null,null,{"$f":"IF(B58>D58,A58&C58,IF(D58>B58,C58&A58,\"/\"))","v":"ADAB"},null,{"$f":"A58&C58","v":"ABAD"},{"$f":"E58","v":1},{"$f":"C58&A58","v":"ADAB"},{"$f":"F58","v":3},{"$f":"B58","v":0},{"$f":"D58","v":36}]
["AE",2,"AA",{"$f":"IF(G59=19,19,IF(ISBLANK(B59),\"\",IF(B59=19,0,36-B59)))","v":34},{"$f":"IF(G59=19,0,IF(ISBLANK(B59),\"\",IF(B59<18,1,IF(B59=18,2,IF(B59>18,3)))))","v":1},{"$f":"IF(G59=19,3,IF(ISBLANK(B59),\"\",IF(B59=19,0,IF(D59<18,1,IF(D59=18,2,IF(D59>=20,3))))))","v":3},null,null,null,null,null,{"$f":"IF(B59>D59,A59&C59,IF(D59>B59,C59&A59,\"/\"))","v":"AAAE"},null,{"$f":"A59&C59","v":"AEAA"},{"$f":"E59","v":1},{"$f":"C59&A59","v":"AAAE"},{"$f":"F59","v":3},{"$f":"B59","v":2},{"$f":"D59","v":34}]
["AG",4,"AC",{"$f":"IF(G60=19,19,IF(ISBLANK(B60),\"\",IF(B60=19,0,36-B60)))","v":32},{"$f":"IF(G60=19,0,IF(ISBLANK(B60),\"\",IF(B60<18,1,IF(B60=18,2,IF(B60>18,3)))))","v":1},{"$f":"IF(G60=19,3,IF(ISBLANK(B60),\"\",IF(B60=19,0,IF(D60<18,1,IF(D60=18,2,IF(D60>=20,3))))))","v":3},null,null,null,null,null,{"$f":"IF(B60>D60,A60&C60,IF(D60>B60,C60&A60,\"/\"))","v":"ACAG"},null,{"$f":"A60&C60","v":"AGAC"},{"$f":"E60","v":1},{"$f":"C60&A60","v":"ACAG"},{"$f":"F60","v":3},{"$f":"B60","v":4},{"$f":"D60","v":32}]
["AF",6,"AH",{"$f":"IF(G61=19,19,IF(ISBLANK(B61),\"\",IF(B61=19,0,36-B61)))","v":30},{"$f":"IF(G61=19,0,IF(ISBLANK(B61),\"\",IF(B61<18,1,IF(B61=18,2,IF(B61>18,3)))))","v":1},{"$f":"IF(G61=19,3,IF(ISBLANK(B61),\"\",IF(B61=19,0,IF(D61<18,1,IF(D61=18,2,IF(D61>=20,3))))))","v":3},null,null,null,null,null,{"$f":"IF(B61>D61,A61&C61,IF(D61>B61,C61&A61,\"/\"))","v":"AHAF"},null,{"$f":"A61&C61","v":"AFAH"},{"$f":"E61","v":1},{"$f":"C61&A61","v":"AHAF"},{"$f":"F61","v":3},{"$f":"B61","v":6},{"$f":"D61","v":30}]
[]
["7 éme MATCH le","à","AG"]
[null,null,null,null,null,null,"SI forfait éq recevante",null," "]
["Equipes","score","Equipes","score","Points","Points"]
["AA",14,"AG",{"$f":"IF(G66=19,19,IF(ISBLANK(B66),\"\",IF(B66=19,0,36-B66)))","v":22},{"$f":"IF(G66=19,0,IF(ISBLANK(B66),\"\",IF(B66<18,1,IF(B66=18,2,IF(B66>18,3)))))","v":1},{"$f":"IF(G66=19,3,IF(ISBLANK(B66),\"\",IF(B66=19,0,IF(D66<18,1,IF(D66=18,2,IF(D66>=20,3))))))","v":3},null,null,null,null,null,{"$f":"IF(B66>D66,A66&C66,IF(D66>B66,C66&A66,\"/\"))","v":"AGAA"},null,{"$f":"A66&C66","v":"AAAG"},{"$f":"E66","v":1},{"$f":"C66&A66","v":"AGAA"},{"$f":"F66","v":3},{"$f":"B66","v":14},{"$f":"D66","v":22}]
["AB",12,"AF",{"$f":"IF(G67=19,19,IF(ISBLANK(B67),\"\",IF(B67=19,0,36-B67)))","v":24},{"$f":"IF(G67=19,0,IF(ISBLANK(B67),\"\",IF(B67<18,1,IF(B67=18,2,IF(B67>18,3)))))","v":1},{"$f":"IF(G67=19,3,IF(ISBLANK(B67),\"\",IF(B67=19,0,IF(D67<18,1,IF(D67=18,2,IF(D67>=20,3))))))","v":3},null,null,null,null,null,{"$f":"IF(B67>D67,A67&C67,IF(D67>B67,C67&A67,\"/\"))","v":"AFAB"},null,{"$f":"A67&C67","v":"ABAF"},{"$f":"E67","v":1},{"$f":"C67&A67","v":"AFAB"},{"$f":"F67","v":3},{"$f":"B67","v":12},{"$f":"D67","v":24}]
["AE",10,"AD",{"$f":"IF(G68=19,19,IF(ISBLANK(B68),\"\",IF(B68=19,0,36-B68)))","v":26},{"$f":"IF(G68=19,0,IF(ISBLANK(B68),\"\",IF(B68<18,1,IF(B68=18,2,IF(B68>18,3)))))","v":1},{"$f":"IF(G68=19,3,IF(ISBLANK(B68),\"\",IF(B68=19,0,IF(D68<18,1,IF(D68=18,2,IF(D68>=20,3))))))","v":3},null,null,null,null,null,{"$f":"IF(B68>D68,A68&C68,IF(D68>B68,C68&A68,\"/\"))","v":"ADAE"},null,{"$f":"A68&C68","v":"AEAD"},{"$f":"E68","v":1},{"$f":"C68&A68","v":"ADAE"},{"$f":"F68","v":3},{"$f":"B68","v":10},{"$f":"D68","v":26}]
["AC",6,"AH",{"$f":"IF(G69=19,19,IF(ISBLANK(B69),\"\",IF(B69=19,0,36-B69)))","v":30},{"$f":"IF(G69=19,0,IF(ISBLANK(B69),\"\",IF(B69<18,1,IF(B69=18,2,IF(B69>18,3)))))","v":1},{"$f":"IF(G69=19,3,IF(ISBLANK(B69),\"\",IF(B69=19,0,IF(D69<18,1,IF(D69=18,2,IF(D69>=20,3))))))","v":3},null,null,null,null,null,{"$f":"IF(B69>D69,A69&C69,IF(D69>B69,C69&A69,\"/\"))","v":"AHAC"},null,{"$f":"A69&C69","v":"ACAH"},{"$f":"E69","v":1},{"$f":"C69&A69","v":"AHAC"},{"$f":"F69","v":3},{"$f":"B69","v":6},{"$f":"D69","v":30}]
[null,null,"Si pas d'exaequo",null,null,null,"Classt        Final","Rencontres entre exaequos"]
["EQUIPES",null,"POINTS","POUR","CONTRE","DIFF",null,"POINTS Exaequos","Exaq","n°","AA","AB","AC","AD","AE","AF","AG","AH","Pts matchs",null,null,null,"1000000*Pts matchs +1000 (Diff +  abs(diff mini) )+Pour ","RANG","DIFF Exaequos","POUR Exaequos"]
["AH","1H",21,194,58,136,1,{"$f":"IF(S72>0,S72,\"\")","v":""},{"$f":"COUNTIF($C$72:$C$79,C72)","v":1},{"$f":"IF(AND(I72>1,COUNTIFS(I$72:I72,I72,C$72:C72,C72)=1),MAX(J$71:J71)+1,\"\")","v":""},{"$f":"IF($A72=K$71,\"\",IF(INDEX($C$72:$C$79,MATCH(K$71,$A$72:$A$79,0))=$C72,IFERROR(VLOOKUP($A72&K$71,$N$18:$O$69,2,0),  VLOOKUP(K$71&$A72,$N$18:$Q$69,4,0)),          \"\"))","v":""},"","","","","","","",{"$f":"SUM(K72:R72)","v":0},null,null,null,{"$f":"IF(I72<3,S72*1000000+(F72+ABS(MIN($F$72:$F$79)))*1000+D72,S72*1000000+U96*1000+Z72)","v":284194},{"$f":"IF(I72>2,RANK(W72,OFFSET(W$71,MATCH(I72,$I$72:$I$79,0),,I72)))","v":false},{"$f":"IF(S96=0,\"\",S96)","v":""},{"$f":"IF(S80=0,\"\",S80)","v":""}]
["AG","1G",17,154,98,56,2,3,2,{"$f":"IF(AND(I73>1,COUNTIFS(I$72:I73,I73,C$72:C73,C73)=1),MAX(J$71:J72)+1,\"\")","v":1},"","","","","",3,"","",{"$f":"SUM(K73:R73)","v":3},null,null,null,{"$f":"IF(I73<3,S73*1000000+(F73+ABS(MIN($F$72:$F$79)))*1000+D73,S73*1000000+U97*1000+Z73)","v":3204154},{"$f":"IF(I73>2,RANK(W73,OFFSET(W$71,MATCH(I73,$I$72:$I$79,0),,I73)))","v":false},16,26]
["AF","1F",17,150,102,48,3,1,2,{"$f":"IF(AND(I74>1,COUNTIFS(I$72:I74,I74,C$72:C74,C74)=1),MAX(J$71:J73)+1,\"\")","v":""},"","","","","","",1,"",1,null,null,null,1196150,false,-16,10]
["AD","1D",15,126,126,0,4,"",1,{"$f":"IF(AND(I75>1,COUNTIFS(I$72:I75,I75,C$72:C75,C75)=1),MAX(J$71:J74)+1,\"\")","v":""},"","","","","","","","",0,null,null,null,148126,false,"",""]
["AC","1C",13,120,132,-12,5,"",1,{"$f":"IF(AND(I76>1,COUNTIFS(I$72:I76,I76,C$72:C76,C76)=1),MAX(J$71:J75)+1,\"\")","v":""},"","","","","","","","",0,null,null,null,136120,false,"",""]
["AE","1E",11,112,140,-28,6,"",1,{"$f":"IF(AND(I77>1,COUNTIFS(I$72:I77,I77,C$72:C77,C77)=1),MAX(J$71:J76)+1,\"\")","v":""},"","","","","","","","",0,null,null,null,120112,false,"",""]
["AB","1B",9,52,200,-148,7,3,2,{"$f":"IF(AND(I78>1,COUNTIFS(I$72:I78,I78,C$72:C78,C78)=1),MAX(J$71:J77)+1,\"\")","v":2},3,"","","","","","","",3,null,null,null,3000052,false,4,20]
["AA","1A",9,100,152,-52,8,1,2,{"$f":"IF(AND(I79>1,COUNTIFS(I$72:I79,I79,C$72:C79,C79)=1),MAX(J$71:J78)+1,\"\")","v":""},"",1,"","","","","","",1,null,null,null,1096100,false,-4,16]
[null,null,null,null,null,null,null,null,"POUR",{"$f":"A72","v":"AH"},{"$f":"IF($A72=K$71,\"\",IF(INDEX($C$72:$C$79,MATCH(K$71,$A$72:$A$79,0))=$C72,IFERROR(VLOOKUP($A72&K$71,$N$18:$R$69,5,0),  VLOOKUP(K$71&$A72,$N$18:$S$69,6,0)),          \"\"))","v":""},"","","","","","","",0]
[null,null,null,null,null,null,null,null,null,"AG","","","","","",26,"","",26]
[null,null,null,null,null,null,null,null,null,"AF","","","","","","",10,"",10]
[null,null,null,null,null,null,null,null,null,"AD","","","","","","","","",0]
[null,null,null,null,null,null,null,null,null,"AC","","","","","","","","",0,null,null,null,null,null,"  "]
[null,null,null,null,null,null,null,null,null,"AE","","","","","","","","",0]
[null,null,null,null,null,null,null,null,null,"AB",20,"","","","","","","",20]
[null,null,null,null,null,null,null,null,null,"AA","",16,"","","","","","",16]
[null,null,null,null,null,null,null,null,"CONTRE",{"$f":"J80","v":"AH"},{"$f":"INDEX($K$80:$R$87,MATCH(K$71,$J$80:$J$87,0),MATCH($J80,$K$71:$R$71,0))","v":""},{"$f":"INDEX($K$80:$R$87,MATCH(L$71,$J$80:$J$87,0),MATCH($J80,$K$71:$R$71,0))","v":""},"","","","","","",0]
[null,null,null,null,null,null,null,null,null,{"$f":"J81","v":"AG"},{"$f":"INDEX($K$80:$R$87,MATCH(K$71,$J$80:$J$87,0),MATCH($J81,$K$71:$R$71,0))","v":""},"","","","",10,"","",10]
[null,null,null,null,null,null,null,null,null,"AF","","","","","","",26,"",26]
[null,null,null,null,null,null,null,null,null,"AD","","","","","","","","",0]
[null,null,null,null,null,null,null,null,null,"AC","","","","","","","","",0]
[null,null,null,null,null,null,null,null,null,"AE","","","","","","","","",0]
[null,null,null,null,null,null,null,null,null,"AB",16,"","","","","","","",16]
[null,null,null,null,null,null,null,null,null,"AA","",20,"","","","","","",20,null,"Diff pondérée"]
[null,null,null,null,null,null,null,null,"DIFF",{"$f":"J88","v":"AH"},null,null,null,null,null,null,null,null,{"$f":"S80-S88","v":0},null,{"$f":"S96+ABS(MIN($S$96:$S$103))","v":16}]
[null,null,null,null,null,null,null,null,null,{"$f":"J89","v":"AG"},null,null,null,null,null,null,null,null,{"$f":"S81-S89","v":16},null,32]
[null,null,null,null,null,null,null,null,null,"AF",null,null,null,null,null,null,null,null,-16,null,0]
[null,null,null,null,null,null,null,null,null,"AD",null,null,null,null,null,null,null,null,0,null,16]
[null,null,null,null,null,null,null,null,null,"AC",null,null,null,null,null,null,null,null,0,null,16]
[null,null,null,null,null,null,null,null,null,"AE",null,null,null,null,null,null,null,null,0,null,16]
[null,null,null,null,null,null,null,null,null,"AB",null,null,null,null,null,null,null,null,4,null,{"$f":"S102+ABS(MIN($S$96:$S$103))","v":20}]
[null,null,null,null,null,null,null,null,null,"AA",null,null,null,null,null,null,null,null,-4,null,{"$f":"S103+ABS(MIN($S$96:$S$103))","v":12}]

{"sheet":"P10","index":9,"n_rows":103,"n_cols":26,"rows_kept":103,"cut":false,"hidden":false,"merged":[[0,0,0,5],[1,0,1,5],[2,0,2,5],[3,0,3,5],[3,8,3,10],[15,6,16,6],[69,2,69,5],[69,6,70,6],[69,7,69,25],[23,6,24,6],[31,6,32,6],[39,6,40,6],[47,6,48,6],[55,6,56,6],[63,6,64,6]]}
[null,null,null,null,null,null,3]
["CHAMPIONNAT DES CLUBS"]
[]
["POULE 1"]
["EQUIPES",null,"POINTS","Pour","Contre","Diff"]
["AA","1A",{"$f":"SUMIF($A$18:$A$69,A6,$E$18:$E$69)+SUMIF($C$18:$C$69,A6,$F$18:$F$69)","v":21},{"$f":"SUMIF($A$18:$A$69,$A6,$B$18:$B$69)+SUMIF($C$18:$C$69,$A6,$D$18:$D$69)","v":158},{"$f":"SUMIF($C$18:$C$69,$A6,$B$18:$B$69)+SUMIF($A$18:$A$69,$A6,$D$18:$D$69)","v":94},{"$f":"D6-E6","v":64}]
["AB","1B",{"$f":"SUMIF($A$18:$A$69,A7,$E$18:$E$69)+SUMIF($C$18:$C$69,A7,$F$18:$F$69)","v":11},{"$f":"SUMIF($A$18:$A$69,$A7,$B$18:$B$69)+SUMIF($C$18:$C$69,$A7,$D$18:$D$69)","v":96},{"$f":"SUMIF($C$18:$C$69,$A7,$B$18:$B$69)+SUMIF($A$18:$A$69,$A7,$D$18:$D$69)","v":156},-60]
["AC","1C",{"$f":"SUMIF($A$18:$A$69,A8,$E$18:$E$69)+SUMIF($C$18:$C$69,A8,$F$18:$F$69)","v":14},98,154,-56]
["AD","1D",13,140,112,28]
["AE","1E",16,150,102,48]
["AF","1F",12,108,144,-36]
["AG","1G",13,132,120,{"$f":"D12-E12","v":12}]
["AH","1H",12,{"$f":"SUMIF($A$18:$A$69,$A13,$B$18:$B$69)+SUMIF($C$18:$C$69,$A13,$D$18:$D$69)","v":126},126,{"$f":"D13-E13","v":0}]
[]
["1er MATCH le ","à","AA"]
[null,null,null,null,null,null,"SI forfait éq recevante"]
["Equipes","score","Equipes","score","Points","Points"]
["AA",24,"AB",{"$f":"IF(G18=19,19,IF(ISBLANK(B18),\"\",IF(B18=19,0,36-B18)))","v":12},{"$f":"IF(G18=19,0,IF(ISBLANK(B18),\"\",IF(B18<18,1,IF(B18=18,2,IF(B18>18,3)))))","v":3},{"$f":"IF(G18=19,3,IF(ISBLANK(B18),\"\",IF(B18=19,0,IF(D18<18,1,IF(D18=18,2,IF(D18>=20,3))))))","v":1},null,null,null,null,null,{"$f":"IF(B18>D18,A18&C18,IF(D18>B18,C18&A18,\"/\"))","v":"AAAB"},null,{"$f":"A18&C18","v":"AAAB"},{"$f":"E18","v":3},{"$f":"C18&A18","v":"ABAA"},{"$f":"F18","v":1},{"$f":"B18","v":24},{"$f":"D18","v":12}]
["AC",0,"AD",{"$f":"IF(G19=19,19,IF(ISBLANK(B19),\"\",IF(B19=19,0,36-B19)))","v":36},{"$f":"IF(G19=19,0,IF(ISBLANK(B19),\"\",IF(B19<18,1,IF(B19=18,2,IF(B19>18,3)))))","v":1},{"$f":"IF(G19=19,3,IF(ISBLANK(B19),\"\",IF(B19=19,0,IF(D19<18,1,IF(D19=18,2,IF(D19>=20,3))))))","v":3},null,null,null,null,null,{"$f":"IF(B19>D19,A19&C19,IF(D19>B19,C19&A19,\"/\"))","v":"ADAC"},null,{"$f":"A19&C19","v":"ACAD"},{"$f":"E19","v":1},{"$f":"C19&A19","v":"ADAC"},{"$f":"F19","v":3},{"$f":"B19","v":0},{"$f":"D19","v":36}]
["AE",28,"AF",{"$f":"IF(G20=19,19,IF(ISBLANK(B20),\"\",IF(B20=19,0,36-B20)))","v":8},{"$f":"IF(G20=19,0,IF(ISBLANK(B20),\"\",IF(B20<18,1,IF(B20=18,2,IF(B20>18,3)))))","v":3},{"$f":"IF(G20=19,3,IF(ISBLANK(B20),\"\",IF(B20=19,0,IF(D20<18,1,IF(D20=18,2,IF(D20>=20,3))))))","v":1},null,null,null,null,null,{"$f":"IF(B20>D20,A20&C20,IF(D20>B20,C20&A20,\"/\"))","v":"AEAF"},null,{"$f":"A20&C20","v":"AEAF"},{"$f":"E20","v":3},{"$f":"C20&A20","v":"AFAE"},{"$f":"F20","v":1},{"$f":"B20","v":28},{"$f":"D20","v":8}]
["AG",18,"AH",{"$f":"IF(G21=19,19,IF(ISBLANK(B21),\"\",IF(B21=19,0,36-B21)))","v":18},{"$f":"IF(G21=19,0,IF(ISBLANK(B21),\"\",IF(B21<18,1,IF(B21=18,2,IF(B21>18,3)))))","v":2},{"$f":"IF(G21=19,3,IF(ISBLANK(B21),\"\",IF(B21=19,0,IF(D21<18,1,IF(D21=18,2,IF(D21>=20,3))))))","v":2},null,null,null,null,null,{"$f":"IF(B21>D21,A21&C21,IF(D21>B21,C21&A21,\"/\"))","v":"/"},null,{"$f":"A21&C21","v":"AGAH"},{"$f":"E21","v":2},{"$f":"C21&A21","v":"AHAG"},{"$f":"F21","v":2},{"$f":"B21","v":18},{"$f":"D21","v":18}]
[]
["2 éme MATCH le ","à","AB"]
[null,null,null,null,null,null,"SI forfait éq recevante"]
["Equipes","score","Equipes","score","Points","Points"]
["AA",22,"AC",{"$f":"IF(G26=19,19,IF(ISBLANK(B26),\"\",IF(B26=19,0,36-B26)))","v":14},{"$f":"IF(G26=19,0,IF(ISBLANK(B26),\"\",IF(B26<18,1,IF(B26=18,2,IF(B26>18,3)))))","v":3},{"$f":"IF(G26=19,3,IF(ISBLANK(B26),\"\",IF(B26=19,0,IF(D26<18,1,IF(D26=18,2,IF(D26>=20,3))))))","v":1},null,null,null,null,null,{"$f":"IF(B26>D26,A26&C26,IF(D26>B26,C26&A26,\"/\"))","v":"AAAC"},null,{"$f":"A26&C26","v":"AAAC"},{"$f":"E26","v":3},{"$f":"C26&A26","v":"ACAA"},{"$f":"F26","v":1},{"$f":"B26","v":22},{"$f":"D26","v":14}]
["AB",10,"AH",{"$f":"IF(G27=19,19,IF(ISBLANK(B27),\"\",IF(B27=19,0,36-B27)))","v":26},{"$f":"IF(G27=19,0,IF(ISBLANK(B27),\"\",IF(B27<18,1,IF(B27=18,2,IF(B27>18,3)))))","v":1},{"$f":"IF(G27=19,3,IF(ISBLANK(B27),\"\",IF(B27=19,0,IF(D27<18,1,IF(D27=18,2,IF(D27>=20,3))))))","v":3},null,null,null,null,null,{"$f":"IF(B27>D27,A27&C27,IF(D27>B27,C27&A27,\"/\"))","v":"AHAB"},null,{"$f":"A27&C27","v":"ABAH"},{"$f":"E27","v":1},{"$f":"C27&A27","v":"AHAB"},{"$f":"F27","v":3},{"$f":"B27","v":10},{"$f":"D27","v":26}]
["AD",18,"AF",{"$f":"IF(G28=19,19,IF(ISBLANK(B28),\"\",IF(B28=19,0,36-B28)))","v":18},{"$f":"IF(G28=19,0,IF(ISBLANK(B28),\"\",IF(B28<18,1,IF(B28=18,2,IF(B28>18,3)))))","v":2},{"$f":"IF(G28=19,3,IF(ISBLANK(B28),\"\",IF(B28=19,0,IF(D28<18,1,IF(D28=18,2,IF(D28>=20,3))))))","v":2},null,null,null,null,null,{"$f":"IF(B28>D28,A28&C28,IF(D28>B28,C28&A28,\"/\"))","v":"/"},null,{"$f":"A28&C28","v":"ADAF"},{"$f":"E28","v":2},{"$f":"C28&A28","v":"AFAD"},{"$f":"F28","v":2},{"$f":"B28","v":18},{"$f":"D28","v":18}]
["AE",28,"AG",{"$f":"IF(G29=19,19,IF(ISBLANK(B29),\"\",IF(B29=19,0,36-B29)))","v":8},{"$f":"IF(G29=19,0,IF(ISBLANK(B29),\"\",IF(B29<18,1,IF(B29=18,2,IF(B29>18,3)))))","v":3},{"$f":"IF(G29=19,3,IF(ISBLANK(B29),\"\",IF(B29=19,0,IF(D29<18,1,IF(D29=18,2,IF(D29>=20,3))))))","v":1},null,null,null,null,null,{"$f":"IF(B29>D29,A29&C29,IF(D29>B29,C29&A29,\"/\"))","v":"AEAG"},null,{"$f":"A29&C29","v":"AEAG"},{"$f":"E29","v":3},{"$f":"C29&A29","v":"AGAE"},{"$f":"F29","v":1},{"$f":"B29","v":28},{"$f":"D29","v":8}]
[]
["3 éme MATCH le ","à","AC"]
[null,null,null,null,null,null,"SI forfait éq recevante"]
["Equipes","score","Equipes","score","Points","Points"]
["AA",20,"AH",{"$f":"IF(G34=19,19,IF(ISBLANK(B34),\"\",IF(B34=19,0,36-B34)))","v":16},{"$f":"IF(G34=19,0,IF(ISBLANK(B34),\"\",IF(B34<18,1,IF(B34=18,2,IF(B34>18,3)))))","v":3},{"$f":"IF(G34=19,3,IF(ISBLANK(B34),\"\",IF(B34=19,0,IF(D34<18,1,IF(D34=18,2,IF(D34>=20,3))))))","v":1},null,null,null,null,null,{"$f":"IF(B34>D34,A34&C34,IF(D34>B34,C34&A34,\"/\"))","v":"AAAH"},null,{"$f":"A34&C34","v":"AAAH"},{"$f":"E34","v":3},{"$f":"C34&A34","v":"AHAA"},{"$f":"F34","v":1},{"$f":"B34","v":20},{"$f":"D34","v":16}]
["AB",6,"AE",{"$f":"IF(G35=19,19,IF(ISBLANK(B35),\"\",IF(B35=19,0,36-B35)))","v":30},{"$f":"IF(G35=19,0,IF(ISBLANK(B35),\"\",IF(B35<18,1,IF(B35=18,2,IF(B35>18,3)))))","v":1},{"$f":"IF(G35=19,3,IF(ISBLANK(B35),\"\",IF(B35=19,0,IF(D35<18,1,IF(D35=18,2,IF(D35>=20,3))))))","v":3},null,null,null,null,null,{"$f":"IF(B35>D35,A35&C35,IF(D35>B35,C35&A35,\"/\"))","v":"AEAB"},null,{"$f":"A35&C35","v":"ABAE"},{"$f":"E35","v":1},{"$f":"C35&A35","v":"AEAB"},{"$f":"F35","v":3},{"$f":"B35","v":6},{"$f":"D35","v":30}]
["AC",20,"AF",{"$f":"IF(G36=19,19,IF(ISBLANK(B36),\"\",IF(B36=19,0,36-B36)))","v":16},{"$f":"IF(G36=19,0,IF(ISBLANK(B36),\"\",IF(B36<18,1,IF(B36=18,2,IF(B36>18,3)))))","v":3},{"$f":"IF(G36=19,3,IF(ISBLANK(B36),\"\",IF(B36=19,0,IF(D36<18,1,IF(D36=18,2,IF(D36>=20,3))))))","v":1},null,null,null,null,null,{"$f":"IF(B36>D36,A36&C36,IF(D36>B36,C36&A36,\"/\"))","v":"ACAF"},null,{"$f":"A36&C36","v":"ACAF"},{"$f":"E36","v":3},{"$f":"C36&A36","v":"AFAC"},{"$f":"F36","v":1},{"$f":"B36","v":20},{"$f":"D36","v":16}]
["AD",18,"AG",{"$f":"IF(G37=19,19,IF(ISBLANK(B37),\"\",IF(B37=19,0,36-B37)))","v":18},{"$f":"IF(G37=19,0,IF(ISBLANK(B37),\"\",IF(B37<18,1,IF(B37=18,2,IF(B37>18,3)))))","v":2},{"$f":"IF(G37=19,3,IF(ISBLANK(B37),\"\",IF(B37=19,0,IF(D37<18,1,IF(D37=18,2,IF(D37>=20,3))))))","v":2},null,null,null,null,null,{"$f":"IF(B37>D37,A37&C37,IF(D37>B37,C37&A37,\"/\"))","v":"/"},null,{"$f":"A37&C37","v":"ADAG"},{"$f":"E37","v":2},{"$f":"C37&A37","v":"AGAD"},{"$f":"F37","v":2},{"$f":"B37","v":18},{"$f":"D37","v":18}]
[]
["4 éme MATCH le ","à","AD"]
[null,null,null,null,null,null,"SI forfait éq recevante"]
["Equipes","score","Equipes","score","Points","Points"]
["AA",20,"AD",{"$f":"IF(G42=19,19,IF(ISBLANK(B42),\"\",IF(B42=19,0,36-B42)))","v":16},{"$f":"IF(G42=19,0,IF(ISBLANK(B42),\"\",IF(B42<18,1,IF(B42=18,2,IF(B42>18,3)))))","v":3},{"$f":"IF(G42=19,3,IF(ISBLANK(B42),\"\",IF(B42=19,0,IF(D42<18,1,IF(D42=18,2,IF(D42>=20,3))))))","v":1},null,null,null,null,null,{"$f":"IF(B42>D42,A42&C42,IF(D42>B42,C42&A42,\"/\"))","v":"AAAD"},null,{"$f":"A42&C42","v":"AAAD"},{"$f":"E42","v":3},{"$f":"C42&A42","v":"ADAA"},{"$f":"F42","v":1},{"$f":"B42","v":20},{"$f":"D42","v":16}]
["AF",10,"AG",{"$f":"IF(G43=19,19,IF(ISBLANK(B43),\"\",IF(B43=19,0,36-B43)))","v":26},{"$f":"IF(G43=19,0,IF(ISBLANK(B43),\"\",IF(B43<18,1,IF(B43=18,2,IF(B43>18,3)))))","v":1},{"$f":"IF(G43=19,3,IF(ISBLANK(B43),\"\",IF(B43=19,0,IF(D43<18,1,IF(D43=18,2,IF(D43>=20,3))))))","v":3},null,null,null,null,null,{"$f":"IF(B43>D43,A43&C43,IF(D43>B43,C43&A43,\"/\"))","v":"AGAF"},null,{"$f":"A43&C43","v":"AFAG"},{"$f":"E43","v":1},{"$f":"C43&A43","v":"AGAF"},{"$f":"F43","v":3},{"$f":"B43","v":10},{"$f":"D43","v":26}]
["AB",32,"AC",{"$f":"IF(G44=19,19,IF(ISBLANK(B44),\"\",IF(B44=19,0,36-B44)))","v":4},{"$f":"IF(G44=19,0,IF(ISBLANK(B44),\"\",IF(B44<18,1,IF(B44=18,2,IF(B44>18,3)))))","v":3},{"$f":"IF(G44=19,3,IF(ISBLANK(B44),\"\",IF(B44=19,0,IF(D44<18,1,IF(D44=18,2,IF(D44>=20,3))))))","v":1},null,null,null,null,null,{"$f":"IF(B44>D44,A44&C44,IF(D44>B44,C44&A44,\"/\"))","v":"ABAC"},null,{"$f":"A44&C44","v":"ABAC"},{"$f":"E44","v":3},{"$f":"C44&A44","v":"ACAB"},{"$f":"F44","v":1},{"$f":"B44","v":32},{"$f":"D44","v":4}]
["AE",20,"AH",{"$f":"IF(G45=19,19,IF(ISBLANK(B45),\"\",IF(B45=19,0,36-B45)))","v":16},{"$f":"IF(G45=19,0,IF(ISBLANK(B45),\"\",IF(B45<18,1,IF(B45=18,2,IF(B45>18,3)))))","v":3},{"$f":"IF(G45=19,3,IF(ISBLANK(B45),\"\",IF(B45=19,0,IF(D45<18,1,IF(D45=18,2,IF(D45>=20,3))))))","v":1},null,null,null,null,null,{"$f":"IF(B45>D45,A45&C45,IF(D45>B45,C45&A45,\"/\"))","v":"AEAH"},null,{"$f":"A45&C45","v":"AEAH"},{"$f":"E45","v":3},{"$f":"C45&A45","v":"AHAE"},{"$f":"F45","v":1},{"$f":"B45","v":20},{"$f":"D45","v":16}]
[]
["5 éme MATCH le ","à","AE"]
[null,null,null,null,null,null,"SI forfait éq recevante"]
["Equipes","score","Equipes","score","Points","Points"]
["AA",26,"AF",{"$f":"IF(G50=19,19,IF(ISBLANK(B50),\"\",IF(B50=19,0,36-B50)))","v":10},{"$f":"IF(G50=19,0,IF(ISBLANK(B50),\"\",IF(B50<18,1,IF(B50=18,2,IF(B50>18,3)))))","v":3},{"$f":"IF(G50=19,3,IF(ISBLANK(B50),\"\",IF(B50=19,0,IF(D50<18,1,IF(D50=18,2,IF(D50>=20,3))))))","v":1},null,null,null,null,null,{"$f":"IF(B50>D50,A50&C50,IF(D50>B50,C50&A50,\"/\"))","v":"AAAF"},null,{"$f":"A50&C50","v":"AAAF"},{"$f":"E50","v":3},{"$f":"C50&A50","v":"AFAA"},{"$f":"F50","v":1},{"$f":"B50","v":26},{"$f":"D50","v":10}]
["AD",18,"AH",{"$f":"IF(G51=19,19,IF(ISBLANK(B51),\"\",IF(B51=19,0,36-B51)))","v":18},{"$f":"IF(G51=19,0,IF(ISBLANK(B51),\"\",IF(B51<18,1,IF(B51=18,2,IF(B51>18,3)))))","v":2},{"$f":"IF(G51=19,3,IF(ISBLANK(B51),\"\",IF(B51=19,0,IF(D51<18,1,IF(D51=18,2,IF(D51>=20,3))))))","v":2},null,null,null,null,null,{"$f":"IF(B51>D51,A51&C51,IF(D51>B51,C51&A51,\"/\"))","v":"/"},null,{"$f":"A51&C51","v":"ADAH"},{"$f":"E51","v":2},{"$f":"C51&A51","v":"AHAD"},{"$f":"F51","v":2},{"$f":"B51","v":18},{"$f":"D51","v":18}]
["AB",4,"AG",{"$f":"IF(G52=19,19,IF(ISBLANK(B52),\"\",IF(B52=19,0,36-B52)))","v":32},{"$f":"IF(G52=19,0,IF(ISBLANK(B52),\"\",IF(B52<18,1,IF(B52=18,2,IF(B52>18,3)))))","v":1},{"$f":"IF(G52=19,3,IF(ISBLANK(B52),\"\",IF(B52=19,0,IF(D52<18,1,IF(D52=18,2,IF(D52>=20,3))))))","v":3},null,null,null,null,null,{"$f":"IF(B52>D52,A52&C52,IF(D52>B52,C52&A52,\"/\"))","v":"AGAB"},null,{"$f":"A52&C52","v":"ABAG"},{"$f":"E52","v":1},{"$f":"C52&A52","v":"AGAB"},{"$f":"F52","v":3},{"$f":"B52","v":4},{"$f":"D52","v":32}]
["AC",20,"AE",{"$f":"IF(G53=19,19,IF(ISBLANK(B53),\"\",IF(B53=19,0,36-B53)))","v":16},{"$f":"IF(G53=19,0,IF(ISBLANK(B53),\"\",IF(B53<18,1,IF(B53=18,2,IF(B53>18,3)))))","v":3},{"$f":"IF(G53=19,3,IF(ISBLANK(B53),\"\",IF(B53=19,0,IF(D53<18,1,IF(D53=18,2,IF(D53>=20,3))))))","v":1},null,null,null,null,null,{"$f":"IF(B53>D53,A53&C53,IF(D53>B53,C53&A53,\"/\"))","v":"ACAE"},null,{"$f":"A53&C53","v":"ACAE"},{"$f":"E53","v":3},{"$f":"C53&A53","v":"AEAC"},{"$f":"F53","v":1},{"$f":"B53","v":20},{"$f":"D53","v":16}]
[]
["6 éme MATCH le ","à","AF"]
[null,null,null,null,null,null,"SI forfait éq recevante"]
["Equipes","score","Equipes","score","Points","Points"]
["AB",20,"AD",{"$f":"IF(G58=19,19,IF(ISBLANK(B58),\"\",IF(B58=19,0,36-B58)))","v":16},{"$f":"IF(G58=19,0,IF(ISBLANK(B58),\"\",IF(B58<18,1,IF(B58=18,2,IF(B58>18,3)))))","v":3},{"$f":"IF(G58=19,3,IF(ISBLANK(B58),\"\",IF(B58=19,0,IF(D58<18,1,IF(D58=18,2,IF(D58>=20,3))))))","v":1},null,null,null,null,null,{"$f":"IF(B58>D58,A58&C58,IF(D58>B58,C58&A58,\"/\"))","v":"ABAD"},null,{"$f":"A58&C58","v":"ABAD"},{"$f":"E58","v":3},{"$f":"C58&A58","v":"ADAB"},{"$f":"F58","v":1},{"$f":"B58","v":20},{"$f":"D58","v":16}]
["AE",10,"AA",{"$f":"IF(G59=19,19,IF(ISBLANK(B59),\"\",IF(B59=19,0,36-B59)))","v":26},{"$f":"IF(G59=19,0,IF(ISBLANK(B59),\"\",IF(B59<18,1,IF(B59=18,2,IF(B59>18,3)))))","v":1},{"$f":"IF(G59=19,3,IF(ISBLANK(B59),\"\",IF(B59=19,0,IF(D59<18,1,IF(D59=18,2,IF(D59>=20,3))))))","v":3},null,null,null,null,null,{"$f":"IF(B59>D59,A59&C59,IF(D59>B59,C59&A59,\"/\"))","v":"AAAE"},null,{"$f":"A59&C59","v":"AEAA"},{"$f":"E59","v":1},{"$f":"C59&A59","v":"AAAE"},{"$f":"F59","v":3},{"$f":"B59","v":10},{"$f":"D59","v":26}]
["AG",14,"AC",{"$f":"IF(G60=19,19,IF(ISBLANK(B60),\"\",IF(B60=19,0,36-B60)))","v":22},{"$f":"IF(G60=19,0,IF(ISBLANK(B60),\"\",IF(B60<18,1,IF(B60=18,2,IF(B60>18,3)))))","v":1},{"$f":"IF(G60=19,3,IF(ISBLANK(B60),\"\",IF(B60=19,0,IF(D60<18,1,IF(D60=18,2,IF(D60>=20,3))))))","v":3},null,null,null,null,null,{"$f":"IF(B60>D60,A60&C60,IF(D60>B60,C60&A60,\"/\"))","v":"ACAG"},null,{"$f":"A60&C60","v":"AGAC"},{"$f":"E60","v":1},{"$f":"C60&A60","v":"ACAG"},{"$f":"F60","v":3},{"$f":"B60","v":14},{"$f":"D60","v":22}]
["AF",22,"AH",{"$f":"IF(G61=19,19,IF(ISBLANK(B61),\"\",IF(B61=19,0,36-B61)))","v":14},{"$f":"IF(G61=19,0,IF(ISBLANK(B61),\"\",IF(B61<18,1,IF(B61=18,2,IF(B61>18,3)))))","v":3},{"$f":"IF(G61=19,3,IF(ISBLANK(B61),\"\",IF(B61=19,0,IF(D61<18,1,IF(D61=18,2,IF(D61>=20,3))))))","v":1},null,null,null,null,null,{"$f":"IF(B61>D61,A61&C61,IF(D61>B61,C61&A61,\"/\"))","v":"AFAH"},null,{"$f":"A61&C61","v":"AFAH"},{"$f":"E61","v":3},{"$f":"C61&A61","v":"AHAF"},{"$f":"F61","v":1},{"$f":"B61","v":22},{"$f":"D61","v":14}]
[]
["7 éme MATCH le","à","AG"]
[null,null,null,null,null,null,"SI forfait éq recevante",null," "]
["Equipes","score","Equipes","score","Points","Points"]
["AA",20,"AG",{"$f":"IF(G66=19,19,IF(ISBLANK(B66),\"\",IF(B66=19,0,36-B66)))","v":16},{"$f":"IF(G66=19,0,IF(ISBLANK(B66),\"\",IF(B66<18,1,IF(B66=18,2,IF(B66>18,3)))))","v":3},{"$f":"IF(G66=19,3,IF(ISBLANK(B66),\"\",IF(B66=19,0,IF(D66<18,1,IF(D66=18,2,IF(D66>=20,3))))))","v":1},null,null,null,null,null,{"$f":"IF(B66>D66,A66&C66,IF(D66>B66,C66&A66,\"/\"))","v":"AAAG"},null,{"$f":"A66&C66","v":"AAAG"},{"$f":"E66","v":3},{"$f":"C66&A66","v":"AGAA"},{"$f":"F66","v":1},{"$f":"B66","v":20},{"$f":"D66","v":16}]
["AB",12,"AF",{"$f":"IF(G67=19,19,IF(ISBLANK(B67),\"\",IF(B67=19,0,36-B67)))","v":24},{"$f":"IF(G67=19,0,IF(ISBLANK(B67),\"\",IF(B67<18,1,IF(B67=18,2,IF(B67>18,3)))))","v":1},{"$f":"IF(G67=19,3,IF(ISBLANK(B67),\"\",IF(B67=19,0,IF(D67<18,1,IF(D67=18,2,IF(D67>=20,3))))))","v":3},null,null,null,null,null,{"$f":"IF(B67>D67,A67&C67,IF(D67>B67,C67&A67,\"/\"))","v":"AFAB"},null,{"$f":"A67&C67","v":"ABAF"},{"$f":"E67","v":1},{"$f":"C67&A67","v":"AFAB"},{"$f":"F67","v":3},{"$f":"B67","v":12},{"$f":"D67","v":24}]
["AE",18,"AD",{"$f":"IF(G68=19,19,IF(ISBLANK(B68),\"\",IF(B68=19,0,36-B68)))","v":18},{"$f":"IF(G68=19,0,IF(ISBLANK(B68),\"\",IF(B68<18,1,IF(B68=18,2,IF(B68>18,3)))))","v":2},{"$f":"IF(G68=19,3,IF(ISBLANK(B68),\"\",IF(B68=19,0,IF(D68<18,1,IF(D68=18,2,IF(D68>=20,3))))))","v":2},null,null,null,null,null,{"$f":"IF(B68>D68,A68&C68,IF(D68>B68,C68&A68,\"/\"))","v":"/"},null,{"$f":"A68&C68","v":"AEAD"},{"$f":"E68","v":2},{"$f":"C68&A68","v":"ADAE"},{"$f":"F68","v":2},{"$f":"B68","v":18},{"$f":"D68","v":18}]
["AC",18,"AH",{"$f":"IF(G69=19,19,IF(ISBLANK(B69),\"\",IF(B69=19,0,36-B69)))","v":18},{"$f":"IF(G69=19,0,IF(ISBLANK(B69),\"\",IF(B69<18,1,IF(B69=18,2,IF(B69>18,3)))))","v":2},{"$f":"IF(G69=19,3,IF(ISBLANK(B69),\"\",IF(B69=19,0,IF(D69<18,1,IF(D69=18,2,IF(D69>=20,3))))))","v":2},null,null,null,null,null,{"$f":"IF(B69>D69,A69&C69,IF(D69>B69,C69&A69,\"/\"))","v":"/"},null,{"$f":"A69&C69","v":"ACAH"},{"$f":"E69","v":2},{"$f":"C69&A69","v":"AHAC"},{"$f":"F69","v":2},{"$f":"B69","v":18},{"$f":"D69","v":18}]
[null,null,"Si pas d'exaequo",null,null,null,"Classt        Final","Rencontres entre exaequos"]
["EQUIPES",null,"POINTS","POUR","CONTRE","DIFF",null,"POINTS Exaequos","Exaq","n°","AA","AB","AC","AD","AE","AF","AG","AH","Pts matchs",null,null,null,"1000000*Pts matchs +1000 (Diff +  abs(diff mini) )+Pour ","RANG","DIFF Exaequos","POUR Exaequos"]
["AA","1A",21,158,94,64,1,{"$f":"IF(S72>0,S72,\"\")","v":""},{"$f":"COUNTIF($C$72:$C$79,C72)","v":1},{"$f":"IF(AND(I72>1,COUNTIFS(I$72:I72,I72,C$72:C72,C72)=1),MAX(J$71:J71)+1,\"\")","v":""},{"$f":"IF($A72=K$71,\"\",IF(INDEX($C$72:$C$79,MATCH(K$71,$A$72:$A$79,0))=$C72,IFERROR(VLOOKUP($A72&K$71,$N$18:$O$69,2,0),  VLOOKUP(K$71&$A72,$N$18:$Q$69,4,0)),          \"\"))","v":""},"","","","","","","",{"$f":"SUM(K72:R72)","v":0},null,null,null,{"$f":"IF(I72<3,S72*1000000+(F72+ABS(MIN($F$72:$F$79)))*1000+D72,S72*1000000+U96*1000+Z72)","v":124158},{"$f":"IF(I72>2,RANK(W72,OFFSET(W$71,MATCH(I72,$I$72:$I$79,0),,I72)))","v":false},{"$f":"IF(S96=0,\"\",S96)","v":""},{"$f":"IF(S80=0,\"\",S80)","v":""}]
["AE","1E",16,150,102,48,2,"",1,{"$f":"IF(AND(I73>1,COUNTIFS(I$72:I73,I73,C$72:C73,C73)=1),MAX(J$71:J72)+1,\"\")","v":""},"","","","","","","","",{"$f":"SUM(K73:R73)","v":0},null,null,null,{"$f":"IF(I73<3,S73*1000000+(F73+ABS(MIN($F$72:$F$79)))*1000+D73,S73*1000000+U97*1000+Z73)","v":108150},{"$f":"IF(I73>2,RANK(W73,OFFSET(W$71,MATCH(I73,$I$72:$I$79,0),,I73)))","v":false},"",""]
["AC","1C",14,98,154,-56,3,"",1,{"$f":"IF(AND(I74>1,COUNTIFS(I$72:I74,I74,C$72:C74,C74)=1),MAX(J$71:J73)+1,\"\")","v":""},"","","","","","","","",0,null,null,null,4098,false,"",""]
["AD","1D",13,140,112,28,4,2,2,{"$f":"IF(AND(I75>1,COUNTIFS(I$72:I75,I75,C$72:C75,C75)=1),MAX(J$71:J74)+1,\"\")","v":1},"","","","","","",2,"",2,null,null,null,2088140,false,"",18]
["AG","1G",13,132,120,12,5,2,2,{"$f":"IF(AND(I76>1,COUNTIFS(I$72:I76,I76,C$72:C76,C76)=1),MAX(J$71:J75)+1,\"\")","v":""},"","","",2,"","","","",2,null,null,null,2072132,false,"",18]
["AF","1F",12,108,144,-36,6,3,2,{"$f":"IF(AND(I77>1,COUNTIFS(I$72:I77,I77,C$72:C77,C77)=1),MAX(J$71:J76)+1,\"\")","v":2},"","","","","","","",3,3,null,null,null,3024108,false,8,22]
["AH","1H",12,126,126,0,7,1,2,{"$f":"IF(AND(I78>1,COUNTIFS(I$72:I78,I78,C$72:C78,C78)=1),MAX(J$71:J77)+1,\"\")","v":""},"","","","","",1,"","",1,null,null,null,1060126,false,-8,14]
["AB","1B",11,96,156,-60,8,"",1,{"$f":"IF(AND(I79>1,COUNTIFS(I$72:I79,I79,C$72:C79,C79)=1),MAX(J$71:J78)+1,\"\")","v":""},"","","","","","","","",0,null,null,null,96,false,"",""]
[null,null,null,null,null,null,null,null,"POUR",{"$f":"A72","v":"AA"},{"$f":"IF($A72=K$71,\"\",IF(INDEX($C$72:$C$79,MATCH(K$71,$A$72:$A$79,0))=$C72,IFERROR(VLOOKUP($A72&K$71,$N$18:$R$69,5,0),  VLOOKUP(K$71&$A72,$N$18:$S$69,6,0)),          \"\"))","v":""},"","","","","","","",0]
[null,null,null,null,null,null,null,null,null,"AE","","","","","","","","",0]
[null,null,null,null,null,null,null,null,null,"AC","","","","","","","","",0]
[null,null,null,null,null,null,null,null,null,"AD","","","","","","",18,"",18]
[null,null,null,null,null,null,null,null,null,"AG","","","",18,"","","","",18,null,null,null,null,null,"  "]
[null,null,null,null,null,null,null,null,null,"AF","","","","","","","",22,22]
[null,null,null,null,null,null,null,null,null,"AH","","","","","",14,"","",14]
[null,null,null,null,null,null,null,null,null,"AB","","","","","","","","",0]
[null,null,null,null,null,null,null,null,"CONTRE",{"$f":"J80","v":"AA"},{"$f":"INDEX($K$80:$R$87,MATCH(K$71,$J$80:$J$87,0),MATCH($J80,$K$71:$R$71,0))","v":""},{"$f":"INDEX($K$80:$R$87,MATCH(L$71,$J$80:$J$87,0),MATCH($J80,$K$71:$R$71,0))","v":""},"","","","","","",0]
[null,null,null,null,null,null,null,null,null,{"$f":"J81","v":"AE"},{"$f":"INDEX($K$80:$R$87,MATCH(K$71,$J$80:$J$87,0),MATCH($J81,$K$71:$R$71,0))","v":""},"","","","","","","",0]
[null,null,null,null,null,null,null,null,null,"AC","","","","","","","","",0]
[null,null,null,null,null,null,null,null,null,"AD","","","","","","",18,"",18]
[null,null,null,null,null,null,null,null,null,"AG","","","",18,"","","","",18]
[null,null,null,null,null,null,null,null,null,"AF","","","","","","","",14,14]
[null,null,null,null,null,null,null,null,null,"AH","","","","","",22,"","",22]
[null,null,null,null,null,null,null,null,null,"AB","","","","","","","","",0,null,"Diff pondérée"]
[null,null,null,null,null,null,null,null,"DIFF",{"$f":"J88","v":"AA"},null,null,null,null,null,null,null,null,{"$f":"S80-S88","v":0},null,{"$f":"S96+ABS(MIN($S$96:$S$103))","v":8}]
[null,null,null,null,null,null,null,null,null,{"$f":"J89","v":"AE"},null,null,null,null,null,null,null,null,{"$f":"S81-S89","v":0},null,8]
[null,null,null,null,null,null,null,null,null,"AC",null,null,null,null,null,null,null,null,0,null,8]
[null,null,null,null,null,null,null,null,null,"AD",null,null,null,null,null,null,null,null,0,null,8]
[null,null,null,null,null,null,null,null,null,"AG",null,null,null,null,null,null,null,null,0,null,8]
[null,null,null,null,null,null,null,null,null,"AF",null,null,null,null,null,null,null,null,8,null,16]
[null,null,null,null,null,null,null,null,null,"AH",null,null,null,null,null,null,null,null,-8,null,{"$f":"S102+ABS(MIN($S$96:$S$103))","v":0}]
[null,null,null,null,null,null,null,null,null,"AB",null,null,null,null,null,null,null,null,0,null,{"$f":"S103+ABS(MIN($S$96:$S$103))","v":8}]

{"sheet":"P11","index":10,"n_rows":103,"n_cols":26,"rows_kept":103,"cut":false,"hidden":false,"merged":[[0,0,0,5],[1,0,1,5],[2,0,2,5],[3,0,3,5],[3,8,3,10],[15,6,16,6],[69,2,69,5],[69,6,70,6],[69,7,69,25],[23,6,24,6],[31,6,32,6],[39,6,40,6],[47,6,48,6],[55,6,56,6],[63,6,64,6]]}
[null,null,null,null,null,null,3]
["CHAMPIONNAT DES CLUBS"]
[]
["POULE 1"]
["EQUIPES",null,"POINTS","Pour","Contre","Diff"]
["AA","1A",{"$f":"SUMIF($A$18:$A$69,A6,$E$18:$E$69)+SUMIF($C$18:$C$69,A6,$F$18:$F$69)","v":14},{"$f":"SUMIF($A$18:$A$69,$A6,$B$18:$B$69)+SUMIF($C$18:$C$69,$A6,$D$18:$D$69)","v":122},{"$f":"SUMIF($C$18:$C$69,$A6,$B$18:$B$69)+SUMIF($A$18:$A$69,$A6,$D$18:$D$69)","v":130},{"$f":"D6-E6","v":-8}]
["AB","1B",{"$f":"SUMIF($A$18:$A$69,A7,$E$18:$E$69)+SUMIF($C$18:$C$69,A7,$F$18:$F$69)","v":15},{"$f":"SUMIF($A$18:$A$69,$A7,$B$18:$B$69)+SUMIF($C$18:$C$69,$A7,$D$18:$D$69)","v":134},{"$f":"SUMIF($C$18:$C$69,$A7,$B$18:$B$69)+SUMIF($A$18:$A$69,$A7,$D$18:$D$69)","v":118},16]
["AC","1C",{"$f":"SUMIF($A$18:$A$69,A8,$E$18:$E$69)+SUMIF($C$18:$C$69,A8,$F$18:$F$69)","v":15},114,138,-24]
["AD","1D",12,102,150,-48]
["AE","1E",15,140,112,28]
["AF","1F",15,128,124,4]
["AG","1G",15,150,102,{"$f":"D12-E12","v":48}]
["AH","1H",11,{"$f":"SUMIF($A$18:$A$69,$A13,$B$18:$B$69)+SUMIF($C$18:$C$69,$A13,$D$18:$D$69)","v":118},134,{"$f":"D13-E13","v":-16}]
[]
["1er MATCH le ","à","AA"]
[null,null,null,null,null,null,"SI forfait éq recevante"]
["Equipes","score","Equipes","score","Points","Points"]
["AA",16,"AB",{"$f":"IF(G18=19,19,IF(ISBLANK(B18),\"\",IF(B18=19,0,36-B18)))","v":20},{"$f":"IF(G18=19,0,IF(ISBLANK(B18),\"\",IF(B18<18,1,IF(B18=18,2,IF(B18>18,3)))))","v":1},{"$f":"IF(G18=19,3,IF(ISBLANK(B18),\"\",IF(B18=19,0,IF(D18<18,1,IF(D18=18,2,IF(D18>=20,3))))))","v":3},null,null,null,null,null,{"$f":"IF(B18>D18,A18&C18,IF(D18>B18,C18&A18,\"/\"))","v":"ABAA"},null,{"$f":"A18&C18","v":"AAAB"},{"$f":"E18","v":1},{"$f":"C18&A18","v":"ABAA"},{"$f":"F18","v":3},{"$f":"B18","v":16},{"$f":"D18","v":20}]
["AC",30,"AD",{"$f":"IF(G19=19,19,IF(ISBLANK(B19),\"\",IF(B19=19,0,36-B19)))","v":6},{"$f":"IF(G19=19,0,IF(ISBLANK(B19),\"\",IF(B19<18,1,IF(B19=18,2,IF(B19>18,3)))))","v":3},{"$f":"IF(G19=19,3,IF(ISBLANK(B19),\"\",IF(B19=19,0,IF(D19<18,1,IF(D19=18,2,IF(D19>=20,3))))))","v":1},null,null,null,null,null,{"$f":"IF(B19>D19,A19&C19,IF(D19>B19,C19&A19,\"/\"))","v":"ACAD"},null,{"$f":"A19&C19","v":"ACAD"},{"$f":"E19","v":3},{"$f":"C19&A19","v":"ADAC"},{"$f":"F19","v":1},{"$f":"B19","v":30},{"$f":"D19","v":6}]
["AE",16,"AF",{"$f":"IF(G20=19,19,IF(ISBLANK(B20),\"\",IF(B20=19,0,36-B20)))","v":20},{"$f":"IF(G20=19,0,IF(ISBLANK(B20),\"\",IF(B20<18,1,IF(B20=18,2,IF(B20>18,3)))))","v":1},{"$f":"IF(G20=19,3,IF(ISBLANK(B20),\"\",IF(B20=19,0,IF(D20<18,1,IF(D20=18,2,IF(D20>=20,3))))))","v":3},null,null,null,null,null,{"$f":"IF(B20>D20,A20&C20,IF(D20>B20,C20&A20,\"/\"))","v":"AFAE"},null,{"$f":"A20&C20","v":"AEAF"},{"$f":"E20","v":1},{"$f":"C20&A20","v":"AFAE"},{"$f":"F20","v":3},{"$f":"B20","v":16},{"$f":"D20","v":20}]
["AG",18,"AH",{"$f":"IF(G21=19,19,IF(ISBLANK(B21),\"\",IF(B21=19,0,36-B21)))","v":18},{"$f":"IF(G21=19,0,IF(ISBLANK(B21),\"\",IF(B21<18,1,IF(B21=18,2,IF(B21>18,3)))))","v":2},{"$f":"IF(G21=19,3,IF(ISBLANK(B21),\"\",IF(B21=19,0,IF(D21<18,1,IF(D21=18,2,IF(D21>=20,3))))))","v":2},null,null,null,null,null,{"$f":"IF(B21>D21,A21&C21,IF(D21>B21,C21&A21,\"/\"))","v":"/"},null,{"$f":"A21&C21","v":"AGAH"},{"$f":"E21","v":2},{"$f":"C21&A21","v":"AHAG"},{"$f":"F21","v":2},{"$f":"B21","v":18},{"$f":"D21","v":18}]
[]
["2 éme MATCH le ","à","AB"]
[null,null,null,null,null,null,"SI forfait éq recevante"]
["Equipes","score","Equipes","score","Points","Points"]
["AA",18,"AC",{"$f":"IF(G26=19,19,IF(ISBLANK(B26),\"\",IF(B26=19,0,36-B26)))","v":18},{"$f":"IF(G26=19,0,IF(ISBLANK(B26),\"\",IF(B26<18,1,IF(B26=18,2,IF(B26>18,3)))))","v":2},{"$f":"IF(G26=19,3,IF(ISBLANK(B26),\"\",IF(B26=19,0,IF(D26<18,1,IF(D26=18,2,IF(D26>=20,3))))))","v":2},null,null,null,null,null,{"$f":"IF(B26>D26,A26&C26,IF(D26>B26,C26&A26,\"/\"))","v":"/"},null,{"$f":"A26&C26","v":"AAAC"},{"$f":"E26","v":2},{"$f":"C26&A26","v":"ACAA"},{"$f":"F26","v":2},{"$f":"B26","v":18},{"$f":"D26","v":18}]
["AB",18,"AH",{"$f":"IF(G27=19,19,IF(ISBLANK(B27),\"\",IF(B27=19,0,36-B27)))","v":18},{"$f":"IF(G27=19,0,IF(ISBLANK(B27),\"\",IF(B27<18,1,IF(B27=18,2,IF(B27>18,3)))))","v":2},{"$f":"IF(G27=19,3,IF(ISBLANK(B27),\"\",IF(B27=19,0,IF(D27<18,1,IF(D27=18,2,IF(D27>=20,3))))))","v":2},null,null,null,null,null,{"$f":"IF(B27>D27,A27&C27,IF(D27>B27,C27&A27,\"/\"))","v":"/"},null,{"$f":"A27&C27","v":"ABAH"},{"$f":"E27","v":2},{"$f":"C27&A27","v":"AHAB"},{"$f":"F27","v":2},{"$f":"B27","v":18},{"$f":"D27","v":18}]
["AD",18,"AF",{"$f":"IF(G28=19,19,IF(ISBLANK(B28),\"\",IF(B28=19,0,36-B28)))","v":18},{"$f":"IF(G28=19,0,IF(ISBLANK(B28),\"\",IF(B28<18,1,IF(B28=18,2,IF(B28>18,3)))))","v":2},{"$f":"IF(G28=19,3,IF(ISBLANK(B28),\"\",IF(B28=19,0,IF(D28<18,1,IF(D28=18,2,IF(D28>=20,3))))))","v":2},null,null,null,null,null,{"$f":"IF(B28>D28,A28&C28,IF(D28>B28,C28&A28,\"/\"))","v":"/"},null,{"$f":"A28&C28","v":"ADAF"},{"$f":"E28","v":2},{"$f":"C28&A28","v":"AFAD"},{"$f":"F28","v":2},{"$f":"B28","v":18},{"$f":"D28","v":18}]
["AE",28,"AG",{"$f":"IF(G29=19,19,IF(ISBLANK(B29),\"\",IF(B29=19,0,36-B29)))","v":8},{"$f":"IF(G29=19,0,IF(ISBLANK(B29),\"\",IF(B29<18,1,IF(B29=18,2,IF(B29>18,3)))))","v":3},{"$f":"IF(G29=19,3,IF(ISBLANK(B29),\"\",IF(B29=19,0,IF(D29<18,1,IF(D29=18,2,IF(D29>=20,3))))))","v":1},null,null,null,null,null,{"$f":"IF(B29>D29,A29&C29,IF(D29>B29,C29&A29,\"/\"))","v":"AEAG"},null,{"$f":"A29&C29","v":"AEAG"},{"$f":"E29","v":3},{"$f":"C29&A29","v":"AGAE"},{"$f":"F29","v":1},{"$f":"B29","v":28},{"$f":"D29","v":8}]
[]
["3 éme MATCH le ","à","AC"]
[null,null,null,null,null,null,"SI forfait éq recevante"]
["Equipes","score","Equipes","score","Points","Points"]
["AA",20,"AH",{"$f":"IF(G34=19,19,IF(ISBLANK(B34),\"\",IF(B34=19,0,36-B34)))","v":16},{"$f":"IF(G34=19,0,IF(ISBLANK(B34),\"\",IF(B34<18,1,IF(B34=18,2,IF(B34>18,3)))))","v":3},{"$f":"IF(G34=19,3,IF(ISBLANK(B34),\"\",IF(B34=19,0,IF(D34<18,1,IF(D34=18,2,IF(D34>=20,3))))))","v":1},null,null,null,null,null,{"$f":"IF(B34>D34,A34&C34,IF(D34>B34,C34&A34,\"/\"))","v":"AAAH"},null,{"$f":"A34&C34","v":"AAAH"},{"$f":"E34","v":3},{"$f":"C34&A34","v":"AHAA"},{"$f":"F34","v":1},{"$f":"B34","v":20},{"$f":"D34","v":16}]
["AB",18,"AE",{"$f":"IF(G35=19,19,IF(ISBLANK(B35),\"\",IF(B35=19,0,36-B35)))","v":18},{"$f":"IF(G35=19,0,IF(ISBLANK(B35),\"\",IF(B35<18,1,IF(B35=18,2,IF(B35>18,3)))))","v":2},{"$f":"IF(G35=19,3,IF(ISBLANK(B35),\"\",IF(B35=19,0,IF(D35<18,1,IF(D35=18,2,IF(D35>=20,3))))))","v":2},null,null,null,null,null,{"$f":"IF(B35>D35,A35&C35,IF(D35>B35,C35&A35,\"/\"))","v":"/"},null,{"$f":"A35&C35","v":"ABAE"},{"$f":"E35","v":2},{"$f":"C35&A35","v":"AEAB"},{"$f":"F35","v":2},{"$f":"B35","v":18},{"$f":"D35","v":18}]
["AC",20,"AF",{"$f":"IF(G36=19,19,IF(ISBLANK(B36),\"\",IF(B36=19,0,36-B36)))","v":16},{"$f":"IF(G36=19,0,IF(ISBLANK(B36),\"\",IF(B36<18,1,IF(B36=18,2,IF(B36>18,3)))))","v":3},{"$f":"IF(G36=19,3,IF(ISBLANK(B36),\"\",IF(B36=19,0,IF(D36<18,1,IF(D36=18,2,IF(D36>=20,3))))))","v":1},null,null,null,null,null,{"$f":"IF(B36>D36,A36&C36,IF(D36>B36,C36&A36,\"/\"))","v":"ACAF"},null,{"$f":"A36&C36","v":"ACAF"},{"$f":"E36","v":3},{"$f":"C36&A36","v":"AFAC"},{"$f":"F36","v":1},{"$f":"B36","v":20},{"$f":"D36","v":16}]
["AD",18,"AG",{"$f":"IF(G37=19,19,IF(ISBLANK(B37),\"\",IF(B37=19,0,36-B37)))","v":18},{"$f":"IF(G37=19,0,IF(ISBLANK(B37),\"\",IF(B37<18,1,IF(B37=18,2,IF(B37>18,3)))))","v":2},{"$f":"IF(G37=19,3,IF(ISBLANK(B37),\"\",IF(B37=19,0,IF(D37<18,1,IF(D37=18,2,IF(D37>=20,3))))))","v":2},null,null,null,null,null,{"$f":"IF(B37>D37,A37&C37,IF(D37>B37,C37&A37,\"/\"))","v":"/"},null,{"$f":"A37&C37","v":"ADAG"},{"$f":"E37","v":2},{"$f":"C37&A37","v":"AGAD"},{"$f":"F37","v":2},{"$f":"B37","v":18},{"$f":"D37","v":18}]
[]
["4 éme MATCH le ","à","AD"]
[null,null,null,null,null,null,"SI forfait éq recevante"]
["Equipes","score","Equipes","score","Points","Points"]
["AA",18,"AD",{"$f":"IF(G42=19,19,IF(ISBLANK(B42),\"\",IF(B42=19,0,36-B42)))","v":18},{"$f":"IF(G42=19,0,IF(ISBLANK(B42),\"\",IF(B42<18,1,IF(B42=18,2,IF(B42>18,3)))))","v":2},{"$f":"IF(G42=19,3,IF(ISBLANK(B42),\"\",IF(B42=19,0,IF(D42<18,1,IF(D42=18,2,IF(D42>=20,3))))))","v":2},null,null,null,null,null,{"$f":"IF(B42>D42,A42&C42,IF(D42>B42,C42&A42,\"/\"))","v":"/"},null,{"$f":"A42&C42","v":"AAAD"},{"$f":"E42","v":2},{"$f":"C42&A42","v":"ADAA"},{"$f":"F42","v":2},{"$f":"B42","v":18},{"$f":"D42","v":18}]
["AF",10,"AG",{"$f":"IF(G43=19,19,IF(ISBLANK(B43),\"\",IF(B43=19,0,36-B43)))","v":26},{"$f":"IF(G43=19,0,IF(ISBLANK(B43),\"\",IF(B43<18,1,IF(B43=18,2,IF(B43>18,3)))))","v":1},{"$f":"IF(G43=19,3,IF(ISBLANK(B43),\"\",IF(B43=19,0,IF(D43<18,1,IF(D43=18,2,IF(D43>=20,3))))))","v":3},null,null,null,null,null,{"$f":"IF(B43>D43,A43&C43,IF(D43>B43,C43&A43,\"/\"))","v":"AGAF"},null,{"$f":"A43&C43","v":"AFAG"},{"$f":"E43","v":1},{"$f":"C43&A43","v":"AGAF"},{"$f":"F43","v":3},{"$f":"B43","v":10},{"$f":"D43","v":26}]
["AB",32,"AC",{"$f":"IF(G44=19,19,IF(ISBLANK(B44),\"\",IF(B44=19,0,36-B44)))","v":4},{"$f":"IF(G44=19,0,IF(ISBLANK(B44),\"\",IF(B44<18,1,IF(B44=18,2,IF(B44>18,3)))))","v":3},{"$f":"IF(G44=19,3,IF(ISBLANK(B44),\"\",IF(B44=19,0,IF(D44<18,1,IF(D44=18,2,IF(D44>=20,3))))))","v":1},null,null,null,null,null,{"$f":"IF(B44>D44,A44&C44,IF(D44>B44,C44&A44,\"/\"))","v":"ABAC"},null,{"$f":"A44&C44","v":"ABAC"},{"$f":"E44","v":3},{"$f":"C44&A44","v":"ACAB"},{"$f":"F44","v":1},{"$f":"B44","v":32},{"$f":"D44","v":4}]
["AE",20,"AH",{"$f":"IF(G45=19,19,IF(ISBLANK(B45),\"\",IF(B45=19,0,36-B45)))","v":16},{"$f":"IF(G45=19,0,IF(ISBLANK(B45),\"\",IF(B45<18,1,IF(B45=18,2,IF(B45>18,3)))))","v":3},{"$f":"IF(G45=19,3,IF(ISBLANK(B45),\"\",IF(B45=19,0,IF(D45<18,1,IF(D45=18,2,IF(D45>=20,3))))))","v":1},null,null,null,null,null,{"$f":"IF(B45>D45,A45&C45,IF(D45>B45,C45&A45,\"/\"))","v":"AEAH"},null,{"$f":"A45&C45","v":"AEAH"},{"$f":"E45","v":3},{"$f":"C45&A45","v":"AHAE"},{"$f":"F45","v":1},{"$f":"B45","v":20},{"$f":"D45","v":16}]
[]
["5 éme MATCH le ","à","AE"]
[null,null,null,null,null,null,"SI forfait éq recevante"]
["Equipes","score","Equipes","score","Points","Points"]
["AA",18,"AF",{"$f":"IF(G50=19,19,IF(ISBLANK(B50),\"\",IF(B50=19,0,36-B50)))","v":18},{"$f":"IF(G50=19,0,IF(ISBLANK(B50),\"\",IF(B50<18,1,IF(B50=18,2,IF(B50>18,3)))))","v":2},{"$f":"IF(G50=19,3,IF(ISBLANK(B50),\"\",IF(B50=19,0,IF(D50<18,1,IF(D50=18,2,IF(D50>=20,3))))))","v":2},null,null,null,null,null,{"$f":"IF(B50>D50,A50&C50,IF(D50>B50,C50&A50,\"/\"))","v":"/"},null,{"$f":"A50&C50","v":"AAAF"},{"$f":"E50","v":2},{"$f":"C50&A50","v":"AFAA"},{"$f":"F50","v":2},{"$f":"B50","v":18},{"$f":"D50","v":18}]
["AD",18,"AH",{"$f":"IF(G51=19,19,IF(ISBLANK(B51),\"\",IF(B51=19,0,36-B51)))","v":18},{"$f":"IF(G51=19,0,IF(ISBLANK(B51),\"\",IF(B51<18,1,IF(B51=18,2,IF(B51>18,3)))))","v":2},{"$f":"IF(G51=19,3,IF(ISBLANK(B51),\"\",IF(B51=19,0,IF(D51<18,1,IF(D51=18,2,IF(D51>=20,3))))))","v":2},null,null,null,null,null,{"$f":"IF(B51>D51,A51&C51,IF(D51>B51,C51&A51,\"/\"))","v":"/"},null,{"$f":"A51&C51","v":"ADAH"},{"$f":"E51","v":2},{"$f":"C51&A51","v":"AHAD"},{"$f":"F51","v":2},{"$f":"B51","v":18},{"$f":"D51","v":18}]
["AB",4,"AG",{"$f":"IF(G52=19,19,IF(ISBLANK(B52),\"\",IF(B52=19,0,36-B52)))","v":32},{"$f":"IF(G52=19,0,IF(ISBLANK(B52),\"\",IF(B52<18,1,IF(B52=18,2,IF(B52>18,3)))))","v":1},{"$f":"IF(G52=19,3,IF(ISBLANK(B52),\"\",IF(B52=19,0,IF(D52<18,1,IF(D52=18,2,IF(D52>=20,3))))))","v":3},null,null,null,null,null,{"$f":"IF(B52>D52,A52&C52,IF(D52>B52,C52&A52,\"/\"))","v":"AGAB"},null,{"$f":"A52&C52","v":"ABAG"},{"$f":"E52","v":1},{"$f":"C52&A52","v":"AGAB"},{"$f":"F52","v":3},{"$f":"B52","v":4},{"$f":"D52","v":32}]
["AC",20,"AE",{"$f":"IF(G53=19,19,IF(ISBLANK(B53),\"\",IF(B53=19,0,36-B53)))","v":16},{"$f":"IF(G53=19,0,IF(ISBLANK(B53),\"\",IF(B53<18,1,IF(B53=18,2,IF(B53>18,3)))))","v":3},{"$f":"IF(G53=19,3,IF(ISBLANK(B53),\"\",IF(B53=19,0,IF(D53<18,1,IF(D53=18,2,IF(D53>=20,3))))))","v":1},null,null,null,null,null,{"$f":"IF(B53>D53,A53&C53,IF(D53>B53,C53&A53,\"/\"))","v":"ACAE"},null,{"$f":"A53&C53","v":"ACAE"},{"$f":"E53","v":3},{"$f":"C53&A53","v":"AEAC"},{"$f":"F53","v":1},{"$f":"B53","v":20},{"$f":"D53","v":16}]
[]
["6 éme MATCH le ","à","AF"]
[null,null,null,null,null,null,"SI forfait éq recevante"]
["Equipes","score","Equipes","score","Points","Points"]
["AB",30,"AD",{"$f":"IF(G58=19,19,IF(ISBLANK(B58),\"\",IF(B58=19,0,36-B58)))","v":6},{"$f":"IF(G58=19,0,IF(ISBLANK(B58),\"\",IF(B58<18,1,IF(B58=18,2,IF(B58>18,3)))))","v":3},{"$f":"IF(G58=19,3,IF(ISBLANK(B58),\"\",IF(B58=19,0,IF(D58<18,1,IF(D58=18,2,IF(D58>=20,3))))))","v":1},null,null,null,null,null,{"$f":"IF(B58>D58,A58&C58,IF(D58>B58,C58&A58,\"/\"))","v":"ABAD"},null,{"$f":"A58&C58","v":"ABAD"},{"$f":"E58","v":3},{"$f":"C58&A58","v":"ADAB"},{"$f":"F58","v":1},{"$f":"B58","v":30},{"$f":"D58","v":6}]
["AE",24,"AA",{"$f":"IF(G59=19,19,IF(ISBLANK(B59),\"\",IF(B59=19,0,36-B59)))","v":12},{"$f":"IF(G59=19,0,IF(ISBLANK(B59),\"\",IF(B59<18,1,IF(B59=18,2,IF(B59>18,3)))))","v":3},{"$f":"IF(G59=19,3,IF(ISBLANK(B59),\"\",IF(B59=19,0,IF(D59<18,1,IF(D59=18,2,IF(D59>=20,3))))))","v":1},null,null,null,null,null,{"$f":"IF(B59>D59,A59&C59,IF(D59>B59,C59&A59,\"/\"))","v":"AEAA"},null,{"$f":"A59&C59","v":"AEAA"},{"$f":"E59","v":3},{"$f":"C59&A59","v":"AAAE"},{"$f":"F59","v":1},{"$f":"B59","v":24},{"$f":"D59","v":12}]
["AG",32,"AC",{"$f":"IF(G60=19,19,IF(ISBLANK(B60),\"\",IF(B60=19,0,36-B60)))","v":4},{"$f":"IF(G60=19,0,IF(ISBLANK(B60),\"\",IF(B60<18,1,IF(B60=18,2,IF(B60>18,3)))))","v":3},{"$f":"IF(G60=19,3,IF(ISBLANK(B60),\"\",IF(B60=19,0,IF(D60<18,1,IF(D60=18,2,IF(D60>=20,3))))))","v":1},null,null,null,null,null,{"$f":"IF(B60>D60,A60&C60,IF(D60>B60,C60&A60,\"/\"))","v":"AGAC"},null,{"$f":"A60&C60","v":"AGAC"},{"$f":"E60","v":3},{"$f":"C60&A60","v":"ACAG"},{"$f":"F60","v":1},{"$f":"B60","v":32},{"$f":"D60","v":4}]
["AF",22,"AH",{"$f":"IF(G61=19,19,IF(ISBLANK(B61),\"\",IF(B61=19,0,36-B61)))","v":14},{"$f":"IF(G61=19,0,IF(ISBLANK(B61),\"\",IF(B61<18,1,IF(B61=18,2,IF(B61>18,3)))))","v":3},{"$f":"IF(G61=19,3,IF(ISBLANK(B61),\"\",IF(B61=19,0,IF(D61<18,1,IF(D61=18,2,IF(D61>=20,3))))))","v":1},null,null,null,null,null,{"$f":"IF(B61>D61,A61&C61,IF(D61>B61,C61&A61,\"/\"))","v":"AFAH"},null,{"$f":"A61&C61","v":"AFAH"},{"$f":"E61","v":3},{"$f":"C61&A61","v":"AHAF"},{"$f":"F61","v":1},{"$f":"B61","v":22},{"$f":"D61","v":14}]
[]
["7 éme MATCH le","à","AG"]
[null,null,null,null,null,null,"SI forfait éq recevante",null," "]
["Equipes","score","Equipes","score","Points","Points"]
["AA",20,"AG",{"$f":"IF(G66=19,19,IF(ISBLANK(B66),\"\",IF(B66=19,0,36-B66)))","v":16},{"$f":"IF(G66=19,0,IF(ISBLANK(B66),\"\",IF(B66<18,1,IF(B66=18,2,IF(B66>18,3)))))","v":3},{"$f":"IF(G66=19,3,IF(ISBLANK(B66),\"\",IF(B66=19,0,IF(D66<18,1,IF(D66=18,2,IF(D66>=20,3))))))","v":1},null,null,null,null,null,{"$f":"IF(B66>D66,A66&C66,IF(D66>B66,C66&A66,\"/\"))","v":"AAAG"},null,{"$f":"A66&C66","v":"AAAG"},{"$f":"E66","v":3},{"$f":"C66&A66","v":"AGAA"},{"$f":"F66","v":1},{"$f":"B66","v":20},{"$f":"D66","v":16}]
["AB",12,"AF",{"$f":"IF(G67=19,19,IF(ISBLANK(B67),\"\",IF(B67=19,0,36-B67)))","v":24},{"$f":"IF(G67=19,0,IF(ISBLANK(B67),\"\",IF(B67<18,1,IF(B67=18,2,IF(B67>18,3)))))","v":1},{"$f":"IF(G67=19,3,IF(ISBLANK(B67),\"\",IF(B67=19,0,IF(D67<18,1,IF(D67=18,2,IF(D67>=20,3))))))","v":3},null,null,null,null,null,{"$f":"IF(B67>D67,A67&C67,IF(D67>B67,C67&A67,\"/\"))","v":"AFAB"},null,{"$f":"A67&C67","v":"ABAF"},{"$f":"E67","v":1},{"$f":"C67&A67","v":"AFAB"},{"$f":"F67","v":3},{"$f":"B67","v":12},{"$f":"D67","v":24}]
["AE",18,"AD",{"$f":"IF(G68=19,19,IF(ISBLANK(B68),\"\",IF(B68=19,0,36-B68)))","v":18},{"$f":"IF(G68=19,0,IF(ISBLANK(B68),\"\",IF(B68<18,1,IF(B68=18,2,IF(B68>18,3)))))","v":2},{"$f":"IF(G68=19,3,IF(ISBLANK(B68),\"\",IF(B68=19,0,IF(D68<18,1,IF(D68=18,2,IF(D68>=20,3))))))","v":2},null,null,null,null,null,{"$f":"IF(B68>D68,A68&C68,IF(D68>B68,C68&A68,\"/\"))","v":"/"},null,{"$f":"A68&C68","v":"AEAD"},{"$f":"E68","v":2},{"$f":"C68&A68","v":"ADAE"},{"$f":"F68","v":2},{"$f":"B68","v":18},{"$f":"D68","v":18}]
["AC",18,"AH",{"$f":"IF(G69=19,19,IF(ISBLANK(B69),\"\",IF(B69=19,0,36-B69)))","v":18},{"$f":"IF(G69=19,0,IF(ISBLANK(B69),\"\",IF(B69<18,1,IF(B69=18,2,IF(B69>18,3)))))","v":2},{"$f":"IF(G69=19,3,IF(ISBLANK(B69),\"\",IF(B69=19,0,IF(D69<18,1,IF(D69=18,2,IF(D69>=20,3))))))","v":2},null,null,null,null,null,{"$f":"IF(B69>D69,A69&C69,IF(D69>B69,C69&A69,\"/\"))","v":"/"},null,{"$f":"A69&C69","v":"ACAH"},{"$f":"E69","v":2},{"$f":"C69&A69","v":"AHAC"},{"$f":"F69","v":2},{"$f":"B69","v":18},{"$f":"D69","v":18}]
[null,null,"Si pas d'exaequo",null,null,null,"Classt        Final","Rencontres entre exaequos"]
["EQUIPES",null,"POINTS","POUR","CONTRE","DIFF",null,"POINTS Exaequos","Exaq","n°","AA","AB","AC","AD","AE","AF","AG","AH","Pts matchs",null,null,null,"1000000*Pts matchs +1000 (Diff +  abs(diff mini) )+Pour ","RANG","DIFF Exaequos","POUR Exaequos"]
["AG","1G",15,150,102,48,1,{"$f":"IF(S72>0,S72,\"\")","v":10},{"$f":"COUNTIF($C$72:$C$79,C72)","v":5},{"$f":"IF(AND(I72>1,COUNTIFS(I$72:I72,I72,C$72:C72,C72)=1),MAX(J$71:J71)+1,\"\")","v":1},{"$f":"IF($A72=K$71,\"\",IF(INDEX($C$72:$C$79,MATCH(K$71,$A$72:$A$79,0))=$C72,IFERROR(VLOOKUP($A72&K$71,$N$18:$O$69,2,0),  VLOOKUP(K$71&$A72,$N$18:$Q$69,4,0)),          \"\"))","v":""},3,3,"",1,3,"","",{"$f":"SUM(K72:R72)","v":10},null,null,null,{"$f":"IF(I72<3,S72*1000000+(F72+ABS(MIN($F$72:$F$79)))*1000+D72,S72*1000000+U96*1000+Z72)","v":10100098},{"$f":"IF(I72>2,RANK(W72,OFFSET(W$71,MATCH(I72,$I$72:$I$79,0),,I72)))","v":1},{"$f":"IF(S96=0,\"\",S96)","v":52},{"$f":"IF(S80=0,\"\",S80)","v":98}]
["AC","1C",15,114,138,-24,2,8,5,{"$f":"IF(AND(I73>1,COUNTIFS(I$72:I73,I73,C$72:C73,C73)=1),MAX(J$71:J72)+1,\"\")","v":""},"",1,"","",3,3,1,"",{"$f":"SUM(K73:R73)","v":8},null,null,null,{"$f":"IF(I73<3,S73*1000000+(F73+ABS(MIN($F$72:$F$79)))*1000+D73,S73*1000000+U97*1000+Z73)","v":8000048},{"$f":"IF(I73>2,RANK(W73,OFFSET(W$71,MATCH(I73,$I$72:$I$79,0),,I73)))","v":3},-48,48]
["AF","1F",15,128,124,4,3,8,5,{"$f":"IF(AND(I74>1,COUNTIFS(I$72:I74,I74,C$72:C74,C74)=1),MAX(J$71:J73)+1,\"\")","v":""},"",3,1,"",3,"",1,"",8,null,null,null,8044070,2,-4,70]
["AE","1E",15,140,112,28,4,7,5,{"$f":"IF(AND(I75>1,COUNTIFS(I$72:I75,I75,C$72:C75,C75)=1),MAX(J$71:J74)+1,\"\")","v":""},"",2,1,"","",1,3,"",7,null,null,null,7060078,4,12,78]
["AB","1B",15,134,118,16,5,7,5,{"$f":"IF(AND(I76>1,COUNTIFS(I$72:I76,I76,C$72:C76,C76)=1),MAX(J$71:J75)+1,\"\")","v":""},"","",3,"",2,1,1,"",7,null,null,null,7036066,5,-12,66]
["AA","1A",14,122,130,-8,6,"",1,{"$f":"IF(AND(I77>1,COUNTIFS(I$72:I77,I77,C$72:C77,C77)=1),MAX(J$71:J76)+1,\"\")","v":""},"","","","","","","","",0,null,null,null,40122,false,"",""]
["AD","1D",12,102,150,-48,7,"",1,{"$f":"IF(AND(I78>1,COUNTIFS(I$72:I78,I78,C$72:C78,C78)=1),MAX(J$71:J77)+1,\"\")","v":""},"","","","","","","","",0,null,null,null,102,false,"",""]
["AH","1H",11,118,134,-16,8,"",1,{"$f":"IF(AND(I79>1,COUNTIFS(I$72:I79,I79,C$72:C79,C79)=1),MAX(J$71:J78)+1,\"\")","v":""},"","","","","","","","",0,null,null,null,32118,false,"",""]
[null,null,null,null,null,null,null,null,"POUR",{"$f":"A72","v":"AG"},{"$f":"IF($A72=K$71,\"\",IF(INDEX($C$72:$C$79,MATCH(K$71,$A$72:$A$79,0))=$C72,IFERROR(VLOOKUP($A72&K$71,$N$18:$R$69,5,0),  VLOOKUP(K$71&$A72,$N$18:$S$69,6,0)),          \"\"))","v":""},32,32,"",8,26,"","",98]
[null,null,null,null,null,null,null,null,null,"AC","",4,"","",20,20,4,"",48]
[null,null,null,null,null,null,null,null,null,"AF","",24,16,"",20,"",10,"",70]
[null,null,null,null,null,null,null,null,null,"AE","",18,16,"","",16,28,"",78]
[null,null,null,null,null,null,null,null,null,"AB","","",32,"",18,12,4,"",66,null,null,null,null,null,"  "]
[null,null,null,null,null,null,null,null,null,"AA","","","","","","","","",0]
[null,null,null,null,null,null,null,null,null,"AD","","","","","","","","",0]
[null,null,null,null,null,null,null,null,null,"AH","","","","","","","","",0]
[null,null,null,null,null,null,null,null,"CONTRE",{"$f":"J80","v":"AG"},{"$f":"INDEX($K$80:$R$87,MATCH(K$71,$J$80:$J$87,0),MATCH($J80,$K$71:$R$71,0))","v":""},{"$f":"INDEX($K$80:$R$87,MATCH(L$71,$J$80:$J$87,0),MATCH($J80,$K$71:$R$71,0))","v":4},4,"",28,10,"","",46]
[null,null,null,null,null,null,null,null,null,{"$f":"J81","v":"AC"},{"$f":"INDEX($K$80:$R$87,MATCH(K$71,$J$80:$J$87,0),MATCH($J81,$K$71:$R$71,0))","v":""},32,"","",16,16,32,"",96]
[null,null,null,null,null,null,null,null,null,"AF","",12,20,"",16,"",26,"",74]
[null,null,null,null,null,null,null,null,null,"AE","",18,20,"","",20,8,"",66]
[null,null,null,null,null,null,null,null,null,"AB","","",4,"",18,24,32,"",78]
[null,null,null,null,null,null,null,null,null,"AA","","","","","","","","",0]
[null,null,null,null,null,null,null,null,null,"AD","","","","","","","","",0]
[null,null,null,null,null,null,null,null,null,"AH","","","","","","","","",0,null,"Diff pondérée"]
[null,null,null,null,null,null,null,null,"DIFF",{"$f":"J88","v":"AG"},null,null,null,null,null,null,null,null,{"$f":"S80-S88","v":52},null,{"$f":"S96+ABS(MIN($S$96:$S$103))","v":100}]
[null,null,null,null,null,null,null,null,null,{"$f":"J89","v":"AC"},null,null,null,null,null,null,null,null,{"$f":"S81-S89","v":-48},null,0]
[null,null,null,null,null,null,null,null,null,"AF",null,null,null,null,null,null,null,null,-4,null,44]
[null,null,null,null,null,null,null,null,null,"AE",null,null,null,null,null,null,null,null,12,null,60]
[null,null,null,null,null,null,null,null,null,"AB",null,null,null,null,null,null,null,null,-12,null,36]
[null,null,null,null,null,null,null,null,null,"AA",null,null,null,null,null,null,null,null,0,null,48]
[null,null,null,null,null,null,null,null,null,"AD",null,null,null,null,null,null,null,null,0,null,{"$f":"S102+ABS(MIN($S$96:$S$103))","v":48}]
[null,null,null,null,null,null,null,null,null,"AH",null,null,null,null,null,null,null,null,0,null,{"$f":"S103+ABS(MIN($S$96:$S$103))","v":48}]

{"sheet":"P12","index":11,"n_rows":103,"n_cols":26,"rows_kept":103,"cut":false,"hidden":false,"merged":[[0,0,0,5],[1,0,1,5],[2,0,2,5],[3,0,3,5],[3,8,3,10],[15,6,16,6],[69,2,69,5],[69,6,70,6],[69,7,69,25],[23,6,24,6],[31,6,32,6],[39,6,40,6],[47,6,48,6],[55,6,56,6],[63,6,64,6]]}
[null,null,null,null,null,null,3]
["CHAMPIONNAT DES CLUBS"]
[]
["POULE 1"]
["EQUIPES",null,"POINTS","Pour","Contre","Diff"]
["AA","1A",{"$f":"SUMIF($A$18:$A$69,A6,$E$18:$E$69)+SUMIF($C$18:$C$69,A6,$F$18:$F$69)","v":13},{"$f":"SUMIF($A$18:$A$69,$A6,$B$18:$B$69)+SUMIF($C$18:$C$69,$A6,$D$18:$D$69)","v":120},{"$f":"SUMIF($C$18:$C$69,$A6,$B$18:$B$69)+SUMIF($A$18:$A$69,$A6,$D$18:$D$69)","v":132},{"$f":"D6-E6","v":-12}]
["AB","1B",{"$f":"SUMIF($A$18:$A$69,A7,$E$18:$E$69)+SUMIF($C$18:$C$69,A7,$F$18:$F$69)","v":15},{"$f":"SUMIF($A$18:$A$69,$A7,$B$18:$B$69)+SUMIF($C$18:$C$69,$A7,$D$18:$D$69)","v":124},{"$f":"SUMIF($C$18:$C$69,$A7,$B$18:$B$69)+SUMIF($A$18:$A$69,$A7,$D$18:$D$69)","v":128},-4]
["AC","1C",{"$f":"SUMIF($A$18:$A$69,A8,$E$18:$E$69)+SUMIF($C$18:$C$69,A8,$F$18:$F$69)","v":15},114,138,-24]
["AD","1D",11,110,142,-32]
["AE","1E",15,140,112,28]
["AF","1F",15,128,124,4]
["AG","1G",17,154,98,{"$f":"D12-E12","v":56}]
["AH","1H",11,{"$f":"SUMIF($A$18:$A$69,$A13,$B$18:$B$69)+SUMIF($C$18:$C$69,$A13,$D$18:$D$69)","v":118},134,{"$f":"D13-E13","v":-16}]
[]
["1er MATCH le ","à","AA"]
[null,null,null,null,null,null,"SI forfait éq recevante"]
["Equipes","score","Equipes","score","Points","Points"]
["AA",16,"AB",{"$f":"IF(G18=19,19,IF(ISBLANK(B18),\"\",IF(B18=19,0,36-B18)))","v":20},{"$f":"IF(G18=19,0,IF(ISBLANK(B18),\"\",IF(B18<18,1,IF(B18=18,2,IF(B18>18,3)))))","v":1},{"$f":"IF(G18=19,3,IF(ISBLANK(B18),\"\",IF(B18=19,0,IF(D18<18,1,IF(D18=18,2,IF(D18>=20,3))))))","v":3},null,null,null,null,null,{"$f":"IF(B18>D18,A18&C18,IF(D18>B18,C18&A18,\"/\"))","v":"ABAA"},null,{"$f":"A18&C18","v":"AAAB"},{"$f":"E18","v":1},{"$f":"C18&A18","v":"ABAA"},{"$f":"F18","v":3},{"$f":"B18","v":16},{"$f":"D18","v":20}]
["AC",30,"AD",{"$f":"IF(G19=19,19,IF(ISBLANK(B19),\"\",IF(B19=19,0,36-B19)))","v":6},{"$f":"IF(G19=19,0,IF(ISBLANK(B19),\"\",IF(B19<18,1,IF(B19=18,2,IF(B19>18,3)))))","v":3},{"$f":"IF(G19=19,3,IF(ISBLANK(B19),\"\",IF(B19=19,0,IF(D19<18,1,IF(D19=18,2,IF(D19>=20,3))))))","v":1},null,null,null,null,null,{"$f":"IF(B19>D19,A19&C19,IF(D19>B19,C19&A19,\"/\"))","v":"ACAD"},null,{"$f":"A19&C19","v":"ACAD"},{"$f":"E19","v":3},{"$f":"C19&A19","v":"ADAC"},{"$f":"F19","v":1},{"$f":"B19","v":30},{"$f":"D19","v":6}]
["AE",16,"AF",{"$f":"IF(G20=19,19,IF(ISBLANK(B20),\"\",IF(B20=19,0,36-B20)))","v":20},{"$f":"IF(G20=19,0,IF(ISBLANK(B20),\"\",IF(B20<18,1,IF(B20=18,2,IF(B20>18,3)))))","v":1},{"$f":"IF(G20=19,3,IF(ISBLANK(B20),\"\",IF(B20=19,0,IF(D20<18,1,IF(D20=18,2,IF(D20>=20,3))))))","v":3},null,null,null,null,null,{"$f":"IF(B20>D20,A20&C20,IF(D20>B20,C20&A20,\"/\"))","v":"AFAE"},null,{"$f":"A20&C20","v":"AEAF"},{"$f":"E20","v":1},{"$f":"C20&A20","v":"AFAE"},{"$f":"F20","v":3},{"$f":"B20","v":16},{"$f":"D20","v":20}]
["AG",18,"AH",{"$f":"IF(G21=19,19,IF(ISBLANK(B21),\"\",IF(B21=19,0,36-B21)))","v":18},{"$f":"IF(G21=19,0,IF(ISBLANK(B21),\"\",IF(B21<18,1,IF(B21=18,2,IF(B21>18,3)))))","v":2},{"$f":"IF(G21=19,3,IF(ISBLANK(B21),\"\",IF(B21=19,0,IF(D21<18,1,IF(D21=18,2,IF(D21>=20,3))))))","v":2},null,null,null,null,null,{"$f":"IF(B21>D21,A21&C21,IF(D21>B21,C21&A21,\"/\"))","v":"/"},null,{"$f":"A21&C21","v":"AGAH"},{"$f":"E21","v":2},{"$f":"C21&A21","v":"AHAG"},{"$f":"F21","v":2},{"$f":"B21","v":18},{"$f":"D21","v":18}]
[]
["2 éme MATCH le ","à","AB"]
[null,null,null,null,null,null,"SI forfait éq recevante"]
["Equipes","score","Equipes","score","Points","Points"]
["AA",18,"AC",{"$f":"IF(G26=19,19,IF(ISBLANK(B26),\"\",IF(B26=19,0,36-B26)))","v":18},{"$f":"IF(G26=19,0,IF(ISBLANK(B26),\"\",IF(B26<18,1,IF(B26=18,2,IF(B26>18,3)))))","v":2},{"$f":"IF(G26=19,3,IF(ISBLANK(B26),\"\",IF(B26=19,0,IF(D26<18,1,IF(D26=18,2,IF(D26>=20,3))))))","v":2},null,null,null,null,null,{"$f":"IF(B26>D26,A26&C26,IF(D26>B26,C26&A26,\"/\"))","v":"/"},null,{"$f":"A26&C26","v":"AAAC"},{"$f":"E26","v":2},{"$f":"C26&A26","v":"ACAA"},{"$f":"F26","v":2},{"$f":"B26","v":18},{"$f":"D26","v":18}]
["AB",18,"AH",{"$f":"IF(G27=19,19,IF(ISBLANK(B27),\"\",IF(B27=19,0,36-B27)))","v":18},{"$f":"IF(G27=19,0,IF(ISBLANK(B27),\"\",IF(B27<18,1,IF(B27=18,2,IF(B27>18,3)))))","v":2},{"$f":"IF(G27=19,3,IF(ISBLANK(B27),\"\",IF(B27=19,0,IF(D27<18,1,IF(D27=18,2,IF(D27>=20,3))))))","v":2},null,null,null,null,null,{"$f":"IF(B27>D27,A27&C27,IF(D27>B27,C27&A27,\"/\"))","v":"/"},null,{"$f":"A27&C27","v":"ABAH"},{"$f":"E27","v":2},{"$f":"C27&A27","v":"AHAB"},{"$f":"F27","v":2},{"$f":"B27","v":18},{"$f":"D27","v":18}]
["AD",18,"AF",{"$f":"IF(G28=19,19,IF(ISBLANK(B28),\"\",IF(B28=19,0,36-B28)))","v":18},{"$f":"IF(G28=19,0,IF(ISBLANK(B28),\"\",IF(B28<18,1,IF(B28=18,2,IF(B28>18,3)))))","v":2},{"$f":"IF(G28=19,3,IF(ISBLANK(B28),\"\",IF(B28=19,0,IF(D28<18,1,IF(D28=18,2,IF(D28>=20,3))))))","v":2},null,null,null,null,null,{"$f":"IF(B28>D28,A28&C28,IF(D28>B28,C28&A28,\"/\"))","v":"/"},null,{"$f":"A28&C28","v":"ADAF"},{"$f":"E28","v":2},{"$f":"C28&A28","v":"AFAD"},{"$f":"F28","v":2},{"$f":"B28","v":18},{"$f":"D28","v":18}]
["AE",28,"AG",{"$f":"IF(G29=19,19,IF(ISBLANK(B29),\"\",IF(B29=19,0,36-B29)))","v":8},{"$f":"IF(G29=19,0,IF(ISBLANK(B29),\"\",IF(B29<18,1,IF(B29=18,2,IF(B29>18,3)))))","v":3},{"$f":"IF(G29=19,3,IF(ISBLANK(B29),\"\",IF(B29=19,0,IF(D29<18,1,IF(D29=18,2,IF(D29>=20,3))))))","v":1},null,null,null,null,null,{"$f":"IF(B29>D29,A29&C29,IF(D29>B29,C29&A29,\"/\"))","v":"AEAG"},null,{"$f":"A29&C29","v":"AEAG"},{"$f":"E29","v":3},{"$f":"C29&A29","v":"AGAE"},{"$f":"F29","v":1},{"$f":"B29","v":28},{"$f":"D29","v":8}]
[]
["3 éme MATCH le ","à","AC"]
[null,null,null,null,null,null,"SI forfait éq recevante"]
["Equipes","score","Equipes","score","Points","Points"]
["AA",20,"AH",{"$f":"IF(G34=19,19,IF(ISBLANK(B34),\"\",IF(B34=19,0,36-B34)))","v":16},{"$f":"IF(G34=19,0,IF(ISBLANK(B34),\"\",IF(B34<18,1,IF(B34=18,2,IF(B34>18,3)))))","v":3},{"$f":"IF(G34=19,3,IF(ISBLANK(B34),\"\",IF(B34=19,0,IF(D34<18,1,IF(D34=18,2,IF(D34>=20,3))))))","v":1},null,null,null,null,null,{"$f":"IF(B34>D34,A34&C34,IF(D34>B34,C34&A34,\"/\"))","v":"AAAH"},null,{"$f":"A34&C34","v":"AAAH"},{"$f":"E34","v":3},{"$f":"C34&A34","v":"AHAA"},{"$f":"F34","v":1},{"$f":"B34","v":20},{"$f":"D34","v":16}]
["AB",20,"AE",{"$f":"IF(G35=19,19,IF(ISBLANK(B35),\"\",IF(B35=19,0,36-B35)))","v":16},{"$f":"IF(G35=19,0,IF(ISBLANK(B35),\"\",IF(B35<18,1,IF(B35=18,2,IF(B35>18,3)))))","v":3},{"$f":"IF(G35=19,3,IF(ISBLANK(B35),\"\",IF(B35=19,0,IF(D35<18,1,IF(D35=18,2,IF(D35>=20,3))))))","v":1},null,null,null,null,null,{"$f":"IF(B35>D35,A35&C35,IF(D35>B35,C35&A35,\"/\"))","v":"ABAE"},null,{"$f":"A35&C35","v":"ABAE"},{"$f":"E35","v":3},{"$f":"C35&A35","v":"AEAB"},{"$f":"F35","v":1},{"$f":"B35","v":20},{"$f":"D35","v":16}]
["AC",20,"AF",{"$f":"IF(G36=19,19,IF(ISBLANK(B36),\"\",IF(B36=19,0,36-B36)))","v":16},{"$f":"IF(G36=19,0,IF(ISBLANK(B36),\"\",IF(B36<18,1,IF(B36=18,2,IF(B36>18,3)))))","v":3},{"$f":"IF(G36=19,3,IF(ISBLANK(B36),\"\",IF(B36=19,0,IF(D36<18,1,IF(D36=18,2,IF(D36>=20,3))))))","v":1},null,null,null,null,null,{"$f":"IF(B36>D36,A36&C36,IF(D36>B36,C36&A36,\"/\"))","v":"ACAF"},null,{"$f":"A36&C36","v":"ACAF"},{"$f":"E36","v":3},{"$f":"C36&A36","v":"AFAC"},{"$f":"F36","v":1},{"$f":"B36","v":20},{"$f":"D36","v":16}]
["AD",18,"AG",{"$f":"IF(G37=19,19,IF(ISBLANK(B37),\"\",IF(B37=19,0,36-B37)))","v":18},{"$f":"IF(G37=19,0,IF(ISBLANK(B37),\"\",IF(B37<18,1,IF(B37=18,2,IF(B37>18,3)))))","v":2},{"$f":"IF(G37=19,3,IF(ISBLANK(B37),\"\",IF(B37=19,0,IF(D37<18,1,IF(D37=18,2,IF(D37>=20,3))))))","v":2},null,null,null,null,null,{"$f":"IF(B37>D37,A37&C37,IF(D37>B37,C37&A37,\"/\"))","v":"/"},null,{"$f":"A37&C37","v":"ADAG"},{"$f":"E37","v":2},{"$f":"C37&A37","v":"AGAD"},{"$f":"F37","v":2},{"$f":"B37","v":18},{"$f":"D37","v":18}]
[]
["4 éme MATCH le ","à","AD"]
[null,null,null,null,null,null,"SI forfait éq recevante"]
["Equipes","score","Equipes","score","Points","Points"]
["AA",20,"AD",{"$f":"IF(G42=19,19,IF(ISBLANK(B42),\"\",IF(B42=19,0,36-B42)))","v":16},{"$f":"IF(G42=19,0,IF(ISBLANK(B42),\"\",IF(B42<18,1,IF(B42=18,2,IF(B42>18,3)))))","v":3},{"$f":"IF(G42=19,3,IF(ISBLANK(B42),\"\",IF(B42=19,0,IF(D42<18,1,IF(D42=18,2,IF(D42>=20,3))))))","v":1},null,null,null,null,null,{"$f":"IF(B42>D42,A42&C42,IF(D42>B42,C42&A42,\"/\"))","v":"AAAD"},null,{"$f":"A42&C42","v":"AAAD"},{"$f":"E42","v":3},{"$f":"C42&A42","v":"ADAA"},{"$f":"F42","v":1},{"$f":"B42","v":20},{"$f":"D42","v":16}]
["AF",10,"AG",{"$f":"IF(G43=19,19,IF(ISBLANK(B43),\"\",IF(B43=19,0,36-B43)))","v":26},{"$f":"IF(G43=19,0,IF(ISBLANK(B43),\"\",IF(B43<18,1,IF(B43=18,2,IF(B43>18,3)))))","v":1},{"$f":"IF(G43=19,3,IF(ISBLANK(B43),\"\",IF(B43=19,0,IF(D43<18,1,IF(D43=18,2,IF(D43>=20,3))))))","v":3},null,null,null,null,null,{"$f":"IF(B43>D43,A43&C43,IF(D43>B43,C43&A43,\"/\"))","v":"AGAF"},null,{"$f":"A43&C43","v":"AFAG"},{"$f":"E43","v":1},{"$f":"C43&A43","v":"AGAF"},{"$f":"F43","v":3},{"$f":"B43","v":10},{"$f":"D43","v":26}]
["AB",32,"AC",{"$f":"IF(G44=19,19,IF(ISBLANK(B44),\"\",IF(B44=19,0,36-B44)))","v":4},{"$f":"IF(G44=19,0,IF(ISBLANK(B44),\"\",IF(B44<18,1,IF(B44=18,2,IF(B44>18,3)))))","v":3},{"$f":"IF(G44=19,3,IF(ISBLANK(B44),\"\",IF(B44=19,0,IF(D44<18,1,IF(D44=18,2,IF(D44>=20,3))))))","v":1},null,null,null,null,null,{"$f":"IF(B44>D44,A44&C44,IF(D44>B44,C44&A44,\"/\"))","v":"ABAC"},null,{"$f":"A44&C44","v":"ABAC"},{"$f":"E44","v":3},{"$f":"C44&A44","v":"ACAB"},{"$f":"F44","v":1},{"$f":"B44","v":32},{"$f":"D44","v":4}]
["AE",20,"AH",{"$f":"IF(G45=19,19,IF(ISBLANK(B45),\"\",IF(B45=19,0,36-B45)))","v":16},{"$f":"IF(G45=19,0,IF(ISBLANK(B45),\"\",IF(B45<18,1,IF(B45=18,2,IF(B45>18,3)))))","v":3},{"$f":"IF(G45=19,3,IF(ISBLANK(B45),\"\",IF(B45=19,0,IF(D45<18,1,IF(D45=18,2,IF(D45>=20,3))))))","v":1},null,null,null,null,null,{"$f":"IF(B45>D45,A45&C45,IF(D45>B45,C45&A45,\"/\"))","v":"AEAH"},null,{"$f":"A45&C45","v":"AEAH"},{"$f":"E45","v":3},{"$f":"C45&A45","v":"AHAE"},{"$f":"F45","v":1},{"$f":"B45","v":20},{"$f":"D45","v":16}]
[]
["5 éme MATCH le ","à","AE"]
[null,null,null,null,null,null,"SI forfait éq recevante"]
["Equipes","score","Equipes","score","Points","Points"]
["AA",18,"AF",{"$f":"IF(G50=19,19,IF(ISBLANK(B50),\"\",IF(B50=19,0,36-B50)))","v":18},{"$f":"IF(G50=19,0,IF(ISBLANK(B50),\"\",IF(B50<18,1,IF(B50=18,2,IF(B50>18,3)))))","v":2},{"$f":"IF(G50=19,3,IF(ISBLANK(B50),\"\",IF(B50=19,0,IF(D50<18,1,IF(D50=18,2,IF(D50>=20,3))))))","v":2},null,null,null,null,null,{"$f":"IF(B50>D50,A50&C50,IF(D50>B50,C50&A50,\"/\"))","v":"/"},null,{"$f":"A50&C50","v":"AAAF"},{"$f":"E50","v":2},{"$f":"C50&A50","v":"AFAA"},{"$f":"F50","v":2},{"$f":"B50","v":18},{"$f":"D50","v":18}]
["AD",18,"AH",{"$f":"IF(G51=19,19,IF(ISBLANK(B51),\"\",IF(B51=19,0,36-B51)))","v":18},{"$f":"IF(G51=19,0,IF(ISBLANK(B51),\"\",IF(B51<18,1,IF(B51=18,2,IF(B51>18,3)))))","v":2},{"$f":"IF(G51=19,3,IF(ISBLANK(B51),\"\",IF(B51=19,0,IF(D51<18,1,IF(D51=18,2,IF(D51>=20,3))))))","v":2},null,null,null,null,null,{"$f":"IF(B51>D51,A51&C51,IF(D51>B51,C51&A51,\"/\"))","v":"/"},null,{"$f":"A51&C51","v":"ADAH"},{"$f":"E51","v":2},{"$f":"C51&A51","v":"AHAD"},{"$f":"F51","v":2},{"$f":"B51","v":18},{"$f":"D51","v":18}]
["AB",4,"AG",{"$f":"IF(G52=19,19,IF(ISBLANK(B52),\"\",IF(B52=19,0,36-B52)))","v":32},{"$f":"IF(G52=19,0,IF(ISBLANK(B52),\"\",IF(B52<18,1,IF(B52=18,2,IF(B52>18,3)))))","v":1},{"$f":"IF(G52=19,3,IF(ISBLANK(B52),\"\",IF(B52=19,0,IF(D52<18,1,IF(D52=18,2,IF(D52>=20,3))))))","v":3},null,null,null,null,null,{"$f":"IF(B52>D52,A52&C52,IF(D52>B52,C52&A52,\"/\"))","v":"AGAB"},null,{"$f":"A52&C52","v":"ABAG"},{"$f":"E52","v":1},{"$f":"C52&A52","v":"AGAB"},{"$f":"F52","v":3},{"$f":"B52","v":4},{"$f":"D52","v":32}]
["AC",20,"AE",{"$f":"IF(G53=19,19,IF(ISBLANK(B53),\"\",IF(B53=19,0,36-B53)))","v":16},{"$f":"IF(G53=19,0,IF(ISBLANK(B53),\"\",IF(B53<18,1,IF(B53=18,2,IF(B53>18,3)))))","v":3},{"$f":"IF(G53=19,3,IF(ISBLANK(B53),\"\",IF(B53=19,0,IF(D53<18,1,IF(D53=18,2,IF(D53>=20,3))))))","v":1},null,null,null,null,null,{"$f":"IF(B53>D53,A53&C53,IF(D53>B53,C53&A53,\"/\"))","v":"ACAE"},null,{"$f":"A53&C53","v":"ACAE"},{"$f":"E53","v":3},{"$f":"C53&A53","v":"AEAC"},{"$f":"F53","v":1},{"$f":"B53","v":20},{"$f":"D53","v":16}]
[]
["6 éme MATCH le ","à","AF"]
[null,null,null,null,null,null,"SI forfait éq recevante"]
["Equipes","score","Equipes","score","Points","Points"]
["AB",18,"AD",{"$f":"IF(G58=19,19,IF(ISBLANK(B58),\"\",IF(B58=19,0,36-B58)))","v":18},{"$f":"IF(G58=19,0,IF(ISBLANK(B58),\"\",IF(B58<18,1,IF(B58=18,2,IF(B58>18,3)))))","v":2},{"$f":"IF(G58=19,3,IF(ISBLANK(B58),\"\",IF(B58=19,0,IF(D58<18,1,IF(D58=18,2,IF(D58>=20,3))))))","v":2},null,null,null,null,null,{"$f":"IF(B58>D58,A58&C58,IF(D58>B58,C58&A58,\"/\"))","v":"/"},null,{"$f":"A58&C58","v":"ABAD"},{"$f":"E58","v":2},{"$f":"C58&A58","v":"ADAB"},{"$f":"F58","v":2},{"$f":"B58","v":18},{"$f":"D58","v":18}]
["AE",24,"AA",{"$f":"IF(G59=19,19,IF(ISBLANK(B59),\"\",IF(B59=19,0,36-B59)))","v":12},{"$f":"IF(G59=19,0,IF(ISBLANK(B59),\"\",IF(B59<18,1,IF(B59=18,2,IF(B59>18,3)))))","v":3},{"$f":"IF(G59=19,3,IF(ISBLANK(B59),\"\",IF(B59=19,0,IF(D59<18,1,IF(D59=18,2,IF(D59>=20,3))))))","v":1},null,null,null,null,null,{"$f":"IF(B59>D59,A59&C59,IF(D59>B59,C59&A59,\"/\"))","v":"AEAA"},null,{"$f":"A59&C59","v":"AEAA"},{"$f":"E59","v":3},{"$f":"C59&A59","v":"AAAE"},{"$f":"F59","v":1},{"$f":"B59","v":24},{"$f":"D59","v":12}]
["AG",32,"AC",{"$f":"IF(G60=19,19,IF(ISBLANK(B60),\"\",IF(B60=19,0,36-B60)))","v":4},{"$f":"IF(G60=19,0,IF(ISBLANK(B60),\"\",IF(B60<18,1,IF(B60=18,2,IF(B60>18,3)))))","v":3},{"$f":"IF(G60=19,3,IF(ISBLANK(B60),\"\",IF(B60=19,0,IF(D60<18,1,IF(D60=18,2,IF(D60>=20,3))))))","v":1},null,null,null,null,null,{"$f":"IF(B60>D60,A60&C60,IF(D60>B60,C60&A60,\"/\"))","v":"AGAC"},null,{"$f":"A60&C60","v":"AGAC"},{"$f":"E60","v":3},{"$f":"C60&A60","v":"ACAG"},{"$f":"F60","v":1},{"$f":"B60","v":32},{"$f":"D60","v":4}]
["AF",22,"AH",{"$f":"IF(G61=19,19,IF(ISBLANK(B61),\"\",IF(B61=19,0,36-B61)))","v":14},{"$f":"IF(G61=19,0,IF(ISBLANK(B61),\"\",IF(B61<18,1,IF(B61=18,2,IF(B61>18,3)))))","v":3},{"$f":"IF(G61=19,3,IF(ISBLANK(B61),\"\",IF(B61=19,0,IF(D61<18,1,IF(D61=18,2,IF(D61>=20,3))))))","v":1},null,null,null,null,null,{"$f":"IF(B61>D61,A61&C61,IF(D61>B61,C61&A61,\"/\"))","v":"AFAH"},null,{"$f":"A61&C61","v":"AFAH"},{"$f":"E61","v":3},{"$f":"C61&A61","v":"AHAF"},{"$f":"F61","v":1},{"$f":"B61","v":22},{"$f":"D61","v":14}]
[]
["7 éme MATCH le","à","AG"]
[null,null,null,null,null,null,"SI forfait éq recevante",null," "]
["Equipes","score","Equipes","score","Points","Points"]
["AA",16,"AG",{"$f":"IF(G66=19,19,IF(ISBLANK(B66),\"\",IF(B66=19,0,36-B66)))","v":20},{"$f":"IF(G66=19,0,IF(ISBLANK(B66),\"\",IF(B66<18,1,IF(B66=18,2,IF(B66>18,3)))))","v":1},{"$f":"IF(G66=19,3,IF(ISBLANK(B66),\"\",IF(B66=19,0,IF(D66<18,1,IF(D66=18,2,IF(D66>=20,3))))))","v":3},null,null,null,null,null,{"$f":"IF(B66>D66,A66&C66,IF(D66>B66,C66&A66,\"/\"))","v":"AGAA"},null,{"$f":"A66&C66","v":"AAAG"},{"$f":"E66","v":1},{"$f":"C66&A66","v":"AGAA"},{"$f":"F66","v":3},{"$f":"B66","v":16},{"$f":"D66","v":20}]
["AB",12,"AF",{"$f":"IF(G67=19,19,IF(ISBLANK(B67),\"\",IF(B67=19,0,36-B67)))","v":24},{"$f":"IF(G67=19,0,IF(ISBLANK(B67),\"\",IF(B67<18,1,IF(B67=18,2,IF(B67>18,3)))))","v":1},{"$f":"IF(G67=19,3,IF(ISBLANK(B67),\"\",IF(B67=19,0,IF(D67<18,1,IF(D67=18,2,IF(D67>=20,3))))))","v":3},null,null,null,null,null,{"$f":"IF(B67>D67,A67&C67,IF(D67>B67,C67&A67,\"/\"))","v":"AFAB"},null,{"$f":"A67&C67","v":"ABAF"},{"$f":"E67","v":1},{"$f":"C67&A67","v":"AFAB"},{"$f":"F67","v":3},{"$f":"B67","v":12},{"$f":"D67","v":24}]
["AE",20,"AD",{"$f":"IF(G68=19,19,IF(ISBLANK(B68),\"\",IF(B68=19,0,36-B68)))","v":16},{"$f":"IF(G68=19,0,IF(ISBLANK(B68),\"\",IF(B68<18,1,IF(B68=18,2,IF(B68>18,3)))))","v":3},{"$f":"IF(G68=19,3,IF(ISBLANK(B68),\"\",IF(B68=19,0,IF(D68<18,1,IF(D68=18,2,IF(D68>=20,3))))))","v":1},null,null,null,null,null,{"$f":"IF(B68>D68,A68&C68,IF(D68>B68,C68&A68,\"/\"))","v":"AEAD"},null,{"$f":"A68&C68","v":"AEAD"},{"$f":"E68","v":3},{"$f":"C68&A68","v":"ADAE"},{"$f":"F68","v":1},{"$f":"B68","v":20},{"$f":"D68","v":16}]
["AC",18,"AH",{"$f":"IF(G69=19,19,IF(ISBLANK(B69),\"\",IF(B69=19,0,36-B69)))","v":18},{"$f":"IF(G69=19,0,IF(ISBLANK(B69),\"\",IF(B69<18,1,IF(B69=18,2,IF(B69>18,3)))))","v":2},{"$f":"IF(G69=19,3,IF(ISBLANK(B69),\"\",IF(B69=19,0,IF(D69<18,1,IF(D69=18,2,IF(D69>=20,3))))))","v":2},null,null,null,null,null,{"$f":"IF(B69>D69,A69&C69,IF(D69>B69,C69&A69,\"/\"))","v":"/"},null,{"$f":"A69&C69","v":"ACAH"},{"$f":"E69","v":2},{"$f":"C69&A69","v":"AHAC"},{"$f":"F69","v":2},{"$f":"B69","v":18},{"$f":"D69","v":18}]
[null,null,"Si pas d'exaequo",null,null,null,"Classt        Final","Rencontres entre exaequos"]
["EQUIPES",null,"POINTS","POUR","CONTRE","DIFF",null,"POINTS Exaequos","Exaq","n°","AA","AB","AC","AD","AE","AF","AG","AH","Pts matchs",null,null,null,"1000000*Pts matchs +1000 (Diff +  abs(diff mini) )+Pour ","RANG","DIFF Exaequos","POUR Exaequos"]
["AG","1G",17,154,98,56,1,{"$f":"IF(S72>0,S72,\"\")","v":""},{"$f":"COUNTIF($C$72:$C$79,C72)","v":1},{"$f":"IF(AND(I72>1,COUNTIFS(I$72:I72,I72,C$72:C72,C72)=1),MAX(J$71:J71)+1,\"\")","v":""},{"$f":"IF($A72=K$71,\"\",IF(INDEX($C$72:$C$79,MATCH(K$71,$A$72:$A$79,0))=$C72,IFERROR(VLOOKUP($A72&K$71,$N$18:$O$69,2,0),  VLOOKUP(K$71&$A72,$N$18:$Q$69,4,0)),          \"\"))","v":""},"","","","","","","",{"$f":"SUM(K72:R72)","v":0},null,null,null,{"$f":"IF(I72<3,S72*1000000+(F72+ABS(MIN($F$72:$F$79)))*1000+D72,S72*1000000+U96*1000+Z72)","v":88154},{"$f":"IF(I72>2,RANK(W72,OFFSET(W$71,MATCH(I72,$I$72:$I$79,0),,I72)))","v":false},{"$f":"IF(S96=0,\"\",S96)","v":""},{"$f":"IF(S80=0,\"\",S80)","v":""}]
["AB","1B",15,124,128,-4,2,7,4,{"$f":"IF(AND(I73>1,COUNTIFS(I$72:I73,I73,C$72:C73,C73)=1),MAX(J$71:J72)+1,\"\")","v":1},"","",3,"",3,1,"","",{"$f":"SUM(K73:R73)","v":7},null,null,null,{"$f":"IF(I73<3,S73*1000000+(F73+ABS(MIN($F$72:$F$79)))*1000+D73,S73*1000000+U97*1000+Z73)","v":7040064},{"$f":"IF(I73>2,RANK(W73,OFFSET(W$71,MATCH(I73,$I$72:$I$79,0),,I73)))","v":1},20,64]
["AF","1F",15,128,124,4,3,7,4,{"$f":"IF(AND(I74>1,COUNTIFS(I$72:I74,I74,C$72:C74,C74)=1),MAX(J$71:J73)+1,\"\")","v":""},"",3,1,"",3,"","","",7,null,null,null,7032060,2,12,60]
["AC","1C",15,114,138,-24,4,7,4,{"$f":"IF(AND(I75>1,COUNTIFS(I$72:I75,I75,C$72:C75,C75)=1),MAX(J$71:J74)+1,\"\")","v":""},"",1,"","",3,3,"","",7,null,null,null,7000044,3,-20,44]
["AE","1E",15,140,112,28,5,3,4,{"$f":"IF(AND(I76>1,COUNTIFS(I$72:I76,I76,C$72:C76,C76)=1),MAX(J$71:J75)+1,\"\")","v":""},"",1,1,"","",1,"","",3,null,null,null,3008048,4,-12,48]
["AA","1A",13,120,132,-12,6,"",1,{"$f":"IF(AND(I77>1,COUNTIFS(I$72:I77,I77,C$72:C77,C77)=1),MAX(J$71:J76)+1,\"\")","v":""},"","","","","","","","",0,null,null,null,20120,false,"",""]
["AD","1D",11,110,142,-32,7,2,2,{"$f":"IF(AND(I78>1,COUNTIFS(I$72:I78,I78,C$72:C78,C78)=1),MAX(J$71:J77)+1,\"\")","v":2},"","","","","","","",2,2,null,null,null,2000110,false,"",18]
["AH","1H",11,118,134,-16,8,2,2,{"$f":"IF(AND(I79>1,COUNTIFS(I$72:I79,I79,C$72:C79,C79)=1),MAX(J$71:J78)+1,\"\")","v":""},"","","",2,"","","","",2,null,null,null,2016118,false,"",18]
[null,null,null,null,null,null,null,null,"POUR",{"$f":"A72","v":"AG"},{"$f":"IF($A72=K$71,\"\",IF(INDEX($C$72:$C$79,MATCH(K$71,$A$72:$A$79,0))=$C72,IFERROR(VLOOKUP($A72&K$71,$N$18:$R$69,5,0),  VLOOKUP(K$71&$A72,$N$18:$S$69,6,0)),          \"\"))","v":""},"","","","","","","",0]
[null,null,null,null,null,null,null,null,null,"AB","","",32,"",20,12,"","",64]
[null,null,null,null,null,null,null,null,null,"AF","",24,16,"",20,"","","",60]
[null,null,null,null,null,null,null,null,null,"AC","",4,"","",20,20,"","",44]
[null,null,null,null,null,null,null,null,null,"AE","",16,16,"","",16,"","",48,null,null,null,null,null,"  "]
[null,null,null,null,null,null,null,null,null,"AA","","","","","","","","",0]
[null,null,null,null,null,null,null,null,null,"AD","","","","","","","",18,18]
[null,null,null,null,null,null,null,null,null,"AH","","","",18,"","","","",18]
[null,null,null,null,null,null,null,null,"CONTRE",{"$f":"J80","v":"AG"},{"$f":"INDEX($K$80:$R$87,MATCH(K$71,$J$80:$J$87,0),MATCH($J80,$K$71:$R$71,0))","v":""},{"$f":"INDEX($K$80:$R$87,MATCH(L$71,$J$80:$J$87,0),MATCH($J80,$K$71:$R$71,0))","v":""},"","","","","","",0]
[null,null,null,null,null,null,null,null,null,{"$f":"J81","v":"AB"},{"$f":"INDEX($K$80:$R$87,MATCH(K$71,$J$80:$J$87,0),MATCH($J81,$K$71:$R$71,0))","v":""},"",4,"",16,24,"","",44]
[null,null,null,null,null,null,null,null,null,"AF","",12,20,"",16,"","","",48]
[null,null,null,null,null,null,null,null,null,"AC","",32,"","",16,16,"","",64]
[null,null,null,null,null,null,null,null,null,"AE","",20,20,"","",20,"","",60]
[null,null,null,null,null,null,null,null,null,"AA","","","","","","","","",0]
[null,null,null,null,null,null,null,null,null,"AD","","","","","","","",18,18]
[null,null,null,null,null,null,null,null,null,"AH","","","",18,"","","","",18,null,"Diff pondérée"]
[null,null,null,null,null,null,null,null,"DIFF",{"$f":"J88","v":"AG"},null,null,null,null,null,null,null,null,{"$f":"S80-S88","v":0},null,{"$f":"S96+ABS(MIN($S$96:$S$103))","v":20}]
[null,null,null,null,null,null,null,null,null,{"$f":"J89","v":"AB"},null,null,null,null,null,null,null,null,{"$f":"S81-S89","v":20},null,40]
[null,null,null,null,null,null,null,null,null,"AF",null,null,null,null,null,null,null,null,12,null,32]
[null,null,null,null,null,null,null,null,null,"AC",null,null,null,null,null,null,null,null,-20,null,0]
[null,null,null,null,null,null,null,null,null,"AE",null,null,null,null,null,null,null,null,-12,null,8]
[null,null,null,null,null,null,null,null,null,"AA",null,null,null,null,null,null,null,null,0,null,20]
[null,null,null,null,null,null,null,null,null,"AD",null,null,null,null,null,null,null,null,0,null,{"$f":"S102+ABS(MIN($S$96:$S$103))","v":20}]
[null,null,null,null,null,null,null,null,null,"AH",null,null,null,null,null,null,null,null,0,null,{"$f":"S103+ABS(MIN($S$96:$S$103))","v":20}]

{"sheet":"P13","index":12,"n_rows":103,"n_cols":26,"rows_kept":103,"cut":false,"hidden":false,"merged":[[0,0,0,5],[1,0,1,5],[2,0,2,5],[3,0,3,5],[3,8,3,10],[15,6,16,6],[69,2,69,5],[69,6,70,6],[69,7,69,25],[23,6,24,6],[31,6,32,6],[39,6,40,6],[47,6,48,6],[55,6,56,6],[63,6,64,6]]}
[null,null,null,null,null,null,3]
["CHAMPIONNAT DES CLUBS"]
[]
["POULE 1"]
["EQUIPES",null,"POINTS","Pour","Contre","Diff"]
["AA","1A",{"$f":"SUMIF($A$18:$A$69,A6,$E$18:$E$69)+SUMIF($C$18:$C$69,A6,$F$18:$F$69)","v":15},{"$f":"SUMIF($A$18:$A$69,$A6,$B$18:$B$69)+SUMIF($C$18:$C$69,$A6,$D$18:$D$69)","v":124},{"$f":"SUMIF($C$18:$C$69,$A6,$B$18:$B$69)+SUMIF($A$18:$A$69,$A6,$D$18:$D$69)","v":128},{"$f":"D6-E6","v":-4}]
["AB","1B",{"$f":"SUMIF($A$18:$A$69,A7,$E$18:$E$69)+SUMIF($C$18:$C$69,A7,$F$18:$F$69)","v":15},{"$f":"SUMIF($A$18:$A$69,$A7,$B$18:$B$69)+SUMIF($C$18:$C$69,$A7,$D$18:$D$69)","v":134},{"$f":"SUMIF($C$18:$C$69,$A7,$B$18:$B$69)+SUMIF($A$18:$A$69,$A7,$D$18:$D$69)","v":118},16]
["AC","1C",{"$f":"SUMIF($A$18:$A$69,A8,$E$18:$E$69)+SUMIF($C$18:$C$69,A8,$F$18:$F$69)","v":13},114,139,-25]
["AD","1D",11,100,152,-52]
["AE","1E",15,140,112,28]
["AF","1F",15,128,124,4]
["AG","1G",15,150,102,{"$f":"D12-E12","v":48}]
["AH","1H",12,{"$f":"SUMIF($A$18:$A$69,$A13,$B$18:$B$69)+SUMIF($C$18:$C$69,$A13,$D$18:$D$69)","v":119},134,{"$f":"D13-E13","v":-15}]
[]
["1er MATCH le ","à","AA"]
[null,null,null,null,null,null,"SI forfait éq recevante"]
["Equipes","score","Equipes","score","Points","Points"]
["AA",16,"AB",{"$f":"IF(G18=19,19,IF(ISBLANK(B18),\"\",IF(B18=19,0,36-B18)))","v":20},{"$f":"IF(G18=19,0,IF(ISBLANK(B18),\"\",IF(B18<18,1,IF(B18=18,2,IF(B18>18,3)))))","v":1},{"$f":"IF(G18=19,3,IF(ISBLANK(B18),\"\",IF(B18=19,0,IF(D18<18,1,IF(D18=18,2,IF(D18>=20,3))))))","v":3},null,null,null,null,null,{"$f":"IF(B18>D18,A18&C18,IF(D18>B18,C18&A18,\"/\"))","v":"ABAA"},null,{"$f":"A18&C18","v":"AAAB"},{"$f":"E18","v":1},{"$f":"C18&A18","v":"ABAA"},{"$f":"F18","v":3},{"$f":"B18","v":16},{"$f":"D18","v":20}]
["AC",30,"AD",{"$f":"IF(G19=19,19,IF(ISBLANK(B19),\"\",IF(B19=19,0,36-B19)))","v":6},{"$f":"IF(G19=19,0,IF(ISBLANK(B19),\"\",IF(B19<18,1,IF(B19=18,2,IF(B19>18,3)))))","v":3},{"$f":"IF(G19=19,3,IF(ISBLANK(B19),\"\",IF(B19=19,0,IF(D19<18,1,IF(D19=18,2,IF(D19>=20,3))))))","v":1},null,null,null,null,null,{"$f":"IF(B19>D19,A19&C19,IF(D19>B19,C19&A19,\"/\"))","v":"ACAD"},null,{"$f":"A19&C19","v":"ACAD"},{"$f":"E19","v":3},{"$f":"C19&A19","v":"ADAC"},{"$f":"F19","v":1},{"$f":"B19","v":30},{"$f":"D19","v":6}]
["AE",16,"AF",{"$f":"IF(G20=19,19,IF(ISBLANK(B20),\"\",IF(B20=19,0,36-B20)))","v":20},{"$f":"IF(G20=19,0,IF(ISBLANK(B20),\"\",IF(B20<18,1,IF(B20=18,2,IF(B20>18,3)))))","v":1},{"$f":"IF(G20=19,3,IF(ISBLANK(B20),\"\",IF(B20=19,0,IF(D20<18,1,IF(D20=18,2,IF(D20>=20,3))))))","v":3},null,null,null,null,null,{"$f":"IF(B20>D20,A20&C20,IF(D20>B20,C20&A20,\"/\"))","v":"AFAE"},null,{"$f":"A20&C20","v":"AEAF"},{"$f":"E20","v":1},{"$f":"C20&A20","v":"AFAE"},{"$f":"F20","v":3},{"$f":"B20","v":16},{"$f":"D20","v":20}]
["AG",18,"AH",{"$f":"IF(G21=19,19,IF(ISBLANK(B21),\"\",IF(B21=19,0,36-B21)))","v":18},{"$f":"IF(G21=19,0,IF(ISBLANK(B21),\"\",IF(B21<18,1,IF(B21=18,2,IF(B21>18,3)))))","v":2},{"$f":"IF(G21=19,3,IF(ISBLANK(B21),\"\",IF(B21=19,0,IF(D21<18,1,IF(D21=18,2,IF(D21>=20,3))))))","v":2},null,null,null,null,null,{"$f":"IF(B21>D21,A21&C21,IF(D21>B21,C21&A21,\"/\"))","v":"/"},null,{"$f":"A21&C21","v":"AGAH"},{"$f":"E21","v":2},{"$f":"C21&A21","v":"AHAG"},{"$f":"F21","v":2},{"$f":"B21","v":18},{"$f":"D21","v":18}]
[]
["2 éme MATCH le ","à","AB"]
[null,null,null,null,null,null,"SI forfait éq recevante"]
["Equipes","score","Equipes","score","Points","Points"]
["AA",18,"AC",{"$f":"IF(G26=19,19,IF(ISBLANK(B26),\"\",IF(B26=19,0,36-B26)))","v":18},{"$f":"IF(G26=19,0,IF(ISBLANK(B26),\"\",IF(B26<18,1,IF(B26=18,2,IF(B26>18,3)))))","v":2},{"$f":"IF(G26=19,3,IF(ISBLANK(B26),\"\",IF(B26=19,0,IF(D26<18,1,IF(D26=18,2,IF(D26>=20,3))))))","v":2},null,null,null,null,null,{"$f":"IF(B26>D26,A26&C26,IF(D26>B26,C26&A26,\"/\"))","v":"/"},null,{"$f":"A26&C26","v":"AAAC"},{"$f":"E26","v":2},{"$f":"C26&A26","v":"ACAA"},{"$f":"F26","v":2},{"$f":"B26","v":18},{"$f":"D26","v":18}]
["AB",18,"AH",{"$f":"IF(G27=19,19,IF(ISBLANK(B27),\"\",IF(B27=19,0,36-B27)))","v":18},{"$f":"IF(G27=19,0,IF(ISBLANK(B27),\"\",IF(B27<18,1,IF(B27=18,2,IF(B27>18,3)))))","v":2},{"$f":"IF(G27=19,3,IF(ISBLANK(B27),\"\",IF(B27=19,0,IF(D27<18,1,IF(D27=18,2,IF(D27>=20,3))))))","v":2},null,null,null,null,null,{"$f":"IF(B27>D27,A27&C27,IF(D27>B27,C27&A27,\"/\"))","v":"/"},null,{"$f":"A27&C27","v":"ABAH"},{"$f":"E27","v":2},{"$f":"C27&A27","v":"AHAB"},{"$f":"F27","v":2},{"$f":"B27","v":18},{"$f":"D27","v":18}]
["AD",18,"AF",{"$f":"IF(G28=19,19,IF(ISBLANK(B28),\"\",IF(B28=19,0,36-B28)))","v":18},{"$f":"IF(G28=19,0,IF(ISBLANK(B28),\"\",IF(B28<18,1,IF(B28=18,2,IF(B28>18,3)))))","v":2},{"$f":"IF(G28=19,3,IF(ISBLANK(B28),\"\",IF(B28=19,0,IF(D28<18,1,IF(D28=18,2,IF(D28>=20,3))))))","v":2},null,null,null,null,null,{"$f":"IF(B28>D28,A28&C28,IF(D28>B28,C28&A28,\"/\"))","v":"/"},null,{"$f":"A28&C28","v":"ADAF"},{"$f":"E28","v":2},{"$f":"C28&A28","v":"AFAD"},{"$f":"F28","v":2},{"$f":"B28","v":18},{"$f":"D28","v":18}]
["AE",28,"AG",{"$f":"IF(G29=19,19,IF(ISBLANK(B29),\"\",IF(B29=19,0,36-B29)))","v":8},{"$f":"IF(G29=19,0,IF(ISBLANK(B29),\"\",IF(B29<18,1,IF(B29=18,2,IF(B29>18,3)))))","v":3},{"$f":"IF(G29=19,3,IF(ISBLANK(B29),\"\",IF(B29=19,0,IF(D29<18,1,IF(D29=18,2,IF(D29>=20,3))))))","v":1},null,null,null,null,null,{"$f":"IF(B29>D29,A29&C29,IF(D29>B29,C29&A29,\"/\"))","v":"AEAG"},null,{"$f":"A29&C29","v":"AEAG"},{"$f":"E29","v":3},{"$f":"C29&A29","v":"AGAE"},{"$f":"F29","v":1},{"$f":"B29","v":28},{"$f":"D29","v":8}]
[]
["3 éme MATCH le ","à","AC"]
[null,null,null,null,null,null,"SI forfait éq recevante"]
["Equipes","score","Equipes","score","Points","Points"]
["AA",20,"AH",{"$f":"IF(G34=19,19,IF(ISBLANK(B34),\"\",IF(B34=19,0,36-B34)))","v":16},{"$f":"IF(G34=19,0,IF(ISBLANK(B34),\"\",IF(B34<18,1,IF(B34=18,2,IF(B34>18,3)))))","v":3},{"$f":"IF(G34=19,3,IF(ISBLANK(B34),\"\",IF(B34=19,0,IF(D34<18,1,IF(D34=18,2,IF(D34>=20,3))))))","v":1},null,null,null,null,null,{"$f":"IF(B34>D34,A34&C34,IF(D34>B34,C34&A34,\"/\"))","v":"AAAH"},null,{"$f":"A34&C34","v":"AAAH"},{"$f":"E34","v":3},{"$f":"C34&A34","v":"AHAA"},{"$f":"F34","v":1},{"$f":"B34","v":20},{"$f":"D34","v":16}]
["AB",18,"AE",{"$f":"IF(G35=19,19,IF(ISBLANK(B35),\"\",IF(B35=19,0,36-B35)))","v":18},{"$f":"IF(G35=19,0,IF(ISBLANK(B35),\"\",IF(B35<18,1,IF(B35=18,2,IF(B35>18,3)))))","v":2},{"$f":"IF(G35=19,3,IF(ISBLANK(B35),\"\",IF(B35=19,0,IF(D35<18,1,IF(D35=18,2,IF(D35>=20,3))))))","v":2},null,null,null,null,null,{"$f":"IF(B35>D35,A35&C35,IF(D35>B35,C35&A35,\"/\"))","v":"/"},null,{"$f":"A35&C35","v":"ABAE"},{"$f":"E35","v":2},{"$f":"C35&A35","v":"AEAB"},{"$f":"F35","v":2},{"$f":"B35","v":18},{"$f":"D35","v":18}]
["AC",20,"AF",{"$f":"IF(G36=19,19,IF(ISBLANK(B36),\"\",IF(B36=19,0,36-B36)))","v":16},{"$f":"IF(G36=19,0,IF(ISBLANK(B36),\"\",IF(B36<18,1,IF(B36=18,2,IF(B36>18,3)))))","v":3},{"$f":"IF(G36=19,3,IF(ISBLANK(B36),\"\",IF(B36=19,0,IF(D36<18,1,IF(D36=18,2,IF(D36>=20,3))))))","v":1},null,null,null,null,null,{"$f":"IF(B36>D36,A36&C36,IF(D36>B36,C36&A36,\"/\"))","v":"ACAF"},null,{"$f":"A36&C36","v":"ACAF"},{"$f":"E36","v":3},{"$f":"C36&A36","v":"AFAC"},{"$f":"F36","v":1},{"$f":"B36","v":20},{"$f":"D36","v":16}]
["AD",18,"AG",{"$f":"IF(G37=19,19,IF(ISBLANK(B37),\"\",IF(B37=19,0,36-B37)))","v":18},{"$f":"IF(G37=19,0,IF(ISBLANK(B37),\"\",IF(B37<18,1,IF(B37=18,2,IF(B37>18,3)))))","v":2},{"$f":"IF(G37=19,3,IF(ISBLANK(B37),\"\",IF(B37=19,0,IF(D37<18,1,IF(D37=18,2,IF(D37>=20,3))))))","v":2},null,null,null,null,null,{"$f":"IF(B37>D37,A37&C37,IF(D37>B37,C37&A37,\"/\"))","v":"/"},null,{"$f":"A37&C37","v":"ADAG"},{"$f":"E37","v":2},{"$f":"C37&A37","v":"AGAD"},{"$f":"F37","v":2},{"$f":"B37","v":18},{"$f":"D37","v":18}]
[]
["4 éme MATCH le ","à","AD"]
[null,null,null,null,null,null,"SI forfait éq recevante"]
["Equipes","score","Equipes","score","Points","Points"]
["AA",20,"AD",{"$f":"IF(G42=19,19,IF(ISBLANK(B42),\"\",IF(B42=19,0,36-B42)))","v":16},{"$f":"IF(G42=19,0,IF(ISBLANK(B42),\"\",IF(B42<18,1,IF(B42=18,2,IF(B42>18,3)))))","v":3},{"$f":"IF(G42=19,3,IF(ISBLANK(B42),\"\",IF(B42=19,0,IF(D42<18,1,IF(D42=18,2,IF(D42>=20,3))))))","v":1},null,null,null,null,null,{"$f":"IF(B42>D42,A42&C42,IF(D42>B42,C42&A42,\"/\"))","v":"AAAD"},null,{"$f":"A42&C42","v":"AAAD"},{"$f":"E42","v":3},{"$f":"C42&A42","v":"ADAA"},{"$f":"F42","v":1},{"$f":"B42","v":20},{"$f":"D42","v":16}]
["AF",10,"AG",{"$f":"IF(G43=19,19,IF(ISBLANK(B43),\"\",IF(B43=19,0,36-B43)))","v":26},{"$f":"IF(G43=19,0,IF(ISBLANK(B43),\"\",IF(B43<18,1,IF(B43=18,2,IF(B43>18,3)))))","v":1},{"$f":"IF(G43=19,3,IF(ISBLANK(B43),\"\",IF(B43=19,0,IF(D43<18,1,IF(D43=18,2,IF(D43>=20,3))))))","v":3},null,null,null,null,null,{"$f":"IF(B43>D43,A43&C43,IF(D43>B43,C43&A43,\"/\"))","v":"AGAF"},null,{"$f":"A43&C43","v":"AFAG"},{"$f":"E43","v":1},{"$f":"C43&A43","v":"AGAF"},{"$f":"F43","v":3},{"$f":"B43","v":10},{"$f":"D43","v":26}]
["AB",32,"AC",{"$f":"IF(G44=19,19,IF(ISBLANK(B44),\"\",IF(B44=19,0,36-B44)))","v":4},{"$f":"IF(G44=19,0,IF(ISBLANK(B44),\"\",IF(B44<18,1,IF(B44=18,2,IF(B44>18,3)))))","v":3},{"$f":"IF(G44=19,3,IF(ISBLANK(B44),\"\",IF(B44=19,0,IF(D44<18,1,IF(D44=18,2,IF(D44>=20,3))))))","v":1},null,null,null,null,null,{"$f":"IF(B44>D44,A44&C44,IF(D44>B44,C44&A44,\"/\"))","v":"ABAC"},null,{"$f":"A44&C44","v":"ABAC"},{"$f":"E44","v":3},{"$f":"C44&A44","v":"ACAB"},{"$f":"F44","v":1},{"$f":"B44","v":32},{"$f":"D44","v":4}]
["AE",20,"AH",{"$f":"IF(G45=19,19,IF(ISBLANK(B45),\"\",IF(B45=19,0,36-B45)))","v":16},{"$f":"IF(G45=19,0,IF(ISBLANK(B45),\"\",IF(B45<18,1,IF(B45=18,2,IF(B45>18,3)))))","v":3},{"$f":"IF(G45=19,3,IF(ISBLANK(B45),\"\",IF(B45=19,0,IF(D45<18,1,IF(D45=18,2,IF(D45>=20,3))))))","v":1},null,null,null,null,null,{"$f":"IF(B45>D45,A45&C45,IF(D45>B45,C45&A45,\"/\"))","v":"AEAH"},null,{"$f":"A45&C45","v":"AEAH"},{"$f":"E45","v":3},{"$f":"C45&A45","v":"AHAE"},{"$f":"F45","v":1},{"$f":"B45","v":20},{"$f":"D45","v":16}]
[]
["5 éme MATCH le ","à","AE"]
[null,null,null,null,null,null,"SI forfait éq recevante"]
["Equipes","score","Equipes","score","Points","Points"]
["AA",18,"AF",{"$f":"IF(G50=19,19,IF(ISBLANK(B50),\"\",IF(B50=19,0,36-B50)))","v":18},{"$f":"IF(G50=19,0,IF(ISBLANK(B50),\"\",IF(B50<18,1,IF(B50=18,2,IF(B50>18,3)))))","v":2},{"$f":"IF(G50=19,3,IF(ISBLANK(B50),\"\",IF(B50=19,0,IF(D50<18,1,IF(D50=18,2,IF(D50>=20,3))))))","v":2},null,null,null,null,null,{"$f":"IF(B50>D50,A50&C50,IF(D50>B50,C50&A50,\"/\"))","v":"/"},null,{"$f":"A50&C50","v":"AAAF"},{"$f":"E50","v":2},{"$f":"C50&A50","v":"AFAA"},{"$f":"F50","v":2},{"$f":"B50","v":18},{"$f":"D50","v":18}]
["AD",18,"AH",{"$f":"IF(G51=19,19,IF(ISBLANK(B51),\"\",IF(B51=19,0,36-B51)))","v":18},{"$f":"IF(G51=19,0,IF(ISBLANK(B51),\"\",IF(B51<18,1,IF(B51=18,2,IF(B51>18,3)))))","v":2},{"$f":"IF(G51=19,3,IF(ISBLANK(B51),\"\",IF(B51=19,0,IF(D51<18,1,IF(D51=18,2,IF(D51>=20,3))))))","v":2},null,null,null,null,null,{"$f":"IF(B51>D51,A51&C51,IF(D51>B51,C51&A51,\"/\"))","v":"/"},null,{"$f":"A51&C51","v":"ADAH"},{"$f":"E51","v":2},{"$f":"C51&A51","v":"AHAD"},{"$f":"F51","v":2},{"$f":"B51","v":18},{"$f":"D51","v":18}]
["AB",4,"AG",{"$f":"IF(G52=19,19,IF(ISBLANK(B52),\"\",IF(B52=19,0,36-B52)))","v":32},{"$f":"IF(G52=19,0,IF(ISBLANK(B52),\"\",IF(B52<18,1,IF(B52=18,2,IF(B52>18,3)))))","v":1},{"$f":"IF(G52=19,3,IF(ISBLANK(B52),\"\",IF(B52=19,0,IF(D52<18,1,IF(D52=18,2,IF(D52>=20,3))))))","v":3},null,null,null,null,null,{"$f":"IF(B52>D52,A52&C52,IF(D52>B52,C52&A52,\"/\"))","v":"AGAB"},null,{"$f":"A52&C52","v":"ABAG"},{"$f":"E52","v":1},{"$f":"C52&A52","v":"AGAB"},{"$f":"F52","v":3},{"$f":"B52","v":4},{"$f":"D52","v":32}]
["AC",20,"AE",{"$f":"IF(G53=19,19,IF(ISBLANK(B53),\"\",IF(B53=19,0,36-B53)))","v":16},{"$f":"IF(G53=19,0,IF(ISBLANK(B53),\"\",IF(B53<18,1,IF(B53=18,2,IF(B53>18,3)))))","v":3},{"$f":"IF(G53=19,3,IF(ISBLANK(B53),\"\",IF(B53=19,0,IF(D53<18,1,IF(D53=18,2,IF(D53>=20,3))))))","v":1},null,null,null,null,null,{"$f":"IF(B53>D53,A53&C53,IF(D53>B53,C53&A53,\"/\"))","v":"ACAE"},null,{"$f":"A53&C53","v":"ACAE"},{"$f":"E53","v":3},{"$f":"C53&A53","v":"AEAC"},{"$f":"F53","v":1},{"$f":"B53","v":20},{"$f":"D53","v":16}]
[]
["6 éme MATCH le ","à","AF"]
[null,null,null,null,null,null,"SI forfait éq recevante"]
["Equipes","score","Equipes","score","Points","Points"]
["AB",30,"AD",{"$f":"IF(G58=19,19,IF(ISBLANK(B58),\"\",IF(B58=19,0,36-B58)))","v":6},{"$f":"IF(G58=19,0,IF(ISBLANK(B58),\"\",IF(B58<18,1,IF(B58=18,2,IF(B58>18,3)))))","v":3},{"$f":"IF(G58=19,3,IF(ISBLANK(B58),\"\",IF(B58=19,0,IF(D58<18,1,IF(D58=18,2,IF(D58>=20,3))))))","v":1},null,null,null,null,null,{"$f":"IF(B58>D58,A58&C58,IF(D58>B58,C58&A58,\"/\"))","v":"ABAD"},null,{"$f":"A58&C58","v":"ABAD"},{"$f":"E58","v":3},{"$f":"C58&A58","v":"ADAB"},{"$f":"F58","v":1},{"$f":"B58","v":30},{"$f":"D58","v":6}]
["AE",24,"AA",{"$f":"IF(G59=19,19,IF(ISBLANK(B59),\"\",IF(B59=19,0,36-B59)))","v":12},{"$f":"IF(G59=19,0,IF(ISBLANK(B59),\"\",IF(B59<18,1,IF(B59=18,2,IF(B59>18,3)))))","v":3},{"$f":"IF(G59=19,3,IF(ISBLANK(B59),\"\",IF(B59=19,0,IF(D59<18,1,IF(D59=18,2,IF(D59>=20,3))))))","v":1},null,null,null,null,null,{"$f":"IF(B59>D59,A59&C59,IF(D59>B59,C59&A59,\"/\"))","v":"AEAA"},null,{"$f":"A59&C59","v":"AEAA"},{"$f":"E59","v":3},{"$f":"C59&A59","v":"AAAE"},{"$f":"F59","v":1},{"$f":"B59","v":24},{"$f":"D59","v":12}]
["AG",32,"AC",{"$f":"IF(G60=19,19,IF(ISBLANK(B60),\"\",IF(B60=19,0,36-B60)))","v":4},{"$f":"IF(G60=19,0,IF(ISBLANK(B60),\"\",IF(B60<18,1,IF(B60=18,2,IF(B60>18,3)))))","v":3},{"$f":"IF(G60=19,3,IF(ISBLANK(B60),\"\",IF(B60=19,0,IF(D60<18,1,IF(D60=18,2,IF(D60>=20,3))))))","v":1},null,null,null,null,null,{"$f":"IF(B60>D60,A60&C60,IF(D60>B60,C60&A60,\"/\"))","v":"AGAC"},null,{"$f":"A60&C60","v":"AGAC"},{"$f":"E60","v":3},{"$f":"C60&A60","v":"ACAG"},{"$f":"F60","v":1},{"$f":"B60","v":32},{"$f":"D60","v":4}]
["AF",22,"AH",{"$f":"IF(G61=19,19,IF(ISBLANK(B61),\"\",IF(B61=19,0,36-B61)))","v":14},{"$f":"IF(G61=19,0,IF(ISBLANK(B61),\"\",IF(B61<18,1,IF(B61=18,2,IF(B61>18,3)))))","v":3},{"$f":"IF(G61=19,3,IF(ISBLANK(B61),\"\",IF(B61=19,0,IF(D61<18,1,IF(D61=18,2,IF(D61>=20,3))))))","v":1},null,null,null,null,null,{"$f":"IF(B61>D61,A61&C61,IF(D61>B61,C61&A61,\"/\"))","v":"AFAH"},null,{"$f":"A61&C61","v":"AFAH"},{"$f":"E61","v":3},{"$f":"C61&A61","v":"AHAF"},{"$f":"F61","v":1},{"$f":"B61","v":22},{"$f":"D61","v":14}]
[]
["7 éme MATCH le","à","AG"]
[null,null,null,null,null,null,"SI forfait éq recevante",null," "]
["Equipes","score","Equipes","score","Points","Points"]
["AA",20,"AG",{"$f":"IF(G66=19,19,IF(ISBLANK(B66),\"\",IF(B66=19,0,36-B66)))","v":16},{"$f":"IF(G66=19,0,IF(ISBLANK(B66),\"\",IF(B66<18,1,IF(B66=18,2,IF(B66>18,3)))))","v":3},{"$f":"IF(G66=19,3,IF(ISBLANK(B66),\"\",IF(B66=19,0,IF(D66<18,1,IF(D66=18,2,IF(D66>=20,3))))))","v":1},null,null,null,null,null,{"$f":"IF(B66>D66,A66&C66,IF(D66>B66,C66&A66,\"/\"))","v":"AAAG"},null,{"$f":"A66&C66","v":"AAAG"},{"$f":"E66","v":3},{"$f":"C66&A66","v":"AGAA"},{"$f":"F66","v":1},{"$f":"B66","v":20},{"$f":"D66","v":16}]
["AB",12,"AF",{"$f":"IF(G67=19,19,IF(ISBLANK(B67),\"\",IF(B67=19,0,36-B67)))","v":24},{"$f":"IF(G67=19,0,IF(ISBLANK(B67),\"\",IF(B67<18,1,IF(B67=18,2,IF(B67>18,3)))))","v":1},{"$f":"IF(G67=19,3,IF(ISBLANK(B67),\"\",IF(B67=19,0,IF(D67<18,1,IF(D67=18,2,IF(D67>=20,3))))))","v":3},null,null,null,null,null,{"$f":"IF(B67>D67,A67&C67,IF(D67>B67,C67&A67,\"/\"))","v":"AFAB"},null,{"$f":"A67&C67","v":"ABAF"},{"$f":"E67","v":1},{"$f":"C67&A67","v":"AFAB"},{"$f":"F67","v":3},{"$f":"B67","v":12},{"$f":"D67","v":24}]
["AE",18,"AD",{"$f":"IF(G68=19,19,IF(ISBLANK(B68),\"\",IF(B68=19,0,36-B68)))","v":18},{"$f":"IF(G68=19,0,IF(ISBLANK(B68),\"\",IF(B68<18,1,IF(B68=18,2,IF(B68>18,3)))))","v":2},{"$f":"IF(G68=19,3,IF(ISBLANK(B68),\"\",IF(B68=19,0,IF(D68<18,1,IF(D68=18,2,IF(D68>=20,3))))))","v":2},null,null,null,null,null,{"$f":"IF(B68>D68,A68&C68,IF(D68>B68,C68&A68,\"/\"))","v":"/"},null,{"$f":"A68&C68","v":"AEAD"},{"$f":"E68","v":2},{"$f":"C68&A68","v":"ADAE"},{"$f":"F68","v":2},{"$f":"B68","v":18},{"$f":"D68","v":18}]
["AC",18,"AH",{"$f":"IF(G69=19,19,IF(ISBLANK(B69),\"\",IF(B69=19,0,36-B69)))","v":19},{"$f":"IF(G69=19,0,IF(ISBLANK(B69),\"\",IF(B69<18,1,IF(B69=18,2,IF(B69>18,3)))))","v":0},{"$f":"IF(G69=19,3,IF(ISBLANK(B69),\"\",IF(B69=19,0,IF(D69<18,1,IF(D69=18,2,IF(D69>=20,3))))))","v":3},19,null,null,null,null,{"$f":"IF(B69>D69,A69&C69,IF(D69>B69,C69&A69,\"/\"))","v":"AHAC"},null,{"$f":"A69&C69","v":"ACAH"},{"$f":"E69","v":0},{"$f":"C69&A69","v":"AHAC"},{"$f":"F69","v":3},{"$f":"B69","v":18},{"$f":"D69","v":19}]
[null,null,"Si pas d'exaequo",null,null,null,"Classt        Final","Rencontres entre exaequos"]
["EQUIPES",null,"POINTS","POUR","CONTRE","DIFF",null,"POINTS Exaequos","Exaq","n°","AA","AB","AC","AD","AE","AF","AG","AH","Pts matchs",null,null,null,"1000000*Pts matchs +1000 (Diff +  abs(diff mini) )+Pour ","RANG","DIFF Exaequos","POUR Exaequos"]
["AF","1F",15,128,124,4,1,{"$f":"IF(S72>0,S72,\"\")","v":9},{"$f":"COUNTIF($C$72:$C$79,C72)","v":5},{"$f":"IF(AND(I72>1,COUNTIFS(I$72:I72,I72,C$72:C72,C72)=1),MAX(J$71:J71)+1,\"\")","v":1},{"$f":"IF($A72=K$71,\"\",IF(INDEX($C$72:$C$79,MATCH(K$71,$A$72:$A$79,0))=$C72,IFERROR(VLOOKUP($A72&K$71,$N$18:$O$69,2,0),  VLOOKUP(K$71&$A72,$N$18:$Q$69,4,0)),          \"\"))","v":2},3,"","",3,"",1,"",{"$f":"SUM(K72:R72)","v":9},null,null,null,{"$f":"IF(I72<3,S72*1000000+(F72+ABS(MIN($F$72:$F$79)))*1000+D72,S72*1000000+U96*1000+Z72)","v":9036072},{"$f":"IF(I72>2,RANK(W72,OFFSET(W$71,MATCH(I72,$I$72:$I$79,0),,I72)))","v":2},{"$f":"IF(S96=0,\"\",S96)","v":""},{"$f":"IF(S80=0,\"\",S80)","v":72}]
["AE","1E",15,140,112,28,2,9,5,{"$f":"IF(AND(I73>1,COUNTIFS(I$72:I73,I73,C$72:C73,C73)=1),MAX(J$71:J72)+1,\"\")","v":""},3,2,"","","",1,3,"",{"$f":"SUM(K73:R73)","v":9},null,null,null,{"$f":"IF(I73<3,S73*1000000+(F73+ABS(MIN($F$72:$F$79)))*1000+D73,S73*1000000+U97*1000+Z73)","v":9064086},{"$f":"IF(I73>2,RANK(W73,OFFSET(W$71,MATCH(I73,$I$72:$I$79,0),,I73)))","v":1},28,86]
["AG","1G",15,150,102,48,3,8,5,{"$f":"IF(AND(I74>1,COUNTIFS(I$72:I74,I74,C$72:C74,C74)=1),MAX(J$71:J73)+1,\"\")","v":""},1,3,"","",1,3,"","",8,null,null,null,8056082,3,20,82]
["AB","1B",15,134,118,16,4,7,5,{"$f":"IF(AND(I75>1,COUNTIFS(I$72:I75,I75,C$72:C75,C75)=1),MAX(J$71:J74)+1,\"\")","v":""},3,"","","",2,1,1,"",7,null,null,null,7000054,5,-36,54]
["AA","1A",15,124,128,-4,5,7,5,{"$f":"IF(AND(I76>1,COUNTIFS(I$72:I76,I76,C$72:C76,C76)=1),MAX(J$71:J75)+1,\"\")","v":""},"",1,"","",1,2,3,"",7,null,null,null,7024066,4,-12,66]
["AC","1C",13,114,139,-25,6,"",1,{"$f":"IF(AND(I77>1,COUNTIFS(I$72:I77,I77,C$72:C77,C77)=1),MAX(J$71:J76)+1,\"\")","v":""},"","","","","","","","",0,null,null,null,27114,false,"",""]
["AH","1H",12,119,134,-15,7,"",1,{"$f":"IF(AND(I78>1,COUNTIFS(I$72:I78,I78,C$72:C78,C78)=1),MAX(J$71:J77)+1,\"\")","v":""},"","","","","","","","",0,null,null,null,37119,false,"",""]
["AD","1D",11,100,152,-52,8,"",1,{"$f":"IF(AND(I79>1,COUNTIFS(I$72:I79,I79,C$72:C79,C79)=1),MAX(J$71:J78)+1,\"\")","v":""},"","","","","","","","",0,null,null,null,100,false,"",""]
[null,null,null,null,null,null,null,null,"POUR",{"$f":"A72","v":"AF"},{"$f":"IF($A72=K$71,\"\",IF(INDEX($C$72:$C$79,MATCH(K$71,$A$72:$A$79,0))=$C72,IFERROR(VLOOKUP($A72&K$71,$N$18:$R$69,5,0),  VLOOKUP(K$71&$A72,$N$18:$S$69,6,0)),          \"\"))","v":18},24,"","",20,"",10,"",72]
[null,null,null,null,null,null,null,null,null,"AE",24,18,"","","",16,28,"",86]
[null,null,null,null,null,null,null,null,null,"AG",16,32,"","",8,26,"","",82]
[null,null,null,null,null,null,null,null,null,"AB",20,"","","",18,12,4,"",54]
[null,null,null,null,null,null,null,null,null,"AA","",16,"","",12,18,20,"",66,null,null,null,null,null,"  "]
[null,null,null,null,null,null,null,null,null,"AC","","","","","","","","",0]
[null,null,null,null,null,null,null,null,null,"AH","","","","","","","","",0]
[null,null,null,null,null,null,null,null,null,"AD","","","","","","","","",0]
[null,null,null,null,null,null,null,null,"CONTRE",{"$f":"J80","v":"AF"},{"$f":"INDEX($K$80:$R$87,MATCH(K$71,$J$80:$J$87,0),MATCH($J80,$K$71:$R$71,0))","v":18},{"$f":"INDEX($K$80:$R$87,MATCH(L$71,$J$80:$J$87,0),MATCH($J80,$K$71:$R$71,0))","v":12},"","",16,"",26,"",72]
[null,null,null,null,null,null,null,null,null,{"$f":"J81","v":"AE"},{"$f":"INDEX($K$80:$R$87,MATCH(K$71,$J$80:$J$87,0),MATCH($J81,$K$71:$R$71,0))","v":12},18,"","","",20,8,"",58]
[null,null,null,null,null,null,null,null,null,"AG",20,4,"","",28,10,"","",62]
[null,null,null,null,null,null,null,null,null,"AB",16,"","","",18,24,32,"",90]
[null,null,null,null,null,null,null,null,null,"AA","",20,"","",24,18,16,"",78]
[null,null,null,null,null,null,null,null,null,"AC","","","","","","","","",0]
[null,null,null,null,null,null,null,null,null,"AH","","","","","","","","",0]
[null,null,null,null,null,null,null,null,null,"AD","","","","","","","","",0,null,"Diff pondérée"]
[null,null,null,null,null,null,null,null,"DIFF",{"$f":"J88","v":"AF"},null,null,null,null,null,null,null,null,{"$f":"S80-S88","v":0},null,{"$f":"S96+ABS(MIN($S$96:$S$103))","v":36}]
[null,null,null,null,null,null,null,null,null,{"$f":"J89","v":"AE"},null,null,null,null,null,null,null,null,{"$f":"S81-S89","v":28},null,64]
[null,null,null,null,null,null,null,null,null,"AG",null,null,null,null,null,null,null,null,20,null,56]
[null,null,null,null,null,null,null,null,null,"AB",null,null,null,null,null,null,null,null,-36,null,0]
[null,null,null,null,null,null,null,null,null,"AA",null,null,null,null,null,null,null,null,-12,null,24]
[null,null,null,null,null,null,null,null,null,"AC",null,null,null,null,null,null,null,null,0,null,36]
[null,null,null,null,null,null,null,null,null,"AH",null,null,null,null,null,null,null,null,0,null,{"$f":"S102+ABS(MIN($S$96:$S$103))","v":36}]
[null,null,null,null,null,null,null,null,null,"AD",null,null,null,null,null,null,null,null,0,null,{"$f":"S103+ABS(MIN($S$96:$S$103))","v":36}]

{"sheet":"P14","index":13,"n_rows":103,"n_cols":26,"rows_kept":103,"cut":false,"hidden":false,"merged":[[0,0,0,5],[1,0,1,5],[2,0,2,5],[3,0,3,5],[3,8,3,10],[15,6,16,6],[69,2,69,5],[69,6,70,6],[69,7,69,25],[23,6,24,6],[31,6,32,6],[39,6,40,6],[47,6,48,6],[55,6,56,6],[63,6,64,6]]}
[null,null,null,null,null,null,3]
["CHAMPIONNAT DES CLUBS"]
[]
["POULE 1"]
["EQUIPES",null,"POINTS","Pour","Contre","Diff"]
["AA","1A",{"$f":"SUMIF($A$18:$A$69,A6,$E$18:$E$69)+SUMIF($C$18:$C$69,A6,$F$18:$F$69)","v":16},{"$f":"SUMIF($A$18:$A$69,$A6,$B$18:$B$69)+SUMIF($C$18:$C$69,$A6,$D$18:$D$69)","v":126},{"$f":"SUMIF($C$18:$C$69,$A6,$B$18:$B$69)+SUMIF($A$18:$A$69,$A6,$D$18:$D$69)","v":126},{"$f":"D6-E6","v":0}]
["AB","1B",{"$f":"SUMIF($A$18:$A$69,A7,$E$18:$E$69)+SUMIF($C$18:$C$69,A7,$F$18:$F$69)","v":14},{"$f":"SUMIF($A$18:$A$69,$A7,$B$18:$B$69)+SUMIF($C$18:$C$69,$A7,$D$18:$D$69)","v":132},{"$f":"SUMIF($C$18:$C$69,$A7,$B$18:$B$69)+SUMIF($A$18:$A$69,$A7,$D$18:$D$69)","v":120},12]
["AC","1C",{"$f":"SUMIF($A$18:$A$69,A8,$E$18:$E$69)+SUMIF($C$18:$C$69,A8,$F$18:$F$69)","v":14},112,140,-28]
["AD","1D",10,96,156,-60]
["AE","1E",15,140,112,28]
["AF","1F",16,132,120,12]
["AG","1G",15,150,102,{"$f":"D12-E12","v":48}]
["AH","1H",12,{"$f":"SUMIF($A$18:$A$69,$A13,$B$18:$B$69)+SUMIF($C$18:$C$69,$A13,$D$18:$D$69)","v":120},132,{"$f":"D13-E13","v":-12}]
[]
["1er MATCH le ","à","AA"]
[null,null,null,null,null,null,"SI forfait éq recevante"]
["Equipes","score","Equipes","score","Points","Points"]
["AA",16,"AB",{"$f":"IF(G18=19,19,IF(ISBLANK(B18),\"\",IF(B18=19,0,36-B18)))","v":20},{"$f":"IF(G18=19,0,IF(ISBLANK(B18),\"\",IF(B18<18,1,IF(B18=18,2,IF(B18>18,3)))))","v":1},{"$f":"IF(G18=19,3,IF(ISBLANK(B18),\"\",IF(B18=19,0,IF(D18<18,1,IF(D18=18,2,IF(D18>=20,3))))))","v":3},null,null,null,null,null,{"$f":"IF(B18>D18,A18&C18,IF(D18>B18,C18&A18,\"/\"))","v":"ABAA"},null,{"$f":"A18&C18","v":"AAAB"},{"$f":"E18","v":1},{"$f":"C18&A18","v":"ABAA"},{"$f":"F18","v":3},{"$f":"B18","v":16},{"$f":"D18","v":20}]
["AC",30,"AD",{"$f":"IF(G19=19,19,IF(ISBLANK(B19),\"\",IF(B19=19,0,36-B19)))","v":6},{"$f":"IF(G19=19,0,IF(ISBLANK(B19),\"\",IF(B19<18,1,IF(B19=18,2,IF(B19>18,3)))))","v":3},{"$f":"IF(G19=19,3,IF(ISBLANK(B19),\"\",IF(B19=19,0,IF(D19<18,1,IF(D19=18,2,IF(D19>=20,3))))))","v":1},null,null,null,null,null,{"$f":"IF(B19>D19,A19&C19,IF(D19>B19,C19&A19,\"/\"))","v":"ACAD"},null,{"$f":"A19&C19","v":"ACAD"},{"$f":"E19","v":3},{"$f":"C19&A19","v":"ADAC"},{"$f":"F19","v":1},{"$f":"B19","v":30},{"$f":"D19","v":6}]
["AE",16,"AF",{"$f":"IF(G20=19,19,IF(ISBLANK(B20),\"\",IF(B20=19,0,36-B20)))","v":20},{"$f":"IF(G20=19,0,IF(ISBLANK(B20),\"\",IF(B20<18,1,IF(B20=18,2,IF(B20>18,3)))))","v":1},{"$f":"IF(G20=19,3,IF(ISBLANK(B20),\"\",IF(B20=19,0,IF(D20<18,1,IF(D20=18,2,IF(D20>=20,3))))))","v":3},null,null,null,null,null,{"$f":"IF(B20>D20,A20&C20,IF(D20>B20,C20&A20,\"/\"))","v":"AFAE"},null,{"$f":"A20&C20","v":"AEAF"},{"$f":"E20","v":1},{"$f":"C20&A20","v":"AFAE"},{"$f":"F20","v":3},{"$f":"B20","v":16},{"$f":"D20","v":20}]
["AG",18,"AH",{"$f":"IF(G21=19,19,IF(ISBLANK(B21),\"\",IF(B21=19,0,36-B21)))","v":18},{"$f":"IF(G21=19,0,IF(ISBLANK(B21),\"\",IF(B21<18,1,IF(B21=18,2,IF(B21>18,3)))))","v":2},{"$f":"IF(G21=19,3,IF(ISBLANK(B21),\"\",IF(B21=19,0,IF(D21<18,1,IF(D21=18,2,IF(D21>=20,3))))))","v":2},null,null,null,null,null,{"$f":"IF(B21>D21,A21&C21,IF(D21>B21,C21&A21,\"/\"))","v":"/"},null,{"$f":"A21&C21","v":"AGAH"},{"$f":"E21","v":2},{"$f":"C21&A21","v":"AHAG"},{"$f":"F21","v":2},{"$f":"B21","v":18},{"$f":"D21","v":18}]
[]
["2 éme MATCH le ","à","AB"]
[null,null,null,null,null,null,"SI forfait éq recevante"]
["Equipes","score","Equipes","score","Points","Points"]
["AA",20,"AC",{"$f":"IF(G26=19,19,IF(ISBLANK(B26),\"\",IF(B26=19,0,36-B26)))","v":16},{"$f":"IF(G26=19,0,IF(ISBLANK(B26),\"\",IF(B26<18,1,IF(B26=18,2,IF(B26>18,3)))))","v":3},{"$f":"IF(G26=19,3,IF(ISBLANK(B26),\"\",IF(B26=19,0,IF(D26<18,1,IF(D26=18,2,IF(D26>=20,3))))))","v":1},null,null,null,null,null,{"$f":"IF(B26>D26,A26&C26,IF(D26>B26,C26&A26,\"/\"))","v":"AAAC"},null,{"$f":"A26&C26","v":"AAAC"},{"$f":"E26","v":3},{"$f":"C26&A26","v":"ACAA"},{"$f":"F26","v":1},{"$f":"B26","v":20},{"$f":"D26","v":16}]
["AB",16,"AH",{"$f":"IF(G27=19,19,IF(ISBLANK(B27),\"\",IF(B27=19,0,36-B27)))","v":20},{"$f":"IF(G27=19,0,IF(ISBLANK(B27),\"\",IF(B27<18,1,IF(B27=18,2,IF(B27>18,3)))))","v":1},{"$f":"IF(G27=19,3,IF(ISBLANK(B27),\"\",IF(B27=19,0,IF(D27<18,1,IF(D27=18,2,IF(D27>=20,3))))))","v":3},null,null,null,null,null,{"$f":"IF(B27>D27,A27&C27,IF(D27>B27,C27&A27,\"/\"))","v":"AHAB"},null,{"$f":"A27&C27","v":"ABAH"},{"$f":"E27","v":1},{"$f":"C27&A27","v":"AHAB"},{"$f":"F27","v":3},{"$f":"B27","v":16},{"$f":"D27","v":20}]
["AD",14,"AF",{"$f":"IF(G28=19,19,IF(ISBLANK(B28),\"\",IF(B28=19,0,36-B28)))","v":22},{"$f":"IF(G28=19,0,IF(ISBLANK(B28),\"\",IF(B28<18,1,IF(B28=18,2,IF(B28>18,3)))))","v":1},{"$f":"IF(G28=19,3,IF(ISBLANK(B28),\"\",IF(B28=19,0,IF(D28<18,1,IF(D28=18,2,IF(D28>=20,3))))))","v":3},null,null,null,null,null,{"$f":"IF(B28>D28,A28&C28,IF(D28>B28,C28&A28,\"/\"))","v":"AFAD"},null,{"$f":"A28&C28","v":"ADAF"},{"$f":"E28","v":1},{"$f":"C28&A28","v":"AFAD"},{"$f":"F28","v":3},{"$f":"B28","v":14},{"$f":"D28","v":22}]
["AE",28,"AG",{"$f":"IF(G29=19,19,IF(ISBLANK(B29),\"\",IF(B29=19,0,36-B29)))","v":8},{"$f":"IF(G29=19,0,IF(ISBLANK(B29),\"\",IF(B29<18,1,IF(B29=18,2,IF(B29>18,3)))))","v":3},{"$f":"IF(G29=19,3,IF(ISBLANK(B29),\"\",IF(B29=19,0,IF(D29<18,1,IF(D29=18,2,IF(D29>=20,3))))))","v":1},null,null,null,null,null,{"$f":"IF(B29>D29,A29&C29,IF(D29>B29,C29&A29,\"/\"))","v":"AEAG"},null,{"$f":"A29&C29","v":"AEAG"},{"$f":"E29","v":3},{"$f":"C29&A29","v":"AGAE"},{"$f":"F29","v":1},{"$f":"B29","v":28},{"$f":"D29","v":8}]
[]
["3 éme MATCH le ","à","AC"]
[null,null,null,null,null,null,"SI forfait éq recevante"]
["Equipes","score","Equipes","score","Points","Points"]
["AA",20,"AH",{"$f":"IF(G34=19,19,IF(ISBLANK(B34),\"\",IF(B34=19,0,36-B34)))","v":16},{"$f":"IF(G34=19,0,IF(ISBLANK(B34),\"\",IF(B34<18,1,IF(B34=18,2,IF(B34>18,3)))))","v":3},{"$f":"IF(G34=19,3,IF(ISBLANK(B34),\"\",IF(B34=19,0,IF(D34<18,1,IF(D34=18,2,IF(D34>=20,3))))))","v":1},null,null,null,null,null,{"$f":"IF(B34>D34,A34&C34,IF(D34>B34,C34&A34,\"/\"))","v":"AAAH"},null,{"$f":"A34&C34","v":"AAAH"},{"$f":"E34","v":3},{"$f":"C34&A34","v":"AHAA"},{"$f":"F34","v":1},{"$f":"B34","v":20},{"$f":"D34","v":16}]
["AB",18,"AE",{"$f":"IF(G35=19,19,IF(ISBLANK(B35),\"\",IF(B35=19,0,36-B35)))","v":18},{"$f":"IF(G35=19,0,IF(ISBLANK(B35),\"\",IF(B35<18,1,IF(B35=18,2,IF(B35>18,3)))))","v":2},{"$f":"IF(G35=19,3,IF(ISBLANK(B35),\"\",IF(B35=19,0,IF(D35<18,1,IF(D35=18,2,IF(D35>=20,3))))))","v":2},null,null,null,null,null,{"$f":"IF(B35>D35,A35&C35,IF(D35>B35,C35&A35,\"/\"))","v":"/"},null,{"$f":"A35&C35","v":"ABAE"},{"$f":"E35","v":2},{"$f":"C35&A35","v":"AEAB"},{"$f":"F35","v":2},{"$f":"B35","v":18},{"$f":"D35","v":18}]
["AC",20,"AF",{"$f":"IF(G36=19,19,IF(ISBLANK(B36),\"\",IF(B36=19,0,36-B36)))","v":16},{"$f":"IF(G36=19,0,IF(ISBLANK(B36),\"\",IF(B36<18,1,IF(B36=18,2,IF(B36>18,3)))))","v":3},{"$f":"IF(G36=19,3,IF(ISBLANK(B36),\"\",IF(B36=19,0,IF(D36<18,1,IF(D36=18,2,IF(D36>=20,3))))))","v":1},null,null,null,null,null,{"$f":"IF(B36>D36,A36&C36,IF(D36>B36,C36&A36,\"/\"))","v":"ACAF"},null,{"$f":"A36&C36","v":"ACAF"},{"$f":"E36","v":3},{"$f":"C36&A36","v":"AFAC"},{"$f":"F36","v":1},{"$f":"B36","v":20},{"$f":"D36","v":16}]
["AD",18,"AG",{"$f":"IF(G37=19,19,IF(ISBLANK(B37),\"\",IF(B37=19,0,36-B37)))","v":18},{"$f":"IF(G37=19,0,IF(ISBLANK(B37),\"\",IF(B37<18,1,IF(B37=18,2,IF(B37>18,3)))))","v":2},{"$f":"IF(G37=19,3,IF(ISBLANK(B37),\"\",IF(B37=19,0,IF(D37<18,1,IF(D37=18,2,IF(D37>=20,3))))))","v":2},null,null,null,null,null,{"$f":"IF(B37>D37,A37&C37,IF(D37>B37,C37&A37,\"/\"))","v":"/"},null,{"$f":"A37&C37","v":"ADAG"},{"$f":"E37","v":2},{"$f":"C37&A37","v":"AGAD"},{"$f":"F37","v":2},{"$f":"B37","v":18},{"$f":"D37","v":18}]
[]
["4 éme MATCH le ","à","AD"]
[null,null,null,null,null,null,"SI forfait éq recevante"]
["Equipes","score","Equipes","score","Points","Points"]
["AA",20,"AD",{"$f":"IF(G42=19,19,IF(ISBLANK(B42),\"\",IF(B42=19,0,36-B42)))","v":16},{"$f":"IF(G42=19,0,IF(ISBLANK(B42),\"\",IF(B42<18,1,IF(B42=18,2,IF(B42>18,3)))))","v":3},{"$f":"IF(G42=19,3,IF(ISBLANK(B42),\"\",IF(B42=19,0,IF(D42<18,1,IF(D42=18,2,IF(D42>=20,3))))))","v":1},null,null,null,null,null,{"$f":"IF(B42>D42,A42&C42,IF(D42>B42,C42&A42,\"/\"))","v":"AAAD"},null,{"$f":"A42&C42","v":"AAAD"},{"$f":"E42","v":3},{"$f":"C42&A42","v":"ADAA"},{"$f":"F42","v":1},{"$f":"B42","v":20},{"$f":"D42","v":16}]
["AF",10,"AG",{"$f":"IF(G43=19,19,IF(ISBLANK(B43),\"\",IF(B43=19,0,36-B43)))","v":26},{"$f":"IF(G43=19,0,IF(ISBLANK(B43),\"\",IF(B43<18,1,IF(B43=18,2,IF(B43>18,3)))))","v":1},{"$f":"IF(G43=19,3,IF(ISBLANK(B43),\"\",IF(B43=19,0,IF(D43<18,1,IF(D43=18,2,IF(D43>=20,3))))))","v":3},null,null,null,null,null,{"$f":"IF(B43>D43,A43&C43,IF(D43>B43,C43&A43,\"/\"))","v":"AGAF"},null,{"$f":"A43&C43","v":"AFAG"},{"$f":"E43","v":1},{"$f":"C43&A43","v":"AGAF"},{"$f":"F43","v":3},{"$f":"B43","v":10},{"$f":"D43","v":26}]
["AB",32,"AC",{"$f":"IF(G44=19,19,IF(ISBLANK(B44),\"\",IF(B44=19,0,36-B44)))","v":4},{"$f":"IF(G44=19,0,IF(ISBLANK(B44),\"\",IF(B44<18,1,IF(B44=18,2,IF(B44>18,3)))))","v":3},{"$f":"IF(G44=19,3,IF(ISBLANK(B44),\"\",IF(B44=19,0,IF(D44<18,1,IF(D44=18,2,IF(D44>=20,3))))))","v":1},null,null,null,null,null,{"$f":"IF(B44>D44,A44&C44,IF(D44>B44,C44&A44,\"/\"))","v":"ABAC"},null,{"$f":"A44&C44","v":"ABAC"},{"$f":"E44","v":3},{"$f":"C44&A44","v":"ACAB"},{"$f":"F44","v":1},{"$f":"B44","v":32},{"$f":"D44","v":4}]
["AE",20,"AH",{"$f":"IF(G45=19,19,IF(ISBLANK(B45),\"\",IF(B45=19,0,36-B45)))","v":16},{"$f":"IF(G45=19,0,IF(ISBLANK(B45),\"\",IF(B45<18,1,IF(B45=18,2,IF(B45>18,3)))))","v":3},{"$f":"IF(G45=19,3,IF(ISBLANK(B45),\"\",IF(B45=19,0,IF(D45<18,1,IF(D45=18,2,IF(D45>=20,3))))))","v":1},null,null,null,null,null,{"$f":"IF(B45>D45,A45&C45,IF(D45>B45,C45&A45,\"/\"))","v":"AEAH"},null,{"$f":"A45&C45","v":"AEAH"},{"$f":"E45","v":3},{"$f":"C45&A45","v":"AHAE"},{"$f":"F45","v":1},{"$f":"B45","v":20},{"$f":"D45","v":16}]
[]
["5 éme MATCH le ","à","AE"]
[null,null,null,null,null,null,"SI forfait éq recevante"]
["Equipes","score","Equipes","score","Points","Points"]
["AA",18,"AF",{"$f":"IF(G50=19,19,IF(ISBLANK(B50),\"\",IF(B50=19,0,36-B50)))","v":18},{"$f":"IF(G50=19,0,IF(ISBLANK(B50),\"\",IF(B50<18,1,IF(B50=18,2,IF(B50>18,3)))))","v":2},{"$f":"IF(G50=19,3,IF(ISBLANK(B50),\"\",IF(B50=19,0,IF(D50<18,1,IF(D50=18,2,IF(D50>=20,3))))))","v":2},null,null,null,null,null,{"$f":"IF(B50>D50,A50&C50,IF(D50>B50,C50&A50,\"/\"))","v":"/"},null,{"$f":"A50&C50","v":"AAAF"},{"$f":"E50","v":2},{"$f":"C50&A50","v":"AFAA"},{"$f":"F50","v":2},{"$f":"B50","v":18},{"$f":"D50","v":18}]
["AD",18,"AH",{"$f":"IF(G51=19,19,IF(ISBLANK(B51),\"\",IF(B51=19,0,36-B51)))","v":18},{"$f":"IF(G51=19,0,IF(ISBLANK(B51),\"\",IF(B51<18,1,IF(B51=18,2,IF(B51>18,3)))))","v":2},{"$f":"IF(G51=19,3,IF(ISBLANK(B51),\"\",IF(B51=19,0,IF(D51<18,1,IF(D51=18,2,IF(D51>=20,3))))))","v":2},null,null,null,null,null,{"$f":"IF(B51>D51,A51&C51,IF(D51>B51,C51&A51,\"/\"))","v":"/"},null,{"$f":"A51&C51","v":"ADAH"},{"$f":"E51","v":2},{"$f":"C51&A51","v":"AHAD"},{"$f":"F51","v":2},{"$f":"B51","v":18},{"$f":"D51","v":18}]
["AB",4,"AG",{"$f":"IF(G52=19,19,IF(ISBLANK(B52),\"\",IF(B52=19,0,36-B52)))","v":32},{"$f":"IF(G52=19,0,IF(ISBLANK(B52),\"\",IF(B52<18,1,IF(B52=18,2,IF(B52>18,3)))))","v":1},{"$f":"IF(G52=19,3,IF(ISBLANK(B52),\"\",IF(B52=19,0,IF(D52<18,1,IF(D52=18,2,IF(D52>=20,3))))))","v":3},null,null,null,null,null,{"$f":"IF(B52>D52,A52&C52,IF(D52>B52,C52&A52,\"/\"))","v":"AGAB"},null,{"$f":"A52&C52","v":"ABAG"},{"$f":"E52","v":1},{"$f":"C52&A52","v":"AGAB"},{"$f":"F52","v":3},{"$f":"B52","v":4},{"$f":"D52","v":32}]
["AC",20,"AE",{"$f":"IF(G53=19,19,IF(ISBLANK(B53),\"\",IF(B53=19,0,36-B53)))","v":16},{"$f":"IF(G53=19,0,IF(ISBLANK(B53),\"\",IF(B53<18,1,IF(B53=18,2,IF(B53>18,3)))))","v":3},{"$f":"IF(G53=19,3,IF(ISBLANK(B53),\"\",IF(B53=19,0,IF(D53<18,1,IF(D53=18,2,IF(D53>=20,3))))))","v":1},null,null,null,null,null,{"$f":"IF(B53>D53,A53&C53,IF(D53>B53,C53&A53,\"/\"))","v":"ACAE"},null,{"$f":"A53&C53","v":"ACAE"},{"$f":"E53","v":3},{"$f":"C53&A53","v":"AEAC"},{"$f":"F53","v":1},{"$f":"B53","v":20},{"$f":"D53","v":16}]
[]
["6 éme MATCH le ","à","AF"]
[null,null,null,null,null,null,"SI forfait éq recevante"]
["Equipes","score","Equipes","score","Points","Points"]
["AB",30,"AD",{"$f":"IF(G58=19,19,IF(ISBLANK(B58),\"\",IF(B58=19,0,36-B58)))","v":6},{"$f":"IF(G58=19,0,IF(ISBLANK(B58),\"\",IF(B58<18,1,IF(B58=18,2,IF(B58>18,3)))))","v":3},{"$f":"IF(G58=19,3,IF(ISBLANK(B58),\"\",IF(B58=19,0,IF(D58<18,1,IF(D58=18,2,IF(D58>=20,3))))))","v":1},null,null,null,null,null,{"$f":"IF(B58>D58,A58&C58,IF(D58>B58,C58&A58,\"/\"))","v":"ABAD"},null,{"$f":"A58&C58","v":"ABAD"},{"$f":"E58","v":3},{"$f":"C58&A58","v":"ADAB"},{"$f":"F58","v":1},{"$f":"B58","v":30},{"$f":"D58","v":6}]
["AE",24,"AA",{"$f":"IF(G59=19,19,IF(ISBLANK(B59),\"\",IF(B59=19,0,36-B59)))","v":12},{"$f":"IF(G59=19,0,IF(ISBLANK(B59),\"\",IF(B59<18,1,IF(B59=18,2,IF(B59>18,3)))))","v":3},{"$f":"IF(G59=19,3,IF(ISBLANK(B59),\"\",IF(B59=19,0,IF(D59<18,1,IF(D59=18,2,IF(D59>=20,3))))))","v":1},null,null,null,null,null,{"$f":"IF(B59>D59,A59&C59,IF(D59>B59,C59&A59,\"/\"))","v":"AEAA"},null,{"$f":"A59&C59","v":"AEAA"},{"$f":"E59","v":3},{"$f":"C59&A59","v":"AAAE"},{"$f":"F59","v":1},{"$f":"B59","v":24},{"$f":"D59","v":12}]
["AG",32,"AC",{"$f":"IF(G60=19,19,IF(ISBLANK(B60),\"\",IF(B60=19,0,36-B60)))","v":4},{"$f":"IF(G60=19,0,IF(ISBLANK(B60),\"\",IF(B60<18,1,IF(B60=18,2,IF(B60>18,3)))))","v":3},{"$f":"IF(G60=19,3,IF(ISBLANK(B60),\"\",IF(B60=19,0,IF(D60<18,1,IF(D60=18,2,IF(D60>=20,3))))))","v":1},null,null,null,null,null,{"$f":"IF(B60>D60,A60&C60,IF(D60>B60,C60&A60,\"/\"))","v":"AGAC"},null,{"$f":"A60&C60","v":"AGAC"},{"$f":"E60","v":3},{"$f":"C60&A60","v":"ACAG"},{"$f":"F60","v":1},{"$f":"B60","v":32},{"$f":"D60","v":4}]
["AF",22,"AH",{"$f":"IF(G61=19,19,IF(ISBLANK(B61),\"\",IF(B61=19,0,36-B61)))","v":14},{"$f":"IF(G61=19,0,IF(ISBLANK(B61),\"\",IF(B61<18,1,IF(B61=18,2,IF(B61>18,3)))))","v":3},{"$f":"IF(G61=19,3,IF(ISBLANK(B61),\"\",IF(B61=19,0,IF(D61<18,1,IF(D61=18,2,IF(D61>=20,3))))))","v":1},null,null,null,null,null,{"$f":"IF(B61>D61,A61&C61,IF(D61>B61,C61&A61,\"/\"))","v":"AFAH"},null,{"$f":"A61&C61","v":"AFAH"},{"$f":"E61","v":3},{"$f":"C61&A61","v":"AHAF"},{"$f":"F61","v":1},{"$f":"B61","v":22},{"$f":"D61","v":14}]
[]
["7 éme MATCH le","à","AG"]
[null,null,null,null,null,null,"SI forfait éq recevante",null," "]
["Equipes","score","Equipes","score","Points","Points"]
["AA",20,"AG",{"$f":"IF(G66=19,19,IF(ISBLANK(B66),\"\",IF(B66=19,0,36-B66)))","v":16},{"$f":"IF(G66=19,0,IF(ISBLANK(B66),\"\",IF(B66<18,1,IF(B66=18,2,IF(B66>18,3)))))","v":3},{"$f":"IF(G66=19,3,IF(ISBLANK(B66),\"\",IF(B66=19,0,IF(D66<18,1,IF(D66=18,2,IF(D66>=20,3))))))","v":1},null,null,null,null,null,{"$f":"IF(B66>D66,A66&C66,IF(D66>B66,C66&A66,\"/\"))","v":"AAAG"},null,{"$f":"A66&C66","v":"AAAG"},{"$f":"E66","v":3},{"$f":"C66&A66","v":"AGAA"},{"$f":"F66","v":1},{"$f":"B66","v":20},{"$f":"D66","v":16}]
["AB",12,"AF",{"$f":"IF(G67=19,19,IF(ISBLANK(B67),\"\",IF(B67=19,0,36-B67)))","v":24},{"$f":"IF(G67=19,0,IF(ISBLANK(B67),\"\",IF(B67<18,1,IF(B67=18,2,IF(B67>18,3)))))","v":1},{"$f":"IF(G67=19,3,IF(ISBLANK(B67),\"\",IF(B67=19,0,IF(D67<18,1,IF(D67=18,2,IF(D67>=20,3))))))","v":3},null,null,null,null,null,{"$f":"IF(B67>D67,A67&C67,IF(D67>B67,C67&A67,\"/\"))","v":"AFAB"},null,{"$f":"A67&C67","v":"ABAF"},{"$f":"E67","v":1},{"$f":"C67&A67","v":"AFAB"},{"$f":"F67","v":3},{"$f":"B67","v":12},{"$f":"D67","v":24}]
["AE",18,"AD",{"$f":"IF(G68=19,19,IF(ISBLANK(B68),\"\",IF(B68=19,0,36-B68)))","v":18},{"$f":"IF(G68=19,0,IF(ISBLANK(B68),\"\",IF(B68<18,1,IF(B68=18,2,IF(B68>18,3)))))","v":2},{"$f":"IF(G68=19,3,IF(ISBLANK(B68),\"\",IF(B68=19,0,IF(D68<18,1,IF(D68=18,2,IF(D68>=20,3))))))","v":2},null,null,null,null,null,{"$f":"IF(B68>D68,A68&C68,IF(D68>B68,C68&A68,\"/\"))","v":"/"},null,{"$f":"A68&C68","v":"AEAD"},{"$f":"E68","v":2},{"$f":"C68&A68","v":"ADAE"},{"$f":"F68","v":2},{"$f":"B68","v":18},{"$f":"D68","v":18}]
["AC",18,"AH",{"$f":"IF(G69=19,19,IF(ISBLANK(B69),\"\",IF(B69=19,0,36-B69)))","v":18},{"$f":"IF(G69=19,0,IF(ISBLANK(B69),\"\",IF(B69<18,1,IF(B69=18,2,IF(B69>18,3)))))","v":2},{"$f":"IF(G69=19,3,IF(ISBLANK(B69),\"\",IF(B69=19,0,IF(D69<18,1,IF(D69=18,2,IF(D69>=20,3))))))","v":2},null,null,null,null,null,{"$f":"IF(B69>D69,A69&C69,IF(D69>B69,C69&A69,\"/\"))","v":"/"},null,{"$f":"A69&C69","v":"ACAH"},{"$f":"E69","v":2},{"$f":"C69&A69","v":"AHAC"},{"$f":"F69","v":2},{"$f":"B69","v":18},{"$f":"D69","v":18}]
[null,null,"Si pas d'exaequo",null,null,null,"Classt        Final","Rencontres entre exaequos"]
["EQUIPES",null,"POINTS","POUR","CONTRE","DIFF",null,"POINTS Exaequos","Exaq","n°","AA","AB","AC","AD","AE","AF","AG","AH","Pts matchs",null,null,null,"1000000*Pts matchs +1000 (Diff +  abs(diff mini) )+Pour ","RANG","DIFF Exaequos","POUR Exaequos"]
["AF","1F",16,132,120,12,1,{"$f":"IF(S72>0,S72,\"\")","v":2},{"$f":"COUNTIF($C$72:$C$79,C72)","v":2},{"$f":"IF(AND(I72>1,COUNTIFS(I$72:I72,I72,C$72:C72,C72)=1),MAX(J$71:J71)+1,\"\")","v":1},{"$f":"IF($A72=K$71,\"\",IF(INDEX($C$72:$C$79,MATCH(K$71,$A$72:$A$79,0))=$C72,IFERROR(VLOOKUP($A72&K$71,$N$18:$O$69,2,0),  VLOOKUP(K$71&$A72,$N$18:$Q$69,4,0)),          \"\"))","v":2},"","","","","","","",{"$f":"SUM(K72:R72)","v":2},null,null,null,{"$f":"IF(I72<3,S72*1000000+(F72+ABS(MIN($F$72:$F$79)))*1000+D72,S72*1000000+U96*1000+Z72)","v":2072132},{"$f":"IF(I72>2,RANK(W72,OFFSET(W$71,MATCH(I72,$I$72:$I$79,0),,I72)))","v":false},{"$f":"IF(S96=0,\"\",S96)","v":""},{"$f":"IF(S80=0,\"\",S80)","v":18}]
["AA","1A",16,126,126,0,2,{"$f":"IF(S73>0,S73,\"\")","v":2},2,{"$f":"IF(AND(I73>1,COUNTIFS(I$72:I73,I73,C$72:C73,C73)=1),MAX(J$71:J72)+1,\"\")","v":""},"","","","","",2,"","",{"$f":"SUM(K73:R73)","v":2},null,null,null,{"$f":"IF(I73<3,S73*1000000+(F73+ABS(MIN($F$72:$F$79)))*1000+D73,S73*1000000+U97*1000+Z73)","v":2060126},{"$f":"IF(I73>2,RANK(W73,OFFSET(W$71,MATCH(I73,$I$72:$I$79,0),,I73)))","v":false},"",18]
["AE","1E",15,140,112,28,3,{"$f":"IF(S74>0,S74,\"\")","v":3},2,{"$f":"IF(AND(I74>1,COUNTIFS(I$72:I74,I74,C$72:C74,C74)=1),MAX(J$71:J73)+1,\"\")","v":2},"","","","","","",3,"",3,null,null,null,{"$f":"IF(I74<3,S74*1000000+(F74+ABS(MIN($F$72:$F$79)))*1000+D74,S74*1000000+U98*1000+Z74)","v":3088140},false,20,28]
["AG","1G",15,150,102,48,4,{"$f":"IF(S75>0,S75,\"\")","v":1},2,{"$f":"IF(AND(I75>1,COUNTIFS(I$72:I75,I75,C$72:C75,C75)=1),MAX(J$71:J74)+1,\"\")","v":""},"","","","",1,"","","",1,null,null,null,1108150,false,-20,8]
["AB","1B",14,132,120,12,5,{"$f":"IF(S76>0,S76,\"\")","v":3},2,{"$f":"IF(AND(I76>1,COUNTIFS(I$72:I76,I76,C$72:C76,C76)=1),MAX(J$71:J75)+1,\"\")","v":3},"","",3,"","","","","",3,null,null,null,3072132,false,28,32]
["AC","1C",14,112,140,-28,6,{"$f":"IF(S77>0,S77,\"\")","v":1},2,{"$f":"IF(AND(I77>1,COUNTIFS(I$72:I77,I77,C$72:C77,C77)=1),MAX(J$71:J76)+1,\"\")","v":""},"",1,"","","","","","",1,null,null,null,1032112,false,-28,4]
["AH","1H",12,120,132,-12,7,{"$f":"IF(S78>0,S78,\"\")","v":""},1,{"$f":"IF(AND(I78>1,COUNTIFS(I$72:I78,I78,C$72:C78,C78)=1),MAX(J$71:J77)+1,\"\")","v":""},"","","","","","","","",0,null,null,null,48120,false,"",""]
["AD","1D",10,96,156,-60,8,{"$f":"IF(S79>0,S79,\"\")","v":""},1,{"$f":"IF(AND(I79>1,COUNTIFS(I$72:I79,I79,C$72:C79,C79)=1),MAX(J$71:J78)+1,\"\")","v":""},"","","","","","","","",0,null,null,null,96,false,"",""]
[null,null,null,null,null,null,null,null,"POUR",{"$f":"A72","v":"AF"},{"$f":"IF($A72=K$71,\"\",IF(INDEX($C$72:$C$79,MATCH(K$71,$A$72:$A$79,0))=$C72,IFERROR(VLOOKUP($A72&K$71,$N$18:$R$69,5,0),  VLOOKUP(K$71&$A72,$N$18:$S$69,6,0)),          \"\"))","v":18},"","","","","","","",18]
[null,null,null,null,null,null,null,null,null,"AA","","","","","",18,"","",18]
[null,null,null,null,null,null,null,null,null,"AE","","","","","","",28,"",28]
[null,null,null,null,null,null,null,null,null,"AG","","","","",8,"","","",8]
[null,null,null,null,null,null,null,null,null,"AB","","",32,"","","","","",32,null,null,null,null,null,"  "]
[null,null,null,null,null,null,null,null,null,"AC","",4,"","","","","","",4]
[null,null,null,null,null,null,null,null,null,"AH","","","","","","","","",0]
[null,null,null,null,null,null,null,null,null,"AD","","","","","","","","",0]
[null,null,null,null,null,null,null,null,"CONTRE",{"$f":"J80","v":"AF"},{"$f":"INDEX($K$80:$R$87,MATCH(K$71,$J$80:$J$87,0),MATCH($J80,$K$71:$R$71,0))","v":18},{"$f":"INDEX($K$80:$R$87,MATCH(L$71,$J$80:$J$87,0),MATCH($J80,$K$71:$R$71,0))","v":""},"","","","","","",18]
[null,null,null,null,null,null,null,null,null,{"$f":"J81","v":"AA"},{"$f":"INDEX($K$80:$R$87,MATCH(K$71,$J$80:$J$87,0),MATCH($J81,$K$71:$R$71,0))","v":""},"","","","",18,"","",18]
[null,null,null,null,null,null,null,null,null,"AE","","","","","","",8,"",8]
[null,null,null,null,null,null,null,null,null,"AG","","","","",28,"","","",28]
[null,null,null,null,null,null,null,null,null,"AB","","",4,"","","","","",4]
[null,null,null,null,null,null,null,null,null,"AC","",32,"","","","","","",32]
[null,null,null,null,null,null,null,null,null,"AH","","","","","","","","",0]
[null,null,null,null,null,null,null,null,null,"AD","","","","","","","","",0,null,"Diff pondérée"]
[null,null,null,null,null,null,null,null,"DIFF",{"$f":"J88","v":"AF"},null,null,null,null,null,null,null,null,{"$f":"S80-S88","v":0},null,{"$f":"S96+ABS(MIN($S$96:$S$103))","v":28}]
[null,null,null,null,null,null,null,null,null,{"$f":"J89","v":"AA"},null,null,null,null,null,null,null,null,{"$f":"S81-S89","v":0},null,28]
[null,null,null,null,null,null,null,null,null,"AE",null,null,null,null,null,null,null,null,20,null,48]
[null,null,null,null,null,null,null,null,null,"AG",null,null,null,null,null,null,null,null,-20,null,8]
[null,null,null,null,null,null,null,null,null,"AB",null,null,null,null,null,null,null,null,28,null,56]
[null,null,null,null,null,null,null,null,null,"AC",null,null,null,null,null,null,null,null,-28,null,0]
[null,null,null,null,null,null,null,null,null,"AH",null,null,null,null,null,null,null,null,0,null,{"$f":"S102+ABS(MIN($S$96:$S$103))","v":28}]
[null,null,null,null,null,null,null,null,null,"AD",null,null,null,null,null,null,null,null,0,null,{"$f":"S103+ABS(MIN($S$96:$S$103))","v":28}]

{"sheet":"P15","index":14,"n_rows":103,"n_cols":26,"rows_kept":103,"cut":false,"hidden":false,"merged":[[0,0,0,5],[1,0,1,5],[2,0,2,5],[3,0,3,5],[3,8,3,10],[15,6,16,6],[69,2,69,5],[69,6,70,6],[69,7,69,25],[23,6,24,6],[31,6,32,6],[39,6,40,6],[47,6,48,6],[55,6,56,6],[63,6,64,6]]}
[null,null,null,null,null,null,3]
["CHAMPIONNAT DES CLUBS"]
[]
["POULE 1"]
["EQUIPES",null,"POINTS","Pour","Contre","Diff"]
["AA","1A",{"$f":"SUMIF($A$18:$A$69,A6,$E$18:$E$69)+SUMIF($C$18:$C$69,A6,$F$18:$F$69)","v":15},{"$f":"SUMIF($A$18:$A$69,$A6,$B$18:$B$69)+SUMIF($C$18:$C$69,$A6,$D$18:$D$69)","v":124},{"$f":"SUMIF($C$18:$C$69,$A6,$B$18:$B$69)+SUMIF($A$18:$A$69,$A6,$D$18:$D$69)","v":128},{"$f":"D6-E6","v":-4}]
["AB","1B",{"$f":"SUMIF($A$18:$A$69,A7,$E$18:$E$69)+SUMIF($C$18:$C$69,A7,$F$18:$F$69)","v":15},{"$f":"SUMIF($A$18:$A$69,$A7,$B$18:$B$69)+SUMIF($C$18:$C$69,$A7,$D$18:$D$69)","v":132},{"$f":"SUMIF($C$18:$C$69,$A7,$B$18:$B$69)+SUMIF($A$18:$A$69,$A7,$D$18:$D$69)","v":120},12]
["AC","1C",{"$f":"SUMIF($A$18:$A$69,A8,$E$18:$E$69)+SUMIF($C$18:$C$69,A8,$F$18:$F$69)","v":17},136,116,20]
["AD","1D",13,132,120,12]
["AE","1E",16,144,108,36]
["AF","1F",15,128,124,4]
["AG","1G",11,106,146,{"$f":"D12-E12","v":-40}]
["AH","1H",10,{"$f":"SUMIF($A$18:$A$69,$A13,$B$18:$B$69)+SUMIF($C$18:$C$69,$A13,$D$18:$D$69)","v":106},146,{"$f":"D13-E13","v":-40}]
[]
["1er MATCH le ","à","AA"]
[null,null,null,null,null,null,"SI forfait éq recevante"]
["Equipes","score","Equipes","score","Points","Points"]
["AA",16,"AB",{"$f":"IF(G18=19,19,IF(ISBLANK(B18),\"\",IF(B18=19,0,36-B18)))","v":20},{"$f":"IF(G18=19,0,IF(ISBLANK(B18),\"\",IF(B18<18,1,IF(B18=18,2,IF(B18>18,3)))))","v":1},{"$f":"IF(G18=19,3,IF(ISBLANK(B18),\"\",IF(B18=19,0,IF(D18<18,1,IF(D18=18,2,IF(D18>=20,3))))))","v":3},null,null,null,null,null,{"$f":"IF(B18>D18,A18&C18,IF(D18>B18,C18&A18,\"/\"))","v":"ABAA"},null,{"$f":"A18&C18","v":"AAAB"},{"$f":"E18","v":1},{"$f":"C18&A18","v":"ABAA"},{"$f":"F18","v":3},{"$f":"B18","v":16},{"$f":"D18","v":20}]
["AC",30,"AD",{"$f":"IF(G19=19,19,IF(ISBLANK(B19),\"\",IF(B19=19,0,36-B19)))","v":6},{"$f":"IF(G19=19,0,IF(ISBLANK(B19),\"\",IF(B19<18,1,IF(B19=18,2,IF(B19>18,3)))))","v":3},{"$f":"IF(G19=19,3,IF(ISBLANK(B19),\"\",IF(B19=19,0,IF(D19<18,1,IF(D19=18,2,IF(D19>=20,3))))))","v":1},null,null,null,null,null,{"$f":"IF(B19>D19,A19&C19,IF(D19>B19,C19&A19,\"/\"))","v":"ACAD"},null,{"$f":"A19&C19","v":"ACAD"},{"$f":"E19","v":3},{"$f":"C19&A19","v":"ADAC"},{"$f":"F19","v":1},{"$f":"B19","v":30},{"$f":"D19","v":6}]
["AE",16,"AF",{"$f":"IF(G20=19,19,IF(ISBLANK(B20),\"\",IF(B20=19,0,36-B20)))","v":20},{"$f":"IF(G20=19,0,IF(ISBLANK(B20),\"\",IF(B20<18,1,IF(B20=18,2,IF(B20>18,3)))))","v":1},{"$f":"IF(G20=19,3,IF(ISBLANK(B20),\"\",IF(B20=19,0,IF(D20<18,1,IF(D20=18,2,IF(D20>=20,3))))))","v":3},null,null,null,null,null,{"$f":"IF(B20>D20,A20&C20,IF(D20>B20,C20&A20,\"/\"))","v":"AFAE"},null,{"$f":"A20&C20","v":"AEAF"},{"$f":"E20","v":1},{"$f":"C20&A20","v":"AFAE"},{"$f":"F20","v":3},{"$f":"B20","v":16},{"$f":"D20","v":20}]
["AG",18,"AH",{"$f":"IF(G21=19,19,IF(ISBLANK(B21),\"\",IF(B21=19,0,36-B21)))","v":18},{"$f":"IF(G21=19,0,IF(ISBLANK(B21),\"\",IF(B21<18,1,IF(B21=18,2,IF(B21>18,3)))))","v":2},{"$f":"IF(G21=19,3,IF(ISBLANK(B21),\"\",IF(B21=19,0,IF(D21<18,1,IF(D21=18,2,IF(D21>=20,3))))))","v":2},null,null,null,null,null,{"$f":"IF(B21>D21,A21&C21,IF(D21>B21,C21&A21,\"/\"))","v":"/"},null,{"$f":"A21&C21","v":"AGAH"},{"$f":"E21","v":2},{"$f":"C21&A21","v":"AHAG"},{"$f":"F21","v":2},{"$f":"B21","v":18},{"$f":"D21","v":18}]
[]
["2 éme MATCH le ","à","AB"]
[null,null,null,null,null,null,"SI forfait éq recevante"]
["Equipes","score","Equipes","score","Points","Points"]
["AA",18,"AC",{"$f":"IF(G26=19,19,IF(ISBLANK(B26),\"\",IF(B26=19,0,36-B26)))","v":18},{"$f":"IF(G26=19,0,IF(ISBLANK(B26),\"\",IF(B26<18,1,IF(B26=18,2,IF(B26>18,3)))))","v":2},{"$f":"IF(G26=19,3,IF(ISBLANK(B26),\"\",IF(B26=19,0,IF(D26<18,1,IF(D26=18,2,IF(D26>=20,3))))))","v":2},null,null,null,null,null,{"$f":"IF(B26>D26,A26&C26,IF(D26>B26,C26&A26,\"/\"))","v":"/"},null,{"$f":"A26&C26","v":"AAAC"},{"$f":"E26","v":2},{"$f":"C26&A26","v":"ACAA"},{"$f":"F26","v":2},{"$f":"B26","v":18},{"$f":"D26","v":18}]
["AB",18,"AH",{"$f":"IF(G27=19,19,IF(ISBLANK(B27),\"\",IF(B27=19,0,36-B27)))","v":18},{"$f":"IF(G27=19,0,IF(ISBLANK(B27),\"\",IF(B27<18,1,IF(B27=18,2,IF(B27>18,3)))))","v":2},{"$f":"IF(G27=19,3,IF(ISBLANK(B27),\"\",IF(B27=19,0,IF(D27<18,1,IF(D27=18,2,IF(D27>=20,3))))))","v":2},null,null,null,null,null,{"$f":"IF(B27>D27,A27&C27,IF(D27>B27,C27&A27,\"/\"))","v":"/"},null,{"$f":"A27&C27","v":"ABAH"},{"$f":"E27","v":2},{"$f":"C27&A27","v":"AHAB"},{"$f":"F27","v":2},{"$f":"B27","v":18},{"$f":"D27","v":18}]
["AD",18,"AF",{"$f":"IF(G28=19,19,IF(ISBLANK(B28),\"\",IF(B28=19,0,36-B28)))","v":18},{"$f":"IF(G28=19,0,IF(ISBLANK(B28),\"\",IF(B28<18,1,IF(B28=18,2,IF(B28>18,3)))))","v":2},{"$f":"IF(G28=19,3,IF(ISBLANK(B28),\"\",IF(B28=19,0,IF(D28<18,1,IF(D28=18,2,IF(D28>=20,3))))))","v":2},null,null,null,null,null,{"$f":"IF(B28>D28,A28&C28,IF(D28>B28,C28&A28,\"/\"))","v":"/"},null,{"$f":"A28&C28","v":"ADAF"},{"$f":"E28","v":2},{"$f":"C28&A28","v":"AFAD"},{"$f":"F28","v":2},{"$f":"B28","v":18},{"$f":"D28","v":18}]
["AE",28,"AG",{"$f":"IF(G29=19,19,IF(ISBLANK(B29),\"\",IF(B29=19,0,36-B29)))","v":8},{"$f":"IF(G29=19,0,IF(ISBLANK(B29),\"\",IF(B29<18,1,IF(B29=18,2,IF(B29>18,3)))))","v":3},{"$f":"IF(G29=19,3,IF(ISBLANK(B29),\"\",IF(B29=19,0,IF(D29<18,1,IF(D29=18,2,IF(D29>=20,3))))))","v":1},null,null,null,null,null,{"$f":"IF(B29>D29,A29&C29,IF(D29>B29,C29&A29,\"/\"))","v":"AEAG"},null,{"$f":"A29&C29","v":"AEAG"},{"$f":"E29","v":3},{"$f":"C29&A29","v":"AGAE"},{"$f":"F29","v":1},{"$f":"B29","v":28},{"$f":"D29","v":8}]
[]
["3 éme MATCH le ","à","AC"]
[null,null,null,null,null,null,"SI forfait éq recevante"]
["Equipes","score","Equipes","score","Points","Points"]
["AA",20,"AH",{"$f":"IF(G34=19,19,IF(ISBLANK(B34),\"\",IF(B34=19,0,36-B34)))","v":16},{"$f":"IF(G34=19,0,IF(ISBLANK(B34),\"\",IF(B34<18,1,IF(B34=18,2,IF(B34>18,3)))))","v":3},{"$f":"IF(G34=19,3,IF(ISBLANK(B34),\"\",IF(B34=19,0,IF(D34<18,1,IF(D34=18,2,IF(D34>=20,3))))))","v":1},null,null,null,null,null,{"$f":"IF(B34>D34,A34&C34,IF(D34>B34,C34&A34,\"/\"))","v":"AAAH"},null,{"$f":"A34&C34","v":"AAAH"},{"$f":"E34","v":3},{"$f":"C34&A34","v":"AHAA"},{"$f":"F34","v":1},{"$f":"B34","v":20},{"$f":"D34","v":16}]
["AB",18,"AE",{"$f":"IF(G35=19,19,IF(ISBLANK(B35),\"\",IF(B35=19,0,36-B35)))","v":18},{"$f":"IF(G35=19,0,IF(ISBLANK(B35),\"\",IF(B35<18,1,IF(B35=18,2,IF(B35>18,3)))))","v":2},{"$f":"IF(G35=19,3,IF(ISBLANK(B35),\"\",IF(B35=19,0,IF(D35<18,1,IF(D35=18,2,IF(D35>=20,3))))))","v":2},null,null,null,null,null,{"$f":"IF(B35>D35,A35&C35,IF(D35>B35,C35&A35,\"/\"))","v":"/"},null,{"$f":"A35&C35","v":"ABAE"},{"$f":"E35","v":2},{"$f":"C35&A35","v":"AEAB"},{"$f":"F35","v":2},{"$f":"B35","v":18},{"$f":"D35","v":18}]
["AC",20,"AF",{"$f":"IF(G36=19,19,IF(ISBLANK(B36),\"\",IF(B36=19,0,36-B36)))","v":16},{"$f":"IF(G36=19,0,IF(ISBLANK(B36),\"\",IF(B36<18,1,IF(B36=18,2,IF(B36>18,3)))))","v":3},{"$f":"IF(G36=19,3,IF(ISBLANK(B36),\"\",IF(B36=19,0,IF(D36<18,1,IF(D36=18,2,IF(D36>=20,3))))))","v":1},null,null,null,null,null,{"$f":"IF(B36>D36,A36&C36,IF(D36>B36,C36&A36,\"/\"))","v":"ACAF"},null,{"$f":"A36&C36","v":"ACAF"},{"$f":"E36","v":3},{"$f":"C36&A36","v":"AFAC"},{"$f":"F36","v":1},{"$f":"B36","v":20},{"$f":"D36","v":16}]
["AD",18,"AG",{"$f":"IF(G37=19,19,IF(ISBLANK(B37),\"\",IF(B37=19,0,36-B37)))","v":18},{"$f":"IF(G37=19,0,IF(ISBLANK(B37),\"\",IF(B37<18,1,IF(B37=18,2,IF(B37>18,3)))))","v":2},{"$f":"IF(G37=19,3,IF(ISBLANK(B37),\"\",IF(B37=19,0,IF(D37<18,1,IF(D37=18,2,IF(D37>=20,3))))))","v":2},null,null,null,null,null,{"$f":"IF(B37>D37,A37&C37,IF(D37>B37,C37&A37,\"/\"))","v":"/"},null,{"$f":"A37&C37","v":"ADAG"},{"$f":"E37","v":2},{"$f":"C37&A37","v":"AGAD"},{"$f":"F37","v":2},{"$f":"B37","v":18},{"$f":"D37","v":18}]
[]
["4 éme MATCH le ","à","AD"]
[null,null,null,null,null,null,"SI forfait éq recevante"]
["Equipes","score","Equipes","score","Points","Points"]
["AA",20,"AD",{"$f":"IF(G42=19,19,IF(ISBLANK(B42),\"\",IF(B42=19,0,36-B42)))","v":16},{"$f":"IF(G42=19,0,IF(ISBLANK(B42),\"\",IF(B42<18,1,IF(B42=18,2,IF(B42>18,3)))))","v":3},{"$f":"IF(G42=19,3,IF(ISBLANK(B42),\"\",IF(B42=19,0,IF(D42<18,1,IF(D42=18,2,IF(D42>=20,3))))))","v":1},null,null,null,null,null,{"$f":"IF(B42>D42,A42&C42,IF(D42>B42,C42&A42,\"/\"))","v":"AAAD"},null,{"$f":"A42&C42","v":"AAAD"},{"$f":"E42","v":3},{"$f":"C42&A42","v":"ADAA"},{"$f":"F42","v":1},{"$f":"B42","v":20},{"$f":"D42","v":16}]
["AF",10,"AG",{"$f":"IF(G43=19,19,IF(ISBLANK(B43),\"\",IF(B43=19,0,36-B43)))","v":26},{"$f":"IF(G43=19,0,IF(ISBLANK(B43),\"\",IF(B43<18,1,IF(B43=18,2,IF(B43>18,3)))))","v":1},{"$f":"IF(G43=19,3,IF(ISBLANK(B43),\"\",IF(B43=19,0,IF(D43<18,1,IF(D43=18,2,IF(D43>=20,3))))))","v":3},null,null,null,null,null,{"$f":"IF(B43>D43,A43&C43,IF(D43>B43,C43&A43,\"/\"))","v":"AGAF"},null,{"$f":"A43&C43","v":"AFAG"},{"$f":"E43","v":1},{"$f":"C43&A43","v":"AGAF"},{"$f":"F43","v":3},{"$f":"B43","v":10},{"$f":"D43","v":26}]
["AB",32,"AC",{"$f":"IF(G44=19,19,IF(ISBLANK(B44),\"\",IF(B44=19,0,36-B44)))","v":4},{"$f":"IF(G44=19,0,IF(ISBLANK(B44),\"\",IF(B44<18,1,IF(B44=18,2,IF(B44>18,3)))))","v":3},{"$f":"IF(G44=19,3,IF(ISBLANK(B44),\"\",IF(B44=19,0,IF(D44<18,1,IF(D44=18,2,IF(D44>=20,3))))))","v":1},null,null,null,null,null,{"$f":"IF(B44>D44,A44&C44,IF(D44>B44,C44&A44,\"/\"))","v":"ABAC"},null,{"$f":"A44&C44","v":"ABAC"},{"$f":"E44","v":3},{"$f":"C44&A44","v":"ACAB"},{"$f":"F44","v":1},{"$f":"B44","v":32},{"$f":"D44","v":4}]
["AE",20,"AH",{"$f":"IF(G45=19,19,IF(ISBLANK(B45),\"\",IF(B45=19,0,36-B45)))","v":16},{"$f":"IF(G45=19,0,IF(ISBLANK(B45),\"\",IF(B45<18,1,IF(B45=18,2,IF(B45>18,3)))))","v":3},{"$f":"IF(G45=19,3,IF(ISBLANK(B45),\"\",IF(B45=19,0,IF(D45<18,1,IF(D45=18,2,IF(D45>=20,3))))))","v":1},null,null,null,null,null,{"$f":"IF(B45>D45,A45&C45,IF(D45>B45,C45&A45,\"/\"))","v":"AEAH"},null,{"$f":"A45&C45","v":"AEAH"},{"$f":"E45","v":3},{"$f":"C45&A45","v":"AHAE"},{"$f":"F45","v":1},{"$f":"B45","v":20},{"$f":"D45","v":16}]
[]
["5 éme MATCH le ","à","AE"]
[null,null,null,null,null,null,"SI forfait éq recevante"]
["Equipes","score","Equipes","score","Points","Points"]
["AA",18,"AF",{"$f":"IF(G50=19,19,IF(ISBLANK(B50),\"\",IF(B50=19,0,36-B50)))","v":18},{"$f":"IF(G50=19,0,IF(ISBLANK(B50),\"\",IF(B50<18,1,IF(B50=18,2,IF(B50>18,3)))))","v":2},{"$f":"IF(G50=19,3,IF(ISBLANK(B50),\"\",IF(B50=19,0,IF(D50<18,1,IF(D50=18,2,IF(D50>=20,3))))))","v":2},null,null,null,null,null,{"$f":"IF(B50>D50,A50&C50,IF(D50>B50,C50&A50,\"/\"))","v":"/"},null,{"$f":"A50&C50","v":"AAAF"},{"$f":"E50","v":2},{"$f":"C50&A50","v":"AFAA"},{"$f":"F50","v":2},{"$f":"B50","v":18},{"$f":"D50","v":18}]
["AD",30,"AH",{"$f":"IF(G51=19,19,IF(ISBLANK(B51),\"\",IF(B51=19,0,36-B51)))","v":6},{"$f":"IF(G51=19,0,IF(ISBLANK(B51),\"\",IF(B51<18,1,IF(B51=18,2,IF(B51>18,3)))))","v":3},{"$f":"IF(G51=19,3,IF(ISBLANK(B51),\"\",IF(B51=19,0,IF(D51<18,1,IF(D51=18,2,IF(D51>=20,3))))))","v":1},null,null,null,null,null,{"$f":"IF(B51>D51,A51&C51,IF(D51>B51,C51&A51,\"/\"))","v":"ADAH"},null,{"$f":"A51&C51","v":"ADAH"},{"$f":"E51","v":3},{"$f":"C51&A51","v":"AHAD"},{"$f":"F51","v":1},{"$f":"B51","v":30},{"$f":"D51","v":6}]
["AB",26,"AG",{"$f":"IF(G52=19,19,IF(ISBLANK(B52),\"\",IF(B52=19,0,36-B52)))","v":10},{"$f":"IF(G52=19,0,IF(ISBLANK(B52),\"\",IF(B52<18,1,IF(B52=18,2,IF(B52>18,3)))))","v":3},{"$f":"IF(G52=19,3,IF(ISBLANK(B52),\"\",IF(B52=19,0,IF(D52<18,1,IF(D52=18,2,IF(D52>=20,3))))))","v":1},null,null,null,null,null,{"$f":"IF(B52>D52,A52&C52,IF(D52>B52,C52&A52,\"/\"))","v":"ABAG"},null,{"$f":"A52&C52","v":"ABAG"},{"$f":"E52","v":3},{"$f":"C52&A52","v":"AGAB"},{"$f":"F52","v":1},{"$f":"B52","v":26},{"$f":"D52","v":10}]
["AC",20,"AE",{"$f":"IF(G53=19,19,IF(ISBLANK(B53),\"\",IF(B53=19,0,36-B53)))","v":16},{"$f":"IF(G53=19,0,IF(ISBLANK(B53),\"\",IF(B53<18,1,IF(B53=18,2,IF(B53>18,3)))))","v":3},{"$f":"IF(G53=19,3,IF(ISBLANK(B53),\"\",IF(B53=19,0,IF(D53<18,1,IF(D53=18,2,IF(D53>=20,3))))))","v":1},null,null,null,null,null,{"$f":"IF(B53>D53,A53&C53,IF(D53>B53,C53&A53,\"/\"))","v":"ACAE"},null,{"$f":"A53&C53","v":"ACAE"},{"$f":"E53","v":3},{"$f":"C53&A53","v":"AEAC"},{"$f":"F53","v":1},{"$f":"B53","v":20},{"$f":"D53","v":16}]
[]
["6 éme MATCH le ","à","AF"]
[null,null,null,null,null,null,"SI forfait éq recevante"]
["Equipes","score","Equipes","score","Points","Points"]
["AB",6,"AD",{"$f":"IF(G58=19,19,IF(ISBLANK(B58),\"\",IF(B58=19,0,36-B58)))","v":30},{"$f":"IF(G58=19,0,IF(ISBLANK(B58),\"\",IF(B58<18,1,IF(B58=18,2,IF(B58>18,3)))))","v":1},{"$f":"IF(G58=19,3,IF(ISBLANK(B58),\"\",IF(B58=19,0,IF(D58<18,1,IF(D58=18,2,IF(D58>=20,3))))))","v":3},null,null,null,null,null,{"$f":"IF(B58>D58,A58&C58,IF(D58>B58,C58&A58,\"/\"))","v":"ADAB"},null,{"$f":"A58&C58","v":"ABAD"},{"$f":"E58","v":1},{"$f":"C58&A58","v":"ADAB"},{"$f":"F58","v":3},{"$f":"B58","v":6},{"$f":"D58","v":30}]
["AE",24,"AA",{"$f":"IF(G59=19,19,IF(ISBLANK(B59),\"\",IF(B59=19,0,36-B59)))","v":12},{"$f":"IF(G59=19,0,IF(ISBLANK(B59),\"\",IF(B59<18,1,IF(B59=18,2,IF(B59>18,3)))))","v":3},{"$f":"IF(G59=19,3,IF(ISBLANK(B59),\"\",IF(B59=19,0,IF(D59<18,1,IF(D59=18,2,IF(D59>=20,3))))))","v":1},null,null,null,null,null,{"$f":"IF(B59>D59,A59&C59,IF(D59>B59,C59&A59,\"/\"))","v":"AEAA"},null,{"$f":"A59&C59","v":"AEAA"},{"$f":"E59","v":3},{"$f":"C59&A59","v":"AAAE"},{"$f":"F59","v":1},{"$f":"B59","v":24},{"$f":"D59","v":12}]
["AG",10,"AC",{"$f":"IF(G60=19,19,IF(ISBLANK(B60),\"\",IF(B60=19,0,36-B60)))","v":26},{"$f":"IF(G60=19,0,IF(ISBLANK(B60),\"\",IF(B60<18,1,IF(B60=18,2,IF(B60>18,3)))))","v":1},{"$f":"IF(G60=19,3,IF(ISBLANK(B60),\"\",IF(B60=19,0,IF(D60<18,1,IF(D60=18,2,IF(D60>=20,3))))))","v":3},null,null,null,null,null,{"$f":"IF(B60>D60,A60&C60,IF(D60>B60,C60&A60,\"/\"))","v":"ACAG"},null,{"$f":"A60&C60","v":"AGAC"},{"$f":"E60","v":1},{"$f":"C60&A60","v":"ACAG"},{"$f":"F60","v":3},{"$f":"B60","v":10},{"$f":"D60","v":26}]
["AF",22,"AH",{"$f":"IF(G61=19,19,IF(ISBLANK(B61),\"\",IF(B61=19,0,36-B61)))","v":14},{"$f":"IF(G61=19,0,IF(ISBLANK(B61),\"\",IF(B61<18,1,IF(B61=18,2,IF(B61>18,3)))))","v":3},{"$f":"IF(G61=19,3,IF(ISBLANK(B61),\"\",IF(B61=19,0,IF(D61<18,1,IF(D61=18,2,IF(D61>=20,3))))))","v":1},null,null,null,null,null,{"$f":"IF(B61>D61,A61&C61,IF(D61>B61,C61&A61,\"/\"))","v":"AFAH"},null,{"$f":"A61&C61","v":"AFAH"},{"$f":"E61","v":3},{"$f":"C61&A61","v":"AHAF"},{"$f":"F61","v":1},{"$f":"B61","v":22},{"$f":"D61","v":14}]
[]
["7 éme MATCH le","à","AG"]
[null,null,null,null,null,null,"SI forfait éq recevante",null," "]
["Equipes","score","Equipes","score","Points","Points"]
["AA",20,"AG",{"$f":"IF(G66=19,19,IF(ISBLANK(B66),\"\",IF(B66=19,0,36-B66)))","v":16},{"$f":"IF(G66=19,0,IF(ISBLANK(B66),\"\",IF(B66<18,1,IF(B66=18,2,IF(B66>18,3)))))","v":3},{"$f":"IF(G66=19,3,IF(ISBLANK(B66),\"\",IF(B66=19,0,IF(D66<18,1,IF(D66=18,2,IF(D66>=20,3))))))","v":1},null,null,null,null,null,{"$f":"IF(B66>D66,A66&C66,IF(D66>B66,C66&A66,\"/\"))","v":"AAAG"},null,{"$f":"A66&C66","v":"AAAG"},{"$f":"E66","v":3},{"$f":"C66&A66","v":"AGAA"},{"$f":"F66","v":1},{"$f":"B66","v":20},{"$f":"D66","v":16}]
["AB",12,"AF",{"$f":"IF(G67=19,19,IF(ISBLANK(B67),\"\",IF(B67=19,0,36-B67)))","v":24},{"$f":"IF(G67=19,0,IF(ISBLANK(B67),\"\",IF(B67<18,1,IF(B67=18,2,IF(B67>18,3)))))","v":1},{"$f":"IF(G67=19,3,IF(ISBLANK(B67),\"\",IF(B67=19,0,IF(D67<18,1,IF(D67=18,2,IF(D67>=20,3))))))","v":3},null,null,null,null,null,{"$f":"IF(B67>D67,A67&C67,IF(D67>B67,C67&A67,\"/\"))","v":"AFAB"},null,{"$f":"A67&C67","v":"ABAF"},{"$f":"E67","v":1},{"$f":"C67&A67","v":"AFAB"},{"$f":"F67","v":3},{"$f":"B67","v":12},{"$f":"D67","v":24}]
["AE",22,"AD",{"$f":"IF(G68=19,19,IF(ISBLANK(B68),\"\",IF(B68=19,0,36-B68)))","v":14},{"$f":"IF(G68=19,0,IF(ISBLANK(B68),\"\",IF(B68<18,1,IF(B68=18,2,IF(B68>18,3)))))","v":3},{"$f":"IF(G68=19,3,IF(ISBLANK(B68),\"\",IF(B68=19,0,IF(D68<18,1,IF(D68=18,2,IF(D68>=20,3))))))","v":1},null,null,null,null,null,{"$f":"IF(B68>D68,A68&C68,IF(D68>B68,C68&A68,\"/\"))","v":"AEAD"},null,{"$f":"A68&C68","v":"AEAD"},{"$f":"E68","v":3},{"$f":"C68&A68","v":"ADAE"},{"$f":"F68","v":1},{"$f":"B68","v":22},{"$f":"D68","v":14}]
["AC",18,"AH",{"$f":"IF(G69=19,19,IF(ISBLANK(B69),\"\",IF(B69=19,0,36-B69)))","v":18},{"$f":"IF(G69=19,0,IF(ISBLANK(B69),\"\",IF(B69<18,1,IF(B69=18,2,IF(B69>18,3)))))","v":2},{"$f":"IF(G69=19,3,IF(ISBLANK(B69),\"\",IF(B69=19,0,IF(D69<18,1,IF(D69=18,2,IF(D69>=20,3))))))","v":2},null,null,null,null,null,{"$f":"IF(B69>D69,A69&C69,IF(D69>B69,C69&A69,\"/\"))","v":"/"},null,{"$f":"A69&C69","v":"ACAH"},{"$f":"E69","v":2},{"$f":"C69&A69","v":"AHAC"},{"$f":"F69","v":2},{"$f":"B69","v":18},{"$f":"D69","v":18}]
[null,null,"Si pas d'exaequo",null,null,null,"Classt        Final","Rencontres entre exaequos"]
["EQUIPES",null,"POINTS","POUR","CONTRE","DIFF",null,"POINTS Exaequos","Exaq","n°","AA","AB","AC","AD","AE","AF","AG","AH","Pts matchs",null,null,null,"1000000*Pts matchs +1000 (Diff +  abs(diff mini) )+Pour ","RANG","DIFF Exaequos","POUR Exaequos"]
["AC","1C",17,136,116,20,1,{"$f":"IF(S72>0,S72,\"\")","v":""},{"$f":"COUNTIF($C$72:$C$79,C72)","v":1},{"$f":"IF(AND(I72>1,COUNTIFS(I$72:I72,I72,C$72:C72,C72)=1),MAX(J$71:J71)+1,\"\")","v":""},{"$f":"IF($A72=K$71,\"\",IF(INDEX($C$72:$C$79,MATCH(K$71,$A$72:$A$79,0))=$C72,IFERROR(VLOOKUP($A72&K$71,$N$18:$O$69,2,0),  VLOOKUP(K$71&$A72,$N$18:$Q$69,4,0)),          \"\"))","v":""},"","","","","","","",{"$f":"SUM(K72:R72)","v":0},null,null,null,{"$f":"IF(I72<3,S72*1000000+(F72+ABS(MIN($F$72:$F$79)))*1000+D72,S72*1000000+U96*1000+Z72)","v":60136},{"$f":"IF(I72>2,RANK(W72,OFFSET(W$71,MATCH(I72,$I$72:$I$79,0),,I72)))","v":false},{"$f":"IF(S96=0,\"\",S96)","v":""},{"$f":"IF(S80=0,\"\",S80)","v":""}]
["AE","1E",16,144,108,36,2,{"$f":"IF(S73>0,S73,\"\")","v":""},1,{"$f":"IF(AND(I73>1,COUNTIFS(I$72:I73,I73,C$72:C73,C73)=1),MAX(J$71:J72)+1,\"\")","v":""},"","","","","","","","",{"$f":"SUM(K73:R73)","v":0},null,null,null,{"$f":"IF(I73<3,S73*1000000+(F73+ABS(MIN($F$72:$F$79)))*1000+D73,S73*1000000+U97*1000+Z73)","v":76144},{"$f":"IF(I73>2,RANK(W73,OFFSET(W$71,MATCH(I73,$I$72:$I$79,0),,I73)))","v":false},"",""]
["AF","1F",15,128,124,4,3,{"$f":"IF(S74>0,S74,\"\")","v":5},3,{"$f":"IF(AND(I74>1,COUNTIFS(I$72:I74,I74,C$72:C74,C74)=1),MAX(J$71:J73)+1,\"\")","v":1},2,3,"","","","","","",5,null,null,null,5020042,1,12,42]
["AB","1B",15,132,120,12,4,{"$f":"IF(S75>0,S75,\"\")","v":4},3,{"$f":"IF(AND(I75>1,COUNTIFS(I$72:I75,I75,C$72:C75,C75)=1),MAX(J$71:J74)+1,\"\")","v":""},3,"","","","",1,"","",4,null,null,null,4000032,2,-8,32]
["AA","1A",15,124,128,-4,5,{"$f":"IF(S76>0,S76,\"\")","v":3},3,{"$f":"IF(AND(I76>1,COUNTIFS(I$72:I76,I76,C$72:C76,C76)=1),MAX(J$71:J75)+1,\"\")","v":""},"",1,"","","",2,"","",3,null,null,null,3004034,3,-4,34]
["AD","1D",13,132,120,12,6,{"$f":"IF(S77>0,S77,\"\")","v":""},1,{"$f":"IF(AND(I77>1,COUNTIFS(I$72:I77,I77,C$72:C77,C77)=1),MAX(J$71:J76)+1,\"\")","v":""},"","","","","","","","",0,null,null,null,52132,false,"",""]
["AG","1G",11,106,146,-40,7,{"$f":"IF(S78>0,S78,\"\")","v":""},1,{"$f":"IF(AND(I78>1,COUNTIFS(I$72:I78,I78,C$72:C78,C78)=1),MAX(J$71:J77)+1,\"\")","v":""},"","","","","","","","",0,null,null,null,106,false,"",""]
["AH","1H",10,106,146,-40,8,{"$f":"IF(S79>0,S79,\"\")","v":""},1,{"$f":"IF(AND(I79>1,COUNTIFS(I$72:I79,I79,C$72:C79,C79)=1),MAX(J$71:J78)+1,\"\")","v":""},"","","","","","","","",0,null,null,null,106,false,"",""]
[null,null,null,null,null,null,null,null,"POUR",{"$f":"A72","v":"AC"},{"$f":"IF($A72=K$71,\"\",IF(INDEX($C$72:$C$79,MATCH(K$71,$A$72:$A$79,0))=$C72,IFERROR(VLOOKUP($A72&K$71,$N$18:$R$69,5,0),  VLOOKUP(K$71&$A72,$N$18:$S$69,6,0)),          \"\"))","v":""},"","","","","","","",0]
[null,null,null,null,null,null,null,null,null,"AE","","","","","","","","",0]
[null,null,null,null,null,null,null,null,null,"AF",18,24,"","","","","","",42]
[null,null,null,null,null,null,null,null,null,"AB",20,"","","","",12,"","",32]
[null,null,null,null,null,null,null,null,null,"AA","",16,"","","",18,"","",34,null,null,null,null,null,"  "]
[null,null,null,null,null,null,null,null,null,"AD","","","","","","","","",0]
[null,null,null,null,null,null,null,null,null,"AG","","","","","","","","",0]
[null,null,null,null,null,null,null,null,null,"AH","","","","","","","","",0]
[null,null,null,null,null,null,null,null,"CONTRE",{"$f":"J80","v":"AC"},{"$f":"INDEX($K$80:$R$87,MATCH(K$71,$J$80:$J$87,0),MATCH($J80,$K$71:$R$71,0))","v":""},{"$f":"INDEX($K$80:$R$87,MATCH(L$71,$J$80:$J$87,0),MATCH($J80,$K$71:$R$71,0))","v":""},"","","","","","",0]
[null,null,null,null,null,null,null,null,null,{"$f":"J81","v":"AE"},{"$f":"INDEX($K$80:$R$87,MATCH(K$71,$J$80:$J$87,0),MATCH($J81,$K$71:$R$71,0))","v":""},"","","","","","","",0]
[null,null,null,null,null,null,null,null,null,"AF",18,12,"","","","","","",30]
[null,null,null,null,null,null,null,null,null,"AB",16,"","","","",24,"","",40]
[null,null,null,null,null,null,null,null,null,"AA","",20,"","","",18,"","",38]
[null,null,null,null,null,null,null,null,null,"AD","","","","","","","","",0]
[null,null,null,null,null,null,null,null,null,"AG","","","","","","","","",0]
[null,null,null,null,null,null,null,null,null,"AH","","","","","","","","",0,null,"Diff pondérée"]
[null,null,null,null,null,null,null,null,"DIFF",{"$f":"J88","v":"AC"},null,null,null,null,null,null,null,null,{"$f":"S80-S88","v":0},null,{"$f":"S96+ABS(MIN($S$96:$S$103))","v":8}]
[null,null,null,null,null,null,null,null,null,{"$f":"J89","v":"AE"},null,null,null,null,null,null,null,null,{"$f":"S81-S89","v":0},null,8]
[null,null,null,null,null,null,null,null,null,"AF",null,null,null,null,null,null,null,null,12,null,20]
[null,null,null,null,null,null,null,null,null,"AB",null,null,null,null,null,null,null,null,-8,null,0]
[null,null,null,null,null,null,null,null,null,"AA",null,null,null,null,null,null,null,null,-4,null,4]
[null,null,null,null,null,null,null,null,null,"AD",null,null,null,null,null,null,null,null,0,null,8]
[null,null,null,null,null,null,null,null,null,"AG",null,null,null,null,null,null,null,null,0,null,{"$f":"S102+ABS(MIN($S$96:$S$103))","v":8}]
[null,null,null,null,null,null,null,null,null,"AH",null,null,null,null,null,null,null,null,0,null,{"$f":"S103+ABS(MIN($S$96:$S$103))","v":8}]

{"sheet":"P16","index":15,"n_rows":103,"n_cols":26,"rows_kept":103,"cut":false,"hidden":false,"merged":[[0,0,0,5],[1,0,1,5],[2,0,2,5],[3,0,3,5],[3,8,3,10],[15,6,16,6],[69,2,69,5],[69,6,70,6],[69,7,69,25],[23,6,24,6],[31,6,32,6],[39,6,40,6],[47,6,48,6],[55,6,56,6],[63,6,64,6]]}
[null,null,null,null,null,null,3]
["CHAMPIONNAT DES CLUBS"]
[]
["POULE 1"]
["EQUIPES",null,"POINTS","Pour","Contre","Diff"]
["AA","1A",{"$f":"SUMIF($A$18:$A$69,A6,$E$18:$E$69)+SUMIF($C$18:$C$69,A6,$F$18:$F$69)","v":15},{"$f":"SUMIF($A$18:$A$69,$A6,$B$18:$B$69)+SUMIF($C$18:$C$69,$A6,$D$18:$D$69)","v":124},{"$f":"SUMIF($C$18:$C$69,$A6,$B$18:$B$69)+SUMIF($A$18:$A$69,$A6,$D$18:$D$69)","v":128},{"$f":"D6-E6","v":-4}]
["AB","1B",{"$f":"SUMIF($A$18:$A$69,A7,$E$18:$E$69)+SUMIF($C$18:$C$69,A7,$F$18:$F$69)","v":15},{"$f":"SUMIF($A$18:$A$69,$A7,$B$18:$B$69)+SUMIF($C$18:$C$69,$A7,$D$18:$D$69)","v":134},{"$f":"SUMIF($C$18:$C$69,$A7,$B$18:$B$69)+SUMIF($A$18:$A$69,$A7,$D$18:$D$69)","v":118},16]
["AC","1C",{"$f":"SUMIF($A$18:$A$69,A8,$E$18:$E$69)+SUMIF($C$18:$C$69,A8,$F$18:$F$69)","v":15},114,138,-24]
["AD","1D",11,100,152,-52]
["AE","1E",15,140,112,28]
["AF","1F",15,128,124,4]
["AG","1G",15,150,102,{"$f":"D12-E12","v":48}]
["AH","1H",11,{"$f":"SUMIF($A$18:$A$69,$A13,$B$18:$B$69)+SUMIF($C$18:$C$69,$A13,$D$18:$D$69)","v":118},134,{"$f":"D13-E13","v":-16}]
[]
["1er MATCH le ","à","AA"]
[null,null,null,null,null,null,"SI forfait éq recevante"]
["Equipes","score","Equipes","score","Points","Points"]
["AA",16,"AB",{"$f":"IF(G18=19,19,IF(ISBLANK(B18),\"\",IF(B18=19,0,36-B18)))","v":20},{"$f":"IF(G18=19,0,IF(ISBLANK(B18),\"\",IF(B18<18,1,IF(B18=18,2,IF(B18>18,3)))))","v":1},{"$f":"IF(G18=19,3,IF(ISBLANK(B18),\"\",IF(B18=19,0,IF(D18<18,1,IF(D18=18,2,IF(D18>=20,3))))))","v":3},null,null,null,null,null,{"$f":"IF(B18>D18,A18&C18,IF(D18>B18,C18&A18,\"/\"))","v":"ABAA"},null,{"$f":"A18&C18","v":"AAAB"},{"$f":"E18","v":1},{"$f":"C18&A18","v":"ABAA"},{"$f":"F18","v":3},{"$f":"B18","v":16},{"$f":"D18","v":20}]
["AC",30,"AD",{"$f":"IF(G19=19,19,IF(ISBLANK(B19),\"\",IF(B19=19,0,36-B19)))","v":6},{"$f":"IF(G19=19,0,IF(ISBLANK(B19),\"\",IF(B19<18,1,IF(B19=18,2,IF(B19>18,3)))))","v":3},{"$f":"IF(G19=19,3,IF(ISBLANK(B19),\"\",IF(B19=19,0,IF(D19<18,1,IF(D19=18,2,IF(D19>=20,3))))))","v":1},null,null,null,null,null,{"$f":"IF(B19>D19,A19&C19,IF(D19>B19,C19&A19,\"/\"))","v":"ACAD"},null,{"$f":"A19&C19","v":"ACAD"},{"$f":"E19","v":3},{"$f":"C19&A19","v":"ADAC"},{"$f":"F19","v":1},{"$f":"B19","v":30},{"$f":"D19","v":6}]
["AE",16,"AF",{"$f":"IF(G20=19,19,IF(ISBLANK(B20),\"\",IF(B20=19,0,36-B20)))","v":20},{"$f":"IF(G20=19,0,IF(ISBLANK(B20),\"\",IF(B20<18,1,IF(B20=18,2,IF(B20>18,3)))))","v":1},{"$f":"IF(G20=19,3,IF(ISBLANK(B20),\"\",IF(B20=19,0,IF(D20<18,1,IF(D20=18,2,IF(D20>=20,3))))))","v":3},null,null,null,null,null,{"$f":"IF(B20>D20,A20&C20,IF(D20>B20,C20&A20,\"/\"))","v":"AFAE"},null,{"$f":"A20&C20","v":"AEAF"},{"$f":"E20","v":1},{"$f":"C20&A20","v":"AFAE"},{"$f":"F20","v":3},{"$f":"B20","v":16},{"$f":"D20","v":20}]
["AG",18,"AH",{"$f":"IF(G21=19,19,IF(ISBLANK(B21),\"\",IF(B21=19,0,36-B21)))","v":18},{"$f":"IF(G21=19,0,IF(ISBLANK(B21),\"\",IF(B21<18,1,IF(B21=18,2,IF(B21>18,3)))))","v":2},{"$f":"IF(G21=19,3,IF(ISBLANK(B21),\"\",IF(B21=19,0,IF(D21<18,1,IF(D21=18,2,IF(D21>=20,3))))))","v":2},null,null,null,null,null,{"$f":"IF(B21>D21,A21&C21,IF(D21>B21,C21&A21,\"/\"))","v":"/"},null,{"$f":"A21&C21","v":"AGAH"},{"$f":"E21","v":2},{"$f":"C21&A21","v":"AHAG"},{"$f":"F21","v":2},{"$f":"B21","v":18},{"$f":"D21","v":18}]
[]
["2 éme MATCH le ","à","AB"]
[null,null,null,null,null,null,"SI forfait éq recevante"]
["Equipes","score","Equipes","score","Points","Points"]
["AA",18,"AC",{"$f":"IF(G26=19,19,IF(ISBLANK(B26),\"\",IF(B26=19,0,36-B26)))","v":18},{"$f":"IF(G26=19,0,IF(ISBLANK(B26),\"\",IF(B26<18,1,IF(B26=18,2,IF(B26>18,3)))))","v":2},{"$f":"IF(G26=19,3,IF(ISBLANK(B26),\"\",IF(B26=19,0,IF(D26<18,1,IF(D26=18,2,IF(D26>=20,3))))))","v":2},null,null,null,null,null,{"$f":"IF(B26>D26,A26&C26,IF(D26>B26,C26&A26,\"/\"))","v":"/"},null,{"$f":"A26&C26","v":"AAAC"},{"$f":"E26","v":2},{"$f":"C26&A26","v":"ACAA"},{"$f":"F26","v":2},{"$f":"B26","v":18},{"$f":"D26","v":18}]
["AB",18,"AH",{"$f":"IF(G27=19,19,IF(ISBLANK(B27),\"\",IF(B27=19,0,36-B27)))","v":18},{"$f":"IF(G27=19,0,IF(ISBLANK(B27),\"\",IF(B27<18,1,IF(B27=18,2,IF(B27>18,3)))))","v":2},{"$f":"IF(G27=19,3,IF(ISBLANK(B27),\"\",IF(B27=19,0,IF(D27<18,1,IF(D27=18,2,IF(D27>=20,3))))))","v":2},null,null,null,null,null,{"$f":"IF(B27>D27,A27&C27,IF(D27>B27,C27&A27,\"/\"))","v":"/"},null,{"$f":"A27&C27","v":"ABAH"},{"$f":"E27","v":2},{"$f":"C27&A27","v":"AHAB"},{"$f":"F27","v":2},{"$f":"B27","v":18},{"$f":"D27","v":18}]
["AD",18,"AF",{"$f":"IF(G28=19,19,IF(ISBLANK(B28),\"\",IF(B28=19,0,36-B28)))","v":18},{"$f":"IF(G28=19,0,IF(ISBLANK(B28),\"\",IF(B28<18,1,IF(B28=18,2,IF(B28>18,3)))))","v":2},{"$f":"IF(G28=19,3,IF(ISBLANK(B28),\"\",IF(B28=19,0,IF(D28<18,1,IF(D28=18,2,IF(D28>=20,3))))))","v":2},null,null,null,null,null,{"$f":"IF(B28>D28,A28&C28,IF(D28>B28,C28&A28,\"/\"))","v":"/"},null,{"$f":"A28&C28","v":"ADAF"},{"$f":"E28","v":2},{"$f":"C28&A28","v":"AFAD"},{"$f":"F28","v":2},{"$f":"B28","v":18},{"$f":"D28","v":18}]
["AE",28,"AG",{"$f":"IF(G29=19,19,IF(ISBLANK(B29),\"\",IF(B29=19,0,36-B29)))","v":8},{"$f":"IF(G29=19,0,IF(ISBLANK(B29),\"\",IF(B29<18,1,IF(B29=18,2,IF(B29>18,3)))))","v":3},{"$f":"IF(G29=19,3,IF(ISBLANK(B29),\"\",IF(B29=19,0,IF(D29<18,1,IF(D29=18,2,IF(D29>=20,3))))))","v":1},null,null,null,null,null,{"$f":"IF(B29>D29,A29&C29,IF(D29>B29,C29&A29,\"/\"))","v":"AEAG"},null,{"$f":"A29&C29","v":"AEAG"},{"$f":"E29","v":3},{"$f":"C29&A29","v":"AGAE"},{"$f":"F29","v":1},{"$f":"B29","v":28},{"$f":"D29","v":8}]
[]
["3 éme MATCH le ","à","AC"]
[null,null,null,null,null,null,"SI forfait éq recevante"]
["Equipes","score","Equipes","score","Points","Points"]
["AA",20,"AH",{"$f":"IF(G34=19,19,IF(ISBLANK(B34),\"\",IF(B34=19,0,36-B34)))","v":16},{"$f":"IF(G34=19,0,IF(ISBLANK(B34),\"\",IF(B34<18,1,IF(B34=18,2,IF(B34>18,3)))))","v":3},{"$f":"IF(G34=19,3,IF(ISBLANK(B34),\"\",IF(B34=19,0,IF(D34<18,1,IF(D34=18,2,IF(D34>=20,3))))))","v":1},null,null,null,null,null,{"$f":"IF(B34>D34,A34&C34,IF(D34>B34,C34&A34,\"/\"))","v":"AAAH"},null,{"$f":"A34&C34","v":"AAAH"},{"$f":"E34","v":3},{"$f":"C34&A34","v":"AHAA"},{"$f":"F34","v":1},{"$f":"B34","v":20},{"$f":"D34","v":16}]
["AB",18,"AE",{"$f":"IF(G35=19,19,IF(ISBLANK(B35),\"\",IF(B35=19,0,36-B35)))","v":18},{"$f":"IF(G35=19,0,IF(ISBLANK(B35),\"\",IF(B35<18,1,IF(B35=18,2,IF(B35>18,3)))))","v":2},{"$f":"IF(G35=19,3,IF(ISBLANK(B35),\"\",IF(B35=19,0,IF(D35<18,1,IF(D35=18,2,IF(D35>=20,3))))))","v":2},null,null,null,null,null,{"$f":"IF(B35>D35,A35&C35,IF(D35>B35,C35&A35,\"/\"))","v":"/"},null,{"$f":"A35&C35","v":"ABAE"},{"$f":"E35","v":2},{"$f":"C35&A35","v":"AEAB"},{"$f":"F35","v":2},{"$f":"B35","v":18},{"$f":"D35","v":18}]
["AC",20,"AF",{"$f":"IF(G36=19,19,IF(ISBLANK(B36),\"\",IF(B36=19,0,36-B36)))","v":16},{"$f":"IF(G36=19,0,IF(ISBLANK(B36),\"\",IF(B36<18,1,IF(B36=18,2,IF(B36>18,3)))))","v":3},{"$f":"IF(G36=19,3,IF(ISBLANK(B36),\"\",IF(B36=19,0,IF(D36<18,1,IF(D36=18,2,IF(D36>=20,3))))))","v":1},null,null,null,null,null,{"$f":"IF(B36>D36,A36&C36,IF(D36>B36,C36&A36,\"/\"))","v":"ACAF"},null,{"$f":"A36&C36","v":"ACAF"},{"$f":"E36","v":3},{"$f":"C36&A36","v":"AFAC"},{"$f":"F36","v":1},{"$f":"B36","v":20},{"$f":"D36","v":16}]
["AD",18,"AG",{"$f":"IF(G37=19,19,IF(ISBLANK(B37),\"\",IF(B37=19,0,36-B37)))","v":18},{"$f":"IF(G37=19,0,IF(ISBLANK(B37),\"\",IF(B37<18,1,IF(B37=18,2,IF(B37>18,3)))))","v":2},{"$f":"IF(G37=19,3,IF(ISBLANK(B37),\"\",IF(B37=19,0,IF(D37<18,1,IF(D37=18,2,IF(D37>=20,3))))))","v":2},null,null,null,null,null,{"$f":"IF(B37>D37,A37&C37,IF(D37>B37,C37&A37,\"/\"))","v":"/"},null,{"$f":"A37&C37","v":"ADAG"},{"$f":"E37","v":2},{"$f":"C37&A37","v":"AGAD"},{"$f":"F37","v":2},{"$f":"B37","v":18},{"$f":"D37","v":18}]
[]
["4 éme MATCH le ","à","AD"]
[null,null,null,null,null,null,"SI forfait éq recevante"]
["Equipes","score","Equipes","score","Points","Points"]
["AA",20,"AD",{"$f":"IF(G42=19,19,IF(ISBLANK(B42),\"\",IF(B42=19,0,36-B42)))","v":16},{"$f":"IF(G42=19,0,IF(ISBLANK(B42),\"\",IF(B42<18,1,IF(B42=18,2,IF(B42>18,3)))))","v":3},{"$f":"IF(G42=19,3,IF(ISBLANK(B42),\"\",IF(B42=19,0,IF(D42<18,1,IF(D42=18,2,IF(D42>=20,3))))))","v":1},null,null,null,null,null,{"$f":"IF(B42>D42,A42&C42,IF(D42>B42,C42&A42,\"/\"))","v":"AAAD"},null,{"$f":"A42&C42","v":"AAAD"},{"$f":"E42","v":3},{"$f":"C42&A42","v":"ADAA"},{"$f":"F42","v":1},{"$f":"B42","v":20},{"$f":"D42","v":16}]
["AF",10,"AG",{"$f":"IF(G43=19,19,IF(ISBLANK(B43),\"\",IF(B43=19,0,36-B43)))","v":26},{"$f":"IF(G43=19,0,IF(ISBLANK(B43),\"\",IF(B43<18,1,IF(B43=18,2,IF(B43>18,3)))))","v":1},{"$f":"IF(G43=19,3,IF(ISBLANK(B43),\"\",IF(B43=19,0,IF(D43<18,1,IF(D43=18,2,IF(D43>=20,3))))))","v":3},null,null,null,null,null,{"$f":"IF(B43>D43,A43&C43,IF(D43>B43,C43&A43,\"/\"))","v":"AGAF"},null,{"$f":"A43&C43","v":"AFAG"},{"$f":"E43","v":1},{"$f":"C43&A43","v":"AGAF"},{"$f":"F43","v":3},{"$f":"B43","v":10},{"$f":"D43","v":26}]
["AB",32,"AC",{"$f":"IF(G44=19,19,IF(ISBLANK(B44),\"\",IF(B44=19,0,36-B44)))","v":4},{"$f":"IF(G44=19,0,IF(ISBLANK(B44),\"\",IF(B44<18,1,IF(B44=18,2,IF(B44>18,3)))))","v":3},{"$f":"IF(G44=19,3,IF(ISBLANK(B44),\"\",IF(B44=19,0,IF(D44<18,1,IF(D44=18,2,IF(D44>=20,3))))))","v":1},null,null,null,null,null,{"$f":"IF(B44>D44,A44&C44,IF(D44>B44,C44&A44,\"/\"))","v":"ABAC"},null,{"$f":"A44&C44","v":"ABAC"},{"$f":"E44","v":3},{"$f":"C44&A44","v":"ACAB"},{"$f":"F44","v":1},{"$f":"B44","v":32},{"$f":"D44","v":4}]
["AE",20,"AH",{"$f":"IF(G45=19,19,IF(ISBLANK(B45),\"\",IF(B45=19,0,36-B45)))","v":16},{"$f":"IF(G45=19,0,IF(ISBLANK(B45),\"\",IF(B45<18,1,IF(B45=18,2,IF(B45>18,3)))))","v":3},{"$f":"IF(G45=19,3,IF(ISBLANK(B45),\"\",IF(B45=19,0,IF(D45<18,1,IF(D45=18,2,IF(D45>=20,3))))))","v":1},null,null,null,null,null,{"$f":"IF(B45>D45,A45&C45,IF(D45>B45,C45&A45,\"/\"))","v":"AEAH"},null,{"$f":"A45&C45","v":"AEAH"},{"$f":"E45","v":3},{"$f":"C45&A45","v":"AHAE"},{"$f":"F45","v":1},{"$f":"B45","v":20},{"$f":"D45","v":16}]
[]
["5 éme MATCH le ","à","AE"]
[null,null,null,null,null,null,"SI forfait éq recevante"]
["Equipes","score","Equipes","score","Points","Points"]
["AA",18,"AF",{"$f":"IF(G50=19,19,IF(ISBLANK(B50),\"\",IF(B50=19,0,36-B50)))","v":18},{"$f":"IF(G50=19,0,IF(ISBLANK(B50),\"\",IF(B50<18,1,IF(B50=18,2,IF(B50>18,3)))))","v":2},{"$f":"IF(G50=19,3,IF(ISBLANK(B50),\"\",IF(B50=19,0,IF(D50<18,1,IF(D50=18,2,IF(D50>=20,3))))))","v":2},null,null,null,null,null,{"$f":"IF(B50>D50,A50&C50,IF(D50>B50,C50&A50,\"/\"))","v":"/"},null,{"$f":"A50&C50","v":"AAAF"},{"$f":"E50","v":2},{"$f":"C50&A50","v":"AFAA"},{"$f":"F50","v":2},{"$f":"B50","v":18},{"$f":"D50","v":18}]
["AD",18,"AH",{"$f":"IF(G51=19,19,IF(ISBLANK(B51),\"\",IF(B51=19,0,36-B51)))","v":18},{"$f":"IF(G51=19,0,IF(ISBLANK(B51),\"\",IF(B51<18,1,IF(B51=18,2,IF(B51>18,3)))))","v":2},{"$f":"IF(G51=19,3,IF(ISBLANK(B51),\"\",IF(B51=19,0,IF(D51<18,1,IF(D51=18,2,IF(D51>=20,3))))))","v":2},null,null,null,null,null,{"$f":"IF(B51>D51,A51&C51,IF(D51>B51,C51&A51,\"/\"))","v":"/"},null,{"$f":"A51&C51","v":"ADAH"},{"$f":"E51","v":2},{"$f":"C51&A51","v":"AHAD"},{"$f":"F51","v":2},{"$f":"B51","v":18},{"$f":"D51","v":18}]
["AB",4,"AG",{"$f":"IF(G52=19,19,IF(ISBLANK(B52),\"\",IF(B52=19,0,36-B52)))","v":32},{"$f":"IF(G52=19,0,IF(ISBLANK(B52),\"\",IF(B52<18,1,IF(B52=18,2,IF(B52>18,3)))))","v":1},{"$f":"IF(G52=19,3,IF(ISBLANK(B52),\"\",IF(B52=19,0,IF(D52<18,1,IF(D52=18,2,IF(D52>=20,3))))))","v":3},null,null,null,null,null,{"$f":"IF(B52>D52,A52&C52,IF(D52>B52,C52&A52,\"/\"))","v":"AGAB"},null,{"$f":"A52&C52","v":"ABAG"},{"$f":"E52","v":1},{"$f":"C52&A52","v":"AGAB"},{"$f":"F52","v":3},{"$f":"B52","v":4},{"$f":"D52","v":32}]
["AC",20,"AE",{"$f":"IF(G53=19,19,IF(ISBLANK(B53),\"\",IF(B53=19,0,36-B53)))","v":16},{"$f":"IF(G53=19,0,IF(ISBLANK(B53),\"\",IF(B53<18,1,IF(B53=18,2,IF(B53>18,3)))))","v":3},{"$f":"IF(G53=19,3,IF(ISBLANK(B53),\"\",IF(B53=19,0,IF(D53<18,1,IF(D53=18,2,IF(D53>=20,3))))))","v":1},null,null,null,null,null,{"$f":"IF(B53>D53,A53&C53,IF(D53>B53,C53&A53,\"/\"))","v":"ACAE"},null,{"$f":"A53&C53","v":"ACAE"},{"$f":"E53","v":3},{"$f":"C53&A53","v":"AEAC"},{"$f":"F53","v":1},{"$f":"B53","v":20},{"$f":"D53","v":16}]
[]
["6 éme MATCH le ","à","AF"]
[null,null,null,null,null,null,"SI forfait éq recevante"]
["Equipes","score","Equipes","score","Points","Points"]
["AB",30,"AD",{"$f":"IF(G58=19,19,IF(ISBLANK(B58),\"\",IF(B58=19,0,36-B58)))","v":6},{"$f":"IF(G58=19,0,IF(ISBLANK(B58),\"\",IF(B58<18,1,IF(B58=18,2,IF(B58>18,3)))))","v":3},{"$f":"IF(G58=19,3,IF(ISBLANK(B58),\"\",IF(B58=19,0,IF(D58<18,1,IF(D58=18,2,IF(D58>=20,3))))))","v":1},null,null,null,null,null,{"$f":"IF(B58>D58,A58&C58,IF(D58>B58,C58&A58,\"/\"))","v":"ABAD"},null,{"$f":"A58&C58","v":"ABAD"},{"$f":"E58","v":3},{"$f":"C58&A58","v":"ADAB"},{"$f":"F58","v":1},{"$f":"B58","v":30},{"$f":"D58","v":6}]
["AE",24,"AA",{"$f":"IF(G59=19,19,IF(ISBLANK(B59),\"\",IF(B59=19,0,36-B59)))","v":12},{"$f":"IF(G59=19,0,IF(ISBLANK(B59),\"\",IF(B59<18,1,IF(B59=18,2,IF(B59>18,3)))))","v":3},{"$f":"IF(G59=19,3,IF(ISBLANK(B59),\"\",IF(B59=19,0,IF(D59<18,1,IF(D59=18,2,IF(D59>=20,3))))))","v":1},null,null,null,null,null,{"$f":"IF(B59>D59,A59&C59,IF(D59>B59,C59&A59,\"/\"))","v":"AEAA"},null,{"$f":"A59&C59","v":"AEAA"},{"$f":"E59","v":3},{"$f":"C59&A59","v":"AAAE"},{"$f":"F59","v":1},{"$f":"B59","v":24},{"$f":"D59","v":12}]
["AG",32,"AC",{"$f":"IF(G60=19,19,IF(ISBLANK(B60),\"\",IF(B60=19,0,36-B60)))","v":4},{"$f":"IF(G60=19,0,IF(ISBLANK(B60),\"\",IF(B60<18,1,IF(B60=18,2,IF(B60>18,3)))))","v":3},{"$f":"IF(G60=19,3,IF(ISBLANK(B60),\"\",IF(B60=19,0,IF(D60<18,1,IF(D60=18,2,IF(D60>=20,3))))))","v":1},null,null,null,null,null,{"$f":"IF(B60>D60,A60&C60,IF(D60>B60,C60&A60,\"/\"))","v":"AGAC"},null,{"$f":"A60&C60","v":"AGAC"},{"$f":"E60","v":3},{"$f":"C60&A60","v":"ACAG"},{"$f":"F60","v":1},{"$f":"B60","v":32},{"$f":"D60","v":4}]
["AF",22,"AH",{"$f":"IF(G61=19,19,IF(ISBLANK(B61),\"\",IF(B61=19,0,36-B61)))","v":14},{"$f":"IF(G61=19,0,IF(ISBLANK(B61),\"\",IF(B61<18,1,IF(B61=18,2,IF(B61>18,3)))))","v":3},{"$f":"IF(G61=19,3,IF(ISBLANK(B61),\"\",IF(B61=19,0,IF(D61<18,1,IF(D61=18,2,IF(D61>=20,3))))))","v":1},null,null,null,null,null,{"$f":"IF(B61>D61,A61&C61,IF(D61>B61,C61&A61,\"/\"))","v":"AFAH"},null,{"$f":"A61&C61","v":"AFAH"},{"$f":"E61","v":3},{"$f":"C61&A61","v":"AHAF"},{"$f":"F61","v":1},{"$f":"B61","v":22},{"$f":"D61","v":14}]
[]
["7 éme MATCH le","à","AG"]
[null,null,null,null,null,null,"SI forfait éq recevante",null," "]
["Equipes","score","Equipes","score","Points","Points"]
["AA",20,"AG",{"$f":"IF(G66=19,19,IF(ISBLANK(B66),\"\",IF(B66=19,0,36-B66)))","v":16},{"$f":"IF(G66=19,0,IF(ISBLANK(B66),\"\",IF(B66<18,1,IF(B66=18,2,IF(B66>18,3)))))","v":3},{"$f":"IF(G66=19,3,IF(ISBLANK(B66),\"\",IF(B66=19,0,IF(D66<18,1,IF(D66=18,2,IF(D66>=20,3))))))","v":1},null,null,null,null,null,{"$f":"IF(B66>D66,A66&C66,IF(D66>B66,C66&A66,\"/\"))","v":"AAAG"},null,{"$f":"A66&C66","v":"AAAG"},{"$f":"E66","v":3},{"$f":"C66&A66","v":"AGAA"},{"$f":"F66","v":1},{"$f":"B66","v":20},{"$f":"D66","v":16}]
["AB",12,"AF",{"$f":"IF(G67=19,19,IF(ISBLANK(B67),\"\",IF(B67=19,0,36-B67)))","v":24},{"$f":"IF(G67=19,0,IF(ISBLANK(B67),\"\",IF(B67<18,1,IF(B67=18,2,IF(B67>18,3)))))","v":1},{"$f":"IF(G67=19,3,IF(ISBLANK(B67),\"\",IF(B67=19,0,IF(D67<18,1,IF(D67=18,2,IF(D67>=20,3))))))","v":3},null,null,null,null,null,{"$f":"IF(B67>D67,A67&C67,IF(D67>B67,C67&A67,\"/\"))","v":"AFAB"},null,{"$f":"A67&C67","v":"ABAF"},{"$f":"E67","v":1},{"$f":"C67&A67","v":"AFAB"},{"$f":"F67","v":3},{"$f":"B67","v":12},{"$f":"D67","v":24}]
["AE",18,"AD",{"$f":"IF(G68=19,19,IF(ISBLANK(B68),\"\",IF(B68=19,0,36-B68)))","v":18},{"$f":"IF(G68=19,0,IF(ISBLANK(B68),\"\",IF(B68<18,1,IF(B68=18,2,IF(B68>18,3)))))","v":2},{"$f":"IF(G68=19,3,IF(ISBLANK(B68),\"\",IF(B68=19,0,IF(D68<18,1,IF(D68=18,2,IF(D68>=20,3))))))","v":2},null,null,null,null,null,{"$f":"IF(B68>D68,A68&C68,IF(D68>B68,C68&A68,\"/\"))","v":"/"},null,{"$f":"A68&C68","v":"AEAD"},{"$f":"E68","v":2},{"$f":"C68&A68","v":"ADAE"},{"$f":"F68","v":2},{"$f":"B68","v":18},{"$f":"D68","v":18}]
["AC",18,"AH",{"$f":"IF(G69=19,19,IF(ISBLANK(B69),\"\",IF(B69=19,0,36-B69)))","v":18},{"$f":"IF(G69=19,0,IF(ISBLANK(B69),\"\",IF(B69<18,1,IF(B69=18,2,IF(B69>18,3)))))","v":2},{"$f":"IF(G69=19,3,IF(ISBLANK(B69),\"\",IF(B69=19,0,IF(D69<18,1,IF(D69=18,2,IF(D69>=20,3))))))","v":2},null,null,null,null,null,{"$f":"IF(B69>D69,A69&C69,IF(D69>B69,C69&A69,\"/\"))","v":"/"},null,{"$f":"A69&C69","v":"ACAH"},{"$f":"E69","v":2},{"$f":"C69&A69","v":"AHAC"},{"$f":"F69","v":2},{"$f":"B69","v":18},{"$f":"D69","v":18}]
[null,null,"Si pas d'exaequo",null,null,null,"Classt        Final","Rencontres entre exaequos"]
["EQUIPES",null,"POINTS","POUR","CONTRE","DIFF",null,"POINTS Exaequos","Exaq","n°","AA","AB","AC","AD","AE","AF","AG","AH","Pts matchs",null,null,null,"1000000*Pts matchs +1000 (Diff +  abs(diff mini) )+Pour ","RANG","DIFF Exaequos","POUR Exaequos"]
["AG","1G",15,150,102,48,1,{"$f":"IF(S72>0,S72,\"\")","v":11},{"$f":"COUNTIF($C$72:$C$79,C72)","v":6},{"$f":"IF(AND(I72>1,COUNTIFS(I$72:I72,I72,C$72:C72,C72)=1),MAX(J$71:J71)+1,\"\")","v":1},{"$f":"IF($A72=K$71,\"\",IF(INDEX($C$72:$C$79,MATCH(K$71,$A$72:$A$79,0))=$C72,IFERROR(VLOOKUP($A72&K$71,$N$18:$O$69,2,0),  VLOOKUP(K$71&$A72,$N$18:$Q$69,4,0)),          \"\"))","v":1},3,3,"",1,3,"","",{"$f":"SUM(K72:R72)","v":11},null,null,null,{"$f":"IF(I72<3,S72*1000000+(F72+ABS(MIN($F$72:$F$79)))*1000+D72,S72*1000000+U96*1000+Z72)","v":11096114},{"$f":"IF(I72>2,RANK(W72,OFFSET(W$71,MATCH(I72,$I$72:$I$79,0),,I72)))","v":1},{"$f":"IF(S96=0,\"\",S96)","v":48},{"$f":"IF(S80=0,\"\",S80)","v":114}]
["AE","1E",15,140,112,28,2,10,6,{"$f":"IF(AND(I73>1,COUNTIFS(I$72:I73,I73,C$72:C73,C73)=1),MAX(J$71:J72)+1,\"\")","v":""},3,2,1,"","",1,3,"",{"$f":"SUM(K73:R73)","v":10},null,null,null,{"$f":"IF(I73<3,S73*1000000+(F73+ABS(MIN($F$72:$F$79)))*1000+D73,S73*1000000+U97*1000+Z73)","v":10072102},{"$f":"IF(I73>2,RANK(W73,OFFSET(W$71,MATCH(I73,$I$72:$I$79,0),,I73)))","v":2},24,102]
["AF","1F",15,128,124,4,3,10,6,{"$f":"IF(AND(I74>1,COUNTIFS(I$72:I74,I74,C$72:C74,C74)=1),MAX(J$71:J73)+1,\"\")","v":""},2,3,1,"",3,"",1,"",10,null,null,null,10044088,3,-4,88]
["AB","1B",15,134,118,16,4,10,6,{"$f":"IF(AND(I75>1,COUNTIFS(I$72:I75,I75,C$72:C75,C75)=1),MAX(J$71:J74)+1,\"\")","v":""},3,"",3,"",2,1,1,"",10,null,null,null,10040086,4,-8,86]
["AC","1C",15,114,138,-24,5,10,6,{"$f":"IF(AND(I76>1,COUNTIFS(I$72:I76,I76,C$72:C76,C76)=1),MAX(J$71:J75)+1,\"\")","v":""},2,1,"","",3,3,1,"",10,null,null,null,10000066,5,-48,66]
["AA","1A",15,124,128,-4,6,9,6,{"$f":"IF(AND(I77>1,COUNTIFS(I$72:I77,I77,C$72:C77,C77)=1),MAX(J$71:J76)+1,\"\")","v":""},"",1,2,"",1,2,3,"",9,null,null,null,9036084,6,-12,84]
["AH","1H",11,118,134,-16,7,2,2,{"$f":"IF(AND(I78>1,COUNTIFS(I$72:I78,I78,C$72:C78,C78)=1),MAX(J$71:J77)+1,\"\")","v":2},"","","",2,"","","","",2,null,null,null,2036118,false,"",18]
["AD","1D",11,100,152,-52,8,2,2,{"$f":"IF(AND(I79>1,COUNTIFS(I$72:I79,I79,C$72:C79,C79)=1),MAX(J$71:J78)+1,\"\")","v":""},"","","","","","","",2,2,null,null,null,2000100,false,"",18]
[null,null,null,null,null,null,null,null,"POUR",{"$f":"A72","v":"AG"},{"$f":"IF($A72=K$71,\"\",IF(INDEX($C$72:$C$79,MATCH(K$71,$A$72:$A$79,0))=$C72,IFERROR(VLOOKUP($A72&K$71,$N$18:$R$69,5,0),  VLOOKUP(K$71&$A72,$N$18:$S$69,6,0)),          \"\"))","v":16},32,32,"",8,26,"","",114]
[null,null,null,null,null,null,null,null,null,"AE",24,18,16,"","",16,28,"",102]
[null,null,null,null,null,null,null,null,null,"AF",18,24,16,"",20,"",10,"",88]
[null,null,null,null,null,null,null,null,null,"AB",20,"",32,"",18,12,4,"",86]
[null,null,null,null,null,null,null,null,null,"AC",18,4,"","",20,20,4,"",66,null,null,null,null,null,"  "]
[null,null,null,null,null,null,null,null,null,"AA","",16,18,"",12,18,20,"",84]
[null,null,null,null,null,null,null,null,null,"AH","","","",18,"","","","",18]
[null,null,null,null,null,null,null,null,null,"AD","","","","","","","",18,18]
[null,null,null,null,null,null,null,null,"CONTRE",{"$f":"J80","v":"AG"},{"$f":"INDEX($K$80:$R$87,MATCH(K$71,$J$80:$J$87,0),MATCH($J80,$K$71:$R$71,0))","v":20},{"$f":"INDEX($K$80:$R$87,MATCH(L$71,$J$80:$J$87,0),MATCH($J80,$K$71:$R$71,0))","v":4},4,"",28,10,"","",66]
[null,null,null,null,null,null,null,null,null,{"$f":"J81","v":"AE"},{"$f":"INDEX($K$80:$R$87,MATCH(K$71,$J$80:$J$87,0),MATCH($J81,$K$71:$R$71,0))","v":12},18,20,"","",20,8,"",78]
[null,null,null,null,null,null,null,null,null,"AF",18,12,20,"",16,"",26,"",92]
[null,null,null,null,null,null,null,null,null,"AB",16,"",4,"",18,24,32,"",94]
[null,null,null,null,null,null,null,null,null,"AC",18,32,"","",16,16,32,"",114]
[null,null,null,null,null,null,null,null,null,"AA","",20,18,"",24,18,16,"",96]
[null,null,null,null,null,null,null,null,null,"AH","","","",18,"","","","",18]
[null,null,null,null,null,null,null,null,null,"AD","","","","","","","",18,18,null,"Diff pondérée"]
[null,null,null,null,null,null,null,null,"DIFF",{"$f":"J88","v":"AG"},null,null,null,null,null,null,null,null,{"$f":"S80-S88","v":48},null,{"$f":"S96+ABS(MIN($S$96:$S$103))","v":96}]
[null,null,null,null,null,null,null,null,null,{"$f":"J89","v":"AE"},null,null,null,null,null,null,null,null,{"$f":"S81-S89","v":24},null,72]
[null,null,null,null,null,null,null,null,null,"AF",null,null,null,null,null,null,null,null,-4,null,44]
[null,null,null,null,null,null,null,null,null,"AB",null,null,null,null,null,null,null,null,-8,null,40]
[null,null,null,null,null,null,null,null,null,"AC",null,null,null,null,null,null,null,null,-48,null,0]
[null,null,null,null,null,null,null,null,null,"AA",null,null,null,null,null,null,null,null,-12,null,36]
[null,null,null,null,null,null,null,null,null,"AH",null,null,null,null,null,null,null,null,0,null,{"$f":"S102+ABS(MIN($S$96:$S$103))","v":48}]
[null,null,null,null,null,null,null,null,null,"AD",null,null,null,null,null,null,null,null,0,null,{"$f":"S103+ABS(MIN($S$96:$S$103))","v":48}]