{"text_format":"1","workbook":"xlsx","n_sheets":3,"sheets":["Accueil","Données","Feuil1"],"not_rendered":{"charts":0,"images":4,"macros":1,"external_links":0,"defined_names":8,"comments":0,"pivot_tables":0},"unopened":[],"bounds":{"document_bytes":16777216,"sheet_cells":100000,"rows_first":2000,"rows_last":500,"rows_between":2000,"halvings":0,"cell_chars":16384,"cell_head_chars":4096},"cells_cut":0,"cells_raw":0,"read":"whole","date_system":"1900"}

{"sheet":"Accueil","index":0,"n_rows":34,"n_cols":33,"rows_kept":34,"cut":false,"hidden":false,"merged":[[3,2,3,32],[1,16,1,21],[20,12,20,16]]}
[{"$f":"C10","v":"2022-01-01"},1]
[null,2,null,{"$f":"DATE(B2+2020,B1,1)","v":"2022-01-01"},{"$f":"DATE(B2+2020,B1+1,1)-1","v":"2022-01-31"},null,null,null,null,null,null,null,"      Nous sommes le :",null,null,null,{"$f":"TODAY()","v":"2021-12-28"}]
[{"$f":"EOMONTH(A1,0)","v":"2022-01-31"}]
[null,null,{"$f":"\"Période du \"&TEXT(D2,\"jj mmmm aaaa\")&\" au \"&TEXT(E2,\"jj mmmm aaaa\")","v":"Période du 01 janvier 2022 au 31 janvier 2022"}]
[null,null,null,null,null,{"$f":"TODAY()","v":"2021-12-28"}]
[null,null,{"$f":"C10","v":"2022-01-01"},"2022-01-02","2022-01-03","2022-01-04","2022-01-05","2022-01-06","2022-01-07","2022-01-08","2022-01-09","2022-01-10","2022-01-11","2022-01-12","2022-01-13","2022-01-14","2022-01-15","2022-01-16","2022-01-17","2022-01-18","2022-01-19","2022-01-20","2022-01-21","2022-01-22","2022-01-23","2022-01-24","2022-01-25","2022-01-26","2022-01-27","2022-01-28","2022-01-29","2022-01-30","2022-01-31"]
[null,"SEMAINES",{"$f":"IF(C8=\"Me\",\"S \" &WEEKNUM(C6),\"\")","v":""},{"$f":"IF(D8=\"Me\",\"S \" &WEEKNUM(D6),\"\")","v":""},{"$f":"IF(E8=\"Me\",\"S \" &WEEKNUM(E6),\"\")","v":""},{"$f":"IF(F8=\"Me\",\"S \" &WEEKNUM(F6),\"\")","v":""},{"$f":"IF(G8=\"Me\",\"S \" &WEEKNUM(G6),\"\")","v":"S 2"},{"$f":"IF(H8=\"Me\",\"S \" &WEEKNUM(H6),\"\")","v":""},{"$f":"IF(I8=\"Me\",\"S \" &WEEKNUM(I6),\"\")","v":""},{"$f":"IF(J8=\"Me\",\"S \" &WEEKNUM(J6),\"\")","v":""},{"$f":"IF(K8=\"Me\",\"S \" &WEEKNUM(K6),\"\")","v":""},{"$f":"IF(L8=\"Me\",\"S \" &WEEKNUM(L6),\"\")","v":""},{"$f":"IF(M8=\"Me\",\"S \" &WEEKNUM(M6),\"\")","v":""},"S 3","","","","","","","S 4","","","",{"$f":"IF(Y8=\"Me\",\"S \" &WEEKNUM(Y6),\"\")","v":""},{"$f":"IF(Z8=\"Me\",\"S \" &WEEKNUM(Z6),\"\")","v":""},{"$f":"IF(AA8=\"Me\",\"S \" &WEEKNUM(AA6),\"\")","v":""},{"$f":"IF(AB8=\"Me\",\"S \" &WEEKNUM(AB6),\"\")","v":"S 5"},{"$f":"IF(AC8=\"Me\",\"S \" &WEEKNUM(AC6),\"\")","v":""},{"$f":"IF(AD8=\"Me\",\"S \" &WEEKNUM(AD6),\"\")","v":""},{"$f":"IF(AE8=\"Me\",\"S \" &WEEKNUM(AE6),\"\")","v":""},{"$f":"IF(AF8=\"Me\",\"S \" &WEEKNUM(AF6),\"\")","v":""},{"$f":"IF(AG8=\"Me\",\"S \" &WEEKNUM(AG6),\"\")","v":""}]
[null,null,{"$f":"CHOOSE(WEEKDAY(C6),\"Di\",\"Lu\",\"Ma\",\"Me\",\"Je\",\"Ve\",\"Sa\")","v":"Sa"},{"$f":"CHOOSE(WEEKDAY(D6),\"Di\",\"Lu\",\"Ma\",\"Me\",\"Je\",\"Ve\",\"Sa\")","v":"Di"},"Lu","Ma","Me","Je","Ve","Sa","Di","Lu","Ma","Me","Je","Ve","Sa","Di","Lu","Ma","Me","Je","Ve","Sa","Di","Lu","Ma","Me","Je","Ve",{"$f":"IFERROR(CHOOSE(WEEKDAY(AE6),\"Di\",\"Lu\",\"Ma\",\"Me\",\"Je\",\"Ve\",\"Sa\"),\"\")","v":"Sa"},{"$f":"IFERROR(CHOOSE(WEEKDAY(AF6),\"Di\",\"Lu\",\"Ma\",\"Me\",\"Je\",\"Ve\",\"Sa\"),\"\")","v":"Di"},{"$f":"IFERROR(CHOOSE(WEEKDAY(AG6),\"Di\",\"Lu\",\"Ma\",\"Me\",\"Je\",\"Ve\",\"Sa\"),\"\")","v":"Lu"}]
[null,null,{"$f":"C6:AG6","v":"2022-01-01"},{"$f":"D6:AH6","v":"2022-01-02"},"2022-01-03","2022-01-04","2022-01-05","2022-01-06","2022-01-07","2022-01-08","2022-01-09","2022-01-10","2022-01-11","2022-01-12","2022-01-13","2022-01-14","2022-01-15","2022-01-16","2022-01-17","2022-01-18","2022-01-19","2022-01-20","2022-01-21","2022-01-22","2022-01-23","2022-01-24","2022-01-25","2022-01-26","2022-01-27","2022-01-28","2022-01-29","2022-01-30","2022-01-31"]
[null,null,{"$f":"D2","v":"2022-01-01"},{"$f":"C10+1","v":"2022-01-02"},{"$f":"D10+1","v":"2022-01-03"},"2022-01-04","2022-01-05","2022-01-06","2022-01-07","2022-01-08","2022-01-09","2022-01-10","2022-01-11","2022-01-12","2022-01-13","2022-01-14","2022-01-15","2022-01-16","2022-01-17","2022-01-18","2022-01-19","2022-01-20","2022-01-21","2022-01-22","2022-01-23","2022-01-24","2022-01-25","2022-01-26","2022-01-27","2022-01-28",{"$f":"IFERROR(IF(AD10+1>A3,\"\",AD10+1),\"\")","v":"2022-01-29"},{"$f":"IFERROR(IF(AE10+1>A3,\"\",AE10+1),\"\")","v":"2022-01-30"},{"$f":"IFERROR(IF(AF10+1>A3,\"\",AF10+1),\"\")","v":"2022-01-31"}]
[{"$f":"C10","v":"2022-01-01"},"Isabelle",{"$f":"VLOOKUP(A11,Tab_donnees,3,FALSE)","v":"AR"},{"$f":"VLOOKUP(A11,Tab_donnees,4,FALSE)","v":"AR/N"},{"$f":"VLOOKUP(A11,Tab_donnees,5,FALSE)","v":"R"},{"$f":"VLOOKUP(A11,Tab_donnees,6,FALSE)","v":3},{"$f":"VLOOKUP(A11,Tab_donnees,7,FALSE)","v":2},{"$f":"VLOOKUP(A11,Tab_donnees,8,FALSE)","v":2},{"$f":"VLOOKUP(A11,Tab_donnees,9,FALSE)","v":"R"},{"$f":"VLOOKUP(A11,Tab_donnees,10,FALSE)","v":2},{"$f":"VLOOKUP(A11,Tab_donnees,11,FALSE)","v":"R"},{"$f":"VLOOKUP(A11,Tab_donnees,12,FALSE)","v":"R"},{"$f":"VLOOKUP(A11,Tab_donnees,13,FALSE)","v":2},{"$f":"VLOOKUP(A11,Tab_donnees,14,FALSE)","v":"A2"},{"$f":"VLOOKUP(A11,Tab_donnees,15,FALSE)","v":2},{"$f":"VLOOKUP(A11,Tab_donnees,16,FALSE)","v":3},{"$f":"VLOOKUP(A11,Tab_donnees,17,FALSE)","v":"R"},{"$f":"VLOOKUP(A11,Tab_donnees,18,FALSE)","v":"R"},{"$f":"VLOOKUP(A11,Tab_donnees,19,FALSE)","v":"A2"},{"$f":"VLOOKUP(A11,Tab_donnees,20,FALSE)","v":3},{"$f":"VLOOKUP(A11,Tab_donnees,21,FALSE)","v":2},{"$f":"VLOOKUP(A11,Tab_donnees,22,FALSE)","v":1},{"$f":"VLOOKUP(A11,Tab_donnees,23,FALSE)","v":"R"},{"$f":"VLOOKUP(A11,Tab_donnees,24,FALSE)","v":2},{"$f":"VLOOKUP(A11,Tab_donnees,25,FALSE)","v":"R"},{"$f":"VLOOKUP(A11,Tab_donnees,26,FALSE)","v":"R"},{"$f":"VLOOKUP(A11,Tab_donnees,27,FALSE)","v":2},{"$f":"VLOOKUP(A11,Tab_donnees,28,FALSE)","v":"A2"},{"$f":"VLOOKUP(A11,Tab_donnees,29,FALSE)","v":2},{"$f":"VLOOKUP(A11,Tab_donnees,30,FALSE)","v":3},{"$f":"VLOOKUP(A11,Tab_donnees,31,FALSE)","v":"R"},{"$f":"VLOOKUP(A11,Tab_donnees,32,FALSE)","v":"R"},{"$f":"VLOOKUP(A11,Tab_donnees,33,FALSE)","v":"A2"}]
[{"$f":"A11+1","v":"2022-01-02"},"Sylvine",{"$f":"VLOOKUP(A12,Tab_donnees,3,FALSE)","v":"R"},{"$f":"VLOOKUP(A12,Tab_donnees,4,FALSE)","v":"R"},{"$f":"VLOOKUP(A12,Tab_donnees,5,FALSE)","v":2},{"$f":"VLOOKUP(A12,Tab_donnees,6,FALSE)","v":"A2"},{"$f":"VLOOKUP(A12,Tab_donnees,7,FALSE)","v":"R"},{"$f":"VLOOKUP(A12,Tab_donnees,8,FALSE)","v":1},{"$f":"VLOOKUP(A12,Tab_donnees,9,FALSE)","v":"A2"},{"$f":"VLOOKUP(A12,Tab_donnees,10,FALSE)","v":"R"},{"$f":"VLOOKUP(A12,Tab_donnees,11,FALSE)","v":"R"},{"$f":"VLOOKUP(A12,Tab_donnees,12,FALSE)","v":"A2"},{"$f":"VLOOKUP(A12,Tab_donnees,13,FALSE)","v":3},{"$f":"VLOOKUP(A12,Tab_donnees,14,FALSE)","v":"R"},{"$f":"VLOOKUP(A12,Tab_donnees,15,FALSE)","v":1},{"$f":"VLOOKUP(A12,Tab_donnees,16,FALSE)","v":"A2"},{"$f":"VLOOKUP(A12,Tab_donnees,17,FALSE)","v":2},{"$f":"VLOOKUP(A12,Tab_donnees,18,FALSE)","v":"R"},{"$f":"VLOOKUP(A12,Tab_donnees,19,FALSE)","v":"R"},{"$f":"VLOOKUP(A12,Tab_donnees,20,FALSE)","v":2},{"$f":"VLOOKUP(A12,Tab_donnees,21,FALSE)","v":"R"},{"$f":"VLOOKUP(A12,Tab_donnees,22,FALSE)","v":2},{"$f":"VLOOKUP(A12,Tab_donnees,23,FALSE)","v":2},{"$f":"VLOOKUP(A12,Tab_donnees,24,FALSE)","v":"R"},{"$f":"VLOOKUP(A12,Tab_donnees,25,FALSE)","v":"R"},{"$f":"VLOOKUP(A12,Tab_donnees,26,FALSE)","v":2},{"$f":"VLOOKUP(A12,Tab_donnees,27,FALSE)","v":3},{"$f":"VLOOKUP(A12,Tab_donnees,28,FALSE)","v":"R"},{"$f":"VLOOKUP(A12,Tab_donnees,29,FALSE)","v":1},{"$f":"VLOOKUP(A12,Tab_donnees,30,FALSE)","v":2},{"$f":"VLOOKUP(A12,Tab_donnees,31,FALSE)","v":"A2"},{"$f":"VLOOKUP(A12,Tab_donnees,32,FALSE)","v":"AR"},{"$f":"VLOOKUP(A12,Tab_donnees,33,FALSE)","v":"R"}]
[]
[{"$f":"A12+1","v":"2022-01-03"},"Élodie",{"$f":"VLOOKUP(A14,Tab_donnees,3,FALSE)","v":"R"},{"$f":"VLOOKUP(A14,Tab_donnees,4,FALSE)","v":"R"},{"$f":"VLOOKUP(A14,Tab_donnees,5,FALSE)","v":"R"},{"$f":"VLOOKUP(A14,Tab_donnees,6,FALSE)","v":"C2"},{"$f":"VLOOKUP(A14,Tab_donnees,7,FALSE)","v":"C2"},{"$f":"VLOOKUP(A14,Tab_donnees,8,FALSE)","v":"R"},{"$f":"VLOOKUP(A14,Tab_donnees,9,FALSE)","v":"R"},{"$f":"VLOOKUP(A14,Tab_donnees,10,FALSE)","v":"A2"},{"$f":"VLOOKUP(A14,Tab_donnees,11,FALSE)","v":"A2"},{"$f":"VLOOKUP(A14,Tab_donnees,12,FALSE)","v":2},{"$f":"VLOOKUP(A14,Tab_donnees,13,FALSE)","v":"R"},{"$f":"VLOOKUP(A14,Tab_donnees,14,FALSE)","v":1},{"$f":"VLOOKUP(A14,Tab_donnees,15,FALSE)","v":2},{"$f":"VLOOKUP(A14,Tab_donnees,16,FALSE)","v":2},{"$f":"VLOOKUP(A14,Tab_donnees,17,FALSE)","v":"R"},{"$f":"VLOOKUP(A14,Tab_donnees,18,FALSE)","v":"R"},{"$f":"VLOOKUP(A14,Tab_donnees,19,FALSE)","v":1},{"$f":"VLOOKUP(A14,Tab_donnees,20,FALSE)","v":"A1"},{"$f":"VLOOKUP(A14,Tab_donnees,21,FALSE)","v":"C3"},{"$f":"VLOOKUP(A14,Tab_donnees,22,FALSE)","v":"A1"},{"$f":"VLOOKUP(A14,Tab_donnees,23,FALSE)","v":1},{"$f":"VLOOKUP(A14,Tab_donnees,24,FALSE)","v":"R"},{"$f":"VLOOKUP(A14,Tab_donnees,25,FALSE)","v":"R"},{"$f":"VLOOKUP(A14,Tab_donnees,26,FALSE)","v":"R"},{"$f":"VLOOKUP(A14,Tab_donnees,27,FALSE)","v":"A2"},{"$f":"VLOOKUP(A14,Tab_donnees,28,FALSE)","v":2},{"$f":"VLOOKUP(A14,Tab_donnees,29,FALSE)","v":"R"},{"$f":"VLOOKUP(A14,Tab_donnees,30,FALSE)","v":"R"},{"$f":"VLOOKUP(A14,Tab_donnees,31,FALSE)","v":2},{"$f":"VLOOKUP(A14,Tab_donnees,32,FALSE)","v":2},{"$f":"VLOOKUP(A14,Tab_donnees,33,FALSE)","v":2}]
[{"$f":"A14+1","v":"2022-01-04"},"Nathalie",{"$f":"VLOOKUP(A15,Tab_donnees,3,FALSE)","v":2},{"$f":"VLOOKUP(A15,Tab_donnees,4,FALSE)","v":2},{"$f":"VLOOKUP(A15,Tab_donnees,5,FALSE)","v":1},{"$f":"VLOOKUP(A15,Tab_donnees,6,FALSE)","v":"R"},{"$f":"VLOOKUP(A15,Tab_donnees,7,FALSE)","v":1},{"$f":"VLOOKUP(A15,Tab_donnees,8,FALSE)","v":"A2"},{"$f":"VLOOKUP(A15,Tab_donnees,9,FALSE)","v":"C3"},{"$f":"VLOOKUP(A15,Tab_donnees,10,FALSE)","v":"R"},{"$f":"VLOOKUP(A15,Tab_donnees,11,FALSE)","v":"R"},{"$f":"VLOOKUP(A15,Tab_donnees,12,FALSE)","v":"R"},{"$f":"VLOOKUP(A15,Tab_donnees,13,FALSE)","v":2},{"$f":"VLOOKUP(A15,Tab_donnees,14,FALSE)","v":2},{"$f":"VLOOKUP(A15,Tab_donnees,15,FALSE)","v":"R"},{"$f":"VLOOKUP(A15,Tab_donnees,16,FALSE)","v":"R"},{"$f":"VLOOKUP(A15,Tab_donnees,17,FALSE)","v":"A2"},{"$f":"VLOOKUP(A15,Tab_donnees,18,FALSE)","v":"A2"},{"$f":"VLOOKUP(A15,Tab_donnees,19,FALSE)","v":2},{"$f":"VLOOKUP(A15,Tab_donnees,20,FALSE)","v":"R"},{"$f":"VLOOKUP(A15,Tab_donnees,21,FALSE)","v":1},{"$f":"VLOOKUP(A15,Tab_donnees,22,FALSE)","v":2},{"$f":"VLOOKUP(A15,Tab_donnees,23,FALSE)","v":"A2"},{"$f":"VLOOKUP(A15,Tab_donnees,24,FALSE)","v":"R"},{"$f":"VLOOKUP(A15,Tab_donnees,25,FALSE)","v":"R/N"},{"$f":"VLOOKUP(A15,Tab_donnees,26,FALSE)","v":1},{"$f":"VLOOKUP(A15,Tab_donnees,27,FALSE)","v":1},{"$f":"VLOOKUP(A15,Tab_donnees,28,FALSE)","v":"REC"},{"$f":"VLOOKUP(A15,Tab_donnees,29,FALSE)","v":1},{"$f":"VLOOKUP(A15,Tab_donnees,30,FALSE)","v":1},{"$f":"VLOOKUP(A15,Tab_donnees,31,FALSE)","v":"R"},{"$f":"VLOOKUP(A15,Tab_donnees,32,FALSE)","v":"R"},{"$f":"VLOOKUP(A15,Tab_donnees,33,FALSE)","v":"R"}]
[{"$f":"A15+1","v":"2022-01-05"},"Marylène",{"$f":"VLOOKUP(A16,Tab_donnees,3,FALSE)","v":"R"},{"$f":"VLOOKUP(A16,Tab_donnees,4,FALSE)","v":"R"},{"$f":"VLOOKUP(A16,Tab_donnees,5,FALSE)","v":"A2"},{"$f":"VLOOKUP(A16,Tab_donnees,6,FALSE)","v":2},{"$f":"VLOOKUP(A16,Tab_donnees,7,FALSE)","v":"A2"},{"$f":"VLOOKUP(A16,Tab_donnees,8,FALSE)","v":"R"},{"$f":"VLOOKUP(A16,Tab_donnees,9,FALSE)","v":2},{"$f":"VLOOKUP(A16,Tab_donnees,10,FALSE)","v":"R"},{"$f":"VLOOKUP(A16,Tab_donnees,11,FALSE)","v":"R"},{"$f":"VLOOKUP(A16,Tab_donnees,12,FALSE)","v":1},{"$f":"VLOOKUP(A16,Tab_donnees,13,FALSE)","v":1},{"$f":"VLOOKUP(A16,Tab_donnees,14,FALSE)","v":"C3"},{"$f":"VLOOKUP(A16,Tab_donnees,15,FALSE)","v":1},{"$f":"VLOOKUP(A16,Tab_donnees,16,FALSE)","v":1},{"$f":"VLOOKUP(A16,Tab_donnees,17,FALSE)","v":"R"},{"$f":"VLOOKUP(A16,Tab_donnees,18,FALSE)","v":"R"},{"$f":"VLOOKUP(A16,Tab_donnees,19,FALSE)","v":"R"},{"$f":"VLOOKUP(A16,Tab_donnees,20,FALSE)","v":2},{"$f":"VLOOKUP(A16,Tab_donnees,21,FALSE)","v":"A2"},{"$f":"VLOOKUP(A16,Tab_donnees,22,FALSE)","v":"R"},{"$f":"VLOOKUP(A16,Tab_donnees,23,FALSE)","v":"R"},{"$f":"VLOOKUP(A16,Tab_donnees,24,FALSE)","v":"A2"},{"$f":"VLOOKUP(A16,Tab_donnees,25,FALSE)","v":"A2"},{"$f":"VLOOKUP(A16,Tab_donnees,26,FALSE)","v":2},{"$f":"VLOOKUP(A16,Tab_donnees,27,FALSE)","v":"R"},{"$f":"VLOOKUP(A16,Tab_donnees,28,FALSE)","v":1},{"$f":"VLOOKUP(A16,Tab_donnees,29,FALSE)","v":2},{"$f":"VLOOKUP(A16,Tab_donnees,30,FALSE)","v":"A2"},{"$f":"VLOOKUP(A16,Tab_donnees,31,FALSE)","v":"R"},{"$f":"VLOOKUP(A16,Tab_donnees,32,FALSE)","v":"R/N"},{"$f":"VLOOKUP(A16,Tab_donnees,33,FALSE)","v":1}]
[]
[{"$f":"A16+1","v":"2022-01-06"},"Karl",{"$f":"VLOOKUP(A18,Tab_donnees,3,FALSE)","v":3},{"$f":"VLOOKUP(A18,Tab_donnees,4,FALSE)","v":2},{"$f":"VLOOKUP(A18,Tab_donnees,5,FALSE)","v":"R"},{"$f":"VLOOKUP(A18,Tab_donnees,6,FALSE)","v":1},{"$f":"VLOOKUP(A18,Tab_donnees,7,FALSE)","v":1},{"$f":"VLOOKUP(A18,Tab_donnees,8,FALSE)","v":1},{"$f":"VLOOKUP(A18,Tab_donnees,9,FALSE)","v":1},{"$f":"VLOOKUP(A18,Tab_donnees,10,FALSE)","v":"R"},{"$f":"VLOOKUP(A18,Tab_donnees,11,FALSE)","v":"R"},{"$f":"VLOOKUP(A18,Tab_donnees,12,FALSE)","v":"R"},{"$f":"VLOOKUP(A18,Tab_donnees,13,FALSE)","v":1},{"$f":"VLOOKUP(A18,Tab_donnees,14,FALSE)","v":1},{"$f":"VLOOKUP(A18,Tab_donnees,15,FALSE)","v":"R"},{"$f":"VLOOKUP(A18,Tab_donnees,16,FALSE)","v":1},{"$f":"VLOOKUP(A18,Tab_donnees,17,FALSE)","v":2},{"$f":"VLOOKUP(A18,Tab_donnees,18,FALSE)","v":"2/N"},{"$f":"VLOOKUP(A18,Tab_donnees,19,FALSE)","v":"R"},{"$f":"VLOOKUP(A18,Tab_donnees,20,FALSE)","v":1},{"$f":"VLOOKUP(A18,Tab_donnees,21,FALSE)","v":1},{"$f":"VLOOKUP(A18,Tab_donnees,22,FALSE)","v":1},{"$f":"VLOOKUP(A18,Tab_donnees,23,FALSE)","v":1},{"$f":"VLOOKUP(A18,Tab_donnees,24,FALSE)","v":"R"},{"$f":"VLOOKUP(A18,Tab_donnees,25,FALSE)","v":"R"},{"$f":"VLOOKUP(A18,Tab_donnees,26,FALSE)","v":"R"},{"$f":"VLOOKUP(A18,Tab_donnees,27,FALSE)","v":1},{"$f":"VLOOKUP(A18,Tab_donnees,28,FALSE)","v":1},{"$f":"VLOOKUP(A18,Tab_donnees,29,FALSE)","v":"R"},{"$f":"VLOOKUP(A18,Tab_donnees,30,FALSE)","v":1},{"$f":"VLOOKUP(A18,Tab_donnees,31,FALSE)","v":2},{"$f":"VLOOKUP(A18,Tab_donnees,32,FALSE)","v":2},{"$f":"VLOOKUP(A18,Tab_donnees,33,FALSE)","v":"R"}]
[{"$f":"A18+1","v":"2022-01-07"},"Mickaël",{"$f":"VLOOKUP(A19,Tab_donnees,3,FALSE)","v":"R"},{"$f":"VLOOKUP(A19,Tab_donnees,4,FALSE)","v":"R"},{"$f":"VLOOKUP(A19,Tab_donnees,5,FALSE)","v":1},{"$f":"VLOOKUP(A19,Tab_donnees,6,FALSE)","v":1},{"$f":"VLOOKUP(A19,Tab_donnees,7,FALSE)","v":"R"},{"$f":"VLOOKUP(A19,Tab_donnees,8,FALSE)","v":"R"},{"$f":"VLOOKUP(A19,Tab_donnees,9,FALSE)","v":1},{"$f":"VLOOKUP(A19,Tab_donnees,10,FALSE)","v":2},{"$f":"VLOOKUP(A19,Tab_donnees,11,FALSE)","v":"2/N"},{"$f":"VLOOKUP(A19,Tab_donnees,12,FALSE)","v":1},{"$f":"VLOOKUP(A19,Tab_donnees,13,FALSE)","v":1},{"$f":"VLOOKUP(A19,Tab_donnees,14,FALSE)","v":"R"},{"$f":"VLOOKUP(A19,Tab_donnees,15,FALSE)","v":1},{"$f":"VLOOKUP(A19,Tab_donnees,16,FALSE)","v":1},{"$f":"VLOOKUP(A19,Tab_donnees,17,FALSE)","v":"R"},{"$f":"VLOOKUP(A19,Tab_donnees,18,FALSE)","v":"R"},{"$f":"VLOOKUP(A19,Tab_donnees,19,FALSE)","v":1},{"$f":"VLOOKUP(A19,Tab_donnees,20,FALSE)","v":1},{"$f":"VLOOKUP(A19,Tab_donnees,21,FALSE)","v":"R"},{"$f":"VLOOKUP(A19,Tab_donnees,22,FALSE)","v":"R"},{"$f":"VLOOKUP(A19,Tab_donnees,23,FALSE)","v":1},{"$f":"VLOOKUP(A19,Tab_donnees,24,FALSE)","v":2},{"$f":"VLOOKUP(A19,Tab_donnees,25,FALSE)","v":2},{"$f":"VLOOKUP(A19,Tab_donnees,26,FALSE)","v":1},{"$f":"VLOOKUP(A19,Tab_donnees,27,FALSE)","v":1},{"$f":"VLOOKUP(A19,Tab_donnees,28,FALSE)","v":"R"},{"$f":"VLOOKUP(A19,Tab_donnees,29,FALSE)","v":1},{"$f":"VLOOKUP(A19,Tab_donnees,30,FALSE)","v":1},{"$f":"VLOOKUP(A19,Tab_donnees,31,FALSE)","v":"R"},{"$f":"VLOOKUP(A19,Tab_donnees,32,FALSE)","v":"R"},{"$f":"VLOOKUP(A19,Tab_donnees,33,FALSE)","v":1}]
[]
[null,null,"A","Astreinte  (A)",null,null,null,"R","Repos",null,null,"C","Congés annuels  (C)",null,null,null,null,"N","18h30 - 20h15",null,null,null,"M","Arrêt et maladie  (M)"]
[]
[null,null,null,null,"1:","7h00",null,null,null,"2:","9h15",null,null,null,null,null,"3:","3h45",null,null,null,"4:","5h15"]
[null,"Sylvine",null,1,"8h30-16h00",null,null,null,2,"8h15-12h15 / 15h-20h15",null,null,null,null,null,3,"8h30-12h15",null,null,null,4,"15h00-20h15"]
[null,"Isabelle",null,1,"8h30-16h00",null,null,null,2,"8h15-12h15 / 15h-20h15",null,null,null,null,null,3,"8h30-12h15"]
[]
[null,"Elodie",null,1,"8h00-16h30",null,null,null,null,null,"8h00"]
[null,"Nathalie",null,2,"8h00-15h15/18h30-20h30",null,null,null,null,null,"8h45"]
[null,"Marylène",null,3,"8h-11h45",null,null,null,null,null,"3h45",null,null,null,null,null,"04/01 : Ménage Isa et Syl"]
[null,null,null,4,"8h-15h15",null,null,null,null,null,"6h45",null,null,null,null,null,"06/01 : Ménage Isa et Syl"]
[]
[null,"Karl",null,1,"7h00-15h30",null,null,null,null,null,"1h45"]
[null,"Mickaël",null,2,"7h00-14h30 Week-end ",null,null,null,null,null,"8h45"]
[null,null,null,null,"et jours fériés"]

{"sheet":"Données","index":1,"n_rows":1074,"n_cols":201,"rows_kept":1074,"cut":false,"hidden":false,"merged":[]}
["Janvier",2021,{"$f":"Accueil!A1","v":"2022-01-01"},"Années","Noms","J1","J2","J3","J4","J5","J6","J7","J8","J9","J10","J11","J12","J13","J14","J15","J16","J17","J18","J19","J20","J21","J22","J23","J24","J25","J26","J27","J28","J29","J30","J31","Colonne1","Colonne2","Colonne3","Colonne4","Colonne5","Colonne6","Colonne7","Colonne8","Colonne9","Colonne10","Colonne11","Colonne12","Colonne13","Colonne14","Colonne15","Colonne16","Colonne17","Colonne18","Colonne19","Colonne20","Colonne21","Colonne22","Colonne23","Colonne24","Colonne25","Colonne26","Colonne27","Colonne28","Colonne29","Colonne30","Colonne31","Colonne32","Colonne33","Colonne34","Colonne35","Colonne36","Colonne37","Colonne38","Colonne39","Colonne40","Colonne41"]
["Février",2022,{"$f":"Accueil!A3","v":"2022-01-31"},1,2,3,4,5,6,7,8,9,10,11,12,13,14,15,16,17,18,19,20,21,22,23,24,25,26,27,28,29,30,31,32,33]
["Mars",2023,null,"Dec-21","Decembre","2021-12-01","2021-12-02","2021-12-03","2021-12-04","2021-12-05","2021-12-06","2021-12-07","2021-12-08","2021-12-09","2021-12-10","2021-12-11","2021-12-12","2021-12-13","2021-12-14","2021-12-15","2021-12-16","2021-12-17","2021-12-18","2021-12-19","2021-12-20","2021-12-21","2021-12-22","2021-12-23","2021-12-24","2021-12-25","2021-12-26","2021-12-27","2021-12-28","2021-12-29","2021-12-30","2021-12-31"]
["Avril",2024,null,"2021-12-01","Isabelle",null,null,null,null,null,"A2",3,"A2",1,"R",2,"R","R",2,2,"A2",3,"R","R","A2",3,2,1,"R",2,"R","R","A2",2,2,3]
["Mai",2025,null,"2021-12-02","Sylvine",null,null,null,null,null,"R",2,"R",2,"A2","R","R","A2",3,"R",1,"A2",2,"R","R",2,"R","A2",2,"AR","AR/S",2,3,"R","C1","C2"]
["Juin",2026,"A","2021-12-03","Élodie",null,null,null,null,null,1,1,"R",1,1,"R","R","R","C2","C2","R","R","A2","A2","C2","R","C1","R","A2",2,2,1,"R","A2","A2",3,null,null,null,null,null,null,null,null,null,null,null,null,null,null,null,null,null,null,null,null,null,null,null,null,null,null,null,null,null,null,null,null,null,null,null,null,null,null,null,null,null,null,null,null,null,null,null,null,null,null,null,null,null,null,null,null,null,null,null,null,null,null,null,null,null,null,null,null,null,null,null,null,null,null,null,null,null,null,null,null,null,null,null,null,null,null,null,null,null,null,null,null,null,null,null,null,null,null,null,null,null,null,null,null,null,null,null,null,null,null,null,null,null,null,null,null,null,null,null,null,null,null,null,null,null,null,null,null,null,null,null,null,null,null,null,null,null,null,null,null,null,null,null,null,null,null,null,null,null,null,null,1,1,3,1,1,"R","R"]
["Juillet",2027,"C","2021-12-04","Nathalie",null,null,null,null,null,2,"R",3,"A2",2,"R","R/S",1,"A2",3,"C1","C1","R","R",1,1,1,2,"R","R","R","A2",2,"R","R","A2",null,null,null,null,null,null,null,null,null,null,null,null,null,null,null,null,null,null,null,null,null,null,null,null,null,null,null,null,null,null,null,null,null,null,null,null,null,null,null,null,null,null,null,null,null,null,null,null,null,null,null,null,null,null,null,null,null,null,null,null,null,null,null,null,null,null,null,null,null,null,null,null,null,null,null,null,null,null,null,null,null,null,null,null,null,null,null,null,null,null,null,null,null,null,null,null,null,null,null,null,null,null,null,null,null,null,null,null,null,null,null,null,null,null,null,null,null,null,null,null,null,null,null,null,null,null,null,null,null,null,null,null,null,null,null,null,null,null,null,null,null,null,null,null,null,null,null,null,null,null,null,2,"R",1,2,2,"R","R"]
["Août",2028,"M","2021-12-05","Marylène",null,null,null,null,null,"R","A2",2,"R","R","A2","A2",2,"R","A2",2,2,"R","R/S","A2","A2",2,"C1","C1","R","R","R","C2","C2","R","R",null,null,null,null,null,null,null,null,null,null,null,null,null,null,null,null,null,null,null,null,null,null,null,null,null,null,null,null,null,null,null,null,null,null,null,null,null,null,null,null,null,null,null,null,null,null,null,null,null,null,null,null,null,null,null,null,null,null,null,null,null,null,null,null,null,null,null,null,null,null,null,null,null,null,null,null,null,null,null,null,null,null,null,null,null,null,null,null,null,null,null,null,null,null,null,null,null,null,null,null,null,null,null,null,null,null,null,null,null,null,null,null,null,null,null,null,null,null,null,null,null,null,null,null,null,null,null,null,null,null,null,null,null,null,null,null,null,null,null,null,null,null,null,null,null,null,null,null,null,null,null,"R",2,2,"R","R",2,2]
["Septembre",2029,"N","2021-12-06","Karl",null,null,null,null,null,"R",1,1,"R",1,2,2,"R",1,1,1,1,"R","R","R",1,1,"R","C1",2,2,"R",1,1,1,1,null,null,null,null,null,null,null,null,null,null,null,null,null,null,null,null,null,null,null,null,null,null,null,null,null,null,null,null,null,null,null,null,null,null,null,null,null,null,null,null,null,null,null,null,null,null,null,null,null,null,null,null,null,null,null,null,null,null,null,null,null,null,null,null,null,null,null,null,null,null,null,null,null,null,null,null,null,null,null,null,null,null,null,null,null,null,null,null,null,null,null,null,null,null,null,null,null,null,null,null,null,null,null,null,null,null,null,null,null,null,null,null,null,null,null,null,null,null,null,null,null,null,null,null,null,null,null,null,null,null,null,null,null,null,null,null,null,null,null,null,null,null,null,null,null,null,null,null,null,null,null,"R",1,1,"R",1,2,2,"R",1,1,1,1,"R","R"]
["Octobre",2030,null,"2021-12-07","Mickaël",null,null,null,null,null,1,1,"R",1,1,"R","R",1,1,"R","R",1,2,2,1,1,"R",1,1,"R","R",1,1,"R","R",1]
["Novembre",2031,null,"Janv-22","Janvier","2022-01-01","2022-01-02","2022-01-03","2022-01-04","2022-01-05","2022-01-06","2022-01-07","2022-01-08","2022-01-09","2022-01-10","2022-01-11","2022-01-12","2022-01-13","2022-01-14","2022-01-15","2022-01-16","2022-01-17","2022-01-18","2022-01-19","2022-01-20","2022-01-21","2022-01-22","2022-01-23","2022-01-24","2022-01-25","2022-01-26","2022-01-27","2022-01-28","2022-01-29","2022-01-30","2022-01-31"]
["Décembre",2032,null,"2022-01-01","Isabelle","AR","AR/N","R",3,2,2,"R",2,"R","R",2,"A2",2,3,"R","R","A2",3,2,1,"R",2,"R","R",2,"A2",2,3,"R","R","A2"]
[null,2033,"Isabelle","2022-01-02","Sylvine","R","R",2,"A2","R",1,"A2","R","R","A2",3,"R",1,"A2",2,"R","R",2,"R",2,2,"R","R",2,3,"R",1,2,"A2","AR","R",null,null,null,null,null,null,null,null,null,null,null,null,null,null,null,null,null,null,null,null,null,null,null,null,null,null,null,null,null,null,null,null,null,null,null,null,null,null,null,null,null,null,null,null,null,null,null,null,null,null,null,null,null,null,null,null,null,null,null,null,null,null,null,null,null,null,null,null,null,null,null,null,null,null,null,null,null,null,null,null,null,null,null,null,null,null,null,null,null,"2022-05-01","2022-05-02","2022-05-03","2022-05-04","2022-05-05","2022-05-06","2022-05-07","2022-05-08","2022-05-09","2022-05-10","2022-05-11","2022-05-12","2022-05-13","2022-05-14","2022-05-15","2022-05-16","2022-05-17","2022-05-18","2022-05-19","2022-05-20","2022-05-21","2022-05-22","2022-05-23","2022-05-24","2022-05-25","2022-05-26","2022-05-27","2022-05-28","2022-05-29","2022-05-30","2022-05-31","2022-06-01","2022-06-02","2022-06-03","2022-06-04","2022-06-05"]
[null,2034,"Sylvine","2022-01-03","Élodie","R","R","R","C2","C2","R","R","A2","A2",2,"R",1,2,2,"R","R",1,"A1","C3","A1",1,"R","R","R","A2",2,"R","R",2,2,2,null,null,null,null,null,null,null,null,null,null,null,null,null,null,null,null,null,null,null,null,null,null,null,null,null,null,null,null,null,null,null,null,null,null,null,null,null,null,null,null,null,null,null,null,null,null,null,null,null,null,null,null,null,null,null,null,null,null,null,null,null,null,null,null,null,null,null,null,null,null,null,null,null,null,null,null,null,null,null,null,null,null,null,null,null,null,null,null,null,"R","R",2,2,2,3,"R","R",2,3,2,1,"R",2,"R","R",2,2,2,3,"R","R",2,3,2,1,"R",2,"R","R",2,2,2,3,"R","R"]
["R/S",2035,"Élodie","2022-01-04","Nathalie",2,2,1,"R",1,"A2","C3","R","R","R",2,2,"R","R","A2","A2",2,"R",1,2,"A2","R","R/N",1,1,"REC",1,1,"R","R","R",null,null,null,null,null,null,null,null,null,null,null,null,null,null,null,null,null,null,null,null,null,null,null,null,null,null,null,null,null,null,null,null,null,null,null,null,null,null,null,null,null,null,null,null,null,null,null,null,null,null,null,null,null,null,null,null,null,null,null,null,null,null,null,null,null,null,null,null,null,null,null,null,null,null,null,null,null,null,null,null,null,null,null,null,null,null,null,null,null,"R",2,3,"R",1,2,2,"R","R",2,"R",2,2,"R","R",2,3,"R",1,2,2,"R","R",2,"R",2,2,"R","R",2,3,"R",1,2,2,"R"]
["R",2036,"Nathalie","2022-01-05","Marylène","R","R","A2",2,"A2","R",2,"R","R",1,1,"C3",1,1,"R","R","R",2,"A2","R","R","A2","A2",2,"R",1,2,"A2","R","R/N",1,null,null,null,null,null,null,null,null,null,null,null,null,null,null,null,null,null,null,null,null,null,null,null,null,null,null,null,null,null,null,null,null,null,null,null,null,null,null,null,null,null,null,null,null,null,null,null,null,null,null,null,null,null,null,null,null,null,null,null,null,null,null,null,null,null,null,null,null,null,null,null,null,null,null,null,null,null,null,null,null,null,null,null,null,null,null,null,null,null,"R","R",2,2,"R","R",2,2,2,"R",1,2,2,"R","R",1,1,3,1,1,"R","R","R",2,2,"R","R",2,2,2,"R",1,2,2,"R","R"]
[1,2037,"Marylène","2022-01-06","Karl",3,2,"R",1,1,1,1,"R","R","R",1,1,"R",1,2,"2/N","R",1,1,1,1,"R","R","R",1,1,"R",1,2,2,"R",null,null,null,null,null,null,null,null,null,null,null,null,null,null,null,null,null,null,null,null,null,null,null,null,null,null,null,null,null,null,null,null,null,null,null,null,null,null,null,null,null,null,null,null,null,null,null,null,null,null,null,null,null,null,null,null,null,null,null,null,null,null,null,null,null,null,null,null,null,null,null,null,null,null,null,null,null,null,null,null,null,null,null,null,null,null,null,null,null,"R",1,1,3,1,1,"R","R","R",2,2,"R","R",2,2,2,"R",1,2,2,"R","R",1,1,3,1,1,"R","R","R",2,2,"R","R",2,2]
[2,2038,"Karl","2022-01-07","Mickaël","R","R",1,1,"R","R",1,2,"2/N",1,1,"R",1,1,"R","R",1,1,"R","R",1,2,2,1,1,"R",1,1,"R","R",1,null,null,null,null,null,null,null,null,null,null,null,null,null,null,null,null,null,null,null,null,null,null,null,null,null,null,null,null,null,null,null,null,null,null,null,null,null,null,null,null,null,null,null,null,null,null,null,null,null,null,null,null,null,null,null,null,null,null,null,null,null,null,null,null,null,null,null,null,null,null,null,null,null,null,null,null,null,null,null,null,null,null,null,null,null,null,null,null,null,2,2,"R",1,2,2,"R","R",1,1,3,1,1,"R","R","R",2,2,"R","R",2,2,2,"R",1,2,2,"R","R",1,1,3,1,1,"R","R"]
[3,2039,"Mickaël","Fevr-22","Fevrier","2022-02-01","2022-02-02","2022-02-03","2022-02-04","2022-02-05","2022-02-06","2022-02-07","2022-02-08","2022-02-09","2022-02-10","2022-02-11","2022-02-12","2022-02-13","2022-02-14","2022-02-15","2022-02-16","2022-02-17","2022-02-18","2022-02-19","2022-02-20","2022-02-21","2022-02-22","2022-02-23","2022-02-24","2022-02-25","2022-02-26","2022-02-27","2022-02-28",null,null,null,null,null,null,null,null,null,null,null,null,null,null,null,null,null,null,null,null,null,null,null,null,null,null,null,null,null,null,null,null,null,null,null,null,null,null,null,null,null,null,null,null,null,null,null,null,null,null,null,null,null,null,null,null,null,null,null,null,null,null,null,null,null,null,null,null,null,null,null,null,null,null,null,null,null,null,null,null,null,null,null,null,null,null,null,null,null,null,null,null,2,"R",1,1,1,1,"R","R","R",1,1,"R",1,2,2,"R",1,1,1,1,"R","R","R",1,1,"R",1,2,2,"R",1,1,1,1,"R","R"]
[null,2040,null,"2022-02-01","Isabelle",2,3,2,1,"R",2,"R","R",2,2,2,3,"R","R",2,3,2,1,"R",2,"R","R",2,2,2,3,"R","R",null,null,null,null,null,null,null,null,null,null,null,null,null,null,null,null,null,null,null,null,null,null,null,null,null,null,null,null,null,null,null,null,null,null,null,null,null,null,null,null,null,null,null,null,null,null,null,null,null,null,null,null,null,null,null,null,null,null,null,null,null,null,null,null,null,null,null,null,null,null,null,null,null,null,null,null,null,null,null,null,null,null,null,null,null,null,null,null,null,null,null,null,"R",1,1,"R","R",1,2,2,1,1,"R",1,1,"R","R",1,1,"R","R",1,2,2,1,1,"R",1,1,"R","R",1,1,"R","R",1,2,2]
[null,2041,null,"2022-02-02","Sylvine","R",2,"R",2,2,"R","R",2,3,"R",1,2,2,"R","R",2,"R",2,2,"R","R",2,3,"R",1,2,2,"R"]
[null,2042,null,"2022-02-03","Élodie",2,"R",1,2,2,"R","R",1,1,3,1,1,"R","R","R",2,2,"R","R",2,2,2,"R",1,2,2,"R","R"]
[null,2043,null,"2022-02-04","Nathalie","R",2,2,"R","R",2,2,2,"R",1,2,2,"R","R",1,1,3,1,1,"R","R","R",2,2,"R","R",2,2]
[null,2044,null,"2022-02-05","Marylène",1,1,3,1,1,"R","R","R",2,2,"R","R",2,2,2,"R",1,2,2,"R","R",1,1,3,1,1,"R","R"]
[null,2045,null,"2022-02-06","Karl","R",1,1,"R",1,2,2,"R",1,1,1,1,"R","R","R",1,1,"R",1,2,2,"R",1,1,1,1,"R","R"]
[null,2046,null,"2022-02-07","Mickaël",1,1,"R",1,1,"R","R",1,1,"R","R",1,2,2,1,1,"R",1,1,"R","R",1,1,"R","R",1,2,2]
[null,2047,null,"Mars-22","Mars","2022-03-01","2022-03-02","2022-03-03","2022-03-04","2022-03-05","2022-03-06","2022-03-07","2022-03-08","2022-03-09","2022-03-10","2022-03-11","2022-03-12","2022-03-13","2022-03-14","2022-03-15","2022-03-16","2022-03-17","2022-03-18","2022-03-19","2022-03-20","2022-03-21","2022-03-22","2022-03-23","2022-03-24","2022-03-25","2022-03-26","2022-03-27","2022-03-28","2022-03-29","2022-03-30","2022-03-31"]
[null,2048,null,"2022-03-01","Isabelle",2,3,2,1,"R",2,"R","R",2,2,2,3,"R","R",2,3,2,1,"R",2,"R","R",2,2,2,3,"R","R",2,3,2]
[null,2049,null,"2022-03-02","Sylvine","R",2,"R",2,2,"R","R",2,3,"R",1,2,2,"R","R",2,"R",2,2,"R","R",2,3,"R",1,2,2,"R","R",2,"R"]
[null,2050,null,"2022-03-03","Élodie",1,1,3,1,1,"R","R","R",2,2,"R","R",2,2,2,"R",1,2,2,"R","R",1,1,3,1,1,"R","R","R",2,2]
[null,null,null,"2022-03-04","Nathalie",2,"R",1,2,2,"R","R",1,1,3,1,1,"R","R","R",2,2,"R","R",2,2,2,"R",1,2,2,"R","R",1,1,3]
[null,null,null,"2022-03-05","Marylène","R",2,2,"R","R",2,2,2,"R",1,2,2,"R","R",1,1,3,1,1,"R","R","R",2,2,"R","R",2,2,2,"R",1]
[null,null,null,"2022-03-06","Karl","R",1,1,"R",1,2,2,"R",1,1,1,1,"R","R","R",1,1,"R",1,2,2,"R",1,1,1,1,"R","R","R",1,1]
[null,null,null,"2022-03-07","Mickaël",1,1,"R",1,1,"R","R",1,1,"R","R",1,2,2,1,1,"R",1,1,"R","R",1,1,"R","R",1,2,2,1,1,"R"]
[null,null,null,"Avr-22","Avril","2022-04-01","2022-04-02","2022-04-03","2022-04-04","2022-04-05","2022-04-06","2022-04-07","2022-04-08","2022-04-09","2022-04-10","2022-04-11","2022-04-12","2022-04-13","2022-04-14","2022-04-15","2022-04-16","2022-04-17","2022-04-18","2022-04-19","2022-04-20","2022-04-21","2022-04-22","2022-04-23","2022-04-24","2022-04-25","2022-04-26","2022-04-27","2022-04-28","2022-04-29","2022-04-30"]
[null,null,null,"2022-04-01","Isabelle",1,"R",2,"R","R",2,2,2,3,"R","R",2,3,2,1,"R",2,"R","R",2,2,2,3,"R","R",2,3,2,1,"R"]
[null,null,null,"2022-04-02","Sylvine",2,2,"R","R",2,3,"R",1,2,2,"R","R",2,"R",2,2,"R","R",2,3,"R",1,2,2,"R","R",2,"R",2,2]
[null,null,null,"2022-04-03","Élodie","R","R",2,2,2,"R",1,2,2,"R","R",1,1,3,1,1,"R","R","R",2,2,"R","R",2,2,2,"R",1,2,2]
[null,null,null,"2022-04-04","Nathalie",1,1,"R","R","R",2,2,"R","R",2,2,2,"R",1,2,2,"R","R",1,1,3,1,1,"R","R","R",2,2,"R","R"]
[null,null,null,"2022-04-05","Marylène",2,2,"R","R",1,1,3,1,1,"R","R","R",2,2,"R","R",2,2,2,"R",1,2,2,"R","R",1,1,3,1,1]
[null,null,null,"2022-04-06","Karl","R",1,2,2,"R",1,1,1,1,"R","R","R",1,1,"R",1,2,2,"R",1,1,1,1,"R","R","R",1,1,"R",1]
[null,null,null,"2022-04-07","Mickaël",1,1,"R","R",1,1,"R","R",1,2,2,1,1,"R",1,1,"R","R",1,1,"R","R",1,2,2,1,1,"R",1,1]
[null,null,null,"Mai-22","Mai","2022-05-01","2022-05-02","2022-05-03","2022-05-04","2022-05-05","2022-05-06","2022-05-07","2022-05-08","2022-05-09","2022-05-10","2022-05-11","2022-05-12","2022-05-13","2022-05-14","2022-05-15","2022-05-16","2022-05-17","2022-05-18","2022-05-19","2022-05-20","2022-05-21","2022-05-22","2022-05-23","2022-05-24","2022-05-25","2022-05-26","2022-05-27","2022-05-28","2022-05-29","2022-05-30","2022-05-31"]
[null,null,null,"2022-05-01","Isabelle",2,"R","R",2,2,2,3,"R","R",2,3,2,1,"R",2,"R","R",2,2,2,3,"R","R",2,3,2,1,"R",2,"R","R"]
[null,null,null,"2022-05-02","Sylvine","R","R",2,3,"R",1,2,2,"R","R",2,"R",2,2,"R","R",2,3,"R",1,2,2,"R","R",2,"R",2,2,"R","R",2]
[null,null,null,"2022-05-03","Élodie","R","R",1,1,3,1,1,"R","R","R",2,2,"R","R",2,2,2,"R",1,2,2,"R","R",1,1,3,1,1,"R","R","R"]
[null,null,null,"2022-05-04","Nathalie",2,2,2,"R",1,2,2,"R","R",1,1,3,1,1,"R","R","R",2,2,"R","R",2,2,2,"R",1,2,2,"R","R",1]
[null,null,null,"2022-05-05","Marylène","R","R","R",2,2,"R","R",2,2,2,"R",1,2,2,"R","R",1,1,3,1,1,"R","R","R",2,2,"R","R",2,2,2]
[null,null,null,"2022-05-06","Karl",2,2,"R",1,1,1,1,"R","R","R",1,1,"R",1,2,2,"R",1,1,1,1,"R","R","R",1,1,"R",1,2,2,"R"]
[null,null,null,"2022-05-07","Mickaël","R","R",1,1,"R","R",1,2,2,1,1,"R",1,1,"R","R",1,1,"R","R",1,2,2,1,1,"R",1,1,"R","R",1]
[null,null,null,"Juin-22","Juin","2022-06-01","2022-06-02","2022-06-03","2022-06-04","2022-06-05","2022-06-06","2022-06-07","2022-06-08","2022-06-09","2022-06-10","2022-06-11","2022-06-12","2022-06-13","2022-06-14","2022-06-15","2022-06-16","2022-06-17","2022-06-18","2022-06-19","2022-06-20","2022-06-21","2022-06-22","2022-06-23","2022-06-24","2022-06-25","2022-06-26","2022-06-27","2022-06-28","2022-06-29","2022-06-30"]
[null,null,null,"2022-06-01","Isabelle",2,2,2,3,"R","R",2,3,2,1,"R",2,"R","R",2,2,2,3,"R","R",2,3,2,1,"R",2,"R","R",2,2]
[null,null,null,"2022-06-02","Sylvine",3,"R",1,2,2,"R","R",2,"R",2,2,"R","R",2,3,"R",1,2,2,"R","R",2,"R",2,2,"R","R",2,3,"R"]
[null,null,null,"2022-06-03","Élodie",2,2,"R","R",2,2,2,"R",1,2,2,"R","R",1,1,3,1,1,"R","R","R",2,2,"R","R",2,2,2,"R",1]
[null,null,null,"2022-06-04","Nathalie",1,3,1,1,"R","R","R",2,2,"R","R",2,2,2,"R",1,2,2,"R","R",1,1,3,1,1,"R","R","R",2,2]
[null,null,null,"2022-06-05","Marylène","R",1,2,2,"R","R",1,1,3,1,1,"R","R","R",2,2,"R","R",2,2,2,"R",1,2,2,"R","R",1,1,3]
[null,null,null,"2022-06-06","Karl",1,1,1,1,"R","R","R",1,1,"R",1,2,2,"R",1,1,1,1,"R","R","R",1,1,"R",1,2,2,"R",1,1]
[null,null,null,"2022-06-07","Mickaël",1,"R","R",1,2,2,1,1,"R",1,1,"R","R",1,1,"R","R",1,2,2,1,1,"R",1,1,"R","R",1,1,"R"]
[null,null,null,"Juil-22","Juillet","2022-07-01","2022-07-02","2022-07-03","2022-07-04","2022-07-05","2022-07-06","2022-07-07","2022-07-08","2022-07-09","2022-07-10","2022-07-11","2022-07-12","2022-07-13","2022-07-14","2022-07-15","2022-07-16","2022-07-17","2022-07-18","2022-07-19","2022-07-20","2022-07-21","2022-07-22","2022-07-23","2022-07-24","2022-07-25","2022-07-26","2022-07-27","2022-07-28","2022-07-29","2022-07-30","2022-07-31"]
[null,null,null,"2022-07-01","Isabelle",2,3,"R","R",2,3,2,1,"R",2,"R","R",2,2,2,3,"R","R",2,3,2,1,"R",2,"R","R",2,2,2,3,"R"]
[null,null,null,"2022-07-02","Sylvine",1,2,2,"R","R",2,"R",2,2,"R","R",2,3,"R",1,2,2,"R","R",2,"R",2,2,"R","R",2,3,"R",1,2,2]
[null,null,null,"2022-07-03","Élodie",2,2,"R","R",1,1,3,1,1,"R","R","R",2,2,"R","R",2,2,2,"R",1,2,2,"R","R",1,1,3,1,1,"R"]
[null,null,null,"2022-07-04","Nathalie","R","R",2,2,2,"R",1,2,2,"R","R",1,1,3,1,1,"R","R","R",2,2,"R","R",2,2,2,"R",1,2,2,"R"]
[null,null,null,"2022-07-05","Marylène",1,1,"R","R","R",2,2,"R","R",2,2,2,"R",1,2,2,"R","R",1,1,3,1,1,"R","R","R",2,2,"R","R",2]
[null,null,null,"2022-07-06","Karl",1,1,"R","R","R",1,1,"R",1,2,2,"R",1,1,1,1,"R","R","R",1,1,"R",1,2,2,"R",1,1,1,1,"R"]
[null,null,null,"2022-07-07","Mickaël","R",1,2,2,1,1,"R",1,1,"R","R",1,1,"R","R",1,2,2,1,1,"R",1,1,"R","R",1,1,"R","R",1,2]
[null,null,null,"Aout-22","Aout","2022-08-01","2022-08-02","2022-08-03","2022-08-04","2022-08-05","2022-08-06","2022-08-07","2022-08-08","2022-08-09","2022-08-10","2022-08-11","2022-08-12","2022-08-13","2022-08-14","2022-08-15","2022-08-16","2022-08-17","2022-08-18","2022-08-19","2022-08-20","2022-08-21","2022-08-22","2022-08-23","2022-08-24","2022-08-25","2022-08-26","2022-08-27","2022-08-28","2022-08-29","2022-08-30","2022-08-31"]
[null,null,null,"2022-08-01","Isabelle","R",2,3,2,1,"R",2,"R","R",2,2,2,3,"R","R",2,3,2,1,"R",2,"R","R",2,2,2,3,"R","R",2,3]
[null,null,null,"2022-08-02","Sylvine","R","R",2,"R",2,2,"R","R",2,3,"R",1,2,2,"R","R",2,"R",2,2,"R","R",2,3,"R",1,2,2,"R","R",2]
[null,null,null,"2022-08-03","Élodie","R","R",2,2,"R","R",2,2,2,"R",1,2,2,"R","R",1,1,3,1,1,"R","R","R",2,2,"R","R",2,2,2,"R"]
[null,null,null,"2022-08-04","Nathalie","R",1,1,3,1,1,"R","R","R",2,2,"R","R",2,2,2,"R",1,2,2,"R","R",1,1,3,1,1,"R","R","R",2]
[null,null,null,"2022-08-05","Marylène",2,2,"R",1,2,2,"R","R",1,1,3,1,1,"R","R","R",2,2,"R","R",2,2,2,"R",1,2,2,"R","R",1,1]
[null,null,null,"2022-08-06","Karl","R","R",1,1,"R",1,2,2,"R",1,1,1,1,"R","R","R",1,1,"R",1,2,2,"R",1,1,1,1,"R","R","R",1]
[null,null,null,"2022-08-07","Mickaël",2,1,1,"R",1,1,"R","R",1,1,"R","R",1,2,2,1,1,"R",1,1,"R","R",1,1,"R","R",1,2,2,1,1]
[null,null,null,"Sept-22","Septembre","2022-09-01","2022-09-02","2022-09-03","2022-09-04","2022-09-05","2022-09-06","2022-09-07","2022-09-08","2022-09-09","2022-09-10","2022-09-11","2022-09-12","2022-09-13","2022-09-14","2022-09-15","2022-09-16","2022-09-17","2022-09-18","2022-09-19","2022-09-20","2022-09-21","2022-09-22","2022-09-23","2022-09-24","2022-09-25","2022-09-26","2022-09-27","2022-09-28","2022-09-29","2022-09-30"]
[null,null,null,"2022-09-01","Isabelle",2,1,"R",2,"R","R",2,2,2,3,"R","R",2,3,2,1,"R",2,"R","R",2,2,2,3,"R","R",2,3,2,1]
[null,null,null,"2022-09-02","Sylvine","R",2,2,"R","R",2,3,"R",1,2,2,"R","R",2,"R",2,2,"R","R",2,3,"R",1,2,2,"R","R",2,"R",2]
[null,null,null,"2022-09-03","Élodie",1,2,2,"R","R",1,1,3,1,1,"R","R","R",2,2,"R","R",2,2,2,"R",1,2,2,"R","R",1,1,3,1]
[null,null,null,"2022-09-04","Nathalie",2,"R","R",2,2,2,"R",1,2,2,"R","R",1,1,3,1,1,"R","R","R",2,2,"R","R",2,2,2,"R",1,2]
[null,null,null,"2022-09-05","Marylène",3,1,1,"R","R","R",2,2,"R","R",2,2,2,"R",1,2,2,"R","R",1,1,3,1,1,"R","R","R",2,2,"R"]
[null,null,null,"2022-09-06","Karl",1,"R",1,2,2,"R",1,1,1,1,"R","R","R",1,1,"R",1,2,2,"R",1,1,1,1,"R","R","R",1,1,"R"]
[null,null,null,"2022-09-07","Mickaël","R",1,1,"R","R",1,1,"R","R",1,2,2,1,1,"R",1,1,"R","R",1,1,"R","R",1,2,2,1,1,"R",1]
[null,null,null,"Oct-22","Octobre","2022-10-01","2022-10-02","2022-10-03","2022-10-04","2022-10-05","2022-10-06","2022-10-07","2022-10-08","2022-10-09","2022-10-10","2022-10-11","2022-10-12","2022-10-13","2022-10-14","2022-10-15","2022-10-16","2022-10-17","2022-10-18","2022-10-19","2022-10-20","2022-10-21","2022-10-22","2022-10-23","2022-10-24","2022-10-25","2022-10-26","2022-10-27","2022-10-28","2022-10-29","2022-10-30","2022-10-31"]
[null,null,null,"2022-10-01","Isabelle","R",2,"R","R",2,2,2,3,"R","R",2,3,2,1,"R",2,"R","R",2,2,2,3,"R","R",2,3,2,1,"R",2,"R"]
[null,null,null,"2022-10-02","Sylvine",2,"R","R",2,3,"R",1,2,2,"R","R",2,"R",2,2,"R","R",2,3,"R",1,2,2,"R","R",2,"R",2,2,"R","R"]
[null,null,null,"2022-10-03","Élodie",1,"R","R","R",2,2,"R","R",2,2,2,"R",1,2,2,"R","R",1,1,3,1,1,"R","R","R",2,2,"R","R",2,2]
[null,null,null,"2022-10-04","Nathalie",2,"R","R",1,1,3,1,1,"R","R","R",2,2,"R","R",2,2,2,"R",1,2,2,"R","R",1,1,3,1,1,"R","R"]
[null,null,null,"2022-10-05","Marylène","R",2,2,2,"R",1,2,2,"R","R",1,1,3,1,1,"R","R","R",2,2,"R","R",2,2,2,"R",1,2,2,"R","R"]
[null,null,null,"2022-10-06","Karl",1,2,2,"R",1,1,1,1,"R","R","R",1,1,"R",1,2,2,"R",1,1,1,1,"R","R","R",1,1,"R",1,2,2]
[null,null,null,"2022-10-07","Mickaël",1,"R","R",1,1,"R","R",1,2,2,1,1,"R",1,1,"R","R",1,1,"R","R",1,2,2,1,1,"R",1,1,"R","R"]
[null,null,null,"Nov-22","Novembre","2022-11-01","2022-11-02","2022-11-03","2022-11-04","2022-11-05","2022-11-06","2022-11-07","2022-11-08","2022-11-09","2022-11-10","2022-11-11","2022-11-12","2022-11-13","2022-11-14","2022-11-15","2022-11-16","2022-11-17","2022-11-18","2022-11-19","2022-11-20","2022-11-21","2022-11-22","2022-11-23","2022-11-24","2022-11-25","2022-11-26","2022-11-27","2022-11-28","2022-11-29","2022-11-30"]
[null,null,null,"2022-11-01","Isabelle","R",2,2,2,3,"R","R",2,3,2,1,"R",2,"R","R",2,2,2,3,"R","R",2,3,2,1,"R",2,"R","R",2]
[null,null,null,"2022-11-02","Sylvine",2,3,"R",1,2,2,"R","R",2,"R",2,2,"R","R",2,3,"R",1,2,2,"R","R",2,"R",2,2,"R","R",2,3]
[null,null,null,"2022-11-03","Élodie",2,"R",1,2,2,"R","R",1,1,3,1,1,"R","R","R",2,2,"R","R",2,2,2,"R",1,2,2,"R","R",1,1]
[null,null,null,"2022-11-04","Nathalie","R",2,2,"R","R",2,2,2,"R",1,2,2,"R","R",1,1,3,1,1,"R","R","R",2,2,"R","R",2,2,2,"R"]
[null,null,null,"2022-11-05","Marylène",1,1,3,1,1,"R","R","R",2,2,"R","R",2,2,2,"R",1,2,2,"R","R",1,1,3,1,1,"R","R","R",2]
[null,null,null,"2022-11-06","Karl","R",1,1,1,1,"R","R","R",1,1,"R",1,2,2,"R",1,1,1,1,"R","R","R",1,1,"R",1,2,2,"R",1]
[null,null,null,"2022-11-07","Mickaël",1,1,"R","R",1,2,2,1,1,"R",1,1,"R","R",1,1,"R","R",1,2,2,1,1,"R",1,1,"R","R",1,1]
[null,null,null,"Dec-22","Décembre","2022-12-01","2022-12-02","2022-12-03","2022-12-04","2022-12-05","2022-12-06","2022-12-07","2022-12-08","2022-12-09","2022-12-10","2022-12-11","2022-12-12","2022-12-13","2022-12-14","2022-12-15","2022-12-16","2022-12-17","2022-12-18","2022-12-19","2022-12-20","2022-12-21","2022-12-22","2022-12-23","2022-12-24","2022-12-25","2022-12-26","2022-12-27","2022-12-28","2022-12-29","2022-12-30","2022-12-31","2023-01-01"]
[null,null,null,"2022-12-01","Isabelle",2,2,3,"R","R",2,3,2,1,"R",2,"R","R",2,2,2,3,"R","R",2,3,2,1,"R",2,"R","R",2,2,2,3]
[null,null,null,"2022-12-02","Sylvine","R",1,2,2,"R","R",2,"R",2,2,"R","R",2,3,"R",1,2,2,"R","R",2,"R",2,2,"R","R",2,3,"R",1,2]
[null,null,null,"2022-12-03","Élodie",3,1,1,"R","R","R",2,2,"R","R",2,2,2,"R",1,2,2,"R","R",1,1,3,1,1,"R","R","R",2,2,"R","R"]
[null,null,null,"2022-12-04","Nathalie",1,2,2,"R","R",1,1,3,1,1,"R","R","R",2,2,"R","R",2,2,2,"R",1,2,2,"R","R",1,1,3,1,1]
[null,null,null,"2022-12-05","Marylène",2,"R","R",2,2,2,"R",1,2,2,"R","R",1,1,3,1,1,"R","R","R",2,2,"R","R",2,2,2,"R",1,2,2]
[null,null,null,"2022-12-06","Karl",1,1,1,"R","R","R",1,1,"R",1,2,2,"R",1,1,1,1,"R","R","R",1,1,"R",1,2,2,"R",1,1,1,1]
[null,null,null,"2022-12-07","Mickaël","R","R",1,2,2,1,1,"R",1,1,"R","R",1,1,"R","R",1,2,2,1,1,"R",1,1,"R","R",1,1,"R","R",1]
[null,null,null,"Janv-23","Janvier","2023-01-01","2023-01-02","2023-01-03","2023-01-04","2023-01-05","2023-01-06","2023-01-07","2023-01-08","2023-01-09","2023-01-10","2023-01-11","2023-01-12","2023-01-13","2023-01-14","2023-01-15","2023-01-16","2023-01-17","2023-01-18","2023-01-19","2023-01-20","2023-01-21","2023-01-22","2023-01-23","2023-01-24","2023-01-25","2023-01-26","2023-01-27","2023-01-28","2023-01-29","2023-01-30","2023-01-31"]
[null,null,null,"2023-01-01","Isabelle","R","R",2,3,2,1,"R",2,"R","R",2,2,2,3,"R","R",2,3,2,1,"R",2,"R","R",2,2,2,3,"R","R",2]
[null,null,null,"2023-01-02","Sylvine",2,"R","R",2,"R",2,2,"R","R",2,3,"R",1,2,2,"R","R",2,"R",2,2,"R","R",2,3,"R",1,2,2,"R","R"]
[null,null,null,"2023-01-03","Élodie",2,2,2,"R",1,2,2,"R","R",1,1,3,1,1,"R","R","R",2,2,"R","R",2,2,2,"R",1,2,2,"R","R",1]
[null,null,null,"2023-01-04","Nathalie","R","R","R",2,2,"R","R",2,2,2,"R",1,2,2,"R","R",1,1,3,1,1,"R","R","R",2,2,"R","R",2,2,2]
[null,null,null,"2023-01-05","Marylène","R","R",1,1,3,1,1,"R","R","R",2,2,"R","R",2,2,2,"R",1,2,2,"R","R",1,1,3,1,1,"R","R","R"]
[null,null,null,"2023-01-06","Karl","R","R","R",1,1,"R",1,2,2,"R",1,1,1,1,"R","R","R",1,1,"R",1,2,2,"R",1,1,1,1,"R","R","R"]
[null,null,null,"2023-01-07","Mickaël",2,2,1,1,"R",1,1,"R","R",1,1,"R","R",1,2,2,1,1,"R",1,1,"R","R",1,1,"R","R",1,2,2,1]
[null,null,null,"Fevr-23","Février","2023-02-01","2023-02-02","2023-02-03","2023-02-04","2023-02-05","2023-02-06","2023-02-07","2023-02-08","2023-02-09","2023-02-10","2023-02-11","2023-02-12","2023-02-13","2023-02-14","2023-02-15","2023-02-16","2023-02-17","2023-02-18","2023-02-19","2023-02-20","2023-02-21","2023-02-22","2023-02-23","2023-02-24","2023-02-25","2023-02-26","2023-02-27","2023-02-28"]
[null,null,null,"2023-02-01","Isabelle",3,2,1,"R",2,"R","R",2,2,2,3,"R","R",2,3,2,1,"R",2,"R","R",2,2,2,3,"R","R",2]
[null,null,null,"2023-02-02","Sylvine",2,"R",2,2,"R","R",2,3,"R",1,2,2,"R","R",2,"R",2,2,"R","R",2,3,"R",1,2,2,"R","R"]
[null,null,null,"2023-02-03","Élodie",1,3,1,1,"R","R","R",2,2,"R","R",2,2,2,"R",1,2,2,"R","R",1,1,3,1,1,"R","R","R"]
[null,null,null,"2023-02-04","Nathalie","R",1,2,2,"R","R",1,1,3,1,1,"R","R","R",2,2,"R","R",2,2,2,"R",1,2,2,"R","R",1]
[null,null,null,"2023-02-05","Marylène",2,2,"R","R",2,2,2,"R",1,2,2,"R","R",1,1,3,1,1,"R","R","R",2,2,"R","R",2,2,2]
[null,null,null,"2023-02-06","Karl",1,1,"R",1,2,2,"R",1,1,1,1,"R","R","R",1,1,"R",1,2,2,"R",1,1,1,1,"R","R","R"]
[null,null,null,"2023-02-07","Mickaël",1,"R",1,1,"R","R",1,1,"R","R",1,2,2,1,1,"R",1,1,"R","R",1,1,"R","R",1,2,2,1]
[null,null,null,"Mars-23","Mars","2023-03-01","2023-03-02","2023-03-03","2023-03-04","2023-03-05","2023-03-06","2023-03-07","2023-03-08","2023-03-09","2023-03-10","2023-03-11","2023-03-12","2023-03-13","2023-03-14","2023-03-15","2023-03-16","2023-03-17","2023-03-18","2023-03-19","2023-03-20","2023-03-21","2023-03-22","2023-03-23","2023-03-24","2023-03-25","2023-03-26","2023-03-27","2023-03-28","2023-03-29","2023-03-30","2023-03-31"]
[null,null,null,"2023-03-01","Isabelle",3,2,1,"R",2,"R","R",2,2,2,3,"R","R",2,3,2,1,"R",2,"R","R",2,2,2,3,"R","R",2,3,2,1]
[null,null,null,"2023-03-02","Sylvine",2,"R",2,2,"R","R",2,3,"R",1,2,2,"R","R",2,"R",2,2,"R","R",2,3,"R",1,2,2,"R","R",2,"R",2]
[null,null,null,"2023-03-03","Élodie",2,2,"R","R",2,2,2,"R",1,2,2,"R","R",1,1,3,1,1,"R","R","R",2,2,"R","R",2,2,2,"R",1,2]
[null,null,null,"2023-03-04","Nathalie",1,3,1,1,"R","R","R",2,2,"R","R",2,2,2,"R",1,2,2,"R","R",1,1,3,1,1,"R","R","R",2,2,"R"]
[null,null,null,"2023-03-05","Marylène","R",1,2,2,"R","R",1,1,3,1,1,"R","R","R",2,2,"R","R",2,2,2,"R",1,2,2,"R","R",1,1,3,1]
[null,null,null,"2023-03-06","Karl",1,1,"R",1,2,2,"R",1,1,1,1,"R","R","R",1,1,"R",1,2,2,"R",1,1,1,1,"R","R","R",1,1,"R"]
[null,null,null,"2023-03-07","Mickaël",1,"R",1,1,"R","R",1,1,"R","R",1,2,2,1,1,"R",1,1,"R","R",1,1,"R","R",1,2,2,1,1,"R",1]
[null,null,null,"Avr-23","Avril","2023-04-01","2023-04-02","2023-04-03","2023-04-04","2023-04-05","2023-04-06","2023-04-07","2023-04-08","2023-04-09","2023-04-10","2023-04-11","2023-04-12","2023-04-13","2023-04-14","2023-04-15","2023-04-16","2023-04-17","2023-04-18","2023-04-19","2023-04-20","2023-04-21","2023-04-22","2023-04-23","2023-04-24","2023-04-25","2023-04-26","2023-04-27","2023-04-28","2023-04-29","2023-04-30"]
[null,null,null,"2023-04-01","Isabelle","R",2,"R","R",2,2,2,3,"R","R",2,3,2,1,"R",2,"R","R",2,2,2,3,"R","R",2,3,2,1,"R",2]
[null,null,null,"2023-04-02","Sylvine",2,"R","R",2,3,"R",1,2,2,"R","R",2,"R",2,2,"R","R",2,3,"R",1,2,2,"R","R",2,"R",2,2,"R"]
[null,null,null,"2023-04-03","Élodie",2,"R","R",1,1,3,1,1,"R","R","R",2,2,"R","R",2,2,2,"R",1,2,2,"R","R",1,1,3,1,1,"R"]
[null,null,null,"2023-04-04","Nathalie","R",2,2,2,"R",1,2,2,"R","R",1,1,3,1,1,"R","R","R",2,2,"R","R",2,2,2,"R",1,2,2,"R"]
[null,null,null,"2023-04-05","Marylène",1,"R","R","R",2,2,"R","R",2,2,2,"R",1,2,2,"R","R",1,1,3,1,1,"R","R","R",2,2,"R","R",2]
[null,null,null,"2023-04-06","Karl",1,2,2,"R",1,1,1,1,"R","R","R",1,1,"R",1,2,2,"R",1,1,1,1,"R","R","R",1,1,"R",1,2]
[null,null,null,"2023-04-07","Mickaël",1,"R","R",1,1,"R","R",1,2,2,1,1,"R",1,1,"R","R",1,1,"R","R",1,2,2,1,1,"R",1,1,"R"]
[null,null,null,"Mai-23","Mai","2023-05-01","2023-05-02","2023-05-03","2023-05-04","2023-05-05","2023-05-06","2023-05-07","2023-05-08","2023-05-09","2023-05-10","2023-05-11","2023-05-12","2023-05-13","2023-05-14","2023-05-15","2023-05-16","2023-05-17","2023-05-18","2023-05-19","2023-05-20","2023-05-21","2023-05-22","2023-05-23","2023-05-24","2023-05-25","2023-05-26","2023-05-27","2023-05-28","2023-05-29","2023-05-30","2023-05-31"]
[null,null,null,"2023-05-01","Isabelle","R","R",2,2,2,3,"R","R",2,3,2,1,"R",2,"R","R",2,2,2,3,"R","R",2,3,2,1,"R",2,"R","R",2]
[null,null,null,"2023-05-02","Sylvine","R",2,3,"R",1,2,2,"R","R",2,"R",2,2,"R","R",2,3,"R",1,2,2,"R","R",2,"R",2,2,"R","R",2,3]
[null,null,null,"2023-05-03","Élodie","R","R",2,2,"R","R",2,2,2,"R",1,2,2,"R","R",1,1,3,1,1,"R","R","R",2,2,"R","R",2,2,2,"R"]
[null,null,null,"2023-05-04","Nathalie","R",1,1,3,1,1,"R","R","R",2,2,"R","R",2,2,2,"R",1,2,2,"R","R",1,1,3,1,1,"R","R","R",2]
[null,null,null,"2023-05-05","Marylène",2,2,"R",1,2,2,"R","R",1,1,3,1,1,"R","R","R",2,2,"R","R",2,2,2,"R",1,2,2,"R","R",1,1]
[null,null,null,"2023-05-06","Karl",2,"R",1,1,1,1,"R","R","R",1,1,"R",1,2,2,"R",1,1,1,1,"R","R","R",1,1,"R",1,2,2,"R",1]
[null,null,null,"2023-05-07","Mickaël","R",1,1,"R","R",1,2,2,1,1,"R",1,1,"R","R",1,1,"R","R",1,2,2,1,1,"R",1,1,"R","R",1,1]
[null,null,null,"Juin-23","Juin","2023-06-01","2023-06-02","2023-06-03","2023-06-04","2023-06-05","2023-06-06","2023-06-07","2023-06-08","2023-06-09","2023-06-10","2023-06-11","2023-06-12","2023-06-13","2023-06-14","2023-06-15","2023-06-16","2023-06-17","2023-06-18","2023-06-19","2023-06-20","2023-06-21","2023-06-22","2023-06-23","2023-06-24","2023-06-25","2023-06-26","2023-06-27","2023-06-28","2023-06-29","2023-06-30"]
[null,null,null,"2023-06-01","Isabelle",2,2,3,"R","R",2,3,2,1,"R",2,"R","R",2,2,2,3,"R","R",2,3,2,1,"R",2,"R","R",2,2,2]
[null,null,null,"2023-06-02","Sylvine","R",1,2,2,"R","R",2,"R",2,2,"R","R",2,3,"R",1,2,2,"R","R",2,"R",2,2,"R","R",2,3,"R",1]
[null,null,null,"2023-06-03","Élodie",1,2,2,"R","R",1,1,3,1,1,"R","R","R",2,2,"R","R",2,2,2,"R",1,2,2,"R","R",1,1,3,1]
[null,null,null,"2023-06-04","Nathalie",2,"R","R",2,2,2,"R",1,2,2,"R","R",1,1,3,1,1,"R","R","R",2,2,"R","R",2,2,2,"R",1,2]
[null,null,null,"2023-06-05","Marylène",3,1,1,"R","R","R",2,2,"R","R",2,2,2,"R",1,2,2,"R","R",1,1,3,1,1,"R","R","R",2,2,"R"]
[null,null,null,"2023-06-06","Karl",1,1,1,"R","R","R",1,1,"R",1,2,2,"R",1,1,1,1,"R","R","R",1,1,"R",1,2,2,"R",1,1,1]
[null,null,null,"2023-06-07","Mickaël","R","R",1,2,2,1,1,"R",1,1,"R","R",1,1,"R","R",1,2,2,1,1,"R",1,1,"R","R",1,1,"R","R"]
[null,null,null,"Juil-23","Juillet","2023-07-01","2023-07-02","2023-07-03","2023-07-04","2023-07-05","2023-07-06","2023-07-07","2023-07-08","2023-07-09","2023-07-10","2023-07-11","2023-07-12","2023-07-13","2023-07-14","2023-07-15","2023-07-16","2023-07-17","2023-07-18","2023-07-19","2023-07-20","2023-07-21","2023-07-22","2023-07-23","2023-07-24","2023-07-25","2023-07-26","2023-07-27","2023-07-28","2023-07-29","2023-07-30","2023-07-31"]
[null,null,null,"2023-07-01","Isabelle",3,"R","R",2,3,2,1,"R",2,"R","R",2,2,2,3,"R","R",2,3,2,1,"R",2,"R","R",2,2,2,3,"R","R"]
[null,null,null,"2023-07-02","Sylvine",2,2,"R","R",2,"R",2,2,"R","R",2,3,"R",1,2,2,"R","R",2,"R",2,2,"R","R",2,3,"R",1,2,2,"R"]
[null,null,null,"2023-07-03","Élodie",1,"R","R","R",2,2,"R","R",2,2,2,"R",1,2,2,"R","R",1,1,3,1,1,"R","R","R",2,2,"R","R",2,2]
[null,null,null,"2023-07-04","Nathalie",2,"R","R",1,1,3,1,1,"R","R","R",2,2,"R","R",2,2,2,"R",1,2,2,"R","R",1,1,3,1,1,"R","R"]
[null,null,null,"2023-07-05","Marylène","R",2,2,2,"R",1,2,2,"R","R",1,1,3,1,1,"R","R","R",2,2,"R","R",2,2,2,"R",1,2,2,"R","R"]
[null,null,null,"2023-07-06","Karl",1,"R","R","R",1,1,"R",1,2,2,"R",1,1,1,1,"R","R","R",1,1,"R",1,2,2,"R",1,1,1,1,"R","R"]
[null,null,null,"2023-07-07","Mickaël",1,2,2,1,1,"R",1,1,"R","R",1,1,"R","R",1,2,2,1,1,"R",1,1,"R","R",1,1,"R","R",1,2,2]
[null,null,null,"Aout-23","Aout","2023-08-01","2023-08-02","2023-08-03","2023-08-04","2023-08-05","2023-08-06","2023-08-07","2023-08-08","2023-08-09","2023-08-10","2023-08-11","2023-08-12","2023-08-13","2023-08-14","2023-08-15","2023-08-16","2023-08-17","2023-08-18","2023-08-19","2023-08-20","2023-08-21","2023-08-22","2023-08-23","2023-08-24","2023-08-25","2023-08-26","2023-08-27","2023-08-28","2023-08-29","2023-08-30","2023-08-31"]
[null,null,null,"2023-08-01","Isabelle",2,3,2,1,"R",2,"R","R",2,2,2,3,"R","R",2,3,2,1,"R",2,"R","R",2,2,2,3,"R","R",2,3,2]
[null,null,null,"2023-08-02","Sylvine","R",2,"R",2,2,"R","R",2,3,"R",1,2,2,"R","R",2,"R",2,2,"R","R",2,3,"R",1,2,2,"R","R",2,"R"]
[null,null,null,"2023-08-03","Élodie",2,"R",1,2,2,"R","R",1,1,3,1,1,"R","R","R",2,2,"R","R",2,2,2,"R",1,2,2,"R","R",1,1,3]
[null,null,null,"2023-08-04","Nathalie","R",2,2,"R","R",2,2,2,"R",1,2,2,"R","R",1,1,3,1,1,"R","R","R",2,2,"R","R",2,2,2,"R",1]
[null,null,null,"2023-08-05","Marylène",1,1,3,1,1,"R","R","R",2,2,"R","R",2,2,2,"R",1,2,2,"R","R",1,1,3,1,1,"R","R","R",2,2]
[null,null,null,"2023-08-06","Karl","R",1,1,"R",1,2,2,"R",1,1,1,1,"R","R","R",1,1,"R",1,2,2,"R",1,1,1,1,"R","R","R",1,1]
[null,null,null,"2023-08-07","Mickaël",1,1,"R",1,1,"R","R",1,1,"R","R",1,2,2,1,1,"R",1,1,"R","R",1,1,"R","R",1,2,2,1,1,"R"]
[null,null,null,"Sept-23","Septembre","2023-09-01","2023-09-02","2023-09-03","2023-09-04","2023-09-05","2023-09-06","2023-09-07","2023-09-08","2023-09-09","2023-09-10","2023-09-11","2023-09-12","2023-09-13","2023-09-14","2023-09-15","2023-09-16","2023-09-17","2023-09-18","2023-09-19","2023-09-20","2023-09-21","2023-09-22","2023-09-23","2023-09-24","2023-09-25","2023-09-26","2023-09-27","2023-09-28","2023-09-29","2023-09-30"]
[null,null,null,"2023-09-01","Isabelle",1,"R",2,"R","R",2,2,2,3,"R","R",2,3,2,1,"R",2,"R","R",2,2,2,3,"R","R",2,3,2,1,"R"]
[null,null,null,"2023-09-02","Sylvine",2,2,"R","R",2,3,"R",1,2,2,"R","R",2,"R",2,2,"R","R",2,3,"R",1,2,2,"R","R",2,"R",2,2]
[null,null,null,"2023-09-03","Élodie",1,1,"R","R","R",2,2,"R","R",2,2,2,"R",1,2,2,"R","R",1,1,3,1,1,"R","R","R",2,2,"R","R"]
[null,null,null,"2023-09-04","Nathalie",2,2,"R","R",1,1,3,1,1,"R","R","R",2,2,"R","R",2,2,2,"R",1,2,2,"R","R",1,1,3,1,1]
[null,null,null,"2023-09-05","Marylène","R","R",2,2,2,"R",1,2,2,"R","R",1,1,3,1,1,"R","R","R",2,2,"R","R",2,2,2,"R",1,2,2]
[null,null,null,"2023-09-06","Karl","R",1,2,2,"R",1,1,1,1,"R","R","R",1,1,"R",1,2,2,"R",1,1,1,1,"R","R","R",1,1,"R",1]
[null,null,null,"2023-09-07","Mickaël",1,1,"R","R",1,1,"R","R",1,2,2,1,1,"R",1,1,"R","R",1,1,"R","R",1,2,2,1,1,"R",1,1]
[null,null,null,"Oct-23","Octobre","2023-10-01","2023-10-02","2023-10-03","2023-10-04","2023-10-05","2023-10-06","2023-10-07","2023-10-08","2023-10-09","2023-10-10","2023-10-11","2023-10-12","2023-10-13","2023-10-14","2023-10-15","2023-10-16","2023-10-17","2023-10-18","2023-10-19","2023-10-20","2023-10-21","2023-10-22","2023-10-23","2023-10-24","2023-10-25","2023-10-26","2023-10-27","2023-10-28","2023-10-29","2023-10-30","2023-10-31"]
[null,null,null,"2023-10-01","Isabelle",2,"R","R",2,2,2,3,"R","R",2,3,2,1,"R",2,"R","R",2,2,2,3,"R","R",2,3,2,1,"R",2,"R","R"]
[null,null,null,"2023-10-02","Sylvine","R","R",2,3,"R",1,2,2,"R","R",2,"R",2,2,"R","R",2,3,"R",1,2,2,"R","R",2,"R",2,2,"R","R",2]
[null,null,null,"2023-10-03","Élodie",2,2,2,"R",1,2,2,"R","R",1,1,3,1,1,"R","R","R",2,2,"R","R",2,2,2,"R",1,2,2,"R","R",1]
[null,null,null,"2023-10-04","Nathalie","R","R","R",2,2,"R","R",2,2,2,"R",1,2,2,"R","R",1,1,3,1,1,"R","R","R",2,2,"R","R",2,2,2]
[null,null,null,"2023-10-05","Marylène","R","R",1,1,3,1,1,"R","R","R",2,2,"R","R",2,2,2,"R",1,2,2,"R","R",1,1,3,1,1,"R","R","R"]
[null,null,null,"2023-10-06","Karl",2,2,"R",1,1,1,1,"R","R","R",1,1,"R",1,2,2,"R",1,1,1,1,"R","R","R",1,1,"R",1,2,2,"R"]
[null,null,null,"2023-10-07","Mickaël","R","R",1,1,"R","R",1,2,2,1,1,"R",1,1,"R","R",1,1,"R","R",1,2,2,1,1,"R",1,1,"R","R",1]
[null,null,null,"Nov-23","Novembre","2023-11-01","2023-11-02","2023-11-03","2023-11-04","2023-11-05","2023-11-06","2023-11-07","2023-11-08","2023-11-09","2023-11-10","2023-11-11","2023-11-12","2023-11-13","2023-11-14","2023-11-15","2023-11-16","2023-11-17","2023-11-18","2023-11-19","2023-11-20","2023-11-21","2023-11-22","2023-11-23","2023-11-24","2023-11-25","2023-11-26","2023-11-27","2023-11-28","2023-11-29","2023-11-30"]
[null,null,null,"2023-11-01","Isabelle",2,2,2,3,"R","R",2,3,2,1,"R",2,"R","R",2,2,2,3,"R","R",2,3,2,1,"R",2,"R","R",2,2]
[null,null,null,"2023-11-02","Sylvine",3,"R",1,2,2,"R","R",2,"R",2,2,"R","R",2,3,"R",1,2,2,"R","R",2,"R",2,2,"R","R",2,3,"R"]
[null,null,null,"2023-11-03","Élodie",1,3,1,1,"R","R","R",2,2,"R","R",2,2,2,"R",1,2,2,"R","R",1,1,3,1,1,"R","R","R",2,2]
[null,null,null,"2023-11-04","Nathalie","R",1,2,2,"R","R",1,1,3,1,1,"R","R","R",2,2,"R","R",2,2,2,"R",1,2,2,"R","R",1,1,3]
[null,null,null,"2023-11-05","Marylène",2,2,"R","R",2,2,2,"R",1,2,2,"R","R",1,1,3,1,1,"R","R","R",2,2,"R","R",2,2,2,"R",1]
[null,null,null,"2023-11-06","Karl",1,1,1,1,"R","R","R",1,1,"R",1,2,2,"R",1,1,1,1,"R","R","R",1,1,"R",1,2,2,"R",1,1]
[null,null,null,"2023-11-07","Mickaël",1,"R","R",1,2,2,1,1,"R",1,1,"R","R",1,1,"R","R",1,2,2,1,1,"R",1,1,"R","R",1,1,"R"]
[null,null,null,"Dec-23","Décembre","2023-12-01","2023-12-02","2023-12-03","2023-12-04","2023-12-05","2023-12-06","2023-12-07","2023-12-08","2023-12-09","2023-12-10","2023-12-11","2023-12-12","2023-12-13","2023-12-14","2023-12-15","2023-12-16","2023-12-17","2023-12-18","2023-12-19","2023-12-20","2023-12-21","2023-12-22","2023-12-23","2023-12-24","2023-12-25","2023-12-26","2023-12-27","2023-12-28","2023-12-29","2023-12-30","2023-12-31"]
[null,null,null,"2023-12-01","Isabelle",2,3,"R","R",2,3,2,1,"R",2,"R","R",2,2,2,3,"R","R",2,3,2,1,"R",2,"R","R",2,2,2,3,"R"]
[null,null,null,"2023-12-02","Sylvine",1,2,2,"R","R",2,"R",2,2,"R","R",2,3,"R",1,2,2,"R","R",2,"R",2,2,"R","R",2,3,"R",1,2,2]
[null,null,null,"2023-12-03","Élodie","R","R",2,2,2,"R",1,2,2,"R","R",1,1,3,1,1,"R","R","R",2,2,"R","R",2,2,2,"R",1,2,2,"R"]
[null,null,null,"2023-12-04","Nathalie",1,1,"R","R","R",2,2,"R","R",2,2,2,"R",1,2,2,"R","R",1,1,3,1,1,"R","R","R",2,2,"R","R",2]
[null,null,null,"2023-12-05","Marylène",2,2,"R","R",1,1,3,1,1,"R","R","R",2,2,"R","R",2,2,2,"R",1,2,2,"R","R",1,1,3,1,1,"R"]
[null,null,null,"2023-12-06","Karl",1,1,"R","R","R",1,1,"R",1,2,2,"R",1,1,1,1,"R","R","R",1,1,"R",1,2,2,"R",1,1,1,1,"R"]
[null,null,null,"2023-12-07","Mickaël","R",1,2,2,1,1,"R",1,1,"R","R",1,1,"R","R",1,2,2,1,1,"R",1,1,"R","R",1,1,"R","R",1,2]
[null,null,null,"Janv-24","Janvier","2024-01-01","2024-01-02","2024-01-03","2024-01-04","2024-01-05","2024-01-06","2024-01-07","2024-01-08","2024-01-09","2024-01-10","2024-01-11","2024-01-12","2024-01-13","2024-01-14","2024-01-15","2024-01-16","2024-01-17","2024-01-18","2024-01-19","2024-01-20","2024-01-21","2024-01-22","2024-01-23","2024-01-24","2024-01-25","2024-01-26","2024-01-27","2024-01-28","2024-01-29","2024-01-30","2024-01-31"]
[null,null,null,"2024-01-01","Isabelle","R",2,3,2,1,"R",2,"R","R",2,2,2,3,"R","R",2,3,2,1,"R",2,"R","R",2,2,2,3,"R","R",2,3]
[null,null,null,"2024-01-02","Sylvine","R","R",2,"R",2,2,"R","R",2,3,"R",1,2,2,"R","R",2,"R",2,2,"R","R",2,3,"R",1,2,2,"R","R",2]
[null,null,null,"2024-01-03","Élodie","R",1,1,3,1,1,"R","R","R",2,2,"R","R",2,2,2,"R",1,2,2,"R","R",1,1,3,1,1,"R","R","R",2]
[null,null,null,"2024-01-04","Nathalie",2,2,"R",1,2,2,"R","R",1,1,3,1,1,"R","R","R",2,2,"R","R",2,2,2,"R",1,2,2,"R","R",1,1]
[null,null,null,"2024-01-05","Marylène","R","R",2,2,"R","R",2,2,2,"R",1,2,2,"R","R",1,1,3,1,1,"R","R","R",2,2,"R","R",2,2,2,"R"]
[null,null,null,"2024-01-06","Karl","R","R",1,1,"R",1,2,2,"R",1,1,1,1,"R","R","R",1,1,"R",1,2,2,"R",1,1,1,1,"R","R","R",1]
[null,null,null,"2024-01-07","Mickaël",2,1,1,"R",1,1,"R","R",1,1,"R","R",1,2,2,1,1,"R",1,1,"R","R",1,1,"R","R",1,2,2,1,1]
[null,null,null,"Fevr-24","Février","2024-02-01","2024-02-02","2024-02-03","2024-02-04","2024-02-05","2024-02-06","2024-02-07","2024-02-08","2024-02-09","2024-02-10","2024-02-11","2024-02-12","2024-02-13","2024-02-14","2024-02-15","2024-02-16","2024-02-17","2024-02-18","2024-02-19","2024-02-20","2024-02-21","2024-02-22","2024-02-23","2024-02-24","2024-02-25","2024-02-26","2024-02-27","2024-02-28","2024-02-29"]
[null,null,null,"2024-02-01","Isabelle",2,1,"R",2,"R","R",2,2,2,3,"R","R",2,3,2,1,"R",2,"R","R",2,2,2,3,"R","R",2,3,2]
[null,null,null,"2024-02-02","Sylvine","R",2,2,"R","R",2,3,"R",1,2,2,"R","R",2,"R",2,2,"R","R",2,3,"R",1,2,2,"R","R",2,"R"]
[null,null,null,"2024-02-03","Élodie",2,"R","R",2,2,2,"R",1,2,2,"R","R",1,1,3,1,1,"R","R","R",2,2,"R","R",2,2,2,"R",1]
[null,null,null,"2024-02-04","Nathalie",3,1,1,"R","R","R",2,2,"R","R",2,2,2,"R",1,2,2,"R","R",1,1,3,1,1,"R","R","R",2,2]
[null,null,null,"2024-02-05","Marylène",1,2,2,"R","R",1,1,3,1,1,"R","R","R",2,2,"R","R",2,2,2,"R",1,2,2,"R","R",1,1,3]
[null,null,null,"2024-02-06","Karl",1,"R",1,2,2,"R",1,1,1,1,"R","R","R",1,1,"R",1,2,2,"R",1,1,1,1,"R","R","R",1,1]
[null,null,null,"2024-02-07","Mickaël","R",1,1,"R","R",1,1,"R","R",1,2,2,1,1,"R",1,1,"R","R",1,1,"R","R",1,2,2,1,1,"R"]
[null,null,null,"Mars-24","Mars","2024-03-01","2024-03-02","2024-03-03","2024-03-04","2024-03-05","2024-03-06","2024-03-07","2024-03-08","2024-03-09","2024-03-10","2024-03-11","2024-03-12","2024-03-13","2024-03-14","2024-03-15","2024-03-16","2024-03-17","2024-03-18","2024-03-19","2024-03-20","2024-03-21","2024-03-22","2024-03-23","2024-03-24","2024-03-25","2024-03-26","2024-03-27","2024-03-28","2024-03-29","2024-03-30","2024-03-31"]
[null,null,null,"2024-03-01","Isabelle",1,"R",2,"R","R",2,2,2,3,"R","R",2,3,2,1,"R",2,"R","R",2,2,2,3,"R","R",2,3,2,1,"R",2]
[null,null,null,"2024-03-02","Sylvine",2,2,"R","R",2,3,"R",1,2,2,"R","R",2,"R",2,2,"R","R",2,3,"R",1,2,2,"R","R",2,"R",2,2,"R"]
[null,null,null,"2024-03-03","Élodie",2,2,"R","R",1,1,3,1,1,"R","R","R",2,2,"R","R",2,2,2,"R",1,2,2,"R","R",1,1,3,1,1,"R"]
[null,null,null,"2024-03-04","Nathalie","R","R",2,2,2,"R",1,2,2,"R","R",1,1,3,1,1,"R","R","R",2,2,"R","R",2,2,2,"R",1,2,2,"R"]
[null,null,null,"2024-03-05","Marylène",1,1,"R","R","R",2,2,"R","R",2,2,2,"R",1,2,2,"R","R",1,1,3,1,1,"R","R","R",2,2,"R","R",2]
[null,null,null,"2024-03-06","Karl","R",1,2,2,"R",1,1,1,1,"R","R","R",1,1,"R",1,2,2,"R",1,1,1,1,"R","R","R",1,1,"R",1,2]
[null,null,null,"2024-03-07","Mickaël",1,1,"R","R",1,1,"R","R",1,2,2,1,1,"R",1,1,"R","R",1,1,"R","R",1,2,2,1,1,"R",1,1,"R"]
[null,null,null,"Avr-24","Avril","2024-04-01","2024-04-02","2024-04-03","2024-04-04","2024-04-05","2024-04-06","2024-04-07","2024-04-08","2024-04-09","2024-04-10","2024-04-11","2024-04-12","2024-04-13","2024-04-14","2024-04-15","2024-04-16","2024-04-17","2024-04-18","2024-04-19","2024-04-20","2024-04-21","2024-04-22","2024-04-23","2024-04-24","2024-04-25","2024-04-26","2024-04-27","2024-04-28","2024-04-29","2024-04-30"]
[null,null,null,"2024-04-01","Isabelle","R","R",2,2,2,3,"R","R",2,3,2,1,"R",2,"R","R",2,2,2,3,"R","R",2,3,2,1,"R",2,"R","R"]
[null,null,null,"2024-04-02","Sylvine","R",2,3,"R",1,2,2,"R","R",2,"R",2,2,"R","R",2,3,"R",1,2,2,"R","R",2,"R",2,2,"R","R",2]
[null,null,null,"2024-04-03","Élodie","R","R",2,2,"R","R",2,2,2,"R",1,2,2,"R","R",1,1,3,1,1,"R","R","R",2,2,"R","R",2,2,2]
[null,null,null,"2024-04-04","Nathalie","R",1,1,3,1,1,"R","R","R",2,2,"R","R",2,2,2,"R",1,2,2,"R","R",1,1,3,1,1,"R","R","R"]
[null,null,null,"2024-04-05","Marylène",2,2,"R",1,2,2,"R","R",1,1,3,1,1,"R","R","R",2,2,"R","R",2,2,2,"R",1,2,2,"R","R",1]
[null,null,null,"2024-04-06","Karl",2,"R",1,1,1,1,"R","R","R",1,1,"R",1,2,2,"R",1,1,1,1,"R","R","R",1,1,"R",1,2,2,"R"]
[null,null,null,"2024-04-07","Mickaël","R",1,1,"R","R",1,2,2,1,1,"R",1,1,"R","R",1,1,"R","R",1,2,2,1,1,"R",1,1,"R","R",1]
[null,null,null,"Mai-24","Mai","2024-05-01","2024-05-02","2024-05-03","2024-05-04","2024-05-05","2024-05-06","2024-05-07","2024-05-08","2024-05-09","2024-05-10","2024-05-11","2024-05-12","2024-05-13","2024-05-14","2024-05-15","2024-05-16","2024-05-17","2024-05-18","2024-05-19","2024-05-20","2024-05-21","2024-05-22","2024-05-23","2024-05-24","2024-05-25","2024-05-26","2024-05-27","2024-05-28","2024-05-29","2024-05-30","2024-05-31"]
[null,null,null,"2024-05-01","Isabelle",2,2,2,3,"R","R",2,3,2,1,"R",2,"R","R",2,2,2,3,"R","R",2,3,2,1,"R",2,"R","R",2,2,2]
[null,null,null,"2024-05-02","Sylvine",3,"R",1,2,2,"R","R",2,"R",2,2,"R","R",2,3,"R",1,2,2,"R","R",2,"R",2,2,"R","R",2,3,"R",1]
[null,null,null,"2024-05-03","Élodie","R",1,2,2,"R","R",1,1,3,1,1,"R","R","R",2,2,"R","R",2,2,2,"R",1,2,2,"R","R",1,1,3,1]
[null,null,null,"2024-05-04","Nathalie",2,2,"R","R",2,2,2,"R",1,2,2,"R","R",1,1,3,1,1,"R","R","R",2,2,"R","R",2,2,2,"R",1,2]
[null,null,null,"2024-05-05","Marylène",1,3,1,1,"R","R","R",2,2,"R","R",2,2,2,"R",1,2,2,"R","R",1,1,3,1,1,"R","R","R",2,2,"R"]
[null,null,null,"2024-05-06","Karl",1,1,1,1,"R","R","R",1,1,"R",1,2,2,"R",1,1,1,1,"R","R","R",1,1,"R",1,2,2,"R",1,1,1]
[null,null,null,"2024-05-07","Mickaël",1,"R","R",1,2,2,1,1,"R",1,1,"R","R",1,1,"R","R",1,2,2,1,1,"R",1,1,"R","R",1,1,"R","R"]
[null,null,null,"Juin-24","Juin","2024-06-01","2024-06-02","2024-06-03","2024-06-04","2024-06-05","2024-06-06","2024-06-07","2024-06-08","2024-06-09","2024-06-10","2024-06-11","2024-06-12","2024-06-13","2024-06-14","2024-06-15","2024-06-16","2024-06-17","2024-06-18","2024-06-19","2024-06-20","2024-06-21","2024-06-22","2024-06-23","2024-06-24","2024-06-25","2024-06-26","2024-06-27","2024-06-28","2024-06-29","2024-06-30"]
[null,null,null,"2024-06-01","Isabelle",3,"R","R",2,3,2,1,"R",2,"R","R",2,2,2,3,"R","R",2,3,2,1,"R",2,"R","R",2,2,2,3,"R"]
[null,null,null,"2024-06-02","Sylvine",2,2,"R","R",2,"R",2,2,"R","R",2,3,"R",1,2,2,"R","R",2,"R",2,2,"R","R",2,3,"R",1,2,2]
[null,null,null,"2024-06-03","Élodie",1,"R","R","R",2,2,"R","R",2,2,2,"R",1,2,2,"R","R",1,1,3,1,1,"R","R","R",2,2,"R","R",2]
[null,null,null,"2024-06-04","Nathalie",2,"R","R",1,1,3,1,1,"R","R","R",2,2,"R","R",2,2,2,"R",1,2,2,"R","R",1,1,3,1,1,"R"]
[null,null,null,"2024-06-05","Marylène","R",2,2,2,"R",1,2,2,"R","R",1,1,3,1,1,"R","R","R",2,2,"R","R",2,2,2,"R",1,2,2,"R"]
[null,null,null,"2024-06-06","Karl",1,"R","R","R",1,1,"R",1,2,2,"R",1,1,1,1,"R","R","R",1,1,"R",1,2,2,"R",1,1,1,1,"R"]
[null,null,null,"2024-06-07","Mickaël",1,2,2,1,1,"R",1,1,"R","R",1,1,"R","R",1,2,2,1,1,"R",1,1,"R","R",1,1,"R","R",1,2]
[null,null,null,"Juil-24","Juillet","2024-07-01","2024-07-02","2024-07-03","2024-07-04","2024-07-05","2024-07-06","2024-07-07","2024-07-08","2024-07-09","2024-07-10","2024-07-11","2024-07-12","2024-07-13","2024-07-14","2024-07-15","2024-07-16","2024-07-17","2024-07-18","2024-07-19","2024-07-20","2024-07-21","2024-07-22","2024-07-23","2024-07-24","2024-07-25","2024-07-26","2024-07-27","2024-07-28","2024-07-29","2024-07-30","2024-07-31"]
[null,null,null,"2024-07-01","Isabelle","R",2,3,2,1,"R",2,"R","R",2,2,2,3,"R","R",2,3,2,1,"R",2,"R","R",2,2,2,3,"R","R",2,3]
[null,null,null,"2024-07-02","Sylvine","R","R",2,"R",2,2,"R","R",2,3,"R",1,2,2,"R","R",2,"R",2,2,"R","R",2,3,"R",1,2,2,"R","R",2]
[null,null,null,"2024-07-03","Élodie",2,2,"R",1,2,2,"R","R",1,1,3,1,1,"R","R","R",2,2,"R","R",2,2,2,"R",1,2,2,"R","R",1,1]
[null,null,null,"2024-07-04","Nathalie","R","R",2,2,"R","R",2,2,2,"R",1,2,2,"R","R",1,1,3,1,1,"R","R","R",2,2,"R","R",2,2,2,"R"]
[null,null,null,"2024-07-05","Marylène","R",1,1,3,1,1,"R","R","R",2,2,"R","R",2,2,2,"R",1,2,2,"R","R",1,1,3,1,1,"R","R","R",2]
[null,null,null,"2024-07-06","Karl","R","R",1,1,"R",1,2,2,"R",1,1,1,1,"R","R","R",1,1,"R",1,2,2,"R",1,1,1,1,"R","R","R",1]
[null,null,null,"2024-07-07","Mickaël",2,1,1,"R",1,1,"R","R",1,1,"R","R",1,2,2,1,1,"R",1,1,"R","R",1,1,"R","R",1,2,2,1,1]
[null,null,null,"Aout-24","Aout","2024-08-01","2024-08-02","2024-08-03","2024-08-04","2024-08-05","2024-08-06","2024-08-07","2024-08-08","2024-08-09","2024-08-10","2024-08-11","2024-08-12","2024-08-13","2024-08-14","2024-08-15","2024-08-16","2024-08-17","2024-08-18","2024-08-19","2024-08-20","2024-08-21","2024-08-22","2024-08-23","2024-08-24","2024-08-25","2024-08-26","2024-08-27","2024-08-28","2024-08-29","2024-08-30","2024-08-31"]
[null,null,null,"2024-08-01","Isabelle",2,1,"R",2,"R","R",2,2,2,3,"R","R",2,3,2,1,"R",2,"R","R",2,2,2,3,"R","R",2,3,2,1,"R"]
[null,null,null,"2024-08-02","Sylvine","R",2,2,"R","R",2,3,"R",1,2,2,"R","R",2,"R",2,2,"R","R",2,3,"R",1,2,2,"R","R",2,"R",2,2]
[null,null,null,"2024-08-03","Élodie",3,1,1,"R","R","R",2,2,"R","R",2,2,2,"R",1,2,2,"R","R",1,1,3,1,1,"R","R","R",2,2,"R","R"]
[null,null,null,"2024-08-04","Nathalie",1,2,2,"R","R",1,1,3,1,1,"R","R","R",2,2,"R","R",2,2,2,"R",1,2,2,"R","R",1,1,3,1,1]
[null,null,null,"2024-08-05","Marylène",2,"R","R",2,2,2,"R",1,2,2,"R","R",1,1,3,1,1,"R","R","R",2,2,"R","R",2,2,2,"R",1,2,2]
[null,null,null,"2024-08-06","Karl",1,"R",1,2,2,"R",1,1,1,1,"R","R","R",1,1,"R",1,2,2,"R",1,1,1,1,"R","R","R",1,1,"R",1]
[null,null,null,"2024-08-07","Mickaël","R",1,1,"R","R",1,1,"R","R",1,2,2,1,1,"R",1,1,"R","R",1,1,"R","R",1,2,2,1,1,"R",1,1]
[null,null,null,"Sept-24","Septembre","2024-09-01","2024-09-02","2024-09-03","2024-09-04","2024-09-05","2024-09-06","2024-09-07","2024-09-08","2024-09-09","2024-09-10","2024-09-11","2024-09-12","2024-09-13","2024-09-14","2024-09-15","2024-09-16","2024-09-17","2024-09-18","2024-09-19","2024-09-20","2024-09-21","2024-09-22","2024-09-23","2024-09-24","2024-09-25","2024-09-26","2024-09-27","2024-09-28","2024-09-29","2024-09-30"]
[null,null,null,"2024-09-01","Isabelle",2,"R","R",2,2,2,3,"R","R",2,3,2,1,"R",2,"R","R",2,2,2,3,"R","R",2,3,2,1,"R",2,"R"]
[null,null,null,"2024-09-02","Sylvine","R","R",2,3,"R",1,2,2,"R","R",2,"R",2,2,"R","R",2,3,"R",1,2,2,"R","R",2,"R",2,2,"R","R"]
[null,null,null,"2024-09-03","Élodie",2,2,2,"R",1,2,2,"R","R",1,1,3,1,1,"R","R","R",2,2,"R","R",2,2,2,"R",1,2,2,"R","R"]
[null,null,null,"2024-09-04","Nathalie","R","R","R",2,2,"R","R",2,2,2,"R",1,2,2,"R","R",1,1,3,1,1,"R","R","R",2,2,"R","R",2,2]
[null,null,null,"2024-09-05","Marylène","R","R",1,1,3,1,1,"R","R","R",2,2,"R","R",2,2,2,"R",1,2,2,"R","R",1,1,3,1,1,"R","R"]
[null,null,null,"2024-09-06","Karl",2,2,"R",1,1,1,1,"R","R","R",1,1,"R",1,2,2,"R",1,1,1,1,"R","R","R",1,1,"R",1,2,2]
[null,null,null,"2024-09-07","Mickaël","R","R",1,1,"R","R",1,2,2,1,1,"R",1,1,"R","R",1,1,"R","R",1,2,2,1,1,"R",1,1,"R","R"]
[null,null,null,"Oct-24","Octobre","2024-10-01","2024-10-02","2024-10-03","2024-10-04","2024-10-05","2024-10-06","2024-10-07","2024-10-08","2024-10-09","2024-10-10","2024-10-11","2024-10-12","2024-10-13","2024-10-14","2024-10-15","2024-10-16","2024-10-17","2024-10-18","2024-10-19","2024-10-20","2024-10-21","2024-10-22","2024-10-23","2024-10-24","2024-10-25","2024-10-26","2024-10-27","2024-10-28","2024-10-29","2024-10-30","2024-10-31"]
[null,null,null,"2024-10-01","Isabelle","R",2,2,2,3,"R","R",2,3,2,1,"R",2,"R","R",2,2,2,3,"R","R",2,3,2,1,"R",2,"R","R",2,2]
[null,null,null,"2024-10-02","Sylvine",2,3,"R",1,2,2,"R","R",2,"R",2,2,"R","R",2,3,"R",1,2,2,"R","R",2,"R",2,2,"R","R",2,3,"R"]
[null,null,null,"2024-10-03","Élodie",1,1,3,1,1,"R","R","R",2,2,"R","R",2,2,2,"R",1,2,2,"R","R",1,1,3,1,1,"R","R","R",2,2]
[null,null,null,"2024-10-04","Nathalie",2,"R",1,2,2,"R","R",1,1,3,1,1,"R","R","R",2,2,"R","R",2,2,2,"R",1,2,2,"R","R",1,1,3]
[null,null,null,"2024-10-05","Marylène","R",2,2,"R","R",2,2,2,"R",1,2,2,"R","R",1,1,3,1,1,"R","R","R",2,2,"R","R",2,2,2,"R",1]
[null,null,null,"2024-10-06","Karl","R",1,1,1,1,"R","R","R",1,1,"R",1,2,2,"R",1,1,1,1,"R","R","R",1,1,"R",1,2,2,"R",1,1]
[null,null,null,"2024-10-07","Mickaël",1,1,"R","R",1,2,2,1,1,"R",1,1,"R","R",1,1,"R","R",1,2,2,1,1,"R",1,1,"R","R",1,1,"R"]
[null,null,null,"Nov-24","Novembre","2024-11-01","2024-11-02","2024-11-03","2024-11-04","2024-11-05","2024-11-06","2024-11-07","2024-11-08","2024-11-09","2024-11-10","2024-11-11","2024-11-12","2024-11-13","2024-11-14","2024-11-15","2024-11-16","2024-11-17","2024-11-18","2024-11-19","2024-11-20","2024-11-21","2024-11-22","2024-11-23","2024-11-24","2024-11-25","2024-11-26","2024-11-27","2024-11-28","2024-11-29","2024-11-30"]
[null,null,null,"2024-11-01","Isabelle",2,3,"R","R",2,3,2,1,"R",2,"R","R",2,2,2,3,"R","R",2,3,2,1,"R",2,"R","R",2,2,2,3]
[null,null,null,"2024-11-02","Sylvine",1,2,2,"R","R",2,"R",2,2,"R","R",2,3,"R",1,2,2,"R","R",2,"R",2,2,"R","R",2,3,"R",1,2]
[null,null,null,"2024-11-03","Élodie","R","R",2,2,2,"R",1,2,2,"R","R",1,1,3,1,1,"R","R","R",2,2,"R","R",2,2,2,"R",1,2,2]
[null,null,null,"2024-11-04","Nathalie",1,1,"R","R","R",2,2,"R","R",2,2,2,"R",1,2,2,"R","R",1,1,3,1,1,"R","R","R",2,2,"R","R"]
[null,null,null,"2024-11-05","Marylène",2,2,"R","R",1,1,3,1,1,"R","R","R",2,2,"R","R",2,2,2,"R",1,2,2,"R","R",1,1,3,1,1]
[null,null,null,"2024-11-06","Karl",1,1,"R","R","R",1,1,"R",1,2,2,"R",1,1,1,1,"R","R","R",1,1,"R",1,2,2,"R",1,1,1,1]
[null,null,null,"2024-11-07","Mickaël","R",1,2,2,1,1,"R",1,1,"R","R",1,1,"R","R",1,2,2,1,1,"R",1,1,"R","R",1,1,"R","R",1]
[null,null,null,"Dec-24","Décembre","2024-12-01","2024-12-02","2024-12-03","2024-12-04","2024-12-05","2024-12-06","2024-12-07","2024-12-08","2024-12-09","2024-12-10","2024-12-11","2024-12-12","2024-12-13","2024-12-14","2024-12-15","2024-12-16","2024-12-17","2024-12-18","2024-12-19","2024-12-20","2024-12-21","2024-12-22","2024-12-23","2024-12-24","2024-12-25","2024-12-26","2024-12-27","2024-12-28","2024-12-29","2024-12-30","2024-12-31"]
[null,null,null,"2024-12-01","Isabelle","R","R",2,3,2,1,"R",2,"R","R",2,2,2,3,"R","R",2,3,2,1,"R",2,"R","R",2,2,2,3,"R","R",2]
[null,null,null,"2024-12-02","Sylvine",2,"R","R",2,"R",2,2,"R","R",2,3,"R",1,2,2,"R","R",2,"R",2,2,"R","R",2,3,"R",1,2,2,"R","R"]
[null,null,null,"2024-12-03","Élodie","R","R",1,1,3,1,1,"R","R","R",2,2,"R","R",2,2,2,"R",1,2,2,"R","R",1,1,3,1,1,"R","R","R"]
[null,null,null,"2024-12-04","Nathalie",2,2,2,"R",1,2,2,"R","R",1,1,3,1,1,"R","R","R",2,2,"R","R",2,2,2,"R",1,2,2,"R","R",1]
[null,null,null,"2024-12-05","Marylène","R","R","R",2,2,"R","R",2,2,2,"R",1,2,2,"R","R",1,1,3,1,1,"R","R","R",2,2,"R","R",2,2,2]
[null,null,null,"2024-12-06","Karl","R","R","R",1,1,"R",1,2,2,"R",1,1,1,1,"R","R","R",1,1,"R",1,2,2,"R",1,1,1,1,"R","R","R"]
[null,null,null,"2024-12-07","Mickaël",2,2,1,1,"R",1,1,"R","R",1,1,"R","R",1,2,2,1,1,"R",1,1,"R","R",1,1,"R","R",1,2,2,1]
[null,null,null,"Janv-25","Janvier","2025-01-01","2025-01-02","2025-01-03","2025-01-04","2025-01-05","2025-01-06","2025-01-07","2025-01-08","2025-01-09","2025-01-10","2025-01-11","2025-01-12","2025-01-13","2025-01-14","2025-01-15","2025-01-16","2025-01-17","2025-01-18","2025-01-19","2025-01-20","2025-01-21","2025-01-22","2025-01-23","2025-01-24","2025-01-25","2025-01-26","2025-01-27","2025-01-28","2025-01-29","2025-01-30","2025-01-31"]
[null,null,null,"2025-01-01","Isabelle",3,2,1,"R",2,"R","R",2,2,2,3,"R","R",2,3,2,1,"R",2,"R","R",2,2,2,3,"R","R",2,3,2,1]
[null,null,null,"2025-01-02","Sylvine",2,"R",2,2,"R","R",2,3,"R",1,2,2,"R","R",2,"R",2,2,"R","R",2,3,"R",1,2,2,"R","R",2,"R",2]
[null,null,null,"2025-01-03","Élodie",2,2,"R","R",2,2,2,"R",1,2,2,"R","R",1,1,3,1,1,"R","R","R",2,2,"R","R",2,2,2,"R",1,2]
[null,null,null,"2025-01-04","Nathalie",1,3,1,1,"R","R","R",2,2,"R","R",2,2,2,"R",1,2,2,"R","R",1,1,3,1,1,"R","R","R",2,2,"R"]
[null,null,null,"2025-01-05","Marylène","R",1,2,2,"R","R",1,1,3,1,1,"R","R","R",2,2,"R","R",2,2,2,"R",1,2,2,"R","R",1,1,3,1]
[null,null,null,"2025-01-06","Karl",1,1,"R",1,2,2,"R",1,1,1,1,"R","R","R",1,1,"R",1,2,2,"R",1,1,1,1,"R","R","R",1,1,"R"]
[null,null,null,"2025-01-07","Mickaël",1,"R",1,1,"R","R",1,1,"R","R",1,2,2,1,1,"R",1,1,"R","R",1,1,"R","R",1,2,2,1,1,"R",1]
[null,null,null,"Fevr-25","Février","2025-02-01","2025-02-02","2025-02-03","2025-02-04","2025-02-05","2025-02-06","2025-02-07","2025-02-08","2025-02-09","2025-02-10","2025-02-11","2025-02-12","2025-02-13","2025-02-14","2025-02-15","2025-02-16","2025-02-17","2025-02-18","2025-02-19","2025-02-20","2025-02-21","2025-02-22","2025-02-23","2025-02-24","2025-02-25","2025-02-26","2025-02-27","2025-02-28"]
[null,null,null,"2025-02-01","Isabelle","R",2,"R","R",2,2,2,3,"R","R",2,3,2,1,"R",2,"R","R",2,2,2,3,"R","R",2,3,2,1]
[null,null,null,"2025-02-02","Sylvine",2,"R","R",2,3,"R",1,2,2,"R","R",2,"R",2,2,"R","R",2,3,"R",1,2,2,"R","R",2,"R",2]
[null,null,null,"2025-02-03","Élodie",2,"R","R",1,1,3,1,1,"R","R","R",2,2,"R","R",2,2,2,"R",1,2,2,"R","R",1,1,3,1]
[null,null,null,"2025-02-04","Nathalie","R",2,2,2,"R",1,2,2,"R","R",1,1,3,1,1,"R","R","R",2,2,"R","R",2,2,2,"R",1,2]
[null,null,null,"2025-02-05","Marylène",1,"R","R","R",2,2,"R","R",2,2,2,"R",1,2,2,"R","R",1,1,3,1,1,"R","R","R",2,2,"R"]
[null,null,null,"2025-02-06","Karl",1,2,2,"R",1,1,1,1,"R","R","R",1,1,"R",1,2,2,"R",1,1,1,1,"R","R","R",1,1,"R"]
[null,null,null,"2025-02-07","Mickaël",1,"R","R",1,1,"R","R",1,2,2,1,1,"R",1,1,"R","R",1,1,"R","R",1,2,2,1,1,"R",1]
[null,null,null,"Mars-25","Mars","2025-03-01","2025-03-02","2025-03-03","2025-03-04","2025-03-05","2025-03-06","2025-03-07","2025-03-08","2025-03-09","2025-03-10","2025-03-11","2025-03-12","2025-03-13","2025-03-14","2025-03-15","2025-03-16","2025-03-17","2025-03-18","2025-03-19","2025-03-20","2025-03-21","2025-03-22","2025-03-23","2025-03-24","2025-03-25","2025-03-26","2025-03-27","2025-03-28","2025-03-29","2025-03-30","2025-03-31"]
[null,null,null,"2025-03-01","Isabelle","R",2,"R","R",2,2,2,3,"R","R",2,3,2,1,"R",2,"R","R",2,2,2,3,"R","R",2,3,2,1,"R",2,"R"]
[null,null,null,"2025-03-02","Sylvine",2,"R","R",2,3,"R",1,2,2,"R","R",2,"R",2,2,"R","R",2,3,"R",1,2,2,"R","R",2,"R",2,2,"R","R"]
[null,null,null,"2025-03-03","Élodie",1,"R","R","R",2,2,"R","R",2,2,2,"R",1,2,2,"R","R",1,1,3,1,1,"R","R","R",2,2,"R","R",2,2]
[null,null,null,"2025-03-04","Nathalie",2,"R","R",1,1,3,1,1,"R","R","R",2,2,"R","R",2,2,2,"R",1,2,2,"R","R",1,1,3,1,1,"R","R"]
[null,null,null,"2025-03-05","Marylène","R",2,2,2,"R",1,2,2,"R","R",1,1,3,1,1,"R","R","R",2,2,"R","R",2,2,2,"R",1,2,2,"R","R"]
[null,null,null,"2025-03-06","Karl",1,2,2,"R",1,1,1,1,"R","R","R",1,1,"R",1,2,2,"R",1,1,1,1,"R","R","R",1,1,"R",1,2,2]
[null,null,null,"2025-03-07","Mickaël",1,"R","R",1,1,"R","R",1,2,2,1,1,"R",1,1,"R","R",1,1,"R","R",1,2,2,1,1,"R",1,1,"R","R"]
[null,null,null,"Avr-25","Avril","2025-04-01","2025-04-02","2025-04-03","2025-04-04","2025-04-05","2025-04-06","2025-04-07","2025-04-08","2025-04-09","2025-04-10","2025-04-11","2025-04-12","2025-04-13","2025-04-14","2025-04-15","2025-04-16","2025-04-17","2025-04-18","2025-04-19","2025-04-20","2025-04-21","2025-04-22","2025-04-23","2025-04-24","2025-04-25","2025-04-26","2025-04-27","2025-04-28","2025-04-29","2025-04-30"]
[null,null,null,"2025-04-01","Isabelle","R",2,2,2,3,"R","R",2,3,2,1,"R",2,"R","R",2,2,2,3,"R","R",2,3,2,1,"R",2,"R","R",2]
[null,null,null,"2025-04-02","Sylvine",2,3,"R",1,2,2,"R","R",2,"R",2,2,"R","R",2,3,"R",1,2,2,"R","R",2,"R",2,2,"R","R",2,3]
[null,null,null,"2025-04-03","Élodie",2,"R",1,2,2,"R","R",1,1,3,1,1,"R","R","R",2,2,"R","R",2,2,2,"R",1,2,2,"R","R",1,1]
[null,null,null,"2025-04-04","Nathalie","R",2,2,"R","R",2,2,2,"R",1,2,2,"R","R",1,1,3,1,1,"R","R","R",2,2,"R","R",2,2,2,"R"]
[null,null,null,"2025-04-05","Marylène",1,1,3,1,1,"R","R","R",2,2,"R","R",2,2,2,"R",1,2,2,"R","R",1,1,3,1,1,"R","R","R",2]
[null,null,null,"2025-04-06","Karl","R",1,1,1,1,"R","R","R",1,1,"R",1,2,2,"R",1,1,1,1,"R","R","R",1,1,"R",1,2,2,"R",1]
[null,null,null,"2025-04-07","Mickaël",1,1,"R","R",1,2,2,1,1,"R",1,1,"R","R",1,1,"R","R",1,2,2,1,1,"R",1,1,"R","R",1,1]
[null,null,null,"Mai-25","Mai","2025-05-01","2025-05-02","2025-05-03","2025-05-04","2025-05-05","2025-05-06","2025-05-07","2025-05-08","2025-05-09","2025-05-10","2025-05-11","2025-05-12","2025-05-13","2025-05-14","2025-05-15","2025-05-16","2025-05-17","2025-05-18","2025-05-19","2025-05-20","2025-05-21","2025-05-22","2025-05-23","2025-05-24","2025-05-25","2025-05-26","2025-05-27","2025-05-28","2025-05-29","2025-05-30","2025-05-31"]
[null,null,null,"2025-05-01","Isabelle",2,2,3,"R","R",2,3,2,1,"R",2,"R","R",2,2,2,3,"R","R",2,3,2,1,"R",2,"R","R",2,2,2,3]
[null,null,null,"2025-05-02","Sylvine","R",1,2,2,"R","R",2,"R",2,2,"R","R",2,3,"R",1,2,2,"R","R",2,"R",2,2,"R","R",2,3,"R",1,2]
[null,null,null,"2025-05-03","Élodie",3,1,1,"R","R","R",2,2,"R","R",2,2,2,"R",1,2,2,"R","R",1,1,3,1,1,"R","R","R",2,2,"R","R"]
[null,null,null,"2025-05-04","Nathalie",1,2,2,"R","R",1,1,3,1,1,"R","R","R",2,2,"R","R",2,2,2,"R",1,2,2,"R","R",1,1,3,1,1]
[null,null,null,"2025-05-05","Marylène",2,"R","R",2,2,2,"R",1,2,2,"R","R",1,1,3,1,1,"R","R","R",2,2,"R","R",2,2,2,"R",1,2,2]
[null,null,null,"2025-05-06","Karl",1,1,1,"R","R","R",1,1,"R",1,2,2,"R",1,1,1,1,"R","R","R",1,1,"R",1,2,2,"R",1,1,1,1]
[null,null,null,"2025-05-07","Mickaël","R","R",1,2,2,1,1,"R",1,1,"R","R",1,1,"R","R",1,2,2,1,1,"R",1,1,"R","R",1,1,"R","R",1]
[null,null,null,"Juin-25","Juin","2025-06-01","2025-06-02","2025-06-03","2025-06-04","2025-06-05","2025-06-06","2025-06-07","2025-06-08","2025-06-09","2025-06-10","2025-06-11","2025-06-12","2025-06-13","2025-06-14","2025-06-15","2025-06-16","2025-06-17","2025-06-18","2025-06-19","2025-06-20","2025-06-21","2025-06-22","2025-06-23","2025-06-24","2025-06-25","2025-06-26","2025-06-27","2025-06-28","2025-06-29","2025-06-30"]
[null,null,null,"2025-06-01","Isabelle","R","R",2,3,2,1,"R",2,"R","R",2,2,2,3,"R","R",2,3,2,1,"R",2,"R","R",2,2,2,3,"R","R"]
[null,null,null,"2025-06-02","Sylvine",2,"R","R",2,"R",2,2,"R","R",2,3,"R",1,2,2,"R","R",2,"R",2,2,"R","R",2,3,"R",1,2,2,"R"]
[null,null,null,"2025-06-03","Élodie",2,2,2,"R",1,2,2,"R","R",1,1,3,1,1,"R","R","R",2,2,"R","R",2,2,2,"R",1,2,2,"R","R"]
[null,null,null,"2025-06-04","Nathalie","R","R","R",2,2,"R","R",2,2,2,"R",1,2,2,"R","R",1,1,3,1,1,"R","R","R",2,2,"R","R",2,2]
[null,null,null,"2025-06-05","Marylène","R","R",1,1,3,1,1,"R","R","R",2,2,"R","R",2,2,2,"R",1,2,2,"R","R",1,1,3,1,1,"R","R"]
[null,null,null,"2025-06-06","Karl","R","R","R",1,1,"R",1,2,2,"R",1,1,1,1,"R","R","R",1,1,"R",1,2,2,"R",1,1,1,1,"R","R"]
[null,null,null,"2025-06-07","Mickaël",2,2,1,1,"R",1,1,"R","R",1,1,"R","R",1,2,2,1,1,"R",1,1,"R","R",1,1,"R","R",1,2,2]
[null,null,null,"Juil-25","Juillet","2025-07-01","2025-07-02","2025-07-03","2025-07-04","2025-07-05","2025-07-06","2025-07-07","2025-07-08","2025-07-09","2025-07-10","2025-07-11","2025-07-12","2025-07-13","2025-07-14","2025-07-15","2025-07-16","2025-07-17","2025-07-18","2025-07-19","2025-07-20","2025-07-21","2025-07-22","2025-07-23","2025-07-24","2025-07-25","2025-07-26","2025-07-27","2025-07-28","2025-07-29","2025-07-30","2025-07-31"]
[null,null,null,"2025-07-01","Isabelle",2,3,2,1,"R",2,"R","R",2,2,2,3,"R","R",2,3,2,1,"R",2,"R","R",2,2,2,3,"R","R",2,3,2]
[null,null,null,"2025-07-02","Sylvine","R",2,"R",2,2,"R","R",2,3,"R",1,2,2,"R","R",2,"R",2,2,"R","R",2,3,"R",1,2,2,"R","R",2,"R"]
[null,null,null,"2025-07-03","Élodie",1,1,3,1,1,"R","R","R",2,2,"R","R",2,2,2,"R",1,2,2,"R","R",1,1,3,1,1,"R","R","R",2,2]
[null,null,null,"2025-07-04","Nathalie",2,"R",1,2,2,"R","R",1,1,3,1,1,"R","R","R",2,2,"R","R",2,2,2,"R",1,2,2,"R","R",1,1,3]
[null,null,null,"2025-07-05","Marylène","R",2,2,"R","R",2,2,2,"R",1,2,2,"R","R",1,1,3,1,1,"R","R","R",2,2,"R","R",2,2,2,"R",1]
[null,null,null,"2025-07-06","Karl","R",1,1,"R",1,2,2,"R",1,1,1,1,"R","R","R",1,1,"R",1,2,2,"R",1,1,1,1,"R","R","R",1,1]
[null,null,null,"2025-07-07","Mickaël",1,1,"R",1,1,"R","R",1,1,"R","R",1,2,2,1,1,"R",1,1,"R","R",1,1,"R","R",1,2,2,1,1,"R"]
[null,null,null,"Aout-25","Aout","2025-08-01","2025-08-02","2025-08-03","2025-08-04","2025-08-05","2025-08-06","2025-08-07","2025-08-08","2025-08-09","2025-08-10","2025-08-11","2025-08-12","2025-08-13","2025-08-14","2025-08-15","2025-08-16","2025-08-17","2025-08-18","2025-08-19","2025-08-20","2025-08-21","2025-08-22","2025-08-23","2025-08-24","2025-08-25","2025-08-26","2025-08-27","2025-08-28","2025-08-29","2025-08-30","2025-08-31"]
[null,null,null,"2025-08-01","Isabelle",1,"R",2,"R","R",2,2,2,3,"R","R",2,3,2,1,"R",2,"R","R",2,2,2,3,"R","R",2,3,2,1,"R",2]
[null,null,null,"2025-08-02","Sylvine",2,2,"R","R",2,3,"R",1,2,2,"R","R",2,"R",2,2,"R","R",2,3,"R",1,2,2,"R","R",2,"R",2,2,"R"]
[null,null,null,"2025-08-03","Élodie","R","R",2,2,2,"R",1,2,2,"R","R",1,1,3,1,1,"R","R","R",2,2,"R","R",2,2,2,"R",1,2,2,"R"]
[null,null,null,"2025-08-04","Nathalie",1,1,"R","R","R",2,2,"R","R",2,2,2,"R",1,2,2,"R","R",1,1,3,1,1,"R","R","R",2,2,"R","R",2]
[null,null,null,"2025-08-05","Marylène",2,2,"R","R",1,1,3,1,1,"R","R","R",2,2,"R","R",2,2,2,"R",1,2,2,"R","R",1,1,3,1,1,"R"]
[null,null,null,"2025-08-06","Karl","R",1,2,2,"R",1,1,1,1,"R","R","R",1,1,"R",1,2,2,"R",1,1,1,1,"R","R","R",1,1,"R",1,2]
[null,null,null,"2025-08-07","Mickaël",1,1,"R","R",1,1,"R","R",1,2,2,1,1,"R",1,1,"R","R",1,1,"R","R",1,2,2,1,1,"R",1,1,"R"]
[null,null,null,"Sept-25","Septembre","2025-09-01","2025-09-02","2025-09-03","2025-09-04","2025-09-05","2025-09-06","2025-09-07","2025-09-08","2025-09-09","2025-09-10","2025-09-11","2025-09-12","2025-09-13","2025-09-14","2025-09-15","2025-09-16","2025-09-17","2025-09-18","2025-09-19","2025-09-20","2025-09-21","2025-09-22","2025-09-23","2025-09-24","2025-09-25","2025-09-26","2025-09-27","2025-09-28","2025-09-29","2025-09-30"]
[null,null,null,"2025-09-01","Isabelle","R","R",2,2,2,3,"R","R",2,3,2,1,"R",2,"R","R",2,2,2,3,"R","R",2,3,2,1,"R",2,"R","R"]
[null,null,null,"2025-09-02","Sylvine","R",2,3,"R",1,2,2,"R","R",2,"R",2,2,"R","R",2,3,"R",1,2,2,"R","R",2,"R",2,2,"R","R",2]
[null,null,null,"2025-09-03","Élodie","R",1,1,3,1,1,"R","R","R",2,2,"R","R",2,2,2,"R",1,2,2,"R","R",1,1,3,1,1,"R","R","R"]
[null,null,null,"2025-09-04","Nathalie",2,2,"R",1,2,2,"R","R",1,1,3,1,1,"R","R","R",2,2,"R","R",2,2,2,"R",1,2,2,"R","R",1]
[null,null,null,"2025-09-05","Marylène","R","R",2,2,"R","R",2,2,2,"R",1,2,2,"R","R",1,1,3,1,1,"R","R","R",2,2,"R","R",2,2,2]
[null,null,null,"2025-09-06","Karl",2,"R",1,1,1,1,"R","R","R",1,1,"R",1,2,2,"R",1,1,1,1,"R","R","R",1,1,"R",1,2,2,"R"]
[null,null,null,"2025-09-07","Mickaël","R",1,1,"R","R",1,2,2,1,1,"R",1,1,"R","R",1,1,"R","R",1,2,2,1,1,"R",1,1,"R","R",1]
[null,null,null,"Oct-25","Octobre","2025-10-01","2025-10-02","2025-10-03","2025-10-04","2025-10-05","2025-10-06","2025-10-07","2025-10-08","2025-10-09","2025-10-10","2025-10-11","2025-10-12","2025-10-13","2025-10-14","2025-10-15","2025-10-16","2025-10-17","2025-10-18","2025-10-19","2025-10-20","2025-10-21","2025-10-22","2025-10-23","2025-10-24","2025-10-25","2025-10-26","2025-10-27","2025-10-28","2025-10-29","2025-10-30","2025-10-31"]
[null,null,null,"2025-10-01","Isabelle",2,2,2,3,"R","R",2,3,2,1,"R",2,"R","R",2,2,2,3,"R","R",2,3,2,1,"R",2,"R","R",2,2,2]
[null,null,null,"2025-10-02","Sylvine",3,"R",1,2,2,"R","R",2,"R",2,2,"R","R",2,3,"R",1,2,2,"R","R",2,"R",2,2,"R","R",2,3,"R",1]
[null,null,null,"2025-10-03","Élodie",2,2,"R","R",2,2,2,"R",1,2,2,"R","R",1,1,3,1,1,"R","R","R",2,2,"R","R",2,2,2,"R",1,2]
[null,null,null,"2025-10-04","Nathalie",1,3,1,1,"R","R","R",2,2,"R","R",2,2,2,"R",1,2,2,"R","R",1,1,3,1,1,"R","R","R",2,2,"R"]
[null,null,null,"2025-10-05","Marylène","R",1,2,2,"R","R",1,1,3,1,1,"R","R","R",2,2,"R","R",2,2,2,"R",1,2,2,"R","R",1,1,3,1]
[null,null,null,"2025-10-06","Karl",1,1,1,1,"R","R","R",1,1,"R",1,2,2,"R",1,1,1,1,"R","R","R",1,1,"R",1,2,2,"R",1,1,1]
[null,null,null,"2025-10-07","Mickaël",1,"R","R",1,2,2,1,1,"R",1,1,"R","R",1,1,"R","R",1,2,2,1,1,"R",1,1,"R","R",1,1,"R","R"]
[null,null,null,"Nov-25","Novembre","2025-11-01","2025-11-02","2025-11-03","2025-11-04","2025-11-05","2025-11-06","2025-11-07","2025-11-08","2025-11-09","2025-11-10","2025-11-11","2025-11-12","2025-11-13","2025-11-14","2025-11-15","2025-11-16","2025-11-17","2025-11-18","2025-11-19","2025-11-20","2025-11-21","2025-11-22","2025-11-23","2025-11-24","2025-11-25","2025-11-26","2025-11-27","2025-11-28","2025-11-29","2025-11-30"]
[null,null,null,"2025-11-01","Isabelle",3,"R","R",2,3,2,1,"R",2,"R","R",2,2,2,3,"R","R",2,3,2,1,"R",2,"R","R",2,2,2,3,"R"]
[null,null,null,"2025-11-02","Sylvine",2,2,"R","R",2,"R",2,2,"R","R",2,3,"R",1,2,2,"R","R",2,"R",2,2,"R","R",2,3,"R",1,2,2]
[null,null,null,"2025-11-03","Élodie",2,"R","R",1,1,3,1,1,"R","R","R",2,2,"R","R",2,2,2,"R",1,2,2,"R","R",1,1,3,1,1,"R"]
[null,null,null,"2025-11-04","Nathalie","R",2,2,2,"R",1,2,2,"R","R",1,1,3,1,1,"R","R","R",2,2,"R","R",2,2,2,"R",1,2,2,"R"]
[null,null,null,"2025-11-05","Marylène",1,"R","R","R",2,2,"R","R",2,2,2,"R",1,2,2,"R","R",1,1,3,1,1,"R","R","R",2,2,"R","R",2]
[null,null,null,"2025-11-06","Karl",1,"R","R","R",1,1,"R",1,2,2,"R",1,1,1,1,"R","R","R",1,1,"R",1,2,2,"R",1,1,1,1,"R"]
[null,null,null,"2025-11-07","Mickaël",1,2,2,1,1,"R",1,1,"R","R",1,1,"R","R",1,2,2,1,1,"R",1,1,"R","R",1,1,"R","R",1,2]
[null,null,null,"Dec-25","Décembre","2025-12-01","2025-12-02","2025-12-03","2025-12-04","2025-12-05","2025-12-06","2025-12-07","2025-12-08","2025-12-09","2025-12-10","2025-12-11","2025-12-12","2025-12-13","2025-12-14","2025-12-15","2025-12-16","2025-12-17","2025-12-18","2025-12-19","2025-12-20","2025-12-21","2025-12-22","2025-12-23","2025-12-24","2025-12-25","2025-12-26","2025-12-27","2025-12-28","2025-12-29","2025-12-30","2025-12-31"]
[null,null,null,"2025-12-01","Isabelle","R",2,3,2,1,"R",2,"R","R",2,2,2,3,"R","R",2,3,2,1,"R",2,"R","R",2,2,2,3,"R","R",2,3]
[null,null,null,"2025-12-02","Sylvine","R","R",2,"R",2,2,"R","R",2,3,"R",1,2,2,"R","R",2,"R",2,2,"R","R",2,3,"R",1,2,2,"R","R",2]
[null,null,null,"2025-12-03","Élodie","R","R",2,2,"R","R",2,2,2,"R",1,2,2,"R","R",1,1,3,1,1,"R","R","R",2,2,"R","R",2,2,2,"R"]
[null,null,null,"2025-12-04","Nathalie","R",1,1,3,1,1,"R","R","R",2,2,"R","R",2,2,2,"R",1,2,2,"R","R",1,1,3,1,1,"R","R","R",2]
[null,null,null,"2025-12-05","Marylène",2,2,"R",1,2,2,"R","R",1,1,3,1,1,"R","R","R",2,2,"R","R",2,2,2,"R",1,2,2,"R","R",1,1]
[null,null,null,"2025-12-06","Karl","R","R",1,1,"R",1,2,2,"R",1,1,1,1,"R","R","R",1,1,"R",1,2,2,"R",1,1,1,1,"R","R","R",1]
[null,null,null,"2025-12-07","Mickaël",2,1,1,"R",1,1,"R","R",1,1,"R","R",1,2,2,1,1,"R",1,1,"R","R",1,1,"R","R",1,2,2,1,1]
[null,null,null,"Janv-26","Janvier","2026-01-01","2026-01-02","2026-01-03","2026-01-04","2026-01-05","2026-01-06","2026-01-07","2026-01-08","2026-01-09","2026-01-10","2026-01-11","2026-01-12","2026-01-13","2026-01-14","2026-01-15","2026-01-16","2026-01-17","2026-01-18","2026-01-19","2026-01-20","2026-01-21","2026-01-22","2026-01-23","2026-01-24","2026-01-25","2026-01-26","2026-01-27","2026-01-28","2026-01-29","2026-01-30","2026-01-31"]
[null,null,null,"2026-01-01","Isabelle",2,1,"R",2,"R","R",2,2,2,3,"R","R",2,3,2,1,"R",2,"R","R",2,2,2,3,"R","R",2,3,2,1,"R"]
[null,null,null,"2026-01-02","Sylvine","R",2,2,"R","R",2,3,"R",1,2,2,"R","R",2,"R",2,2,"R","R",2,3,"R",1,2,2,"R","R",2,"R",2,2]
[null,null,null,"2026-01-03","Élodie",1,2,2,"R","R",1,1,3,1,1,"R","R","R",2,2,"R","R",2,2,2,"R",1,2,2,"R","R",1,1,3,1,1]
[null,null,null,"2026-01-04","Nathalie",2,"R","R",2,2,2,"R",1,2,2,"R","R",1,1,3,1,1,"R","R","R",2,2,"R","R",2,2,2,"R",1,2,2]
[null,null,null,"2026-01-05","Marylène",3,1,1,"R","R","R",2,2,"R","R",2,2,2,"R",1,2,2,"R","R",1,1,3,1,1,"R","R","R",2,2,"R","R"]
[null,null,null,"2026-01-06","Karl",1,"R",1,2,2,"R",1,1,1,1,"R","R","R",1,1,"R",1,2,2,"R",1,1,1,1,"R","R","R",1,1,"R",1]
[null,null,null,"2026-01-07","Mickaël","R",1,1,"R","R",1,1,"R","R",1,2,2,1,1,"R",1,1,"R","R",1,1,"R","R",1,2,2,1,1,"R",1,1]
[null,null,null,"Fevr-26","Fevrier","2026-02-01","2026-02-02","2026-02-03","2026-02-04","2026-02-05","2026-02-06","2026-02-07","2026-02-08","2026-02-09","2026-02-10","2026-02-11","2026-02-12","2026-02-13","2026-02-14","2026-02-15","2026-02-16","2026-02-17","2026-02-18","2026-02-19","2026-02-20","2026-02-21","2026-02-22","2026-02-23","2026-02-24","2026-02-25","2026-02-26","2026-02-27","2026-02-28"]
[null,null,null,"2026-02-01","Isabelle",2,"R","R",2,2,2,3,"R","R",2,3,2,1,"R",2,"R","R",2,2,2,3,"R","R",2,3,2,1,"R"]
[null,null,null,"2026-02-02","Sylvine","R","R",2,3,"R",1,2,2,"R","R",2,"R",2,2,"R","R",2,3,"R",1,2,2,"R","R",2,"R",2,2]
[null,null,null,"2026-02-03","Élodie","R","R","R",2,2,"R","R",2,2,2,"R",1,2,2,"R","R",1,1,3,1,1,"R","R","R",2,2,"R","R"]
[null,null,null,"2026-02-04","Nathalie","R","R",1,1,3,1,1,"R","R","R",2,2,"R","R",2,2,2,"R",1,2,2,"R","R",1,1,3,1,1]
[null,null,null,"2026-02-05","Marylène",2,2,2,"R",1,2,2,"R","R",1,1,3,1,1,"R","R","R",2,2,"R","R",2,2,2,"R",1,2,2]
[null,null,null,"2026-02-06","Karl",2,2,"R",1,1,1,1,"R","R","R",1,1,"R",1,2,2,"R",1,1,1,1,"R","R","R",1,1,"R",1]
[null,null,null,"2026-02-07","Mickaël","R","R",1,1,"R","R",1,2,2,1,1,"R",1,1,"R","R",1,1,"R","R",1,2,2,1,1,"R",1,1]
[null,null,null,"Mars-26","Mars","2026-03-01","2026-03-02","2026-03-03","2026-03-04","2026-03-05","2026-03-06","2026-03-07","2026-03-08","2026-03-09","2026-03-10","2026-03-11","2026-03-12","2026-03-13","2026-03-14","2026-03-15","2026-03-16","2026-03-17","2026-03-18","2026-03-19","2026-03-20","2026-03-21","2026-03-22","2026-03-23","2026-03-24","2026-03-25","2026-03-26","2026-03-27","2026-03-28","2026-03-29","2026-03-30","2026-03-31"]
[null,null,null,"2026-03-01","Isabelle",2,"R","R",2,2,2,3,"R","R",2,3,2,1,"R",2,"R","R",2,2,2,3,"R","R",2,3,2,1,"R",2,"R","R"]
[null,null,null,"2026-03-02","Sylvine","R","R",2,3,"R",1,2,2,"R","R",2,"R",2,2,"R","R",2,3,"R",1,2,2,"R","R",2,"R",2,2,"R","R",2]
[null,null,null,"2026-03-03","Élodie",2,2,2,"R",1,2,2,"R","R",1,1,3,1,1,"R","R","R",2,2,"R","R",2,2,2,"R",1,2,2,"R","R",1]
[null,null,null,"2026-03-04","Nathalie","R","R","R",2,2,"R","R",2,2,2,"R",1,2,2,"R","R",1,1,3,1,1,"R","R","R",2,2,"R","R",2,2,2]
[null,null,null,"2026-03-05","Marylène","R","R",1,1,3,1,1,"R","R","R",2,2,"R","R",2,2,2,"R",1,2,2,"R","R",1,1,3,1,1,"R","R","R"]
[null,null,null,"2026-03-06","Karl",2,2,"R",1,1,1,1,"R","R","R",1,1,"R",1,2,2,"R",1,1,1,1,"R","R","R",1,1,"R",1,2,2,"R"]
[null,null,null,"2026-03-07","Mickaël","R","R",1,1,"R","R",1,2,2,1,1,"R",1,1,"R","R",1,1,"R","R",1,2,2,1,1,"R",1,1,"R","R",1]
[null,null,null,"Avril-26","Avril","2026-04-01","2026-04-02","2026-04-03","2026-04-04","2026-04-05","2026-04-06","2026-04-07","2026-04-08","2026-04-09","2026-04-10","2026-04-11","2026-04-12","2026-04-13","2026-04-14","2026-04-15","2026-04-16","2026-04-17","2026-04-18","2026-04-19","2026-04-20","2026-04-21","2026-04-22","2026-04-23","2026-04-24","2026-04-25","2026-04-26","2026-04-27","2026-04-28","2026-04-29","2026-04-30"]
[null,null,null,"2026-04-01","Isabelle",2,2,2,3,"R","R",2,3,2,1,"R",2,"R","R",2,2,2,3,"R","R",2,3,2,1,"R",2,"R","R",2,2]
[null,null,null,"2026-04-02","Sylvine",3,"R",1,2,2,"R","R",2,"R",2,2,"R","R",2,3,"R",1,2,2,"R","R",2,"R",2,2,"R","R",2,3,"R"]
[null,null,null,"2026-04-03","Élodie",1,3,1,1,"R","R","R",2,2,"R","R",2,2,2,"R",1,2,2,"R","R",1,1,3,1,1,"R","R","R",2,2]
[null,null,null,"2026-04-04","Nathalie","R",1,2,2,"R","R",1,1,3,1,1,"R","R","R",2,2,"R","R",2,2,2,"R",1,2,2,"R","R",1,1,3]
[null,null,null,"2026-04-05","Marylène",2,2,"R","R",2,2,2,"R",1,2,2,"R","R",1,1,3,1,1,"R","R","R",2,2,"R","R",2,2,2,"R",1]
[null,null,null,"2026-04-06","Karl",1,1,1,1,"R","R","R",1,1,"R",1,2,2,"R",1,1,1,1,"R","R","R",1,1,"R",1,2,2,"R",1,1]
[null,null,null,"2026-04-07","Mickaël",1,"R","R",1,2,2,1,1,"R",1,1,"R","R",1,1,"R","R",1,2,2,1,1,"R",1,1,"R","R",1,1,"R"]
[null,null,null,"Mai-26","Mai","2026-05-01","2026-05-02","2026-05-03","2026-05-04","2026-05-05","2026-05-06","2026-05-07","2026-05-08","2026-05-09","2026-05-10","2026-05-11","2026-05-12","2026-05-13","2026-05-14","2026-05-15","2026-05-16","2026-05-17","2026-05-18","2026-05-19","2026-05-20","2026-05-21","2026-05-22","2026-05-23","2026-05-24","2026-05-25","2026-05-26","2026-05-27","2026-05-28","2026-05-29","2026-05-30","2026-05-31"]
[null,null,null,"2026-05-01","Isabelle",2,3,"R","R",2,3,2,1,"R",2,"R","R",2,2,2,3,"R","R",2,3,2,1,"R",2,"R","R",2,2,2,3,"R"]
[null,null,null,"2026-05-02","Sylvine",1,2,2,"R","R",2,"R",2,2,"R","R",2,3,"R",1,2,2,"R","R",2,"R",2,2,"R","R",2,3,"R",1,2,2]
[null,null,null,"2026-05-03","Élodie","R","R",2,2,2,"R",1,2,2,"R","R",1,1,3,1,1,"R","R","R",2,2,"R","R",2,2,2,"R",1,2,2,"R"]
[null,null,null,"2026-05-04","Nathalie",1,1,"R","R","R",2,2,"R","R",2,2,2,"R",1,2,2,"R","R",1,1,3,1,1,"R","R","R",2,2,"R","R",2]
[null,null,null,"2026-05-05","Marylène",2,2,"R","R",1,1,3,1,1,"R","R","R",2,2,"R","R",2,2,2,"R",1,2,2,"R","R",1,1,3,1,1,"R"]
[null,null,null,"2026-05-06","Karl",1,1,"R","R","R",1,1,"R",1,2,2,"R",1,1,1,1,"R","R","R",1,1,"R",1,2,2,"R",1,1,1,1,"R"]
[null,null,null,"2026-05-07","Mickaël","R",1,2,2,1,1,"R",1,1,"R","R",1,1,"R","R",1,2,2,1,1,"R",1,1,"R","R",1,1,"R","R",1,2]
[null,null,null,"Juin-26","Juin","2026-06-01","2026-06-02","2026-06-03","2026-06-04","2026-06-05","2026-06-06","2026-06-07","2026-06-08","2026-06-09","2026-06-10","2026-06-11","2026-06-12","2026-06-13","2026-06-14","2026-06-15","2026-06-16","2026-06-17","2026-06-18","2026-06-19","2026-06-20","2026-06-21","2026-06-22","2026-06-23","2026-06-24","2026-06-25","2026-06-26","2026-06-27","2026-06-28","2026-06-29","2026-06-30"]
[null,null,null,"2026-06-01","Isabelle","R",2,3,2,1,"R",2,"R","R",2,2,2,3,"R","R",2,3,2,1,"R",2,"R","R",2,2,2,3,"R","R",2]
[null,null,null,"2026-06-02","Sylvine","R","R",2,"R",2,2,"R","R",2,3,"R",1,2,2,"R","R",2,"R",2,2,"R","R",2,3,"R",1,2,2,"R","R"]
[null,null,null,"2026-06-03","Élodie","R",1,1,3,1,1,"R","R","R",2,2,"R","R",2,2,2,"R",1,2,2,"R","R",1,1,3,1,1,"R","R","R"]
[null,null,null,"2026-06-04","Nathalie",2,2,"R",1,2,2,"R","R",1,1,3,1,1,"R","R","R",2,2,"R","R",2,2,2,"R",1,2,2,"R","R",1]
[null,null,null,"2026-06-05","Marylène","R","R",2,2,"R","R",2,2,2,"R",1,2,2,"R","R",1,1,3,1,1,"R","R","R",2,2,"R","R",2,2,2]
[null,null,null,"2026-06-06","Karl","R","R",1,1,"R",1,2,2,"R",1,1,1,1,"R","R","R",1,1,"R",1,2,2,"R",1,1,1,1,"R","R","R"]
[null,null,null,"2026-06-07","Mickaël",2,1,1,"R",1,1,"R","R",1,1,"R","R",1,2,2,1,1,"R",1,1,"R","R",1,1,"R","R",1,2,2,1]
[null,null,null,"Juil-26","Juillet","2026-07-01","2026-07-02","2026-07-03","2026-07-04","2026-07-05","2026-07-06","2026-07-07","2026-07-08","2026-07-09","2026-07-10","2026-07-11","2026-07-12","2026-07-13","2026-07-14","2026-07-15","2026-07-16","2026-07-17","2026-07-18","2026-07-19","2026-07-20","2026-07-21","2026-07-22","2026-07-23","2026-07-24","2026-07-25","2026-07-26","2026-07-27","2026-07-28","2026-07-29","2026-07-30","2026-07-31"]
[null,null,null,"2026-07-01","Isabelle",3,2,1,"R",2,"R","R",2,2,2,3,"R","R",2,3,2,1,"R",2,"R","R",2,2,2,3,"R","R",2,3,2,1]
[null,null,null,"2026-07-02","Sylvine",2,"R",2,2,"R","R",2,3,"R",1,2,2,"R","R",2,"R",2,2,"R","R",2,3,"R",1,2,2,"R","R",2,"R",2]
[null,null,null,"2026-07-03","Élodie",2,2,"R","R",2,2,2,"R",1,2,2,"R","R",1,1,3,1,1,"R","R","R",2,2,"R","R",2,2,2,"R",1,2]
[null,null,null,"2026-07-04","Nathalie",1,3,1,1,"R","R","R",2,2,"R","R",2,2,2,"R",1,2,2,"R","R",1,1,3,1,1,"R","R","R",2,2,"R"]
[null,null,null,"2026-07-05","Marylène","R",1,2,2,"R","R",1,1,3,1,1,"R","R","R",2,2,"R","R",2,2,2,"R",1,2,2,"R","R",1,1,3,1]
[null,null,null,"2026-07-06","Karl",1,1,"R",1,2,2,"R",1,1,1,1,"R","R","R",1,1,"R",1,2,2,"R",1,1,1,1,"R","R","R",1,1,"R"]
[null,null,null,"2026-07-07","Mickaël",1,"R",1,1,"R","R",1,1,"R","R",1,2,2,1,1,"R",1,1,"R","R",1,1,"R","R",1,2,2,1,1,"R",1]
[null,null,null,"Aout-26","Aout","2026-08-01","2026-08-02","2026-08-03","2026-08-04","2026-08-05","2026-08-06","2026-08-07","2026-08-08","2026-08-09","2026-08-10","2026-08-11","2026-08-12","2026-08-13","2026-08-14","2026-08-15","2026-08-16","2026-08-17","2026-08-18","2026-08-19","2026-08-20","2026-08-21","2026-08-22","2026-08-23","2026-08-24","2026-08-25","2026-08-26","2026-08-27","2026-08-28","2026-08-29","2026-08-30","2026-08-31"]
[null,null,null,"2026-08-01","Isabelle","R",2,"R","R",2,2,2,3,"R","R",2,3,2,1,"R",2,"R","R",2,2,2,3,"R","R",2,3,2,1,"R",2,"R"]
[null,null,null,"2026-08-02","Sylvine",2,"R","R",2,3,"R",1,2,2,"R","R",2,"R",2,2,"R","R",2,3,"R",1,2,2,"R","R",2,"R",2,2,"R","R"]
[null,null,null,"2026-08-03","Élodie",2,"R","R",1,1,3,1,1,"R","R","R",2,2,"R","R",2,2,2,"R",1,2,2,"R","R",1,1,3,1,1,"R","R"]
[null,null,null,"2026-08-04","Nathalie","R",2,2,2,"R",1,2,2,"R","R",1,1,3,1,1,"R","R","R",2,2,"R","R",2,2,2,"R",1,2,2,"R","R"]
[null,null,null,"2026-08-05","Marylène",1,"R","R","R",2,2,"R","R",2,2,2,"R",1,2,2,"R","R",1,1,3,1,1,"R","R","R",2,2,"R","R",2,2]
[null,null,null,"2026-08-06","Karl",1,2,2,"R",1,1,1,1,"R","R","R",1,1,"R",1,2,2,"R",1,1,1,1,"R","R","R",1,1,"R",1,2,2]
[null,null,null,"2026-08-07","Mickaël",1,"R","R",1,1,"R","R",1,2,2,1,1,"R",1,1,"R","R",1,1,"R","R",1,2,2,1,1,"R",1,1,"R","R"]
[null,null,null,"Sept-26","Septembre","2026-09-01","2026-09-02","2026-09-03","2026-09-04","2026-09-05","2026-09-06","2026-09-07","2026-09-08","2026-09-09","2026-09-10","2026-09-11","2026-09-12","2026-09-13","2026-09-14","2026-09-15","2026-09-16","2026-09-17","2026-09-18","2026-09-19","2026-09-20","2026-09-21","2026-09-22","2026-09-23","2026-09-24","2026-09-25","2026-09-26","2026-09-27","2026-09-28","2026-09-29","2026-09-30"]
[null,null,null,"2026-09-01","Isabelle","R",2,2,2,3,"R","R",2,3,2,1,"R",2,"R","R",2,2,2,3,"R","R",2,3,2,1,"R",2,"R","R",2]
[null,null,null,"2026-09-02","Sylvine",2,3,"R",1,2,2,"R","R",2,"R",2,2,"R","R",2,3,"R",1,2,2,"R","R",2,"R",2,2,"R","R",2,3]
[null,null,null,"2026-09-03","Élodie","R",2,2,"R","R",2,2,2,"R",1,2,2,"R","R",1,1,3,1,1,"R","R","R",2,2,"R","R",2,2,2,"R"]
[null,null,null,"2026-09-04","Nathalie",1,1,3,1,1,"R","R","R",2,2,"R","R",2,2,2,"R",1,2,2,"R","R",1,1,3,1,1,"R","R","R",2]
[null,null,null,"2026-09-05","Marylène",2,"R",1,2,2,"R","R",1,1,3,1,1,"R","R","R",2,2,"R","R",2,2,2,"R",1,2,2,"R","R",1,1]
[null,null,null,"2026-09-06","Karl","R",1,1,1,1,"R","R","R",1,1,"R",1,2,2,"R",1,1,1,1,"R","R","R",1,1,"R",1,2,2,"R",1]
[null,null,null,"2026-09-07","Mickaël",1,1,"R","R",1,2,2,1,1,"R",1,1,"R","R",1,1,"R","R",1,2,2,1,1,"R",1,1,"R","R",1,1]
[null,null,null,"Oct-26","Octobre","2026-10-01","2026-10-02","2026-10-03","2026-10-04","2026-10-05","2026-10-06","2026-10-07","2026-10-08","2026-10-09","2026-10-10","2026-10-11","2026-10-12","2026-10-13","2026-10-14","2026-10-15","2026-10-16","2026-10-17","2026-10-18","2026-10-19","2026-10-20","2026-10-21","2026-10-22","2026-10-23","2026-10-24","2026-10-25","2026-10-26","2026-10-27","2026-10-28","2026-10-29","2026-10-30","2026-10-31"]
[null,null,null,"2026-10-01","Isabelle",2,2,3,"R","R",2,3,2,1,"R",2,"R","R",2,2,2,3,"R","R",2,3,2,1,"R",2,"R","R",2,2,2,3]
[null,null,null,"2026-10-02","Sylvine","R",1,2,2,"R","R",2,"R",2,2,"R","R",2,3,"R",1,2,2,"R","R",2,"R",2,2,"R","R",2,3,"R",1,2]
[null,null,null,"2026-10-03","Élodie",1,2,2,"R","R",1,1,3,1,1,"R","R","R",2,2,"R","R",2,2,2,"R",1,2,2,"R","R",1,1,3,1,1]
[null,null,null,"2026-10-04","Nathalie",2,"R","R",2,2,2,"R",1,2,2,"R","R",1,1,3,1,1,"R","R","R",2,2,"R","R",2,2,2,"R",1,2,2]
[null,null,null,"2026-10-05","Marylène",3,1,1,"R","R","R",2,2,"R","R",2,2,2,"R",1,2,2,"R","R",1,1,3,1,1,"R","R","R",2,2,"R","R"]
[null,null,null,"2026-10-06","Karl",1,1,1,"R","R","R",1,1,"R",1,2,2,"R",1,1,1,1,"R","R","R",1,1,"R",1,2,2,"R",1,1,1,1]
[null,null,null,"2026-10-07","Mickaël","R","R",1,2,2,1,1,"R",1,1,"R","R",1,1,"R","R",1,2,2,1,1,"R",1,1,"R","R",1,1,"R","R",1]
[null,null,null,"Nov-26","Novembre","2026-11-01","2026-11-02","2026-11-03","2026-11-04","2026-11-05","2026-11-06","2026-11-07","2026-11-08","2026-11-09","2026-11-10","2026-11-11","2026-11-12","2026-11-13","2026-11-14","2026-11-15","2026-11-16","2026-11-17","2026-11-18","2026-11-19","2026-11-20","2026-11-21","2026-11-22","2026-11-23","2026-11-24","2026-11-25","2026-11-26","2026-11-27","2026-11-28","2026-11-29","2026-11-30"]
[null,null,null,"2026-11-01","Isabelle","R","R",2,3,2,1,"R",2,"R","R",2,2,2,3,"R","R",2,3,2,1,"R",2,"R","R",2,2,2,3,"R","R"]
[null,null,null,"2026-11-02","Sylvine",2,"R","R",2,"R",2,2,"R","R",2,3,"R",1,2,2,"R","R",2,"R",2,2,"R","R",2,3,"R",1,2,2,"R"]
[null,null,null,"2026-11-03","Élodie","R","R","R",2,2,"R","R",2,2,2,"R",1,2,2,"R","R",1,1,3,1,1,"R","R","R",2,2,"R","R",2,2]
[null,null,null,"2026-11-04","Nathalie","R","R",1,1,3,1,1,"R","R","R",2,2,"R","R",2,2,2,"R",1,2,2,"R","R",1,1,3,1,1,"R","R"]
[null,null,null,"2026-11-05","Marylène",2,2,2,"R",1,2,2,"R","R",1,1,3,1,1,"R","R","R",2,2,"R","R",2,2,2,"R",1,2,2,"R","R"]
[null,null,null,"2026-11-06","Karl","R","R","R",1,1,"R",1,2,2,"R",1,1,1,1,"R","R","R",1,1,"R",1,2,2,"R",1,1,1,1,"R","R"]
[null,null,null,"2026-11-07","Mickaël",2,2,1,1,"R",1,1,"R","R",1,1,"R","R",1,2,2,1,1,"R",1,1,"R","R",1,1,"R","R",1,2,2]
[null,null,null,"Dec-26","Décembre","2026-12-01","2026-12-02","2026-12-03","2026-12-04","2026-12-05","2026-12-06","2026-12-07","2026-12-08","2026-12-09","2026-12-10","2026-12-11","2026-12-12","2026-12-13","2026-12-14","2026-12-15","2026-12-16","2026-12-17","2026-12-18","2026-12-19","2026-12-20","2026-12-21","2026-12-22","2026-12-23","2026-12-24","2026-12-25","2026-12-26","2026-12-27","2026-12-28","2026-12-29","2026-12-30","2026-12-31"]
[null,null,null,"2026-12-01","Isabelle",2,3,2,1,"R",2,"R","R",2,2,2,3,"R","R",2,3,2,1,"R",2,"R","R",2,2,2,3,"R","R",2,3,2]
[null,null,null,"2026-12-02","Sylvine","R",2,"R",2,2,"R","R",2,3,"R",1,2,2,"R","R",2,"R",2,2,"R","R",2,3,"R",1,2,2,"R","R",2,"R"]
[null,null,null,"2026-12-03","Élodie",2,"R",1,2,2,"R","R",1,1,3,1,1,"R","R","R",2,2,"R","R",2,2,2,"R",1,2,2,"R","R",1,1,3]
[null,null,null,"2026-12-04","Nathalie","R",2,2,"R","R",2,2,2,"R",1,2,2,"R","R",1,1,3,1,1,"R","R","R",2,2,"R","R",2,2,2,"R",1]
[null,null,null,"2026-12-05","Marylène",1,1,3,1,1,"R","R","R",2,2,"R","R",2,2,2,"R",1,2,2,"R","R",1,1,3,1,1,"R","R","R",2,2]
[null,null,null,"2026-12-06","Karl","R",1,1,"R",1,2,2,"R",1,1,1,1,"R","R","R",1,1,"R",1,2,2,"R",1,1,1,1,"R","R","R",1,1]
[null,null,null,"2026-12-07","Mickaël",1,1,"R",1,1,"R","R",1,1,"R","R",1,2,2,1,1,"R",1,1,"R","R",1,1,"R","R",1,2,2,1,1,"R"]
[null,null,null,"Janv-27","Janvier","2027-01-01","2027-01-02","2027-01-03","2027-01-04","2027-01-05","2027-01-06","2027-01-07","2027-01-08","2027-01-09","2027-01-10","2027-01-11","2027-01-12","2027-01-13","2027-01-14","2027-01-15","2027-01-16","2027-01-17","2027-01-18","2027-01-19","2027-01-20","2027-01-21","2027-01-22","2027-01-23","2027-01-24","2027-01-25","2027-01-26","2027-01-27","2027-01-28","2027-01-29","2027-01-30","2027-01-31"]
[null,null,null,"2027-01-01","Isabelle",1,"R",2,"R","R",2,2,2,3,"R","R",2,3,2,1,"R",2,"R","R",2,2,2,3,"R","R",2,3,2,1,"R",2]
[null,null,null,"2027-01-02","Sylvine",2,2,"R","R",2,3,"R",1,2,2,"R","R",2,"R",2,2,"R","R",2,3,"R",1,2,2,"R","R",2,"R",2,2,"R"]
[null,null,null,"2027-01-03","Élodie",1,1,"R","R","R",2,2,"R","R",2,2,2,"R",1,2,2,"R","R",1,1,3,1,1,"R","R","R",2,2,"R","R",2]
[null,null,null,"2027-01-04","Nathalie",2,2,"R","R",1,1,3,1,1,"R","R","R",2,2,"R","R",2,2,2,"R",1,2,2,"R","R",1,1,3,1,1,"R"]
[null,null,null,"2027-01-05","Marylène","R","R",2,2,2,"R",1,2,2,"R","R",1,1,3,1,1,"R","R","R",2,2,"R","R",2,2,2,"R",1,2,2,"R"]
[null,null,null,"2027-01-06","Karl","R",1,2,2,"R",1,1,1,1,"R","R","R",1,1,"R",1,2,2,"R",1,1,1,1,"R","R","R",1,1,"R",1,2]
[null,null,null,"2027-01-07","Mickaël",1,1,"R","R",1,1,"R","R",1,2,2,1,1,"R",1,1,"R","R",1,1,"R","R",1,2,2,1,1,"R",1,1,"R"]
[null,null,null,"Févr-27","Fevrier","2027-02-01","2027-02-02","2027-02-03","2027-02-04","2027-02-05","2027-02-06","2027-02-07","2027-02-08","2027-02-09","2027-02-10","2027-02-11","2027-02-12","2027-02-13","2027-02-14","2027-02-15","2027-02-16","2027-02-17","2027-02-18","2027-02-19","2027-02-20","2027-02-21","2027-02-22","2027-02-23","2027-02-24","2027-02-25","2027-02-26","2027-02-27","2027-02-28"]
[null,null,null,"2027-02-01","Isabelle","R","R",2,2,2,3,"R","R",2,3,2,1,"R",2,"R","R",2,2,2,3,"R","R",2,3,2,1,"R",2]
[null,null,null,"2027-02-02","Sylvine","R",2,3,"R",1,2,2,"R","R",2,"R",2,2,"R","R",2,3,"R",1,2,2,"R","R",2,"R",2,2,"R"]
[null,null,null,"2027-02-03","Élodie",2,2,"R",1,2,2,"R","R",1,1,3,1,1,"R","R","R",2,2,"R","R",2,2,2,"R",1,2,2,"R"]
[null,null,null,"2027-02-04","Nathalie","R","R",2,2,"R","R",2,2,2,"R",1,2,2,"R","R",1,1,3,1,1,"R","R","R",2,2,"R","R",2]
[null,null,null,"2027-02-05","Marylène","R",1,1,3,1,1,"R","R","R",2,2,"R","R",2,2,2,"R",1,2,2,"R","R",1,1,3,1,1,"R"]
[null,null,null,"2027-02-06","Karl",2,"R",1,1,1,1,"R","R","R",1,1,"R",1,2,2,"R",1,1,1,1,"R","R","R",1,1,"R",1,2]
[null,null,null,"2027-02-07","Mickaël","R",1,1,"R","R",1,2,2,1,1,"R",1,1,"R","R",1,1,"R","R",1,2,2,1,1,"R",1,1,"R"]
[null,null,null,"Mars-27","Mars","2027-03-01","2027-03-02","2027-03-03","2027-03-04","2027-03-05","2027-03-06","2027-03-07","2027-03-08","2027-03-09","2027-03-10","2027-03-11","2027-03-12","2027-03-13","2027-03-14","2027-03-15","2027-03-16","2027-03-17","2027-03-18","2027-03-19","2027-03-20","2027-03-21","2027-03-22","2027-03-23","2027-03-24","2027-03-25","2027-03-26","2027-03-27","2027-03-28","2027-03-29","2027-03-30","2027-03-31"]
[null,null,null,"2027-03-01","Isabelle","R","R",2,2,2,3,"R","R",2,3,2,1,"R",2,"R","R",2,2,2,3,"R","R",2,3,2,1,"R",2,"R","R",2]
[null,null,null,"2027-03-02","Sylvine","R",2,3,"R",1,2,2,"R","R",2,"R",2,2,"R","R",2,3,"R",1,2,2,"R","R",2,"R",2,2,"R","R",2,3]
[null,null,null,"2027-03-03","Élodie","R",1,1,3,1,1,"R","R","R",2,2,"R","R",2,2,2,"R",1,2,2,"R","R",1,1,3,1,1,"R","R","R",2]
[null,null,null,"2027-03-04","Nathalie",2,2,"R",1,2,2,"R","R",1,1,3,1,1,"R","R","R",2,2,"R","R",2,2,2,"R",1,2,2,"R","R",1,1]
[null,null,null,"2027-03-05","Marylène","R","R",2,2,"R","R",2,2,2,"R",1,2,2,"R","R",1,1,3,1,1,"R","R","R",2,2,"R","R",2,2,2,"R"]
[null,null,null,"2027-03-06","Karl",2,"R",1,1,1,1,"R","R","R",1,1,"R",1,2,2,"R",1,1,1,1,"R","R","R",1,1,"R",1,2,2,"R",1]
[null,null,null,"2027-03-07","Mickaël","R",1,1,"R","R",1,2,2,1,1,"R",1,1,"R","R",1,1,"R","R",1,2,2,1,1,"R",1,1,"R","R",1,1]
[null,null,null,"Avr-27","Avril","2027-04-01","2027-04-02","2027-04-03","2027-04-04","2027-04-05","2027-04-06","2027-04-07","2027-04-08","2027-04-09","2027-04-10","2027-04-11","2027-04-12","2027-04-13","2027-04-14","2027-04-15","2027-04-16","2027-04-17","2027-04-18","2027-04-19","2027-04-20","2027-04-21","2027-04-22","2027-04-23","2027-04-24","2027-04-25","2027-04-26","2027-04-27","2027-04-28","2027-04-29","2027-04-30"]
[null,null,null,"2027-04-01","Isabelle",2,2,3,"R","R",2,3,2,1,"R",2,"R","R",2,2,2,3,"R","R",2,3,2,1,"R",2,"R","R",2,2,2]
[null,null,null,"2027-04-02","Sylvine","R",1,2,2,"R","R",2,"R",2,2,"R","R",2,3,"R",1,2,2,"R","R",2,"R",2,2,"R","R",2,3,"R",1]
[null,null,null,"2027-04-03","Élodie",2,"R","R",2,2,2,"R",1,2,2,"R","R",1,1,3,1,1,"R","R","R",2,2,"R","R",2,2,2,"R",1,2]
[null,null,null,"2027-04-04","Nathalie",3,1,1,"R","R","R",2,2,"R","R",2,2,2,"R",1,2,2,"R","R",1,1,3,1,1,"R","R","R",2,2,"R"]
[null,null,null,"2027-04-05","Marylène",1,2,2,"R","R",1,1,3,1,1,"R","R","R",2,2,"R","R",2,2,2,"R",1,2,2,"R","R",1,1,3,1]
[null,null,null,"2027-04-06","Karl",1,1,1,"R","R","R",1,1,"R",1,2,2,"R",1,1,1,1,"R","R","R",1,1,"R",1,2,2,"R",1,1,1]
[null,null,null,"2027-04-07","Mickaël","R","R",1,2,2,1,1,"R",1,1,"R","R",1,1,"R","R",1,2,2,1,1,"R",1,1,"R","R",1,1,"R","R"]
[null,null,null,"Mai-27","Mai","2027-05-01","2027-05-02","2027-05-03","2027-05-04","2027-05-05","2027-05-06","2027-05-07","2027-05-08","2027-05-09","2027-05-10","2027-05-11","2027-05-12","2027-05-13","2027-05-14","2027-05-15","2027-05-16","2027-05-17","2027-05-18","2027-05-19","2027-05-20","2027-05-21","2027-05-22","2027-05-23","2027-05-24","2027-05-25","2027-05-26","2027-05-27","2027-05-28","2027-05-29","2027-05-30","2027-05-31"]
[null,null,null,"2027-05-01","Isabelle",3,"R","R",2,3,2,1,"R",2,"R","R",2,2,2,3,"R","R",2,3,2,1,"R",2,"R","R",2,2,2,3,"R","R"]
[null,null,null,"2027-05-02","Sylvine",2,2,"R","R",2,"R",2,2,"R","R",2,3,"R",1,2,2,"R","R",2,"R",2,2,"R","R",2,3,"R",1,2,2,"R"]
[null,null,null,"2027-05-03","Élodie",2,"R","R",1,1,3,1,1,"R","R","R",2,2,"R","R",2,2,2,"R",1,2,2,"R","R",1,1,3,1,1,"R","R"]
[null,null,null,"2027-05-04","Nathalie","R",2,2,2,"R",1,2,2,"R","R",1,1,3,1,1,"R","R","R",2,2,"R","R",2,2,2,"R",1,2,2,"R","R"]
[null,null,null,"2027-05-05","Marylène",1,"R","R","R",2,2,"R","R",2,2,2,"R",1,2,2,"R","R",1,1,3,1,1,"R","R","R",2,2,"R","R",2,2]
[null,null,null,"2027-05-06","Karl",1,"R","R","R",1,1,"R",1,2,2,"R",1,1,1,1,"R","R","R",1,1,"R",1,2,2,"R",1,1,1,1,"R","R"]
[null,null,null,"2027-05-07","Mickaël",1,2,2,1,1,"R",1,1,"R","R",1,1,"R","R",1,2,2,1,1,"R",1,1,"R","R",1,1,"R","R",1,2,2]
[null,null,null,"Juin-27","Juin","2027-06-01","2027-06-02","2027-06-03","2027-06-04","2027-06-05","2027-06-06","2027-06-07","2027-06-08","2027-06-09","2027-06-10","2027-06-11","2027-06-12","2027-06-13","2027-06-14","2027-06-15","2027-06-16","2027-06-17","2027-06-18","2027-06-19","2027-06-20","2027-06-21","2027-06-22","2027-06-23","2027-06-24","2027-06-25","2027-06-26","2027-06-27","2027-06-28","2027-06-29","2027-06-30"]
[null,null,null,"2027-06-01","Isabelle",2,3,2,1,"R",2,"R","R",2,2,2,3,"R","R",2,3,2,1,"R",2,"R","R",2,2,2,3,"R","R",2,3]
[null,null,null,"2027-06-02","Sylvine","R",2,"R",2,2,"R","R",2,3,"R",1,2,2,"R","R",2,"R",2,2,"R","R",2,3,"R",1,2,2,"R","R",2]
[null,null,null,"2027-06-03","Élodie","R",2,2,"R","R",2,2,2,"R",1,2,2,"R","R",1,1,3,1,1,"R","R","R",2,2,"R","R",2,2,2,"R"]
[null,null,null,"2027-06-04","Nathalie",1,1,3,1,1,"R","R","R",2,2,"R","R",2,2,2,"R",1,2,2,"R","R",1,1,3,1,1,"R","R","R",2]
[null,null,null,"2027-06-05","Marylène",2,"R",1,2,2,"R","R",1,1,3,1,1,"R","R","R",2,2,"R","R",2,2,2,"R",1,2,2,"R","R",1,1]
[null,null,null,"2027-06-06","Karl","R",1,1,"R",1,2,2,"R",1,1,1,1,"R","R","R",1,1,"R",1,2,2,"R",1,1,1,1,"R","R","R",1]
[null,null,null,"2027-06-07","Mickaël",1,1,"R",1,1,"R","R",1,1,"R","R",1,2,2,1,1,"R",1,1,"R","R",1,1,"R","R",1,2,2,1,1]
[null,null,null,"Juil-27","Juillet","2027-07-01","2027-07-02","2027-07-03","2027-07-04","2027-07-05","2027-07-06","2027-07-07","2027-07-08","2027-07-09","2027-07-10","2027-07-11","2027-07-12","2027-07-13","2027-07-14","2027-07-15","2027-07-16","2027-07-17","2027-07-18","2027-07-19","2027-07-20","2027-07-21","2027-07-22","2027-07-23","2027-07-24","2027-07-25","2027-07-26","2027-07-27","2027-07-28","2027-07-29","2027-07-30","2027-07-31"]
[null,null,null,"2027-07-01","Isabelle",2,1,"R",2,"R","R",2,2,2,3,"R","R",2,3,2,1,"R",2,"R","R",2,2,2,3,"R","R",2,3,2,1,"R"]
[null,null,null,"2027-07-02","Sylvine","R",2,2,"R","R",2,3,"R",1,2,2,"R","R",2,"R",2,2,"R","R",2,3,"R",1,2,2,"R","R",2,"R",2,2]
[null,null,null,"2027-07-03","Élodie",1,2,2,"R","R",1,1,3,1,1,"R","R","R",2,2,"R","R",2,2,2,"R",1,2,2,"R","R",1,1,3,1,1]
[null,null,null,"2027-07-04","Nathalie",2,"R","R",2,2,2,"R",1,2,2,"R","R",1,1,3,1,1,"R","R","R",2,2,"R","R",2,2,2,"R",1,2,2]
[null,null,null,"2027-07-05","Marylène",3,1,1,"R","R","R",2,2,"R","R",2,2,2,"R",1,2,2,"R","R",1,1,3,1,1,"R","R","R",2,2,"R","R"]
[null,null,null,"2027-07-06","Karl",1,"R",1,2,2,"R",1,1,1,1,"R","R","R",1,1,"R",1,2,2,"R",1,1,1,1,"R","R","R",1,1,"R",1]
[null,null,null,"2027-07-07","Mickaël","R",1,1,"R","R",1,1,"R","R",1,2,2,1,1,"R",1,1,"R","R",1,1,"R","R",1,2,2,1,1,"R",1,1]
[null,null,null,"Aout-27","Aout","2027-08-01","2027-08-02","2027-08-03","2027-08-04","2027-08-05","2027-08-06","2027-08-07","2027-08-08","2027-08-09","2027-08-10","2027-08-11","2027-08-12","2027-08-13","2027-08-14","2027-08-15","2027-08-16","2027-08-17","2027-08-18","2027-08-19","2027-08-20","2027-08-21","2027-08-22","2027-08-23","2027-08-24","2027-08-25","2027-08-26","2027-08-27","2027-08-28","2027-08-29","2027-08-30","2027-08-31"]
[null,null,null,"2027-08-01","Isabelle",2,"R","R",2,2,2,3,"R","R",2,3,2,1,"R",2,"R","R",2,2,2,3,"R","R",2,3,2,1,"R",2,"R","R"]
[null,null,null,"2027-08-02","Sylvine","R","R",2,3,"R",1,2,2,"R","R",2,"R",2,2,"R","R",2,3,"R",1,2,2,"R","R",2,"R",2,2,"R","R",2]
[null,null,null,"2027-08-03","Élodie","R","R","R",2,2,"R","R",2,2,2,"R",1,2,2,"R","R",1,1,3,1,1,"R","R","R",2,2,"R","R",2,2,2]
[null,null,null,"2027-08-04","Nathalie","R","R",1,1,3,1,1,"R","R","R",2,2,"R","R",2,2,2,"R",1,2,2,"R","R",1,1,3,1,1,"R","R","R"]
[null,null,null,"2027-08-05","Marylène",2,2,2,"R",1,2,2,"R","R",1,1,3,1,1,"R","R","R",2,2,"R","R",2,2,2,"R",1,2,2,"R","R",1]
[null,null,null,"2027-08-06","Karl",2,2,"R",1,1,1,1,"R","R","R",1,1,"R",1,2,2,"R",1,1,1,1,"R","R","R",1,1,"R",1,2,2,"R"]
[null,null,null,"2027-08-07","Mickaël","R","R",1,1,"R","R",1,2,2,1,1,"R",1,1,"R","R",1,1,"R","R",1,2,2,1,1,"R",1,1,"R","R",1]
[null,null,null,"Sept-27","Septembre","2027-09-01","2027-09-02","2027-09-03","2027-09-04","2027-09-05","2027-09-06","2027-09-07","2027-09-08","2027-09-09","2027-09-10","2027-09-11","2027-09-12","2027-09-13","2027-09-14","2027-09-15","2027-09-16","2027-09-17","2027-09-18","2027-09-19","2027-09-20","2027-09-21","2027-09-22","2027-09-23","2027-09-24","2027-09-25","2027-09-26","2027-09-27","2027-09-28","2027-09-29","2027-09-30"]
[null,null,null,"2027-09-01","Isabelle",2,2,2,3,"R","R",2,3,2,1,"R",2,"R","R",2,2,2,3,"R","R",2,3,2,1,"R",2,"R","R",2,2]
[null,null,null,"2027-09-02","Sylvine",3,"R",1,2,2,"R","R",2,"R",2,2,"R","R",2,3,"R",1,2,2,"R","R",2,"R",2,2,"R","R",2,3,"R"]
[null,null,null,"2027-09-03","Élodie","R",1,2,2,"R","R",1,1,3,1,1,"R","R","R",2,2,"R","R",2,2,2,"R",1,2,2,"R","R",1,1,3]
[null,null,null,"2027-09-04","Nathalie",2,2,"R","R",2,2,2,"R",1,2,2,"R","R",1,1,3,1,1,"R","R","R",2,2,"R","R",2,2,2,"R",1]
[null,null,null,"2027-09-05","Marylène",1,3,1,1,"R","R","R",2,2,"R","R",2,2,2,"R",1,2,2,"R","R",1,1,3,1,1,"R","R","R",2,2]
[null,null,null,"2027-09-06","Karl",1,1,1,1,"R","R","R",1,1,"R",1,2,2,"R",1,1,1,1,"R","R","R",1,1,"R",1,2,2,"R",1,1]
[null,null,null,"2027-09-07","Mickaël",1,"R","R",1,2,2,1,1,"R",1,1,"R","R",1,1,"R","R",1,2,2,1,1,"R",1,1,"R","R",1,1,"R"]
[null,null,null,"Oct-27","Octobre","2027-10-01","2027-10-02","2027-10-03","2027-10-04","2027-10-05","2027-10-06","2027-10-07","2027-10-08","2027-10-09","2027-10-10","2027-10-11","2027-10-12","2027-10-13","2027-10-14","2027-10-15","2027-10-16","2027-10-17","2027-10-18","2027-10-19","2027-10-20","2027-10-21","2027-10-22","2027-10-23","2027-10-24","2027-10-25","2027-10-26","2027-10-27","2027-10-28","2027-10-29","2027-10-30","2027-10-31"]
[null,null,null,"2027-10-01","Isabelle",2,3,"R","R",2,3,2,1,"R",2,"R","R",2,2,2,3,"R","R",2,3,2,1,"R",2,"R","R",2,2,2,3,"R"]
[null,null,null,"2027-10-02","Sylvine",1,2,2,"R","R",2,"R",2,2,"R","R",2,3,"R",1,2,2,"R","R",2,"R",2,2,"R","R",2,3,"R",1,2,2]
[null,null,null,"2027-10-03","Élodie",1,1,"R","R","R",2,2,"R","R",2,2,2,"R",1,2,2,"R","R",1,1,3,1,1,"R","R","R",2,2,"R","R",2]
[null,null,null,"2027-10-04","Nathalie",2,2,"R","R",1,1,3,1,1,"R","R","R",2,2,"R","R",2,2,2,"R",1,2,2,"R","R",1,1,3,1,1,"R"]
[null,null,null,"2027-10-05","Marylène","R","R",2,2,2,"R",1,2,2,"R","R",1,1,3,1,1,"R","R","R",2,2,"R","R",2,2,2,"R",1,2,2,"R"]
[null,null,null,"2027-10-06","Karl",1,1,"R","R","R",1,1,"R",1,2,2,"R",1,1,1,1,"R","R","R",1,1,"R",1,2,2,"R",1,1,1,1,"R"]
[null,null,null,"2027-10-07","Mickaël","R",1,2,2,1,1,"R",1,1,"R","R",1,1,"R","R",1,2,2,1,1,"R",1,1,"R","R",1,1,"R","R",1,2]
[null,null,null,"Nov-27","Novembre","2027-11-01","2027-11-02","2027-11-03","2027-11-04","2027-11-05","2027-11-06","2027-11-07","2027-11-08","2027-11-09","2027-11-10","2027-11-11","2027-11-12","2027-11-13","2027-11-14","2027-11-15","2027-11-16","2027-11-17","2027-11-18","2027-11-19","2027-11-20","2027-11-21","2027-11-22","2027-11-23","2027-11-24","2027-11-25","2027-11-26","2027-11-27","2027-11-28","2027-11-29","2027-11-30"]
[null,null,null,"2027-11-01","Isabelle","R",2,3,2,1,"R",2,"R","R",2,2,2,3,"R","R",2,3,2,1,"R",2,"R","R",2,2,2,3,"R","R",2]
[null,null,null,"2027-11-02","Sylvine","R","R",2,"R",2,2,"R","R",2,3,"R",1,2,2,"R","R",2,"R",2,2,"R","R",2,3,"R",1,2,2,"R","R"]
[null,null,null,"2027-11-03","Élodie",2,2,"R",1,2,2,"R","R",1,1,3,1,1,"R","R","R",2,2,"R","R",2,2,2,"R",1,2,2,"R","R",1]
[null,null,null,"2027-11-04","Nathalie","R","R",2,2,"R","R",2,2,2,"R",1,2,2,"R","R",1,1,3,1,1,"R","R","R",2,2,"R","R",2,2,2]
[null,null,null,"2027-11-05","Marylène","R",1,1,3,1,1,"R","R","R",2,2,"R","R",2,2,2,"R",1,2,2,"R","R",1,1,3,1,1,"R","R","R"]
[null,null,null,"2027-11-06","Karl","R","R",1,1,"R",1,2,2,"R",1,1,1,1,"R","R","R",1,1,"R",1,2,2,"R",1,1,1,1,"R","R","R"]
[null,null,null,"2027-11-07","Mickaël",2,1,1,"R",1,1,"R","R",1,1,"R","R",1,2,2,1,1,"R",1,1,"R","R",1,1,"R","R",1,2,2,1]
[null,null,null,"Dec-27","Décembre","2027-12-01","2027-12-02","2027-12-03","2027-12-04","2027-12-05","2027-12-06","2027-12-07","2027-12-08","2027-12-09","2027-12-10","2027-12-11","2027-12-12","2027-12-13","2027-12-14","2027-12-15","2027-12-16","2027-12-17","2027-12-18","2027-12-19","2027-12-20","2027-12-21","2027-12-22","2027-12-23","2027-12-24","2027-12-25","2027-12-26","2027-12-27","2027-12-28","2027-12-29","2027-12-30","2027-12-31"]
[null,null,null,"2027-12-01","Isabelle",3,2,1,"R",2,"R","R",2,2,2,3,"R","R",2,3,2,1,"R",2,"R","R",2,2,2,3,"R","R",2,3,2,1]
[null,null,null,"2027-12-02","Sylvine",2,"R",2,2,"R","R",2,3,"R",1,2,2,"R","R",2,"R",2,2,"R","R",2,3,"R",1,2,2,"R","R",2,"R",2]
[null,null,null,"2027-12-03","Élodie",1,3,1,1,"R","R","R",2,2,"R","R",2,2,2,"R",1,2,2,"R","R",1,1,3,1,1,"R","R","R",2,2,"R"]
[null,null,null,"2027-12-04","Nathalie","R",1,2,2,"R","R",1,1,3,1,1,"R","R","R",2,2,"R","R",2,2,2,"R",1,2,2,"R","R",1,1,3,1]
[null,null,null,"2027-12-05","Marylène",2,2,"R","R",2,2,2,"R",1,2,2,"R","R",1,1,3,1,1,"R","R","R",2,2,"R","R",2,2,2,"R",1,2]
[null,null,null,"2027-12-06","Karl",1,1,"R",1,2,2,"R",1,1,1,1,"R","R","R",1,1,"R",1,2,2,"R",1,1,1,1,"R","R","R",1,1,"R"]
[null,null,null,"2027-12-07","Mickaël",1,"R",1,1,"R","R",1,1,"R","R",1,2,2,1,1,"R",1,1,"R","R",1,1,"R","R",1,2,2,1,1,"R",1]
[null,null,null,"Janv-28","Janvier","2028-01-01","2028-01-02","2028-01-03","2028-01-04","2028-01-05","2028-01-06","2028-01-07","2028-01-08","2028-01-09","2028-01-10","2028-01-11","2028-01-12","2028-01-13","2028-01-14","2028-01-15","2028-01-16","2028-01-17","2028-01-18","2028-01-19","2028-01-20","2028-01-21","2028-01-22","2028-01-23","2028-01-24","2028-01-25","2028-01-26","2028-01-27","2028-01-28","2028-01-29","2028-01-30","2028-01-31"]
[null,null,null,"2028-01-01","Isabelle","R",2,"R","R",2,2,2,3,"R","R",2,3,2,1,"R",2,"R","R",2,2,2,3,"R","R",2,3,2,1,"R",2,"R"]
[null,null,null,"2028-01-02","Sylvine",2,"R","R",2,3,"R",1,2,2,"R","R",2,"R",2,2,"R","R",2,3,"R",1,2,2,"R","R",2,"R",2,2,"R","R"]
[null,null,null,"2028-01-03","Élodie","R",2,2,2,"R",1,2,2,"R","R",1,1,3,1,1,"R","R","R",2,2,"R","R",2,2,2,"R",1,2,2,"R","R"]
[null,null,null,"2028-01-04","Nathalie",1,"R","R","R",2,2,"R","R",2,2,2,"R",1,2,2,"R","R",1,1,3,1,1,"R","R","R",2,2,"R","R",2,2]
[null,null,null,"2028-01-05","Marylène",2,"R","R",1,1,3,1,1,"R","R","R",2,2,"R","R",2,2,2,"R",1,2,2,"R","R",1,1,3,1,1,"R","R"]
[null,null,null,"2028-01-06","Karl",1,2,2,"R",1,1,1,1,"R","R","R",1,1,"R",1,2,2,"R",1,1,1,1,"R","R","R",1,1,"R",1,2,2]
[null,null,null,"2028-01-07","Mickaël",1,"R","R",1,1,"R","R",1,2,2,1,1,"R",1,1,"R","R",1,1,"R","R",1,2,2,1,1,"R",1,1,"R","R"]
[null,null,null,"Fevr-28","Fevrier","2028-02-01","2028-02-02","2028-02-03","2028-02-04","2028-02-05","2028-02-06","2028-02-07","2028-02-08","2028-02-09","2028-02-10","2028-02-11","2028-02-12","2028-02-13","2028-02-14","2028-02-15","2028-02-16","2028-02-17","2028-02-18","2028-02-19","2028-02-20","2028-02-21","2028-02-22","2028-02-23","2028-02-24","2028-02-25","2028-02-26","2028-02-27","2028-02-28","2028-02-29"]
[null,null,null,"2028-02-01","Isabelle","R",2,2,2,3,"R","R",2,3,2,1,"R",2,"R","R",2,2,2,3,"R","R",2,3,2,1,"R",2,"R","R"]
[null,null,null,"2028-02-02","Sylvine",2,3,"R",1,2,2,"R","R",2,"R",2,2,"R","R",2,3,"R",1,2,2,"R","R",2,"R",2,2,"R","R",2]
[null,null,null,"2028-02-03","Élodie",1,1,3,1,1,"R","R","R",2,2,"R","R",2,2,2,"R",1,2,2,"R","R",1,1,3,1,1,"R","R","R"]
[null,null,null,"2028-02-04","Nathalie",2,"R",1,2,2,"R","R",1,1,3,1,1,"R","R","R",2,2,"R","R",2,2,2,"R",1,2,2,"R","R",1]
[null,null,null,"2028-02-05","Marylène","R",2,2,"R","R",2,2,2,"R",1,2,2,"R","R",1,1,3,1,1,"R","R","R",2,2,"R","R",2,2,2]
[null,null,null,"2028-02-06","Karl","R",1,1,1,1,"R","R","R",1,1,"R",1,2,2,"R",1,1,1,1,"R","R","R",1,1,"R",1,2,2,"R"]
[null,null,null,"2028-02-07","Mickaël",1,1,"R","R",1,2,2,1,1,"R",1,1,"R","R",1,1,"R","R",1,2,2,1,1,"R",1,1,"R","R",1]
[null,null,null,"Mars-28","Mars","2028-03-01","2028-03-02","2028-03-03","2028-03-04","2028-03-05","2028-03-06","2028-03-07","2028-03-08","2028-03-09","2028-03-10","2028-03-11","2028-03-12","2028-03-13","2028-03-14","2028-03-15","2028-03-16","2028-03-17","2028-03-18","2028-03-19","2028-03-20","2028-03-21","2028-03-22","2028-03-23","2028-03-24","2028-03-25","2028-03-26","2028-03-27","2028-03-28","2028-03-29","2028-03-30","2028-03-31"]
[null,null,null,"2028-03-01","Isabelle",2,2,2,3,"R","R",2,3,2,1,"R",2,"R","R",2,2,2,3,"R","R",2,3,2,1,"R",2,"R","R",2,2,2]
[null,null,null,"2028-03-02","Sylvine",3,"R",1,2,2,"R","R",2,"R",2,2,"R","R",2,3,"R",1,2,2,"R","R",2,"R",2,2,"R","R",2,3,"R",1]
[null,null,null,"2028-03-03","Élodie",2,2,"R","R",2,2,2,"R",1,2,2,"R","R",1,1,3,1,1,"R","R","R",2,2,"R","R",2,2,2,"R",1,2]
[null,null,null,"2028-03-04","Nathalie",1,3,1,1,"R","R","R",2,2,"R","R",2,2,2,"R",1,2,2,"R","R",1,1,3,1,1,"R","R","R",2,2,"R"]
[null,null,null,"2028-03-05","Marylène","R",1,2,2,"R","R",1,1,3,1,1,"R","R","R",2,2,"R","R",2,2,2,"R",1,2,2,"R","R",1,1,3,1]
[null,null,null,"2028-03-06","Karl",1,1,1,1,"R","R","R",1,1,"R",1,2,2,"R",1,1,1,1,"R","R","R",1,1,"R",1,2,2,"R",1,1,1]
[null,null,null,"2028-03-07","Mickaël",1,"R","R",1,2,2,1,1,"R",1,1,"R","R",1,1,"R","R",1,2,2,1,1,"R",1,1,"R","R",1,1,"R","R"]
[null,null,null,"Avr-28","Avril","2028-04-01","2028-04-02","2028-04-03","2028-04-04","2028-04-05","2028-04-06","2028-04-07","2028-04-08","2028-04-09","2028-04-10","2028-04-11","2028-04-12","2028-04-13","2028-04-14","2028-04-15","2028-04-16","2028-04-17","2028-04-18","2028-04-19","2028-04-20","2028-04-21","2028-04-22","2028-04-23","2028-04-24","2028-04-25","2028-04-26","2028-04-27","2028-04-28","2028-04-29","2028-04-30"]
[null,null,null,"2028-04-01","Isabelle",3,"R","R",2,3,2,1,"R",2,"R","R",2,2,2,3,"R","R",2,3,2,1,"R",2,"R","R",2,2,2,3,"R"]
[null,null,null,"2028-04-02","Sylvine",2,2,"R","R",2,"R",2,2,"R","R",2,3,"R",1,2,2,"R","R",2,"R",2,2,"R","R",2,3,"R",1,2,2]
[null,null,null,"2028-04-03","Élodie",2,"R","R",1,1,3,1,1,"R","R","R",2,2,"R","R",2,2,2,"R",1,2,2,"R","R",1,1,3,1,1,"R"]
[null,null,null,"2028-04-04","Nathalie","R",2,2,2,"R",1,2,2,"R","R",1,1,3,1,1,"R","R","R",2,2,"R","R",2,2,2,"R",1,2,2,"R"]
[null,null,null,"2028-04-05","Marylène",1,"R","R","R",2,2,"R","R",2,2,2,"R",1,2,2,"R","R",1,1,3,1,1,"R","R","R",2,2,"R","R",2]
[null,null,null,"2028-04-06","Karl",1,"R","R","R",1,1,"R",1,2,2,"R",1,1,1,1,"R","R","R",1,1,"R",1,2,2,"R",1,1,1,1,"R"]
[null,null,null,"2028-04-07","Mickaël",1,2,2,1,1,"R",1,1,"R","R",1,1,"R","R",1,2,2,1,1,"R",1,1,"R","R",1,1,"R","R",1,2]
[null,null,null,"Mai-28","Mai","2028-05-01","2028-05-02","2028-05-03","2028-05-04","2028-05-05","2028-05-06","2028-05-07","2028-05-08","2028-05-09","2028-05-10","2028-05-11","2028-05-12","2028-05-13","2028-05-14","2028-05-15","2028-05-16","2028-05-17","2028-05-18","2028-05-19","2028-05-20","2028-05-21","2028-05-22","2028-05-23","2028-05-24","2028-05-25","2028-05-26","2028-05-27","2028-05-28","2028-05-29","2028-05-30","2028-05-31"]
[null,null,null,"2028-05-01","Isabelle","R",2,3,2,1,"R",2,"R","R",2,2,2,3,"R","R",2,3,2,1,"R",2,"R","R",2,2,2,3,"R","R",2,3]
[null,null,null,"2028-05-02","Sylvine","R","R",2,"R",2,2,"R","R",2,3,"R",1,2,2,"R","R",2,"R",2,2,"R","R",2,3,"R",1,2,2,"R","R",2]
[null,null,null,"2028-05-03","Élodie","R","R",2,2,"R","R",2,2,2,"R",1,2,2,"R","R",1,1,3,1,1,"R","R","R",2,2,"R","R",2,2,2,"R"]
[null,null,null,"2028-05-04","Nathalie","R",1,1,3,1,1,"R","R","R",2,2,"R","R",2,2,2,"R",1,2,2,"R","R",1,1,3,1,1,"R","R","R",2]
[null,null,null,"2028-05-05","Marylène",2,2,"R",1,2,2,"R","R",1,1,3,1,1,"R","R","R",2,2,"R","R",2,2,2,"R",1,2,2,"R","R",1,1]
[null,null,null,"2028-05-06","Karl","R","R",1,1,"R",1,2,2,"R",1,1,1,1,"R","R","R",1,1,"R",1,2,2,"R",1,1,1,1,"R","R","R",1]
[null,null,null,"2028-05-07","Mickaël",2,1,1,"R",1,1,"R","R",1,1,"R","R",1,2,2,1,1,"R",1,1,"R","R",1,1,"R","R",1,2,2,1,1]
[null,null,null,"Juin-28","Juin","2028-06-01","2028-06-02","2028-06-03","2028-06-04","2028-06-05","2028-06-06","2028-06-07","2028-06-08","2028-06-09","2028-06-10","2028-06-11","2028-06-12","2028-06-13","2028-06-14","2028-06-15","2028-06-16","2028-06-17","2028-06-18","2028-06-19","2028-06-20","2028-06-21","2028-06-22","2028-06-23","2028-06-24","2028-06-25","2028-06-26","2028-06-27","2028-06-28","2028-06-29","2028-06-30"]
[null,null,null,"2028-06-01","Isabelle",2,1,"R",2,"R","R",2,2,2,3,"R","R",2,3,2,1,"R",2,"R","R",2,2,2,3,"R","R",2,3,2,1]
[null,null,null,"2028-06-02","Sylvine","R",2,2,"R","R",2,3,"R",1,2,2,"R","R",2,"R",2,2,"R","R",2,3,"R",1,2,2,"R","R",2,"R",2]
[null,null,null,"2028-06-03","Élodie",1,2,2,"R","R",1,1,3,1,1,"R","R","R",2,2,"R","R",2,2,2,"R",1,2,2,"R","R",1,1,3,1]
[null,null,null,"2028-06-04","Nathalie",2,"R","R",2,2,2,"R",1,2,2,"R","R",1,1,3,1,1,"R","R","R",2,2,"R","R",2,2,2,"R",1,2]
[null,null,null,"2028-06-05","Marylène",3,1,1,"R","R","R",2,2,"R","R",2,2,2,"R",1,2,2,"R","R",1,1,3,1,1,"R","R","R",2,2,"R"]
[null,null,null,"2028-06-06","Karl",1,"R",1,2,2,"R",1,1,1,1,"R","R","R",1,1,"R",1,2,2,"R",1,1,1,1,"R","R","R",1,1,"R"]
[null,null,null,"2028-06-07","Mickaël","R",1,1,"R","R",1,1,"R","R",1,2,2,1,1,"R",1,1,"R","R",1,1,"R","R",1,2,2,1,1,"R",1]
[null,null,null,"Juil-28","Juillet","2028-07-01","2028-07-02","2028-07-03","2028-07-04","2028-07-05","2028-07-06","2028-07-07","2028-07-08","2028-07-09","2028-07-10","2028-07-11","2028-07-12","2028-07-13","2028-07-14","2028-07-15","2028-07-16","2028-07-17","2028-07-18","2028-07-19","2028-07-20","2028-07-21","2028-07-22","2028-07-23","2028-07-24","2028-07-25","2028-07-26","2028-07-27","2028-07-28","2028-07-29","2028-07-30","2028-07-31"]
[null,null,null,"2028-07-01","Isabelle","R",2,"R","R",2,2,2,3,"R","R",2,3,2,1,"R",2,"R","R",2,2,2,3,"R","R",2,3,2,1,"R",2,"R"]
[null,null,null,"2028-07-02","Sylvine",2,"R","R",2,3,"R",1,2,2,"R","R",2,"R",2,2,"R","R",2,3,"R",1,2,2,"R","R",2,"R",2,2,"R","R"]
[null,null,null,"2028-07-03","Élodie",1,"R","R","R",2,2,"R","R",2,2,2,"R",1,2,2,"R","R",1,1,3,1,1,"R","R","R",2,2,"R","R",2,2]
[null,null,null,"2028-07-04","Nathalie",2,"R","R",1,1,3,1,1,"R","R","R",2,2,"R","R",2,2,2,"R",1,2,2,"R","R",1,1,3,1,1,"R","R"]
[null,null,null,"2028-07-05","Marylène","R",2,2,2,"R",1,2,2,"R","R",1,1,3,1,1,"R","R","R",2,2,"R","R",2,2,2,"R",1,2,2,"R","R"]
[null,null,null,"2028-07-06","Karl",1,2,2,"R",1,1,1,1,"R","R","R",1,1,"R",1,2,2,"R",1,1,1,1,"R","R","R",1,1,"R",1,2,2]
[null,null,null,"2028-07-07","Mickaël",1,"R","R",1,1,"R","R",1,2,2,1,1,"R",1,1,"R","R",1,1,"R","R",1,2,2,1,1,"R",1,1,"R","R"]
[null,null,null,"Aout-28","Aout","2028-08-01","2028-08-02","2028-08-03","2028-08-04","2028-08-05","2028-08-06","2028-08-07","2028-08-08","2028-08-09","2028-08-10","2028-08-11","2028-08-12","2028-08-13","2028-08-14","2028-08-15","2028-08-16","2028-08-17","2028-08-18","2028-08-19","2028-08-20","2028-08-21","2028-08-22","2028-08-23","2028-08-24","2028-08-25","2028-08-26","2028-08-27","2028-08-28","2028-08-29","2028-08-30","2028-08-31"]
[null,null,null,"2028-08-01","Isabelle","R",2,2,2,3,"R","R",2,3,2,1,"R",2,"R","R",2,2,2,3,"R","R",2,3,2,1,"R",2,"R","R",2,2]
[null,null,null,"2028-08-02","Sylvine",2,3,"R",1,2,2,"R","R",2,"R",2,2,"R","R",2,3,"R",1,2,2,"R","R",2,"R",2,2,"R","R",2,3,"R"]
[null,null,null,"2028-08-03","Élodie",2,"R",1,2,2,"R","R",1,1,3,1,1,"R","R","R",2,2,"R","R",2,2,2,"R",1,2,2,"R","R",1,1,3]
[null,null,null,"2028-08-04","Nathalie","R",2,2,"R","R",2,2,2,"R",1,2,2,"R","R",1,1,3,1,1,"R","R","R",2,2,"R","R",2,2,2,"R",1]
[null,null,null,"2028-08-05","Marylène",1,1,3,1,1,"R","R","R",2,2,"R","R",2,2,2,"R",1,2,2,"R","R",1,1,3,1,1,"R","R","R",2,2]
[null,null,null,"2028-08-06","Karl","R",1,1,1,1,"R","R","R",1,1,"R",1,2,2,"R",1,1,1,1,"R","R","R",1,1,"R",1,2,2,"R",1,1]
[null,null,null,"2028-08-07","Mickaël",1,1,"R","R",1,2,2,1,1,"R",1,1,"R","R",1,1,"R","R",1,2,2,1,1,"R",1,1,"R","R",1,1,"R"]
[null,null,null,"Sept-28","Septembre","2028-09-01","2028-09-02","2028-09-03","2028-09-04","2028-09-05","2028-09-06","2028-09-07","2028-09-08","2028-09-09","2028-09-10","2028-09-11","2028-09-12","2028-09-13","2028-09-14","2028-09-15","2028-09-16","2028-09-17","2028-09-18","2028-09-19","2028-09-20","2028-09-21","2028-09-22","2028-09-23","2028-09-24","2028-09-25","2028-09-26","2028-09-27","2028-09-28","2028-09-29","2028-09-30"]
[null,null,null,"2028-09-01","Isabelle",2,3,"R","R",2,3,2,1,"R",2,"R","R",2,2,2,3,"R","R",2,3,2,1,"R",2,"R","R",2,2,2,3]
[null,null,null,"2028-09-02","Sylvine",1,2,2,"R","R",2,"R",2,2,"R","R",2,3,"R",1,2,2,"R","R",2,"R",2,2,"R","R",2,3,"R",1,2]
[null,null,null,"2028-09-03","Élodie",1,1,"R","R","R",2,2,"R","R",2,2,2,"R",1,2,2,"R","R",1,1,3,1,1,"R","R","R",2,2,"R","R"]
[null,null,null,"2028-09-04","Nathalie",2,2,"R","R",1,1,3,1,1,"R","R","R",2,2,"R","R",2,2,2,"R",1,2,2,"R","R",1,1,3,1,1]
[null,null,null,"2028-09-05","Marylène","R","R",2,2,2,"R",1,2,2,"R","R",1,1,3,1,1,"R","R","R",2,2,"R","R",2,2,2,"R",1,2,2]
[null,null,null,"2028-09-06","Karl",1,1,"R","R","R",1,1,"R",1,2,2,"R",1,1,1,1,"R","R","R",1,1,"R",1,2,2,"R",1,1,1,1]
[null,null,null,"2028-09-07","Mickaël","R",1,2,2,1,1,"R",1,1,"R","R",1,1,"R","R",1,2,2,1,1,"R",1,1,"R","R",1,1,"R","R",1]
[null,null,null,"Oct-28","Octobre","2028-10-01","2028-10-02","2028-10-03","2028-10-04","2028-10-05","2028-10-06","2028-10-07","2028-10-08","2028-10-09","2028-10-10","2028-10-11","2028-10-12","2028-10-13","2028-10-14","2028-10-15","2028-10-16","2028-10-17","2028-10-18","2028-10-19","2028-10-20","2028-10-21","2028-10-22","2028-10-23","2028-10-24","2028-10-25","2028-10-26","2028-10-27","2028-10-28","2028-10-29","2028-10-30","2028-10-31"]
[null,null,null,"2028-10-01","Isabelle","R","R",2,3,2,1,"R",2,"R","R",2,2,2,3,"R","R",2,3,2,1,"R",2,"R","R",2,2,2,3,"R","R",2]
[null,null,null,"2028-10-02","Sylvine",2,"R","R",2,"R",2,2,"R","R",2,3,"R",1,2,2,"R","R",2,"R",2,2,"R","R",2,3,"R",1,2,2,"R","R"]
[null,null,null,"2028-10-03","Élodie",2,2,2,"R",1,2,2,"R","R",1,1,3,1,1,"R","R","R",2,2,"R","R",2,2,2,"R",1,2,2,"R","R",1]
[null,null,null,"2028-10-04","Nathalie","R","R","R",2,2,"R","R",2,2,2,"R",1,2,2,"R","R",1,1,3,1,1,"R","R","R",2,2,"R","R",2,2,2]
[null,null,null,"2028-10-05","Marylène","R","R",1,1,3,1,1,"R","R","R",2,2,"R","R",2,2,2,"R",1,2,2,"R","R",1,1,3,1,1,"R","R","R"]
[null,null,null,"2028-10-06","Karl","R","R","R",1,1,"R",1,2,2,"R",1,1,1,1,"R","R","R",1,1,"R",1,2,2,"R",1,1,1,1,"R","R","R"]
[null,null,null,"2028-10-07","Mickaël",2,2,1,1,"R",1,1,"R","R",1,1,"R","R",1,2,2,1,1,"R",1,1,"R","R",1,1,"R","R",1,2,2,1]
[null,null,null,"Nov-28","Novembre","2028-11-01","2028-11-02","2028-11-03","2028-11-04","2028-11-05","2028-11-06","2028-11-07","2028-11-08","2028-11-09","2028-11-10","2028-11-11","2028-11-12","2028-11-13","2028-11-14","2028-11-15","2028-11-16","2028-11-17","2028-11-18","2028-11-19","2028-11-20","2028-11-21","2028-11-22","2028-11-23","2028-11-24","2028-11-25","2028-11-26","2028-11-27","2028-11-28","2028-11-29","2028-11-30"]
[null,null,null,"2028-11-01","Isabelle",3,2,1,"R",2,"R","R",2,2,2,3,"R","R",2,3,2,1,"R",2,"R","R",2,2,2,3,"R","R",2,3,2]
[null,null,null,"2028-11-02","Sylvine",2,"R",2,2,"R","R",2,3,"R",1,2,2,"R","R",2,"R",2,2,"R","R",2,3,"R",1,2,2,"R","R",2,"R"]
[null,null,null,"2028-11-03","Élodie",1,3,1,1,"R","R","R",2,2,"R","R",2,2,2,"R",1,2,2,"R","R",1,1,3,1,1,"R","R","R",2,2]
[null,null,null,"2028-11-04","Nathalie","R",1,2,2,"R","R",1,1,3,1,1,"R","R","R",2,2,"R","R",2,2,2,"R",1,2,2,"R","R",1,1,3]
[null,null,null,"2028-11-05","Marylène",2,2,"R","R",2,2,2,"R",1,2,2,"R","R",1,1,3,1,1,"R","R","R",2,2,"R","R",2,2,2,"R",1]
[null,null,null,"2028-11-06","Karl",1,1,"R",1,2,2,"R",1,1,1,1,"R","R","R",1,1,"R",1,2,2,"R",1,1,1,1,"R","R","R",1,1]
[null,null,null,"2028-11-07","Mickaël",1,"R",1,1,"R","R",1,1,"R","R",1,2,2,1,1,"R",1,1,"R","R",1,1,"R","R",1,2,2,1,1,"R"]
[null,null,null,"Dec-28","Décembre","2028-12-01","2028-12-02","2028-12-03","2028-12-04","2028-12-05","2028-12-06","2028-12-07","2028-12-08","2028-12-09","2028-12-10","2028-12-11","2028-12-12","2028-12-13","2028-12-14","2028-12-15","2028-12-16","2028-12-17","2028-12-18","2028-12-19","2028-12-20","2028-12-21","2028-12-22","2028-12-23","2028-12-24","2028-12-25","2028-12-26","2028-12-27","2028-12-28","2028-12-29","2028-12-30","2028-12-31"]
[null,null,null,"2028-12-01","Isabelle",1,"R",2,"R","R",2,2,2,3,"R","R",2,3,2,1,"R",2,"R","R",2,2,2,3,"R","R",2,3,2,1,"R",2]
[null,null,null,"2028-12-02","Sylvine",2,2,"R","R",2,3,"R",1,2,2,"R","R",2,"R",2,2,"R","R",2,3,"R",1,2,2,"R","R",2,"R",2,2,"R"]
[null,null,null,"2028-12-03","Élodie","R","R",2,2,2,"R",1,2,2,"R","R",1,1,3,1,1,"R","R","R",2,2,"R","R",2,2,2,"R",1,2,2,"R"]
[null,null,null,"2028-12-04","Nathalie",1,1,"R","R","R",2,2,"R","R",2,2,2,"R",1,2,2,"R","R",1,1,3,1,1,"R","R","R",2,2,"R","R",2]
[null,null,null,"2028-12-05","Marylène",2,2,"R","R",1,1,3,1,1,"R","R","R",2,2,"R","R",2,2,2,"R",1,2,2,"R","R",1,1,3,1,1,"R"]
[null,null,null,"2028-12-06","Karl","R",1,2,2,"R",1,1,1,1,"R","R","R",1,1,"R",1,2,2,"R",1,1,1,1,"R","R","R",1,1,"R",1,2]
[null,null,null,"2028-12-07","Mickaël",1,1,"R","R",1,1,"R","R",1,2,2,1,1,"R",1,1,"R","R",1,1,"R","R",1,2,2,1,1,"R",1,1,"R"]
[null,null,null,"Janv-29","Janvier","2029-01-01","2029-01-02","2029-01-03","2029-01-04","2029-01-05","2029-01-06","2029-01-07","2029-01-08","2029-01-09","2029-01-10","2029-01-11","2029-01-12","2029-01-13","2029-01-14","2029-01-15","2029-01-16","2029-01-17","2029-01-18","2029-01-19","2029-01-20","2029-01-21","2029-01-22","2029-01-23","2029-01-24","2029-01-25","2029-01-26","2029-01-27","2029-01-28","2029-01-29","2029-01-30","2029-01-31"]
[null,null,null,"2029-01-01","Isabelle","R","R",2,2,2,3,"R","R",2,3,2,1,"R",2,"R","R",2,2,2,3,"R","R",2,3,2,1,"R",2,"R","R",2]
[null,null,null,"2029-01-02","Sylvine","R",2,3,"R",1,2,2,"R","R",2,"R",2,2,"R","R",2,3,"R",1,2,2,"R","R",2,"R",2,2,"R","R",2,3]
[null,null,null,"2029-01-03","Élodie","R",1,1,3,1,1,"R","R","R",2,2,"R","R",2,2,2,"R",1,2,2,"R","R",1,1,3,1,1,"R","R","R",2]
[null,null,null,"2029-01-04","Nathalie",2,2,"R",1,2,2,"R","R",1,1,3,1,1,"R","R","R",2,2,"R","R",2,2,2,"R",1,2,2,"R","R",1,1]
[null,null,null,"2029-01-05","Marylène","R","R",2,2,"R","R",2,2,2,"R",1,2,2,"R","R",1,1,3,1,1,"R","R","R",2,2,"R","R",2,2,2,"R"]
[null,null,null,"2029-01-06","Karl",2,"R",1,1,1,1,"R","R","R",1,1,"R",1,2,2,"R",1,1,1,1,"R","R","R",1,1,"R",1,2,2,"R",1]
[null,null,null,"2029-01-07","Mickaël","R",1,1,"R","R",1,2,2,1,1,"R",1,1,"R","R",1,1,"R","R",1,2,2,1,1,"R",1,1,"R","R",1,1]
[null,null,null,"Fev-29","Fevrier","2029-02-01","2029-02-02","2029-02-03","2029-02-04","2029-02-05","2029-02-06","2029-02-07","2029-02-08","2029-02-09","2029-02-10","2029-02-11","2029-02-12","2029-02-13","2029-02-14","2029-02-15","2029-02-16","2029-02-17","2029-02-18","2029-02-19","2029-02-20","2029-02-21","2029-02-22","2029-02-23","2029-02-24","2029-02-25","2029-02-26","2029-02-27","2029-02-28"]
[null,null,null,"2029-02-01","Isabelle",2,2,3,"R","R",2,3,2,1,"R",2,"R","R",2,2,2,3,"R","R",2,3,2,1,"R",2,"R","R",2]
[null,null,null,"2029-02-02","Sylvine","R",1,2,2,"R","R",2,"R",2,2,"R","R",2,3,"R",1,2,2,"R","R",2,"R",2,2,"R","R",2,3]
[null,null,null,"2029-02-03","Élodie",2,"R","R",2,2,2,"R",1,2,2,"R","R",1,1,3,1,1,"R","R","R",2,2,"R","R",2,2,2,"R"]
[null,null,null,"2029-02-04","Nathalie",3,1,1,"R","R","R",2,2,"R","R",2,2,2,"R",1,2,2,"R","R",1,1,3,1,1,"R","R","R",2]
[null,null,null,"2029-02-05","Marylène",1,2,2,"R","R",1,1,3,1,1,"R","R","R",2,2,"R","R",2,2,2,"R",1,2,2,"R","R",1,1]
[null,null,null,"2029-02-06","Karl",1,1,1,"R","R","R",1,1,"R",1,2,2,"R",1,1,1,1,"R","R","R",1,1,"R",1,2,2,"R",1]
[null,null,null,"2029-02-07","Mickaël","R","R",1,2,2,1,1,"R",1,1,"R","R",1,1,"R","R",1,2,2,1,1,"R",1,1,"R","R",1,1]
[null,null,null,"Mars-29","Mars","2029-03-01","2029-03-02","2029-03-03","2029-03-04","2029-03-05","2029-03-06","2029-03-07","2029-03-08","2029-03-09","2029-03-10","2029-03-11","2029-03-12","2029-03-13","2029-03-14","2029-03-15","2029-03-16","2029-03-17","2029-03-18","2029-03-19","2029-03-20","2029-03-21","2029-03-22","2029-03-23","2029-03-24","2029-03-25","2029-03-26","2029-03-27","2029-03-28","2029-03-29","2029-03-30","2029-03-31"]
[null,null,null,"2029-03-01","Isabelle",2,2,3,"R","R",2,3,2,1,"R",2,"R","R",2,2,2,3,"R","R",2,3,2,1,"R",2,"R","R",2,2,2,3]
[null,null,null,"2029-03-02","Sylvine","R",1,2,2,"R","R",2,"R",2,2,"R","R",2,3,"R",1,2,2,"R","R",2,"R",2,2,"R","R",2,3,"R",1,2]
[null,null,null,"2029-03-03","Élodie",1,2,2,"R","R",1,1,3,1,1,"R","R","R",2,2,"R","R",2,2,2,"R",1,2,2,"R","R",1,1,3,1,1]
[null,null,null,"2029-03-04","Nathalie",2,"R","R",2,2,2,"R",1,2,2,"R","R",1,1,3,1,1,"R","R","R",2,2,"R","R",2,2,2,"R",1,2,2]
[null,null,null,"2029-03-05","Marylène",3,1,1,"R","R","R",2,2,"R","R",2,2,2,"R",1,2,2,"R","R",1,1,3,1,1,"R","R","R",2,2,"R","R"]
[null,null,null,"2029-03-06","Karl",1,1,1,"R","R","R",1,1,"R",1,2,2,"R",1,1,1,1,"R","R","R",1,1,"R",1,2,2,"R",1,1,1,1]
[null,null,null,"2029-03-07","Mickaël","R","R",1,2,2,1,1,"R",1,1,"R","R",1,1,"R","R",1,2,2,1,1,"R",1,1,"R","R",1,1,"R","R",1]
[null,null,null,"Avr-29","Avril","2029-04-01","2029-04-02","2029-04-03","2029-04-04","2029-04-05","2029-04-06","2029-04-07","2029-04-08","2029-04-09","2029-04-10","2029-04-11","2029-04-12","2029-04-13","2029-04-14","2029-04-15","2029-04-16","2029-04-17","2029-04-18","2029-04-19","2029-04-20","2029-04-21","2029-04-22","2029-04-23","2029-04-24","2029-04-25","2029-04-26","2029-04-27","2029-04-28","2029-04-29","2029-04-30"]
[null,null,null,"2029-04-01","Isabelle","R","R",2,3,2,1,"R",2,"R","R",2,2,2,3,"R","R",2,3,2,1,"R",2,"R","R",2,2,2,3,"R","R"]
[null,null,null,"2029-04-02","Sylvine",2,"R","R",2,"R",2,2,"R","R",2,3,"R",1,2,2,"R","R",2,"R",2,2,"R","R",2,3,"R",1,2,2,"R"]
[null,null,null,"2029-04-03","Élodie","R","R","R",2,2,"R","R",2,2,2,"R",1,2,2,"R","R",1,1,3,1,1,"R","R","R",2,2,"R","R",2,2]
[null,null,null,"2029-04-04","Nathalie","R","R",1,1,3,1,1,"R","R","R",2,2,"R","R",2,2,2,"R",1,2,2,"R","R",1,1,3,1,1,"R","R"]
[null,null,null,"2029-04-05","Marylène",2,2,2,"R",1,2,2,"R","R",1,1,3,1,1,"R","R","R",2,2,"R","R",2,2,2,"R",1,2,2,"R","R"]
[null,null,null,"2029-04-06","Karl","R","R","R",1,1,"R",1,2,2,"R",1,1,1,1,"R","R","R",1,1,"R",1,2,2,"R",1,1,1,1,"R","R"]
[null,null,null,"2029-04-07","Mickaël",2,2,1,1,"R",1,1,"R","R",1,1,"R","R",1,2,2,1,1,"R",1,1,"R","R",1,1,"R","R",1,2,2]
[null,null,null,"Mai-29","Mai","2029-05-01","2029-05-02","2029-05-03","2029-05-04","2029-05-05","2029-05-06","2029-05-07","2029-05-08","2029-05-09","2029-05-10","2029-05-11","2029-05-12","2029-05-13","2029-05-14","2029-05-15","2029-05-16","2029-05-17","2029-05-18","2029-05-19","2029-05-20","2029-05-21","2029-05-22","2029-05-23","2029-05-24","2029-05-25","2029-05-26","2029-05-27","2029-05-28","2029-05-29","2029-05-30","2029-05-31"]
[null,null,null,"2029-05-01","Isabelle",2,3,2,1,"R",2,"R","R",2,2,2,3,"R","R",2,3,2,1,"R",2,"R","R",2,2,2,3,"R","R",2,3,2]
[null,null,null,"2029-05-02","Sylvine","R",2,"R",2,2,"R","R",2,3,"R",1,2,2,"R","R",2,"R",2,2,"R","R",2,3,"R",1,2,2,"R","R",2,"R"]
[null,null,null,"2029-05-03","Élodie",2,"R",1,2,2,"R","R",1,1,3,1,1,"R","R","R",2,2,"R","R",2,2,2,"R",1,2,2,"R","R",1,1,3]
[null,null,null,"2029-05-04","Nathalie","R",2,2,"R","R",2,2,2,"R",1,2,2,"R","R",1,1,3,1,1,"R","R","R",2,2,"R","R",2,2,2,"R",1]
[null,null,null,"2029-05-05","Marylène",1,1,3,1,1,"R","R","R",2,2,"R","R",2,2,2,"R",1,2,2,"R","R",1,1,3,1,1,"R","R","R",2,2]
[null,null,null,"2029-05-06","Karl","R",1,1,"R",1,2,2,"R",1,1,1,1,"R","R","R",1,1,"R",1,2,2,"R",1,1,1,1,"R","R","R",1,1]
[null,null,null,"2029-05-07","Mickaël",1,1,"R",1,1,"R","R",1,1,"R","R",1,2,2,1,1,"R",1,1,"R","R",1,1,"R","R",1,2,2,1,1,"R"]
[null,null,null,"Juin-29","Juin","2029-06-01","2029-06-02","2029-06-03","2029-06-04","2029-06-05","2029-06-06","2029-06-07","2029-06-08","2029-06-09","2029-06-10","2029-06-11","2029-06-12","2029-06-13","2029-06-14","2029-06-15","2029-06-16","2029-06-17","2029-06-18","2029-06-19","2029-06-20","2029-06-21","2029-06-22","2029-06-23","2029-06-24","2029-06-25","2029-06-26","2029-06-27","2029-06-28","2029-06-29","2029-06-30"]
[null,null,null,"2029-06-01","Isabelle",1,"R",2,"R","R",2,2,2,3,"R","R",2,3,2,1,"R",2,"R","R",2,2,2,3,"R","R",2,3,2,1,"R"]
[null,null,null,"2029-06-02","Sylvine",2,2,"R","R",2,3,"R",1,2,2,"R","R",2,"R",2,2,"R","R",2,3,"R",1,2,2,"R","R",2,"R",2,2]
[null,null,null,"2029-06-03","Élodie",1,1,"R","R","R",2,2,"R","R",2,2,2,"R",1,2,2,"R","R",1,1,3,1,1,"R","R","R",2,2,"R","R"]
[null,null,null,"2029-06-04","Nathalie",2,2,"R","R",1,1,3,1,1,"R","R","R",2,2,"R","R",2,2,2,"R",1,2,2,"R","R",1,1,3,1,1]
[null,null,null,"2029-06-05","Marylène","R","R",2,2,2,"R",1,2,2,"R","R",1,1,3,1,1,"R","R","R",2,2,"R","R",2,2,2,"R",1,2,2]
[null,null,null,"2029-06-06","Karl","R",1,2,2,"R",1,1,1,1,"R","R","R",1,1,"R",1,2,2,"R",1,1,1,1,"R","R","R",1,1,"R",1]
[null,null,null,"2029-06-07","Mickaël",1,1,"R","R",1,1,"R","R",1,2,2,1,1,"R",1,1,"R","R",1,1,"R","R",1,2,2,1,1,"R",1,1]
[null,null,null,"Juil-29","Juillet","2029-07-01","2029-07-02","2029-07-03","2029-07-04","2029-07-05","2029-07-06","2029-07-07","2029-07-08","2029-07-09","2029-07-10","2029-07-11","2029-07-12","2029-07-13","2029-07-14","2029-07-15","2029-07-16","2029-07-17","2029-07-18","2029-07-19","2029-07-20","2029-07-21","2029-07-22","2029-07-23","2029-07-24","2029-07-25","2029-07-26","2029-07-27","2029-07-28","2029-07-29","2029-07-30","2029-07-31"]
[null,null,null,"2029-07-01","Isabelle",2,"R","R",2,2,2,3,"R","R",2,3,2,1,"R",2,"R","R",2,2,2,3,"R","R",2,3,2,1,"R",2,"R","R"]
[null,null,null,"2029-07-02","Sylvine","R","R",2,3,"R",1,2,2,"R","R",2,"R",2,2,"R","R",2,3,"R",1,2,2,"R","R",2,"R",2,2,"R","R",2]
[null,null,null,"2029-07-03","Élodie",2,2,2,"R",1,2,2,"R","R",1,1,3,1,1,"R","R","R",2,2,"R","R",2,2,2,"R",1,2,2,"R","R",1]
[null,null,null,"2029-07-04","Nathalie","R","R","R",2,2,"R","R",2,2,2,"R",1,2,2,"R","R",1,1,3,1,1,"R","R","R",2,2,"R","R",2,2,2]
[null,null,null,"2029-07-05","Marylène","R","R",1,1,3,1,1,"R","R","R",2,2,"R","R",2,2,2,"R",1,2,2,"R","R",1,1,3,1,1,"R","R","R"]
[null,null,null,"2029-07-06","Karl",2,2,"R",1,1,1,1,"R","R","R",1,1,"R",1,2,2,"R",1,1,1,1,"R","R","R",1,1,"R",1,2,2,"R"]
[null,null,null,"2029-07-07","Mickaël","R","R",1,1,"R","R",1,2,2,1,1,"R",1,1,"R","R",1,1,"R","R",1,2,2,1,1,"R",1,1,"R","R",1]
[null,null,null,"Aout-29","Aout","2029-08-01","2029-08-02","2029-08-03","2029-08-04","2029-08-05","2029-08-06","2029-08-07","2029-08-08","2029-08-09","2029-08-10","2029-08-11","2029-08-12","2029-08-13","2029-08-14","2029-08-15","2029-08-16","2029-08-17","2029-08-18","2029-08-19","2029-08-20","2029-08-21","2029-08-22","2029-08-23","2029-08-24","2029-08-25","2029-08-26","2029-08-27","2029-08-28","2029-08-29","2029-08-30","2029-08-31"]
[null,null,null,"2029-08-01","Isabelle",2,2,2,3,"R","R",2,3,2,1,"R",2,"R","R",2,2,2,3,"R","R",2,3,2,1,"R",2,"R","R",2,2,2]
[null,null,null,"2029-08-02","Sylvine",3,"R",1,2,2,"R","R",2,"R",2,2,"R","R",2,3,"R",1,2,2,"R","R",2,"R",2,2,"R","R",2,3,"R",1]
[null,null,null,"2029-08-03","Élodie",1,3,1,1,"R","R","R",2,2,"R","R",2,2,2,"R",1,2,2,"R","R",1,1,3,1,1,"R","R","R",2,2,"R"]
[null,null,null,"2029-08-04","Nathalie","R",1,2,2,"R","R",1,1,3,1,1,"R","R","R",2,2,"R","R",2,2,2,"R",1,2,2,"R","R",1,1,3,1]
[null,null,null,"2029-08-05","Marylène",2,2,"R","R",2,2,2,"R",1,2,2,"R","R",1,1,3,1,1,"R","R","R",2,2,"R","R",2,2,2,"R",1,2]
[null,null,null,"2029-08-06","Karl",1,1,1,1,"R","R","R",1,1,"R",1,2,2,"R",1,1,1,1,"R","R","R",1,1,"R",1,2,2,"R",1,1,1]
[null,null,null,"2029-08-07","Mickaël",1,"R","R",1,2,2,1,1,"R",1,1,"R","R",1,1,"R","R",1,2,2,1,1,"R",1,1,"R","R",1,1,"R","R"]
[null,null,null,"Sept-29","Septembre","2029-09-01","2029-09-02","2029-09-03","2029-09-04","2029-09-05","2029-09-06","2029-09-07","2029-09-08","2029-09-09","2029-09-10","2029-09-11","2029-09-12","2029-09-13","2029-09-14","2029-09-15","2029-09-16","2029-09-17","2029-09-18","2029-09-19","2029-09-20","2029-09-21","2029-09-22","2029-09-23","2029-09-24","2029-09-25","2029-09-26","2029-09-27","2029-09-28","2029-09-29","2029-09-30"]
[null,null,null,"2029-09-01","Isabelle",3,"R","R",2,3,2,1,"R",2,"R","R",2,2,2,3,"R","R",2,3,2,1,"R",2,"R","R",2,2,2,3,"R"]
[null,null,null,"2029-09-02","Sylvine",2,2,"R","R",2,"R",2,2,"R","R",2,3,"R",1,2,2,"R","R",2,"R",2,2,"R","R",2,3,"R",1,2,2]
[null,null,null,"2029-09-03","Élodie","R",2,2,2,"R",1,2,2,"R","R",1,1,3,1,1,"R","R","R",2,2,"R","R",2,2,2,"R",1,2,2,"R"]
[null,null,null,"2029-09-04","Nathalie",1,"R","R","R",2,2,"R","R",2,2,2,"R",1,2,2,"R","R",1,1,3,1,1,"R","R","R",2,2,"R","R",2]
[null,null,null,"2029-09-05","Marylène",2,"R","R",1,1,3,1,1,"R","R","R",2,2,"R","R",2,2,2,"R",1,2,2,"R","R",1,1,3,1,1,"R"]
[null,null,null,"2029-09-06","Karl",1,"R","R","R",1,1,"R",1,2,2,"R",1,1,1,1,"R","R","R",1,1,"R",1,2,2,"R",1,1,1,1,"R"]
[null,null,null,"2029-09-07","Mickaël",1,2,2,1,1,"R",1,1,"R","R",1,1,"R","R",1,2,2,1,1,"R",1,1,"R","R",1,1,"R","R",1,2]
[null,null,null,"Oct-29","Octobre","2029-10-01","2029-10-02","2029-10-03","2029-10-04","2029-10-05","2029-10-06","2029-10-07","2029-10-08","2029-10-09","2029-10-10","2029-10-11","2029-10-12","2029-10-13","2029-10-14","2029-10-15","2029-10-16","2029-10-17","2029-10-18","2029-10-19","2029-10-20","2029-10-21","2029-10-22","2029-10-23","2029-10-24","2029-10-25","2029-10-26","2029-10-27","2029-10-28","2029-10-29","2029-10-30","2029-10-31"]
[null,null,null,"2029-10-01","Isabelle","R",2,3,2,1,"R",2,"R","R",2,2,2,3,"R","R",2,3,2,1,"R",2,"R","R",2,2,2,3,"R","R",2,3]
[null,null,null,"2029-10-02","Sylvine","R","R",2,"R",2,2,"R","R",2,3,"R",1,2,2,"R","R",2,"R",2,2,"R","R",2,3,"R",1,2,2,"R","R",2]
[null,null,null,"2029-10-03","Élodie","R",1,1,3,1,1,"R","R","R",2,2,"R","R",2,2,2,"R",1,2,2,"R","R",1,1,3,1,1,"R","R","R",2]
[null,null,null,"2029-10-04","Nathalie",2,2,"R",1,2,2,"R","R",1,1,3,1,1,"R","R","R",2,2,"R","R",2,2,2,"R",1,2,2,"R","R",1,1]
[null,null,null,"2029-10-05","Marylène","R","R",2,2,"R","R",2,2,2,"R",1,2,2,"R","R",1,1,3,1,1,"R","R","R",2,2,"R","R",2,2,2,"R"]
[null,null,null,"2029-10-06","Karl","R","R",1,1,"R",1,2,2,"R",1,1,1,1,"R","R","R",1,1,"R",1,2,2,"R",1,1,1,1,"R","R","R",1]
[null,null,null,"2029-10-07","Mickaël",2,1,1,"R",1,1,"R","R",1,1,"R","R",1,2,2,1,1,"R",1,1,"R","R",1,1,"R","R",1,2,2,1,1]
[null,null,null,"Nov-29","Novembre","2029-11-01","2029-11-02","2029-11-03","2029-11-04","2029-11-05","2029-11-06","2029-11-07","2029-11-08","2029-11-09","2029-11-10","2029-11-11","2029-11-12","2029-11-13","2029-11-14","2029-11-15","2029-11-16","2029-11-17","2029-11-18","2029-11-19","2029-11-20","2029-11-21","2029-11-22","2029-11-23","2029-11-24","2029-11-25","2029-11-26","2029-11-27","2029-11-28","2029-11-29","2029-11-30"]
[null,null,null,"2029-11-01","Isabelle",2,1,"R",2,"R","R",2,2,2,3,"R","R",2,3,2,1,"R",2,"R","R",2,2,2,3,"R","R",2,3,2,1]
[null,null,null,"2029-11-02","Sylvine","R",2,2,"R","R",2,3,"R",1,2,2,"R","R",2,"R",2,2,"R","R",2,3,"R",1,2,2,"R","R",2,"R",2]
[null,null,null,"2029-11-03","Élodie",2,"R","R",2,2,2,"R",1,2,2,"R","R",1,1,3,1,1,"R","R","R",2,2,"R","R",2,2,2,"R",1,2]
[null,null,null,"2029-11-04","Nathalie",3,1,1,"R","R","R",2,2,"R","R",2,2,2,"R",1,2,2,"R","R",1,1,3,1,1,"R","R","R",2,2,"R"]
[null,null,null,"2029-11-05","Marylène",1,2,2,"R","R",1,1,3,1,1,"R","R","R",2,2,"R","R",2,2,2,"R",1,2,2,"R","R",1,1,3,1]
[null,null,null,"2029-11-06","Karl",1,"R",1,2,2,"R",1,1,1,1,"R","R","R",1,1,"R",1,2,2,"R",1,1,1,1,"R","R","R",1,1,"R"]
[null,null,null,"2029-11-07","Mickaël","R",1,1,"R","R",1,1,"R","R",1,2,2,1,1,"R",1,1,"R","R",1,1,"R","R",1,2,2,1,1,"R",1]
[null,null,null,"Dec-29","Décembre","2029-12-01","2029-12-02","2029-12-03","2029-12-04","2029-12-05","2029-12-06","2029-12-07","2029-12-08","2029-12-09","2029-12-10","2029-12-11","2029-12-12","2029-12-13","2029-12-14","2029-12-15","2029-12-16","2029-12-17","2029-12-18","2029-12-19","2029-12-20","2029-12-21","2029-12-22","2029-12-23","2029-12-24","2029-12-25","2029-12-26","2029-12-27","2029-12-28","2029-12-29","2029-12-30","2029-12-31"]
[null,null,null,"2029-12-01","Isabelle","R",2,"R","R",2,2,2,3,"R","R",2,3,2,1,"R",2,"R","R",2,2,2,3,"R","R",2,3,2,1,"R",2,"R"]
[null,null,null,"2029-12-02","Sylvine",2,"R","R",2,3,"R",1,2,2,"R","R",2,"R",2,2,"R","R",2,3,"R",1,2,2,"R","R",2,"R",2,2,"R","R"]
[null,null,null,"2029-12-03","Élodie",2,"R","R",1,1,3,1,1,"R","R","R",2,2,"R","R",2,2,2,"R",1,2,2,"R","R",1,1,3,1,1,"R","R"]
[null,null,null,"2029-12-04","Nathalie","R",2,2,2,"R",1,2,2,"R","R",1,1,3,1,1,"R","R","R",2,2,"R","R",2,2,2,"R",1,2,2,"R","R"]
[null,null,null,"2029-12-05","Marylène",1,"R","R","R",2,2,"R","R",2,2,2,"R",1,2,2,"R","R",1,1,3,1,1,"R","R","R",2,2,"R","R",2,2]
[null,null,null,"2029-12-06","Karl",1,2,2,"R",1,1,1,1,"R","R","R",1,1,"R",1,2,2,"R",1,1,1,1,"R","R","R",1,1,"R",1,2,2]
[null,null,null,"2029-12-07","Mickaël",1,"R","R",1,1,"R","R",1,2,2,1,1,"R",1,1,"R","R",1,1,"R","R",1,2,2,1,1,"R",1,1,"R","R"]
[null,null,null,"Janv-30","Janvier","2030-01-01","2030-01-02","2030-01-03","2030-01-04","2030-01-05","2030-01-06","2030-01-07","2030-01-08","2030-01-09","2030-01-10","2030-01-11","2030-01-12","2030-01-13","2030-01-14","2030-01-15","2030-01-16","2030-01-17","2030-01-18","2030-01-19","2030-01-20","2030-01-21","2030-01-22","2030-01-23","2030-01-24","2030-01-25","2030-01-26","2030-01-27","2030-01-28","2030-01-29","2030-01-30","2030-01-31"]
[null,null,null,"2030-01-01","Isabelle","R",2,2,2,3,"R","R",2,3,2,1,"R",2,"R","R",2,2,2,3,"R","R",2,3,2,1,"R",2,"R","R",2,2]
[null,null,null,"2030-01-02","Sylvine",2,3,"R",1,2,2,"R","R",2,"R",2,2,"R","R",2,3,"R",1,2,2,"R","R",2,"R",2,2,"R","R",2,3,"R"]
[null,null,null,"2030-01-03","Élodie","R",2,2,"R","R",2,2,2,"R",1,2,2,"R","R",1,1,3,1,1,"R","R","R",2,2,"R","R",2,2,2,"R",1]
[null,null,null,"2030-01-04","Nathalie",1,1,3,1,1,"R","R","R",2,2,"R","R",2,2,2,"R",1,2,2,"R","R",1,1,3,1,1,"R","R","R",2,2]
[null,null,null,"2030-01-05","Marylène",2,"R",1,2,2,"R","R",1,1,3,1,1,"R","R","R",2,2,"R","R",2,2,2,"R",1,2,2,"R","R",1,1,3]
[null,null,null,"2030-01-06","Karl","R",1,1,1,1,"R","R","R",1,1,"R",1,2,2,"R",1,1,1,1,"R","R","R",1,1,"R",1,2,2,"R",1,1]
[null,null,null,"2030-01-07","Mickaël",1,1,"R","R",1,2,2,1,1,"R",1,1,"R","R",1,1,"R","R",1,2,2,1,1,"R",1,1,"R","R",1,1,"R"]
[null,null,null,"Fev-30","Fevrier","2030-02-01","2030-02-02","2030-02-03","2030-02-04","2030-02-05","2030-02-06","2030-02-07","2030-02-08","2030-02-09","2030-02-10","2030-02-11","2030-02-12","2030-02-13","2030-02-14","2030-02-15","2030-02-16","2030-02-17","2030-02-18","2030-02-19","2030-02-20","2030-02-21","2030-02-22","2030-02-23","2030-02-24","2030-02-25","2030-02-26","2030-02-27","2030-02-28"]
[null,null,null,"2030-02-01","Isabelle",2,3,"R","R",2,3,2,1,"R",2,"R","R",2,2,2,3,"R","R",2,3,2,1,"R",2,"R","R",2,2]
[null,null,null,"2030-02-02","Sylvine",1,2,2,"R","R",2,"R",2,2,"R","R",2,3,"R",1,2,2,"R","R",2,"R",2,2,"R","R",2,3,"R"]
[null,null,null,"2030-02-03","Élodie",2,2,"R","R",1,1,3,1,1,"R","R","R",2,2,"R","R",2,2,2,"R",1,2,2,"R","R",1,1,3]
[null,null,null,"2030-02-04","Nathalie","R","R",2,2,2,"R",1,2,2,"R","R",1,1,3,1,1,"R","R","R",2,2,"R","R",2,2,2,"R",1]
[null,null,null,"2030-02-05","Marylène",1,1,"R","R","R",2,2,"R","R",2,2,2,"R",1,2,2,"R","R",1,1,3,1,1,"R","R","R",2,2]
[null,null,null,"2030-02-06","Karl",1,1,"R","R","R",1,1,"R",1,2,2,"R",1,1,1,1,"R","R","R",1,1,"R",1,2,2,"R",1,1]
[null,null,null,"2030-02-07","Mickaël","R",1,2,2,1,1,"R",1,1,"R","R",1,1,"R","R",1,2,2,1,1,"R",1,1,"R","R",1,1,"R"]
[null,null,null,"Mars-30","Mars","2030-03-01","2030-03-02","2030-03-03","2030-03-04","2030-03-05","2030-03-06","2030-03-07","2030-03-08","2030-03-09","2030-03-10","2030-03-11","2030-03-12","2030-03-13","2030-03-14","2030-03-15","2030-03-16","2030-03-17","2030-03-18","2030-03-19","2030-03-20","2030-03-21","2030-03-22","2030-03-23","2030-03-24","2030-03-25","2030-03-26","2030-03-27","2030-03-28","2030-03-29","2030-03-30","2030-03-31"]
[null,null,null,"2030-03-01","Isabelle",2,3,"R","R",2,3,2,1,"R",2,"R","R",2,2,2,3,"R","R",2,3,2,1,"R",2,"R","R",2,2,2,3,"R"]
[null,null,null,"2030-03-02","Sylvine",1,2,2,"R","R",2,"R",2,2,"R","R",2,3,"R",1,2,2,"R","R",2,"R",2,2,"R","R",2,3,"R",1,2,2]
[null,null,null,"2030-03-03","Élodie",1,1,"R","R","R",2,2,"R","R",2,2,2,"R",1,2,2,"R","R",1,1,3,1,1,"R","R","R",2,2,"R","R",2]
[null,null,null,"2030-03-04","Nathalie",2,2,"R","R",1,1,3,1,1,"R","R","R",2,2,"R","R",2,2,2,"R",1,2,2,"R","R",1,1,3,1,1,"R"]
[null,null,null,"2030-03-05","Marylène","R","R",2,2,2,"R",1,2,2,"R","R",1,1,3,1,1,"R","R","R",2,2,"R","R",2,2,2,"R",1,2,2,"R"]
[null,null,null,"2030-03-06","Karl",1,1,"R","R","R",1,1,"R",1,2,2,"R",1,1,1,1,"R","R","R",1,1,"R",1,2,2,"R",1,1,1,1,"R"]
[null,null,null,"2030-03-07","Mickaël","R",1,2,2,1,1,"R",1,1,"R","R",1,1,"R","R",1,2,2,1,1,"R",1,1,"R","R",1,1,"R","R",1,2]
[null,null,null,"Avr-30","Avril","2030-04-01","2030-04-02","2030-04-03","2030-04-04","2030-04-05","2030-04-06","2030-04-07","2030-04-08","2030-04-09","2030-04-10","2030-04-11","2030-04-12","2030-04-13","2030-04-14","2030-04-15","2030-04-16","2030-04-17","2030-04-18","2030-04-19","2030-04-20","2030-04-21","2030-04-22","2030-04-23","2030-04-24","2030-04-25","2030-04-26","2030-04-27","2030-04-28","2030-04-29","2030-04-30"]
[null,null,null,"2030-04-01","Isabelle","R",2,3,2,1,"R",2,"R","R",2,2,2,3,"R","R",2,3,2,1,"R",2,"R","R",2,2,2,3,"R","R",2]
[null,null,null,"2030-04-02","Sylvine","R","R",2,"R",2,2,"R","R",2,3,"R",1,2,2,"R","R",2,"R",2,2,"R","R",2,3,"R",1,2,2,"R","R"]
[null,null,null,"2030-04-03","Élodie",2,2,"R",1,2,2,"R","R",1,1,3,1,1,"R","R","R",2,2,"R","R",2,2,2,"R",1,2,2,"R","R",1]
[null,null,null,"2030-04-04","Nathalie","R","R",2,2,"R","R",2,2,2,"R",1,2,2,"R","R",1,1,3,1,1,"R","R","R",2,2,"R","R",2,2,2]
[null,null,null,"2030-04-05","Marylène","R",1,1,3,1,1,"R","R","R",2,2,"R","R",2,2,2,"R",1,2,2,"R","R",1,1,3,1,1,"R","R","R"]
[null,null,null,"2030-04-06","Karl","R","R",1,1,"R",1,2,2,"R",1,1,1,1,"R","R","R",1,1,"R",1,2,2,"R",1,1,1,1,"R","R","R"]
[null,null,null,"2030-04-07","Mickaël",2,1,1,"R",1,1,"R","R",1,1,"R","R",1,2,2,1,1,"R",1,1,"R","R",1,1,"R","R",1,2,2,1]
[null,null,null,"Mai-30","Mai","2030-05-01","2030-05-02","2030-05-03","2030-05-04","2030-05-05","2030-05-06","2030-05-07","2030-05-08","2030-05-09","2030-05-10","2030-05-11","2030-05-12","2030-05-13","2030-05-14","2030-05-15","2030-05-16","2030-05-17","2030-05-18","2030-05-19","2030-05-20","2030-05-21","2030-05-22","2030-05-23","2030-05-24","2030-05-25","2030-05-26","2030-05-27","2030-05-28","2030-05-29","2030-05-30","2030-05-31"]
[null,null,null,"2030-05-01","Isabelle",3,2,1,"R",2,"R","R",2,2,2,3,"R","R",2,3,2,1,"R",2,"R","R",2,2,2,3,"R","R",2,3,2,1]
[null,null,null,"2030-05-02","Sylvine",2,"R",2,2,"R","R",2,3,"R",1,2,2,"R","R",2,"R",2,2,"R","R",2,3,"R",1,2,2,"R","R",2,"R",2]
[null,null,null,"2030-05-03","Élodie",1,3,1,1,"R","R","R",2,2,"R","R",2,2,2,"R",1,2,2,"R","R",1,1,3,1,1,"R","R","R",2,2,"R"]
[null,null,null,"2030-05-04","Nathalie","R",1,2,2,"R","R",1,1,3,1,1,"R","R","R",2,2,"R","R",2,2,2,"R",1,2,2,"R","R",1,1,3,1]
[null,null,null,"2030-05-05","Marylène",2,2,"R","R",2,2,2,"R",1,2,2,"R","R",1,1,3,1,1,"R","R","R",2,2,"R","R",2,2,2,"R",1,2]
[null,null,null,"2030-05-06","Karl",1,1,"R",1,2,2,"R",1,1,1,1,"R","R","R",1,1,"R",1,2,2,"R",1,1,1,1,"R","R","R",1,1,"R"]
[null,null,null,"2030-05-07","Mickaël",1,"R",1,1,"R","R",1,1,"R","R",1,2,2,1,1,"R",1,1,"R","R",1,1,"R","R",1,2,2,1,1,"R",1]
[null,null,null,"Juin-30","Juin","2030-06-01","2030-06-02","2030-06-03","2030-06-04","2030-06-05","2030-06-06","2030-06-07","2030-06-08","2030-06-09","2030-06-10","2030-06-11","2030-06-12","2030-06-13","2030-06-14","2030-06-15","2030-06-16","2030-06-17","2030-06-18","2030-06-19","2030-06-20","2030-06-21","2030-06-22","2030-06-23","2030-06-24","2030-06-25","2030-06-26","2030-06-27","2030-06-28","2030-06-29","2030-06-30"]
[null,null,null,"2030-06-01","Isabelle","R",2,"R","R",2,2,2,3,"R","R",2,3,2,1,"R",2,"R","R",2,2,2,3,"R","R",2,3,2,1,"R",2]
[null,null,null,"2030-06-02","Sylvine",2,"R","R",2,3,"R",1,2,2,"R","R",2,"R",2,2,"R","R",2,3,"R",1,2,2,"R","R",2,"R",2,2,"R"]
[null,null,null,"2030-06-03","Élodie","R",2,2,2,"R",1,2,2,"R","R",1,1,3,1,1,"R","R","R",2,2,"R","R",2,2,2,"R",1,2,2,"R"]
[null,null,null,"2030-06-04","Nathalie",1,"R","R","R",2,2,"R","R",2,2,2,"R",1,2,2,"R","R",1,1,3,1,1,"R","R","R",2,2,"R","R",2]
[null,null,null,"2030-06-05","Marylène",2,"R","R",1,1,3,1,1,"R","R","R",2,2,"R","R",2,2,2,"R",1,2,2,"R","R",1,1,3,1,1,"R"]
[null,null,null,"2030-06-06","Karl",1,2,2,"R",1,1,1,1,"R","R","R",1,1,"R",1,2,2,"R",1,1,1,1,"R","R","R",1,1,"R",1,2]
[null,null,null,"2030-06-07","Mickaël",1,"R","R",1,1,"R","R",1,2,2,1,1,"R",1,1,"R","R",1,1,"R","R",1,2,2,1,1,"R",1,1,"R"]
[null,null,null,"Juil-30","Juillet","2030-07-01","2030-07-02","2030-07-03","2030-07-04","2030-07-05","2030-07-06","2030-07-07","2030-07-08","2030-07-09","2030-07-10","2030-07-11","2030-07-12","2030-07-13","2030-07-14","2030-07-15","2030-07-16","2030-07-17","2030-07-18","2030-07-19","2030-07-20","2030-07-21","2030-07-22","2030-07-23","2030-07-24","2030-07-25","2030-07-26","2030-07-27","2030-07-28","2030-07-29","2030-07-30","2030-07-31"]
[null,null,null,"2030-07-01","Isabelle","R","R",2,2,2,3,"R","R",2,3,2,1,"R",2,"R","R",2,2,2,3,"R","R",2,3,2,1,"R",2,"R","R",2]
[null,null,null,"2030-07-02","Sylvine","R",2,3,"R",1,2,2,"R","R",2,"R",2,2,"R","R",2,3,"R",1,2,2,"R","R",2,"R",2,2,"R","R",2,3]
[null,null,null,"2030-07-03","Élodie","R",1,1,3,1,1,"R","R","R",2,2,"R","R",2,2,2,"R",1,2,2,"R","R",1,1,3,1,1,"R","R","R",2]
[null,null,null,"2030-07-04","Nathalie",2,2,"R",1,2,2,"R","R",1,1,3,1,1,"R","R","R",2,2,"R","R",2,2,2,"R",1,2,2,"R","R",1,1]
[null,null,null,"2030-07-05","Marylène","R","R",2,2,"R","R",2,2,2,"R",1,2,2,"R","R",1,1,3,1,1,"R","R","R",2,2,"R","R",2,2,2,"R"]
[null,null,null,"2030-07-06","Karl",2,"R",1,1,1,1,"R","R","R",1,1,"R",1,2,2,"R",1,1,1,1,"R","R","R",1,1,"R",1,2,2,"R",1]
[null,null,null,"2030-07-07","Mickaël","R",1,1,"R","R",1,2,2,1,1,"R",1,1,"R","R",1,1,"R","R",1,2,2,1,1,"R",1,1,"R","R",1,1]
[null,null,null,"Aout-30","Aout","2030-08-01","2030-08-02","2030-08-03","2030-08-04","2030-08-05","2030-08-06","2030-08-07","2030-08-08","2030-08-09","2030-08-10","2030-08-11","2030-08-12","2030-08-13","2030-08-14","2030-08-15","2030-08-16","2030-08-17","2030-08-18","2030-08-19","2030-08-20","2030-08-21","2030-08-22","2030-08-23","2030-08-24","2030-08-25","2030-08-26","2030-08-27","2030-08-28","2030-08-29","2030-08-30","2030-08-31"]
[null,null,null,"2030-08-01","Isabelle",2,2,3,"R","R",2,3,2,1,"R",2,"R","R",2,2,2,3,"R","R",2,3,2,1,"R",2,"R","R",2,2,2,3]
[null,null,null,"2030-08-02","Sylvine","R",1,2,2,"R","R",2,"R",2,2,"R","R",2,3,"R",1,2,2,"R","R",2,"R",2,2,"R","R",2,3,"R",1,2]
[null,null,null,"2030-08-03","Élodie",2,"R","R",2,2,2,"R",1,2,2,"R","R",1,1,3,1,1,"R","R","R",2,2,"R","R",2,2,2,"R",1,2,2]
[null,null,null,"2030-08-04","Nathalie",3,1,1,"R","R","R",2,2,"R","R",2,2,2,"R",1,2,2,"R","R",1,1,3,1,1,"R","R","R",2,2,"R","R"]
[null,null,null,"2030-08-05","Marylène",1,2,2,"R","R",1,1,3,1,1,"R","R","R",2,2,"R","R",2,2,2,"R",1,2,2,"R","R",1,1,3,1,1]
[null,null,null,"2030-08-06","Karl",1,1,1,"R","R","R",1,1,"R",1,2,2,"R",1,1,1,1,"R","R","R",1,1,"R",1,2,2,"R",1,1,1,1]
[null,null,null,"2030-08-07","Mickaël","R","R",1,2,2,1,1,"R",1,1,"R","R",1,1,"R","R",1,2,2,1,1,"R",1,1,"R","R",1,1,"R","R",1]
[null,null,null,"Sept-30","Septembre","2030-09-01","2030-09-02","2030-09-03","2030-09-04","2030-09-05","2030-09-06","2030-09-07","2030-09-08","2030-09-09","2030-09-10","2030-09-11","2030-09-12","2030-09-13","2030-09-14","2030-09-15","2030-09-16","2030-09-17","2030-09-18","2030-09-19","2030-09-20","2030-09-21","2030-09-22","2030-09-23","2030-09-24","2030-09-25","2030-09-26","2030-09-27","2030-09-28","2030-09-29","2030-09-30"]
[null,null,null,"2030-09-01","Isabelle","R","R",2,3,2,1,"R",2,"R","R",2,2,2,3,"R","R",2,3,2,1,"R",2,"R","R",2,2,2,3,"R","R"]
[null,null,null,"2030-09-02","Sylvine",2,"R","R",2,"R",2,2,"R","R",2,3,"R",1,2,2,"R","R",2,"R",2,2,"R","R",2,3,"R",1,2,2,"R"]
[null,null,null,"2030-09-03","Élodie","R","R",1,1,3,1,1,"R","R","R",2,2,"R","R",2,2,2,"R",1,2,2,"R","R",1,1,3,1,1,"R","R"]
[null,null,null,"2030-09-04","Nathalie",2,2,2,"R",1,2,2,"R","R",1,1,3,1,1,"R","R","R",2,2,"R","R",2,2,2,"R",1,2,2,"R","R"]
[null,null,null,"2030-09-05","Marylène","R","R","R",2,2,"R","R",2,2,2,"R",1,2,2,"R","R",1,1,3,1,1,"R","R","R",2,2,"R","R",2,2]
[null,null,null,"2030-09-06","Karl","R","R","R",1,1,"R",1,2,2,"R",1,1,1,1,"R","R","R",1,1,"R",1,2,2,"R",1,1,1,1,"R","R"]
[null,null,null,"2030-09-07","Mickaël",2,2,1,1,"R",1,1,"R","R",1,1,"R","R",1,2,2,1,1,"R",1,1,"R","R",1,1,"R","R",1,2,2]
[null,null,null,"Oct-30","Octobre","2030-10-01","2030-10-02","2030-10-03","2030-10-04","2030-10-05","2030-10-06","2030-10-07","2030-10-08","2030-10-09","2030-10-10","2030-10-11","2030-10-12","2030-10-13","2030-10-14","2030-10-15","2030-10-16","2030-10-17","2030-10-18","2030-10-19","2030-10-20","2030-10-21","2030-10-22","2030-10-23","2030-10-24","2030-10-25","2030-10-26","2030-10-27","2030-10-28","2030-10-29","2030-10-30","2030-10-31"]
[null,null,null,"2030-10-01","Isabelle",2,3,2,1,"R",2,"R","R",2,2,2,3,"R","R",2,3,2,1,"R",2,"R","R",2,2,2,3,"R","R",2,3,2]
[null,null,null,"2030-10-02","Sylvine","R",2,"R",2,2,"R","R",2,3,"R",1,2,2,"R","R",2,"R",2,2,"R","R",2,3,"R",1,2,2,"R","R",2,"R"]
[null,null,null,"2030-10-03","Élodie","R",2,2,"R","R",2,2,2,"R",1,2,2,"R","R",1,1,3,1,1,"R","R","R",2,2,"R","R",2,2,2,"R",1]
[null,null,null,"2030-10-04","Nathalie",1,1,3,1,1,"R","R","R",2,2,"R","R",2,2,2,"R",1,2,2,"R","R",1,1,3,1,1,"R","R","R",2,2]
[null,null,null,"2030-10-05","Marylène",2,"R",1,2,2,"R","R",1,1,3,1,1,"R","R","R",2,2,"R","R",2,2,2,"R",1,2,2,"R","R",1,1,3]
[null,null,null,"2030-10-06","Karl","R",1,1,"R",1,2,2,"R",1,1,1,1,"R","R","R",1,1,"R",1,2,2,"R",1,1,1,1,"R","R","R",1,1]
[null,null,null,"2030-10-07","Mickaël",1,1,"R",1,1,"R","R",1,1,"R","R",1,2,2,1,1,"R",1,1,"R","R",1,1,"R","R",1,2,2,1,1,"R"]
[null,null,null,"Nov-30","Novembre","2030-11-01","2030-11-02","2030-11-03","2030-11-04","2030-11-05","2030-11-06","2030-11-07","2030-11-08","2030-11-09","2030-11-10","2030-11-11","2030-11-12","2030-11-13","2030-11-14","2030-11-15","2030-11-16","2030-11-17","2030-11-18","2030-11-19","2030-11-20","2030-11-21","2030-11-22","2030-11-23","2030-11-24","2030-11-25","2030-11-26","2030-11-27","2030-11-28","2030-11-29","2030-11-30"]
[null,null,null,"2030-11-01","Isabelle",1,"R",2,"R","R",2,2,2,3,"R","R",2,3,2,1,"R",2,"R","R",2,2,2,3,"R","R",2,3,2,1,"R"]
[null,null,null,"2030-11-02","Sylvine",2,2,"R","R",2,3,"R",1,2,2,"R","R",2,"R",2,2,"R","R",2,3,"R",1,2,2,"R","R",2,"R",2,2]
[null,null,null,"2030-11-03","Élodie",2,2,"R","R",1,1,3,1,1,"R","R","R",2,2,"R","R",2,2,2,"R",1,2,2,"R","R",1,1,3,1,1]
[null,null,null,"2030-11-04","Nathalie","R","R",2,2,2,"R",1,2,2,"R","R",1,1,3,1,1,"R","R","R",2,2,"R","R",2,2,2,"R",1,2,2]
[null,null,null,"2030-11-05","Marylène",1,1,"R","R","R",2,2,"R","R",2,2,2,"R",1,2,2,"R","R",1,1,3,1,1,"R","R","R",2,2,"R","R"]
[null,null,null,"2030-11-06","Karl","R",1,2,2,"R",1,1,1,1,"R","R","R",1,1,"R",1,2,2,"R",1,1,1,1,"R","R","R",1,1,"R",1]
[null,null,null,"2030-11-07","Mickaël",1,1,"R","R",1,1,"R","R",1,2,2,1,1,"R",1,1,"R","R",1,1,"R","R",1,2,2,1,1,"R",1,1]
[null,null,null,"Dec-30","Décembre","2030-12-01","2030-12-02","2030-12-03","2030-12-04","2030-12-05","2030-12-06","2030-12-07","2030-12-08","2030-12-09","2030-12-10","2030-12-11","2030-12-12","2030-12-13","2030-12-14","2030-12-15","2030-12-16","2030-12-17","2030-12-18","2030-12-19","2030-12-20","2030-12-21","2030-12-22","2030-12-23","2030-12-24","2030-12-25","2030-12-26","2030-12-27","2030-12-28","2030-12-29","2030-12-30","2030-12-31"]
[null,null,null,"2030-12-01","Isabelle",2,"R","R",2,2,2,3,"R","R",2,3,2,1,"R",2,"R","R",2,2,2,3,"R","R",2,3,2,1,"R",2,"R","R"]
[null,null,null,"2030-12-02","Sylvine","R","R",2,3,"R",1,2,2,"R","R",2,"R",2,2,"R","R",2,3,"R",1,2,2,"R","R",2,"R",2,2,"R","R",2]
[null,null,null,"2030-12-03","Élodie","R","R","R",2,2,"R","R",2,2,2,"R",1,2,2,"R","R",1,1,3,1,1,"R","R","R",2,2,"R","R",2,2,2]
[null,null,null,"2030-12-04","Nathalie","R","R",1,1,3,1,1,"R","R","R",2,2,"R","R",2,2,2,"R",1,2,2,"R","R",1,1,3,1,1,"R","R","R"]
[null,null,null,"2030-12-05","Marylène",2,2,2,"R",1,2,2,"R","R",1,1,3,1,1,"R","R","R",2,2,"R","R",2,2,2,"R",1,2,2,"R","R",1]
[null,null,null,"2030-12-06","Karl",2,2,"R",1,1,1,1,"R","R","R",1,1,"R",1,2,2,"R",1,1,1,1,"R","R","R",1,1,"R",1,2,2,"R"]
[null,null,null,"2030-12-07","Mickaël","R","R",1,1,"R","R",1,2,2,1,1,"R",1,1,"R","R",1,1,"R","R",1,2,2,1,1,"R",1,1,"R","R",1]
[null,null,null,"Janv-31","Janvier","2031-01-01","2031-01-02","2031-01-03","2031-01-04","2031-01-05","2031-01-06","2031-01-07","2031-01-08","2031-01-09","2031-01-10","2031-01-11","2031-01-12","2031-01-13","2031-01-14","2031-01-15","2031-01-16","2031-01-17","2031-01-18","2031-01-19","2031-01-20","2031-01-21","2031-01-22","2031-01-23","2031-01-24","2031-01-25","2031-01-26","2031-01-27","2031-01-28","2031-01-29","2031-01-30","2031-01-31"]
[null,null,null,"2031-01-01","Isabelle",2,2,2,3,"R","R",2,3,2,1,"R",2,"R","R",2,2,2,3,"R","R",2,3,2,1,"R",2,"R","R",2,2,2]
[null,null,null,"2031-01-02","Sylvine",3,"R",1,2,2,"R","R",2,"R",2,2,"R","R",2,3,"R",1,2,2,"R","R",2,"R",2,2,"R","R",2,3,"R",1]
[null,null,null,"2031-01-03","Élodie","R",1,2,2,"R","R",1,1,3,1,1,"R","R","R",2,2,"R","R",2,2,2,"R",1,2,2,"R","R",1,1,3,1]
[null,null,null,"2031-01-04","Nathalie",2,2,"R","R",2,2,2,"R",1,2,2,"R","R",1,1,3,1,1,"R","R","R",2,2,"R","R",2,2,2,"R",1,2]
[null,null,null,"2031-01-05","Marylène",1,3,1,1,"R","R","R",2,2,"R","R",2,2,2,"R",1,2,2,"R","R",1,1,3,1,1,"R","R","R",2,2,"R"]
[null,null,null,"2031-01-06","Karl",1,1,1,1,"R","R","R",1,1,"R",1,2,2,"R",1,1,1,1,"R","R","R",1,1,"R",1,2,2,"R",1,1,1]
[null,null,null,"2031-01-07","Mickaël",1,"R","R",1,2,2,1,1,"R",1,1,"R","R",1,1,"R","R",1,2,2,1,1,"R",1,1,"R","R",1,1,"R","R"]
[null,null,null,"Fev-31","Fevrier","2031-02-01","2031-02-02","2031-02-03","2031-02-04","2031-02-05","2031-02-06","2031-02-07","2031-02-08","2031-02-09","2031-02-10","2031-02-11","2031-02-12","2031-02-13","2031-02-14","2031-02-15","2031-02-16","2031-02-17","2031-02-18","2031-02-19","2031-02-20","2031-02-21","2031-02-22","2031-02-23","2031-02-24","2031-02-25","2031-02-26","2031-02-27","2031-02-28"]
[null,null,null,"2031-02-01","Isabelle",3,"R","R",2,3,2,1,"R",2,"R","R",2,2,2,3,"R","R",2,3,2,1,"R",2,"R","R",2,2,2]
[null,null,null,"2031-02-02","Sylvine",2,2,"R","R",2,"R",2,2,"R","R",2,3,"R",1,2,2,"R","R",2,"R",2,2,"R","R",2,3,"R",1]
[null,null,null,"2031-02-03","Élodie",1,"R","R","R",2,2,"R","R",2,2,2,"R",1,2,2,"R","R",1,1,3,1,1,"R","R","R",2,2,"R"]
[null,null,null,"2031-02-04","Nathalie",2,"R","R",1,1,3,1,1,"R","R","R",2,2,"R","R",2,2,2,"R",1,2,2,"R","R",1,1,3,1]
[null,null,null,"2031-02-05","Marylène","R",2,2,2,"R",1,2,2,"R","R",1,1,3,1,1,"R","R","R",2,2,"R","R",2,2,2,"R",1,2]
[null,null,null,"2031-02-06","Karl",1,"R","R","R",1,1,"R",1,2,2,"R",1,1,1,1,"R","R","R",1,1,"R",1,2,2,"R",1,1,1]
[null,null,null,"2031-02-07","Mickaël",1,2,2,1,1,"R",1,1,"R","R",1,1,"R","R",1,2,2,1,1,"R",1,1,"R","R",1,1,"R","R"]
[null,null,null,"Mars-31","Mars","2031-03-01","2031-03-02","2031-03-03","2031-03-04","2031-03-05","2031-03-06","2031-03-07","2031-03-08","2031-03-09","2031-03-10","2031-03-11","2031-03-12","2031-03-13","2031-03-14","2031-03-15","2031-03-16","2031-03-17","2031-03-18","2031-03-19","2031-03-20","2031-03-21","2031-03-22","2031-03-23","2031-03-24","2031-03-25","2031-03-26","2031-03-27","2031-03-28","2031-03-29","2031-03-30","2031-03-31"]
[null,null,null,"2031-03-01","Isabelle",3,"R","R",2,3,2,1,"R",2,"R","R",2,2,2,3,"R","R",2,3,2,1,"R",2,"R","R",2,2,2,3,"R","R"]
[null,null,null,"2031-03-02","Sylvine",2,2,"R","R",2,"R",2,2,"R","R",2,3,"R",1,2,2,"R","R",2,"R",2,2,"R","R",2,3,"R",1,2,2,"R"]
[null,null,null,"2031-03-03","Élodie","R",2,2,2,"R",1,2,2,"R","R",1,1,3,1,1,"R","R","R",2,2,"R","R",2,2,2,"R",1,2,2,"R","R"]
[null,null,null,"2031-03-04","Nathalie",1,"R","R","R",2,2,"R","R",2,2,2,"R",1,2,2,"R","R",1,1,3,1,1,"R","R","R",2,2,"R","R",2,2]
[null,null,null,"2031-03-05","Marylène",2,"R","R",1,1,3,1,1,"R","R","R",2,2,"R","R",2,2,2,"R",1,2,2,"R","R",1,1,3,1,1,"R","R"]
[null,null,null,"2031-03-06","Karl",1,"R","R","R",1,1,"R",1,2,2,"R",1,1,1,1,"R","R","R",1,1,"R",1,2,2,"R",1,1,1,1,"R","R"]
[null,null,null,"2031-03-07","Mickaël",1,2,2,1,1,"R",1,1,"R","R",1,1,"R","R",1,2,2,1,1,"R",1,1,"R","R",1,1,"R","R",1,2,2]
[null,null,null,"Avr-31","Avril","2031-04-01","2031-04-02","2031-04-03","2031-04-04","2031-04-05","2031-04-06","2031-04-07","2031-04-08","2031-04-09","2031-04-10","2031-04-11","2031-04-12","2031-04-13","2031-04-14","2031-04-15","2031-04-16","2031-04-17","2031-04-18","2031-04-19","2031-04-20","2031-04-21","2031-04-22","2031-04-23","2031-04-24","2031-04-25","2031-04-26","2031-04-27","2031-04-28","2031-04-29","2031-04-30"]
[null,null,null,"2031-04-01","Isabelle",2,3,2,1,"R",2,"R","R",2,2,2,3,"R","R",2,3,2,1,"R",2,"R","R",2,2,2,3,"R","R",2,3]
[null,null,null,"2031-04-02","Sylvine","R",2,"R",2,2,"R","R",2,3,"R",1,2,2,"R","R",2,"R",2,2,"R","R",2,3,"R",1,2,2,"R","R",2]
[null,null,null,"2031-04-03","Élodie",1,1,3,1,1,"R","R","R",2,2,"R","R",2,2,2,"R",1,2,2,"R","R",1,1,3,1,1,"R","R","R",2]
[null,null,null,"2031-04-04","Nathalie",2,"R",1,2,2,"R","R",1,1,3,1,1,"R","R","R",2,2,"R","R",2,2,2,"R",1,2,2,"R","R",1,1]
[null,null,null,"2031-04-05","Marylène","R",2,2,"R","R",2,2,2,"R",1,2,2,"R","R",1,1,3,1,1,"R","R","R",2,2,"R","R",2,2,2,"R"]
[null,null,null,"2031-04-06","Karl","R",1,1,"R",1,2,2,"R",1,1,1,1,"R","R","R",1,1,"R",1,2,2,"R",1,1,1,1,"R","R","R",1]
[null,null,null,"2031-04-07","Mickaël",1,1,"R",1,1,"R","R",1,1,"R","R",1,2,2,1,1,"R",1,1,"R","R",1,1,"R","R",1,2,2,1,1]
[null,null,null,"Mai-31","Mai","2031-05-01","2031-05-02","2031-05-03","2031-05-04","2031-05-05","2031-05-06","2031-05-07","2031-05-08","2031-05-09","2031-05-10","2031-05-11","2031-05-12","2031-05-13","2031-05-14","2031-05-15","2031-05-16","2031-05-17","2031-05-18","2031-05-19","2031-05-20","2031-05-21","2031-05-22","2031-05-23","2031-05-24","2031-05-25","2031-05-26","2031-05-27","2031-05-28","2031-05-29","2031-05-30","2031-05-31"]
[null,null,null,"2031-05-01","Isabelle",2,1,"R",2,"R","R",2,2,2,3,"R","R",2,3,2,1,"R",2,"R","R",2,2,2,3,"R","R",2,3,2,1,"R"]
[null,null,null,"2031-05-02","Sylvine","R",2,2,"R","R",2,3,"R",1,2,2,"R","R",2,"R",2,2,"R","R",2,3,"R",1,2,2,"R","R",2,"R",2,2]
[null,null,null,"2031-05-03","Élodie",2,"R","R",2,2,2,"R",1,2,2,"R","R",1,1,3,1,1,"R","R","R",2,2,"R","R",2,2,2,"R",1,2,2]
[null,null,null,"2031-05-04","Nathalie",3,1,1,"R","R","R",2,2,"R","R",2,2,2,"R",1,2,2,"R","R",1,1,3,1,1,"R","R","R",2,2,"R","R"]
[null,null,null,"2031-05-05","Marylène",1,2,2,"R","R",1,1,3,1,1,"R","R","R",2,2,"R","R",2,2,2,"R",1,2,2,"R","R",1,1,3,1,1]
[null,null,null,"2031-05-06","Karl",1,"R",1,2,2,"R",1,1,1,1,"R","R","R",1,1,"R",1,2,2,"R",1,1,1,1,"R","R","R",1,1,"R",1]
[null,null,null,"2031-05-07","Mickaël","R",1,1,"R","R",1,1,"R","R",1,2,2,1,1,"R",1,1,"R","R",1,1,"R","R",1,2,2,1,1,"R",1,1]
[null,null,null,"Juin-31","Juin","2031-06-01","2031-06-02","2031-06-03","2031-06-04","2031-06-05","2031-06-06","2031-06-07","2031-06-08","2031-06-09","2031-06-10","2031-06-11","2031-06-12","2031-06-13","2031-06-14","2031-06-15","2031-06-16","2031-06-17","2031-06-18","2031-06-19","2031-06-20","2031-06-21","2031-06-22","2031-06-23","2031-06-24","2031-06-25","2031-06-26","2031-06-27","2031-06-28","2031-06-29","2031-06-30"]
[null,null,null,"2031-06-01","Isabelle",2,"R","R",2,2,2,3,"R","R",2,3,2,1,"R",2,"R","R",2,2,2,3,"R","R",2,3,2,1,"R",2,"R"]
[null,null,null,"2031-06-02","Sylvine","R","R",2,3,"R",1,2,2,"R","R",2,"R",2,2,"R","R",2,3,"R",1,2,2,"R","R",2,"R",2,2,"R","R"]
[null,null,null,"2031-06-03","Élodie","R","R",1,1,3,1,1,"R","R","R",2,2,"R","R",2,2,2,"R",1,2,2,"R","R",1,1,3,1,1,"R","R"]
[null,null,null,"2031-06-04","Nathalie",2,2,2,"R",1,2,2,"R","R",1,1,3,1,1,"R","R","R",2,2,"R","R",2,2,2,"R",1,2,2,"R","R"]
[null,null,null,"2031-06-05","Marylène","R","R","R",2,2,"R","R",2,2,2,"R",1,2,2,"R","R",1,1,3,1,1,"R","R","R",2,2,"R","R",2,2]
[null,null,null,"2031-06-06","Karl",2,2,"R",1,1,1,1,"R","R","R",1,1,"R",1,2,2,"R",1,1,1,1,"R","R","R",1,1,"R",1,2,2]
[null,null,null,"2031-06-07","Mickaël","R","R",1,1,"R","R",1,2,2,1,1,"R",1,1,"R","R",1,1,"R","R",1,2,2,1,1,"R",1,1,"R","R"]
[null,null,null,"Juil-31","Juillet","2031-07-01","2031-07-02","2031-07-03","2031-07-04","2031-07-05","2031-07-06","2031-07-07","2031-07-08","2031-07-09","2031-07-10","2031-07-11","2031-07-12","2031-07-13","2031-07-14","2031-07-15","2031-07-16","2031-07-17","2031-07-18","2031-07-19","2031-07-20","2031-07-21","2031-07-22","2031-07-23","2031-07-24","2031-07-25","2031-07-26","2031-07-27","2031-07-28","2031-07-29","2031-07-30","2031-07-31"]
[null,null,null,"2031-07-01","Isabelle","R",2,2,2,3,"R","R",2,3,2,1,"R",2,"R","R",2,2,2,3,"R","R",2,3,2,1,"R",2,"R","R",2,2]
[null,null,null,"2031-07-02","Sylvine",2,3,"R",1,2,2,"R","R",2,"R",2,2,"R","R",2,3,"R",1,2,2,"R","R",2,"R",2,2,"R","R",2,3,"R"]
[null,null,null,"2031-07-03","Élodie","R",2,2,"R","R",2,2,2,"R",1,2,2,"R","R",1,1,3,1,1,"R","R","R",2,2,"R","R",2,2,2,"R",1]
[null,null,null,"2031-07-04","Nathalie",1,1,3,1,1,"R","R","R",2,2,"R","R",2,2,2,"R",1,2,2,"R","R",1,1,3,1,1,"R","R","R",2,2]
[null,null,null,"2031-07-05","Marylène",2,"R",1,2,2,"R","R",1,1,3,1,1,"R","R","R",2,2,"R","R",2,2,2,"R",1,2,2,"R","R",1,1,3]
[null,null,null,"2031-07-06","Karl","R",1,1,1,1,"R","R","R",1,1,"R",1,2,2,"R",1,1,1,1,"R","R","R",1,1,"R",1,2,2,"R",1,1]
[null,null,null,"2031-07-07","Mickaël",1,1,"R","R",1,2,2,1,1,"R",1,1,"R","R",1,1,"R","R",1,2,2,1,1,"R",1,1,"R","R",1,1,"R"]
[null,null,null,"Aout-31","Aout","2031-08-01","2031-08-02","2031-08-03","2031-08-04","2031-08-05","2031-08-06","2031-08-07","2031-08-08","2031-08-09","2031-08-10","2031-08-11","2031-08-12","2031-08-13","2031-08-14","2031-08-15","2031-08-16","2031-08-17","2031-08-18","2031-08-19","2031-08-20","2031-08-21","2031-08-22","2031-08-23","2031-08-24","2031-08-25","2031-08-26","2031-08-27","2031-08-28","2031-08-29","2031-08-30","2031-08-31"]
[null,null,null,"2031-08-01","Isabelle",2,3,"R","R",2,3,2,1,"R",2,"R","R",2,2,2,3,"R","R",2,3,2,1,"R",2,"R","R",2,2,2,3,"R"]
[null,null,null,"2031-08-02","Sylvine",1,2,2,"R","R",2,"R",2,2,"R","R",2,3,"R",1,2,2,"R","R",2,"R",2,2,"R","R",2,3,"R",1,2,2]
[null,null,null,"2031-08-03","Élodie",2,2,"R","R",1,1,3,1,1,"R","R","R",2,2,"R","R",2,2,2,"R",1,2,2,"R","R",1,1,3,1,1,"R"]
[null,null,null,"2031-08-04","Nathalie","R","R",2,2,2,"R",1,2,2,"R","R",1,1,3,1,1,"R","R","R",2,2,"R","R",2,2,2,"R",1,2,2,"R"]
[null,null,null,"2031-08-05","Marylène",1,1,"R","R","R",2,2,"R","R",2,2,2,"R",1,2,2,"R","R",1,1,3,1,1,"R","R","R",2,2,"R","R",2]
[null,null,null,"2031-08-06","Karl",1,1,"R","R","R",1,1,"R",1,2,2,"R",1,1,1,1,"R","R","R",1,1,"R",1,2,2,"R",1,1,1,1,"R"]
[null,null,null,"2031-08-07","Mickaël","R",1,2,2,1,1,"R",1,1,"R","R",1,1,"R","R",1,2,2,1,1,"R",1,1,"R","R",1,1,"R","R",1,2]
[null,null,null,"Sept-31","Septembre","2031-09-01","2031-09-02","2031-09-03","2031-09-04","2031-09-05","2031-09-06","2031-09-07","2031-09-08","2031-09-09","2031-09-10","2031-09-11","2031-09-12","2031-09-13","2031-09-14","2031-09-15","2031-09-16","2031-09-17","2031-09-18","2031-09-19","2031-09-20","2031-09-21","2031-09-22","2031-09-23","2031-09-24","2031-09-25","2031-09-26","2031-09-27","2031-09-28","2031-09-29","2031-09-30"]
[null,null,null,"2031-09-01","Isabelle","R",2,3,2,1,"R",2,"R","R",2,2,2,3,"R","R",2,3,2,1,"R",2,"R","R",2,2,2,3,"R","R",2]
[null,null,null,"2031-09-02","Sylvine","R","R",2,"R",2,2,"R","R",2,3,"R",1,2,2,"R","R",2,"R",2,2,"R","R",2,3,"R",1,2,2,"R","R"]
[null,null,null,"2031-09-03","Élodie","R","R",2,2,"R","R",2,2,2,"R",1,2,2,"R","R",1,1,3,1,1,"R","R","R",2,2,"R","R",2,2,2]
[null,null,null,"2031-09-04","Nathalie","R",1,1,3,1,1,"R","R","R",2,2,"R","R",2,2,2,"R",1,2,2,"R","R",1,1,3,1,1,"R","R","R"]
[null,null,null,"2031-09-05","Marylène",2,2,"R",1,2,2,"R","R",1,1,3,1,1,"R","R","R",2,2,"R","R",2,2,2,"R",1,2,2,"R","R",1]
[null,null,null,"2031-09-06","Karl","R","R",1,1,"R",1,2,2,"R",1,1,1,1,"R","R","R",1,1,"R",1,2,2,"R",1,1,1,1,"R","R","R"]
[null,null,null,"2031-09-07","Mickaël",2,1,1,"R",1,1,"R","R",1,1,"R","R",1,2,2,1,1,"R",1,1,"R","R",1,1,"R","R",1,2,2,1]
[null,null,null,"Oct-31","Octobre","2031-10-01","2031-10-02","2031-10-03","2031-10-04","2031-10-05","2031-10-06","2031-10-07","2031-10-08","2031-10-09","2031-10-10","2031-10-11","2031-10-12","2031-10-13","2031-10-14","2031-10-15","2031-10-16","2031-10-17","2031-10-18","2031-10-19","2031-10-20","2031-10-21","2031-10-22","2031-10-23","2031-10-24","2031-10-25","2031-10-26","2031-10-27","2031-10-28","2031-10-29","2031-10-30","2031-10-31"]
[null,null,null,"2031-10-01","Isabelle",3,2,1,"R",2,"R","R",2,2,2,3,"R","R",2,3,2,1,"R",2,"R","R",2,2,2,3,"R","R",2,3,2,1]
[null,null,null,"2031-10-02","Sylvine",2,"R",2,2,"R","R",2,3,"R",1,2,2,"R","R",2,"R",2,2,"R","R",2,3,"R",1,2,2,"R","R",2,"R",2]
[null,null,null,"2031-10-03","Élodie","R",1,2,2,"R","R",1,1,3,1,1,"R","R","R",2,2,"R","R",2,2,2,"R",1,2,2,"R","R",1,1,3,1]
[null,null,null,"2031-10-04","Nathalie",2,2,"R","R",2,2,2,"R",1,2,2,"R","R",1,1,3,1,1,"R","R","R",2,2,"R","R",2,2,2,"R",1,2]
[null,null,null,"2031-10-05","Marylène",1,3,1,1,"R","R","R",2,2,"R","R",2,2,2,"R",1,2,2,"R","R",1,1,3,1,1,"R","R","R",2,2,"R"]
[null,null,null,"2031-10-06","Karl",1,1,"R",1,2,2,"R",1,1,1,1,"R","R","R",1,1,"R",1,2,2,"R",1,1,1,1,"R","R","R",1,1,"R"]
[null,null,null,"2031-10-07","Mickaël",1,"R",1,1,"R","R",1,1,"R","R",1,2,2,1,1,"R",1,1,"R","R",1,1,"R","R",1,2,2,1,1,"R",1]
[null,null,null,"Nov-31","Novembre","2031-11-01","2031-11-02","2031-11-03","2031-11-04","2031-11-05","2031-11-06","2031-11-07","2031-11-08","2031-11-09","2031-11-10","2031-11-11","2031-11-12","2031-11-13","2031-11-14","2031-11-15","2031-11-16","2031-11-17","2031-11-18","2031-11-19","2031-11-20","2031-11-21","2031-11-22","2031-11-23","2031-11-24","2031-11-25","2031-11-26","2031-11-27","2031-11-28","2031-11-29","2031-11-30"]
[null,null,null,"2031-11-01","Isabelle","R",2,"R","R",2,2,2,3,"R","R",2,3,2,1,"R",2,"R","R",2,2,2,3,"R","R",2,3,2,1,"R",2]
[null,null,null,"2031-11-02","Sylvine",2,"R","R",2,3,"R",1,2,2,"R","R",2,"R",2,2,"R","R",2,3,"R",1,2,2,"R","R",2,"R",2,2,"R"]
[null,null,null,"2031-11-03","Élodie",1,"R","R","R",2,2,"R","R",2,2,2,"R",1,2,2,"R","R",1,1,3,1,1,"R","R","R",2,2,"R","R",2]
[null,null,null,"2031-11-04","Nathalie",2,"R","R",1,1,3,1,1,"R","R","R",2,2,"R","R",2,2,2,"R",1,2,2,"R","R",1,1,3,1,1,"R"]
[null,null,null,"2031-11-05","Marylène","R",2,2,2,"R",1,2,2,"R","R",1,1,3,1,1,"R","R","R",2,2,"R","R",2,2,2,"R",1,2,2,"R"]
[null,null,null,"2031-11-06","Karl",1,2,2,"R",1,1,1,1,"R","R","R",1,1,"R",1,2,2,"R",1,1,1,1,"R","R","R",1,1,"R",1,2]
[null,null,null,"2031-11-07","Mickaël",1,"R","R",1,1,"R","R",1,2,2,1,1,"R",1,1,"R","R",1,1,"R","R",1,2,2,1,1,"R",1,1,"R"]
[null,null,null,"Dec-31","Décembre","2031-12-01","2031-12-02","2031-12-03","2031-12-04","2031-12-05","2031-12-06","2031-12-07","2031-12-08","2031-12-09","2031-12-10","2031-12-11","2031-12-12","2031-12-13","2031-12-14","2031-12-15","2031-12-16","2031-12-17","2031-12-18","2031-12-19","2031-12-20","2031-12-21","2031-12-22","2031-12-23","2031-12-24","2031-12-25","2031-12-26","2031-12-27","2031-12-28","2031-12-29","2031-12-30","2031-12-31"]
[null,null,null,"2031-12-01","Isabelle","R","R",2,2,2,3,"R","R",2,3,2,1,"R",2,"R","R",2,2,2,3,"R","R",2,3,2,1,"R",2,"R","R",2]
[null,null,null,"2031-12-02","Sylvine","R",2,3,"R",1,2,2,"R","R",2,"R",2,2,"R","R",2,3,"R",1,2,2,"R","R",2,"R",2,2,"R","R",2,3]
[null,null,null,"2031-12-03","Élodie",2,2,"R",1,2,2,"R","R",1,1,3,1,1,"R","R","R",2,2,"R","R",2,2,2,"R",1,2,2,"R","R",1,1]
[null,null,null,"2031-12-04","Nathalie","R","R",2,2,"R","R",2,2,2,"R",1,2,2,"R","R",1,1,3,1,1,"R","R","R",2,2,"R","R",2,2,2,"R"]
[null,null,null,"2031-12-05","Marylène","R",1,1,3,1,1,"R","R","R",2,2,"R","R",2,2,2,"R",1,2,2,"R","R",1,1,3,1,1,"R","R","R",2]
[null,null,null,"2031-12-06","Karl",2,"R",1,1,1,1,"R","R","R",1,1,"R",1,2,2,"R",1,1,1,1,"R","R","R",1,1,"R",1,2,2,"R",1]
[null,null,null,"2031-12-07","Mickaël","R",1,1,"R","R",1,2,2,1,1,"R",1,1,"R","R",1,1,"R","R",1,2,2,1,1,"R",1,1,"R","R",1,1]
[null,null,null,"Janv-32","Janvier","2032-01-01","2032-01-02","2032-01-03","2032-01-04","2032-01-05","2032-01-06","2032-01-07","2032-01-08","2032-01-09","2032-01-10","2032-01-11","2032-01-12","2032-01-13","2032-01-14","2032-01-15","2032-01-16","2032-01-17","2032-01-18","2032-01-19","2032-01-20","2032-01-21","2032-01-22","2032-01-23","2032-01-24","2032-01-25","2032-01-26","2032-01-27","2032-01-28","2032-01-29","2032-01-30","2032-01-31"]
[null,null,null,"2032-01-01","Isabelle",2,2,3,"R","R",2,3,2,1,"R",2,"R","R",2,2,2,3,"R","R",2,3,2,1,"R",2,"R","R",2,2,2,3]
[null,null,null,"2032-01-02","Sylvine","R",1,2,2,"R","R",2,"R",2,2,"R","R",2,3,"R",1,2,2,"R","R",2,"R",2,2,"R","R",2,3,"R",1,2]
[null,null,null,"2032-01-03","Élodie",3,1,1,"R","R","R",2,2,"R","R",2,2,2,"R",1,2,2,"R","R",1,1,3,1,1,"R","R","R",2,2,"R","R"]
[null,null,null,"2032-01-04","Nathalie",1,2,2,"R","R",1,1,3,1,1,"R","R","R",2,2,"R","R",2,2,2,"R",1,2,2,"R","R",1,1,3,1,1]
[null,null,null,"2032-01-05","Marylène",2,"R","R",2,2,2,"R",1,2,2,"R","R",1,1,3,1,1,"R","R","R",2,2,"R","R",2,2,2,"R",1,2,2]
[null,null,null,"2032-01-06","Karl",1,1,1,"R","R","R",1,1,"R",1,2,2,"R",1,1,1,1,"R","R","R",1,1,"R",1,2,2,"R",1,1,1,1]
[null,null,null,"2032-01-07","Mickaël","R","R",1,2,2,1,1,"R",1,1,"R","R",1,1,"R","R",1,2,2,1,1,"R",1,1,"R","R",1,1,"R","R",1]
[null,null,null,"Fevr-32","Fevrier","2032-02-01","2032-02-02","2032-02-03","2032-02-04","2032-02-05","2032-02-06","2032-02-07","2032-02-08","2032-02-09","2032-02-10","2032-02-11","2032-02-12","2032-02-13","2032-02-14","2032-02-15","2032-02-16","2032-02-17","2032-02-18","2032-02-19","2032-02-20","2032-02-21","2032-02-22","2032-02-23","2032-02-24","2032-02-25","2032-02-26","2032-02-27","2032-02-28","2032-02-29"]
[null,null,null,"2032-02-01","Isabelle","R","R",2,3,2,1,"R",2,"R","R",2,2,2,3,"R","R",2,3,2,1,"R",2,"R","R",2,2,2,3,"R"]
[null,null,null,"2032-02-02","Sylvine",2,"R","R",2,"R",2,2,"R","R",2,3,"R",1,2,2,"R","R",2,"R",2,2,"R","R",2,3,"R",1,2,2]
[null,null,null,"2032-02-03","Élodie",2,2,2,"R",1,2,2,"R","R",1,1,3,1,1,"R","R","R",2,2,"R","R",2,2,2,"R",1,2,2,"R"]
[null,null,null,"2032-02-04","Nathalie","R","R","R",2,2,"R","R",2,2,2,"R",1,2,2,"R","R",1,1,3,1,1,"R","R","R",2,2,"R","R",2]
[null,null,null,"2032-02-05","Marylène","R","R",1,1,3,1,1,"R","R","R",2,2,"R","R",2,2,2,"R",1,2,2,"R","R",1,1,3,1,1,"R"]
[null,null,null,"2032-02-06","Karl","R","R","R",1,1,"R",1,2,2,"R",1,1,1,1,"R","R","R",1,1,"R",1,2,2,"R",1,1,1,1,"R"]
[null,null,null,"2032-02-07","Mickaël",2,2,1,1,"R",1,1,"R","R",1,1,"R","R",1,2,2,1,1,"R",1,1,"R","R",1,1,"R","R",1,2]
[null,null,null,"Mars-32","Mars","2032-03-01","2032-03-02","2032-03-03","2032-03-04","2032-03-05","2032-03-06","2032-03-07","2032-03-08","2032-03-09","2032-03-10","2032-03-11","2032-03-12","2032-03-13","2032-03-14","2032-03-15","2032-03-16","2032-03-17","2032-03-18","2032-03-19","2032-03-20","2032-03-21","2032-03-22","2032-03-23","2032-03-24","2032-03-25","2032-03-26","2032-03-27","2032-03-28","2032-03-29","2032-03-30","2032-03-31"]
[null,null,null,"2032-03-01","Isabelle","R",2,3,2,1,"R",2,"R","R",2,2,2,3,"R","R",2,3,2,1,"R",2,"R","R",2,2,2,3,"R","R",2,3]
[null,null,null,"2032-03-02","Sylvine","R","R",2,"R",2,2,"R","R",2,3,"R",1,2,2,"R","R",2,"R",2,2,"R","R",2,3,"R",1,2,2,"R","R",2]
[null,null,null,"2032-03-03","Élodie","R",1,1,3,1,1,"R","R","R",2,2,"R","R",2,2,2,"R",1,2,2,"R","R",1,1,3,1,1,"R","R","R",2]
[null,null,null,"2032-03-04","Nathalie",2,2,"R",1,2,2,"R","R",1,1,3,1,1,"R","R","R",2,2,"R","R",2,2,2,"R",1,2,2,"R","R",1,1]
[null,null,null,"2032-03-05","Marylène","R","R",2,2,"R","R",2,2,2,"R",1,2,2,"R","R",1,1,3,1,1,"R","R","R",2,2,"R","R",2,2,2,"R"]
[null,null,null,"2032-03-06","Karl","R","R",1,1,"R",1,2,2,"R",1,1,1,1,"R","R","R",1,1,"R",1,2,2,"R",1,1,1,1,"R","R","R",1]
[null,null,null,"2032-03-07","Mickaël",2,1,1,"R",1,1,"R","R",1,1,"R","R",1,2,2,1,1,"R",1,1,"R","R",1,1,"R","R",1,2,2,1,1]
[null,null,null,"Avr-32","Avril","2032-04-01","2032-04-02","2032-04-03","2032-04-04","2032-04-05","2032-04-06","2032-04-07","2032-04-08","2032-04-09","2032-04-10","2032-04-11","2032-04-12","2032-04-13","2032-04-14","2032-04-15","2032-04-16","2032-04-17","2032-04-18","2032-04-19","2032-04-20","2032-04-21","2032-04-22","2032-04-23","2032-04-24","2032-04-25","2032-04-26","2032-04-27","2032-04-28","2032-04-29","2032-04-30"]
[null,null,null,"2032-04-01","Isabelle",2,1,"R",2,"R","R",2,2,2,3,"R","R",2,3,2,1,"R",2,"R","R",2,2,2,3,"R","R",2,3,2,1]
[null,null,null,"2032-04-02","Sylvine","R",2,2,"R","R",2,3,"R",1,2,2,"R","R",2,"R",2,2,"R","R",2,3,"R",1,2,2,"R","R",2,"R",2]
[null,null,null,"2032-04-03","Élodie",2,"R","R",2,2,2,"R",1,2,2,"R","R",1,1,3,1,1,"R","R","R",2,2,"R","R",2,2,2,"R",1,2]
[null,null,null,"2032-04-04","Nathalie",3,1,1,"R","R","R",2,2,"R","R",2,2,2,"R",1,2,2,"R","R",1,1,3,1,1,"R","R","R",2,2,"R"]
[null,null,null,"2032-04-05","Marylène",1,2,2,"R","R",1,1,3,1,1,"R","R","R",2,2,"R","R",2,2,2,"R",1,2,2,"R","R",1,1,3,1]
[null,null,null,"2032-04-06","Karl",1,"R",1,2,2,"R",1,1,1,1,"R","R","R",1,1,"R",1,2,2,"R",1,1,1,1,"R","R","R",1,1,"R"]
[null,null,null,"2032-04-07","Mickaël","R",1,1,"R","R",1,1,"R","R",1,2,2,1,1,"R",1,1,"R","R",1,1,"R","R",1,2,2,1,1,"R",1]
[null,null,null,"Mai-32","Mai","2032-05-01","2032-05-02","2032-05-03","2032-05-04","2032-05-05","2032-05-06","2032-05-07","2032-05-08","2032-05-09","2032-05-10","2032-05-11","2032-05-12","2032-05-13","2032-05-14","2032-05-15","2032-05-16","2032-05-17","2032-05-18","2032-05-19","2032-05-20","2032-05-21","2032-05-22","2032-05-23","2032-05-24","2032-05-25","2032-05-26","2032-05-27","2032-05-28","2032-05-29","2032-05-30","2032-05-31"]
[null,null,null,"2032-05-01","Isabelle","R",2,"R","R",2,2,2,3,"R","R",2,3,2,1,"R",2,"R","R",2,2,2,3,"R","R",2,3,2,1,"R",2,"R"]
[null,null,null,"2032-05-02","Sylvine",2,"R","R",2,3,"R",1,2,2,"R","R",2,"R",2,2,"R","R",2,3,"R",1,2,2,"R","R",2,"R",2,2,"R","R"]
[null,null,null,"2032-05-03","Élodie",2,"R","R",1,1,3,1,1,"R","R","R",2,2,"R","R",2,2,2,"R",1,2,2,"R","R",1,1,3,1,1,"R","R"]
[null,null,null,"2032-05-04","Nathalie","R",2,2,2,"R",1,2,2,"R","R",1,1,3,1,1,"R","R","R",2,2,"R","R",2,2,2,"R",1,2,2,"R","R"]
[null,null,null,"2032-05-05","Marylène",1,"R","R","R",2,2,"R","R",2,2,2,"R",1,2,2,"R","R",1,1,3,1,1,"R","R","R",2,2,"R","R",2,2]
[null,null,null,"2032-05-06","Karl",1,2,2,"R",1,1,1,1,"R","R","R",1,1,"R",1,2,2,"R",1,1,1,1,"R","R","R",1,1,"R",1,2,2]
[null,null,null,"2032-05-07","Mickaël",1,"R","R",1,1,"R","R",1,2,2,1,1,"R",1,1,"R","R",1,1,"R","R",1,2,2,1,1,"R",1,1,"R","R"]
[null,null,null,"Juin-32","Juin","2032-06-01","2032-06-02","2032-06-03","2032-06-04","2032-06-05","2032-06-06","2032-06-07","2032-06-08","2032-06-09","2032-06-10","2032-06-11","2032-06-12","2032-06-13","2032-06-14","2032-06-15","2032-06-16","2032-06-17","2032-06-18","2032-06-19","2032-06-20","2032-06-21","2032-06-22","2032-06-23","2032-06-24","2032-06-25","2032-06-26","2032-06-27","2032-06-28","2032-06-29","2032-06-30"]
[null,null,null,"2032-06-01","Isabelle","R",2,2,2,3,"R","R",2,3,2,1,"R",2,"R","R",2,2,2,3,"R","R",2,3,2,1,"R",2,"R","R",2]
[null,null,null,"2032-06-02","Sylvine",2,3,"R",1,2,2,"R","R",2,"R",2,2,"R","R",2,3,"R",1,2,2,"R","R",2,"R",2,2,"R","R",2,3]
[null,null,null,"2032-06-03","Élodie","R",2,2,"R","R",2,2,2,"R",1,2,2,"R","R",1,1,3,1,1,"R","R","R",2,2,"R","R",2,2,2,"R"]
[null,null,null,"2032-06-04","Nathalie",1,1,3,1,1,"R","R","R",2,2,"R","R",2,2,2,"R",1,2,2,"R","R",1,1,3,1,1,"R","R","R",2]
[null,null,null,"2032-06-05","Marylène",2,"R",1,2,2,"R","R",1,1,3,1,1,"R","R","R",2,2,"R","R",2,2,2,"R",1,2,2,"R","R",1,1]
[null,null,null,"2032-06-06","Karl","R",1,1,1,1,"R","R","R",1,1,"R",1,2,2,"R",1,1,1,1,"R","R","R",1,1,"R",1,2,2,"R",1]
[null,null,null,"2032-06-07","Mickaël",1,1,"R","R",1,2,2,1,1,"R",1,1,"R","R",1,1,"R","R",1,2,2,1,1,"R",1,1,"R","R",1,1]
[null,null,null,"Juil-32","Juillet","2032-07-01","2032-07-02","2032-07-03","2032-07-04","2032-07-05","2032-07-06","2032-07-07","2032-07-08","2032-07-09","2032-07-10","2032-07-11","2032-07-12","2032-07-13","2032-07-14","2032-07-15","2032-07-16","2032-07-17","2032-07-18","2032-07-19","2032-07-20","2032-07-21","2032-07-22","2032-07-23","2032-07-24","2032-07-25","2032-07-26","2032-07-27","2032-07-28","2032-07-29","2032-07-30","2032-07-31"]
[null,null,null,"2032-07-01","Isabelle",2,2,3,"R","R",2,3,2,1,"R",2,"R","R",2,2,2,3,"R","R",2,3,2,1,"R",2,"R","R",2,2,2,3]
[null,null,null,"2032-07-02","Sylvine","R",1,2,2,"R","R",2,"R",2,2,"R","R",2,3,"R",1,2,2,"R","R",2,"R",2,2,"R","R",2,3,"R",1,2]
[null,null,null,"2032-07-03","Élodie",1,2,2,"R","R",1,1,3,1,1,"R","R","R",2,2,"R","R",2,2,2,"R",1,2,2,"R","R",1,1,3,1,1]
[null,null,null,"2032-07-04","Nathalie",2,"R","R",2,2,2,"R",1,2,2,"R","R",1,1,3,1,1,"R","R","R",2,2,"R","R",2,2,2,"R",1,2,2]
[null,null,null,"2032-07-05","Marylène",3,1,1,"R","R","R",2,2,"R","R",2,2,2,"R",1,2,2,"R","R",1,1,3,1,1,"R","R","R",2,2,"R","R"]
[null,null,null,"2032-07-06","Karl",1,1,1,"R","R","R",1,1,"R",1,2,2,"R",1,1,1,1,"R","R","R",1,1,"R",1,2,2,"R",1,1,1,1]
[null,null,null,"2032-07-07","Mickaël","R","R",1,2,2,1,1,"R",1,1,"R","R",1,1,"R","R",1,2,2,1,1,"R",1,1,"R","R",1,1,"R","R",1]
[null,null,null,"Aout-32","Aout","2032-08-01","2032-08-02","2032-08-03","2032-08-04","2032-08-05","2032-08-06","2032-08-07","2032-08-08","2032-08-09","2032-08-10","2032-08-11","2032-08-12","2032-08-13","2032-08-14","2032-08-15","2032-08-16","2032-08-17","2032-08-18","2032-08-19","2032-08-20","2032-08-21","2032-08-22","2032-08-23","2032-08-24","2032-08-25","2032-08-26","2032-08-27","2032-08-28","2032-08-29","2032-08-30","2032-08-31"]
[null,null,null,"2032-08-01","Isabelle","R","R",2,3,2,1,"R",2,"R","R",2,2,2,3,"R","R",2,3,2,1,"R",2,"R","R",2,2,2,3,"R","R",2]
[null,null,null,"2032-08-02","Sylvine",2,"R","R",2,"R",2,2,"R","R",2,3,"R",1,2,2,"R","R",2,"R",2,2,"R","R",2,3,"R",1,2,2,"R","R"]
[null,null,null,"2032-08-03","Élodie","R","R","R",2,2,"R","R",2,2,2,"R",1,2,2,"R","R",1,1,3,1,1,"R","R","R",2,2,"R","R",2,2,2]
[null,null,null,"2032-08-04","Nathalie","R","R",1,1,3,1,1,"R","R","R",2,2,"R","R",2,2,2,"R",1,2,2,"R","R",1,1,3,1,1,"R","R","R"]
[null,null,null,"2032-08-05","Marylène",2,2,2,"R",1,2,2,"R","R",1,1,3,1,1,"R","R","R",2,2,"R","R",2,2,2,"R",1,2,2,"R","R",1]
[null,null,null,"2032-08-06","Karl","R","R","R",1,1,"R",1,2,2,"R",1,1,1,1,"R","R","R",1,1,"R",1,2,2,"R",1,1,1,1,"R","R","R"]
[null,null,null,"2032-08-07","Mickaël",2,2,1,1,"R",1,1,"R","R",1,1,"R","R",1,2,2,1,1,"R",1,1,"R","R",1,1,"R","R",1,2,2,1]
[null,null,null,"Sept-32","Septembre","2032-09-01","2032-09-02","2032-09-03","2032-09-04","2032-09-05","2032-09-06","2032-09-07","2032-09-08","2032-09-09","2032-09-10","2032-09-11","2032-09-12","2032-09-13","2032-09-14","2032-09-15","2032-09-16","2032-09-17","2032-09-18","2032-09-19","2032-09-20","2032-09-21","2032-09-22","2032-09-23","2032-09-24","2032-09-25","2032-09-26","2032-09-27","2032-09-28","2032-09-29","2032-09-30"]
[null,null,null,"2032-09-01","Isabelle",3,2,1,"R",2,"R","R",2,2,2,3,"R","R",2,3,2,1,"R",2,"R","R",2,2,2,3,"R","R",2,3,2]
[null,null,null,"2032-09-02","Sylvine",2,"R",2,2,"R","R",2,3,"R",1,2,2,"R","R",2,"R",2,2,"R","R",2,3,"R",1,2,2,"R","R",2,"R"]
[null,null,null,"2032-09-03","Élodie","R",1,2,2,"R","R",1,1,3,1,1,"R","R","R",2,2,"R","R",2,2,2,"R",1,2,2,"R","R",1,1,3]
[null,null,null,"2032-09-04","Nathalie",2,2,"R","R",2,2,2,"R",1,2,2,"R","R",1,1,3,1,1,"R","R","R",2,2,"R","R",2,2,2,"R",1]
[null,null,null,"2032-09-05","Marylène",1,3,1,1,"R","R","R",2,2,"R","R",2,2,2,"R",1,2,2,"R","R",1,1,3,1,1,"R","R","R",2,2]
[null,null,null,"2032-09-06","Karl",1,1,"R",1,2,2,"R",1,1,1,1,"R","R","R",1,1,"R",1,2,2,"R",1,1,1,1,"R","R","R",1,1]
[null,null,null,"2032-09-07","Mickaël",1,"R",1,1,"R","R",1,1,"R","R",1,2,2,1,1,"R",1,1,"R","R",1,1,"R","R",1,2,2,1,1,"R"]
[null,null,null,"Oct-32","Octobre","2032-10-01","2032-10-02","2032-10-03","2032-10-04","2032-10-05","2032-10-06","2032-10-07","2032-10-08","2032-10-09","2032-10-10","2032-10-11","2032-10-12","2032-10-13","2032-10-14","2032-10-15","2032-10-16","2032-10-17","2032-10-18","2032-10-19","2032-10-20","2032-10-21","2032-10-22","2032-10-23","2032-10-24","2032-10-25","2032-10-26","2032-10-27","2032-10-28","2032-10-29","2032-10-30","2032-10-31"]
[null,null,null,"2032-10-01","Isabelle",1,"R",2,"R","R",2,2,2,3,"R","R",2,3,2,1,"R",2,"R","R",2,2,2,3,"R","R",2,3,2,1,"R",2]
[null,null,null,"2032-10-02","Sylvine",2,2,"R","R",2,3,"R",1,2,2,"R","R",2,"R",2,2,"R","R",2,3,"R",1,2,2,"R","R",2,"R",2,2,"R"]
[null,null,null,"2032-10-03","Élodie",1,1,"R","R","R",2,2,"R","R",2,2,2,"R",1,2,2,"R","R",1,1,3,1,1,"R","R","R",2,2,"R","R",2]
[null,null,null,"2032-10-04","Nathalie",2,2,"R","R",1,1,3,1,1,"R","R","R",2,2,"R","R",2,2,2,"R",1,2,2,"R","R",1,1,3,1,1,"R"]
[null,null,null,"2032-10-05","Marylène","R","R",2,2,2,"R",1,2,2,"R","R",1,1,3,1,1,"R","R","R",2,2,"R","R",2,2,2,"R",1,2,2,"R"]
[null,null,null,"2032-10-06","Karl","R",1,2,2,"R",1,1,1,1,"R","R","R",1,1,"R",1,2,2,"R",1,1,1,1,"R","R","R",1,1,"R",1,2]
[null,null,null,"2032-10-07","Mickaël",1,1,"R","R",1,1,"R","R",1,2,2,1,1,"R",1,1,"R","R",1,1,"R","R",1,2,2,1,1,"R",1,1,"R"]
[null,null,null,"Nov-32","Novembre","2032-11-01","2032-11-02","2032-11-03","2032-11-04","2032-11-05","2032-11-06","2032-11-07","2032-11-08","2032-11-09","2032-11-10","2032-11-11","2032-11-12","2032-11-13","2032-11-14","2032-11-15","2032-11-16","2032-11-17","2032-11-18","2032-11-19","2032-11-20","2032-11-21","2032-11-22","2032-11-23","2032-11-24","2032-11-25","2032-11-26","2032-11-27","2032-11-28","2032-11-29","2032-11-30"]
[null,null,null,"2032-11-01","Isabelle","R","R",2,2,2,3,"R","R",2,3,2,1,"R",2,"R","R",2,2,2,3,"R","R",2,3,2,1,"R",2,"R","R"]
[null,null,null,"2032-11-02","Sylvine","R",2,3,"R",1,2,2,"R","R",2,"R",2,2,"R","R",2,3,"R",1,2,2,"R","R",2,"R",2,2,"R","R",2]
[null,null,null,"2032-11-03","Élodie",2,2,"R",1,2,2,"R","R",1,1,3,1,1,"R","R","R",2,2,"R","R",2,2,2,"R",1,2,2,"R","R",1]
[null,null,null,"2032-11-04","Nathalie","R","R",2,2,"R","R",2,2,2,"R",1,2,2,"R","R",1,1,3,1,1,"R","R","R",2,2,"R","R",2,2,2]
[null,null,null,"2032-11-05","Marylène","R",1,1,3,1,1,"R","R","R",2,2,"R","R",2,2,2,"R",1,2,2,"R","R",1,1,3,1,1,"R","R","R"]
[null,null,null,"2032-11-06","Karl",2,"R",1,1,1,1,"R","R","R",1,1,"R",1,2,2,"R",1,1,1,1,"R","R","R",1,1,"R",1,2,2,"R"]
[null,null,null,"2032-11-07","Mickaël","R",1,1,"R","R",1,2,2,1,1,"R",1,1,"R","R",1,1,"R","R",1,2,2,1,1,"R",1,1,"R","R",1]
[null,null,null,"Dec-32","Décembre","2032-12-01","2032-12-02","2032-12-03","2032-12-04","2032-12-05","2032-12-06","2032-12-07","2032-12-08","2032-12-09","2032-12-10","2032-12-11","2032-12-12","2032-12-13","2032-12-14","2032-12-15","2032-12-16","2032-12-17","2032-12-18","2032-12-19","2032-12-20","2032-12-21","2032-12-22","2032-12-23","2032-12-24","2032-12-25","2032-12-26","2032-12-27","2032-12-28","2032-12-29","2032-12-30","2032-12-31"]
[null,null,null,"2032-12-01","Isabelle",2,2,2,3,"R","R",2,3,2,1,"R",2,"R","R",2,2,2,3,"R","R",2,3,2,1,"R",2,"R","R",2,2,2]
[null,null,null,"2032-12-02","Sylvine",3,"R",1,2,2,"R","R",2,"R",2,2,"R","R",2,3,"R",1,2,2,"R","R",2,"R",2,2,"R","R",2,3,"R",1]
[null,null,null,"2032-12-03","Élodie",1,3,1,1,"R","R","R",2,2,"R","R",2,2,2,"R",1,2,2,"R","R",1,1,3,1,1,"R","R","R",2,2,"R"]
[null,null,null,"2032-12-04","Nathalie","R",1,2,2,"R","R",1,1,3,1,1,"R","R","R",2,2,"R","R",2,2,2,"R",1,2,2,"R","R",1,1,3,1]
[null,null,null,"2032-12-05","Marylène",2,2,"R","R",2,2,2,"R",1,2,2,"R","R",1,1,3,1,1,"R","R","R",2,2,"R","R",2,2,2,"R",1,2]
[null,null,null,"2032-12-06","Karl",1,1,1,1,"R","R","R",1,1,"R",1,2,2,"R",1,1,1,1,"R","R","R",1,1,"R",1,2,2,"R",1,1,1]
[null,null,null,"2032-12-07","Mickaël",1,"R","R",1,2,2,1,1,"R",1,1,"R","R",1,1,"R","R",1,2,2,1,1,"R",1,1,"R","R",1,1,"R","R"]
[null,null,null,"Janv-33","Janvier","1933-01-01","1933-01-02","1933-01-03","1933-01-04","1933-01-05","1933-01-06","1933-01-07","1933-01-08","1933-01-09","1933-01-10","1933-01-11","1933-01-12","1933-01-13","1933-01-14","1933-01-15","1933-01-16","1933-01-17","1933-01-18","1933-01-19","1933-01-20","1933-01-21","1933-01-22","1933-01-23","1933-01-24","1933-01-25","1933-01-26","1933-01-27","1933-01-28","1933-01-29","1933-01-30","1933-01-31"]
[null,null,null,null,"Isabelle",3,"R","R",2,3,2,1,"R",2,"R","R",2,2,2,3,"R","R"]
[null,null,null,null,"Sylvine",2,2,"R","R",2,"R",2,2,"R","R",2,3,"R",1,2,2,"R"]
[null,null,null,null,"Élodie","R",2,2,2,"R",1,2,2,"R","R",1,1,3,1,1,"R","R"]
[null,null,null,null,"Nathalie",1,"R","R","R",2,2,"R","R",2,2,2,"R",1,2,2,"R","R"]
[null,null,null,null,"Marylène",2,"R","R",1,1,3,1,1,"R","R","R",2,2,"R","R",2,2]
[null,null,null,null,"Karl",1,"R","R","R",1,1,"R",1,2,2,"R",1,1,1,1,"R","R"]
[null,null,null,null,"Mickaël",1,2,2,1,1,"R",1,1,"R","R",1,1,"R","R",1,2,2]

{"sheet":"Feuil1","index":2,"n_rows":4046,"n_cols":52,"rows_kept":4046,"cut":false,"hidden":false,"merged":[]}
[]
["Date","Isabelle","Sylvine","Élodie","Nathalie","Marylène","Karl","Mickaël",null,"Isabelle",2,3,2,1,"R",2,"R","R",2,2,2,3,"R","R",2,3,2,1,"R",2,"R","R",2,2,2,3,"R","R",2,3,2,1,"R",2,"R","R",2,2,2,3,"R","R"]
["2021-12-06","A2","R",1,2,"R","R",1,null,"Sylvine","R",2,"R",2,2,"R","R",2,3,"R",1,2,2,"R","R",2,"R",2,2,"R","R",2,3,"R",1,2,2,"R","R",2,"R",2,2,"R","R",2,3,"R",1,2,2,"R"]
["2021-12-07",3,2,1,"R","A2",1,1,null,"ELODIE","R",2,2,"R","R",2,2,2,"R",1,2,2,"R","R",1,1,3,1,1,"R","R","R",2,2,"R","R",2,2,2,"R",1,2,2,"R","R",1,1,3,1,1,"R","R"]
["2021-12-08","A2","R","R",3,2,1,"R",null,"NATHALIE",1,1,3,1,1,"R","R","R",2,2,"R","R",2,2,2,"R",1,2,2,"R","R",1,1,3,1,1,"R","R","R",2,2,"R","R",2,2,2,"R",1,2,2,"R","R"]
["2021-12-09",1,2,1,"A2","R",1,"R",null,"MARYLENE",2,"R",1,2,2,"R","R",1,1,3,1,1,"R","R","R",2,2,"R","R",2,2,2,"R",1,2,2,"R","R",1,1,3,1,1,"R","R","R",2,2,"R","R",2,2]
["2021-12-10","R","A2",1,2,"R",1,1,null,"KARL","R",1,1,"R",1,2,2,"R",1,1,1,1,"R","R","R",1,1,"R",1,2,2,"R",1,1,1,1,"R","R","R",1,1,"R",1,2,2,"R",1,1,1,1,"R","R"]
["2021-12-11",2,"R","R","R","A2","R",2,null,"MICKAEL",1,1,"R",1,1,"R","R",1,1,"R","R",1,2,2,1,1,"R",1,1,"R","R",1,1,"R","R",1,2,2,1,1,"R",1,1,"R","R",1,1,"R","R",1,2,2]
["2021-12-12","R","R","R","R/S","A2","R",2]
["2021-12-13","R","A2","R",1,2,"R",1]
["2021-12-14",2,3,"C2","A2","R",1,1]
["2021-12-15",2,"R","C2",3,"A2",1,"R"]
["2021-12-16","A2",1,"R","C1",2,"R",1]
["2021-12-17",3,"A2","R","C1",2,1,1]
["2021-12-18","R",2,"A2","R","R",2,"R"]
["2021-12-19","R","R","A2","R","R/S",2,"R"]
["2021-12-20","A2","R","C2",1,"A2","R",1]
["2021-12-21",3,2,"R",1,"A2",1,1]
["2021-12-22",2,"R","C1",1,2,1,"R"]
["2021-12-23",1,"A2","R",2,"C1",1,"R"]
["2021-12-24","R",2,"A2","R","C1","C1",3]
["2021-12-25",2,"AR",2,"R","R","R",3]
["2021-12-26","R","AR/S",2,"R","R","R",2,null,null,null,"Commentaire : Bonjour, Le planning (feuille \"Accueil\") est actuellement alimenté via la base de données (feuille \"Données\"), ceci provisoirement. Sur la \"Feuil1\", j'ai mis en place la même base de données mais différemment afin que les recherches du formulaire soient plus évidentes. Actuellement, le formulaire de saisie est mise en place et accessible depuis le bouton de commande \"Saisie\", il aura pour but de modifier les postes sur le planning \"Accueil\". J'ai mis en place les deux listes du formulaire, prénoms et dates, que j'ai récupéré dans la base de donnée \"feuil1\", base de données qui viendra alimenter le planning \"Accueil\" ensuite. Je souhaiterai que la TextBox \"Poste\" me donne le poste en jonction des deux combobox, ce poste de jonction sera pris dans la base de données définitive qui est celle de la \"feuil1\". Merci"]
["2021-12-27","R",2,1,"A2","R","R",1,null,null,null,"Format du document : application/vnd.ms-excel.sheet.macroEnabled.12"]
["2021-12-28","A2",3,"R",2,"C2",1,1]
["2021-12-29",2,"R","A2","R","C2",1,"R"]
["2021-12-30",2,"C1","A2","R","R","R",1]
["2021-12-31",3,"C2",3,"A2","R",3,1]
["2022-01-01","R",2,"R","R",2,"R",2]
["2022-01-02","R","R","R","R",2,"R",2]
["2022-01-03",2,"R","R",1,2,"R",1]
["2022-01-04",3,2,2,1,"R",1,1]
["2022-01-05",2,"R",2,3,1,1,"R"]
["2022-01-06",1,2,"R",1,2,"R",1]
["2022-01-07","R",2,"R",1,2,1,1]
["2022-01-08",2,"R",2,"R","R",2,"R"]
["2022-01-09","R","R",2,"R","R",2,"R"]
["2022-01-10","R",2,2,"R",1,"R",1]
["2022-01-11",2,3,"R",2,1,1,1]
["2022-01-12",2,"R",1,2,3,1,"R"]
["2022-01-13",2,1,2,"R",1,1,"R"]
["2022-01-14",3,2,2,"R",1,1,1]
["2022-01-15","R",2,"R",2,"R","R",2]
["2022-01-16","R","R","R",2,"R","R",2]
["2022-01-17",2,"R",1,2,"R","R",1]
["2022-01-18",3,2,1,"R",2,1,1]
["2022-01-19",2,"R",3,1,2,1,"R"]
["2022-01-20",1,2,1,2,"R","R",1]
["2022-01-21","R",2,1,2,"R",1,1]
["2022-01-22",2,"R","R","R",2,2,"R"]
["2022-01-23","R","R","R","R",2,2,"R"]
["2022-01-24","R",2,"R",1,2,"R",1]
["2022-01-25",2,3,2,1,"R",1,1]
["2022-01-26",2,"R",2,3,1,1,"R"]
["2022-01-27",2,1,"R",1,2,1,"R"]
["2022-01-28",3,2,"R",1,2,1,1]
["2022-01-29","R",2,2,"R","R","R",2]
["2022-01-30","R","R",2,"R","R","R",2]
["2022-01-31",2,"R",2,"R",1,"R",1]
["2022-02-01",3,2,"R",2,1,1,1]
["2022-02-02",2,"R",1,2,3,1,"R"]
["2022-02-03",1,2,2,"R",1,"R",1]
["2022-02-04","R",2,2,"R",1,1,1]
["2022-02-05",2,"R","R",2,"R",2,"R"]
["2022-02-06","R","R","R",2,"R",2,"R"]
["2022-02-07","R",2,1,2,"R","R",1]
["2022-02-08",2,3,1,"R",2,1,1]
["2022-02-09",2,"R",3,1,2,1,"R"]
["2022-02-10",2,1,1,2,"R",1,"R"]
["2022-02-11",3,2,1,2,"R",1,1]
["2022-02-12","R",2,"R","R",2,"R",2]
["2022-02-13","R","R","R","R",2,"R",2]
["2022-02-14",2,"R","R",1,2,"R",1]
["2022-02-15",3,2,2,1,"R",1,1]
["2022-02-16",2,"R",2,3,1,1,"R"]
["2022-02-17",1,2,"R",1,2,"R",1]
["2022-02-18","R",2,"R",1,2,1,1]
["2022-02-19",2,"R",2,"R","R",2,"R"]
["2022-02-20","R","R",2,"R","R",2,"R"]
["2022-02-21","R",2,2,"R",1,"R",1]
["2022-02-22",2,3,"R",2,1,1,1]
["2022-02-23",2,"R",1,2,3,1,"R"]
["2022-02-24",2,1,2,"R",1,1,"R"]
["2022-02-25",3,2,2,"R",1,1,1]
["2022-02-26","R",2,"R",2,"R","R",2]
["2022-02-27","R","R","R",2,"R","R",2]
["2022-02-28",2,"R",1,2,"R","R",1]
["2022-03-01",3,2,1,"R",2,1,1]
["2022-03-02",2,"R",3,1,2,1,"R"]
["2022-03-03",1,2,1,2,"R","R",1]
["2022-03-04","R",2,1,2,"R",1,1]
["2022-03-05",2,"R","R","R",2,2,"R"]
["2022-03-06","R","R","R","R",2,2,"R"]
["2022-03-07","R",2,"R",1,2,"R",1]
["2022-03-08",2,3,2,1,"R",1,1]
["2022-03-09",2,"R",2,3,1,1,"R"]
["2022-03-10",2,1,"R",1,2,1,"R"]
["2022-03-11",3,2,"R",1,2,1,1]
["2022-03-12","R",2,2,"R","R","R",2]
["2022-03-13","R","R",2,"R","R","R",2]
["2022-03-14",2,"R",2,"R",1,"R",1]
["2022-03-15",3,2,"R",2,1,1,1]
["2022-03-16",2,"R",1,2,3,1,"R"]
["2022-03-17",1,2,2,"R",1,"R",1]
["2022-03-18","R",2,2,"R",1,1,1]
["2022-03-19",2,"R","R",2,"R",2,"R"]
["2022-03-20","R","R","R",2,"R",2,"R"]
["2022-03-21","R",2,1,2,"R","R",1]
["2022-03-22",2,3,1,"R",2,1,1]
["2022-03-23",2,"R",3,1,2,1,"R"]
["2022-03-24",2,1,1,2,"R",1,"R"]
["2022-03-25",3,2,1,2,"R",1,1]
["2022-03-26","R",2,"R","R",2,"R",2]
["2022-03-27","R","R","R","R",2,"R",2]
["2022-03-28",2,"R","R",1,2,"R",1]
["2022-03-29",3,2,2,1,"R",1,1]
["2022-03-30",2,"R",2,3,1,1,"R"]
["2022-03-31",1,2,"R",1,2,"R",1]
["2022-04-01","R",2,"R",1,2,1,1]
["2022-04-02",2,"R",2,"R","R",2,"R"]
["2022-04-03","R","R",2,"R","R",2,"R"]
["2022-04-04","R",2,2,"R",1,"R",1]
["2022-04-05",2,3,"R",2,1,1,1]
["2022-04-06",2,"R",1,2,3,1,"R"]
["2022-04-07",2,1,2,"R",1,1,"R"]
["2022-04-08",3,2,2,"R",1,1,1]
["2022-04-09","R",2,"R",2,"R","R",2]
["2022-04-10","R","R","R",2,"R","R",2]
["2022-04-11",2,"R",1,2,"R","R",1]
["2022-04-12",3,2,1,"R",2,1,1]
["2022-04-13",2,"R",3,1,2,1,"R"]
["2022-04-14",1,2,1,2,"R","R",1]
["2022-04-15","R",2,1,2,"R",1,1]
["2022-04-16",2,"R","R","R",2,2,"R"]
["2022-04-17","R","R","R","R",2,2,"R"]
["2022-04-18","R",2,"R",1,2,"R",1]
["2022-04-19",2,3,2,1,"R",1,1]
["2022-04-20",2,"R",2,3,1,1,"R"]
["2022-04-21",2,1,"R",1,2,1,"R"]
["2022-04-22",3,2,"R",1,2,1,1]
["2022-04-23","R",2,2,"R","R","R",2]
["2022-04-24","R","R",2,"R","R","R",2]
["2022-04-25",2,"R",2,"R",1,"R",1]
["2022-04-26",3,2,"R",2,1,1,1]
["2022-04-27",2,"R",1,2,3,1,"R"]
["2022-04-28",1,2,2,"R",1,"R",1]
["2022-04-29","R",2,2,"R",1,1,1]
["2022-04-30",2,"R","R",2,"R",2,"R"]
["2022-05-01","R","R","R",2,"R",2,"R"]
["2022-05-02","R",2,1,2,"R","R",1]
["2022-05-03",2,3,1,"R",2,1,1]
["2022-05-04",2,"R",3,1,2,1,"R"]
["2022-05-05",2,1,1,2,"R",1,"R"]
["2022-05-06",3,2,1,2,"R",1,1]
["2022-05-07","R",2,"R","R",2,"R",2]
["2022-05-08","R","R","R","R",2,"R",2]
["2022-05-09",2,"R","R",1,2,"R",1]
["2022-05-10",3,2,2,1,"R",1,1]
["2022-05-11",2,"R",2,3,1,1,"R"]
["2022-05-12",1,2,"R",1,2,"R",1]
["2022-05-13","R",2,"R",1,2,1,1]
["2022-05-14",2,"R",2,"R","R",2,"R"]
["2022-05-15","R","R",2,"R","R",2,"R"]
["2022-05-16","R",2,2,"R",1,"R",1]
["2022-05-17",2,3,"R",2,1,1,1]
["2022-05-18",2,"R",1,2,3,1,"R"]
["2022-05-19",2,1,2,"R",1,1,"R"]
["2022-05-20",3,2,2,"R",1,1,1]
["2022-05-21","R",2,"R",2,"R","R",2]
["2022-05-22","R","R","R",2,"R","R",2]
["2022-05-23",2,"R",1,2,"R","R",1]
["2022-05-24",3,2,1,"R",2,1,1]
["2022-05-25",2,"R",3,1,2,1,"R"]
["2022-05-26",1,2,1,2,"R","R",1]
["2022-05-27","R",2,1,2,"R",1,1]
["2022-05-28",2,"R","R","R",2,2,"R"]
["2022-05-29","R","R","R","R",2,2,"R"]
["2022-05-30","R",2,"R",1,2,"R",1]
["2022-05-31",2,3,2,1,"R",1,1]
["2022-06-01",2,"R",2,3,1,1,"R"]
["2022-06-02",2,1,"R",1,2,1,"R"]
["2022-06-03",3,2,"R",1,2,1,1]
["2022-06-04","R",2,2,"R","R","R",2]
["2022-06-05","R","R",2,"R","R","R",2]
["2022-06-06",2,"R",2,"R",1,"R",1]
["2022-06-07",3,2,"R",2,1,1,1]
["2022-06-08",2,"R",1,2,3,1,"R"]
["2022-06-09",1,2,2,"R",1,"R",1]
["2022-06-10","R",2,2,"R",1,1,1]
["2022-06-11",2,"R","R",2,"R",2,"R"]
["2022-06-12","R","R","R",2,"R",2,"R"]
["2022-06-13","R",2,1,2,"R","R",1]
["2022-06-14",2,3,1,"R",2,1,1]
["2022-06-15",2,"R",3,1,2,1,"R"]
["2022-06-16",2,1,1,2,"R",1,"R"]
["2022-06-17",3,2,1,2,"R",1,1]
["2022-06-18","R",2,"R","R",2,"R",2]
["2022-06-19","R","R","R","R",2,"R",2]
["2022-06-20",2,"R","R",1,2,"R",1]
["2022-06-21",3,2,2,1,"R",1,1]
["2022-06-22",2,"R",2,3,1,1,"R"]
["2022-06-23",1,2,"R",1,2,"R",1]
["2022-06-24","R",2,"R",1,2,1,1]
["2022-06-25",2,"R",2,"R","R",2,"R"]
["2022-06-26","R","R",2,"R","R",2,"R"]
["2022-06-27","R",2,2,"R",1,"R",1]
["2022-06-28",2,3,"R",2,1,1,1]
["2022-06-29",2,"R",1,2,3,1,"R"]
["2022-06-30",2,1,2,"R",1,1,"R"]
["2022-07-01",3,2,2,"R",1,1,1]
["2022-07-02","R",2,"R",2,"R","R",2]
["2022-07-03","R","R","R",2,"R","R",2]
["2022-07-04",2,"R",1,2,"R","R",1]
["2022-07-05",3,2,1,"R",2,1,1]
["2022-07-06",2,"R",3,1,2,1,"R"]
["2022-07-07",1,2,1,2,"R","R",1]
["2022-07-08","R",2,1,2,"R",1,1]
["2022-07-09",2,"R","R","R",2,2,"R"]
["2022-07-10","R","R","R","R",2,2,"R"]
["2022-07-11","R",2,"R",1,2,"R",1]
["2022-07-12",2,3,2,1,"R",1,1]
["2022-07-13",2,"R",2,3,1,1,"R"]
["2022-07-14",2,1,"R",1,2,1,"R"]
["2022-07-15",3,2,"R",1,2,1,1]
["2022-07-16","R",2,2,"R","R","R",2]
["2022-07-17","R","R",2,"R","R","R",2]
["2022-07-18",2,"R",2,"R",1,"R",1]
["2022-07-19",3,2,"R",2,1,1,1]
["2022-07-20",2,"R",1,2,3,1,"R"]
["2022-07-21",1,2,2,"R",1,"R",1]
["2022-07-22","R",2,2,"R",1,1,1]
["2022-07-23",2,"R","R",2,"R",2,"R"]
["2022-07-24","R","R","R",2,"R",2,"R"]
["2022-07-25","R",2,1,2,"R","R",1]
["2022-07-26",2,3,1,"R",2,1,1]
["2022-07-27",2,"R",3,1,2,1,"R"]
["2022-07-28",2,1,1,2,"R",1,"R"]
["2022-07-29",3,2,1,2,"R",1,1]
["2022-07-30","R",2,"R","R",2,"R",2]
["2022-07-31","R","R","R","R",2,"R",2]
["2022-08-01",2,"R","R",1,2,"R",1]
["2022-08-02",3,2,2,1,"R",1,1]
["2022-08-03",2,"R",2,3,1,1,"R"]
["2022-08-04",1,2,"R",1,2,"R",1]
["2022-08-05","R",2,"R",1,2,1,1]
["2022-08-06",2,"R",2,"R","R",2,"R"]
["2022-08-07","R","R",2,"R","R",2,"R"]
["2022-08-08","R",2,2,"R",1,"R",1]
["2022-08-09",2,3,"R",2,1,1,1]
["2022-08-10",2,"R",1,2,3,1,"R"]
["2022-08-11",2,1,2,"R",1,1,"R"]
["2022-08-12",3,2,2,"R",1,1,1]
["2022-08-13","R",2,"R",2,"R","R",2]
["2022-08-14","R","R","R",2,"R","R",2]
["2022-08-15",2,"R",1,2,"R","R",1]
["2022-08-16",3,2,1,"R",2,1,1]
["2022-08-17",2,"R",3,1,2,1,"R"]
["2022-08-18",1,2,1,2,"R","R",1]
["2022-08-19","R",2,1,2,"R",1,1]
["2022-08-20",2,"R","R","R",2,2,"R"]
["2022-08-21","R","R","R","R",2,2,"R"]
["2022-08-22","R",2,"R",1,2,"R",1]
["2022-08-23",2,3,2,1,"R",1,1]
["2022-08-24",2,"R",2,3,1,1,"R"]
["2022-08-25",2,1,"R",1,2,1,"R"]
["2022-08-26",3,2,"R",1,2,1,1]
["2022-08-27","R",2,2,"R","R","R",2]
["2022-08-28","R","R",2,"R","R","R",2]
["2022-08-29",2,"R",2,"R",1,"R",1]
["2022-08-30",3,2,"R",2,1,1,1]
["2022-08-31",2,"R",1,2,3,1,"R"]
["2022-09-01",1,1,2,"R",1,"R",1]
["2022-09-02","R","R",2,"R",1,1,1]
["2022-09-03",2,2,"R",2,"R",2,"R"]
["2022-09-04","R","R","R",2,"R",2,"R"]
["2022-09-05","R","R",1,2,"R","R",1]
["2022-09-06",2,2,1,"R",2,1,1]
["2022-09-07",2,2,3,1,2,1,"R"]
["2022-09-08",2,2,1,2,"R",1,"R"]
["2022-09-09",3,3,1,2,"R",1,1]
["2022-09-10","R","R","R","R",2,"R",2]
["2022-09-11","R","R","R","R",2,"R",2]
["2022-09-12",2,"R","R",1,2,"R",1]
["2022-09-13",3,2,2,1,"R",1,1]
["2022-09-14",2,"R",2,3,1,1,"R"]
["2022-09-15",1,2,"R",1,2,"R",1]
["2022-09-16","R",2,"R",1,2,1,1]
["2022-09-17",2,"R",2,"R","R",2,"R"]
["2022-09-18","R","R",2,"R","R",2,"R"]
["2022-09-19","R",2,2,"R",1,"R",1]
["2022-09-20",2,3,"R",2,1,1,1]
["2022-09-21",2,"R",1,2,3,1,"R"]
["2022-09-22",2,1,2,"R",1,1,"R"]
["2022-09-23",3,2,2,"R",1,1,1]
["2022-09-24","R",2,"R",2,"R","R",2]
["2022-09-25","R","R","R",2,"R","R",2]
["2022-09-26",2,"R",1,2,"R","R",1]
["2022-09-27",3,2,1,"R",2,1,1]
["2022-09-28",2,"R",3,1,2,1,"R"]
["2022-09-29",1,2,1,2,"R","R",1]
["2022-09-30","R",2,1,2,"R",1,1]
["2022-10-01",2,"R","R","R",2,2,"R"]
["2022-10-02","R","R","R","R",2,2,"R"]
["2022-10-03","R",2,"R",1,2,"R",1]
["2022-10-04",2,3,2,1,"R",1,1]
["2022-10-05",2,"R",2,3,1,1,"R"]
["2022-10-06",2,1,"R",1,2,1,"R"]
["2022-10-07",3,2,"R",1,2,1,1]
["2022-10-08","R",2,2,"R","R","R",2]
["2022-10-09","R","R",2,"R","R","R",2]
["2022-10-10",2,"R",2,"R",1,"R",1]
["2022-10-11",3,2,"R",2,1,1,1]
["2022-10-12",2,"R",1,2,3,1,"R"]
["2022-10-13",1,2,2,"R",1,"R",1]
["2022-10-14","R",2,2,"R",1,1,1]
["2022-10-15",2,"R","R",2,"R",2,"R"]
["2022-10-16","R","R","R",2,"R",2,"R"]
["2022-10-17","R",2,1,2,"R","R",1]
["2022-10-18",2,3,1,"R",2,1,1]
["2022-10-19",2,"R",3,1,2,1,"R"]
["2022-10-20",2,1,1,2,"R",1,"R"]
["2022-10-21",3,2,1,2,"R",1,1]
["2022-10-22","R",2,"R","R",2,"R",2]
["2022-10-23","R","R","R","R",2,"R",2]
["2022-10-24",2,"R","R",1,2,"R",1]
["2022-10-25",3,2,2,1,"R",1,1]
["2022-10-26",2,"R",2,3,1,1,"R"]
["2022-10-27",1,2,"R",1,2,"R",1]
["2022-10-28","R",2,"R",1,2,1,1]
["2022-10-29",2,"R",2,"R","R",2,"R"]
["2022-10-30","R","R",2,"R","R",2,"R"]
["2022-10-31","R",2,2,"R",1,"R",1]
["2022-11-01",2,3,"R",2,1,1,1]
["2022-11-02",2,"R",1,2,3,1,"R"]
["2022-11-03",2,1,2,"R",1,1,"R"]
["2022-11-04",3,2,2,"R",1,1,1]
["2022-11-05","R",2,"R",2,"R","R",2]
["2022-11-06","R","R","R",2,"R","R",2]
["2022-11-07",2,"R",1,2,"R","R",1]
["2022-11-08",3,2,1,"R",2,1,1]
["2022-11-09",2,"R",3,1,2,1,"R"]
["2022-11-10",1,2,1,2,"R","R",1]
["2022-11-11","R",2,1,2,"R",1,1]
["2022-11-12",2,"R","R","R",2,2,"R"]
["2022-11-13","R","R","R","R",2,2,"R"]
["2022-11-14","R",2,"R",1,2,"R",1]
["2022-11-15",2,3,2,1,"R",1,1]
["2022-11-16",2,"R",2,3,1,1,"R"]
["2022-11-17",2,1,"R",1,2,1,"R"]
["2022-11-18",3,2,"R",1,2,1,1]
["2022-11-19","R",2,2,"R","R","R",2]
["2022-11-20","R","R",2,"R","R","R",2]
["2022-11-21",2,"R",2,"R",1,"R",1]
["2022-11-22",3,2,"R",2,1,1,1]
["2022-11-23",2,"R",1,2,3,1,"R"]
["2022-11-24",1,2,2,"R",1,"R",1]
["2022-11-25","R",2,2,"R",1,1,1]
["2022-11-26",2,"R","R",2,"R",2,"R"]
["2022-11-27","R","R","R",2,"R",2,"R"]
["2022-11-28","R",2,1,2,"R","R",1]
["2022-11-29",2,3,1,"R",2,1,1]
["2022-11-30",2,"R",3,1,2,1,"R"]
["2022-12-01",2,1,1,2,"R",1,"R"]
["2022-12-02",3,2,1,2,"R",1,1]
["2022-12-03","R",2,"R","R",2,"R",2]
["2022-12-04","R","R","R","R",2,"R",2]
["2022-12-05",2,"R","R",1,2,"R",1]
["2022-12-06",3,2,2,1,"R",1,1]
["2022-12-07",2,"R",2,3,1,1,"R"]
["2022-12-08",1,2,"R",1,2,"R",1]
["2022-12-09","R",2,"R",1,2,1,1]
["2022-12-10",2,"R",2,"R","R",2,"R"]
["2022-12-11","R","R",2,"R","R",2,"R"]
["2022-12-12","R",2,2,"R",1,"R",1]
["2022-12-13",2,3,"R",2,1,1,1]
["2022-12-14",2,"R",1,2,3,1,"R"]
["2022-12-15",2,1,2,"R",1,1,"R"]
["2022-12-16",3,2,2,"R",1,1,1]
["2022-12-17","R",2,"R",2,"R","R",2]
["2022-12-18","R","R","R",2,"R","R",2]
["2022-12-19",2,"R",1,2,"R","R",1]
["2022-12-20",3,2,1,"R",2,1,1]
["2022-12-21",2,"R",3,1,2,1,"R"]
["2022-12-22",1,2,1,2,"R","R",1]
["2022-12-23","R",2,1,2,"R",1,1]
["2022-12-24",2,"R","R","R",2,2,"R"]
["2022-12-25","R","R","R","R",2,2,"R"]
["2022-12-26","R",2,"R",1,2,"R",1]
["2022-12-27",2,3,2,1,"R",1,1]
["2022-12-28",2,"R",2,3,1,1,"R"]
["2022-12-29",2,1,"R",1,2,1,"R"]
["2022-12-30",3,2,"R",1,2,1,1]
["2022-12-31","R",2,2,"R","R","R",2]
["2023-01-01","R","R",2,"R","R","R",2]
["2023-01-02",2,"R",2,"R",1,"R",1]
["2023-01-03",3,2,"R",2,1,1,1]
["2023-01-04",2,"R",1,2,3,1,"R"]
["2023-01-05",1,2,2,"R",1,"R",1]
["2023-01-06","R",2,2,"R",1,1,1]
["2023-01-07",2,"R","R",2,"R",2,"R"]
["2023-01-08","R","R","R",2,"R",2,"R"]
["2023-01-09","R",2,1,2,"R","R",1]
["2023-01-10",2,3,1,"R",2,1,1]
["2023-01-11",2,"R",3,1,2,1,"R"]
["2023-01-12",2,1,1,2,"R",1,"R"]
["2023-01-13",3,2,1,2,"R",1,1]
["2023-01-14","R",2,"R","R",2,"R",2]
["2023-01-15","R","R","R","R",2,"R",2]
["2023-01-16",2,"R","R",1,2,"R",1]
["2023-01-17",3,2,2,1,"R",1,1]
["2023-01-18",2,"R",2,3,1,1,"R"]
["2023-01-19",1,2,"R",1,2,"R",1]
["2023-01-20","R",2,"R",1,2,1,1]
["2023-01-21",2,"R",2,"R","R",2,"R"]
["2023-01-22","R","R",2,"R","R",2,"R"]
["2023-01-23","R",2,2,"R",1,"R",1]
["2023-01-24",2,3,"R",2,1,1,1]
["2023-01-25",2,"R",1,2,3,1,"R"]
["2023-01-26",2,1,2,"R",1,1,"R"]
["2023-01-27",3,2,2,"R",1,1,1]
["2023-01-28","R",2,"R",2,"R","R",2]
["2023-01-29","R","R","R",2,"R","R",2]
["2023-01-30",2,"R",1,2,"R","R",1]
["2023-01-31",3,2,1,"R",2,1,1]
["2023-02-01",2,"R",3,1,2,1,"R"]
["2023-02-02",1,2,1,2,"R","R",1]
["2023-02-03","R",2,1,2,"R",1,1]
["2023-02-04",2,"R","R","R",2,2,"R"]
["2023-02-05","R","R","R","R",2,2,"R"]
["2023-02-06","R",2,"R",1,2,"R",1]
["2023-02-07",2,3,2,1,"R",1,1]
["2023-02-08",2,"R",2,3,1,1,"R"]
["2023-02-09",2,1,"R",1,2,1,"R"]
["2023-02-10",3,2,"R",1,2,1,1]
["2023-02-11","R",2,2,"R","R","R",2]
["2023-02-12","R","R",2,"R","R","R",2]
["2023-02-13",2,"R",2,"R",1,"R",1]
["2023-02-14",3,2,"R",2,1,1,1]
["2023-02-15",2,"R",1,2,3,1,"R"]
["2023-02-16",1,2,2,"R",1,"R",1]
["2023-02-17","R",2,2,"R",1,1,1]
["2023-02-18",2,"R","R",2,"R",2,"R"]
["2023-02-19","R","R","R",2,"R",2,"R"]
["2023-02-20","R",2,1,2,"R","R",1]
["2023-02-21",2,3,1,"R",2,1,1]
["2023-02-22",2,"R",3,1,2,1,"R"]
["2023-02-23",2,1,1,2,"R",1,"R"]
["2023-02-24",3,2,1,2,"R",1,1]
["2023-02-25","R",2,"R","R",2,"R",2]
["2023-02-26","R","R","R","R",2,"R",2]
["2023-02-27",2,"R","R",1,2,"R",1]
["2023-02-28",3,2,2,1,"R",1,1]
["2023-03-01",2,"R",2,3,1,1,"R"]
["2023-03-02",1,2,"R",1,2,"R",1]
["2023-03-03","R",2,"R",1,2,1,1]
["2023-03-04",2,"R",2,"R","R",2,"R"]
["2023-03-05","R","R",2,"R","R",2,"R"]
["2023-03-06","R",2,2,"R",1,"R",1]
["2023-03-07",2,3,"R",2,1,1,1]
["2023-03-08",2,"R",1,2,3,1,"R"]
["2023-03-09",2,1,2,"R",1,1,"R"]
["2023-03-10",3,2,2,"R",1,1,1]
["2023-03-11","R",2,"R",2,"R","R",2]
["2023-03-12","R","R","R",2,"R","R",2]
["2023-03-13",2,"R",1,2,"R","R",1]
["2023-03-14",3,2,1,"R",2,1,1]
["2023-03-15",2,"R",3,1,2,1,"R"]
["2023-03-16",1,2,1,2,"R","R",1]
["2023-03-17","R",2,1,2,"R",1,1]
["2023-03-18",2,"R","R","R",2,2,"R"]
["2023-03-19","R","R","R","R",2,2,"R"]
["2023-03-20","R",2,"R",1,2,"R",1]
["2023-03-21",2,3,2,1,"R",1,1]
["2023-03-22",2,"R",2,3,1,1,"R"]
["2023-03-23",2,1,"R",1,2,1,"R"]
["2023-03-24",3,2,"R",1,2,1,1]
["2023-03-25","R",2,2,"R","R","R",2]
["2023-03-26","R","R",2,"R","R","R",2]
["2023-03-27",2,"R",2,"R",1,"R",1]
["2023-03-28",3,2,"R",2,1,1,1]
["2023-03-29",2,"R",1,2,3,1,"R"]
["2023-03-30",1,2,2,"R",1,"R",1]
["2023-03-31","R",2,2,"R",1,1,1]
["2023-04-01",2,"R","R",2,"R",2,"R"]
["2023-04-02","R","R","R",2,"R",2,"R"]
["2023-04-03","R",2,1,2,"R","R",1]
["2023-04-04",2,3,1,"R",2,1,1]
["2023-04-05",2,"R",3,1,2,1,"R"]
["2023-04-06",2,1,1,2,"R",1,"R"]
["2023-04-07",3,2,1,2,"R",1,1]
["2023-04-08","R",2,"R","R",2,"R",2]
["2023-04-09","R","R","R","R",2,"R",2]
["2023-04-10",2,"R","R",1,2,"R",1]
["2023-04-11",3,2,2,1,"R",1,1]
["2023-04-12",2,"R",2,3,1,1,"R"]
["2023-04-13",1,2,"R",1,2,"R",1]
["2023-04-14","R",2,"R",1,2,1,1]
["2023-04-15",2,"R",2,"R","R",2,"R"]
["2023-04-16","R","R",2,"R","R",2,"R"]
["2023-04-17","R",2,2,"R",1,"R",1]
["2023-04-18",2,3,"R",2,1,1,1]
["2023-04-19",2,"R",1,2,3,1,"R"]
["2023-04-20",2,1,2,"R",1,1,"R"]
["2023-04-21",3,2,2,"R",1,1,1]
["2023-04-22","R",2,"R",2,"R","R",2]
["2023-04-23","R","R","R",2,"R","R",2]
["2023-04-24",2,"R",1,2,"R","R",1]
["2023-04-25",3,2,1,"R",2,1,1]
["2023-04-26",2,"R",3,1,2,1,"R"]
["2023-04-27",1,2,1,2,"R","R",1]
["2023-04-28","R",2,1,2,"R",1,1]
["2023-04-29",2,"R","R","R",2,2,"R"]
["2023-04-30","R","R","R","R",2,2,"R"]
["2023-05-01","R",2,"R",1,2,"R",1]
["2023-05-02",2,3,2,1,"R",1,1]
["2023-05-03",2,"R",2,3,1,1,"R"]
["2023-05-04",2,1,"R",1,2,1,"R"]
["2023-05-05",3,2,"R",1,2,1,1]
["2023-05-06","R",2,2,"R","R","R",2]
["2023-05-07","R","R",2,"R","R","R",2]
["2023-05-08",2,"R",2,"R",1,"R",1]
["2023-05-09",3,2,"R",2,1,1,1]
["2023-05-10",2,"R",1,2,3,1,"R"]
["2023-05-11",1,2,2,"R",1,"R",1]
["2023-05-12","R",2,2,"R",1,1,1]
["2023-05-13",2,"R","R",2,"R",2,"R"]
["2023-05-14","R","R","R",2,"R",2,"R"]
["2023-05-15","R",2,1,2,"R","R",1]
["2023-05-16",2,3,1,"R",2,1,1]
["2023-05-17",2,"R",3,1,2,1,"R"]
["2023-05-18",2,1,1,2,"R",1,"R"]
["2023-05-19",3,2,1,2,"R",1,1]
["2023-05-20","R",2,"R","R",2,"R",2]
["2023-05-21","R","R","R","R",2,"R",2]
["2023-05-22",2,"R","R",1,2,"R",1]
["2023-05-23",3,2,2,1,"R",1,1]
["2023-05-24",2,"R",2,3,1,1,"R"]
["2023-05-25",1,2,"R",1,2,"R",1]
["2023-05-26","R",2,"R",1,2,1,1]
["2023-05-27",2,"R",2,"R","R",2,"R"]
["2023-05-28","R","R",2,"R","R",2,"R"]
["2023-05-29","R",2,2,"R",1,"R",1]
["2023-05-30",2,3,"R",2,1,1,1]
["2023-05-31",2,"R",1,2,3,1,"R"]
["2023-06-01",2,1,2,"R",1,1,"R"]
["2023-06-02",3,2,2,"R",1,1,1]
["2023-06-03","R",2,"R",2,"R","R",2]
["2023-06-04","R","R","R",2,"R","R",2]
["2023-06-05",2,"R",1,2,"R","R",1]
["2023-06-06",3,2,1,"R",2,1,1]
["2023-06-07",2,"R",3,1,2,1,"R"]
["2023-06-08",1,2,1,2,"R","R",1]
["2023-06-09","R",2,1,2,"R",1,1]
["2023-06-10",2,"R","R","R",2,2,"R"]
["2023-06-11","R","R","R","R",2,2,"R"]
["2023-06-12","R",2,"R",1,2,"R",1]
["2023-06-13",2,3,2,1,"R",1,1]
["2023-06-14",2,"R",2,3,1,1,"R"]
["2023-06-15",2,1,"R",1,2,1,"R"]
["2023-06-16",3,2,"R",1,2,1,1]
["2023-06-17","R",2,2,"R","R","R",2]
["2023-06-18","R","R",2,"R","R","R",2]
["2023-06-19",2,"R",2,"R",1,"R",1]
["2023-06-20",3,2,"R",2,1,1,1]
["2023-06-21",2,"R",1,2,3,1,"R"]
["2023-06-22",1,2,2,"R",1,"R",1]
["2023-06-23","R",2,2,"R",1,1,1]
["2023-06-24",2,"R","R",2,"R",2,"R"]
["2023-06-25","R","R","R",2,"R",2,"R"]
["2023-06-26","R",2,1,2,"R","R",1]
["2023-06-27",2,3,1,"R",2,1,1]
["2023-06-28",2,"R",3,1,2,1,"R"]
["2023-06-29",2,1,1,2,"R",1,"R"]
["2023-06-30",3,2,1,2,"R",1,1]
["2023-07-01","R",2,"R","R",2,"R",2]
["2023-07-02","R","R","R","R",2,"R",2]
["2023-07-03",2,"R","R",1,2,"R",1]
["2023-07-04",3,2,2,1,"R",1,1]
["2023-07-05",2,"R",2,3,1,1,"R"]
["2023-07-06",1,2,"R",1,2,"R",1]
["2023-07-07","R",2,"R",1,2,1,1]
["2023-07-08",2,"R",2,"R","R",2,"R"]
["2023-07-09","R","R",2,"R","R",2,"R"]
["2023-07-10","R",2,2,"R",1,"R",1]
["2023-07-11",2,3,"R",2,1,1,1]
["2023-07-12",2,"R",1,2,3,1,"R"]
["2023-07-13",2,1,2,"R",1,1,"R"]
["2023-07-14",3,2,2,"R",1,1,1]
["2023-07-15","R",2,"R",2,"R","R",2]
["2023-07-16","R","R","R",2,"R","R",2]
["2023-07-17",2,"R",1,2,"R","R",1]
["2023-07-18",3,2,1,"R",2,1,1]
["2023-07-19",2,"R",3,1,2,1,"R"]
["2023-07-20",1,2,1,2,"R","R",1]
["2023-07-21","R",2,1,2,"R",1,1]
["2023-07-22",2,"R","R","R",2,2,"R"]
["2023-07-23","R","R","R","R",2,2,"R"]
["2023-07-24","R",2,"R",1,2,"R",1]
["2023-07-25",2,3,2,1,"R",1,1]
["2023-07-26",2,"R",2,3,1,1,"R"]
["2023-07-27",2,1,"R",1,2,1,"R"]
["2023-07-28",3,2,"R",1,2,1,1]
["2023-07-29","R",2,2,"R","R","R",2]
["2023-07-30","R","R",2,"R","R","R",2]
["2023-07-31",2,"R",2,"R",1,"R",1]
["2023-08-01",3,2,"R",2,1,1,1]
["2023-08-02",2,"R",1,2,3,1,"R"]
["2023-08-03",1,2,2,"R",1,"R",1]
["2023-08-04","R",2,2,"R",1,1,1]
["2023-08-05",2,"R","R",2,"R",2,"R"]
["2023-08-06","R","R","R",2,"R",2,"R"]
["2023-08-07","R",2,1,2,"R","R",1]
["2023-08-08",2,3,1,"R",2,1,1]
["2023-08-09",2,"R",3,1,2,1,"R"]
["2023-08-10",2,1,1,2,"R",1,"R"]
["2023-08-11",3,2,1,2,"R",1,1]
["2023-08-12","R",2,"R","R",2,"R",2]
["2023-08-13","R","R","R","R",2,"R",2]
["2023-08-14",2,"R","R",1,2,"R",1]
["2023-08-15",3,2,2,1,"R",1,1]
["2023-08-16",2,"R",2,3,1,1,"R"]
["2023-08-17",1,2,"R",1,2,"R",1]
["2023-08-18","R",2,"R",1,2,1,1]
["2023-08-19",2,"R",2,"R","R",2,"R"]
["2023-08-20","R","R",2,"R","R",2,"R"]
["2023-08-21","R",2,2,"R",1,"R",1]
["2023-08-22",2,3,"R",2,1,1,1]
["2023-08-23",2,"R",1,2,3,1,"R"]
["2023-08-24",2,1,2,"R",1,1,"R"]
["2023-08-25",3,2,2,"R",1,1,1]
["2023-08-26","R",2,"R",2,"R","R",2]
["2023-08-27","R","R","R",2,"R","R",2]
["2023-08-28",2,"R",1,2,"R","R",1]
["2023-08-29",3,2,1,"R",2,1,1]
["2023-08-30",2,"R",3,1,2,1,"R"]
["2023-08-31",1,2,1,2,"R","R",1]
["2023-09-01","R",2,1,2,"R",1,1]
["2023-09-02",2,"R","R","R",2,2,"R"]
["2023-09-03","R","R","R","R",2,2,"R"]
["2023-09-04","R",2,"R",1,2,"R",1]
["2023-09-05",2,3,2,1,"R",1,1]
["2023-09-06",2,"R",2,3,1,1,"R"]
["2023-09-07",2,1,"R",1,2,1,"R"]
["2023-09-08",3,2,"R",1,2,1,1]
["2023-09-09","R",2,2,"R","R","R",2]
["2023-09-10","R","R",2,"R","R","R",2]
["2023-09-11",2,"R",2,"R",1,"R",1]
["2023-09-12",3,2,"R",2,1,1,1]
["2023-09-13",2,"R",1,2,3,1,"R"]
["2023-09-14",1,2,2,"R",1,"R",1]
["2023-09-15","R",2,2,"R",1,1,1]
["2023-09-16",2,"R","R",2,"R",2,"R"]
["2023-09-17","R","R","R",2,"R",2,"R"]
["2023-09-18","R",2,1,2,"R","R",1]
["2023-09-19",2,3,1,"R",2,1,1]
["2023-09-20",2,"R",3,1,2,1,"R"]
["2023-09-21",2,1,1,2,"R",1,"R"]
["2023-09-22",3,2,1,2,"R",1,1]
["2023-09-23","R",2,"R","R",2,"R",2]
["2023-09-24","R","R","R","R",2,"R",2]
["2023-09-25",2,"R","R",1,2,"R",1]
["2023-09-26",3,2,2,1,"R",1,1]
["2023-09-27",2,"R",2,3,1,1,"R"]
["2023-09-28",1,2,"R",1,2,"R",1]
["2023-09-29","R",2,"R",1,2,1,1]
["2023-09-30",2,"R",2,"R","R",2,"R"]
["2023-10-01","R","R",2,"R","R",2,"R"]
["2023-10-02","R",2,2,"R",1,"R",1]
["2023-10-03",2,3,"R",2,1,1,1]
["2023-10-04",2,"R",1,2,3,1,"R"]
["2023-10-05",2,1,2,"R",1,1,"R"]
["2023-10-06",3,2,2,"R",1,1,1]
["2023-10-07","R",2,"R",2,"R","R",2]
["2023-10-08","R","R","R",2,"R","R",2]
["2023-10-09",2,"R",1,2,"R","R",1]
["2023-10-10",3,2,1,"R",2,1,1]
["2023-10-11",2,"R",3,1,2,1,"R"]
["2023-10-12",1,2,1,2,"R","R",1]
["2023-10-13","R",2,1,2,"R",1,1]
["2023-10-14",2,"R","R","R",2,2,"R"]
["2023-10-15","R","R","R","R",2,2,"R"]
["2023-10-16","R",2,"R",1,2,"R",1]
["2023-10-17",2,3,2,1,"R",1,1]
["2023-10-18",2,"R",2,3,1,1,"R"]
["2023-10-19",2,1,"R",1,2,1,"R"]
["2023-10-20",3,2,"R",1,2,1,1]
["2023-10-21","R",2,2,"R","R","R",2]
["2023-10-22","R","R",2,"R","R","R",2]
["2023-10-23",2,"R",2,"R",1,"R",1]
["2023-10-24",3,2,"R",2,1,1,1]
["2023-10-25",2,"R",1,2,3,1,"R"]
["2023-10-26",1,2,2,"R",1,"R",1]
["2023-10-27","R",2,2,"R",1,1,1]
["2023-10-28",2,"R","R",2,"R",2,"R"]
["2023-10-29","R","R","R",2,"R",2,"R"]
["2023-10-30","R",2,1,2,"R","R",1]
["2023-10-31",2,3,1,"R",2,1,1]
["2023-11-01",2,"R",3,1,2,1,"R"]
["2023-11-02",2,1,1,2,"R",1,"R"]
["2023-11-03",3,2,1,2,"R",1,1]
["2023-11-04","R",2,"R","R",2,"R",2]
["2023-11-05","R","R","R","R",2,"R",2]
["2023-11-06",2,"R","R",1,2,"R",1]
["2023-11-07",3,2,2,1,"R",1,1]
["2023-11-08",2,"R",2,3,1,1,"R"]
["2023-11-09",1,2,"R",1,2,"R",1]
["2023-11-10","R",2,"R",1,2,1,1]
["2023-11-11",2,"R",2,"R","R",2,"R"]
["2023-11-12","R","R",2,"R","R",2,"R"]
["2023-11-13","R",2,2,"R",1,"R",1]
["2023-11-14",2,3,"R",2,1,1,1]
["2023-11-15",2,"R",1,2,3,1,"R"]
["2023-11-16",2,1,2,"R",1,1,"R"]
["2023-11-17",3,2,2,"R",1,1,1]
["2023-11-18","R",2,"R",2,"R","R",2]
["2023-11-19","R","R","R",2,"R","R",2]
["2023-11-20",2,"R",1,2,"R","R",1]
["2023-11-21",3,2,1,"R",2,1,1]
["2023-11-22",2,"R",3,1,2,1,"R"]
["2023-11-23",1,2,1,2,"R","R",1]
["2023-11-24","R",2,1,2,"R",1,1]
["2023-11-25",2,"R","R","R",2,2,"R"]
["2023-11-26","R","R","R","R",2,2,"R"]
["2023-11-27","R",2,"R",1,2,"R",1]
["2023-11-28",2,3,2,1,"R",1,1]
["2023-11-29",2,"R",2,3,1,1,"R"]
["2023-11-30",2,1,"R",1,2,1,"R"]
["2023-12-01",3,2,"R",1,2,1,1]
["2023-12-02","R",2,2,"R","R","R",2]
["2023-12-03","R","R",2,"R","R","R",2]
["2023-12-04",2,"R",2,"R",1,"R",1]
["2023-12-05",3,2,"R",2,1,1,1]
["2023-12-06",2,"R",1,2,3,1,"R"]
["2023-12-07",1,2,2,"R",1,"R",1]
["2023-12-08","R",2,2,"R",1,1,1]
["2023-12-09",2,"R","R",2,"R",2,"R"]
["2023-12-10","R","R","R",2,"R",2,"R"]
["2023-12-11","R",2,1,2,"R","R",1]
["2023-12-12",2,3,1,"R",2,1,1]
["2023-12-13",2,"R",3,1,2,1,"R"]
["2023-12-14",2,1,1,2,"R",1,"R"]
["2023-12-15",3,2,1,2,"R",1,1]
["2023-12-16","R",2,"R","R",2,"R",2]
["2023-12-17","R","R","R","R",2,"R",2]
["2023-12-18",2,"R","R",1,2,"R",1]
["2023-12-19",3,2,2,1,"R",1,1]
["2023-12-20",2,"R",2,3,1,1,"R"]
["2023-12-21",1,2,"R",1,2,"R",1]
["2023-12-22","R",2,"R",1,2,1,1]
["2023-12-23",2,"R",2,"R","R",2,"R"]
["2023-12-24","R","R",2,"R","R",2,"R"]
["2023-12-25","R",2,2,"R",1,"R",1]
["2023-12-26",2,3,"R",2,1,1,1]
["2023-12-27",2,"R",1,2,3,1,"R"]
["2023-12-28",2,1,2,"R",1,1,"R"]
["2023-12-29",3,2,2,"R",1,1,1]
["2023-12-30","R",2,"R",2,"R","R",2]
["2023-12-31","R","R","R",2,"R","R",2]
["2024-01-01",2,"R",1,2,"R","R",1]
["2024-01-02",3,2,1,"R",2,1,1]
["2024-01-03",2,"R",3,1,2,1,"R"]
["2024-01-04",1,2,1,2,"R","R",1]
["2024-01-05","R",2,1,2,"R",1,1]
["2024-01-06",2,"R","R","R",2,2,"R"]
["2024-01-07","R","R","R","R",2,2,"R"]
["2024-01-08","R",2,"R",1,2,"R",1]
["2024-01-09",2,3,2,1,"R",1,1]
["2024-01-10",2,"R",2,3,1,1,"R"]
["2024-01-11",2,1,"R",1,2,1,"R"]
["2024-01-12",3,2,"R",1,2,1,1]
["2024-01-13","R",2,2,"R","R","R",2]
["2024-01-14","R","R",2,"R","R","R",2]
["2024-01-15",2,"R",2,"R",1,"R",1]
["2024-01-16",3,2,"R",2,1,1,1]
["2024-01-17",2,"R",1,2,3,1,"R"]
["2024-01-18",1,2,2,"R",1,"R",1]
["2024-01-19","R",2,2,"R",1,1,1]
["2024-01-20",2,"R","R",2,"R",2,"R"]
["2024-01-21","R","R","R",2,"R",2,"R"]
["2024-01-22","R",2,1,2,"R","R",1]
["2024-01-23",2,3,1,"R",2,1,1]
["2024-01-24",2,"R",3,1,2,1,"R"]
["2024-01-25",2,1,1,2,"R",1,"R"]
["2024-01-26",3,2,1,2,"R",1,1]
["2024-01-27","R",2,"R","R",2,"R",2]
["2024-01-28","R","R","R","R",2,"R",2]
["2024-01-29",2,"R","R",1,2,"R",1]
["2024-01-30",3,2,2,1,"R",1,1]
["2024-01-31",2,"R",2,3,1,1,"R"]
["2024-02-01",1,2,"R",1,2,"R",1]
["2024-02-02","R",2,"R",1,2,1,1]
["2024-02-03",2,"R",2,"R","R",2,"R"]
["2024-02-04","R","R",2,"R","R",2,"R"]
["2024-02-05","R",2,2,"R",1,"R",1]
["2024-02-06",2,3,"R",2,1,1,1]
["2024-02-07",2,"R",1,2,3,1,"R"]
["2024-02-08",2,1,2,"R",1,1,"R"]
["2024-02-09",3,2,2,"R",1,1,1]
["2024-02-10","R",2,"R",2,"R","R",2]
["2024-02-11","R","R","R",2,"R","R",2]
["2024-02-12",2,"R",1,2,"R","R",1]
["2024-02-13",3,2,1,"R",2,1,1]
["2024-02-14",2,"R",3,1,2,1,"R"]
["2024-02-15",1,2,1,2,"R","R",1]
["2024-02-16","R",2,1,2,"R",1,1]
["2024-02-17",2,"R","R","R",2,2,"R"]
["2024-02-18","R","R","R","R",2,2,"R"]
["2024-02-19","R",2,"R",1,2,"R",1]
["2024-02-20",2,3,2,1,"R",1,1]
["2024-02-21",2,"R",2,3,1,1,"R"]
["2024-02-22",2,1,"R",1,2,1,"R"]
["2024-02-23",3,2,"R",1,2,1,1]
["2024-02-24","R",2,2,"R","R","R",2]
["2024-02-25","R","R",2,"R","R","R",2]
["2024-02-26",2,"R",2,"R",1,"R",1]
["2024-02-27",3,2,"R",2,1,1,1]
["2024-02-28",2,"R",1,2,3,1,"R"]
["2024-02-29",1,2,2,"R",1,"R",1]
["2024-03-01","R",2,2,"R",1,1,1]
["2024-03-02",2,"R","R",2,"R",2,"R"]
["2024-03-03","R","R","R",2,"R",2,"R"]
["2024-03-04","R",2,1,2,"R","R",1]
["2024-03-05",2,3,1,"R",2,1,1]
["2024-03-06",2,"R",3,1,2,1,"R"]
["2024-03-07",2,1,1,2,"R",1,"R"]
["2024-03-08",3,2,1,2,"R",1,1]
["2024-03-09","R",2,"R","R",2,"R",2]
["2024-03-10","R","R","R","R",2,"R",2]
["2024-03-11",2,"R","R",1,2,"R",1]
["2024-03-12",3,2,2,1,"R",1,1]
["2024-03-13",2,"R",2,3,1,1,"R"]
["2024-03-14",1,2,"R",1,2,"R",1]
["2024-03-15","R",2,"R",1,2,1,1]
["2024-03-16",2,"R",2,"R","R",2,"R"]
["2024-03-17","R","R",2,"R","R",2,"R"]
["2024-03-18","R",2,2,"R",1,"R",1]
["2024-03-19",2,3,"R",2,1,1,1]
["2024-03-20",2,"R",1,2,3,1,"R"]
["2024-03-21",2,1,2,"R",1,1,"R"]
["2024-03-22",3,2,2,"R",1,1,1]
["2024-03-23","R",2,"R",2,"R","R",2]
["2024-03-24","R","R","R",2,"R","R",2]
["2024-03-25",2,"R",1,2,"R","R",1]
["2024-03-26",3,2,1,"R",2,1,1]
["2024-03-27",2,"R",3,1,2,1,"R"]
["2024-03-28",1,2,1,2,"R","R",1]
["2024-03-29","R",2,1,2,"R",1,1]
["2024-03-30",2,"R","R","R",2,2,"R"]
["2024-03-31","R","R","R","R",2,2,"R"]
["2024-04-01","R",2,"R",1,2,"R",1]
["2024-04-02",2,3,2,1,"R",1,1]
["2024-04-03",2,"R",2,3,1,1,"R"]
["2024-04-04",2,1,"R",1,2,1,"R"]
["2024-04-05",3,2,"R",1,2,1,1]
["2024-04-06","R",2,2,"R","R","R",2]
["2024-04-07","R","R",2,"R","R","R",2]
["2024-04-08",2,"R",2,"R",1,"R",1]
["2024-04-09",3,2,"R",2,1,1,1]
["2024-04-10",2,"R",1,2,3,1,"R"]
["2024-04-11",1,2,2,"R",1,"R",1]
["2024-04-12","R",2,2,"R",1,1,1]
["2024-04-13",2,"R","R",2,"R",2,"R"]
["2024-04-14","R","R","R",2,"R",2,"R"]
["2024-04-15","R",2,1,2,"R","R",1]
["2024-04-16",2,3,1,"R",2,1,1]
["2024-04-17",2,"R",3,1,2,1,"R"]
["2024-04-18",2,1,1,2,"R",1,"R"]
["2024-04-19",3,2,1,2,"R",1,1]
["2024-04-20","R",2,"R","R",2,"R",2]
["2024-04-21","R","R","R","R",2,"R",2]
["2024-04-22",2,"R","R",1,2,"R",1]
["2024-04-23",3,2,2,1,"R",1,1]
["2024-04-24",2,"R",2,3,1,1,"R"]
["2024-04-25",1,2,"R",1,2,"R",1]
["2024-04-26","R",2,"R",1,2,1,1]
["2024-04-27",2,"R",2,"R","R",2,"R"]
["2024-04-28","R","R",2,"R","R",2,"R"]
["2024-04-29","R",2,2,"R",1,"R",1]
["2024-04-30",2,3,"R",2,1,1,1]
["2024-05-01",2,"R",1,2,3,1,"R"]
["2024-05-02",2,1,2,"R",1,1,"R"]
["2024-05-03",3,2,2,"R",1,1,1]
["2024-05-04","R",2,"R",2,"R","R",2]
["2024-05-05","R","R","R",2,"R","R",2]
["2024-05-06",2,"R",1,2,"R","R",1]
["2024-05-07",3,2,1,"R",2,1,1]
["2024-05-08",2,"R",3,1,2,1,"R"]
["2024-05-09",1,2,1,2,"R","R",1]
["2024-05-10","R",2,1,2,"R",1,1]
["2024-05-11",2,"R","R","R",2,2,"R"]
["2024-05-12","R","R","R","R",2,2,"R"]
["2024-05-13","R",2,"R",1,2,"R",1]
["2024-05-14",2,3,2,1,"R",1,1]
["2024-05-15",2,"R",2,3,1,1,"R"]
["2024-05-16",2,1,"R",1,2,1,"R"]
["2024-05-17",3,2,"R",1,2,1,1]
["2024-05-18","R",2,2,"R","R","R",2]
["2024-05-19","R","R",2,"R","R","R",2]
["2024-05-20",2,"R",2,"R",1,"R",1]
["2024-05-21",3,2,"R",2,1,1,1]
["2024-05-22",2,"R",1,2,3,1,"R"]
["2024-05-23",1,2,2,"R",1,"R",1]
["2024-05-24","R",2,2,"R",1,1,1]
["2024-05-25",2,"R","R",2,"R",2,"R"]
["2024-05-26","R","R","R",2,"R",2,"R"]
["2024-05-27","R",2,1,2,"R","R",1]
["2024-05-28",2,3,1,"R",2,1,1]
["2024-05-29",2,"R",3,1,2,1,"R"]
["2024-05-30",2,1,1,2,"R",1,"R"]
["2024-05-31",3,2,1,2,"R",1,1]
["2024-06-01","R",2,"R","R",2,"R",2]
["2024-06-02","R","R","R","R",2,"R",2]
["2024-06-03",2,"R","R",1,2,"R",1]
["2024-06-04",3,2,2,1,"R",1,1]
["2024-06-05",2,"R",2,3,1,1,"R"]
["2024-06-06",1,2,"R",1,2,"R",1]
["2024-06-07","R",2,"R",1,2,1,1]
["2024-06-08",2,"R",2,"R","R",2,"R"]
["2024-06-09","R","R",2,"R","R",2,"R"]
["2024-06-10","R",2,2,"R",1,"R",1]
["2024-06-11",2,3,"R",2,1,1,1]
["2024-06-12",2,"R",1,2,3,1,"R"]
["2024-06-13",2,1,2,"R",1,1,"R"]
["2024-06-14",3,2,2,"R",1,1,1]
["2024-06-15","R",2,"R",2,"R","R",2]
["2024-06-16","R","R","R",2,"R","R",2]
["2024-06-17",2,"R",1,2,"R","R",1]
["2024-06-18",3,2,1,"R",2,1,1]
["2024-06-19",2,"R",3,1,2,1,"R"]
["2024-06-20",1,2,1,2,"R","R",1]
["2024-06-21","R",2,1,2,"R",1,1]
["2024-06-22",2,"R","R","R",2,2,"R"]
["2024-06-23","R","R","R","R",2,2,"R"]
["2024-06-24","R",2,"R",1,2,"R",1]
["2024-06-25",2,3,2,1,"R",1,1]
["2024-06-26",2,"R",2,3,1,1,"R"]
["2024-06-27",2,1,"R",1,2,1,"R"]
["2024-06-28",3,2,"R",1,2,1,1]
["2024-06-29","R",2,2,"R","R","R",2]
["2024-06-30","R","R",2,"R","R","R",2]
["2024-07-01",2,"R",2,"R",1,"R",1]
["2024-07-02",3,2,"R",2,1,1,1]
["2024-07-03",2,"R",1,2,3,1,"R"]
["2024-07-04",1,2,2,"R",1,"R",1]
["2024-07-05","R",2,2,"R",1,1,1]
["2024-07-06",2,"R","R",2,"R",2,"R"]
["2024-07-07","R","R","R",2,"R",2,"R"]
["2024-07-08","R",2,1,2,"R","R",1]
["2024-07-09",2,3,1,"R",2,1,1]
["2024-07-10",2,"R",3,1,2,1,"R"]
["2024-07-11",2,1,1,2,"R",1,"R"]
["2024-07-12",3,2,1,2,"R",1,1]
["2024-07-13","R",2,"R","R",2,"R",2]
["2024-07-14","R","R","R","R",2,"R",2]
["2024-07-15",2,"R","R",1,2,"R",1]
["2024-07-16",3,2,2,1,"R",1,1]
["2024-07-17",2,"R",2,3,1,1,"R"]
["2024-07-18",1,2,"R",1,2,"R",1]
["2024-07-19","R",2,"R",1,2,1,1]
["2024-07-20",2,"R",2,"R","R",2,"R"]
["2024-07-21","R","R",2,"R","R",2,"R"]
["2024-07-22","R",2,2,"R",1,"R",1]
["2024-07-23",2,3,"R",2,1,1,1]
["2024-07-24",2,"R",1,2,3,1,"R"]
["2024-07-25",2,1,2,"R",1,1,"R"]
["2024-07-26",3,2,2,"R",1,1,1]
["2024-07-27","R",2,"R",2,"R","R",2]
["2024-07-28","R","R","R",2,"R","R",2]
["2024-07-29",2,"R",1,2,"R","R",1]
["2024-07-30",3,2,1,"R",2,1,1]
["2024-07-31",2,"R",3,1,2,1,"R"]
["2024-08-01",1,2,1,2,"R","R",1]
["2024-08-02","R",2,1,2,"R",1,1]
["2024-08-03",2,"R","R","R",2,2,"R"]
["2024-08-04","R","R","R","R",2,2,"R"]
["2024-08-05","R",2,"R",1,2,"R",1]
["2024-08-06",2,3,2,1,"R",1,1]
["2024-08-07",2,"R",2,3,1,1,"R"]
["2024-08-08",2,1,"R",1,2,1,"R"]
["2024-08-09",3,2,"R",1,2,1,1]
["2024-08-10","R",2,2,"R","R","R",2]
["2024-08-11","R","R",2,"R","R","R",2]
["2024-08-12",2,"R",2,"R",1,"R",1]
["2024-08-13",3,2,"R",2,1,1,1]
["2024-08-14",2,"R",1,2,3,1,"R"]
["2024-08-15",1,2,2,"R",1,"R",1]
["2024-08-16","R",2,2,"R",1,1,1]
["2024-08-17",2,"R","R",2,"R",2,"R"]
["2024-08-18","R","R","R",2,"R",2,"R"]
["2024-08-19","R",2,1,2,"R","R",1]
["2024-08-20",2,3,1,"R",2,1,1]
["2024-08-21",2,"R",3,1,2,1,"R"]
["2024-08-22",2,1,1,2,"R",1,"R"]
["2024-08-23",3,2,1,2,"R",1,1]
["2024-08-24","R",2,"R","R",2,"R",2]
["2024-08-25","R","R","R","R",2,"R",2]
["2024-08-26",2,"R","R",1,2,"R",1]
["2024-08-27",3,2,2,1,"R",1,1]
["2024-08-28",2,"R",2,3,1,1,"R"]
["2024-08-29",1,2,"R",1,2,"R",1]
["2024-08-30","R",2,"R",1,2,1,1]
["2024-08-31",2,"R",2,"R","R",2,"R"]
["2024-09-01","R","R",2,"R","R",2,"R"]
["2024-09-02","R",2,2,"R",1,"R",1]
["2024-09-03",2,3,"R",2,1,1,1]
["2024-09-04",2,"R",1,2,3,1,"R"]
["2024-09-05",2,1,2,"R",1,1,"R"]
["2024-09-06",3,2,2,"R",1,1,1]
["2024-09-07","R",2,"R",2,"R","R",2]
["2024-09-08","R","R","R",2,"R","R",2]
["2024-09-09",2,"R",1,2,"R","R",1]
["2024-09-10",3,2,1,"R",2,1,1]
["2024-09-11",2,"R",3,1,2,1,"R"]
["2024-09-12",1,2,1,2,"R","R",1]
["2024-09-13","R",2,1,2,"R",1,1]
["2024-09-14",2,"R","R","R",2,2,"R"]
["2024-09-15","R","R","R","R",2,2,"R"]
["2024-09-16","R",2,"R",1,2,"R",1]
["2024-09-17",2,3,2,1,"R",1,1]
["2024-09-18",2,"R",2,3,1,1,"R"]
["2024-09-19",2,1,"R",1,2,1,"R"]
["2024-09-20",3,2,"R",1,2,1,1]
["2024-09-21","R",2,2,"R","R","R",2]
["2024-09-22","R","R",2,"R","R","R",2]
["2024-09-23",2,"R",2,"R",1,"R",1]
["2024-09-24",3,2,"R",2,1,1,1]
["2024-09-25",2,"R",1,2,3,1,"R"]
["2024-09-26",1,2,2,"R",1,"R",1]
["2024-09-27","R",2,2,"R",1,1,1]
["2024-09-28",2,"R","R",2,"R",2,"R"]
["2024-09-29","R","R","R",2,"R",2,"R"]
["2024-09-30","R",2,1,2,"R","R",1]
["2024-10-01",2,3,1,"R",2,1,1]
["2024-10-02",2,"R",3,1,2,1,"R"]
["2024-10-03",2,1,1,2,"R",1,"R"]
["2024-10-04",3,2,1,2,"R",1,1]
["2024-10-05","R",2,"R","R",2,"R",2]
["2024-10-06","R","R","R","R",2,"R",2]
["2024-10-07",2,"R","R",1,2,"R",1]
["2024-10-08",3,2,2,1,"R",1,1]
["2024-10-09",2,"R",2,3,1,1,"R"]
["2024-10-10",1,2,"R",1,2,"R",1]
["2024-10-11","R",2,"R",1,2,1,1]
["2024-10-12",2,"R",2,"R","R",2,"R"]
["2024-10-13","R","R",2,"R","R",2,"R"]
["2024-10-14","R",2,2,"R",1,"R",1]
["2024-10-15",2,3,"R",2,1,1,1]
["2024-10-16",2,"R",1,2,3,1,"R"]
["2024-10-17",2,1,2,"R",1,1,"R"]
["2024-10-18",3,2,2,"R",1,1,1]
["2024-10-19","R",2,"R",2,"R","R",2]
["2024-10-20","R","R","R",2,"R","R",2]
["2024-10-21",2,"R",1,2,"R","R",1]
["2024-10-22",3,2,1,"R",2,1,1]
["2024-10-23",2,"R",3,1,2,1,"R"]
["2024-10-24",1,2,1,2,"R","R",1]
["2024-10-25","R",2,1,2,"R",1,1]
["2024-10-26",2,"R","R","R",2,2,"R"]
["2024-10-27","R","R","R","R",2,2,"R"]
["2024-10-28","R",2,"R",1,2,"R",1]
["2024-10-29",2,3,2,1,"R",1,1]
["2024-10-30",2,"R",2,3,1,1,"R"]
["2024-10-31",2,1,"R",1,2,1,"R"]
["2024-11-01",3,2,"R",1,2,1,1]
["2024-11-02","R",2,2,"R","R","R",2]
["2024-11-03","R","R",2,"R","R","R",2]
["2024-11-04",2,"R",2,"R",1,"R",1]
["2024-11-05",3,2,"R",2,1,1,1]
["2024-11-06",2,"R",1,2,3,1,"R"]
["2024-11-07",1,2,2,"R",1,"R",1]
["2024-11-08","R",2,2,"R",1,1,1]
["2024-11-09",2,"R","R",2,"R",2,"R"]
["2024-11-10","R","R","R",2,"R",2,"R"]
["2024-11-11","R",2,1,2,"R","R",1]
["2024-11-12",2,3,1,"R",2,1,1]
["2024-11-13",2,"R",3,1,2,1,"R"]
["2024-11-14",2,1,1,2,"R",1,"R"]
["2024-11-15",3,2,1,2,"R",1,1]
["2024-11-16","R",2,"R","R",2,"R",2]
["2024-11-17","R","R","R","R",2,"R",2]
["2024-11-18",2,"R","R",1,2,"R",1]
["2024-11-19",3,2,2,1,"R",1,1]
["2024-11-20",2,"R",2,3,1,1,"R"]
["2024-11-21",1,2,"R",1,2,"R",1]
["2024-11-22","R",2,"R",1,2,1,1]
["2024-11-23",2,"R",2,"R","R",2,"R"]
["2024-11-24","R","R",2,"R","R",2,"R"]
["2024-11-25","R",2,2,"R",1,"R",1]
["2024-11-26",2,3,"R",2,1,1,1]
["2024-11-27",2,"R",1,2,3,1,"R"]
["2024-11-28",2,1,2,"R",1,1,"R"]
["2024-11-29",3,2,2,"R",1,1,1]
["2024-11-30","R",2,"R",2,"R","R",2]
["2024-12-01","R","R","R",2,"R","R",2]
["2024-12-02",2,"R",1,2,"R","R",1]
["2024-12-03",3,2,1,"R",2,1,1]
["2024-12-04",2,"R",3,1,2,1,"R"]
["2024-12-05",1,2,1,2,"R","R",1]
["2024-12-06","R",2,1,2,"R",1,1]
["2024-12-07",2,"R","R","R",2,2,"R"]
["2024-12-08","R","R","R","R",2,2,"R"]
["2024-12-09","R",2,"R",1,2,"R",1]
["2024-12-10",2,3,2,1,"R",1,1]
["2024-12-11",2,"R",2,3,1,1,"R"]
["2024-12-12",2,1,"R",1,2,1,"R"]
["2024-12-13",3,2,"R",1,2,1,1]
["2024-12-14","R",2,2,"R","R","R",2]
["2024-12-15","R","R",2,"R","R","R",2]
["2024-12-16",2,"R",2,"R",1,"R",1]
["2024-12-17",3,2,"R",2,1,1,1]
["2024-12-18",2,"R",1,2,3,1,"R"]
["2024-12-19",1,2,2,"R",1,"R",1]
["2024-12-20","R",2,2,"R",1,1,1]
["2024-12-21",2,"R","R",2,"R",2,"R"]
["2024-12-22","R","R","R",2,"R",2,"R"]
["2024-12-23","R",2,1,2,"R","R",1]
["2024-12-24",2,3,1,"R",2,1,1]
["2024-12-25",2,"R",3,1,2,1,"R"]
["2024-12-26",2,1,1,2,"R",1,"R"]
["2024-12-27",3,2,1,2,"R",1,1]
["2024-12-28","R",2,"R","R",2,"R",2]
["2024-12-29","R","R","R","R",2,"R",2]
["2024-12-30",2,"R","R",1,2,"R",1]
["2024-12-31",3,2,2,1,"R",1,1]
["2025-01-01",2,"R",2,3,1,1,"R"]
["2025-01-02",1,2,"R",1,2,"R",1]
["2025-01-03","R",2,"R",1,2,1,1]
["2025-01-04",2,"R",2,"R","R",2,"R"]
["2025-01-05","R","R",2,"R","R",2,"R"]
["2025-01-06","R",2,2,"R",1,"R",1]
["2025-01-07",2,3,"R",2,1,1,1]
["2025-01-08",2,"R",1,2,3,1,"R"]
["2025-01-09",2,1,2,"R",1,1,"R"]
["2025-01-10",3,2,2,"R",1,1,1]
["2025-01-11","R",2,"R",2,"R","R",2]
["2025-01-12","R","R","R",2,"R","R",2]
["2025-01-13",2,"R",1,2,"R","R",1]
["2025-01-14",3,2,1,"R",2,1,1]
["2025-01-15",2,"R",3,1,2,1,"R"]
["2025-01-16",1,2,1,2,"R","R",1]
["2025-01-17","R",2,1,2,"R",1,1]
["2025-01-18",2,"R","R","R",2,2,"R"]
["2025-01-19","R","R","R","R",2,2,"R"]
["2025-01-20","R",2,"R",1,2,"R",1]
["2025-01-21",2,3,2,1,"R",1,1]
["2025-01-22",2,"R",2,3,1,1,"R"]
["2025-01-23",2,1,"R",1,2,1,"R"]
["2025-01-24",3,2,"R",1,2,1,1]
["2025-01-25","R",2,2,"R","R","R",2]
["2025-01-26","R","R",2,"R","R","R",2]
["2025-01-27",2,"R",2,"R",1,"R",1]
["2025-01-28",3,2,"R",2,1,1,1]
["2025-01-29",2,"R",1,2,3,1,"R"]
["2025-01-30",1,2,2,"R",1,"R",1]
["2025-01-31","R",2,2,"R",1,1,1]
["2025-02-01",2,"R","R",2,"R",2,"R"]
["2025-02-02","R","R","R",2,"R",2,"R"]
["2025-02-03","R",2,1,2,"R","R",1]
["2025-02-04",2,3,1,"R",2,1,1]
["2025-02-05",2,"R",3,1,2,1,"R"]
["2025-02-06",2,1,1,2,"R",1,"R"]
["2025-02-07",3,2,1,2,"R",1,1]
["2025-02-08","R",2,"R","R",2,"R",2]
["2025-02-09","R","R","R","R",2,"R",2]
["2025-02-10",2,"R","R",1,2,"R",1]
["2025-02-11",3,2,2,1,"R",1,1]
["2025-02-12",2,"R",2,3,1,1,"R"]
["2025-02-13",1,2,"R",1,2,"R",1]
["2025-02-14","R",2,"R",1,2,1,1]
["2025-02-15",2,"R",2,"R","R",2,"R"]
["2025-02-16","R","R",2,"R","R",2,"R"]
["2025-02-17","R",2,2,"R",1,"R",1]
["2025-02-18",2,3,"R",2,1,1,1]
["2025-02-19",2,"R",1,2,3,1,"R"]
["2025-02-20",2,1,2,"R",1,1,"R"]
["2025-02-21",3,2,2,"R",1,1,1]
["2025-02-22","R",2,"R",2,"R","R",2]
["2025-02-23","R","R","R",2,"R","R",2]
["2025-02-24",2,"R",1,2,"R","R",1]
["2025-02-25",3,2,1,"R",2,1,1]
["2025-02-26",2,"R",3,1,2,1,"R"]
["2025-02-27",1,2,1,2,"R","R",1]
["2025-02-28","R",2,1,2,"R",1,1]
["2025-03-01",2,"R","R","R",2,2,"R"]
["2025-03-02","R","R","R","R",2,2,"R"]
["2025-03-03","R",2,"R",1,2,"R",1]
["2025-03-04",2,3,2,1,"R",1,1]
["2025-03-05",2,"R",2,3,1,1,"R"]
["2025-03-06",2,1,"R",1,2,1,"R"]
["2025-03-07",3,2,"R",1,2,1,1]
["2025-03-08","R",2,2,"R","R","R",2]
["2025-03-09","R","R",2,"R","R","R",2]
["2025-03-10",2,"R",2,"R",1,"R",1]
["2025-03-11",3,2,"R",2,1,1,1]
["2025-03-12",2,"R",1,2,3,1,"R"]
["2025-03-13",1,2,2,"R",1,"R",1]
["2025-03-14","R",2,2,"R",1,1,1]
["2025-03-15",2,"R","R",2,"R",2,"R"]
["2025-03-16","R","R","R",2,"R",2,"R"]
["2025-03-17","R",2,1,2,"R","R",1]
["2025-03-18",2,3,1,"R",2,1,1]
["2025-03-19",2,"R",3,1,2,1,"R"]
["2025-03-20",2,1,1,2,"R",1,"R"]
["2025-03-21",3,2,1,2,"R",1,1]
["2025-03-22","R",2,"R","R",2,"R",2]
["2025-03-23","R","R","R","R",2,"R",2]
["2025-03-24",2,"R","R",1,2,"R",1]
["2025-03-25",3,2,2,1,"R",1,1]
["2025-03-26",2,"R",2,3,1,1,"R"]
["2025-03-27",1,2,"R",1,2,"R",1]
["2025-03-28","R",2,"R",1,2,1,1]
["2025-03-29",2,"R",2,"R","R",2,"R"]
["2025-03-30","R","R",2,"R","R",2,"R"]
["2025-03-31","R",2,2,"R",1,"R",1]
["2025-04-01",2,3,"R",2,1,1,1]
["2025-04-02",2,"R",1,2,3,1,"R"]
["2025-04-03",2,1,2,"R",1,1,"R"]
["2025-04-04",3,2,2,"R",1,1,1]
["2025-04-05","R",2,"R",2,"R","R",2]
["2025-04-06","R","R","R",2,"R","R",2]
["2025-04-07",2,"R",1,2,"R","R",1]
["2025-04-08",3,2,1,"R",2,1,1]
["2025-04-09",2,"R",3,1,2,1,"R"]
["2025-04-10",1,2,1,2,"R","R",1]
["2025-04-11","R",2,1,2,"R",1,1]
["2025-04-12",2,"R","R","R",2,2,"R"]
["2025-04-13","R","R","R","R",2,2,"R"]
["2025-04-14","R",2,"R",1,2,"R",1]
["2025-04-15",2,3,2,1,"R",1,1]
["2025-04-16",2,"R",2,3,1,1,"R"]
["2025-04-17",2,1,"R",1,2,1,"R"]
["2025-04-18",3,2,"R",1,2,1,1]
["2025-04-19","R",2,2,"R","R","R",2]
["2025-04-20","R","R",2,"R","R","R",2]
["2025-04-21",2,"R",2,"R",1,"R",1]
["2025-04-22",3,2,"R",2,1,1,1]
["2025-04-23",2,"R",1,2,3,1,"R"]
["2025-04-24",1,2,2,"R",1,"R",1]
["2025-04-25","R",2,2,"R",1,1,1]
["2025-04-26",2,"R","R",2,"R",2,"R"]
["2025-04-27","R","R","R",2,"R",2,"R"]
["2025-04-28","R",2,1,2,"R","R",1]
["2025-04-29",2,3,1,"R",2,1,1]
["2025-04-30",2,"R",3,1,2,1,"R"]
["2025-05-01",2,1,1,2,"R",1,"R"]
["2025-05-02",3,2,1,2,"R",1,1]
["2025-05-03","R",2,"R","R",2,"R",2]
["2025-05-04","R","R","R","R",2,"R",2]
["2025-05-05",2,"R","R",1,2,"R",1]
["2025-05-06",3,2,2,1,"R",1,1]
["2025-05-07",2,"R",2,3,1,1,"R"]
["2025-05-08",1,2,"R",1,2,"R",1]
["2025-05-09","R",2,"R",1,2,1,1]
["2025-05-10",2,"R",2,"R","R",2,"R"]
["2025-05-11","R","R",2,"R","R",2,"R"]
["2025-05-12","R",2,2,"R",1,"R",1]
["2025-05-13",2,3,"R",2,1,1,1]
["2025-05-14",2,"R",1,2,3,1,"R"]
["2025-05-15",2,1,2,"R",1,1,"R"]
["2025-05-16",3,2,2,"R",1,1,1]
["2025-05-17","R",2,"R",2,"R","R",2]
["2025-05-18","R","R","R",2,"R","R",2]
["2025-05-19",2,"R",1,2,"R","R",1]
["2025-05-20",3,2,1,"R",2,1,1]
["2025-05-21",2,"R",3,1,2,1,"R"]
["2025-05-22",1,2,1,2,"R","R",1]
["2025-05-23","R",2,1,2,"R",1,1]
["2025-05-24",2,"R","R","R",2,2,"R"]
["2025-05-25","R","R","R","R",2,2,"R"]
["2025-05-26","R",2,"R",1,2,"R",1]
["2025-05-27",2,3,2,1,"R",1,1]
["2025-05-28",2,"R",2,3,1,1,"R"]
["2025-05-29",2,1,"R",1,2,1,"R"]
["2025-05-30",3,2,"R",1,2,1,1]
["2025-05-31","R",2,2,"R","R","R",2]
["2025-06-01","R","R",2,"R","R","R",2]
["2025-06-02",2,"R",2,"R",1,"R",1]
["2025-06-03",3,2,"R",2,1,1,1]
["2025-06-04",2,"R",1,2,3,1,"R"]
["2025-06-05",1,2,2,"R",1,"R",1]
["2025-06-06","R",2,2,"R",1,1,1]
["2025-06-07",2,"R","R",2,"R",2,"R"]
["2025-06-08","R","R","R",2,"R",2,"R"]
["2025-06-09","R",2,1,2,"R","R",1]
["2025-06-10",2,3,1,"R",2,1,1]
["2025-06-11",2,"R",3,1,2,1,"R"]
["2025-06-12",2,1,1,2,"R",1,"R"]
["2025-06-13",3,2,1,2,"R",1,1]
["2025-06-14","R",2,"R","R",2,"R",2]
["2025-06-15","R","R","R","R",2,"R",2]
["2025-06-16",2,"R","R",1,2,"R",1]
["2025-06-17",3,2,2,1,"R",1,1]
["2025-06-18",2,"R",2,3,1,1,"R"]
["2025-06-19",1,2,"R",1,2,"R",1]
["2025-06-20","R",2,"R",1,2,1,1]
["2025-06-21",2,"R",2,"R","R",2,"R"]
["2025-06-22","R","R",2,"R","R",2,"R"]
["2025-06-23","R",2,2,"R",1,"R",1]
["2025-06-24",2,3,"R",2,1,1,1]
["2025-06-25",2,"R",1,2,3,1,"R"]
["2025-06-26",2,1,2,"R",1,1,"R"]
["2025-06-27",3,2,2,"R",1,1,1]
["2025-06-28","R",2,"R",2,"R","R",2]
["2025-06-29","R","R","R",2,"R","R",2]
["2025-06-30",2,"R",1,2,"R","R",1]
["2025-07-01",3,2,1,"R",2,1,1]
["2025-07-02",2,"R",3,1,2,1,"R"]
["2025-07-03",1,2,1,2,"R","R",1]
["2025-07-04","R",2,1,2,"R",1,1]
["2025-07-05",2,"R","R","R",2,2,"R"]
["2025-07-06","R","R","R","R",2,2,"R"]
["2025-07-07","R",2,"R",1,2,"R",1]
["2025-07-08",2,3,2,1,"R",1,1]
["2025-07-09",2,"R",2,3,1,1,"R"]
["2025-07-10",2,1,"R",1,2,1,"R"]
["2025-07-11",3,2,"R",1,2,1,1]
["2025-07-12","R",2,2,"R","R","R",2]
["2025-07-13","R","R",2,"R","R","R",2]
["2025-07-14",2,"R",2,"R",1,"R",1]
["2025-07-15",3,2,"R",2,1,1,1]
["2025-07-16",2,"R",1,2,3,1,"R"]
["2025-07-17",1,2,2,"R",1,"R",1]
["2025-07-18","R",2,2,"R",1,1,1]
["2025-07-19",2,"R","R",2,"R",2,"R"]
["2025-07-20","R","R","R",2,"R",2,"R"]
["2025-07-21","R",2,1,2,"R","R",1]
["2025-07-22",2,3,1,"R",2,1,1]
["2025-07-23",2,"R",3,1,2,1,"R"]
["2025-07-24",2,1,1,2,"R",1,"R"]
["2025-07-25",3,2,1,2,"R",1,1]
["2025-07-26","R",2,"R","R",2,"R",2]
["2025-07-27","R","R","R","R",2,"R",2]
["2025-07-28",2,"R","R",1,2,"R",1]
["2025-07-29",3,2,2,1,"R",1,1]
["2025-07-30",2,"R",2,3,1,1,"R"]
["2025-07-31",1,2,"R",1,2,"R",1]
["2025-08-01","R",2,"R",1,2,1,1]
["2025-08-02",2,"R",2,"R","R",2,"R"]
["2025-08-03","R","R",2,"R","R",2,"R"]
["2025-08-04","R",2,2,"R",1,"R",1]
["2025-08-05",2,3,"R",2,1,1,1]
["2025-08-06",2,"R",1,2,3,1,"R"]
["2025-08-07",2,1,2,"R",1,1,"R"]
["2025-08-08",3,2,2,"R",1,1,1]
["2025-08-09","R",2,"R",2,"R","R",2]
["2025-08-10","R","R","R",2,"R","R",2]
["2025-08-11",2,"R",1,2,"R","R",1]
["2025-08-12",3,2,1,"R",2,1,1]
["2025-08-13",2,"R",3,1,2,1,"R"]
["2025-08-14",1,2,1,2,"R","R",1]
["2025-08-15","R",2,1,2,"R",1,1]
["2025-08-16",2,"R","R","R",2,2,"R"]
["2025-08-17","R","R","R","R",2,2,"R"]
["2025-08-18","R",2,"R",1,2,"R",1]
["2025-08-19",2,3,2,1,"R",1,1]
["2025-08-20",2,"R",2,3,1,1,"R"]
["2025-08-21",2,1,"R",1,2,1,"R"]
["2025-08-22",3,2,"R",1,2,1,1]
["2025-08-23","R",2,2,"R","R","R",2]
["2025-08-24","R","R",2,"R","R","R",2]
["2025-08-25",2,"R",2,"R",1,"R",1]
["2025-08-26",3,2,"R",2,1,1,1]
["2025-08-27",2,"R",1,2,3,1,"R"]
["2025-08-28",1,2,2,"R",1,"R",1]
["2025-08-29","R",2,2,"R",1,1,1]
["2025-08-30",2,"R","R",2,"R",2,"R"]
["2025-08-31","R","R","R",2,"R",2,"R"]
["2025-09-01","R",2,1,2,"R","R",1]
["2025-09-02",2,3,1,"R",2,1,1]
["2025-09-03",2,"R",3,1,2,1,"R"]
["2025-09-04",2,1,1,2,"R",1,"R"]
["2025-09-05",3,2,1,2,"R",1,1]
["2025-09-06","R",2,"R","R",2,"R",2]
["2025-09-07","R","R","R","R",2,"R",2]
["2025-09-08",2,"R","R",1,2,"R",1]
["2025-09-09",3,2,2,1,"R",1,1]
["2025-09-10",2,"R",2,3,1,1,"R"]
["2025-09-11",1,2,"R",1,2,"R",1]
["2025-09-12","R",2,"R",1,2,1,1]
["2025-09-13",2,"R",2,"R","R",2,"R"]
["2025-09-14","R","R",2,"R","R",2,"R"]
["2025-09-15","R",2,2,"R",1,"R",1]
["2025-09-16",2,3,"R",2,1,1,1]
["2025-09-17",2,"R",1,2,3,1,"R"]
["2025-09-18",2,1,2,"R",1,1,"R"]
["2025-09-19",3,2,2,"R",1,1,1]
["2025-09-20","R",2,"R",2,"R","R",2]
["2025-09-21","R","R","R",2,"R","R",2]
["2025-09-22",2,"R",1,2,"R","R",1]
["2025-09-23",3,2,1,"R",2,1,1]
["2025-09-24",2,"R",3,1,2,1,"R"]
["2025-09-25",1,2,1,2,"R","R",1]
["2025-09-26","R",2,1,2,"R",1,1]
["2025-09-27",2,"R","R","R",2,2,"R"]
["2025-09-28","R","R","R","R",2,2,"R"]
["2025-09-29","R",2,"R",1,2,"R",1]
["2025-09-30",2,3,2,1,"R",1,1]
["2025-10-01",2,"R",2,3,1,1,"R"]
["2025-10-02",2,1,"R",1,2,1,"R"]
["2025-10-03",3,2,"R",1,2,1,1]
["2025-10-04","R",2,2,"R","R","R",2]
["2025-10-05","R","R",2,"R","R","R",2]
["2025-10-06",2,"R",2,"R",1,"R",1]
["2025-10-07",3,2,"R",2,1,1,1]
["2025-10-08",2,"R",1,2,3,1,"R"]
["2025-10-09",1,2,2,"R",1,"R",1]
["2025-10-10","R",2,2,"R",1,1,1]
["2025-10-11",2,"R","R",2,"R",2,"R"]
["2025-10-12","R","R","R",2,"R",2,"R"]
["2025-10-13","R",2,1,2,"R","R",1]
["2025-10-14",2,3,1,"R",2,1,1]
["2025-10-15",2,"R",3,1,2,1,"R"]
["2025-10-16",2,1,1,2,"R",1,"R"]
["2025-10-17",3,2,1,2,"R",1,1]
["2025-10-18","R",2,"R","R",2,"R",2]
["2025-10-19","R","R","R","R",2,"R",2]
["2025-10-20",2,"R","R",1,2,"R",1]
["2025-10-21",3,2,2,1,"R",1,1]
["2025-10-22",2,"R",2,3,1,1,"R"]
["2025-10-23",1,2,"R",1,2,"R",1]
["2025-10-24","R",2,"R",1,2,1,1]
["2025-10-25",2,"R",2,"R","R",2,"R"]
["2025-10-26","R","R",2,"R","R",2,"R"]
["2025-10-27","R",2,2,"R",1,"R",1]
["2025-10-28",2,3,"R",2,1,1,1]
["2025-10-29",2,"R",1,2,3,1,"R"]
["2025-10-30",2,1,2,"R",1,1,"R"]
["2025-10-31",3,2,2,"R",1,1,1]
["2025-11-01","R",2,"R",2,"R","R",2]
["2025-11-02","R","R","R",2,"R","R",2]
["2025-11-03",2,"R",1,2,"R","R",1]
["2025-11-04",3,2,1,"R",2,1,1]
["2025-11-05",2,"R",3,1,2,1,"R"]
["2025-11-06",1,2,1,2,"R","R",1]
["2025-11-07","R",2,1,2,"R",1,1]
["2025-11-08",2,"R","R","R",2,2,"R"]
["2025-11-09","R","R","R","R",2,2,"R"]
["2025-11-10","R",2,"R",1,2,"R",1]
["2025-11-11",2,3,2,1,"R",1,1]
["2025-11-12",2,"R",2,3,1,1,"R"]
["2025-11-13",2,1,"R",1,2,1,"R"]
["2025-11-14",3,2,"R",1,2,1,1]
["2025-11-15","R",2,2,"R","R","R",2]
["2025-11-16","R","R",2,"R","R","R",2]
["2025-11-17",2,"R",2,"R",1,"R",1]
["2025-11-18",3,2,"R",2,1,1,1]
["2025-11-19",2,"R",1,2,3,1,"R"]
["2025-11-20",1,2,2,"R",1,"R",1]
["2025-11-21","R",2,2,"R",1,1,1]
["2025-11-22",2,"R","R",2,"R",2,"R"]
["2025-11-23","R","R","R",2,"R",2,"R"]
["2025-11-24","R",2,1,2,"R","R",1]
["2025-11-25",2,3,1,"R",2,1,1]
["2025-11-26",2,"R",3,1,2,1,"R"]
["2025-11-27",2,1,1,2,"R",1,"R"]
["2025-11-28",3,2,1,2,"R",1,1]
["2025-11-29","R",2,"R","R",2,"R",2]
["2025-11-30","R","R","R","R",2,"R",2]
["2025-12-01",2,"R","R",1,2,"R",1]
["2025-12-02",3,2,2,1,"R",1,1]
["2025-12-03",2,"R",2,3,1,1,"R"]
["2025-12-04",1,2,"R",1,2,"R",1]
["2025-12-05","R",2,"R",1,2,1,1]
["2025-12-06",2,"R",2,"R","R",2,"R"]
["2025-12-07","R","R",2,"R","R",2,"R"]
["2025-12-08","R",2,2,"R",1,"R",1]
["2025-12-09",2,3,"R",2,1,1,1]
["2025-12-10",2,"R",1,2,3,1,"R"]
["2025-12-11",2,1,2,"R",1,1,"R"]
["2025-12-12",3,2,2,"R",1,1,1]
["2025-12-13","R",2,"R",2,"R","R",2]
["2025-12-14","R","R","R",2,"R","R",2]
["2025-12-15",2,"R",1,2,"R","R",1]
["2025-12-16",3,2,1,"R",2,1,1]
["2025-12-17",2,"R",3,1,2,1,"R"]
["2025-12-18",1,2,1,2,"R","R",1]
["2025-12-19","R",2,1,2,"R",1,1]
["2025-12-20",2,"R","R","R",2,2,"R"]
["2025-12-21","R","R","R","R",2,2,"R"]
["2025-12-22","R",2,"R",1,2,"R",1]
["2025-12-23",2,3,2,1,"R",1,1]
["2025-12-24",2,"R",2,3,1,1,"R"]
["2025-12-25",2,1,"R",1,2,1,"R"]
["2025-12-26",3,2,"R",1,2,1,1]
["2025-12-27","R",2,2,"R","R","R",2]
["2025-12-28","R","R",2,"R","R","R",2]
["2025-12-29",2,"R",2,"R",1,"R",1]
["2025-12-30",3,2,"R",2,1,1,1]
["2025-12-31",2,"R",1,2,3,1,"R"]
["2026-01-01",1,2,2,"R",1,"R",1]
["2026-01-02","R",2,2,"R",1,1,1]
["2026-01-03",2,"R","R",2,"R",2,"R"]
["2026-01-04","R","R","R",2,"R",2,"R"]
["2026-01-05","R",2,1,2,"R","R",1]
["2026-01-06",2,3,1,"R",2,1,1]
["2026-01-07",2,"R",3,1,2,1,"R"]
["2026-01-08",2,1,1,2,"R",1,"R"]
["2026-01-09",3,2,1,2,"R",1,1]
["2026-01-10","R",2,"R","R",2,"R",2]
["2026-01-11","R","R","R","R",2,"R",2]
["2026-01-12",2,"R","R",1,2,"R",1]
["2026-01-13",3,2,2,1,"R",1,1]
["2026-01-14",2,"R",2,3,1,1,"R"]
["2026-01-15",1,2,"R",1,2,"R",1]
["2026-01-16","R",2,"R",1,2,1,1]
["2026-01-17",2,"R",2,"R","R",2,"R"]
["2026-01-18","R","R",2,"R","R",2,"R"]
["2026-01-19","R",2,2,"R",1,"R",1]
["2026-01-20",2,3,"R",2,1,1,1]
["2026-01-21",2,"R",1,2,3,1,"R"]
["2026-01-22",2,1,2,"R",1,1,"R"]
["2026-01-23",3,2,2,"R",1,1,1]
["2026-01-24","R",2,"R",2,"R","R",2]
["2026-01-25","R","R","R",2,"R","R",2]
["2026-01-26",2,"R",1,2,"R","R",1]
["2026-01-27",3,2,1,"R",2,1,1]
["2026-01-28",2,"R",3,1,2,1,"R"]
["2026-01-29",1,2,1,2,"R","R",1]
["2026-01-30","R",2,1,2,"R",1,1]
["2026-01-31",2,"R","R","R",2,2,"R"]
["2026-02-01","R","R","R","R",2,2,"R"]
["2026-02-02","R",2,"R",1,2,"R",1]
["2026-02-03",2,3,2,1,"R",1,1]
["2026-02-04",2,"R",2,3,1,1,"R"]
["2026-02-05",2,1,"R",1,2,1,"R"]
["2026-02-06",3,2,"R",1,2,1,1]
["2026-02-07","R",2,2,"R","R","R",2]
["2026-02-08","R","R",2,"R","R","R",2]
["2026-02-09",2,"R",2,"R",1,"R",1]
["2026-02-10",3,2,"R",2,1,1,1]
["2026-02-11",2,"R",1,2,3,1,"R"]
["2026-02-12",1,2,2,"R",1,"R",1]
["2026-02-13","R",2,2,"R",1,1,1]
["2026-02-14",2,"R","R",2,"R",2,"R"]
["2026-02-15","R","R","R",2,"R",2,"R"]
["2026-02-16","R",2,1,2,"R","R",1]
["2026-02-17",2,3,1,"R",2,1,1]
["2026-02-18",2,"R",3,1,2,1,"R"]
["2026-02-19",2,1,1,2,"R",1,"R"]
["2026-02-20",3,2,1,2,"R",1,1]
["2026-02-21","R",2,"R","R",2,"R",2]
["2026-02-22","R","R","R","R",2,"R",2]
["2026-02-23",2,"R","R",1,2,"R",1]
["2026-02-24",3,2,2,1,"R",1,1]
["2026-02-25",2,"R",2,3,1,1,"R"]
["2026-02-26",1,2,"R",1,2,"R",1]
["2026-02-27","R",2,"R",1,2,1,1]
["2026-02-28",2,"R",2,"R","R",2,"R"]
["2026-03-01","R","R",2,"R","R",2,"R"]
["2026-03-02","R",2,2,"R",1,"R",1]
["2026-03-03",2,3,"R",2,1,1,1]
["2026-03-04",2,"R",1,2,3,1,"R"]
["2026-03-05",2,1,2,"R",1,1,"R"]
["2026-03-06",3,2,2,"R",1,1,1]
["2026-03-07","R",2,"R",2,"R","R",2]
["2026-03-08","R","R","R",2,"R","R",2]
["2026-03-09",2,"R",1,2,"R","R",1]
["2026-03-10",3,2,1,"R",2,1,1]
["2026-03-11",2,"R",3,1,2,1,"R"]
["2026-03-12",1,2,1,2,"R","R",1]
["2026-03-13","R",2,1,2,"R",1,1]
["2026-03-14",2,"R","R","R",2,2,"R"]
["2026-03-15","R","R","R","R",2,2,"R"]
["2026-03-16","R",2,"R",1,2,"R",1]
["2026-03-17",2,3,2,1,"R",1,1]
["2026-03-18",2,"R",2,3,1,1,"R"]
["2026-03-19",2,1,"R",1,2,1,"R"]
["2026-03-20",3,2,"R",1,2,1,1]
["2026-03-21","R",2,2,"R","R","R",2]
["2026-03-22","R","R",2,"R","R","R",2]
["2026-03-23",2,"R",2,"R",1,"R",1]
["2026-03-24",3,2,"R",2,1,1,1]
["2026-03-25",2,"R",1,2,3,1,"R"]
["2026-03-26",1,2,2,"R",1,"R",1]
["2026-03-27","R",2,2,"R",1,1,1]
["2026-03-28",2,"R","R",2,"R",2,"R"]
["2026-03-29","R","R","R",2,"R",2,"R"]
["2026-03-30","R",2,1,2,"R","R",1]
["2026-03-31",2,3,1,"R",2,1,1]
["2026-04-01",2,"R",3,1,2,1,"R"]
["2026-04-02",2,1,1,2,"R",1,"R"]
["2026-04-03",3,2,1,2,"R",1,1]
["2026-04-04","R",2,"R","R",2,"R",2]
["2026-04-05","R","R","R","R",2,"R",2]
["2026-04-06",2,"R","R",1,2,"R",1]
["2026-04-07",3,2,2,1,"R",1,1]
["2026-04-08",2,"R",2,3,1,1,"R"]
["2026-04-09",1,2,"R",1,2,"R",1]
["2026-04-10","R",2,"R",1,2,1,1]
["2026-04-11",2,"R",2,"R","R",2,"R"]
["2026-04-12","R","R",2,"R","R",2,"R"]
["2026-04-13","R",2,2,"R",1,"R",1]
["2026-04-14",2,3,"R",2,1,1,1]
["2026-04-15",2,"R",1,2,3,1,"R"]
["2026-04-16",2,1,2,"R",1,1,"R"]
["2026-04-17",3,2,2,"R",1,1,1]
["2026-04-18","R",2,"R",2,"R","R",2]
["2026-04-19","R","R","R",2,"R","R",2]
["2026-04-20",2,"R",1,2,"R","R",1]
["2026-04-21",3,2,1,"R",2,1,1]
["2026-04-22",2,"R",3,1,2,1,"R"]
["2026-04-23",1,2,1,2,"R","R",1]
["2026-04-24","R",2,1,2,"R",1,1]
["2026-04-25",2,"R","R","R",2,2,"R"]
["2026-04-26","R","R","R","R",2,2,"R"]
["2026-04-27","R",2,"R",1,2,"R",1]
["2026-04-28",2,3,2,1,"R",1,1]
["2026-04-29",2,"R",2,3,1,1,"R"]
["2026-04-30",2,1,"R",1,2,1,"R"]
["2026-05-01",3,2,"R",1,2,1,1]
["2026-05-02","R",2,2,"R","R","R",2]
["2026-05-03","R","R",2,"R","R","R",2]
["2026-05-04",2,"R",2,"R",1,"R",1]
["2026-05-05",3,2,"R",2,1,1,1]
["2026-05-06",2,"R",1,2,3,1,"R"]
["2026-05-07",1,2,2,"R",1,"R",1]
["2026-05-08","R",2,2,"R",1,1,1]
["2026-05-09",2,"R","R",2,"R",2,"R"]
["2026-05-10","R","R","R",2,"R",2,"R"]
["2026-05-11","R",2,1,2,"R","R",1]
["2026-05-12",2,3,1,"R",2,1,1]
["2026-05-13",2,"R",3,1,2,1,"R"]
["2026-05-14",2,1,1,2,"R",1,"R"]
["2026-05-15",3,2,1,2,"R",1,1]
["2026-05-16","R",2,"R","R",2,"R",2]
["2026-05-17","R","R","R","R",2,"R",2]
["2026-05-18",2,"R","R",1,2,"R",1]
["2026-05-19",3,2,2,1,"R",1,1]
["2026-05-20",2,"R",2,3,1,1,"R"]
["2026-05-21",1,2,"R",1,2,"R",1]
["2026-05-22","R",2,"R",1,2,1,1]
["2026-05-23",2,"R",2,"R","R",2,"R"]
["2026-05-24","R","R",2,"R","R",2,"R"]
["2026-05-25","R",2,2,"R",1,"R",1]
["2026-05-26",2,3,"R",2,1,1,1]
["2026-05-27",2,"R",1,2,3,1,"R"]
["2026-05-28",2,1,2,"R",1,1,"R"]
["2026-05-29",3,2,2,"R",1,1,1]
["2026-05-30","R",2,"R",2,"R","R",2]
["2026-05-31","R","R","R",2,"R","R",2]
["2026-06-01",2,"R",1,2,"R","R",1]
["2026-06-02",3,2,1,"R",2,1,1]
["2026-06-03",2,"R",3,1,2,1,"R"]
["2026-06-04",1,2,1,2,"R","R",1]
["2026-06-05","R",2,1,2,"R",1,1]
["2026-06-06",2,"R","R","R",2,2,"R"]
["2026-06-07","R","R","R","R",2,2,"R"]
["2026-06-08","R",2,"R",1,2,"R",1]
["2026-06-09",2,3,2,1,"R",1,1]
["2026-06-10",2,"R",2,3,1,1,"R"]
["2026-06-11",2,1,"R",1,2,1,"R"]
["2026-06-12",3,2,"R",1,2,1,1]
["2026-06-13","R",2,2,"R","R","R",2]
["2026-06-14","R","R",2,"R","R","R",2]
["2026-06-15",2,"R",2,"R",1,"R",1]
["2026-06-16",3,2,"R",2,1,1,1]
["2026-06-17",2,"R",1,2,3,1,"R"]
["2026-06-18",1,2,2,"R",1,"R",1]
["2026-06-19","R",2,2,"R",1,1,1]
["2026-06-20",2,"R","R",2,"R",2,"R"]
["2026-06-21","R","R","R",2,"R",2,"R"]
["2026-06-22","R",2,1,2,"R","R",1]
["2026-06-23",2,3,1,"R",2,1,1]
["2026-06-24",2,"R",3,1,2,1,"R"]
["2026-06-25",2,1,1,2,"R",1,"R"]
["2026-06-26",3,2,1,2,"R",1,1]
["2026-06-27","R",2,"R","R",2,"R",2]
["2026-06-28","R","R","R","R",2,"R",2]
["2026-06-29",2,"R","R",1,2,"R",1]
["2026-06-30",3,2,2,1,"R",1,1]
["2026-07-01",2,"R",2,3,1,1,"R"]
["2026-07-02",1,2,"R",1,2,"R",1]
["2026-07-03","R",2,"R",1,2,1,1]
["2026-07-04",2,"R",2,"R","R",2,"R"]
["2026-07-05","R","R",2,"R","R",2,"R"]
["2026-07-06","R",2,2,"R",1,"R",1]
["2026-07-07",2,3,"R",2,1,1,1]
["2026-07-08",2,"R",1,2,3,1,"R"]
["2026-07-09",2,1,2,"R",1,1,"R"]
["2026-07-10",3,2,2,"R",1,1,1]
["2026-07-11","R",2,"R",2,"R","R",2]
["2026-07-12","R","R","R",2,"R","R",2]
["2026-07-13",2,"R",1,2,"R","R",1]
["2026-07-14",3,2,1,"R",2,1,1]
["2026-07-15",2,"R",3,1,2,1,"R"]
["2026-07-16",1,2,1,2,"R","R",1]
["2026-07-17","R",2,1,2,"R",1,1]
["2026-07-18",2,"R","R","R",2,2,"R"]
["2026-07-19","R","R","R","R",2,2,"R"]
["2026-07-20","R",2,"R",1,2,"R",1]
["2026-07-21",2,3,2,1,"R",1,1]
["2026-07-22",2,"R",2,3,1,1,"R"]
["2026-07-23",2,1,"R",1,2,1,"R"]
["2026-07-24",3,2,"R",1,2,1,1]
["2026-07-25","R",2,2,"R","R","R",2]
["2026-07-26","R","R",2,"R","R","R",2]
["2026-07-27",2,"R",2,"R",1,"R",1]
["2026-07-28",3,2,"R",2,1,1,1]
["2026-07-29",2,"R",1,2,3,1,"R"]
["2026-07-30",1,2,2,"R",1,"R",1]
["2026-07-31","R",2,2,"R",1,1,1]
["2026-08-01",2,"R","R",2,"R",2,"R"]
["2026-08-02","R","R","R",2,"R",2,"R"]
["2026-08-03","R",2,1,2,"R","R",1]
["2026-08-04",2,3,1,"R",2,1,1]
["2026-08-05",2,"R",3,1,2,1,"R"]
["2026-08-06",2,1,1,2,"R",1,"R"]
["2026-08-07",3,2,1,2,"R",1,1]
["2026-08-08","R",2,"R","R",2,"R",2]
["2026-08-09","R","R","R","R",2,"R",2]
["2026-08-10",2,"R","R",1,2,"R",1]
["2026-08-11",3,2,2,1,"R",1,1]
["2026-08-12",2,"R",2,3,1,1,"R"]
["2026-08-13",1,2,"R",1,2,"R",1]
["2026-08-14","R",2,"R",1,2,1,1]
["2026-08-15",2,"R",2,"R","R",2,"R"]
["2026-08-16","R","R",2,"R","R",2,"R"]
["2026-08-17","R",2,2,"R",1,"R",1]
["2026-08-18",2,3,"R",2,1,1,1]
["2026-08-19",2,"R",1,2,3,1,"R"]
["2026-08-20",2,1,2,"R",1,1,"R"]
["2026-08-21",3,2,2,"R",1,1,1]
["2026-08-22","R",2,"R",2,"R","R",2]
["2026-08-23","R","R","R",2,"R","R",2]
["2026-08-24",2,"R",1,2,"R","R",1]
["2026-08-25",3,2,1,"R",2,1,1]
["2026-08-26",2,"R",3,1,2,1,"R"]
["2026-08-27",1,2,1,2,"R","R",1]
["2026-08-28","R",2,1,2,"R",1,1]
["2026-08-29",2,"R","R","R",2,2,"R"]
["2026-08-30","R","R","R","R",2,2,"R"]
["2026-08-31","R",2,"R",1,2,"R",1]
["2026-09-01",2,3,2,1,"R",1,1]
["2026-09-02",2,"R",2,3,1,1,"R"]
["2026-09-03",2,1,"R",1,2,1,"R"]
["2026-09-04",3,2,"R",1,2,1,1]
["2026-09-05","R",2,2,"R","R","R",2]
["2026-09-06","R","R",2,"R","R","R",2]
["2026-09-07",2,"R",2,"R",1,"R",1]
["2026-09-08",3,2,"R",2,1,1,1]
["2026-09-09",2,"R",1,2,3,1,"R"]
["2026-09-10",1,2,2,"R",1,"R",1]
["2026-09-11","R",2,2,"R",1,1,1]
["2026-09-12",2,"R","R",2,"R",2,"R"]
["2026-09-13","R","R","R",2,"R",2,"R"]
["2026-09-14","R",2,1,2,"R","R",1]
["2026-09-15",2,3,1,"R",2,1,1]
["2026-09-16",2,"R",3,1,2,1,"R"]
["2026-09-17",2,1,1,2,"R",1,"R"]
["2026-09-18",3,2,1,2,"R",1,1]
["2026-09-19","R",2,"R","R",2,"R",2]
["2026-09-20","R","R","R","R",2,"R",2]
["2026-09-21",2,"R","R",1,2,"R",1]
["2026-09-22",3,2,2,1,"R",1,1]
["2026-09-23",2,"R",2,3,1,1,"R"]
["2026-09-24",1,2,"R",1,2,"R",1]
["2026-09-25","R",2,"R",1,2,1,1]
["2026-09-26",2,"R",2,"R","R",2,"R"]
["2026-09-27","R","R",2,"R","R",2,"R"]
["2026-09-28","R",2,2,"R",1,"R",1]
["2026-09-29",2,3,"R",2,1,1,1]
["2026-09-30",2,"R",1,2,3,1,"R"]
["2026-10-01",2,1,2,"R",1,1,"R"]
["2026-10-02",3,2,2,"R",1,1,1]
["2026-10-03","R",2,"R",2,"R","R",2]
["2026-10-04","R","R","R",2,"R","R",2]
["2026-10-05",2,"R",1,2,"R","R",1]
["2026-10-06",3,2,1,"R",2,1,1]
["2026-10-07",2,"R",3,1,2,1,"R"]
["2026-10-08",1,2,1,2,"R","R",1]
["2026-10-09","R",2,1,2,"R",1,1]
["2026-10-10",2,"R","R","R",2,2,"R"]
["2026-10-11","R","R","R","R",2,2,"R"]
["2026-10-12","R",2,"R",1,2,"R",1]
["2026-10-13",2,3,2,1,"R",1,1]
["2026-10-14",2,"R",2,3,1,1,"R"]
["2026-10-15",2,1,"R",1,2,1,"R"]
["2026-10-16",3,2,"R",1,2,1,1]
["2026-10-17","R",2,2,"R","R","R",2]
["2026-10-18","R","R",2,"R","R","R",2]
["2026-10-19",2,"R",2,"R",1,"R",1]
["2026-10-20",3,2,"R",2,1,1,1]
["2026-10-21",2,"R",1,2,3,1,"R"]
["2026-10-22",1,2,2,"R",1,"R",1]
["2026-10-23","R",2,2,"R",1,1,1]
["2026-10-24",2,"R","R",2,"R",2,"R"]
["2026-10-25","R","R","R",2,"R",2,"R"]
["2026-10-26","R",2,1,2,"R","R",1]
["2026-10-27",2,3,1,"R",2,1,1]
["2026-10-28",2,"R",3,1,2,1,"R"]
["2026-10-29",2,1,1,2,"R",1,"R"]
["2026-10-30",3,2,1,2,"R",1,1]
["2026-10-31","R",2,"R","R",2,"R",2]
["2026-11-01","R","R","R","R",2,"R",2]
["2026-11-02",2,"R","R",1,2,"R",1]
["2026-11-03",3,2,2,1,"R",1,1]
["2026-11-04",2,"R",2,3,1,1,"R"]
["2026-11-05",1,2,"R",1,2,"R",1]
["2026-11-06","R",2,"R",1,2,1,1]
["2026-11-07",2,"R",2,"R","R",2,"R"]
["2026-11-08","R","R",2,"R","R",2,"R"]
["2026-11-09","R",2,2,"R",1,"R",1]
["2026-11-10",2,3,"R",2,1,1,1]
["2026-11-11",2,"R",1,2,3,1,"R"]
["2026-11-12",2,1,2,"R",1,1,"R"]
["2026-11-13",3,2,2,"R",1,1,1]
["2026-11-14","R",2,"R",2,"R","R",2]
["2026-11-15","R","R","R",2,"R","R",2]
["2026-11-16",2,"R",1,2,"R","R",1]
["2026-11-17",3,2,1,"R",2,1,1]
["2026-11-18",2,"R",3,1,2,1,"R"]
["2026-11-19",1,2,1,2,"R","R",1]
["2026-11-20","R",2,1,2,"R",1,1]
["2026-11-21",2,"R","R","R",2,2,"R"]
["2026-11-22","R","R","R","R",2,2,"R"]
["2026-11-23","R",2,"R",1,2,"R",1]
["2026-11-24",2,3,2,1,"R",1,1]
["2026-11-25",2,"R",2,3,1,1,"R"]
["2026-11-26",2,1,"R",1,2,1,"R"]
["2026-11-27",3,2,"R",1,2,1,1]
["2026-11-28","R",2,2,"R","R","R",2]
["2026-11-29","R","R",2,"R","R","R",2]
["2026-11-30",2,"R",2,"R",1,"R",1]
["2026-12-01",3,2,"R",2,1,1,1]
["2026-12-02",2,"R",1,2,3,1,"R"]
["2026-12-03",1,2,2,"R",1,"R",1]
["2026-12-04","R",2,2,"R",1,1,1]
["2026-12-05",2,"R","R",2,"R",2,"R"]
["2026-12-06","R","R","R",2,"R",2,"R"]
["2026-12-07","R",2,1,2,"R","R",1]
["2026-12-08",2,3,1,"R",2,1,1]
["2026-12-09",2,"R",3,1,2,1,"R"]
["2026-12-10",2,1,1,2,"R",1,"R"]
["2026-12-11",3,2,1,2,"R",1,1]
["2026-12-12","R",2,"R","R",2,"R",2]
["2026-12-13","R","R","R","R",2,"R",2]
["2026-12-14",2,"R","R",1,2,"R",1]
["2026-12-15",3,2,2,1,"R",1,1]
["2026-12-16",2,"R",2,3,1,1,"R"]
["2026-12-17",1,2,"R",1,2,"R",1]
["2026-12-18","R",2,"R",1,2,1,1]
["2026-12-19",2,"R",2,"R","R",2,"R"]
["2026-12-20","R","R",2,"R","R",2,"R"]
["2026-12-21","R",2,2,"R",1,"R",1]
["2026-12-22",2,3,"R",2,1,1,1]
["2026-12-23",2,"R",1,2,3,1,"R"]
["2026-12-24",2,1,2,"R",1,1,"R"]
["2026-12-25",3,2,2,"R",1,1,1]
["2026-12-26","R",2,"R",2,"R","R",2]
["2026-12-27","R","R","R",2,"R","R",2]
["2026-12-28",2,"R",1,2,"R","R",1]
["2026-12-29",3,2,1,"R",2,1,1]
["2026-12-30",2,"R",3,1,2,1,"R"]
["2026-12-31",1,2,1,2,"R","R",1]
["2027-01-01","R",2,1,2,"R",1,1]
["2027-01-02",2,"R","R","R",2,2,"R"]
["2027-01-03","R","R","R","R",2,2,"R"]
["2027-01-04","R",2,"R",1,2,"R",1]
["2027-01-05",2,3,2,1,"R",1,1]
["2027-01-06",2,"R",2,3,1,1,"R"]
["2027-01-07",2,1,"R",1,2,1,"R"]
["2027-01-08",3,2,"R",1,2,1,1]
["2027-01-09","R",2,2,"R","R","R",2]
["2027-01-10","R","R",2,"R","R","R",2]
["2027-01-11",2,"R",2,"R",1,"R",1]
["2027-01-12",3,2,"R",2,1,1,1]
["2027-01-13",2,"R",1,2,3,1,"R"]
["2027-01-14",1,2,2,"R",1,"R",1]
["2027-01-15","R",2,2,"R",1,1,1]
["2027-01-16",2,"R","R",2,"R",2,"R"]
["2027-01-17","R","R","R",2,"R",2,"R"]
["2027-01-18","R",2,1,2,"R","R",1]
["2027-01-19",2,3,1,"R",2,1,1]
["2027-01-20",2,"R",3,1,2,1,"R"]
["2027-01-21",2,1,1,2,"R",1,"R"]
["2027-01-22",3,2,1,2,"R",1,1]
["2027-01-23","R",2,"R","R",2,"R",2]
["2027-01-24","R","R","R","R",2,"R",2]
["2027-01-25",2,"R","R",1,2,"R",1]
["2027-01-26",3,2,2,1,"R",1,1]
["2027-01-27",2,"R",2,3,1,1,"R"]
["2027-01-28",1,2,"R",1,2,"R",1]
["2027-01-29","R",2,"R",1,2,1,1]
["2027-01-30",2,"R",2,"R","R",2,"R"]
["2027-01-31","R","R",2,"R","R",2,"R"]
["2027-02-01","R",2,2,"R",1,"R",1]
["2027-02-02",2,3,"R",2,1,1,1]
["2027-02-03",2,"R",1,2,3,1,"R"]
["2027-02-04",2,1,2,"R",1,1,"R"]
["2027-02-05",3,2,2,"R",1,1,1]
["2027-02-06","R",2,"R",2,"R","R",2]
["2027-02-07","R","R","R",2,"R","R",2]
["2027-02-08",2,"R",1,2,"R","R",1]
["2027-02-09",3,2,1,"R",2,1,1]
["2027-02-10",2,"R",3,1,2,1,"R"]
["2027-02-11",1,2,1,2,"R","R",1]
["2027-02-12","R",2,1,2,"R",1,1]
["2027-02-13",2,"R","R","R",2,2,"R"]
["2027-02-14","R","R","R","R",2,2,"R"]
["2027-02-15","R",2,"R",1,2,"R",1]
["2027-02-16",2,3,2,1,"R",1,1]
["2027-02-17",2,"R",2,3,1,1,"R"]
["2027-02-18",2,1,"R",1,2,1,"R"]
["2027-02-19",3,2,"R",1,2,1,1]
["2027-02-20","R",2,2,"R","R","R",2]
["2027-02-21","R","R",2,"R","R","R",2]
["2027-02-22",2,"R",2,"R",1,"R",1]
["2027-02-23",3,2,"R",2,1,1,1]
["2027-02-24",2,"R",1,2,3,1,"R"]
["2027-02-25",1,2,2,"R",1,"R",1]
["2027-02-26","R",2,2,"R",1,1,1]
["2027-02-27",2,"R","R",2,"R",2,"R"]
["2027-02-28","R","R","R",2,"R",2,"R"]
["2027-03-01","R",2,1,2,"R","R",1]
["2027-03-02",2,3,1,"R",2,1,1]
["2027-03-03",2,"R",3,1,2,1,"R"]
["2027-03-04",2,1,1,2,"R",1,"R"]
["2027-03-05",3,2,1,2,"R",1,1]
["2027-03-06","R",2,"R","R",2,"R",2]
["2027-03-07","R","R","R","R",2,"R",2]
["2027-03-08",2,"R","R",1,2,"R",1]
["2027-03-09",3,2,2,1,"R",1,1]
["2027-03-10",2,"R",2,3,1,1,"R"]
["2027-03-11",1,2,"R",1,2,"R",1]
["2027-03-12","R",2,"R",1,2,1,1]
["2027-03-13",2,"R",2,"R","R",2,"R"]
["2027-03-14","R","R",2,"R","R",2,"R"]
["2027-03-15","R",2,2,"R",1,"R",1]
["2027-03-16",2,3,"R",2,1,1,1]
["2027-03-17",2,"R",1,2,3,1,"R"]
["2027-03-18",2,1,2,"R",1,1,"R"]
["2027-03-19",3,2,2,"R",1,1,1]
["2027-03-20","R",2,"R",2,"R","R",2]
["2027-03-21","R","R","R",2,"R","R",2]
["2027-03-22",2,"R",1,2,"R","R",1]
["2027-03-23",3,2,1,"R",2,1,1]
["2027-03-24",2,"R",3,1,2,1,"R"]
["2027-03-25",1,2,1,2,"R","R",1]
["2027-03-26","R",2,1,2,"R",1,1]
["2027-03-27",2,"R","R","R",2,2,"R"]
["2027-03-28","R","R","R","R",2,2,"R"]
["2027-03-29","R",2,"R",1,2,"R",1]
["2027-03-30",2,3,2,1,"R",1,1]
["2027-03-31",2,"R",2,3,1,1,"R"]
["2027-04-01",2,1,"R",1,2,1,"R"]
["2027-04-02",3,2,"R",1,2,1,1]
["2027-04-03","R",2,2,"R","R","R",2]
["2027-04-04","R","R",2,"R","R","R",2]
["2027-04-05",2,"R",2,"R",1,"R",1]
["2027-04-06",3,2,"R",2,1,1,1]
["2027-04-07",2,"R",1,2,3,1,"R"]
["2027-04-08",1,2,2,"R",1,"R",1]
["2027-04-09","R",2,2,"R",1,1,1]
["2027-04-10",2,"R","R",2,"R",2,"R"]
["2027-04-11","R","R","R",2,"R",2,"R"]
["2027-04-12","R",2,1,2,"R","R",1]
["2027-04-13",2,3,1,"R",2,1,1]
["2027-04-14",2,"R",3,1,2,1,"R"]
["2027-04-15",2,1,1,2,"R",1,"R"]
["2027-04-16",3,2,1,2,"R",1,1]
["2027-04-17","R",2,"R","R",2,"R",2]
["2027-04-18","R","R","R","R",2,"R",2]
["2027-04-19",2,"R","R",1,2,"R",1]
["2027-04-20",3,2,2,1,"R",1,1]
["2027-04-21",2,"R",2,3,1,1,"R"]
["2027-04-22",1,2,"R",1,2,"R",1]
["2027-04-23","R",2,"R",1,2,1,1]
["2027-04-24",2,"R",2,"R","R",2,"R"]
["2027-04-25","R","R",2,"R","R",2,"R"]
["2027-04-26","R",2,2,"R",1,"R",1]
["2027-04-27",2,3,"R",2,1,1,1]
["2027-04-28",2,"R",1,2,3,1,"R"]
["2027-04-29",2,1,2,"R",1,1,"R"]
["2027-04-30",3,2,2,"R",1,1,1]
["2027-05-01","R",2,"R",2,"R","R",2]
["2027-05-02","R","R","R",2,"R","R",2]
["2027-05-03",2,"R",1,2,"R","R",1]
["2027-05-04",3,2,1,"R",2,1,1]
["2027-05-05",2,"R",3,1,2,1,"R"]
["2027-05-06",1,2,1,2,"R","R",1]
["2027-05-07","R",2,1,2,"R",1,1]
["2027-05-08",2,"R","R","R",2,2,"R"]
["2027-05-09","R","R","R","R",2,2,"R"]
["2027-05-10","R",2,"R",1,2,"R",1]
["2027-05-11",2,3,2,1,"R",1,1]
["2027-05-12",2,"R",2,3,1,1,"R"]
["2027-05-13",2,1,"R",1,2,1,"R"]
["2027-05-14",3,2,"R",1,2,1,1]
["2027-05-15","R",2,2,"R","R","R",2]
["2027-05-16","R","R",2,"R","R","R",2]
["2027-05-17",2,"R",2,"R",1,"R",1]
["2027-05-18",3,2,"R",2,1,1,1]
["2027-05-19",2,"R",1,2,3,1,"R"]
["2027-05-20",1,2,2,"R",1,"R",1]
["2027-05-21","R",2,2,"R",1,1,1]
["2027-05-22",2,"R","R",2,"R",2,"R"]
["2027-05-23","R","R","R",2,"R",2,"R"]
["2027-05-24","R",2,1,2,"R","R",1]
["2027-05-25",2,3,1,"R",2,1,1]
["2027-05-26",2,"R",3,1,2,1,"R"]
["2027-05-27",2,1,1,2,"R",1,"R"]
["2027-05-28",3,2,1,2,"R",1,1]
["2027-05-29","R",2,"R","R",2,"R",2]
["2027-05-30","R","R","R","R",2,"R",2]
["2027-05-31",2,"R","R",1,2,"R",1]
["2027-06-01",3,2,2,1,"R",1,1]
["2027-06-02",2,"R",2,3,1,1,"R"]
["2027-06-03",1,2,"R",1,2,"R",1]
["2027-06-04","R",2,"R",1,2,1,1]
["2027-06-05",2,"R",2,"R","R",2,"R"]
["2027-06-06","R","R",2,"R","R",2,"R"]
["2027-06-07","R",2,2,"R",1,"R",1]
["2027-06-08",2,3,"R",2,1,1,1]
["2027-06-09",2,"R",1,2,3,1,"R"]
["2027-06-10",2,1,2,"R",1,1,"R"]
["2027-06-11",3,2,2,"R",1,1,1]
["2027-06-12","R",2,"R",2,"R","R",2]
["2027-06-13","R","R","R",2,"R","R",2]
["2027-06-14",2,"R",1,2,"R","R",1]
["2027-06-15",3,2,1,"R",2,1,1]
["2027-06-16",2,"R",3,1,2,1,"R"]
["2027-06-17",1,2,1,2,"R","R",1]
["2027-06-18","R",2,1,2,"R",1,1]
["2027-06-19",2,"R","R","R",2,2,"R"]
["2027-06-20","R","R","R","R",2,2,"R"]
["2027-06-21","R",2,"R",1,2,"R",1]
["2027-06-22",2,3,2,1,"R",1,1]
["2027-06-23",2,"R",2,3,1,1,"R"]
["2027-06-24",2,1,"R",1,2,1,"R"]
["2027-06-25",3,2,"R",1,2,1,1]
["2027-06-26","R",2,2,"R","R","R",2]
["2027-06-27","R","R",2,"R","R","R",2]
["2027-06-28",2,"R",2,"R",1,"R",1]
["2027-06-29",3,2,"R",2,1,1,1]
["2027-06-30",2,"R",1,2,3,1,"R"]
["2027-07-01",1,2,2,"R",1,"R",1]
["2027-07-02","R",2,2,"R",1,1,1]
["2027-07-03",2,"R","R",2,"R",2,"R"]
["2027-07-04","R","R","R",2,"R",2,"R"]
["2027-07-05","R",2,1,2,"R","R",1]
["2027-07-06",2,3,1,"R",2,1,1]
["2027-07-07",2,"R",3,1,2,1,"R"]
["2027-07-08",2,1,1,2,"R",1,"R"]
["2027-07-09",3,2,1,2,"R",1,1]
["2027-07-10","R",2,"R","R",2,"R",2]
["2027-07-11","R","R","R","R",2,"R",2]
["2027-07-12",2,"R","R",1,2,"R",1]
["2027-07-13",3,2,2,1,"R",1,1]
["2027-07-14",2,"R",2,3,1,1,"R"]
["2027-07-15",1,2,"R",1,2,"R",1]
["2027-07-16","R",2,"R",1,2,1,1]
["2027-07-17",2,"R",2,"R","R",2,"R"]
["2027-07-18","R","R",2,"R","R",2,"R"]
["2027-07-19","R",2,2,"R",1,"R",1]
["2027-07-20",2,3,"R",2,1,1,1]
["2027-07-21",2,"R",1,2,3,1,"R"]
["2027-07-22",2,1,2,"R",1,1,"R"]
["2027-07-23",3,2,2,"R",1,1,1]
["2027-07-24","R",2,"R",2,"R","R",2]
["2027-07-25","R","R","R",2,"R","R",2]
["2027-07-26",2,"R",1,2,"R","R",1]
["2027-07-27",3,2,1,"R",2,1,1]
["2027-07-28",2,"R",3,1,2,1,"R"]
["2027-07-29",1,2,1,2,"R","R",1]
["2027-07-30","R",2,1,2,"R",1,1]
["2027-07-31",2,"R","R","R",2,2,"R"]
["2027-08-01","R","R","R","R",2,2,"R"]
["2027-08-02","R",2,"R",1,2,"R",1]
["2027-08-03",2,3,2,1,"R",1,1]
["2027-08-04",2,"R",2,3,1,1,"R"]
["2027-08-05",2,1,"R",1,2,1,"R"]
["2027-08-06",3,2,"R",1,2,1,1]
["2027-08-07","R",2,2,"R","R","R",2]
["2027-08-08","R","R",2,"R","R","R",2]
["2027-08-09",2,"R",2,"R",1,"R",1]
["2027-08-10",3,2,"R",2,1,1,1]
["2027-08-11",2,"R",1,2,3,1,"R"]
["2027-08-12",1,2,2,"R",1,"R",1]
["2027-08-13","R",2,2,"R",1,1,1]
["2027-08-14",2,"R","R",2,"R",2,"R"]
["2027-08-15","R","R","R",2,"R",2,"R"]
["2027-08-16","R",2,1,2,"R","R",1]
["2027-08-17",2,3,1,"R",2,1,1]
["2027-08-18",2,"R",3,1,2,1,"R"]
["2027-08-19",2,1,1,2,"R",1,"R"]
["2027-08-20",3,2,1,2,"R",1,1]
["2027-08-21","R",2,"R","R",2,"R",2]
["2027-08-22","R","R","R","R",2,"R",2]
["2027-08-23",2,"R","R",1,2,"R",1]
["2027-08-24",3,2,2,1,"R",1,1]
["2027-08-25",2,"R",2,3,1,1,"R"]
["2027-08-26",1,2,"R",1,2,"R",1]
["2027-08-27","R",2,"R",1,2,1,1]
["2027-08-28",2,"R",2,"R","R",2,"R"]
["2027-08-29","R","R",2,"R","R",2,"R"]
["2027-08-30","R",2,2,"R",1,"R",1]
["2027-08-31",2,3,"R",2,1,1,1]
["2027-09-01",2,"R",1,2,3,1,"R"]
["2027-09-02",2,1,2,"R",1,1,"R"]
["2027-09-03",3,2,2,"R",1,1,1]
["2027-09-04","R",2,"R",2,"R","R",2]
["2027-09-05","R","R","R",2,"R","R",2]
["2027-09-06",2,"R",1,2,"R","R",1]
["2027-09-07",3,2,1,"R",2,1,1]
["2027-09-08",2,"R",3,1,2,1,"R"]
["2027-09-09",1,2,1,2,"R","R",1]
["2027-09-10","R",2,1,2,"R",1,1]
["2027-09-11",2,"R","R","R",2,2,"R"]
["2027-09-12","R","R","R","R",2,2,"R"]
["2027-09-13","R",2,"R",1,2,"R",1]
["2027-09-14",2,3,2,1,"R",1,1]
["2027-09-15",2,"R",2,3,1,1,"R"]
["2027-09-16",2,1,"R",1,2,1,"R"]
["2027-09-17",3,2,"R",1,2,1,1]
["2027-09-18","R",2,2,"R","R","R",2]
["2027-09-19","R","R",2,"R","R","R",2]
["2027-09-20",2,"R",2,"R",1,"R",1]
["2027-09-21",3,2,"R",2,1,1,1]
["2027-09-22",2,"R",1,2,3,1,"R"]
["2027-09-23",1,2,2,"R",1,"R",1]
["2027-09-24","R",2,2,"R",1,1,1]
["2027-09-25",2,"R","R",2,"R",2,"R"]
["2027-09-26","R","R","R",2,"R",2,"R"]
["2027-09-27","R",2,1,2,"R","R",1]
["2027-09-28",2,3,1,"R",2,1,1]
["2027-09-29",2,"R",3,1,2,1,"R"]
["2027-09-30",2,1,1,2,"R",1,"R"]
["2027-10-01",3,2,1,2,"R",1,1]
["2027-10-02","R",2,"R","R",2,"R",2]
["2027-10-03","R","R","R","R",2,"R",2]
["2027-10-04",2,"R","R",1,2,"R",1]
["2027-10-05",3,2,2,1,"R",1,1]
["2027-10-06",2,"R",2,3,1,1,"R"]
["2027-10-07",1,2,"R",1,2,"R",1]
["2027-10-08","R",2,"R",1,2,1,1]
["2027-10-09",2,"R",2,"R","R",2,"R"]
["2027-10-10","R","R",2,"R","R",2,"R"]
["2027-10-11","R",2,2,"R",1,"R",1]
["2027-10-12",2,3,"R",2,1,1,1]
["2027-10-13",2,"R",1,2,3,1,"R"]
["2027-10-14",2,1,2,"R",1,1,"R"]
["2027-10-15",3,2,2,"R",1,1,1]
["2027-10-16","R",2,"R",2,"R","R",2]
["2027-10-17","R","R","R",2,"R","R",2]
["2027-10-18",2,"R",1,2,"R","R",1]
["2027-10-19",3,2,1,"R",2,1,1]
["2027-10-20",2,"R",3,1,2,1,"R"]
["2027-10-21",1,2,1,2,"R","R",1]
["2027-10-22","R",2,1,2,"R",1,1]
["2027-10-23",2,"R","R","R",2,2,"R"]
["2027-10-24","R","R","R","R",2,2,"R"]
["2027-10-25","R",2,"R",1,2,"R",1]
["2027-10-26",2,3,2,1,"R",1,1]
["2027-10-27",2,"R",2,3,1,1,"R"]
["2027-10-28",2,1,"R",1,2,1,"R"]
["2027-10-29",3,2,"R",1,2,1,1]
["2027-10-30","R",2,2,"R","R","R",2]
["2027-10-31","R","R",2,"R","R","R",2]
["2027-11-01",2,"R",2,"R",1,"R",1]
["2027-11-02",3,2,"R",2,1,1,1]
["2027-11-03",2,"R",1,2,3,1,"R"]
["2027-11-04",1,2,2,"R",1,"R",1]
["2027-11-05","R",2,2,"R",1,1,1]
["2027-11-06",2,"R","R",2,"R",2,"R"]
["2027-11-07","R","R","R",2,"R",2,"R"]
["2027-11-08","R",2,1,2,"R","R",1]
["2027-11-09",2,3,1,"R",2,1,1]
["2027-11-10",2,"R",3,1,2,1,"R"]
["2027-11-11",2,1,1,2,"R",1,"R"]
["2027-11-12",3,2,1,2,"R",1,1]
["2027-11-13","R",2,"R","R",2,"R",2]
["2027-11-14","R","R","R","R",2,"R",2]
["2027-11-15",2,"R","R",1,2,"R",1]
["2027-11-16",3,2,2,1,"R",1,1]
["2027-11-17",2,"R",2,3,1,1,"R"]
["2027-11-18",1,2,"R",1,2,"R",1]
["2027-11-19","R",2,"R",1,2,1,1]
["2027-11-20",2,"R",2,"R","R",2,"R"]
["2027-11-21","R","R",2,"R","R",2,"R"]
["2027-11-22","R",2,2,"R",1,"R",1]
["2027-11-23",2,3,"R",2,1,1,1]
["2027-11-24",2,"R",1,2,3,1,"R"]
["2027-11-25",2,1,2,"R",1,1,"R"]
["2027-11-26",3,2,2,"R",1,1,1]
["2027-11-27","R",2,"R",2,"R","R",2]
["2027-11-28","R","R","R",2,"R","R",2]
["2027-11-29",2,"R",1,2,"R","R",1]
["2027-11-30",3,2,1,"R",2,1,1]
["2027-12-01",2,"R",3,1,2,1,"R"]
["2027-12-02",1,2,1,2,"R","R",1]
["2027-12-03","R",2,1,2,"R",1,1]
["2027-12-04",2,"R","R","R",2,2,"R"]
["2027-12-05","R","R","R","R",2,2,"R"]
["2027-12-06","R",2,"R",1,2,"R",1]
["2027-12-07",2,3,2,1,"R",1,1]
["2027-12-08",2,"R",2,3,1,1,"R"]
["2027-12-09",2,1,"R",1,2,1,"R"]
["2027-12-10",3,2,"R",1,2,1,1]
["2027-12-11","R",2,2,"R","R","R",2]
["2027-12-12","R","R",2,"R","R","R",2]
["2027-12-13",2,"R",2,"R",1,"R",1]
["2027-12-14",3,2,"R",2,1,1,1]
["2027-12-15",2,"R",1,2,3,1,"R"]
["2027-12-16",1,2,2,"R",1,"R",1]
["2027-12-17","R",2,2,"R",1,1,1]
["2027-12-18",2,"R","R",2,"R",2,"R"]
["2027-12-19","R","R","R",2,"R",2,"R"]
["2027-12-20","R",2,1,2,"R","R",1]
["2027-12-21",2,3,1,"R",2,1,1]
["2027-12-22",2,"R",3,1,2,1,"R"]
["2027-12-23",2,1,1,2,"R",1,"R"]
["2027-12-24",3,2,1,2,"R",1,1]
["2027-12-25","R",2,"R","R",2,"R",2]
["2027-12-26","R","R","R","R",2,"R",2]
["2027-12-27",2,"R","R",1,2,"R",1]
["2027-12-28",3,2,2,1,"R",1,1]
["2027-12-29",2,"R",2,3,1,1,"R"]
["2027-12-30",1,2,"R",1,2,"R",1]
["2027-12-31","R",2,"R",1,2,1,1]
["2028-01-01",2,"R",2,"R","R",2,"R"]
["2028-01-02","R","R",2,"R","R",2,"R"]
["2028-01-03","R",2,2,"R",1,"R",1]
["2028-01-04",2,3,"R",2,1,1,1]
["2028-01-05",2,"R",1,2,3,1,"R"]
["2028-01-06",2,1,2,"R",1,1,"R"]
["2028-01-07",3,2,2,"R",1,1,1]
["2028-01-08","R",2,"R",2,"R","R",2]
["2028-01-09","R","R","R",2,"R","R",2]
["2028-01-10",2,"R",1,2,"R","R",1]
["2028-01-11",3,2,1,"R",2,1,1]
["2028-01-12",2,"R",3,1,2,1,"R"]
["2028-01-13",1,2,1,2,"R","R",1]
["2028-01-14","R",2,1,2,"R",1,1]
["2028-01-15",2,"R","R","R",2,2,"R"]
["2028-01-16","R","R","R","R",2,2,"R"]
["2028-01-17","R",2,"R",1,2,"R",1]
["2028-01-18",2,3,2,1,"R",1,1]
["2028-01-19",2,"R",2,3,1,1,"R"]
["2028-01-20",2,1,"R",1,2,1,"R"]
["2028-01-21",3,2,"R",1,2,1,1]
["2028-01-22","R",2,2,"R","R","R",2]
["2028-01-23","R","R",2,"R","R","R",2]
["2028-01-24",2,"R",2,"R",1,"R",1]
["2028-01-25",3,2,"R",2,1,1,1]
["2028-01-26",2,"R",1,2,3,1,"R"]
["2028-01-27",1,2,2,"R",1,"R",1]
["2028-01-28","R",2,2,"R",1,1,1]
["2028-01-29",2,"R","R",2,"R",2,"R"]
["2028-01-30","R","R","R",2,"R",2,"R"]
["2028-01-31","R",2,1,2,"R","R",1]
["2028-02-01",2,3,1,"R",2,1,1]
["2028-02-02",2,"R",3,1,2,1,"R"]
["2028-02-03",2,1,1,2,"R",1,"R"]
["2028-02-04",3,2,1,2,"R",1,1]
["2028-02-05","R",2,"R","R",2,"R",2]
["2028-02-06","R","R","R","R",2,"R",2]
["2028-02-07",2,"R","R",1,2,"R",1]
["2028-02-08",3,2,2,1,"R",1,1]
["2028-02-09",2,"R",2,3,1,1,"R"]
["2028-02-10",1,2,"R",1,2,"R",1]
["2028-02-11","R",2,"R",1,2,1,1]
["2028-02-12",2,"R",2,"R","R",2,"R"]
["2028-02-13","R","R",2,"R","R",2,"R"]
["2028-02-14","R",2,2,"R",1,"R",1]
["2028-02-15",2,3,"R",2,1,1,1]
["2028-02-16",2,"R",1,2,3,1,"R"]
["2028-02-17",2,1,2,"R",1,1,"R"]
["2028-02-18",3,2,2,"R",1,1,1]
["2028-02-19","R",2,"R",2,"R","R",2]
["2028-02-20","R","R","R",2,"R","R",2]
["2028-02-21",2,"R",1,2,"R","R",1]
["2028-02-22",3,2,1,"R",2,1,1]
["2028-02-23",2,"R",3,1,2,1,"R"]
["2028-02-24",1,2,1,2,"R","R",1]
["2028-02-25","R",2,1,2,"R",1,1]
["2028-02-26",2,"R","R","R",2,2,"R"]
["2028-02-27","R","R","R","R",2,2,"R"]
["2028-02-28","R",2,"R",1,2,"R",1]
["2028-02-29",2,3,2,1,"R",1,1]
["2028-03-01",2,"R",2,3,1,1,"R"]
["2028-03-02",2,1,"R",1,2,1,"R"]
["2028-03-03",3,2,"R",1,2,1,1]
["2028-03-04","R",2,2,"R","R","R",2]
["2028-03-05","R","R",2,"R","R","R",2]
["2028-03-06",2,"R",2,"R",1,"R",1]
["2028-03-07",3,2,"R",2,1,1,1]
["2028-03-08",2,"R",1,2,3,1,"R"]
["2028-03-09",1,2,2,"R",1,"R",1]
["2028-03-10","R",2,2,"R",1,1,1]
["2028-03-11",2,"R","R",2,"R",2,"R"]
["2028-03-12","R","R","R",2,"R",2,"R"]
["2028-03-13","R",2,1,2,"R","R",1]
["2028-03-14",2,3,1,"R",2,1,1]
["2028-03-15",2,"R",3,1,2,1,"R"]
["2028-03-16",2,1,1,2,"R",1,"R"]
["2028-03-17",3,2,1,2,"R",1,1]
["2028-03-18","R",2,"R","R",2,"R",2]
["2028-03-19","R","R","R","R",2,"R",2]
["2028-03-20",2,"R","R",1,2,"R",1]
["2028-03-21",3,2,2,1,"R",1,1]
["2028-03-22",2,"R",2,3,1,1,"R"]
["2028-03-23",1,2,"R",1,2,"R",1]
["2028-03-24","R",2,"R",1,2,1,1]
["2028-03-25",2,"R",2,"R","R",2,"R"]
["2028-03-26","R","R",2,"R","R",2,"R"]
["2028-03-27","R",2,2,"R",1,"R",1]
["2028-03-28",2,3,"R",2,1,1,1]
["2028-03-29",2,"R",1,2,3,1,"R"]
["2028-03-30",2,1,2,"R",1,1,"R"]
["2028-03-31",3,2,2,"R",1,1,1]
["2028-04-01","R",2,"R",2,"R","R",2]
["2028-04-02","R","R","R",2,"R","R",2]
["2028-04-03",2,"R",1,2,"R","R",1]
["2028-04-04",3,2,1,"R",2,1,1]
["2028-04-05",2,"R",3,1,2,1,"R"]
["2028-04-06",1,2,1,2,"R","R",1]
["2028-04-07","R",2,1,2,"R",1,1]
["2028-04-08",2,"R","R","R",2,2,"R"]
["2028-04-09","R","R","R","R",2,2,"R"]
["2028-04-10","R",2,"R",1,2,"R",1]
["2028-04-11",2,3,2,1,"R",1,1]
["2028-04-12",2,"R",2,3,1,1,"R"]
["2028-04-13",2,1,"R",1,2,1,"R"]
["2028-04-14",3,2,"R",1,2,1,1]
["2028-04-15","R",2,2,"R","R","R",2]
["2028-04-16","R","R",2,"R","R","R",2]
["2028-04-17",2,"R",2,"R",1,"R",1]
["2028-04-18",3,2,"R",2,1,1,1]
["2028-04-19",2,"R",1,2,3,1,"R"]
["2028-04-20",1,2,2,"R",1,"R",1]
["2028-04-21","R",2,2,"R",1,1,1]
["2028-04-22",2,"R","R",2,"R",2,"R"]
["2028-04-23","R","R","R",2,"R",2,"R"]
["2028-04-24","R",2,1,2,"R","R",1]
["2028-04-25",2,3,1,"R",2,1,1]
["2028-04-26",2,"R",3,1,2,1,"R"]
["2028-04-27",2,1,1,2,"R",1,"R"]
["2028-04-28",3,2,1,2,"R",1,1]
["2028-04-29","R",2,"R","R",2,"R",2]
["2028-04-30","R","R","R","R",2,"R",2]
["2028-05-01",2,"R","R",1,2,"R",1]
["2028-05-02",3,2,2,1,"R",1,1]
["2028-05-03",2,"R",2,3,1,1,"R"]
["2028-05-04",1,2,"R",1,2,"R",1]
["2028-05-05","R",2,"R",1,2,1,1]
["2028-05-06",2,"R",2,"R","R",2,"R"]
["2028-05-07","R","R",2,"R","R",2,"R"]
["2028-05-08","R",2,2,"R",1,"R",1]
["2028-05-09",2,3,"R",2,1,1,1]
["2028-05-10",2,"R",1,2,3,1,"R"]
["2028-05-11",2,1,2,"R",1,1,"R"]
["2028-05-12",3,2,2,"R",1,1,1]
["2028-05-13","R",2,"R",2,"R","R",2]
["2028-05-14","R","R","R",2,"R","R",2]
["2028-05-15",2,"R",1,2,"R","R",1]
["2028-05-16",3,2,1,"R",2,1,1]
["2028-05-17",2,"R",3,1,2,1,"R"]
["2028-05-18",1,2,1,2,"R","R",1]
["2028-05-19","R",2,1,2,"R",1,1]
["2028-05-20",2,"R","R","R",2,2,"R"]
["2028-05-21","R","R","R","R",2,2,"R"]
["2028-05-22","R",2,"R",1,2,"R",1]
["2028-05-23",2,3,2,1,"R",1,1]
["2028-05-24",2,"R",2,3,1,1,"R"]
["2028-05-25",2,1,"R",1,2,1,"R"]
["2028-05-26",3,2,"R",1,2,1,1]
["2028-05-27","R",2,2,"R","R","R",2]
["2028-05-28","R","R",2,"R","R","R",2]
["2028-05-29",2,"R",2,"R",1,"R",1]
["2028-05-30",3,2,"R",2,1,1,1]
["2028-05-31",2,"R",1,2,3,1,"R"]
["2028-06-01",1,2,2,"R",1,"R",1]
["2028-06-02","R",2,2,"R",1,1,1]
["2028-06-03",2,"R","R",2,"R",2,"R"]
["2028-06-04","R","R","R",2,"R",2,"R"]
["2028-06-05","R",2,1,2,"R","R",1]
["2028-06-06",2,3,1,"R",2,1,1]
["2028-06-07",2,"R",3,1,2,1,"R"]
["2028-06-08",2,1,1,2,"R",1,"R"]
["2028-06-09",3,2,1,2,"R",1,1]
["2028-06-10","R",2,"R","R",2,"R",2]
["2028-06-11","R","R","R","R",2,"R",2]
["2028-06-12",2,"R","R",1,2,"R",1]
["2028-06-13",3,2,2,1,"R",1,1]
["2028-06-14",2,"R",2,3,1,1,"R"]
["2028-06-15",1,2,"R",1,2,"R",1]
["2028-06-16","R",2,"R",1,2,1,1]
["2028-06-17",2,"R",2,"R","R",2,"R"]
["2028-06-18","R","R",2,"R","R",2,"R"]
["2028-06-19","R",2,2,"R",1,"R",1]
["2028-06-20",2,3,"R",2,1,1,1]
["2028-06-21",2,"R",1,2,3,1,"R"]
["2028-06-22",2,1,2,"R",1,1,"R"]
["2028-06-23",3,2,2,"R",1,1,1]
["2028-06-24","R",2,"R",2,"R","R",2]
["2028-06-25","R","R","R",2,"R","R",2]
["2028-06-26",2,"R",1,2,"R","R",1]
["2028-06-27",3,2,1,"R",2,1,1]
["2028-06-28",2,"R",3,1,2,1,"R"]
["2028-06-29",1,2,1,2,"R","R",1]
["2028-06-30","R",2,1,2,"R",1,1]
["2028-07-01",2,"R","R","R",2,2,"R"]
["2028-07-02","R","R","R","R",2,2,"R"]
["2028-07-03","R",2,"R",1,2,"R",1]
["2028-07-04",2,3,2,1,"R",1,1]
["2028-07-05",2,"R",2,3,1,1,"R"]
["2028-07-06",2,1,"R",1,2,1,"R"]
["2028-07-07",3,2,"R",1,2,1,1]
["2028-07-08","R",2,2,"R","R","R",2]
["2028-07-09","R","R",2,"R","R","R",2]
["2028-07-10",2,"R",2,"R",1,"R",1]
["2028-07-11",3,2,"R",2,1,1,1]
["2028-07-12",2,"R",1,2,3,1,"R"]
["2028-07-13",1,2,2,"R",1,"R",1]
["2028-07-14","R",2,2,"R",1,1,1]
["2028-07-15",2,"R","R",2,"R",2,"R"]
["2028-07-16","R","R","R",2,"R",2,"R"]
["2028-07-17","R",2,1,2,"R","R",1]
["2028-07-18",2,3,1,"R",2,1,1]
["2028-07-19",2,"R",3,1,2,1,"R"]
["2028-07-20",2,1,1,2,"R",1,"R"]
["2028-07-21",3,2,1,2,"R",1,1]
["2028-07-22","R",2,"R","R",2,"R",2]
["2028-07-23","R","R","R","R",2,"R",2]
["2028-07-24",2,"R","R",1,2,"R",1]
["2028-07-25",3,2,2,1,"R",1,1]
["2028-07-26",2,"R",2,3,1,1,"R"]
["2028-07-27",1,2,"R",1,2,"R",1]
["2028-07-28","R",2,"R",1,2,1,1]
["2028-07-29",2,"R",2,"R","R",2,"R"]
["2028-07-30","R","R",2,"R","R",2,"R"]
["2028-07-31","R",2,2,"R",1,"R",1]
["2028-08-01",2,3,"R",2,1,1,1]
["2028-08-02",2,"R",1,2,3,1,"R"]
["2028-08-03",2,1,2,"R",1,1,"R"]
["2028-08-04",3,2,2,"R",1,1,1]
["2028-08-05","R",2,"R",2,"R","R",2]
["2028-08-06","R","R","R",2,"R","R",2]
["2028-08-07",2,"R",1,2,"R","R",1]
["2028-08-08",3,2,1,"R",2,1,1]
["2028-08-09",2,"R",3,1,2,1,"R"]
["2028-08-10",1,2,1,2,"R","R",1]
["2028-08-11","R",2,1,2,"R",1,1]
["2028-08-12",2,"R","R","R",2,2,"R"]
["2028-08-13","R","R","R","R",2,2,"R"]
["2028-08-14","R",2,"R",1,2,"R",1]
["2028-08-15",2,3,2,1,"R",1,1]
["2028-08-16",2,"R",2,3,1,1,"R"]
["2028-08-17",2,1,"R",1,2,1,"R"]
["2028-08-18",3,2,"R",1,2,1,1]
["2028-08-19","R",2,2,"R","R","R",2]
["2028-08-20","R","R",2,"R","R","R",2]
["2028-08-21",2,"R",2,"R",1,"R",1]
["2028-08-22",3,2,"R",2,1,1,1]
["2028-08-23",2,"R",1,2,3,1,"R"]
["2028-08-24",1,2,2,"R",1,"R",1]
["2028-08-25","R",2,2,"R",1,1,1]
["2028-08-26",2,"R","R",2,"R",2,"R"]
["2028-08-27","R","R","R",2,"R",2,"R"]
["2028-08-28","R",2,1,2,"R","R",1]
["2028-08-29",2,3,1,"R",2,1,1]
["2028-08-30",2,"R",3,1,2,1,"R"]
["2028-08-31",2,1,1,2,"R",1,"R"]
["2028-09-01",3,2,1,2,"R",1,1]
["2028-09-02","R",2,"R","R",2,"R",2]
["2028-09-03","R","R","R","R",2,"R",2]
["2028-09-04",2,"R","R",1,2,"R",1]
["2028-09-05",3,2,2,1,"R",1,1]
["2028-09-06",2,"R",2,3,1,1,"R"]
["2028-09-07",1,2,"R",1,2,"R",1]
["2028-09-08","R",2,"R",1,2,1,1]
["2028-09-09",2,"R",2,"R","R",2,"R"]
["2028-09-10","R","R",2,"R","R",2,"R"]
["2028-09-11","R",2,2,"R",1,"R",1]
["2028-09-12",2,3,"R",2,1,1,1]
["2028-09-13",2,"R",1,2,3,1,"R"]
["2028-09-14",2,1,2,"R",1,1,"R"]
["2028-09-15",3,2,2,"R",1,1,1]
["2028-09-16","R",2,"R",2,"R","R",2]
["2028-09-17","R","R","R",2,"R","R",2]
["2028-09-18",2,"R",1,2,"R","R",1]
["2028-09-19",3,2,1,"R",2,1,1]
["2028-09-20",2,"R",3,1,2,1,"R"]
["2028-09-21",1,2,1,2,"R","R",1]
["2028-09-22","R",2,1,2,"R",1,1]
["2028-09-23",2,"R","R","R",2,2,"R"]
["2028-09-24","R","R","R","R",2,2,"R"]
["2028-09-25","R",2,"R",1,2,"R",1]
["2028-09-26",2,3,2,1,"R",1,1]
["2028-09-27",2,"R",2,3,1,1,"R"]
["2028-09-28",2,1,"R",1,2,1,"R"]
["2028-09-29",3,2,"R",1,2,1,1]
["2028-09-30","R",2,2,"R","R","R",2]
["2028-10-01","R","R",2,"R","R","R",2]
["2028-10-02",2,"R",2,"R",1,"R",1]
["2028-10-03",3,2,"R",2,1,1,1]
["2028-10-04",2,"R",1,2,3,1,"R"]
["2028-10-05",1,2,2,"R",1,"R",1]
["2028-10-06","R",2,2,"R",1,1,1]
["2028-10-07",2,"R","R",2,"R",2,"R"]
["2028-10-08","R","R","R",2,"R",2,"R"]
["2028-10-09","R",2,1,2,"R","R",1]
["2028-10-10",2,3,1,"R",2,1,1]
["2028-10-11",2,"R",3,1,2,1,"R"]
["2028-10-12",2,1,1,2,"R",1,"R"]
["2028-10-13",3,2,1,2,"R",1,1]
["2028-10-14","R",2,"R","R",2,"R",2]
["2028-10-15","R","R","R","R",2,"R",2]
["2028-10-16",2,"R","R",1,2,"R",1]
["2028-10-17",3,2,2,1,"R",1,1]
["2028-10-18",2,"R",2,3,1,1,"R"]
["2028-10-19",1,2,"R",1,2,"R",1]
["2028-10-20","R",2,"R",1,2,1,1]
["2028-10-21",2,"R",2,"R","R",2,"R"]
["2028-10-22","R","R",2,"R","R",2,"R"]
["2028-10-23","R",2,2,"R",1,"R",1]
["2028-10-24",2,3,"R",2,1,1,1]
["2028-10-25",2,"R",1,2,3,1,"R"]
["2028-10-26",2,1,2,"R",1,1,"R"]
["2028-10-27",3,2,2,"R",1,1,1]
["2028-10-28","R",2,"R",2,"R","R",2]
["2028-10-29","R","R","R",2,"R","R",2]
["2028-10-30",2,"R",1,2,"R","R",1]
["2028-10-31",3,2,1,"R",2,1,1]
["2028-11-01",2,"R",3,1,2,1,"R"]
["2028-11-02",1,2,1,2,"R","R",1]
["2028-11-03","R",2,1,2,"R",1,1]
["2028-11-04",2,"R","R","R",2,2,"R"]
["2028-11-05","R","R","R","R",2,2,"R"]
["2028-11-06","R",2,"R",1,2,"R",1]
["2028-11-07",2,3,2,1,"R",1,1]
["2028-11-08",2,"R",2,3,1,1,"R"]
["2028-11-09",2,1,"R",1,2,1,"R"]
["2028-11-10",3,2,"R",1,2,1,1]
["2028-11-11","R",2,2,"R","R","R",2]
["2028-11-12","R","R",2,"R","R","R",2]
["2028-11-13",2,"R",2,"R",1,"R",1]
["2028-11-14",3,2,"R",2,1,1,1]
["2028-11-15",2,"R",1,2,3,1,"R"]
["2028-11-16",1,2,2,"R",1,"R",1]
["2028-11-17","R",2,2,"R",1,1,1]
["2028-11-18",2,"R","R",2,"R",2,"R"]
["2028-11-19","R","R","R",2,"R",2,"R"]
["2028-11-20","R",2,1,2,"R","R",1]
["2028-11-21",2,3,1,"R",2,1,1]
["2028-11-22",2,"R",3,1,2,1,"R"]
["2028-11-23",2,1,1,2,"R",1,"R"]
["2028-11-24",3,2,1,2,"R",1,1]
["2028-11-25","R",2,"R","R",2,"R",2]
["2028-11-26","R","R","R","R",2,"R",2]
["2028-11-27",2,"R","R",1,2,"R",1]
["2028-11-28",3,2,2,1,"R",1,1]
["2028-11-29",2,"R",2,3,1,1,"R"]
["2028-11-30",1,2,"R",1,2,"R",1]
["2028-12-01","R",2,"R",1,2,1,1]
["2028-12-02",2,"R",2,"R","R",2,"R"]
["2028-12-03","R","R",2,"R","R",2,"R"]
["2028-12-04","R",2,2,"R",1,"R",1]
["2028-12-05",2,3,"R",2,1,1,1]
["2028-12-06",2,"R",1,2,3,1,"R"]
["2028-12-07",2,1,2,"R",1,1,"R"]
["2028-12-08",3,2,2,"R",1,1,1]
["2028-12-09","R",2,"R",2,"R","R",2]
["2028-12-10","R","R","R",2,"R","R",2]
["2028-12-11",2,"R",1,2,"R","R",1]
["2028-12-12",3,2,1,"R",2,1,1]
["2028-12-13",2,"R",3,1,2,1,"R"]
["2028-12-14",1,2,1,2,"R","R",1]
["2028-12-15","R",2,1,2,"R",1,1]
["2028-12-16",2,"R","R","R",2,2,"R"]
["2028-12-17","R","R","R","R",2,2,"R"]
["2028-12-18","R",2,"R",1,2,"R",1]
["2028-12-19",2,3,2,1,"R",1,1]
["2028-12-20",2,"R",2,3,1,1,"R"]
["2028-12-21",2,1,"R",1,2,1,"R"]
["2028-12-22",3,2,"R",1,2,1,1]
["2028-12-23","R",2,2,"R","R","R",2]
["2028-12-24","R","R",2,"R","R","R",2]
["2028-12-25",2,"R",2,"R",1,"R",1]
["2028-12-26",3,2,"R",2,1,1,1]
["2028-12-27",2,"R",1,2,3,1,"R"]
["2028-12-28",1,2,2,"R",1,"R",1]
["2028-12-29","R",2,2,"R",1,1,1]
["2028-12-30",2,"R","R",2,"R",2,"R"]
["2028-12-31","R","R","R",2,"R",2,"R"]
["2029-01-01","R",2,1,2,"R","R",1]
["2029-01-02",2,3,1,"R",2,1,1]
["2029-01-03",2,"R",3,1,2,1,"R"]
["2029-01-04",2,1,1,2,"R",1,"R"]
["2029-01-05",3,2,1,2,"R",1,1]
["2029-01-06","R",2,"R","R",2,"R",2]
["2029-01-07","R","R","R","R",2,"R",2]
["2029-01-08",2,"R","R",1,2,"R",1]
["2029-01-09",3,2,2,1,"R",1,1]
["2029-01-10",2,"R",2,3,1,1,"R"]
["2029-01-11",1,2,"R",1,2,"R",1]
["2029-01-12","R",2,"R",1,2,1,1]
["2029-01-13",2,"R",2,"R","R",2,"R"]
["2029-01-14","R","R",2,"R","R",2,"R"]
["2029-01-15","R",2,2,"R",1,"R",1]
["2029-01-16",2,3,"R",2,1,1,1]
["2029-01-17",2,"R",1,2,3,1,"R"]
["2029-01-18",2,1,2,"R",1,1,"R"]
["2029-01-19",3,2,2,"R",1,1,1]
["2029-01-20","R",2,"R",2,"R","R",2]
["2029-01-21","R","R","R",2,"R","R",2]
["2029-01-22",2,"R",1,2,"R","R",1]
["2029-01-23",3,2,1,"R",2,1,1]
["2029-01-24",2,"R",3,1,2,1,"R"]
["2029-01-25",1,2,1,2,"R","R",1]
["2029-01-26","R",2,1,2,"R",1,1]
["2029-01-27",2,"R","R","R",2,2,"R"]
["2029-01-28","R","R","R","R",2,2,"R"]
["2029-01-29","R",2,"R",1,2,"R",1]
["2029-01-30",2,3,2,1,"R",1,1]
["2029-01-31",2,"R",2,3,1,1,"R"]
["2029-02-01",2,1,"R",1,2,1,"R"]
["2029-02-02",3,2,"R",1,2,1,1]
["2029-02-03","R",2,2,"R","R","R",2]
["2029-02-04","R","R",2,"R","R","R",2]
["2029-02-05",2,"R",2,"R",1,"R",1]
["2029-02-06",3,2,"R",2,1,1,1]
["2029-02-07",2,"R",1,2,3,1,"R"]
["2029-02-08",1,2,2,"R",1,"R",1]
["2029-02-09","R",2,2,"R",1,1,1]
["2029-02-10",2,"R","R",2,"R",2,"R"]
["2029-02-11","R","R","R",2,"R",2,"R"]
["2029-02-12","R",2,1,2,"R","R",1]
["2029-02-13",2,3,1,"R",2,1,1]
["2029-02-14",2,"R",3,1,2,1,"R"]
["2029-02-15",2,1,1,2,"R",1,"R"]
["2029-02-16",3,2,1,2,"R",1,1]
["2029-02-17","R",2,"R","R",2,"R",2]
["2029-02-18","R","R","R","R",2,"R",2]
["2029-02-19",2,"R","R",1,2,"R",1]
["2029-02-20",3,2,2,1,"R",1,1]
["2029-02-21",2,"R",2,3,1,1,"R"]
["2029-02-22",1,2,"R",1,2,"R",1]
["2029-02-23","R",2,"R",1,2,1,1]
["2029-02-24",2,"R",2,"R","R",2,"R"]
["2029-02-25","R","R",2,"R","R",2,"R"]
["2029-02-26","R",2,2,"R",1,"R",1]
["2029-02-27",2,3,"R",2,1,1,1]
["2029-02-28",2,"R",1,2,3,1,"R"]
["2029-03-01",2,1,2,"R",1,1,"R"]
["2029-03-02",3,2,2,"R",1,1,1]
["2029-03-03","R",2,"R",2,"R","R",2]
["2029-03-04","R","R","R",2,"R","R",2]
["2029-03-05",2,"R",1,2,"R","R",1]
["2029-03-06",3,2,1,"R",2,1,1]
["2029-03-07",2,"R",3,1,2,1,"R"]
["2029-03-08",1,2,1,2,"R","R",1]
["2029-03-09","R",2,1,2,"R",1,1]
["2029-03-10",2,"R","R","R",2,2,"R"]
["2029-03-11","R","R","R","R",2,2,"R"]
["2029-03-12","R",2,"R",1,2,"R",1]
["2029-03-13",2,3,2,1,"R",1,1]
["2029-03-14",2,"R",2,3,1,1,"R"]
["2029-03-15",2,1,"R",1,2,1,"R"]
["2029-03-16",3,2,"R",1,2,1,1]
["2029-03-17","R",2,2,"R","R","R",2]
["2029-03-18","R","R",2,"R","R","R",2]
["2029-03-19",2,"R",2,"R",1,"R",1]
["2029-03-20",3,2,"R",2,1,1,1]
["2029-03-21",2,"R",1,2,3,1,"R"]
["2029-03-22",1,2,2,"R",1,"R",1]
["2029-03-23","R",2,2,"R",1,1,1]
["2029-03-24",2,"R","R",2,"R",2,"R"]
["2029-03-25","R","R","R",2,"R",2,"R"]
["2029-03-26","R",2,1,2,"R","R",1]
["2029-03-27",2,3,1,"R",2,1,1]
["2029-03-28",2,"R",3,1,2,1,"R"]
["2029-03-29",2,1,1,2,"R",1,"R"]
["2029-03-30",3,2,1,2,"R",1,1]
["2029-03-31","R",2,"R","R",2,"R",2]
["2029-04-01","R","R","R","R",2,"R",2]
["2029-04-02",2,"R","R",1,2,"R",1]
["2029-04-03",3,2,2,1,"R",1,1]
["2029-04-04",2,"R",2,3,1,1,"R"]
["2029-04-05",1,2,"R",1,2,"R",1]
["2029-04-06","R",2,"R",1,2,1,1]
["2029-04-07",2,"R",2,"R","R",2,"R"]
["2029-04-08","R","R",2,"R","R",2,"R"]
["2029-04-09","R",2,2,"R",1,"R",1]
["2029-04-10",2,3,"R",2,1,1,1]
["2029-04-11",2,"R",1,2,3,1,"R"]
["2029-04-12",2,1,2,"R",1,1,"R"]
["2029-04-13",3,2,2,"R",1,1,1]
["2029-04-14","R",2,"R",2,"R","R",2]
["2029-04-15","R","R","R",2,"R","R",2]
["2029-04-16",2,"R",1,2,"R","R",1]
["2029-04-17",3,2,1,"R",2,1,1]
["2029-04-18",2,"R",3,1,2,1,"R"]
["2029-04-19",1,2,1,2,"R","R",1]
["2029-04-20","R",2,1,2,"R",1,1]
["2029-04-21",2,"R","R","R",2,2,"R"]
["2029-04-22","R","R","R","R",2,2,"R"]
["2029-04-23","R",2,"R",1,2,"R",1]
["2029-04-24",2,3,2,1,"R",1,1]
["2029-04-25",2,"R",2,3,1,1,"R"]
["2029-04-26",2,1,"R",1,2,1,"R"]
["2029-04-27",3,2,"R",1,2,1,1]
["2029-04-28","R",2,2,"R","R","R",2]
["2029-04-29","R","R",2,"R","R","R",2]
["2029-04-30",2,"R",2,"R",1,"R",1]
["2029-05-01",3,2,"R",2,1,1,1]
["2029-05-02",2,"R",1,2,3,1,"R"]
["2029-05-03",1,2,2,"R",1,"R",1]
["2029-05-04","R",2,2,"R",1,1,1]
["2029-05-05",2,"R","R",2,"R",2,"R"]
["2029-05-06","R","R","R",2,"R",2,"R"]
["2029-05-07","R",2,1,2,"R","R",1]
["2029-05-08",2,3,1,"R",2,1,1]
["2029-05-09",2,"R",3,1,2,1,"R"]
["2029-05-10",2,1,1,2,"R",1,"R"]
["2029-05-11",3,2,1,2,"R",1,1]
["2029-05-12","R",2,"R","R",2,"R",2]
["2029-05-13","R","R","R","R",2,"R",2]
["2029-05-14",2,"R","R",1,2,"R",1]
["2029-05-15",3,2,2,1,"R",1,1]
["2029-05-16",2,"R",2,3,1,1,"R"]
["2029-05-17",1,2,"R",1,2,"R",1]
["2029-05-18","R",2,"R",1,2,1,1]
["2029-05-19",2,"R",2,"R","R",2,"R"]
["2029-05-20","R","R",2,"R","R",2,"R"]
["2029-05-21","R",2,2,"R",1,"R",1]
["2029-05-22",2,3,"R",2,1,1,1]
["2029-05-23",2,"R",1,2,3,1,"R"]
["2029-05-24",2,1,2,"R",1,1,"R"]
["2029-05-25",3,2,2,"R",1,1,1]
["2029-05-26","R",2,"R",2,"R","R",2]
["2029-05-27","R","R","R",2,"R","R",2]
["2029-05-28",2,"R",1,2,"R","R",1]
["2029-05-29",3,2,1,"R",2,1,1]
["2029-05-30",2,"R",3,1,2,1,"R"]
["2029-05-31",1,2,1,2,"R","R",1]
["2029-06-01","R",2,1,2,"R",1,1]
["2029-06-02",2,"R","R","R",2,2,"R"]
["2029-06-03","R","R","R","R",2,2,"R"]
["2029-06-04","R",2,"R",1,2,"R",1]
["2029-06-05",2,3,2,1,"R",1,1]
["2029-06-06",2,"R",2,3,1,1,"R"]
["2029-06-07",2,1,"R",1,2,1,"R"]
["2029-06-08",3,2,"R",1,2,1,1]
["2029-06-09","R",2,2,"R","R","R",2]
["2029-06-10","R","R",2,"R","R","R",2]
["2029-06-11",2,"R",2,"R",1,"R",1]
["2029-06-12",3,2,"R",2,1,1,1]
["2029-06-13",2,"R",1,2,3,1,"R"]
["2029-06-14",1,2,2,"R",1,"R",1]
["2029-06-15","R",2,2,"R",1,1,1]
["2029-06-16",2,"R","R",2,"R",2,"R"]
["2029-06-17","R","R","R",2,"R",2,"R"]
["2029-06-18","R",2,1,2,"R","R",1]
["2029-06-19",2,3,1,"R",2,1,1]
["2029-06-20",2,"R",3,1,2,1,"R"]
["2029-06-21",2,1,1,2,"R",1,"R"]
["2029-06-22",3,2,1,2,"R",1,1]
["2029-06-23","R",2,"R","R",2,"R",2]
["2029-06-24","R","R","R","R",2,"R",2]
["2029-06-25",2,"R","R",1,2,"R",1]
["2029-06-26",3,2,2,1,"R",1,1]
["2029-06-27",2,"R",2,3,1,1,"R"]
["2029-06-28",1,2,"R",1,2,"R",1]
["2029-06-29","R",2,"R",1,2,1,1]
["2029-06-30",2,"R",2,"R","R",2,"R"]
["2029-07-01","R","R",2,"R","R",2,"R"]
["2029-07-02","R",2,2,"R",1,"R",1]
["2029-07-03",2,3,"R",2,1,1,1]
["2029-07-04",2,"R",1,2,3,1,"R"]
["2029-07-05",2,1,2,"R",1,1,"R"]
["2029-07-06",3,2,2,"R",1,1,1]
["2029-07-07","R",2,"R",2,"R","R",2]
["2029-07-08","R","R","R",2,"R","R",2]
["2029-07-09",2,"R",1,2,"R","R",1]
["2029-07-10",3,2,1,"R",2,1,1]
["2029-07-11",2,"R",3,1,2,1,"R"]
["2029-07-12",1,2,1,2,"R","R",1]
["2029-07-13","R",2,1,2,"R",1,1]
["2029-07-14",2,"R","R","R",2,2,"R"]
["2029-07-15","R","R","R","R",2,2,"R"]
["2029-07-16","R",2,"R",1,2,"R",1]
["2029-07-17",2,3,2,1,"R",1,1]
["2029-07-18",2,"R",2,3,1,1,"R"]
["2029-07-19",2,1,"R",1,2,1,"R"]
["2029-07-20",3,2,"R",1,2,1,1]
["2029-07-21","R",2,2,"R","R","R",2]
["2029-07-22","R","R",2,"R","R","R",2]
["2029-07-23",2,"R",2,"R",1,"R",1]
["2029-07-24",3,2,"R",2,1,1,1]
["2029-07-25",2,"R",1,2,3,1,"R"]
["2029-07-26",1,2,2,"R",1,"R",1]
["2029-07-27","R",2,2,"R",1,1,1]
["2029-07-28",2,"R","R",2,"R",2,"R"]
["2029-07-29","R","R","R",2,"R",2,"R"]
["2029-07-30","R",2,1,2,"R","R",1]
["2029-07-31",2,3,1,"R",2,1,1]
["2029-08-01",2,"R",3,1,2,1,"R"]
["2029-08-02",2,1,1,2,"R",1,"R"]
["2029-08-03",3,2,1,2,"R",1,1]
["2029-08-04","R",2,"R","R",2,"R",2]
["2029-08-05","R","R","R","R",2,"R",2]
["2029-08-06",2,"R","R",1,2,"R",1]
["2029-08-07",3,2,2,1,"R",1,1]
["2029-08-08",2,"R",2,3,1,1,"R"]
["2029-08-09",1,2,"R",1,2,"R",1]
["2029-08-10","R",2,"R",1,2,1,1]
["2029-08-11",2,"R",2,"R","R",2,"R"]
["2029-08-12","R","R",2,"R","R",2,"R"]
["2029-08-13","R",2,2,"R",1,"R",1]
["2029-08-14",2,3,"R",2,1,1,1]
["2029-08-15",2,"R",1,2,3,1,"R"]
["2029-08-16",2,1,2,"R",1,1,"R"]
["2029-08-17",3,2,2,"R",1,1,1]
["2029-08-18","R",2,"R",2,"R","R",2]
["2029-08-19","R","R","R",2,"R","R",2]
["2029-08-20",2,"R",1,2,"R","R",1]
["2029-08-21",3,2,1,"R",2,1,1]
["2029-08-22",2,"R",3,1,2,1,"R"]
["2029-08-23",1,2,1,2,"R","R",1]
["2029-08-24","R",2,1,2,"R",1,1]
["2029-08-25",2,"R","R","R",2,2,"R"]
["2029-08-26","R","R","R","R",2,2,"R"]
["2029-08-27","R",2,"R",1,2,"R",1]
["2029-08-28",2,3,2,1,"R",1,1]
["2029-08-29",2,"R",2,3,1,1,"R"]
["2029-08-30",2,1,"R",1,2,1,"R"]
["2029-08-31",3,2,"R",1,2,1,1]
["2029-09-01","R",2,2,"R","R","R",2]
["2029-09-02","R","R",2,"R","R","R",2]
["2029-09-03",2,"R",2,"R",1,"R",1]
["2029-09-04",3,2,"R",2,1,1,1]
["2029-09-05",2,"R",1,2,3,1,"R"]
["2029-09-06",1,2,2,"R",1,"R",1]
["2029-09-07","R",2,2,"R",1,1,1]
["2029-09-08",2,"R","R",2,"R",2,"R"]
["2029-09-09","R","R","R",2,"R",2,"R"]
["2029-09-10","R",2,1,2,"R","R",1]
["2029-09-11",2,3,1,"R",2,1,1]
["2029-09-12",2,"R",3,1,2,1,"R"]
["2029-09-13",2,1,1,2,"R",1,"R"]
["2029-09-14",3,2,1,2,"R",1,1]
["2029-09-15","R",2,"R","R",2,"R",2]
["2029-09-16","R","R","R","R",2,"R",2]
["2029-09-17",2,"R","R",1,2,"R",1]
["2029-09-18",3,2,2,1,"R",1,1]
["2029-09-19",2,"R",2,3,1,1,"R"]
["2029-09-20",1,2,"R",1,2,"R",1]
["2029-09-21","R",2,"R",1,2,1,1]
["2029-09-22",2,"R",2,"R","R",2,"R"]
["2029-09-23","R","R",2,"R","R",2,"R"]
["2029-09-24","R",2,2,"R",1,"R",1]
["2029-09-25",2,3,"R",2,1,1,1]
["2029-09-26",2,"R",1,2,3,1,"R"]
["2029-09-27",2,1,2,"R",1,1,"R"]
["2029-09-28",3,2,2,"R",1,1,1]
["2029-09-29","R",2,"R",2,"R","R",2]
["2029-09-30","R","R","R",2,"R","R",2]
["2029-10-01",2,"R",1,2,"R","R",1]
["2029-10-02",3,2,1,"R",2,1,1]
["2029-10-03",2,"R",3,1,2,1,"R"]
["2029-10-04",1,2,1,2,"R","R",1]
["2029-10-05","R",2,1,2,"R",1,1]
["2029-10-06",2,"R","R","R",2,2,"R"]
["2029-10-07","R","R","R","R",2,2,"R"]
["2029-10-08","R",2,"R",1,2,"R",1]
["2029-10-09",2,3,2,1,"R",1,1]
["2029-10-10",2,"R",2,3,1,1,"R"]
["2029-10-11",2,1,"R",1,2,1,"R"]
["2029-10-12",3,2,"R",1,2,1,1]
["2029-10-13","R",2,2,"R","R","R",2]
["2029-10-14","R","R",2,"R","R","R",2]
["2029-10-15",2,"R",2,"R",1,"R",1]
["2029-10-16",3,2,"R",2,1,1,1]
["2029-10-17",2,"R",1,2,3,1,"R"]
["2029-10-18",1,2,2,"R",1,"R",1]
["2029-10-19","R",2,2,"R",1,1,1]
["2029-10-20",2,"R","R",2,"R",2,"R"]
["2029-10-21","R","R","R",2,"R",2,"R"]
["2029-10-22","R",2,1,2,"R","R",1]
["2029-10-23",2,3,1,"R",2,1,1]
["2029-10-24",2,"R",3,1,2,1,"R"]
["2029-10-25",2,1,1,2,"R",1,"R"]
["2029-10-26",3,2,1,2,"R",1,1]
["2029-10-27","R",2,"R","R",2,"R",2]
["2029-10-28","R","R","R","R",2,"R",2]
["2029-10-29",2,"R","R",1,2,"R",1]
["2029-10-30",3,2,2,1,"R",1,1]
["2029-10-31",2,"R",2,3,1,1,"R"]
["2029-11-01",1,2,"R",1,2,"R",1]
["2029-11-02","R",2,"R",1,2,1,1]
["2029-11-03",2,"R",2,"R","R",2,"R"]
["2029-11-04","R","R",2,"R","R",2,"R"]
["2029-11-05","R",2,2,"R",1,"R",1]
["2029-11-06",2,3,"R",2,1,1,1]
["2029-11-07",2,"R",1,2,3,1,"R"]
["2029-11-08",2,1,2,"R",1,1,"R"]
["2029-11-09",3,2,2,"R",1,1,1]
["2029-11-10","R",2,"R",2,"R","R",2]
["2029-11-11","R","R","R",2,"R","R",2]
["2029-11-12",2,"R",1,2,"R","R",1]
["2029-11-13",3,2,1,"R",2,1,1]
["2029-11-14",2,"R",3,1,2,1,"R"]
["2029-11-15",1,2,1,2,"R","R",1]
["2029-11-16","R",2,1,2,"R",1,1]
["2029-11-17",2,"R","R","R",2,2,"R"]
["2029-11-18","R","R","R","R",2,2,"R"]
["2029-11-19","R",2,"R",1,2,"R",1]
["2029-11-20",2,3,2,1,"R",1,1]
["2029-11-21",2,"R",2,3,1,1,"R"]
["2029-11-22",2,1,"R",1,2,1,"R"]
["2029-11-23",3,2,"R",1,2,1,1]
["2029-11-24","R",2,2,"R","R","R",2]
["2029-11-25","R","R",2,"R","R","R",2]
["2029-11-26",2,"R",2,"R",1,"R",1]
["2029-11-27",3,2,"R",2,1,1,1]
["2029-11-28",2,"R",1,2,3,1,"R"]
["2029-11-29",1,2,2,"R",1,"R",1]
["2029-11-30","R",2,2,"R",1,1,1]
["2029-12-01",2,"R","R",2,"R",2,"R"]
["2029-12-02","R","R","R",2,"R",2,"R"]
["2029-12-03","R",2,1,2,"R","R",1]
["2029-12-04",2,3,1,"R",2,1,1]
["2029-12-05",2,"R",3,1,2,1,"R"]
["2029-12-06",2,1,1,2,"R",1,"R"]
["2029-12-07",3,2,1,2,"R",1,1]
["2029-12-08","R",2,"R","R",2,"R",2]
["2029-12-09","R","R","R","R",2,"R",2]
["2029-12-10",2,"R","R",1,2,"R",1]
["2029-12-11",3,2,2,1,"R",1,1]
["2029-12-12",2,"R",2,3,1,1,"R"]
["2029-12-13",1,2,"R",1,2,"R",1]
["2029-12-14","R",2,"R",1,2,1,1]
["2029-12-15",2,"R",2,"R","R",2,"R"]
["2029-12-16","R","R",2,"R","R",2,"R"]
["2029-12-17","R",2,2,"R",1,"R",1]
["2029-12-18",2,3,"R",2,1,1,1]
["2029-12-19",2,"R",1,2,3,1,"R"]
["2029-12-20",2,1,2,"R",1,1,"R"]
["2029-12-21",3,2,2,"R",1,1,1]
["2029-12-22","R",2,"R",2,"R","R",2]
["2029-12-23","R","R","R",2,"R","R",2]
["2029-12-24",2,"R",1,2,"R","R",1]
["2029-12-25",3,2,1,"R",2,1,1]
["2029-12-26",2,"R",3,1,2,1,"R"]
["2029-12-27",1,2,1,2,"R","R",1]
["2029-12-28","R",2,1,2,"R",1,1]
["2029-12-29",2,"R","R","R",2,2,"R"]
["2029-12-30","R","R","R","R",2,2,"R"]
["2029-12-31","R",2,"R",1,2,"R",1]
["2030-01-01",2,3,2,1,"R",1,1]
["2030-01-02",2,"R",2,3,1,1,"R"]
["2030-01-03",2,1,"R",1,2,1,"R"]
["2030-01-04",3,2,"R",1,2,1,1]
["2030-01-05","R",2,2,"R","R","R",2]
["2030-01-06","R","R",2,"R","R","R",2]
["2030-01-07",2,"R",2,"R",1,"R",1]
["2030-01-08",3,2,"R",2,1,1,1]
["2030-01-09",2,"R",1,2,3,1,"R"]
["2030-01-10",1,2,2,"R",1,"R",1]
["2030-01-11","R",2,2,"R",1,1,1]
["2030-01-12",2,"R","R",2,"R",2,"R"]
["2030-01-13","R","R","R",2,"R",2,"R"]
["2030-01-14","R",2,1,2,"R","R",1]
["2030-01-15",2,3,1,"R",2,1,1]
["2030-01-16",2,"R",3,1,2,1,"R"]
["2030-01-17",2,1,1,2,"R",1,"R"]
["2030-01-18",3,2,1,2,"R",1,1]
["2030-01-19","R",2,"R","R",2,"R",2]
["2030-01-20","R","R","R","R",2,"R",2]
["2030-01-21",2,"R","R",1,2,"R",1]
["2030-01-22",3,2,2,1,"R",1,1]
["2030-01-23",2,"R",2,3,1,1,"R"]
["2030-01-24",1,2,"R",1,2,"R",1]
["2030-01-25","R",2,"R",1,2,1,1]
["2030-01-26",2,"R",2,"R","R",2,"R"]
["2030-01-27","R","R",2,"R","R",2,"R"]
["2030-01-28","R",2,2,"R",1,"R",1]
["2030-01-29",2,3,"R",2,1,1,1]
["2030-01-30",2,"R",1,2,3,1,"R"]
["2030-01-31",2,1,2,"R",1,1,"R"]
["2030-02-01",3,2,2,"R",1,1,1]
["2030-02-02","R",2,"R",2,"R","R",2]
["2030-02-03","R","R","R",2,"R","R",2]
["2030-02-04",2,"R",1,2,"R","R",1]
["2030-02-05",3,2,1,"R",2,1,1]
["2030-02-06",2,"R",3,1,2,1,"R"]
["2030-02-07",1,2,1,2,"R","R",1]
["2030-02-08","R",2,1,2,"R",1,1]
["2030-02-09",2,"R","R","R",2,2,"R"]
["2030-02-10","R","R","R","R",2,2,"R"]
["2030-02-11","R",2,"R",1,2,"R",1]
["2030-02-12",2,3,2,1,"R",1,1]
["2030-02-13",2,"R",2,3,1,1,"R"]
["2030-02-14",2,1,"R",1,2,1,"R"]
["2030-02-15",3,2,"R",1,2,1,1]
["2030-02-16","R",2,2,"R","R","R",2]
["2030-02-17","R","R",2,"R","R","R",2]
["2030-02-18",2,"R",2,"R",1,"R",1]
["2030-02-19",3,2,"R",2,1,1,1]
["2030-02-20",2,"R",1,2,3,1,"R"]
["2030-02-21",1,2,2,"R",1,"R",1]
["2030-02-22","R",2,2,"R",1,1,1]
["2030-02-23",2,"R","R",2,"R",2,"R"]
["2030-02-24","R","R","R",2,"R",2,"R"]
["2030-02-25","R",2,1,2,"R","R",1]
["2030-02-26",2,3,1,"R",2,1,1]
["2030-02-27",2,"R",3,1,2,1,"R"]
["2030-02-28",2,1,1,2,"R",1,"R"]
["2030-03-01",3,2,1,2,"R",1,1]
["2030-03-02","R",2,"R","R",2,"R",2]
["2030-03-03","R","R","R","R",2,"R",2]
["2030-03-04",2,"R","R",1,2,"R",1]
["2030-03-05",3,2,2,1,"R",1,1]
["2030-03-06",2,"R",2,3,1,1,"R"]
["2030-03-07",1,2,"R",1,2,"R",1]
["2030-03-08","R",2,"R",1,2,1,1]
["2030-03-09",2,"R",2,"R","R",2,"R"]
["2030-03-10","R","R",2,"R","R",2,"R"]
["2030-03-11","R",2,2,"R",1,"R",1]
["2030-03-12",2,3,"R",2,1,1,1]
["2030-03-13",2,"R",1,2,3,1,"R"]
["2030-03-14",2,1,2,"R",1,1,"R"]
["2030-03-15",3,2,2,"R",1,1,1]
["2030-03-16","R",2,"R",2,"R","R",2]
["2030-03-17","R","R","R",2,"R","R",2]
["2030-03-18",2,"R",1,2,"R","R",1]
["2030-03-19",3,2,1,"R",2,1,1]
["2030-03-20",2,"R",3,1,2,1,"R"]
["2030-03-21",1,2,1,2,"R","R",1]
["2030-03-22","R",2,1,2,"R",1,1]
["2030-03-23",2,"R","R","R",2,2,"R"]
["2030-03-24","R","R","R","R",2,2,"R"]
["2030-03-25","R",2,"R",1,2,"R",1]
["2030-03-26",2,3,2,1,"R",1,1]
["2030-03-27",2,"R",2,3,1,1,"R"]
["2030-03-28",2,1,"R",1,2,1,"R"]
["2030-03-29",3,2,"R",1,2,1,1]
["2030-03-30","R",2,2,"R","R","R",2]
["2030-03-31","R","R",2,"R","R","R",2]
["2030-04-01",2,"R",2,"R",1,"R",1]
["2030-04-02",3,2,"R",2,1,1,1]
["2030-04-03",2,"R",1,2,3,1,"R"]
["2030-04-04",1,2,2,"R",1,"R",1]
["2030-04-05","R",2,2,"R",1,1,1]
["2030-04-06",2,"R","R",2,"R",2,"R"]
["2030-04-07","R","R","R",2,"R",2,"R"]
["2030-04-08","R",2,1,2,"R","R",1]
["2030-04-09",2,3,1,"R",2,1,1]
["2030-04-10",2,"R",3,1,2,1,"R"]
["2030-04-11",2,1,1,2,"R",1,"R"]
["2030-04-12",3,2,1,2,"R",1,1]
["2030-04-13","R",2,"R","R",2,"R",2]
["2030-04-14","R","R","R","R",2,"R",2]
["2030-04-15",2,"R","R",1,2,"R",1]
["2030-04-16",3,2,2,1,"R",1,1]
["2030-04-17",2,"R",2,3,1,1,"R"]
["2030-04-18",1,2,"R",1,2,"R",1]
["2030-04-19","R",2,"R",1,2,1,1]
["2030-04-20",2,"R",2,"R","R",2,"R"]
["2030-04-21","R","R",2,"R","R",2,"R"]
["2030-04-22","R",2,2,"R",1,"R",1]
["2030-04-23",2,3,"R",2,1,1,1]
["2030-04-24",2,"R",1,2,3,1,"R"]
["2030-04-25",2,1,2,"R",1,1,"R"]
["2030-04-26",3,2,2,"R",1,1,1]
["2030-04-27","R",2,"R",2,"R","R",2]
["2030-04-28","R","R","R",2,"R","R",2]
["2030-04-29",2,"R",1,2,"R","R",1]
["2030-04-30",3,2,1,"R",2,1,1]
["2030-05-01",2,"R",3,1,2,1,"R"]
["2030-05-02",1,2,1,2,"R","R",1]
["2030-05-03","R",2,1,2,"R",1,1]
["2030-05-04",2,"R","R","R",2,2,"R"]
["2030-05-05","R","R","R","R",2,2,"R"]
["2030-05-06","R",2,"R",1,2,"R",1]
["2030-05-07",2,3,2,1,"R",1,1]
["2030-05-08",2,"R",2,3,1,1,"R"]
["2030-05-09",2,1,"R",1,2,1,"R"]
["2030-05-10",3,2,"R",1,2,1,1]
["2030-05-11","R",2,2,"R","R","R",2]
["2030-05-12","R","R",2,"R","R","R",2]
["2030-05-13",2,"R",2,"R",1,"R",1]
["2030-05-14",3,2,"R",2,1,1,1]
["2030-05-15",2,"R",1,2,3,1,"R"]
["2030-05-16",1,2,2,"R",1,"R",1]
["2030-05-17","R",2,2,"R",1,1,1]
["2030-05-18",2,"R","R",2,"R",2,"R"]
["2030-05-19","R","R","R",2,"R",2,"R"]
["2030-05-20","R",2,1,2,"R","R",1]
["2030-05-21",2,3,1,"R",2,1,1]
["2030-05-22",2,"R",3,1,2,1,"R"]
["2030-05-23",2,1,1,2,"R",1,"R"]
["2030-05-24",3,2,1,2,"R",1,1]
["2030-05-25","R",2,"R","R",2,"R",2]
["2030-05-26","R","R","R","R",2,"R",2]
["2030-05-27",2,"R","R",1,2,"R",1]
["2030-05-28",3,2,2,1,"R",1,1]
["2030-05-29",2,"R",2,3,1,1,"R"]
["2030-05-30",1,2,"R",1,2,"R",1]
["2030-05-31","R",2,"R",1,2,1,1]
["2030-06-01",2,"R",2,"R","R",2,"R"]
["2030-06-02","R","R",2,"R","R",2,"R"]
["2030-06-03","R",2,2,"R",1,"R",1]
["2030-06-04",2,3,"R",2,1,1,1]
["2030-06-05",2,"R",1,2,3,1,"R"]
["2030-06-06",2,1,2,"R",1,1,"R"]
["2030-06-07",3,2,2,"R",1,1,1]
["2030-06-08","R",2,"R",2,"R","R",2]
["2030-06-09","R","R","R",2,"R","R",2]
["2030-06-10",2,"R",1,2,"R","R",1]
["2030-06-11",3,2,1,"R",2,1,1]
["2030-06-12",2,"R",3,1,2,1,"R"]
["2030-06-13",1,2,1,2,"R","R",1]
["2030-06-14","R",2,1,2,"R",1,1]
["2030-06-15",2,"R","R","R",2,2,"R"]
["2030-06-16","R","R","R","R",2,2,"R"]
["2030-06-17","R",2,"R",1,2,"R",1]
["2030-06-18",2,3,2,1,"R",1,1]
["2030-06-19",2,"R",2,3,1,1,"R"]
["2030-06-20",2,1,"R",1,2,1,"R"]
["2030-06-21",3,2,"R",1,2,1,1]
["2030-06-22","R",2,2,"R","R","R",2]
["2030-06-23","R","R",2,"R","R","R",2]
["2030-06-24",2,"R",2,"R",1,"R",1]
["2030-06-25",3,2,"R",2,1,1,1]
["2030-06-26",2,"R",1,2,3,1,"R"]
["2030-06-27",1,2,2,"R",1,"R",1]
["2030-06-28","R",2,2,"R",1,1,1]
["2030-06-29",2,"R","R",2,"R",2,"R"]
["2030-06-30","R","R","R",2,"R",2,"R"]
["2030-07-01","R",2,1,2,"R","R",1]
["2030-07-02",2,3,1,"R",2,1,1]
["2030-07-03",2,"R",3,1,2,1,"R"]
["2030-07-04",2,1,1,2,"R",1,"R"]
["2030-07-05",3,2,1,2,"R",1,1]
["2030-07-06","R",2,"R","R",2,"R",2]
["2030-07-07","R","R","R","R",2,"R",2]
["2030-07-08",2,"R","R",1,2,"R",1]
["2030-07-09",3,2,2,1,"R",1,1]
["2030-07-10",2,"R",2,3,1,1,"R"]
["2030-07-11",1,2,"R",1,2,"R",1]
["2030-07-12","R",2,"R",1,2,1,1]
["2030-07-13",2,"R",2,"R","R",2,"R"]
["2030-07-14","R","R",2,"R","R",2,"R"]
["2030-07-15","R",2,2,"R",1,"R",1]
["2030-07-16",2,3,"R",2,1,1,1]
["2030-07-17",2,"R",1,2,3,1,"R"]
["2030-07-18",2,1,2,"R",1,1,"R"]
["2030-07-19",3,2,2,"R",1,1,1]
["2030-07-20","R",2,"R",2,"R","R",2]
["2030-07-21","R","R","R",2,"R","R",2]
["2030-07-22",2,"R",1,2,"R","R",1]
["2030-07-23",3,2,1,"R",2,1,1]
["2030-07-24",2,"R",3,1,2,1,"R"]
["2030-07-25",1,2,1,2,"R","R",1]
["2030-07-26","R",2,1,2,"R",1,1]
["2030-07-27",2,"R","R","R",2,2,"R"]
["2030-07-28","R","R","R","R",2,2,"R"]
["2030-07-29","R",2,"R",1,2,"R",1]
["2030-07-30",2,3,2,1,"R",1,1]
["2030-07-31",2,"R",2,3,1,1,"R"]
["2030-08-01",2,1,"R",1,2,1,"R"]
["2030-08-02",3,2,"R",1,2,1,1]
["2030-08-03","R",2,2,"R","R","R",2]
["2030-08-04","R","R",2,"R","R","R",2]
["2030-08-05",2,"R",2,"R",1,"R",1]
["2030-08-06",3,2,"R",2,1,1,1]
["2030-08-07",2,"R",1,2,3,1,"R"]
["2030-08-08",1,2,2,"R",1,"R",1]
["2030-08-09","R",2,2,"R",1,1,1]
["2030-08-10",2,"R","R",2,"R",2,"R"]
["2030-08-11","R","R","R",2,"R",2,"R"]
["2030-08-12","R",2,1,2,"R","R",1]
["2030-08-13",2,3,1,"R",2,1,1]
["2030-08-14",2,"R",3,1,2,1,"R"]
["2030-08-15",2,1,1,2,"R",1,"R"]
["2030-08-16",3,2,1,2,"R",1,1]
["2030-08-17","R",2,"R","R",2,"R",2]
["2030-08-18","R","R","R","R",2,"R",2]
["2030-08-19",2,"R","R",1,2,"R",1]
["2030-08-20",3,2,2,1,"R",1,1]
["2030-08-21",2,"R",2,3,1,1,"R"]
["2030-08-22",1,2,"R",1,2,"R",1]
["2030-08-23","R",2,"R",1,2,1,1]
["2030-08-24",2,"R",2,"R","R",2,"R"]
["2030-08-25","R","R",2,"R","R",2,"R"]
["2030-08-26","R",2,2,"R",1,"R",1]
["2030-08-27",2,3,"R",2,1,1,1]
["2030-08-28",2,"R",1,2,3,1,"R"]
["2030-08-29",2,1,2,"R",1,1,"R"]
["2030-08-30",3,2,2,"R",1,1,1]
["2030-08-31","R",2,"R",2,"R","R",2]
["2030-09-01","R","R","R",2,"R","R",2]
["2030-09-02",2,"R",1,2,"R","R",1]
["2030-09-03",3,2,1,"R",2,1,1]
["2030-09-04",2,"R",3,1,2,1,"R"]
["2030-09-05",1,2,1,2,"R","R",1]
["2030-09-06","R",2,1,2,"R",1,1]
["2030-09-07",2,"R","R","R",2,2,"R"]
["2030-09-08","R","R","R","R",2,2,"R"]
["2030-09-09","R",2,"R",1,2,"R",1]
["2030-09-10",2,3,2,1,"R",1,1]
["2030-09-11",2,"R",2,3,1,1,"R"]
["2030-09-12",2,1,"R",1,2,1,"R"]
["2030-09-13",3,2,"R",1,2,1,1]
["2030-09-14","R",2,2,"R","R","R",2]
["2030-09-15","R","R",2,"R","R","R",2]
["2030-09-16",2,"R",2,"R",1,"R",1]
["2030-09-17",3,2,"R",2,1,1,1]
["2030-09-18",2,"R",1,2,3,1,"R"]
["2030-09-19",1,2,2,"R",1,"R",1]
["2030-09-20","R",2,2,"R",1,1,1]
["2030-09-21",2,"R","R",2,"R",2,"R"]
["2030-09-22","R","R","R",2,"R",2,"R"]
["2030-09-23","R",2,1,2,"R","R",1]
["2030-09-24",2,3,1,"R",2,1,1]
["2030-09-25",2,"R",3,1,2,1,"R"]
["2030-09-26",2,1,1,2,"R",1,"R"]
["2030-09-27",3,2,1,2,"R",1,1]
["2030-09-28","R",2,"R","R",2,"R",2]
["2030-09-29","R","R","R","R",2,"R",2]
["2030-09-30",2,"R","R",1,2,"R",1]
["2030-10-01",3,2,2,1,"R",1,1]
["2030-10-02",2,"R",2,3,1,1,"R"]
["2030-10-03",1,2,"R",1,2,"R",1]
["2030-10-04","R",2,"R",1,2,1,1]
["2030-10-05",2,"R",2,"R","R",2,"R"]
["2030-10-06","R","R",2,"R","R",2,"R"]
["2030-10-07","R",2,2,"R",1,"R",1]
["2030-10-08",2,3,"R",2,1,1,1]
["2030-10-09",2,"R",1,2,3,1,"R"]
["2030-10-10",2,1,2,"R",1,1,"R"]
["2030-10-11",3,2,2,"R",1,1,1]
["2030-10-12","R",2,"R",2,"R","R",2]
["2030-10-13","R","R","R",2,"R","R",2]
["2030-10-14",2,"R",1,2,"R","R",1]
["2030-10-15",3,2,1,"R",2,1,1]
["2030-10-16",2,"R",3,1,2,1,"R"]
["2030-10-17",1,2,1,2,"R","R",1]
["2030-10-18","R",2,1,2,"R",1,1]
["2030-10-19",2,"R","R","R",2,2,"R"]
["2030-10-20","R","R","R","R",2,2,"R"]
["2030-10-21","R",2,"R",1,2,"R",1]
["2030-10-22",2,3,2,1,"R",1,1]
["2030-10-23",2,"R",2,3,1,1,"R"]
["2030-10-24",2,1,"R",1,2,1,"R"]
["2030-10-25",3,2,"R",1,2,1,1]
["2030-10-26","R",2,2,"R","R","R",2]
["2030-10-27","R","R",2,"R","R","R",2]
["2030-10-28",2,"R",2,"R",1,"R",1]
["2030-10-29",3,2,"R",2,1,1,1]
["2030-10-30",2,"R",1,2,3,1,"R"]
["2030-10-31",1,2,2,"R",1,"R",1]
["2030-11-01","R",2,2,"R",1,1,1]
["2030-11-02",2,"R","R",2,"R",2,"R"]
["2030-11-03","R","R","R",2,"R",2,"R"]
["2030-11-04","R",2,1,2,"R","R",1]
["2030-11-05",2,3,1,"R",2,1,1]
["2030-11-06",2,"R",3,1,2,1,"R"]
["2030-11-07",2,1,1,2,"R",1,"R"]
["2030-11-08",3,2,1,2,"R",1,1]
["2030-11-09","R",2,"R","R",2,"R",2]
["2030-11-10","R","R","R","R",2,"R",2]
["2030-11-11",2,"R","R",1,2,"R",1]
["2030-11-12",3,2,2,1,"R",1,1]
["2030-11-13",2,"R",2,3,1,1,"R"]
["2030-11-14",1,2,"R",1,2,"R",1]
["2030-11-15","R",2,"R",1,2,1,1]
["2030-11-16",2,"R",2,"R","R",2,"R"]
["2030-11-17","R","R",2,"R","R",2,"R"]
["2030-11-18","R",2,2,"R",1,"R",1]
["2030-11-19",2,3,"R",2,1,1,1]
["2030-11-20",2,"R",1,2,3,1,"R"]
["2030-11-21",2,1,2,"R",1,1,"R"]
["2030-11-22",3,2,2,"R",1,1,1]
["2030-11-23","R",2,"R",2,"R","R",2]
["2030-11-24","R","R","R",2,"R","R",2]
["2030-11-25",2,"R",1,2,"R","R",1]
["2030-11-26",3,2,1,"R",2,1,1]
["2030-11-27",2,"R",3,1,2,1,"R"]
["2030-11-28",1,2,1,2,"R","R",1]
["2030-11-29","R",2,1,2,"R",1,1]
["2030-11-30",2,"R","R","R",2,2,"R"]
["2030-12-01","R","R","R","R",2,2,"R"]
["2030-12-02","R",2,"R",1,2,"R",1]
["2030-12-03",2,3,2,1,"R",1,1]
["2030-12-04",2,"R",2,3,1,1,"R"]
["2030-12-05",2,1,"R",1,2,1,"R"]
["2030-12-06",3,2,"R",1,2,1,1]
["2030-12-07","R",2,2,"R","R","R",2]
["2030-12-08","R","R",2,"R","R","R",2]
["2030-12-09",2,"R",2,"R",1,"R",1]
["2030-12-10",3,2,"R",2,1,1,1]
["2030-12-11",2,"R",1,2,3,1,"R"]
["2030-12-12",1,2,2,"R",1,"R",1]
["2030-12-13","R",2,2,"R",1,1,1]
["2030-12-14",2,"R","R",2,"R",2,"R"]
["2030-12-15","R","R","R",2,"R",2,"R"]
["2030-12-16","R",2,1,2,"R","R",1]
["2030-12-17",2,3,1,"R",2,1,1]
["2030-12-18",2,"R",3,1,2,1,"R"]
["2030-12-19",2,1,1,2,"R",1,"R"]
["2030-12-20",3,2,1,2,"R",1,1]
["2030-12-21","R",2,"R","R",2,"R",2]
["2030-12-22","R","R","R","R",2,"R",2]
["2030-12-23",2,"R","R",1,2,"R",1]
["2030-12-24",3,2,2,1,"R",1,1]
["2030-12-25",2,"R",2,3,1,1,"R"]
["2030-12-26",1,2,"R",1,2,"R",1]
["2030-12-27","R",2,"R",1,2,1,1]
["2030-12-28",2,"R",2,"R","R",2,"R"]
["2030-12-29","R","R",2,"R","R",2,"R"]
["2030-12-30","R",2,2,"R",1,"R",1]
["2030-12-31",2,3,"R",2,1,1,1]
["2031-01-01",2,"R",1,2,3,1,"R"]
["2031-01-02",2,1,2,"R",1,1,"R"]
["2031-01-03",3,2,2,"R",1,1,1]
["2031-01-04","R",2,"R",2,"R","R",2]
["2031-01-05","R","R","R",2,"R","R",2]
["2031-01-06",2,"R",1,2,"R","R",1]
["2031-01-07",3,2,1,"R",2,1,1]
["2031-01-08",2,"R",3,1,2,1,"R"]
["2031-01-09",1,2,1,2,"R","R",1]
["2031-01-10","R",2,1,2,"R",1,1]
["2031-01-11",2,"R","R","R",2,2,"R"]
["2031-01-12","R","R","R","R",2,2,"R"]
["2031-01-13","R",2,"R",1,2,"R",1]
["2031-01-14",2,3,2,1,"R",1,1]
["2031-01-15",2,"R",2,3,1,1,"R"]
["2031-01-16",2,1,"R",1,2,1,"R"]
["2031-01-17",3,2,"R",1,2,1,1]
["2031-01-18","R",2,2,"R","R","R",2]
["2031-01-19","R","R",2,"R","R","R",2]
["2031-01-20",2,"R",2,"R",1,"R",1]
["2031-01-21",3,2,"R",2,1,1,1]
["2031-01-22",2,"R",1,2,3,1,"R"]
["2031-01-23",1,2,2,"R",1,"R",1]
["2031-01-24","R",2,2,"R",1,1,1]
["2031-01-25",2,"R","R",2,"R",2,"R"]
["2031-01-26","R","R","R",2,"R",2,"R"]
["2031-01-27","R",2,1,2,"R","R",1]
["2031-01-28",2,3,1,"R",2,1,1]
["2031-01-29",2,"R",3,1,2,1,"R"]
["2031-01-30",2,1,1,2,"R",1,"R"]
["2031-01-31",3,2,1,2,"R",1,1]
["2031-02-01","R",2,"R","R",2,"R",2]
["2031-02-02","R","R","R","R",2,"R",2]
["2031-02-03",2,"R","R",1,2,"R",1]
["2031-02-04",3,2,2,1,"R",1,1]
["2031-02-05",2,"R",2,3,1,1,"R"]
["2031-02-06",1,2,"R",1,2,"R",1]
["2031-02-07","R",2,"R",1,2,1,1]
["2031-02-08",2,"R",2,"R","R",2,"R"]
["2031-02-09","R","R",2,"R","R",2,"R"]
["2031-02-10","R",2,2,"R",1,"R",1]
["2031-02-11",2,3,"R",2,1,1,1]
["2031-02-12",2,"R",1,2,3,1,"R"]
["2031-02-13",2,1,2,"R",1,1,"R"]
["2031-02-14",3,2,2,"R",1,1,1]
["2031-02-15","R",2,"R",2,"R","R",2]
["2031-02-16","R","R","R",2,"R","R",2]
["2031-02-17",2,"R",1,2,"R","R",1]
["2031-02-18",3,2,1,"R",2,1,1]
["2031-02-19",2,"R",3,1,2,1,"R"]
["2031-02-20",1,2,1,2,"R","R",1]
["2031-02-21","R",2,1,2,"R",1,1]
["2031-02-22",2,"R","R","R",2,2,"R"]
["2031-02-23","R","R","R","R",2,2,"R"]
["2031-02-24","R",2,"R",1,2,"R",1]
["2031-02-25",2,3,2,1,"R",1,1]
["2031-02-26",2,"R",2,3,1,1,"R"]
["2031-02-27",2,1,"R",1,2,1,"R"]
["2031-02-28",3,2,"R",1,2,1,1]
["2031-03-01","R",2,2,"R","R","R",2]
["2031-03-02","R","R",2,"R","R","R",2]
["2031-03-03",2,"R",2,"R",1,"R",1]
["2031-03-04",3,2,"R",2,1,1,1]
["2031-03-05",2,"R",1,2,3,1,"R"]
["2031-03-06",1,2,2,"R",1,"R",1]
["2031-03-07","R",2,2,"R",1,1,1]
["2031-03-08",2,"R","R",2,"R",2,"R"]
["2031-03-09","R","R","R",2,"R",2,"R"]
["2031-03-10","R",2,1,2,"R","R",1]
["2031-03-11",2,3,1,"R",2,1,1]
["2031-03-12",2,"R",3,1,2,1,"R"]
["2031-03-13",2,1,1,2,"R",1,"R"]
["2031-03-14",3,2,1,2,"R",1,1]
["2031-03-15","R",2,"R","R",2,"R",2]
["2031-03-16","R","R","R","R",2,"R",2]
["2031-03-17",2,"R","R",1,2,"R",1]
["2031-03-18",3,2,2,1,"R",1,1]
["2031-03-19",2,"R",2,3,1,1,"R"]
["2031-03-20",1,2,"R",1,2,"R",1]
["2031-03-21","R",2,"R",1,2,1,1]
["2031-03-22",2,"R",2,"R","R",2,"R"]
["2031-03-23","R","R",2,"R","R",2,"R"]
["2031-03-24","R",2,2,"R",1,"R",1]
["2031-03-25",2,3,"R",2,1,1,1]
["2031-03-26",2,"R",1,2,3,1,"R"]
["2031-03-27",2,1,2,"R",1,1,"R"]
["2031-03-28",3,2,2,"R",1,1,1]
["2031-03-29","R",2,"R",2,"R","R",2]
["2031-03-30","R","R","R",2,"R","R",2]
["2031-03-31",2,"R",1,2,"R","R",1]
["2031-04-01",3,2,1,"R",2,1,1]
["2031-04-02",2,"R",3,1,2,1,"R"]
["2031-04-03",1,2,1,2,"R","R",1]
["2031-04-04","R",2,1,2,"R",1,1]
["2031-04-05",2,"R","R","R",2,2,"R"]
["2031-04-06","R","R","R","R",2,2,"R"]
["2031-04-07","R",2,"R",1,2,"R",1]
["2031-04-08",2,3,2,1,"R",1,1]
["2031-04-09",2,"R",2,3,1,1,"R"]
["2031-04-10",2,1,"R",1,2,1,"R"]
["2031-04-11",3,2,"R",1,2,1,1]
["2031-04-12","R",2,2,"R","R","R",2]
["2031-04-13","R","R",2,"R","R","R",2]
["2031-04-14",2,"R",2,"R",1,"R",1]
["2031-04-15",3,2,"R",2,1,1,1]
["2031-04-16",2,"R",1,2,3,1,"R"]
["2031-04-17",1,2,2,"R",1,"R",1]
["2031-04-18","R",2,2,"R",1,1,1]
["2031-04-19",2,"R","R",2,"R",2,"R"]
["2031-04-20","R","R","R",2,"R",2,"R"]
["2031-04-21","R",2,1,2,"R","R",1]
["2031-04-22",2,3,1,"R",2,1,1]
["2031-04-23",2,"R",3,1,2,1,"R"]
["2031-04-24",2,1,1,2,"R",1,"R"]
["2031-04-25",3,2,1,2,"R",1,1]
["2031-04-26","R",2,"R","R",2,"R",2]
["2031-04-27","R","R","R","R",2,"R",2]
["2031-04-28",2,"R","R",1,2,"R",1]
["2031-04-29",3,2,2,1,"R",1,1]
["2031-04-30",2,"R",2,3,1,1,"R"]
["2031-05-01",1,2,"R",1,2,"R",1]
["2031-05-02","R",2,"R",1,2,1,1]
["2031-05-03",2,"R",2,"R","R",2,"R"]
["2031-05-04","R","R",2,"R","R",2,"R"]
["2031-05-05","R",2,2,"R",1,"R",1]
["2031-05-06",2,3,"R",2,1,1,1]
["2031-05-07",2,"R",1,2,3,1,"R"]
["2031-05-08",2,1,2,"R",1,1,"R"]
["2031-05-09",3,2,2,"R",1,1,1]
["2031-05-10","R",2,"R",2,"R","R",2]
["2031-05-11","R","R","R",2,"R","R",2]
["2031-05-12",2,"R",1,2,"R","R",1]
["2031-05-13",3,2,1,"R",2,1,1]
["2031-05-14",2,"R",3,1,2,1,"R"]
["2031-05-15",1,2,1,2,"R","R",1]
["2031-05-16","R",2,1,2,"R",1,1]
["2031-05-17",2,"R","R","R",2,2,"R"]
["2031-05-18","R","R","R","R",2,2,"R"]
["2031-05-19","R",2,"R",1,2,"R",1]
["2031-05-20",2,3,2,1,"R",1,1]
["2031-05-21",2,"R",2,3,1,1,"R"]
["2031-05-22",2,1,"R",1,2,1,"R"]
["2031-05-23",3,2,"R",1,2,1,1]
["2031-05-24","R",2,2,"R","R","R",2]
["2031-05-25","R","R",2,"R","R","R",2]
["2031-05-26",2,"R",2,"R",1,"R",1]
["2031-05-27",3,2,"R",2,1,1,1]
["2031-05-28",2,"R",1,2,3,1,"R"]
["2031-05-29",1,2,2,"R",1,"R",1]
["2031-05-30","R",2,2,"R",1,1,1]
["2031-05-31",2,"R","R",2,"R",2,"R"]
["2031-06-01","R","R","R",2,"R",2,"R"]
["2031-06-02","R",2,1,2,"R","R",1]
["2031-06-03",2,3,1,"R",2,1,1]
["2031-06-04",2,"R",3,1,2,1,"R"]
["2031-06-05",2,1,1,2,"R",1,"R"]
["2031-06-06",3,2,1,2,"R",1,1]
["2031-06-07","R",2,"R","R",2,"R",2]
["2031-06-08","R","R","R","R",2,"R",2]
["2031-06-09",2,"R","R",1,2,"R",1]
["2031-06-10",3,2,2,1,"R",1,1]
["2031-06-11",2,"R",2,3,1,1,"R"]
["2031-06-12",1,2,"R",1,2,"R",1]
["2031-06-13","R",2,"R",1,2,1,1]
["2031-06-14",2,"R",2,"R","R",2,"R"]
["2031-06-15","R","R",2,"R","R",2,"R"]
["2031-06-16","R",2,2,"R",1,"R",1]
["2031-06-17",2,3,"R",2,1,1,1]
["2031-06-18",2,"R",1,2,3,1,"R"]
["2031-06-19",2,1,2,"R",1,1,"R"]
["2031-06-20",3,2,2,"R",1,1,1]
["2031-06-21","R",2,"R",2,"R","R",2]
["2031-06-22","R","R","R",2,"R","R",2]
["2031-06-23",2,"R",1,2,"R","R",1]
["2031-06-24",3,2,1,"R",2,1,1]
["2031-06-25",2,"R",3,1,2,1,"R"]
["2031-06-26",1,2,1,2,"R","R",1]
["2031-06-27","R",2,1,2,"R",1,1]
["2031-06-28",2,"R","R","R",2,2,"R"]
["2031-06-29","R","R","R","R",2,2,"R"]
["2031-06-30","R",2,"R",1,2,"R",1]
["2031-07-01",2,3,2,1,"R",1,1]
["2031-07-02",2,"R",2,3,1,1,"R"]
["2031-07-03",2,1,"R",1,2,1,"R"]
["2031-07-04",3,2,"R",1,2,1,1]
["2031-07-05","R",2,2,"R","R","R",2]
["2031-07-06","R","R",2,"R","R","R",2]
["2031-07-07",2,"R",2,"R",1,"R",1]
["2031-07-08",3,2,"R",2,1,1,1]
["2031-07-09",2,"R",1,2,3,1,"R"]
["2031-07-10",1,2,2,"R",1,"R",1]
["2031-07-11","R",2,2,"R",1,1,1]
["2031-07-12",2,"R","R",2,"R",2,"R"]
["2031-07-13","R","R","R",2,"R",2,"R"]
["2031-07-14","R",2,1,2,"R","R",1]
["2031-07-15",2,3,1,"R",2,1,1]
["2031-07-16",2,"R",3,1,2,1,"R"]
["2031-07-17",2,1,1,2,"R",1,"R"]
["2031-07-18",3,2,1,2,"R",1,1]
["2031-07-19","R",2,"R","R",2,"R",2]
["2031-07-20","R","R","R","R",2,"R",2]
["2031-07-21",2,"R","R",1,2,"R",1]
["2031-07-22",3,2,2,1,"R",1,1]
["2031-07-23",2,"R",2,3,1,1,"R"]
["2031-07-24",1,2,"R",1,2,"R",1]
["2031-07-25","R",2,"R",1,2,1,1]
["2031-07-26",2,"R",2,"R","R",2,"R"]
["2031-07-27","R","R",2,"R","R",2,"R"]
["2031-07-28","R",2,2,"R",1,"R",1]
["2031-07-29",2,3,"R",2,1,1,1]
["2031-07-30",2,"R",1,2,3,1,"R"]
["2031-07-31",2,1,2,"R",1,1,"R"]
["2031-08-01",3,2,2,"R",1,1,1]
["2031-08-02","R",2,"R",2,"R","R",2]
["2031-08-03","R","R","R",2,"R","R",2]
["2031-08-04",2,"R",1,2,"R","R",1]
["2031-08-05",3,2,1,"R",2,1,1]
["2031-08-06",2,"R",3,1,2,1,"R"]
["2031-08-07",1,2,1,2,"R","R",1]
["2031-08-08","R",2,1,2,"R",1,1]
["2031-08-09",2,"R","R","R",2,2,"R"]
["2031-08-10","R","R","R","R",2,2,"R"]
["2031-08-11","R",2,"R",1,2,"R",1]
["2031-08-12",2,3,2,1,"R",1,1]
["2031-08-13",2,"R",2,3,1,1,"R"]
["2031-08-14",2,1,"R",1,2,1,"R"]
["2031-08-15",3,2,"R",1,2,1,1]
["2031-08-16","R",2,2,"R","R","R",2]
["2031-08-17","R","R",2,"R","R","R",2]
["2031-08-18",2,"R",2,"R",1,"R",1]
["2031-08-19",3,2,"R",2,1,1,1]
["2031-08-20",2,"R",1,2,3,1,"R"]
["2031-08-21",1,2,2,"R",1,"R",1]
["2031-08-22","R",2,2,"R",1,1,1]
["2031-08-23",2,"R","R",2,"R",2,"R"]
["2031-08-24","R","R","R",2,"R",2,"R"]
["2031-08-25","R",2,1,2,"R","R",1]
["2031-08-26",2,3,1,"R",2,1,1]
["2031-08-27",2,"R",3,1,2,1,"R"]
["2031-08-28",2,1,1,2,"R",1,"R"]
["2031-08-29",3,2,1,2,"R",1,1]
["2031-08-30","R",2,"R","R",2,"R",2]
["2031-08-31","R","R","R","R",2,"R",2]
["2031-09-01",2,"R","R",1,2,"R",1]
["2031-09-02",3,2,2,1,"R",1,1]
["2031-09-03",2,"R",2,3,1,1,"R"]
["2031-09-04",1,2,"R",1,2,"R",1]
["2031-09-05","R",2,"R",1,2,1,1]
["2031-09-06",2,"R",2,"R","R",2,"R"]
["2031-09-07","R","R",2,"R","R",2,"R"]
["2031-09-08","R",2,2,"R",1,"R",1]
["2031-09-09",2,3,"R",2,1,1,1]
["2031-09-10",2,"R",1,2,3,1,"R"]
["2031-09-11",2,1,2,"R",1,1,"R"]
["2031-09-12",3,2,2,"R",1,1,1]
["2031-09-13","R",2,"R",2,"R","R",2]
["2031-09-14","R","R","R",2,"R","R",2]
["2031-09-15",2,"R",1,2,"R","R",1]
["2031-09-16",3,2,1,"R",2,1,1]
["2031-09-17",2,"R",3,1,2,1,"R"]
["2031-09-18",1,2,1,2,"R","R",1]
["2031-09-19","R",2,1,2,"R",1,1]
["2031-09-20",2,"R","R","R",2,2,"R"]
["2031-09-21","R","R","R","R",2,2,"R"]
["2031-09-22","R",2,"R",1,2,"R",1]
["2031-09-23",2,3,2,1,"R",1,1]
["2031-09-24",2,"R",2,3,1,1,"R"]
["2031-09-25",2,1,"R",1,2,1,"R"]
["2031-09-26",3,2,"R",1,2,1,1]
["2031-09-27","R",2,2,"R","R","R",2]
["2031-09-28","R","R",2,"R","R","R",2]
["2031-09-29",2,"R",2,"R",1,"R",1]
["2031-09-30",3,2,"R",2,1,1,1]
["2031-10-01",2,"R",1,2,3,1,"R"]
["2031-10-02",1,2,2,"R",1,"R",1]
["2031-10-03","R",2,2,"R",1,1,1]
["2031-10-04",2,"R","R",2,"R",2,"R"]
["2031-10-05","R","R","R",2,"R",2,"R"]
["2031-10-06","R",2,1,2,"R","R",1]
["2031-10-07",2,3,1,"R",2,1,1]
["2031-10-08",2,"R",3,1,2,1,"R"]
["2031-10-09",2,1,1,2,"R",1,"R"]
["2031-10-10",3,2,1,2,"R",1,1]
["2031-10-11","R",2,"R","R",2,"R",2]
["2031-10-12","R","R","R","R",2,"R",2]
["2031-10-13",2,"R","R",1,2,"R",1]
["2031-10-14",3,2,2,1,"R",1,1]
["2031-10-15",2,"R",2,3,1,1,"R"]
["2031-10-16",1,2,"R",1,2,"R",1]
["2031-10-17","R",2,"R",1,2,1,1]
["2031-10-18",2,"R",2,"R","R",2,"R"]
["2031-10-19","R","R",2,"R","R",2,"R"]
["2031-10-20","R",2,2,"R",1,"R",1]
["2031-10-21",2,3,"R",2,1,1,1]
["2031-10-22",2,"R",1,2,3,1,"R"]
["2031-10-23",2,1,2,"R",1,1,"R"]
["2031-10-24",3,2,2,"R",1,1,1]
["2031-10-25","R",2,"R",2,"R","R",2]
["2031-10-26","R","R","R",2,"R","R",2]
["2031-10-27",2,"R",1,2,"R","R",1]
["2031-10-28",3,2,1,"R",2,1,1]
["2031-10-29",2,"R",3,1,2,1,"R"]
["2031-10-30",1,2,1,2,"R","R",1]
["2031-10-31","R",2,1,2,"R",1,1]
["2031-11-01",2,"R","R","R",2,2,"R"]
["2031-11-02","R","R","R","R",2,2,"R"]
["2031-11-03","R",2,"R",1,2,"R",1]
["2031-11-04",2,3,2,1,"R",1,1]
["2031-11-05",2,"R",2,3,1,1,"R"]
["2031-11-06",2,1,"R",1,2,1,"R"]
["2031-11-07",3,2,"R",1,2,1,1]
["2031-11-08","R",2,2,"R","R","R",2]
["2031-11-09","R","R",2,"R","R","R",2]
["2031-11-10",2,"R",2,"R",1,"R",1]
["2031-11-11",3,2,"R",2,1,1,1]
["2031-11-12",2,"R",1,2,3,1,"R"]
["2031-11-13",1,2,2,"R",1,"R",1]
["2031-11-14","R",2,2,"R",1,1,1]
["2031-11-15",2,"R","R",2,"R",2,"R"]
["2031-11-16","R","R","R",2,"R",2,"R"]
["2031-11-17","R",2,1,2,"R","R",1]
["2031-11-18",2,3,1,"R",2,1,1]
["2031-11-19",2,"R",3,1,2,1,"R"]
["2031-11-20",2,1,1,2,"R",1,"R"]
["2031-11-21",3,2,1,2,"R",1,1]
["2031-11-22","R",2,"R","R",2,"R",2]
["2031-11-23","R","R","R","R",2,"R",2]
["2031-11-24",2,"R","R",1,2,"R",1]
["2031-11-25",3,2,2,1,"R",1,1]
["2031-11-26",2,"R",2,3,1,1,"R"]
["2031-11-27",1,2,"R",1,2,"R",1]
["2031-11-28","R",2,"R",1,2,1,1]
["2031-11-29",2,"R",2,"R","R",2,"R"]
["2031-11-30","R","R",2,"R","R",2,"R"]
["2031-12-01","R",2,2,"R",1,"R",1]
["2031-12-02",2,3,"R",2,1,1,1]
["2031-12-03",2,"R",1,2,3,1,"R"]
["2031-12-04",2,1,2,"R",1,1,"R"]
["2031-12-05",3,2,2,"R",1,1,1]
["2031-12-06","R",2,"R",2,"R","R",2]
["2031-12-07","R","R","R",2,"R","R",2]
["2031-12-08",2,"R",1,2,"R","R",1]
["2031-12-09",3,2,1,"R",2,1,1]
["2031-12-10",2,"R",3,1,2,1,"R"]
["2031-12-11",1,2,1,2,"R","R",1]
["2031-12-12","R",2,1,2,"R",1,1]
["2031-12-13",2,"R","R","R",2,2,"R"]
["2031-12-14","R","R","R","R",2,2,"R"]
["2031-12-15","R",2,"R",1,2,"R",1]
["2031-12-16",2,3,2,1,"R",1,1]
["2031-12-17",2,"R",2,3,1,1,"R"]
["2031-12-18",2,1,"R",1,2,1,"R"]
["2031-12-19",3,2,"R",1,2,1,1]
["2031-12-20","R",2,2,"R","R","R",2]
["2031-12-21","R","R",2,"R","R","R",2]
["2031-12-22",2,"R",2,"R",1,"R",1]
["2031-12-23",3,2,"R",2,1,1,1]
["2031-12-24",2,"R",1,2,3,1,"R"]
["2031-12-25",1,2,2,"R",1,"R",1]
["2031-12-26","R",2,2,"R",1,1,1]
["2031-12-27",2,"R","R",2,"R",2,"R"]
["2031-12-28","R","R","R",2,"R",2,"R"]
["2031-12-29","R",2,1,2,"R","R",1]
["2031-12-30",2,3,1,"R",2,1,1]
["2031-12-31",2,"R",3,1,2,1,"R"]
["2032-01-01",2,1,1,2,"R",1,"R"]
["2032-01-02",3,2,1,2,"R",1,1]
["2032-01-03","R",2,"R","R",2,"R",2]
["2032-01-04","R","R","R","R",2,"R",2]
["2032-01-05",2,"R","R",1,2,"R",1]
["2032-01-06",3,2,2,1,"R",1,1]
["2032-01-07",2,"R",2,3,1,1,"R"]
["2032-01-08",1,2,"R",1,2,"R",1]
["2032-01-09","R",2,"R",1,2,1,1]
["2032-01-10",2,"R",2,"R","R",2,"R"]
["2032-01-11","R","R",2,"R","R",2,"R"]
["2032-01-12","R",2,2,"R",1,"R",1]
["2032-01-13",2,3,"R",2,1,1,1]
["2032-01-14",2,"R",1,2,3,1,"R"]
["2032-01-15",2,1,2,"R",1,1,"R"]
["2032-01-16",3,2,2,"R",1,1,1]
["2032-01-17","R",2,"R",2,"R","R",2]
["2032-01-18","R","R","R",2,"R","R",2]
["2032-01-19",2,"R",1,2,"R","R",1]
["2032-01-20",3,2,1,"R",2,1,1]
["2032-01-21",2,"R",3,1,2,1,"R"]
["2032-01-22",1,2,1,2,"R","R",1]
["2032-01-23","R",2,1,2,"R",1,1]
["2032-01-24",2,"R","R","R",2,2,"R"]
["2032-01-25","R","R","R","R",2,2,"R"]
["2032-01-26","R",2,"R",1,2,"R",1]
["2032-01-27",2,3,2,1,"R",1,1]
["2032-01-28",2,"R",2,3,1,1,"R"]
["2032-01-29",2,1,"R",1,2,1,"R"]
["2032-01-30",3,2,"R",1,2,1,1]
["2032-01-31","R",2,2,"R","R","R",2]
["2032-02-01","R","R",2,"R","R","R",2]
["2032-02-02",2,"R",2,"R",1,"R",1]
["2032-02-03",3,2,"R",2,1,1,1]
["2032-02-04",2,"R",1,2,3,1,"R"]
["2032-02-05",1,2,2,"R",1,"R",1]
["2032-02-06","R",2,2,"R",1,1,1]
["2032-02-07",2,"R","R",2,"R",2,"R"]
["2032-02-08","R","R","R",2,"R",2,"R"]
["2032-02-09","R",2,1,2,"R","R",1]
["2032-02-10",2,3,1,"R",2,1,1]
["2032-02-11",2,"R",3,1,2,1,"R"]
["2032-02-12",2,1,1,2,"R",1,"R"]
["2032-02-13",3,2,1,2,"R",1,1]
["2032-02-14","R",2,"R","R",2,"R",2]
["2032-02-15","R","R","R","R",2,"R",2]
["2032-02-16",2,"R","R",1,2,"R",1]
["2032-02-17",3,2,2,1,"R",1,1]
["2032-02-18",2,"R",2,3,1,1,"R"]
["2032-02-19",1,2,"R",1,2,"R",1]
["2032-02-20","R",2,"R",1,2,1,1]
["2032-02-21",2,"R",2,"R","R",2,"R"]
["2032-02-22","R","R",2,"R","R",2,"R"]
["2032-02-23","R",2,2,"R",1,"R",1]
["2032-02-24",2,3,"R",2,1,1,1]
["2032-02-25",2,"R",1,2,3,1,"R"]
["2032-02-26",2,1,2,"R",1,1,"R"]
["2032-02-27",3,2,2,"R",1,1,1]
["2032-02-28","R",2,"R",2,"R","R",2]
["2032-02-29","R","R","R",2,"R","R",2]
["2032-03-01",2,"R",1,2,"R","R",1]
["2032-03-02",3,2,1,"R",2,1,1]
["2032-03-03",2,"R",3,1,2,1,"R"]
["2032-03-04",1,2,1,2,"R","R",1]
["2032-03-05","R",2,1,2,"R",1,1]
["2032-03-06",2,"R","R","R",2,2,"R"]
["2032-03-07","R","R","R","R",2,2,"R"]
["2032-03-08","R",2,"R",1,2,"R",1]
["2032-03-09",2,3,2,1,"R",1,1]
["2032-03-10",2,"R",2,3,1,1,"R"]
["2032-03-11",2,1,"R",1,2,1,"R"]
["2032-03-12",3,2,"R",1,2,1,1]
["2032-03-13","R",2,2,"R","R","R",2]
["2032-03-14","R","R",2,"R","R","R",2]
["2032-03-15",2,"R",2,"R",1,"R",1]
["2032-03-16",3,2,"R",2,1,1,1]
["2032-03-17",2,"R",1,2,3,1,"R"]
["2032-03-18",1,2,2,"R",1,"R",1]
["2032-03-19","R",2,2,"R",1,1,1]
["2032-03-20",2,"R","R",2,"R",2,"R"]
["2032-03-21","R","R","R",2,"R",2,"R"]
["2032-03-22","R",2,1,2,"R","R",1]
["2032-03-23",2,3,1,"R",2,1,1]
["2032-03-24",2,"R",3,1,2,1,"R"]
["2032-03-25",2,1,1,2,"R",1,"R"]
["2032-03-26",3,2,1,2,"R",1,1]
["2032-03-27","R",2,"R","R",2,"R",2]
["2032-03-28","R","R","R","R",2,"R",2]
["2032-03-29",2,"R","R",1,2,"R",1]
["2032-03-30",3,2,2,1,"R",1,1]
["2032-03-31",2,"R",2,3,1,1,"R"]
["2032-04-01",1,2,"R",1,2,"R",1]
["2032-04-02","R",2,"R",1,2,1,1]
["2032-04-03",2,"R",2,"R","R",2,"R"]
["2032-04-04","R","R",2,"R","R",2,"R"]
["2032-04-05","R",2,2,"R",1,"R",1]
["2032-04-06",2,3,"R",2,1,1,1]
["2032-04-07",2,"R",1,2,3,1,"R"]
["2032-04-08",2,1,2,"R",1,1,"R"]
["2032-04-09",3,2,2,"R",1,1,1]
["2032-04-10","R",2,"R",2,"R","R",2]
["2032-04-11","R","R","R",2,"R","R",2]
["2032-04-12",2,"R",1,2,"R","R",1]
["2032-04-13",3,2,1,"R",2,1,1]
["2032-04-14",2,"R",3,1,2,1,"R"]
["2032-04-15",1,2,1,2,"R","R",1]
["2032-04-16","R",2,1,2,"R",1,1]
["2032-04-17",2,"R","R","R",2,2,"R"]
["2032-04-18","R","R","R","R",2,2,"R"]
["2032-04-19","R",2,"R",1,2,"R",1]
["2032-04-20",2,3,2,1,"R",1,1]
["2032-04-21",2,"R",2,3,1,1,"R"]
["2032-04-22",2,1,"R",1,2,1,"R"]
["2032-04-23",3,2,"R",1,2,1,1]
["2032-04-24","R",2,2,"R","R","R",2]
["2032-04-25","R","R",2,"R","R","R",2]
["2032-04-26",2,"R",2,"R",1,"R",1]
["2032-04-27",3,2,"R",2,1,1,1]
["2032-04-28",2,"R",1,2,3,1,"R"]
["2032-04-29",1,2,2,"R",1,"R",1]
["2032-04-30","R",2,2,"R",1,1,1]
["2032-05-01",2,"R","R",2,"R",2,"R"]
["2032-05-02","R","R","R",2,"R",2,"R"]
["2032-05-03","R",2,1,2,"R","R",1]
["2032-05-04",2,3,1,"R",2,1,1]
["2032-05-05",2,"R",3,1,2,1,"R"]
["2032-05-06",2,1,1,2,"R",1,"R"]
["2032-05-07",3,2,1,2,"R",1,1]
["2032-05-08","R",2,"R","R",2,"R",2]
["2032-05-09","R","R","R","R",2,"R",2]
["2032-05-10",2,"R","R",1,2,"R",1]
["2032-05-11",3,2,2,1,"R",1,1]
["2032-05-12",2,"R",2,3,1,1,"R"]
["2032-05-13",1,2,"R",1,2,"R",1]
["2032-05-14","R",2,"R",1,2,1,1]
["2032-05-15",2,"R",2,"R","R",2,"R"]
["2032-05-16","R","R",2,"R","R",2,"R"]
["2032-05-17","R",2,2,"R",1,"R",1]
["2032-05-18",2,3,"R",2,1,1,1]
["2032-05-19",2,"R",1,2,3,1,"R"]
["2032-05-20",2,1,2,"R",1,1,"R"]
["2032-05-21",3,2,2,"R",1,1,1]
["2032-05-22","R",2,"R",2,"R","R",2]
["2032-05-23","R","R","R",2,"R","R",2]
["2032-05-24",2,"R",1,2,"R","R",1]
["2032-05-25",3,2,1,"R",2,1,1]
["2032-05-26",2,"R",3,1,2,1,"R"]
["2032-05-27",1,2,1,2,"R","R",1]
["2032-05-28","R",2,1,2,"R",1,1]
["2032-05-29",2,"R","R","R",2,2,"R"]
["2032-05-30","R","R","R","R",2,2,"R"]
["2032-05-31","R",2,"R",1,2,"R",1]
["2032-06-01",2,3,2,1,"R",1,1]
["2032-06-02",2,"R",2,3,1,1,"R"]
["2032-06-03",2,1,"R",1,2,1,"R"]
["2032-06-04",3,2,"R",1,2,1,1]
["2032-06-05","R",2,2,"R","R","R",2]
["2032-06-06","R","R",2,"R","R","R",2]
["2032-06-07",2,"R",2,"R",1,"R",1]
["2032-06-08",3,2,"R",2,1,1,1]
["2032-06-09",2,"R",1,2,3,1,"R"]
["2032-06-10",1,2,2,"R",1,"R",1]
["2032-06-11","R",2,2,"R",1,1,1]
["2032-06-12",2,"R","R",2,"R",2,"R"]
["2032-06-13","R","R","R",2,"R",2,"R"]
["2032-06-14","R",2,1,2,"R","R",1]
["2032-06-15",2,3,1,"R",2,1,1]
["2032-06-16",2,"R",3,1,2,1,"R"]
["2032-06-17",2,1,1,2,"R",1,"R"]
["2032-06-18",3,2,1,2,"R",1,1]
["2032-06-19","R",2,"R","R",2,"R",2]
["2032-06-20","R","R","R","R",2,"R",2]
["2032-06-21",2,"R","R",1,2,"R",1]
["2032-06-22",3,2,2,1,"R",1,1]
["2032-06-23",2,"R",2,3,1,1,"R"]
["2032-06-24",1,2,"R",1,2,"R",1]
["2032-06-25","R",2,"R",1,2,1,1]
["2032-06-26",2,"R",2,"R","R",2,"R"]
["2032-06-27","R","R",2,"R","R",2,"R"]
["2032-06-28","R",2,2,"R",1,"R",1]
["2032-06-29",2,3,"R",2,1,1,1]
["2032-06-30",2,"R",1,2,3,1,"R"]
["2032-07-01",2,1,2,"R",1,1,"R"]
["2032-07-02",3,2,2,"R",1,1,1]
["2032-07-03","R",2,"R",2,"R","R",2]
["2032-07-04","R","R","R",2,"R","R",2]
["2032-07-05",2,"R",1,2,"R","R",1]
["2032-07-06",3,2,1,"R",2,1,1]
["2032-07-07",2,"R",3,1,2,1,"R"]
["2032-07-08",1,2,1,2,"R","R",1]
["2032-07-09","R",2,1,2,"R",1,1]
["2032-07-10",2,"R","R","R",2,2,"R"]
["2032-07-11","R","R","R","R",2,2,"R"]
["2032-07-12","R",2,"R",1,2,"R",1]
["2032-07-13",2,3,2,1,"R",1,1]
["2032-07-14",2,"R",2,3,1,1,"R"]
["2032-07-15",2,1,"R",1,2,1,"R"]
["2032-07-16",3,2,"R",1,2,1,1]
["2032-07-17","R",2,2,"R","R","R",2]
["2032-07-18","R","R",2,"R","R","R",2]
["2032-07-19",2,"R",2,"R",1,"R",1]
["2032-07-20",3,2,"R",2,1,1,1]
["2032-07-21",2,"R",1,2,3,1,"R"]
["2032-07-22",1,2,2,"R",1,"R",1]
["2032-07-23","R",2,2,"R",1,1,1]
["2032-07-24",2,"R","R",2,"R",2,"R"]
["2032-07-25","R","R","R",2,"R",2,"R"]
["2032-07-26","R",2,1,2,"R","R",1]
["2032-07-27",2,3,1,"R",2,1,1]
["2032-07-28",2,"R",3,1,2,1,"R"]
["2032-07-29",2,1,1,2,"R",1,"R"]
["2032-07-30",3,2,1,2,"R",1,1]
["2032-07-31","R",2,"R","R",2,"R",2]
["2032-08-01","R","R","R","R",2,"R",2]
["2032-08-02",2,"R","R",1,2,"R",1]
["2032-08-03",3,2,2,1,"R",1,1]
["2032-08-04",2,"R",2,3,1,1,"R"]
["2032-08-05",1,2,"R",1,2,"R",1]
["2032-08-06","R",2,"R",1,2,1,1]
["2032-08-07",2,"R",2,"R","R",2,"R"]
["2032-08-08","R","R",2,"R","R",2,"R"]
["2032-08-09","R",2,2,"R",1,"R",1]
["2032-08-10",2,3,"R",2,1,1,1]
["2032-08-11",2,"R",1,2,3,1,"R"]
["2032-08-12",2,1,2,"R",1,1,"R"]
["2032-08-13",3,2,2,"R",1,1,1]
["2032-08-14","R",2,"R",2,"R","R",2]
["2032-08-15","R","R","R",2,"R","R",2]
["2032-08-16",2,"R",1,2,"R","R",1]
["2032-08-17",3,2,1,"R",2,1,1]
["2032-08-18",2,"R",3,1,2,1,"R"]
["2032-08-19",1,2,1,2,"R","R",1]
["2032-08-20","R",2,1,2,"R",1,1]
["2032-08-21",2,"R","R","R",2,2,"R"]
["2032-08-22","R","R","R","R",2,2,"R"]
["2032-08-23","R",2,"R",1,2,"R",1]
["2032-08-24",2,3,2,1,"R",1,1]
["2032-08-25",2,"R",2,3,1,1,"R"]
["2032-08-26",2,1,"R",1,2,1,"R"]
["2032-08-27",3,2,"R",1,2,1,1]
["2032-08-28","R",2,2,"R","R","R",2]
["2032-08-29","R","R",2,"R","R","R",2]
["2032-08-30",2,"R",2,"R",1,"R",1]
["2032-08-31",3,2,"R",2,1,1,1]
["2032-09-01",2,"R",1,2,3,1,"R"]
["2032-09-02",1,2,2,"R",1,"R",1]
["2032-09-03","R",2,2,"R",1,1,1]
["2032-09-04",2,"R","R",2,"R",2,"R"]
["2032-09-05","R","R","R",2,"R",2,"R"]
["2032-09-06","R",2,1,2,"R","R",1]
["2032-09-07",2,3,1,"R",2,1,1]
["2032-09-08",2,"R",3,1,2,1,"R"]
["2032-09-09",2,1,1,2,"R",1,"R"]
["2032-09-10",3,2,1,2,"R",1,1]
["2032-09-11","R",2,"R","R",2,"R",2]
["2032-09-12","R","R","R","R",2,"R",2]
["2032-09-13",2,"R","R",1,2,"R",1]
["2032-09-14",3,2,2,1,"R",1,1]
["2032-09-15",2,"R",2,3,1,1,"R"]
["2032-09-16",1,2,"R",1,2,"R",1]
["2032-09-17","R",2,"R",1,2,1,1]
["2032-09-18",2,"R",2,"R","R",2,"R"]
["2032-09-19","R","R",2,"R","R",2,"R"]
["2032-09-20","R",2,2,"R",1,"R",1]
["2032-09-21",2,3,"R",2,1,1,1]
["2032-09-22",2,"R",1,2,3,1,"R"]
["2032-09-23",2,1,2,"R",1,1,"R"]
["2032-09-24",3,2,2,"R",1,1,1]
["2032-09-25","R",2,"R",2,"R","R",2]
["2032-09-26","R","R","R",2,"R","R",2]
["2032-09-27",2,"R",1,2,"R","R",1]
["2032-09-28",3,2,1,"R",2,1,1]
["2032-09-29",2,"R",3,1,2,1,"R"]
["2032-09-30",1,2,1,2,"R","R",1]
["2032-10-01","R",2,"R","R",2,2,"R"]
["2032-10-02",2,"R","R","R",2,2,"R"]
["2032-10-03","R","R","R",1,2,"R",1]
["2032-10-04","R",2,2,1,"R",1,1]
["2032-10-05",2,3,2,3,1,1,"R"]
["2032-10-06",2,"R","R",1,2,1,"R"]
["2032-10-07",2,1,"R",1,2,1,1]
["2032-10-08",3,2,2,"R","R","R",2]
["2032-10-09","R",2,2,"R","R","R",2]
["2032-10-10","R","R",2,"R",1,"R",1]
["2032-10-11",2,"R","R",2,1,1,1]
["2032-10-12",3,2,1,2,3,1,"R"]
["2032-10-13",2,"R",2,"R",1,"R",1]
["2032-10-14",1,2,2,"R",1,1,1]
["2032-10-15","R",2,"R",2,"R",2,"R"]
["2032-10-16",2,"R","R",2,"R",2,"R"]
["2032-10-17","R","R",1,2,"R","R",1]
["2032-10-18","R",2,1,"R",2,1,1]
["2032-10-19",2,3,3,1,2,1,"R"]
["2032-10-20",2,"R",1,2,"R",1,"R"]
["2032-10-21",2,1,1,2,"R",1,1]
["2032-10-22",3,2,"R","R",2,"R",2]
["2032-10-23","R",2,"R","R",2,"R",2]
["2032-10-24","R","R","R",1,2,"R",1]
["2032-10-25",2,"R",2,1,"R",1,1]
["2032-10-26",3,2,2,3,1,1,"R"]
["2032-10-27",2,"R","R",1,2,"R",1]
["2032-10-28",1,2,"R",1,2,1,1]
["2032-10-29","R",2,2,"R","R",2,"R"]
["2032-10-30",2,"R",2,"R","R",2,"R"]
["2032-10-31","R","R",2,"R",1,"R",1]
["2032-11-01","R",2,"R",2,1,1,1]
["2032-11-02",2,3,1,2,3,1,"R"]
["2032-11-03",2,"R",2,"R",1,1,"R"]
["2032-11-04",2,1,2,"R",1,1,1]
["2032-11-05",3,2,"R",2,"R","R",2]
["2032-11-06","R",2,"R",2,"R","R",2]
["2032-11-07","R","R",1,2,"R","R",1]
["2032-11-08",2,"R",1,"R",2,1,1]
["2032-11-09",3,2,3,1,2,1,"R"]
["2032-11-10",2,"R",1,2,"R","R",1]
["2032-11-11",1,2,1,2,"R",1,1]
["2032-11-12","R",2,"R","R",2,2,"R"]
["2032-11-13",2,"R","R","R",2,2,"R"]
["2032-11-14","R","R","R",1,2,"R",1]
["2032-11-15","R",2,2,1,"R",1,1]
["2032-11-16",2,3,2,3,1,1,"R"]
["2032-11-17",2,"R","R",1,2,1,"R"]
["2032-11-18",2,1,"R",1,2,1,1]
["2032-11-19",3,2,2,"R","R","R",2]
["2032-11-20","R",2,2,"R","R","R",2]
["2032-11-21","R","R",2,"R",1,"R",1]
["2032-11-22",2,"R","R",2,1,1,1]
["2032-11-23",3,2,1,2,3,1,"R"]
["2032-11-24",2,"R",2,"R",1,"R",1]
["2032-11-25",1,2,2,"R",1,1,1]
["2032-11-26","R",2,"R",2,"R",2,"R"]
["2032-11-27",2,"R","R",2,"R",2,"R"]
["2032-11-28","R","R",1,2,"R","R",1]
["2032-11-29","R",2,1,"R",2,1,1]
["2032-11-30",2,3,3,1,2,1,"R"]
["2032-12-01",2,"R",1,2,"R",1,"R"]
["2032-12-02",2,1,1,2,"R",1,1]
["2032-12-03",3,2,"R","R",2,"R",2]
["2032-12-04","R",2,"R","R",2,"R",2]
["2032-12-05","R","R","R",1,2,"R",1]
["2032-12-06",2,"R",2,1,"R",1,1]
["2032-12-07",3,2,2,3,1,1,"R"]
["2032-12-08",2,"R","R",1,2,"R",1]
["2032-12-09",1,2,"R",1,2,1,1]
["2032-12-10","R",2,2,"R","R",2,"R"]
["2032-12-11",2,"R",2,"R","R",2,"R"]
["2032-12-12","R","R",2,"R",1,"R",1]
["2032-12-13","R",2,"R",2,1,1,1]
["2032-12-14",2,3,1,2,3,1,"R"]
["2032-12-15",2,"R",2,"R",1,1,"R"]
["2032-12-16",2,1,2,"R",1,1,1]
["2032-12-17",3,2,"R",2,"R","R",2]
["2032-12-18","R",2,"R",2,"R","R",2]
["2032-12-19","R","R",1,2,"R","R",1]
["2032-12-20",2,"R",1,"R",2,1,1]
["2032-12-21",3,2,3,1,2,1,"R"]
["2032-12-22",2,"R",1,2,"R","R",1]
["2032-12-23",1,2,1,2,"R",1,1]
["2032-12-24","R",2,"R","R",2,2,"R"]
["2032-12-25",2,"R","R","R",2,2,"R"]
["2032-12-26","R","R","R",1,2,"R",1]
["2032-12-27","R",2,2,1,"R",1,1]
["2032-12-28",2,3,2,3,1,1,"R"]
["2032-12-29",2,"R","R",1,2,1,"R"]
["2032-12-30",2,1,"R",1,2,1,1]
["2032-12-31",3,2,2,"R","R","R",2]