{"text_format":"1","workbook":"xlsx","n_sheets":17,"sheets":["P1","P2","P3","P4","P5","P6","P7","P8","P9","P10","P11","P12","P13","P14","P15","Classt","Macros"],"not_rendered":{"charts":0,"images":1,"macros":1,"external_links":1,"defined_names":61,"comments":0,"pivot_tables":0},"unopened":[],"bounds":{"document_bytes":16777216,"sheet_cells":100000,"rows_first":2000,"rows_last":500,"rows_between":2000,"halvings":0,"cell_chars":16384,"cell_head_chars":4096},"cells_cut":0,"cells_raw":0,"read":"whole","date_system":"1900"}

{"sheet":"P1","index":0,"n_rows":69,"n_cols":14,"rows_kept":69,"cut":false,"hidden":false,"merged":[[3,7,3,10],[0,0,0,5],[1,0,1,5],[2,0,2,5],[3,0,3,5],[39,6,40,6],[47,6,48,6],[55,6,56,6],[63,6,64,6],[15,6,16,6],[23,6,24,6],[31,6,32,6]]}
[null,null,null,null,null,null,null,null,null,null,null,null,null,"les points & (la diff + la valeur absolue de la plus petif dif (pour n'avoir que des nombres positifs mais en gardant -56 < 56 "]
["CHAMPIONNAT DES CLUBS",null,null,null,null,null,null,null,null,null,null,null,null,"puisqu'ils sont remplacés par 0 et 112)  & les pour  &  (256 - les contre)     256 car 36*7=252 et en y soustrayant les contre on inverse pour obtenir un grand nombre pour un contre faible "]
[null,null,null,null,null,null,null,null,null,null,null,null,null,"ainsi le plus grand nombre obtenu indique le 1er etc, on peut en un seul calcul déterminer le rang et supprimer l'usine à gaz des tableaux supplémentaires"]
["POULE 1",null,null,null,null,null,null,"Traitement 2 exaequo"]
["EQUIPES",null,"POINTS","Pour","Contre","Diff","Rang","Place","Adv","Rang adv","1 si gagnant","Rang corrigé","Rang  d'après M"]
["AA","1A",{"$f":"SUMIF($A$18:$A$69,A6,$E$18:$E$69)+SUMIF($C$18:$C$69,A6,$F$18:$F$69)","v":18},{"$f":"SUMIF($A$18:$A$69,$A6,$B$18:$B$69)+SUMIF($C$18:$C$69,$A6,$D$18:$D$69)","v":160},{"$f":"SUMIF($C$18:$C$69,$A6,$B$18:$B$69)+SUMIF($A$18:$A$69,$A6,$D$18:$D$69)","v":92},{"$f":"D6-E6","v":68},{"$f":"IF(K6=\"\",M6,IF(L6<>\"\",L6,IF(K6=1,MIN(J6,M6),MAX(J6,M6))))","v":1},{"$f":"C6&\"-\"&COUNTIF(C$6:C6,C6)&\"/\"&COUNTIF($C$6:$C$13,C6)","v":"18-1/2"},{"$f":"IF(RIGHT(H6,3)=\"1/2\",INDEX($A$6:$A$13,MATCH(SUBSTITUTE(H6,\"1/2\",\"2/2\"),$H$6:$H$13,0)),IF(RIGHT(H6,3)=\"2/2\",INDEX($A$6:$A$13,MATCH(SUBSTITUTE(H6,\"2/2\",\"1/2\"),$H$6:$H$13,0)),\"\"))","v":"AB"},{"$f":"IF(I6=\"\",\"\",INDEX($M$6:$M$13,MATCH(I6,$A$6:$A$13,0)))","v":2},{"$f":"IF(I6=\"\",\"\",COUNTIF($N$18:$N$69,A6&I6))","v":0},{"$f":"IF(AND(I6<>\"\",COUNTIF($N$34:$N$69,A6&I6)+COUNTIF($N$34:$N$69,I6&A6)=0),M6,IF(J6=M6,IF(K6=1,M6,M6+1),\"\"))","v":1},{"$f":"RANK(N6,N6:N13)","v":1},{"$f":"VALUE($C6&TEXT($F6+ABS(MIN($F$6:$F$13)),\"000\")&TEXT($D6,\"000\")&TEXT(252-$E6,\"000\"))","v":18144160160}]
["AB","1B",{"$f":"SUMIF($A$18:$A$69,A7,$E$18:$E$69)+SUMIF($C$18:$C$69,A7,$F$18:$F$69)","v":18},{"$f":"SUMIF($A$18:$A$69,$A7,$B$18:$B$69)+SUMIF($C$18:$C$69,$A7,$D$18:$D$69)","v":134},{"$f":"SUMIF($C$18:$C$69,$A7,$B$18:$B$69)+SUMIF($A$18:$A$69,$A7,$D$18:$D$69)","v":118},16,{"$f":"IF(K7=\"\",M7,IF(L7<>\"\",L7,IF(K7=1,MIN(J7,M7),MAX(J7,M7))))","v":2},{"$f":"C7&\"-\"&COUNTIF(C$6:C7,C7)&\"/\"&COUNTIF($C$6:$C$13,C7)","v":"18-2/2"},{"$f":"IF(RIGHT(H7,3)=\"1/2\",INDEX($A$6:$A$13,MATCH(SUBSTITUTE(H7,\"1/2\",\"2/2\"),$H$6:$H$13,0)),IF(RIGHT(H7,3)=\"2/2\",INDEX($A$6:$A$13,MATCH(SUBSTITUTE(H7,\"2/2\",\"1/2\"),$H$6:$H$13,0)),\"\"))","v":"AA"},1,{"$f":"IF(I7=\"\",\"\",COUNTIF($N$18:$N$69,A7&I7))","v":0},{"$f":"IF(AND(I7<>\"\",COUNTIF($N$34:$N$69,A7&I7)+COUNTIF($N$34:$N$69,I7&A7)=0),M7,IF(J7=M7,IF(K7=1,M7,M7+1),\"\"))","v":2},{"$f":"RANK(N7,$N$6:$N$13,0)","v":2},{"$f":"VALUE($C7&TEXT($F7+ABS(MIN($F$6:$F$13)),\"000\")&TEXT($D7,\"000\")&TEXT(252-$E7,\"000\"))","v":18092134134}]
["AC","1C",{"$f":"SUMIF($A$18:$A$69,A8,$E$18:$E$69)+SUMIF($C$18:$C$69,A8,$F$18:$F$69)","v":12},88,164,-76,5,{"$f":"C8&\"-\"&COUNTIF(C$6:C8,C8)&\"/\"&COUNTIF($C$6:$C$13,C8)","v":"12-1/1"},"","","","",5,12000088088]
["AD","1D",14,136,116,20,4,{"$f":"C9&\"-\"&COUNTIF(C$6:C9,C9)&\"/\"&COUNTIF($C$6:$C$13,C9)","v":"14-1/1"},"","","","",4,14096136136]
["AE","1E",17,144,108,36,3,{"$f":"C10&\"-\"&COUNTIF(C$6:C10,C10)&\"/\"&COUNTIF($C$6:$C$13,C10)","v":"17-1/1"},"","","","",3,17112144144]
["AF","1F",11,126,126,0,6,{"$f":"C11&\"-\"&COUNTIF(C$6:C11,C11)&\"/\"&COUNTIF($C$6:$C$13,C11)","v":"11-1/3"},"","","","",6,11076126126]
["AG","1G",11,94,158,{"$f":"D12-E12","v":-64},8,{"$f":"C12&\"-\"&COUNTIF(C$6:C12,C12)&\"/\"&COUNTIF($C$6:$C$13,C12)","v":"11-2/3"},"","","","",8,11012094094]
["AH","1H",11,{"$f":"SUMIF($A$18:$A$69,$A13,$B$18:$B$69)+SUMIF($C$18:$C$69,$A13,$D$18:$D$69)","v":126},126,{"$f":"D13-E13","v":0},6,{"$f":"C13&\"-\"&COUNTIF(C$6:C13,C13)&\"/\"&COUNTIF($C$6:$C$13,C13)","v":"11-3/3"},"","","","",6,11076126126]
[]
["1er MATCH le ","à",{"$f":"A6","v":"AA"}]
[null,null,null,null,null,null,"SI forfait éq recevante"]
["Equipes","score","Equipes","score","Points","Points"]
[{"$f":"$A$6","v":"AA"},18,{"$f":"$A$7","v":"AB"},{"$f":"IF(G18=19,19,IF(ISBLANK(B18),\"\",IF(B18=19,0,36-B18)))","v":18},{"$f":"IF(G18=19,0,IF(ISBLANK(B18),\"\",IF(B18<18,1,IF(B18=18,2,IF(B18>18,3)))))","v":2},{"$f":"IF(G18=19,3,IF(ISBLANK(B18),\"\",IF(B18=19,0,IF(D18<18,1,IF(D18=18,2,IF(D18>=20,3))))))","v":2},null,null,null,null,null,null,null,{"$f":"IF(B18>D18,A18&C18,IF(D18>B18,C18&A18,\"/\"))","v":"/"}]
[{"$f":"$A$8","v":"AC"},18,{"$f":"$A$9","v":"AD"},{"$f":"IF(G19=19,19,IF(ISBLANK(B19),\"\",IF(B19=19,0,36-B19)))","v":18},{"$f":"IF(G19=19,0,IF(ISBLANK(B19),\"\",IF(B19<18,1,IF(B19=18,2,IF(B19>18,3)))))","v":2},{"$f":"IF(G19=19,3,IF(ISBLANK(B19),\"\",IF(B19=19,0,IF(D19<18,1,IF(D19=18,2,IF(D19>=20,3))))))","v":2},null,null,null,null,null,null,null,{"$f":"IF(B19>D19,A19&C19,IF(D19>B19,C19&A19,\"/\"))","v":"/"}]
[{"$f":"$A$10","v":"AE"},28,{"$f":"$A$11","v":"AF"},{"$f":"IF(G20=19,19,IF(ISBLANK(B20),\"\",IF(B20=19,0,36-B20)))","v":8},{"$f":"IF(G20=19,0,IF(ISBLANK(B20),\"\",IF(B20<18,1,IF(B20=18,2,IF(B20>18,3)))))","v":3},{"$f":"IF(G20=19,3,IF(ISBLANK(B20),\"\",IF(B20=19,0,IF(D20<18,1,IF(D20=18,2,IF(D20>=20,3))))))","v":1},null,null,null,null,null,null,null,{"$f":"IF(B20>D20,A20&C20,IF(D20>B20,C20&A20,\"/\"))","v":"AEAF"}]
[{"$f":"$A$12","v":"AG"},10,{"$f":"$A$13","v":"AH"},{"$f":"IF(G21=19,19,IF(ISBLANK(B21),\"\",IF(B21=19,0,36-B21)))","v":26},{"$f":"IF(G21=19,0,IF(ISBLANK(B21),\"\",IF(B21<18,1,IF(B21=18,2,IF(B21>18,3)))))","v":1},{"$f":"IF(G21=19,3,IF(ISBLANK(B21),\"\",IF(B21=19,0,IF(D21<18,1,IF(D21=18,2,IF(D21>=20,3))))))","v":3},null,null,null,null,null,null,null,{"$f":"IF(B21>D21,A21&C21,IF(D21>B21,C21&A21,\"/\"))","v":"AHAG"}]
[]
["2 éme MATCH le ","à",{"$f":"A7","v":"AB"}]
[null,null,null,null,null,null,"SI forfait éq recevante"]
["Equipes","score","Equipes","score","Points","Points"]
[{"$f":"$A$6","v":"AA"},28,{"$f":"$A$8","v":"AC"},{"$f":"IF(G26=19,19,IF(ISBLANK(B26),\"\",IF(B26=19,0,36-B26)))","v":8},{"$f":"IF(G26=19,0,IF(ISBLANK(B26),\"\",IF(B26<18,1,IF(B26=18,2,IF(B26>18,3)))))","v":3},{"$f":"IF(G26=19,3,IF(ISBLANK(B26),\"\",IF(B26=19,0,IF(D26<18,1,IF(D26=18,2,IF(D26>=20,3))))))","v":1},null,null,null,null,null,null,null,{"$f":"IF(B26>D26,A26&C26,IF(D26>B26,C26&A26,\"/\"))","v":"AAAC"}]
[{"$f":"$A$7","v":"AB"},20,{"$f":"$A$13","v":"AH"},{"$f":"IF(G27=19,19,IF(ISBLANK(B27),\"\",IF(B27=19,0,36-B27)))","v":16},{"$f":"IF(G27=19,0,IF(ISBLANK(B27),\"\",IF(B27<18,1,IF(B27=18,2,IF(B27>18,3)))))","v":3},{"$f":"IF(G27=19,3,IF(ISBLANK(B27),\"\",IF(B27=19,0,IF(D27<18,1,IF(D27=18,2,IF(D27>=20,3))))))","v":1},null,null,null,null,null,null,null,{"$f":"IF(B27>D27,A27&C27,IF(D27>B27,C27&A27,\"/\"))","v":"ABAH"}]
[{"$f":"$A$9","v":"AD"},24,{"$f":"$A$11","v":"AF"},{"$f":"IF(G28=19,19,IF(ISBLANK(B28),\"\",IF(B28=19,0,36-B28)))","v":12},{"$f":"IF(G28=19,0,IF(ISBLANK(B28),\"\",IF(B28<18,1,IF(B28=18,2,IF(B28>18,3)))))","v":3},{"$f":"IF(G28=19,3,IF(ISBLANK(B28),\"\",IF(B28=19,0,IF(D28<18,1,IF(D28=18,2,IF(D28>=20,3))))))","v":1},null,null,null,null,null,null,null,{"$f":"IF(B28>D28,A28&C28,IF(D28>B28,C28&A28,\"/\"))","v":"ADAF"}]
[{"$f":"$A$10","v":"AE"},24,{"$f":"$A$12","v":"AG"},{"$f":"IF(G29=19,19,IF(ISBLANK(B29),\"\",IF(B29=19,0,36-B29)))","v":12},{"$f":"IF(G29=19,0,IF(ISBLANK(B29),\"\",IF(B29<18,1,IF(B29=18,2,IF(B29>18,3)))))","v":3},{"$f":"IF(G29=19,3,IF(ISBLANK(B29),\"\",IF(B29=19,0,IF(D29<18,1,IF(D29=18,2,IF(D29>=20,3))))))","v":1},null,null,null,null,null,null,null,{"$f":"IF(B29>D29,A29&C29,IF(D29>B29,C29&A29,\"/\"))","v":"AEAG"}]
[]
["3 éme MATCH le ","à",{"$f":"A8","v":"AC"}]
[null,null,null,null,null,null,"SI forfait éq recevante"]
["Equipes","score","Equipes","score","Points","Points"]
[{"$f":"$A$6","v":"AA"},22,{"$f":"$A$13","v":"AH"},{"$f":"IF(G34=19,19,IF(ISBLANK(B34),\"\",IF(B34=19,0,36-B34)))","v":14},{"$f":"IF(G34=19,0,IF(ISBLANK(B34),\"\",IF(B34<18,1,IF(B34=18,2,IF(B34>18,3)))))","v":3},{"$f":"IF(G34=19,3,IF(ISBLANK(B34),\"\",IF(B34=19,0,IF(D34<18,1,IF(D34=18,2,IF(D34>=20,3))))))","v":1},null,null,null,null,null,null,null,{"$f":"IF(B34>D34,A34&C34,IF(D34>B34,C34&A34,\"/\"))","v":"AAAH"}]
[{"$f":"$A$7","v":"AB"},22,{"$f":"$A$10","v":"AE"},{"$f":"IF(G35=19,19,IF(ISBLANK(B35),\"\",IF(B35=19,0,36-B35)))","v":14},{"$f":"IF(G35=19,0,IF(ISBLANK(B35),\"\",IF(B35<18,1,IF(B35=18,2,IF(B35>18,3)))))","v":3},{"$f":"IF(G35=19,3,IF(ISBLANK(B35),\"\",IF(B35=19,0,IF(D35<18,1,IF(D35=18,2,IF(D35>=20,3))))))","v":1},null,null,null,null,null,null,null,{"$f":"IF(B35>D35,A35&C35,IF(D35>B35,C35&A35,\"/\"))","v":"ABAE"}]
[{"$f":"$A$8","v":"AC"},20,{"$f":"$A$11","v":"AF"},{"$f":"IF(G36=19,19,IF(ISBLANK(B36),\"\",IF(B36=19,0,36-B36)))","v":16},{"$f":"IF(G36=19,0,IF(ISBLANK(B36),\"\",IF(B36<18,1,IF(B36=18,2,IF(B36>18,3)))))","v":3},{"$f":"IF(G36=19,3,IF(ISBLANK(B36),\"\",IF(B36=19,0,IF(D36<18,1,IF(D36=18,2,IF(D36>=20,3))))))","v":1},null,null,null,null,null,null,null,{"$f":"IF(B36>D36,A36&C36,IF(D36>B36,C36&A36,\"/\"))","v":"ACAF"}]
[{"$f":"$A$9","v":"AD"},30,{"$f":"$A$12","v":"AG"},{"$f":"IF(G37=19,19,IF(ISBLANK(B37),\"\",IF(B37=19,0,36-B37)))","v":6},{"$f":"IF(G37=19,0,IF(ISBLANK(B37),\"\",IF(B37<18,1,IF(B37=18,2,IF(B37>18,3)))))","v":3},{"$f":"IF(G37=19,3,IF(ISBLANK(B37),\"\",IF(B37=19,0,IF(D37<18,1,IF(D37=18,2,IF(D37>=20,3))))))","v":1},null,null,null,null,null,null,null,{"$f":"IF(B37>D37,A37&C37,IF(D37>B37,C37&A37,\"/\"))","v":"ADAG"}]
[]
["4 éme MATCH le ","à",{"$f":"A9","v":"AD"}]
[null,null,null,null,null,null,"SI forfait éq recevante"]
["Equipes","score","Equipes","score","Points","Points"]
[{"$f":"A6","v":"AA"},22,{"$f":"$A$9","v":"AD"},{"$f":"IF(G42=19,19,IF(ISBLANK(B42),\"\",IF(B42=19,0,36-B42)))","v":14},{"$f":"IF(G42=19,0,IF(ISBLANK(B42),\"\",IF(B42<18,1,IF(B42=18,2,IF(B42>18,3)))))","v":3},{"$f":"IF(G42=19,3,IF(ISBLANK(B42),\"\",IF(B42=19,0,IF(D42<18,1,IF(D42=18,2,IF(D42>=20,3))))))","v":1},null,null,null,null,null,null,null,{"$f":"IF(B42>D42,A42&C42,IF(D42>B42,C42&A42,\"/\"))","v":"AAAD"}]
[{"$f":"$A$11","v":"AF"},16,{"$f":"$A$12","v":"AG"},{"$f":"IF(G43=19,19,IF(ISBLANK(B43),\"\",IF(B43=19,0,36-B43)))","v":20},{"$f":"IF(G43=19,0,IF(ISBLANK(B43),\"\",IF(B43<18,1,IF(B43=18,2,IF(B43>18,3)))))","v":1},{"$f":"IF(G43=19,3,IF(ISBLANK(B43),\"\",IF(B43=19,0,IF(D43<18,1,IF(D43=18,2,IF(D43>=20,3))))))","v":3},null,null,null,null,null,null,null,{"$f":"IF(B43>D43,A43&C43,IF(D43>B43,C43&A43,\"/\"))","v":"AGAF"}]
[{"$f":"A7","v":"AB"},24,{"$f":"$A$8","v":"AC"},{"$f":"IF(G44=19,19,IF(ISBLANK(B44),\"\",IF(B44=19,0,36-B44)))","v":12},{"$f":"IF(G44=19,0,IF(ISBLANK(B44),\"\",IF(B44<18,1,IF(B44=18,2,IF(B44>18,3)))))","v":3},{"$f":"IF(G44=19,3,IF(ISBLANK(B44),\"\",IF(B44=19,0,IF(D44<18,1,IF(D44=18,2,IF(D44>=20,3))))))","v":1},null,null,null,null,null,null,null,{"$f":"IF(B44>D44,A44&C44,IF(D44>B44,C44&A44,\"/\"))","v":"ABAC"}]
[{"$f":"A10","v":"AE"},6,{"$f":"$A$13","v":"AH"},{"$f":"IF(G45=19,19,IF(ISBLANK(B45),\"\",IF(B45=19,0,36-B45)))","v":30},{"$f":"IF(G45=19,0,IF(ISBLANK(B45),\"\",IF(B45<18,1,IF(B45=18,2,IF(B45>18,3)))))","v":1},{"$f":"IF(G45=19,3,IF(ISBLANK(B45),\"\",IF(B45=19,0,IF(D45<18,1,IF(D45=18,2,IF(D45>=20,3))))))","v":3},null,null,null,null,null,null,null,{"$f":"IF(B45>D45,A45&C45,IF(D45>B45,C45&A45,\"/\"))","v":"AHAE"}]
[]
["5 éme MATCH le ","à",{"$f":"A10","v":"AE"}]
[null,null,null,null,null,null,"SI forfait éq recevante"]
["Equipes","score","Equipes","score","Points","Points"]
[{"$f":"A6","v":"AA"},20,{"$f":"$A$11","v":"AF"},{"$f":"IF(G50=19,19,IF(ISBLANK(B50),\"\",IF(B50=19,0,36-B50)))","v":16},{"$f":"IF(G50=19,0,IF(ISBLANK(B50),\"\",IF(B50<18,1,IF(B50=18,2,IF(B50>18,3)))))","v":3},{"$f":"IF(G50=19,3,IF(ISBLANK(B50),\"\",IF(B50=19,0,IF(D50<18,1,IF(D50=18,2,IF(D50>=20,3))))))","v":1},null,null,null,null,null,null,null,{"$f":"IF(B50>D50,A50&C50,IF(D50>B50,C50&A50,\"/\"))","v":"AAAF"}]
[{"$f":"$A$9","v":"AD"},22,{"$f":"A13","v":"AH"},{"$f":"IF(G51=19,19,IF(ISBLANK(B51),\"\",IF(B51=19,0,36-B51)))","v":14},{"$f":"IF(G51=19,0,IF(ISBLANK(B51),\"\",IF(B51<18,1,IF(B51=18,2,IF(B51>18,3)))))","v":3},{"$f":"IF(G51=19,3,IF(ISBLANK(B51),\"\",IF(B51=19,0,IF(D51<18,1,IF(D51=18,2,IF(D51>=20,3))))))","v":1},null,null,null,null,null,null,null,{"$f":"IF(B51>D51,A51&C51,IF(D51>B51,C51&A51,\"/\"))","v":"ADAH"}]
[{"$f":"A7","v":"AB"},24,{"$f":"$A$12","v":"AG"},{"$f":"IF(G52=19,19,IF(ISBLANK(B52),\"\",IF(B52=19,0,36-B52)))","v":12},{"$f":"IF(G52=19,0,IF(ISBLANK(B52),\"\",IF(B52<18,1,IF(B52=18,2,IF(B52>18,3)))))","v":3},{"$f":"IF(G52=19,3,IF(ISBLANK(B52),\"\",IF(B52=19,0,IF(D52<18,1,IF(D52=18,2,IF(D52>=20,3))))))","v":1},null,null,null,null,null,null,null,{"$f":"IF(B52>D52,A52&C52,IF(D52>B52,C52&A52,\"/\"))","v":"ABAG"}]
[{"$f":"A8","v":"AC"},4,{"$f":"$A$10","v":"AE"},{"$f":"IF(G53=19,19,IF(ISBLANK(B53),\"\",IF(B53=19,0,36-B53)))","v":32},{"$f":"IF(G53=19,0,IF(ISBLANK(B53),\"\",IF(B53<18,1,IF(B53=18,2,IF(B53>18,3)))))","v":1},{"$f":"IF(G53=19,3,IF(ISBLANK(B53),\"\",IF(B53=19,0,IF(D53<18,1,IF(D53=18,2,IF(D53>=20,3))))))","v":3},null,null,null,null,null,null,null,{"$f":"IF(B53>D53,A53&C53,IF(D53>B53,C53&A53,\"/\"))","v":"AEAC"}]
[]
["6 éme MATCH le ","à","AF"]
[null,null,null,null,null,null,"SI forfait éq recevante"]
["Equipes","score","Equipes","score","Points","Points"]
[{"$f":"A7","v":"AB"},24,{"$f":"A9","v":"AD"},{"$f":"IF(G58=19,19,IF(ISBLANK(B58),\"\",IF(B58=19,0,36-B58)))","v":12},{"$f":"IF(G58=19,0,IF(ISBLANK(B58),\"\",IF(B58<18,1,IF(B58=18,2,IF(B58>18,3)))))","v":3},{"$f":"IF(G58=19,3,IF(ISBLANK(B58),\"\",IF(B58=19,0,IF(D58<18,1,IF(D58=18,2,IF(D58>=20,3))))))","v":1},null,null,null,null,null,null,null,{"$f":"IF(B58>D58,A58&C58,IF(D58>B58,C58&A58,\"/\"))","v":"ABAD"}]
[{"$f":"A10","v":"AE"},20,{"$f":"A6","v":"AA"},{"$f":"IF(G59=19,19,IF(ISBLANK(B59),\"\",IF(B59=19,0,36-B59)))","v":16},{"$f":"IF(G59=19,0,IF(ISBLANK(B59),\"\",IF(B59<18,1,IF(B59=18,2,IF(B59>18,3)))))","v":3},{"$f":"IF(G59=19,3,IF(ISBLANK(B59),\"\",IF(B59=19,0,IF(D59<18,1,IF(D59=18,2,IF(D59>=20,3))))))","v":1},null,null,null,null,null,null,null,{"$f":"IF(B59>D59,A59&C59,IF(D59>B59,C59&A59,\"/\"))","v":"AEAA"}]
[{"$f":"A12","v":"AG"},32,{"$f":"A8","v":"AC"},{"$f":"IF(G60=19,19,IF(ISBLANK(B60),\"\",IF(B60=19,0,36-B60)))","v":4},{"$f":"IF(G60=19,0,IF(ISBLANK(B60),\"\",IF(B60<18,1,IF(B60=18,2,IF(B60>18,3)))))","v":3},{"$f":"IF(G60=19,3,IF(ISBLANK(B60),\"\",IF(B60=19,0,IF(D60<18,1,IF(D60=18,2,IF(D60>=20,3))))))","v":1},null,null,null,null,null,null,null,{"$f":"IF(B60>D60,A60&C60,IF(D60>B60,C60&A60,\"/\"))","v":"AGAC"}]
[{"$f":"A11","v":"AF"},24,{"$f":"A13","v":"AH"},{"$f":"IF(G61=19,19,IF(ISBLANK(B61),\"\",IF(B61=19,0,36-B61)))","v":12},{"$f":"IF(G61=19,0,IF(ISBLANK(B61),\"\",IF(B61<18,1,IF(B61=18,2,IF(B61>18,3)))))","v":3},{"$f":"IF(G61=19,3,IF(ISBLANK(B61),\"\",IF(B61=19,0,IF(D61<18,1,IF(D61=18,2,IF(D61>=20,3))))))","v":1},null,null,null,null,null,null,null,{"$f":"IF(B61>D61,A61&C61,IF(D61>B61,C61&A61,\"/\"))","v":"AFAH"}]
[]
["7 éme MATCH le 12 juin","à","AG"]
[null,null,null,null,null,null,"SI forfait éq recevante"]
["Equipes","score","Equipes","score","Points","Points"]
[{"$f":"A6","v":"AA"},34,{"$f":"A12","v":"AG"},{"$f":"IF(G66=19,19,IF(ISBLANK(B66),\"\",IF(B66=19,0,36-B66)))","v":2},{"$f":"IF(G66=19,0,IF(ISBLANK(B66),\"\",IF(B66<18,1,IF(B66=18,2,IF(B66>18,3)))))","v":3},{"$f":"IF(G66=19,3,IF(ISBLANK(B66),\"\",IF(B66=19,0,IF(D66<18,1,IF(D66=18,2,IF(D66>=20,3))))))","v":1},null,null,null,null,null,null,null,{"$f":"IF(B66>D66,A66&C66,IF(D66>B66,C66&A66,\"/\"))","v":"AAAG"}]
[{"$f":"A7","v":"AB"},2,{"$f":"A11","v":"AF"},{"$f":"IF(G67=19,19,IF(ISBLANK(B67),\"\",IF(B67=19,0,36-B67)))","v":34},{"$f":"IF(G67=19,0,IF(ISBLANK(B67),\"\",IF(B67<18,1,IF(B67=18,2,IF(B67>18,3)))))","v":1},{"$f":"IF(G67=19,3,IF(ISBLANK(B67),\"\",IF(B67=19,0,IF(D67<18,1,IF(D67=18,2,IF(D67>=20,3))))))","v":3},null,null,null,null,null,null,null,{"$f":"IF(B67>D67,A67&C67,IF(D67>B67,C67&A67,\"/\"))","v":"AFAB"}]
[{"$f":"A10","v":"AE"},20,{"$f":"A9","v":"AD"},{"$f":"IF(G68=19,19,IF(ISBLANK(B68),\"\",IF(B68=19,0,36-B68)))","v":16},{"$f":"IF(G68=19,0,IF(ISBLANK(B68),\"\",IF(B68<18,1,IF(B68=18,2,IF(B68>18,3)))))","v":3},{"$f":"IF(G68=19,3,IF(ISBLANK(B68),\"\",IF(B68=19,0,IF(D68<18,1,IF(D68=18,2,IF(D68>=20,3))))))","v":1},null,null,null,null,null,null,null,{"$f":"IF(B68>D68,A68&C68,IF(D68>B68,C68&A68,\"/\"))","v":"AEAD"}]
[{"$f":"A8","v":"AC"},22,{"$f":"A13","v":"AH"},{"$f":"IF(G69=19,19,IF(ISBLANK(B69),\"\",IF(B69=19,0,36-B69)))","v":14},{"$f":"IF(G69=19,0,IF(ISBLANK(B69),\"\",IF(B69<18,1,IF(B69=18,2,IF(B69>18,3)))))","v":3},{"$f":"IF(G69=19,3,IF(ISBLANK(B69),\"\",IF(B69=19,0,IF(D69<18,1,IF(D69=18,2,IF(D69>=20,3))))))","v":1},null,null,null,null,null,null,null,{"$f":"IF(B69>D69,A69&C69,IF(D69>B69,C69&A69,\"/\"))","v":"ACAH"}]

{"sheet":"P2","index":1,"n_rows":64,"n_cols":15,"rows_kept":64,"cut":false,"hidden":false,"merged":[[0,0,0,5],[1,0,1,5],[2,0,2,5],[3,0,3,5],[13,6,14,6],[56,1,56,6],[56,12,56,14],[20,6,21,6],[27,6,28,6],[34,6,35,6],[41,6,42,6],[47,0,47,5]]}
[]
["CHAMPIONNAT DES CLUBS"]
[]
["POULE 2",null,null,null,null,null,null,null,"Récapitulatif  différence match entre 2 équipes"]
["EQUIPES",null,"POINTS","Pour","Contre","Diff",null,null,null,{"$f":"A6","v":"AH"},{"$f":"A7","v":"AI"},{"$f":"A8","v":"AJ"},{"$f":"A9","v":"AK"},{"$f":"A10","v":"AL"},{"$f":"A11","v":"AM"}]
["AH","2A",{"$f":"SUM(E16,E23,E30,E37,F45)","v":13},{"$f":"I16+I23+I30+I37+J45","v":96},{"$f":"J16+J23+J30+J37+I45","v":67},{"$f":"D6-E6","v":29},null,null,{"$f":"A6","v":"AH"},null,{"$f":"IF(ISBLANK(B16),0,IFERROR(INDEX($B$15:$B$46,MATCH($I6&K$5,$K$15:$K$46,0))-INDEX($D$15:$D$46,MATCH($I6&K$5,$K$15:$K$46,0)),0-INDEX($J$6:$O$11,MATCH(K$5,$I$6:$I$11,0),MATCH($I6,$J$5:$O$5,0))))","v":-12},{"$f":"IF(ISBLANK(B23),0,IFERROR(INDEX($B$15:$B$46,MATCH($I6&L$5,$K$15:$K$46,0))-INDEX($D$15:$D$46,MATCH($I6&L$5,$K$15:$K$46,0)),0-INDEX($J$6:$O$11,MATCH(L$5,$I$6:$I$11,0),MATCH($I6,$J$5:$O$5,0))))","v":4},{"$f":"IF(ISBLANK(B37),0,IFERROR(INDEX($B$15:$B$46,MATCH($I6&M$5,$K$15:$K$46,0))-INDEX($D$15:$D$46,MATCH($I6&M$5,$K$15:$K$46,0)),0-INDEX($J$6:$O$11,MATCH(M$5,$I$6:$I$11,0),MATCH($I6,$J$5:$O$5,0))))","v":14},{"$f":"IF(ISBLANK(B45),0,IFERROR(INDEX($B$15:$B$46,MATCH($I6&N$5,$K$15:$K$46,0))-INDEX($D$15:$D$46,MATCH($I6&N$5,$K$15:$K$46,0)),0-INDEX($J$6:$O$11,MATCH(N$5,$I$6:$I$11,0),MATCH($I6,$J$5:$O$5,0))))","v":4},{"$f":"IF(ISBLANK(B30),0,IFERROR(INDEX($B$15:$B$46,MATCH($I6&O$5,$K$15:$K$46,0))-INDEX($D$15:$D$46,MATCH($I6&O$5,$K$15:$K$46,0)),0-INDEX($J$6:$O$11,MATCH(O$5,$I$6:$I$11,0),MATCH($I6,$J$5:$O$5,0))))","v":19}]
["AI","2B",{"$f":"SUM(F16,E24,F32,E38,E46)","v":15},{"$f":"J16+I24+J32+I38+I46","v":112},{"$f":"I16+J24+I32+J38+J46","v":68},44,null,null,"AI",{"$f":"IF(ISBLANK(B16),0,IFERROR(INDEX($B$15:$B$46,MATCH($I7&J$5,$K$15:$K$46,0))-INDEX($D$15:$D$46,MATCH($I7&J$5,$K$15:$K$46,0)),0-INDEX($J$6:$O$11,MATCH(J$5,$I$6:$I$11,0),MATCH($I7,$J$5:$O$5,0))))","v":12},null,{"$f":"IF(ISBLANK(B32),0,IFERROR(INDEX($B$15:$B$46,MATCH($I7&L$5,$K$15:$K$46,0))-INDEX($D$15:$D$46,MATCH($I7&L$5,$K$15:$K$46,0)),0-INDEX($J$6:$O$11,MATCH(L$5,$I$6:$I$11,0),MATCH($I7,$J$5:$O$5,0))))","v":10},{"$f":"IF(ISBLANK(B46),0,IFERROR(INDEX($B$15:$B$46,MATCH($I7&M$5,$K$15:$K$46,0))-INDEX($D$15:$D$46,MATCH($I7&M$5,$K$15:$K$46,0)),0-INDEX($J$6:$O$11,MATCH(M$5,$I$6:$I$11,0),MATCH($I7,$J$5:$O$5,0))))","v":10},{"$f":"IF(ISBLANK(B24),0,IFERROR(INDEX($B$15:$B$46,MATCH($I7&N$5,$K$15:$K$46,0))-INDEX($D$15:$D$46,MATCH($I7&N$5,$K$15:$K$46,0)),0-INDEX($J$6:$O$11,MATCH(N$5,$I$6:$I$11,0),MATCH($I7,$J$5:$O$5,0))))","v":8},{"$f":"IF(ISBLANK(B38),0,IFERROR(INDEX($B$15:$B$46,MATCH($I7&O$5,$K$15:$K$46,0))-INDEX($D$15:$D$46,MATCH($I7&O$5,$K$15:$K$46,0)),0-INDEX($J$6:$O$11,MATCH(O$5,$I$6:$I$11,0),MATCH($I7,$J$5:$O$5,0))))","v":4}]
["AJ","2C",{"$f":"SUM(E17,F23,E32,E39,E44)","v":9},{"$f":"I17+J23+I32+I39+I44","v":88},{"$f":"J17+I23+J32+J39+J44","v":92},-4,null,null,"AJ",{"$f":"IF(ISBLANK(B23),0,IFERROR(INDEX($B$15:$B$46,MATCH($I8&J$5,$K$15:$K$46,0))-INDEX($D$15:$D$46,MATCH($I8&J$5,$K$15:$K$46,0)),0-INDEX($J$6:$O$11,MATCH(J$5,$I$6:$I$11,0),MATCH($I8,$J$5:$O$5,0))))","v":-4},{"$f":"IF(ISBLANK(B32),0,IFERROR(INDEX($B$15:$B$46,MATCH($I8&K$5,$K$15:$K$46,0))-INDEX($D$15:$D$46,MATCH($I8&K$5,$K$15:$K$46,0)),0-INDEX($J$6:$O$11,MATCH(K$5,$I$6:$I$11,0),MATCH($I8,$J$5:$O$5,0))))","v":-10},null,{"$f":"IF(ISBLANK(B17),0,IFERROR(INDEX($B$15:$B$46,MATCH($I8&M$5,$K$15:$K$46,0))-INDEX($D$15:$D$46,MATCH($I8&M$5,$K$15:$K$46,0)),0-INDEX($J$6:$O$11,MATCH(M$5,$I$6:$I$11,0),MATCH($I8,$J$5:$O$5,0))))","v":4},{"$f":"IF(ISBLANK(B39),0,IFERROR(INDEX($B$15:$B$46,MATCH($I8&N$5,$K$15:$K$46,0))-INDEX($D$15:$D$46,MATCH($I8&N$5,$K$15:$K$46,0)),0-INDEX($J$6:$O$11,MATCH(N$5,$I$6:$I$11,0),MATCH($I8,$J$5:$O$5,0))))","v":12},{"$f":"IF(ISBLANK(B44),0,IFERROR(INDEX($B$15:$B$46,MATCH($I8&O$5,$K$15:$K$46,0))-INDEX($D$15:$D$46,MATCH($I8&O$5,$K$15:$K$46,0)),0-INDEX($J$6:$O$11,MATCH(O$5,$I$6:$I$11,0),MATCH($I8,$J$5:$O$5,0))))","v":-6}]
["AK","2D",{"$f":"SUM(F17,E25,F31,F37,F46)","v":5},{"$f":"J17+I25+J31+J37+J46","v":68},{"$f":"I17+J25+I31+I37+I46","v":112},-44,null,null,"AK",{"$f":"IF(ISBLANK(B37),0,IFERROR(INDEX($B$15:$B$46,MATCH($I9&J$5,$K$15:$K$46,0))-INDEX($D$15:$D$46,MATCH($I9&J$5,$K$15:$K$46,0)),0-INDEX($J$6:$O$11,MATCH(J$5,$I$6:$I$11,0),MATCH($I9,$J$5:$O$5,0))))","v":-14},{"$f":"IF(ISBLANK(B46),0,IFERROR(INDEX($B$15:$B$46,MATCH($I9&K$5,$K$15:$K$46,0))-INDEX($D$15:$D$46,MATCH($I9&K$5,$K$15:$K$46,0)),0-INDEX($J$6:$O$11,MATCH(K$5,$I$6:$I$11,0),MATCH($I9,$J$5:$O$5,0))))","v":-10},{"$f":"IF(ISBLANK(B17),0,IFERROR(INDEX($B$15:$B$46,MATCH($I9&L$5,$K$15:$K$46,0))-INDEX($D$15:$D$46,MATCH($I9&L$5,$K$15:$K$46,0)),0-INDEX($J$6:$O$11,MATCH(L$5,$I$6:$I$11,0),MATCH($I9,$J$5:$O$5,0))))","v":-4},null,{"$f":"IF(ISBLANK(B31),0,IFERROR(INDEX($B$15:$B$46,MATCH($I9&N$5,$K$15:$K$46,0))-INDEX($D$15:$D$46,MATCH($I9&N$5,$K$15:$K$46,0)),0-INDEX($J$6:$O$11,MATCH(N$5,$I$6:$I$11,0),MATCH($I9,$J$5:$O$5,0))))","v":-4},{"$f":"IF(ISBLANK(B25),0,IFERROR(INDEX($B$15:$B$46,MATCH($I9&O$5,$K$15:$K$46,0))-INDEX($D$15:$D$46,MATCH($I9&O$5,$K$15:$K$46,0)),0-INDEX($J$6:$O$11,MATCH(O$5,$I$6:$I$11,0),MATCH($I9,$J$5:$O$5,0))))","v":-12}]
["AL","2E",{"$f":"SUM(E18,F24,E31,F39,E45)","v":8},{"$f":"I18+J24+I31+J39+I45","v":80},{"$f":"J18+I24+J31+I39+J45","v":100},-20,null,null,"AL",{"$f":"IF(ISBLANK(B45),0,IFERROR(INDEX($B$15:$B$46,MATCH($I10&J$5,$K$15:$K$46,0))-INDEX($D$15:$D$46,MATCH($I10&J$5,$K$15:$K$46,0)),0-INDEX($J$6:$O$11,MATCH(J$5,$I$6:$I$11,0),MATCH($I10,$J$5:$O$5,0))))","v":-4},{"$f":"IF(ISBLANK(B24),0,IFERROR(INDEX($B$15:$B$46,MATCH($I10&K$5,$K$15:$K$46,0))-INDEX($D$15:$D$46,MATCH($I10&K$5,$K$15:$K$46,0)),0-INDEX($J$6:$O$11,MATCH(K$5,$I$6:$I$11,0),MATCH($I10,$J$5:$O$5,0))))","v":-8},{"$f":"IF(ISBLANK(B39),0,IFERROR(INDEX($B$15:$B$46,MATCH($I10&L$5,$K$15:$K$46,0))-INDEX($D$15:$D$46,MATCH($I10&L$5,$K$15:$K$46,0)),0-INDEX($J$6:$O$11,MATCH(L$5,$I$6:$I$11,0),MATCH($I10,$J$5:$O$5,0))))","v":-12},{"$f":"IF(ISBLANK(B31),0,IFERROR(INDEX($B$15:$B$46,MATCH($I10&M$5,$K$15:$K$46,0))-INDEX($D$15:$D$46,MATCH($I10&M$5,$K$15:$K$46,0)),0-INDEX($J$6:$O$11,MATCH(M$5,$I$6:$I$11,0),MATCH($I10,$J$5:$O$5,0))))","v":4},null,{"$f":"IF(ISBLANK(B18),0,IFERROR(INDEX($B$15:$B$46,MATCH($I10&O$5,$K$15:$K$46,0))-INDEX($D$15:$D$46,MATCH($I10&O$5,$K$15:$K$46,0)),0-INDEX($J$6:$O$11,MATCH(O$5,$I$6:$I$11,0),MATCH($I10,$J$5:$O$5,0))))","v":0}]
["AM","2F",{"$f":"SUM(F18,F25,F30,F38,F44)","v":9},{"$f":"J18+J25+J30+J38+J44","v":79},{"$f":"I18+I25+I30+I38+I44","v":84},-5,null,null,"AM",{"$f":"IF(ISBLANK(B30),0,IFERROR(INDEX($B$15:$B$46,MATCH($I11&J$5,$K$15:$K$46,0))-INDEX($D$15:$D$46,MATCH($I11&J$5,$K$15:$K$46,0)),0-INDEX($J$6:$O$11,MATCH(J$5,$I$6:$I$11,0),MATCH($I11,$J$5:$O$5,0))))","v":-19},{"$f":"IF(ISBLANK(B38),0,IFERROR(INDEX($B$15:$B$46,MATCH($I11&K$5,$K$15:$K$46,0))-INDEX($D$15:$D$46,MATCH($I11&K$5,$K$15:$K$46,0)),0-INDEX($J$6:$O$11,MATCH(K$5,$I$6:$I$11,0),MATCH($I11,$J$5:$O$5,0))))","v":-4},{"$f":"IF(ISBLANK(B44),0,IFERROR(INDEX($B$15:$B$46,MATCH($I11&L$5,$K$15:$K$46,0))-INDEX($D$15:$D$46,MATCH($I11&L$5,$K$15:$K$46,0)),0-INDEX($J$6:$O$11,MATCH(L$5,$I$6:$I$11,0),MATCH($I11,$J$5:$O$5,0))))","v":6},{"$f":"IF(ISBLANK(B25),0,IFERROR(INDEX($B$15:$B$46,MATCH($I11&M$5,$K$15:$K$46,0))-INDEX($D$15:$D$46,MATCH($I11&M$5,$K$15:$K$46,0)),0-INDEX($J$6:$O$11,MATCH(M$5,$I$6:$I$11,0),MATCH($I11,$J$5:$O$5,0))))","v":12},{"$f":"IF(ISBLANK(B18),0,IFERROR(INDEX($B$15:$B$46,MATCH($I11&N$5,$K$15:$K$46,0))-INDEX($D$15:$D$46,MATCH($I11&N$5,$K$15:$K$46,0)),0-INDEX($J$6:$O$11,MATCH(N$5,$I$6:$I$11,0),MATCH($I11,$J$5:$O$5,0))))","v":0}]
[null,null,null,null,null,null,null,null,"Les concaténations en rouge permettent de remplir par formules le récapitulatif au dessus"]
["1er MATCH le 15 mai","à",{"$f":"A6","v":"AH"},null,null,null,null,null,"Ce récap servira à départager les ex aequos"]
[null,null,null,null,null,null,"SI forfait éq recevante"]
["Equipes","score","Equipes","score"]
[{"$f":"$A$6","v":"AH"},12,{"$f":"$A$7","v":"AI"},{"$f":"IF(G16=19,19,IF(ISBLANK(B16),\"\",IF(B16=19,0,36-B16)))","v":24},{"$f":"IF(G16=19,0,IF(ISBLANK(B16),\"\",IF(B16<18,1,IF(B16=18,2,IF(B16>18,3)))))","v":1},{"$f":"IF(G16=19,3,IF(ISBLANK(B16),\"\",IF(B16=19,0,IF(D16<18,1,IF(D16=18,2,IF(D16>=20,3))))))","v":3},null,null,{"$f":"IF(ISBLANK(B16),0,B16)","v":12},{"$f":"IF(ISBLANK(B16),0,D16)","v":24},{"$f":"A16&C16","v":"AHAI"},null,{"$f":"IF(E16=3,A16&C16,C16&A16)","v":"AIAH"}]
[{"$f":"$A$8","v":"AJ"},20,{"$f":"$A$9","v":"AK"},{"$f":"IF(G17=19,19,IF(ISBLANK(B17),\"\",IF(B17=19,0,36-B17)))","v":16},{"$f":"IF(G17=19,0,IF(ISBLANK(B17),\"\",IF(B17<18,1,IF(B17=18,2,IF(B17>18,3)))))","v":3},{"$f":"IF(G17=19,3,IF(ISBLANK(B17),\"\",IF(B17=19,0,IF(D17<18,1,IF(D17=18,2,IF(D17>=20,3))))))","v":1},null,null,{"$f":"IF(ISBLANK(B17),0,B17)","v":20},{"$f":"IF(ISBLANK(B17),0,D17)","v":16},{"$f":"A17&C17","v":"AJAK"},null,{"$f":"IF(E17=3,A17&C17,C17&A17)","v":"AJAK"}]
[{"$f":"$A$10","v":"AL"},18,{"$f":"$A$11","v":"AM"},{"$f":"IF(G18=19,19,IF(ISBLANK(B18),\"\",IF(B18=19,0,36-B18)))","v":18},{"$f":"IF(G18=19,0,IF(ISBLANK(B18),\"\",IF(B18<18,1,IF(B18=18,2,IF(B18>18,3)))))","v":2},{"$f":"IF(G18=19,3,IF(ISBLANK(B18),\"\",IF(B18=19,0,IF(D18<18,1,IF(D18=18,2,IF(D18>=20,3))))))","v":2},null,null,{"$f":"IF(ISBLANK(B18),0,B18)","v":18},{"$f":"IF(ISBLANK(B18),0,D18)","v":18},{"$f":"A18&C18","v":"ALAM"},null,"AMAL"]
[null,null,null,null,null,null,null,null,null,null,null,null,""]
["2 éme MATCH le 22 mai","à",{"$f":"A7","v":"AI"}]
[null,null,null,null,null,null,"SI forfait éq recevante"]
["Equipes","score","Equipes","score"]
[{"$f":"$A$6","v":"AH"},20,{"$f":"$A$8","v":"AJ"},{"$f":"IF(G23=19,19,IF(ISBLANK(B23),\"\",IF(B23=19,0,36-B23)))","v":16},{"$f":"IF(G23=19,0,IF(ISBLANK(B23),\"\",IF(B23<18,1,IF(B23=18,2,IF(B23>18,3)))))","v":3},{"$f":"IF(G23=19,3,IF(ISBLANK(B23),\"\",IF(B23=19,0,IF(D23<18,1,IF(D23=18,2,IF(D23>=20,3))))))","v":1},null,null,{"$f":"IF(ISBLANK(B23),0,B23)","v":20},{"$f":"IF(ISBLANK(B23),0,D23)","v":16},{"$f":"A23&C23","v":"AHAJ"},null,"AHAJ"]
[{"$f":"$A$7","v":"AI"},22,{"$f":"$A$10","v":"AL"},{"$f":"IF(G24=19,19,IF(ISBLANK(B24),\"\",IF(B24=19,0,36-B24)))","v":14},{"$f":"IF(G24=19,0,IF(ISBLANK(B24),\"\",IF(B24<18,1,IF(B24=18,2,IF(B24>18,3)))))","v":3},{"$f":"IF(G24=19,3,IF(ISBLANK(B24),\"\",IF(B24=19,0,IF(D24<18,1,IF(D24=18,2,IF(D24>=20,3))))))","v":1},null,null,{"$f":"IF(ISBLANK(B24),0,B24)","v":22},{"$f":"IF(ISBLANK(B24),0,D24)","v":14},{"$f":"A24&C24","v":"AIAL"},null,"AIAL"]
[{"$f":"$A$9","v":"AK"},12,{"$f":"$A$11","v":"AM"},{"$f":"IF(G25=19,19,IF(ISBLANK(B25),\"\",IF(B25=19,0,36-B25)))","v":24},{"$f":"IF(G25=19,0,IF(ISBLANK(B25),\"\",IF(B25<18,1,IF(B25=18,2,IF(B25>18,3)))))","v":1},{"$f":"IF(G25=19,3,IF(ISBLANK(B25),\"\",IF(B25=19,0,IF(D25<18,1,IF(D25=18,2,IF(D25>=20,3))))))","v":3},null,null,{"$f":"IF(ISBLANK(B25),0,B25)","v":12},{"$f":"IF(ISBLANK(B25),0,D25)","v":24},{"$f":"A25&C25","v":"AKAM"},null,"AMAK"]
[null,null,null,null,null,null,null,null,null,null,null,null,""]
["3 éme MATCH le 29 mai","à",{"$f":"A8","v":"AJ"}]
[null,null,null,null,null,null,"SI forfait éq recevante",null,null,null,null,null,""]
["Equipes","score","Equipes","score"]
[{"$f":"$A$6","v":"AH"},19,{"$f":"$A$11","v":"AM"},{"$f":"IF(G30=19,19,IF(ISBLANK(B30),\"\",IF(B30=19,0,36-B30)))","v":0},{"$f":"IF(G30=19,0,IF(ISBLANK(B30),\"\",IF(B30<18,1,IF(B30=18,2,IF(B30>18,3)))))","v":3},{"$f":"IF(G30=19,3,IF(ISBLANK(B30),\"\",IF(B30=19,0,IF(D30<18,1,IF(D30=18,2,IF(D30>=20,3))))))","v":0},null,null,{"$f":"IF(ISBLANK(B30),0,B30)","v":19},{"$f":"IF(ISBLANK(B30),0,D30)","v":0},{"$f":"A30&C30","v":"AHAM"},null,"AHAM"]
[{"$f":"$A$10","v":"AL"},20,{"$f":"$A$9","v":"AK"},{"$f":"IF(G31=19,19,IF(ISBLANK(B31),\"\",IF(B31=19,0,36-B31)))","v":16},{"$f":"IF(G31=19,0,IF(ISBLANK(B31),\"\",IF(B31<18,1,IF(B31=18,2,IF(B31>18,3)))))","v":3},{"$f":"IF(G31=19,3,IF(ISBLANK(B31),\"\",IF(B31=19,0,IF(D31<18,1,IF(D31=18,2,IF(D31>=20,3))))))","v":1},null,null,{"$f":"IF(ISBLANK(B31),0,B31)","v":20},{"$f":"IF(ISBLANK(B31),0,D31)","v":16},{"$f":"A31&C31","v":"ALAK"},null,"ALAK"]
[{"$f":"$A$8","v":"AJ"},13,{"$f":"$A$7","v":"AI"},{"$f":"IF(G32=19,19,IF(ISBLANK(B32),\"\",IF(B32=19,0,36-B32)))","v":23},{"$f":"IF(G32=19,0,IF(ISBLANK(B32),\"\",IF(B32<18,1,IF(B32=18,2,IF(B32>18,3)))))","v":1},{"$f":"IF(G32=19,3,IF(ISBLANK(B32),\"\",IF(B32=19,0,IF(D32<18,1,IF(D32=18,2,IF(D32>=20,3))))))","v":3},null,null,{"$f":"IF(ISBLANK(B32),0,B32)","v":13},{"$f":"IF(ISBLANK(B32),0,D32)","v":23},{"$f":"A32&C32","v":"AJAI"},null,"AIAJ"]
[null,null,null,null,null,null,null,null,null,null,null,null,""]
["4 éme MATCH le 5 juin","à",{"$f":"A9","v":"AK"}]
[null,null,null,null,null,null,"SI forfait éq recevante"]
["Equipes","score","Equipes","score"]
[{"$f":"A6","v":"AH"},25,{"$f":"$A$9","v":"AK"},{"$f":"IF(G37=19,19,IF(ISBLANK(B37),\"\",IF(B37=19,0,36-B37)))","v":11},{"$f":"IF(G37=19,0,IF(ISBLANK(B37),\"\",IF(B37<18,1,IF(B37=18,2,IF(B37>18,3)))))","v":3},{"$f":"IF(G37=19,3,IF(ISBLANK(B37),\"\",IF(B37=19,0,IF(D37<18,1,IF(D37=18,2,IF(D37>=20,3))))))","v":1},null,null,{"$f":"IF(ISBLANK(B37),0,B37)","v":25},{"$f":"IF(ISBLANK(B37),0,D37)","v":11},{"$f":"A37&C37","v":"AHAK"},null,"AHAK"]
[{"$f":"$A$7","v":"AI"},20,{"$f":"$A$11","v":"AM"},{"$f":"IF(G38=19,19,IF(ISBLANK(B38),\"\",IF(B38=19,0,36-B38)))","v":16},{"$f":"IF(G38=19,0,IF(ISBLANK(B38),\"\",IF(B38<18,1,IF(B38=18,2,IF(B38>18,3)))))","v":3},{"$f":"IF(G38=19,3,IF(ISBLANK(B38),\"\",IF(B38=19,0,IF(D38<18,1,IF(D38=18,2,IF(D38>=20,3))))))","v":1},null,null,{"$f":"IF(ISBLANK(B38),0,B38)","v":20},{"$f":"IF(ISBLANK(B38),0,D38)","v":16},{"$f":"A38&C38","v":"AIAM"},null,"AIAM"]
[{"$f":"A8","v":"AJ"},24,{"$f":"$A$10","v":"AL"},{"$f":"IF(G39=19,19,IF(ISBLANK(B39),\"\",IF(B39=19,0,36-B39)))","v":12},{"$f":"IF(G39=19,0,IF(ISBLANK(B39),\"\",IF(B39<18,1,IF(B39=18,2,IF(B39>18,3)))))","v":3},{"$f":"IF(G39=19,3,IF(ISBLANK(B39),\"\",IF(B39=19,0,IF(D39<18,1,IF(D39=18,2,IF(D39>=20,3))))))","v":1},null,null,{"$f":"IF(ISBLANK(B39),0,B39)","v":24},{"$f":"IF(ISBLANK(B39),0,D39)","v":12},{"$f":"A39&C39","v":"AJAL"},null,"AJAL"]
[null,null,null,null,null,null,null,null,null,null,null,null,""]
["5 éme MATCH le 12 juin","à",{"$f":"A10","v":"AL"}]
[null,null,null,null,null,null,"SI forfait éq recevante"]
["Equipes","score","Equipes","score"]
[{"$f":"A8","v":"AJ"},15,{"$f":"$A$11","v":"AM"},{"$f":"IF(G44=19,19,IF(ISBLANK(B44),\"\",IF(B44=19,0,36-B44)))","v":21},{"$f":"IF(G44=19,0,IF(ISBLANK(B44),\"\",IF(B44<18,1,IF(B44=18,2,IF(B44>18,3)))))","v":1},{"$f":"IF(G44=19,3,IF(ISBLANK(B44),\"\",IF(B44=19,0,IF(D44<18,1,IF(D44=18,2,IF(D44>=20,3))))))","v":3},null,null,{"$f":"IF(ISBLANK(B44),0,B44)","v":15},{"$f":"IF(ISBLANK(B44),0,D44)","v":21},{"$f":"A44&C44","v":"AJAM"},null,"AMAJ"]
[{"$f":"$A$10","v":"AL"},16,{"$f":"A6","v":"AH"},{"$f":"IF(G45=19,19,IF(ISBLANK(B45),\"\",IF(B45=19,0,36-B45)))","v":20},{"$f":"IF(G45=19,0,IF(ISBLANK(B45),\"\",IF(B45<18,1,IF(B45=18,2,IF(B45>18,3)))))","v":1},{"$f":"IF(G45=19,3,IF(ISBLANK(B45),\"\",IF(B45=19,0,IF(D45<18,1,IF(D45=18,2,IF(D45>=20,3))))))","v":3},null,null,{"$f":"IF(ISBLANK(B45),0,B45)","v":16},{"$f":"IF(ISBLANK(B45),0,D45)","v":20},{"$f":"A45&C45","v":"ALAH"},null,"AHAL"]
[{"$f":"A7","v":"AI"},23,{"$f":"$A$9","v":"AK"},{"$f":"IF(G46=19,19,IF(ISBLANK(B46),\"\",IF(B46=19,0,36-B46)))","v":13},{"$f":"IF(G46=19,0,IF(ISBLANK(B46),\"\",IF(B46<18,1,IF(B46=18,2,IF(B46>18,3)))))","v":3},{"$f":"IF(G46=19,3,IF(ISBLANK(B46),\"\",IF(B46=19,0,IF(D46<18,1,IF(D46=18,2,IF(D46>=20,3))))))","v":1},null,null,{"$f":"IF(ISBLANK(B46),0,B46)","v":23},{"$f":"IF(ISBLANK(B46),0,D46)","v":13},{"$f":"A46&C46","v":"AIAK"},null,"AIAK"]
[]
["CLASSEMENT"]
["EQUIPES",null,"POINTS","Pour","Contre","Diff","CLASST"]
["AH","2A",0,0,0,0,{"$f":"B59","v":5},{"$f":"IF(AND(G50=1,COUNTIF(rang1,1)>1),COUNTIF(G$50:G50,1),IF(AND(G50=2,COUNTIF(rang1,2)>1),COUNTIF(G$50:G50,2)+3,\"\"))","v":""}]
["AI","2B",0,0,0,0,1,{"$f":"IF(AND(G51=1,COUNTIF(rang1,1)>1),COUNTIF(G$50:G51,1),IF(AND(G51=2,COUNTIF(rang1,2)>1),COUNTIF(G$50:G51,2)+3,\"\"))","v":""}]
["AJ","2C",0,0,0,0,2,{"$f":"IF(AND(G52=1,COUNTIF(rang1,1)>1),COUNTIF(G$50:G52,1),IF(AND(G52=2,COUNTIF(rang1,2)>1),COUNTIF(G$50:G52,2)+3,\"\"))","v":""}]
["AK","2D",0,0,0,0,4,{"$f":"IF(AND(G53=1,COUNTIF(rang1,1)>1),COUNTIF(G$50:G53,1),IF(AND(G53=2,COUNTIF(rang1,2)>1),COUNTIF(G$50:G53,2)+3,\"\"))","v":""}]
["AL","2E",0,0,0,0,3,{"$f":"IF(AND(G54=1,COUNTIF(rang1,1)>1),COUNTIF(G$50:G54,1),IF(AND(G54=2,COUNTIF(rang1,2)>1),COUNTIF(G$50:G54,2)+3,\"\"))","v":""}]
["AM","2F",0,0,0,0,6,{"$f":"IF(AND(G55=1,COUNTIF(rang1,1)>1),COUNTIF(G$50:G55,1),IF(AND(G55=2,COUNTIF(rang1,2)>1),COUNTIF(G$50:G55,2)+3,\"\"))","v":""}]
[]
[null,"CLASSEMENT FINAL et DEPARTAGE EX AEQUOS",null,null,null,null,null,null,null,null,null,null,"CLASSEMENT"]
[null,"Rang","Equipes","Pts","diff pts avec exaequo","cumul","departage goalaverage si même cumul","RP",null,null,null,"RP","Rang","Equipe","Pts"]
[null,{"$f":"RANK(G59,$G$59:$G$64)","v":5},{"$f":"INDEX($A$50:$A$55,MATCH(H59,$L$59:$L$64,0))","v":"AH"},{"$f":"VLOOKUP(C59,$A$50:$C$55,3,0)","v":0},{"$f":"IF(D59=D60,INDEX($J$6:$O$11,MATCH(C59,$I$6:$I$11,0),MATCH(C60,$J$5:$O$5,0)),IF(D59=D58,INDEX($J$6:$O$11,MATCH(C59,$I$6:$I$11,0),MATCH(C58,$J$5:$O$5,0)),0))","v":-12},{"$f":"D59+E59/100","v":-0.12},{"$f":"IF(AND(F59<>F58,F59<>F60),F59,F59+VLOOKUP(C59,$A$50:$F$55,6,0)/100)","v":-0.12},1,null,null,null,{"$f":"RANK(C50,$C$50:$C$55)+COUNTIF($C$50:C50,C50)-1","v":1},{"$f":"B59","v":5},"AH",{"$f":"VLOOKUP(N59,$C$59:$D$64,2,0)","v":0}]
[null,1,"AI",0,{"$f":"IF(D60=D61,INDEX($J$6:$O$11,MATCH(C60,$I$6:$I$11,0),MATCH(C61,$J$5:$O$5,0)),IF(D60=D59,INDEX($J$6:$O$11,MATCH(C60,$I$6:$I$11,0),MATCH(C59,$J$5:$O$5,0)),0))","v":10},0.1,{"$f":"IF(AND(F60<>F59,F60<>F61),F60,F60+VLOOKUP(C60,$A$50:$F$55,6,0)/100)","v":0.1},2,null,null,null,{"$f":"RANK(C51,$C$50:$C$55)+COUNTIF($C$50:C51,C51)-1","v":2},1,"AI",0]
[null,2,"AJ",0,{"$f":"IF(D61=D62,INDEX($J$6:$O$11,MATCH(C61,$I$6:$I$11,0),MATCH(C62,$J$5:$O$5,0)),IF(D61=D60,INDEX($J$6:$O$11,MATCH(C61,$I$6:$I$11,0),MATCH(C60,$J$5:$O$5,0)),0))","v":4},0.04,{"$f":"IF(AND(F61<>F60,F61<>F62),F61,F61+VLOOKUP(C61,$A$50:$F$55,6,0)/100)","v":0.04},3,null,null,null,{"$f":"RANK(C52,$C$50:$C$55)+COUNTIF($C$50:C52,C52)-1","v":3},2,"AJ",0]
[null,4,"AK",0,{"$f":"IF(D62=D63,INDEX($J$6:$O$11,MATCH(C62,$I$6:$I$11,0),MATCH(C63,$J$5:$O$5,0)),IF(D62=D61,INDEX($J$6:$O$11,MATCH(C62,$I$6:$I$11,0),MATCH(C61,$J$5:$O$5,0)),0))","v":-4},-0.04,{"$f":"IF(AND(F62<>F61,F62<>F63),F62,F62+VLOOKUP(C62,$A$50:$F$55,6,0)/100)","v":-0.04},4,null,null,null,{"$f":"RANK(C53,$C$50:$C$55)+COUNTIF($C$50:C53,C53)-1","v":4},4,"AK",0]
[null,3,"AL",0,{"$f":"IF(D63=D64,INDEX($J$6:$O$11,MATCH(C63,$I$6:$I$11,0),MATCH(C64,$J$5:$O$5,0)),IF(D63=D62,INDEX($J$6:$O$11,MATCH(C63,$I$6:$I$11,0),MATCH(C62,$J$5:$O$5,0)),0))","v":0},0,{"$f":"IF(AND(F63<>F62,F63<>F64),F63,F63+VLOOKUP(C63,$A$50:$F$55,6,0)/100)","v":0},5,null,null,null,{"$f":"RANK(C54,$C$50:$C$55)+COUNTIF($C$50:C54,C54)-1","v":5},3,"AL",0]
[null,6,"AM",0,{"$f":"IF(D64=D59,INDEX($J$6:$O$11,MATCH(C64,$I$6:$I$11,0),MATCH(C59,$J$5:$O$5,0)),IF(D64=D63,INDEX($J$6:$O$11,MATCH(C64,$I$6:$I$11,0),MATCH(C63,$J$5:$O$5,0)),0))","v":-19},-0.19,{"$f":"IF(AND(F64<>F63,F64<>F59),F64,F64+VLOOKUP(C64,$A$50:$F$55,6,0)/100)","v":-0.19},6,null,null,null,{"$f":"RANK(C55,$C$50:$C$55)+COUNTIF($C$50:C55,C55)-1","v":6},6,"AM",0]

{"sheet":"P3","index":2,"n_rows":64,"n_cols":15,"rows_kept":64,"cut":false,"hidden":false,"merged":[[0,0,0,5],[1,0,1,5],[2,0,2,5],[3,0,3,5],[13,6,14,6],[56,1,56,6],[56,12,56,14],[20,6,21,6],[27,6,28,6],[34,6,35,6],[41,6,42,6],[47,0,47,5]]}
[]
["CHAMPIONNAT DES CLUBS"]
[]
["POULE 3",null,null,null,null,null,null,null,"Récapitulatif  différence match entre 2 équipes"]
["EQUIPES",null,"POINTS","Pour","Contre","Diff",null,null,null,{"$f":"A6","v":"AN"},{"$f":"A7","v":"AO"},{"$f":"A8","v":"AP"},{"$f":"A9","v":"AQ"},{"$f":"A10","v":"AR"},{"$f":"A11","v":"AS"}]
["AN","3A",{"$f":"SUM(E16,E23,E30,E37,F45)","v":0},{"$f":"I16+I23+I30+I37+J45","v":0},{"$f":"J16+J23+J30+J37+I45","v":0},{"$f":"D6-E6","v":0},null,null,{"$f":"A6","v":"AN"},null,{"$f":"IF(ISBLANK(B16),0,IFERROR(INDEX($B$15:$B$46,MATCH($I6&K$5,$K$15:$K$46,0))-INDEX($D$15:$D$46,MATCH($I6&K$5,$K$15:$K$46,0)),0-INDEX($J$6:$O$11,MATCH(K$5,$I$6:$I$11,0),MATCH($I6,$J$5:$O$5,0))))","v":0},{"$f":"IF(ISBLANK(B23),0,IFERROR(INDEX($B$15:$B$46,MATCH($I6&L$5,$K$15:$K$46,0))-INDEX($D$15:$D$46,MATCH($I6&L$5,$K$15:$K$46,0)),0-INDEX($J$6:$O$11,MATCH(L$5,$I$6:$I$11,0),MATCH($I6,$J$5:$O$5,0))))","v":0},{"$f":"IF(ISBLANK(B37),0,IFERROR(INDEX($B$15:$B$46,MATCH($I6&M$5,$K$15:$K$46,0))-INDEX($D$15:$D$46,MATCH($I6&M$5,$K$15:$K$46,0)),0-INDEX($J$6:$O$11,MATCH(M$5,$I$6:$I$11,0),MATCH($I6,$J$5:$O$5,0))))","v":0},{"$f":"IF(ISBLANK(B45),0,IFERROR(INDEX($B$15:$B$46,MATCH($I6&N$5,$K$15:$K$46,0))-INDEX($D$15:$D$46,MATCH($I6&N$5,$K$15:$K$46,0)),0-INDEX($J$6:$O$11,MATCH(N$5,$I$6:$I$11,0),MATCH($I6,$J$5:$O$5,0))))","v":0},{"$f":"IF(ISBLANK(B30),0,IFERROR(INDEX($B$15:$B$46,MATCH($I6&O$5,$K$15:$K$46,0))-INDEX($D$15:$D$46,MATCH($I6&O$5,$K$15:$K$46,0)),0-INDEX($J$6:$O$11,MATCH(O$5,$I$6:$I$11,0),MATCH($I6,$J$5:$O$5,0))))","v":0}]
["AO","3B",{"$f":"SUM(F16,E24,F32,E38,E46)","v":0},{"$f":"J16+I24+J32+I38+I46","v":0},{"$f":"I16+J24+I32+J38+J46","v":0},0,null,null,"AO",{"$f":"IF(ISBLANK(B16),0,IFERROR(INDEX($B$15:$B$46,MATCH($I7&J$5,$K$15:$K$46,0))-INDEX($D$15:$D$46,MATCH($I7&J$5,$K$15:$K$46,0)),0-INDEX($J$6:$O$11,MATCH(J$5,$I$6:$I$11,0),MATCH($I7,$J$5:$O$5,0))))","v":0},null,{"$f":"IF(ISBLANK(B32),0,IFERROR(INDEX($B$15:$B$46,MATCH($I7&L$5,$K$15:$K$46,0))-INDEX($D$15:$D$46,MATCH($I7&L$5,$K$15:$K$46,0)),0-INDEX($J$6:$O$11,MATCH(L$5,$I$6:$I$11,0),MATCH($I7,$J$5:$O$5,0))))","v":0},{"$f":"IF(ISBLANK(B46),0,IFERROR(INDEX($B$15:$B$46,MATCH($I7&M$5,$K$15:$K$46,0))-INDEX($D$15:$D$46,MATCH($I7&M$5,$K$15:$K$46,0)),0-INDEX($J$6:$O$11,MATCH(M$5,$I$6:$I$11,0),MATCH($I7,$J$5:$O$5,0))))","v":0},{"$f":"IF(ISBLANK(B24),0,IFERROR(INDEX($B$15:$B$46,MATCH($I7&N$5,$K$15:$K$46,0))-INDEX($D$15:$D$46,MATCH($I7&N$5,$K$15:$K$46,0)),0-INDEX($J$6:$O$11,MATCH(N$5,$I$6:$I$11,0),MATCH($I7,$J$5:$O$5,0))))","v":0},{"$f":"IF(ISBLANK(B38),0,IFERROR(INDEX($B$15:$B$46,MATCH($I7&O$5,$K$15:$K$46,0))-INDEX($D$15:$D$46,MATCH($I7&O$5,$K$15:$K$46,0)),0-INDEX($J$6:$O$11,MATCH(O$5,$I$6:$I$11,0),MATCH($I7,$J$5:$O$5,0))))","v":0}]
["AP","3C",{"$f":"SUM(E17,F23,E32,E39,E44)","v":0},{"$f":"I17+J23+I32+I39+I44","v":0},{"$f":"J17+I23+J32+J39+J44","v":0},0,null,null,"AP",{"$f":"IF(ISBLANK(B23),0,IFERROR(INDEX($B$15:$B$46,MATCH($I8&J$5,$K$15:$K$46,0))-INDEX($D$15:$D$46,MATCH($I8&J$5,$K$15:$K$46,0)),0-INDEX($J$6:$O$11,MATCH(J$5,$I$6:$I$11,0),MATCH($I8,$J$5:$O$5,0))))","v":0},{"$f":"IF(ISBLANK(B32),0,IFERROR(INDEX($B$15:$B$46,MATCH($I8&K$5,$K$15:$K$46,0))-INDEX($D$15:$D$46,MATCH($I8&K$5,$K$15:$K$46,0)),0-INDEX($J$6:$O$11,MATCH(K$5,$I$6:$I$11,0),MATCH($I8,$J$5:$O$5,0))))","v":0},null,{"$f":"IF(ISBLANK(B17),0,IFERROR(INDEX($B$15:$B$46,MATCH($I8&M$5,$K$15:$K$46,0))-INDEX($D$15:$D$46,MATCH($I8&M$5,$K$15:$K$46,0)),0-INDEX($J$6:$O$11,MATCH(M$5,$I$6:$I$11,0),MATCH($I8,$J$5:$O$5,0))))","v":0},{"$f":"IF(ISBLANK(B39),0,IFERROR(INDEX($B$15:$B$46,MATCH($I8&N$5,$K$15:$K$46,0))-INDEX($D$15:$D$46,MATCH($I8&N$5,$K$15:$K$46,0)),0-INDEX($J$6:$O$11,MATCH(N$5,$I$6:$I$11,0),MATCH($I8,$J$5:$O$5,0))))","v":0},{"$f":"IF(ISBLANK(B44),0,IFERROR(INDEX($B$15:$B$46,MATCH($I8&O$5,$K$15:$K$46,0))-INDEX($D$15:$D$46,MATCH($I8&O$5,$K$15:$K$46,0)),0-INDEX($J$6:$O$11,MATCH(O$5,$I$6:$I$11,0),MATCH($I8,$J$5:$O$5,0))))","v":0}]
["AQ","3D",{"$f":"SUM(F17,E25,F31,F37,F46)","v":0},{"$f":"J17+I25+J31+J37+J46","v":0},{"$f":"I17+J25+I31+I37+I46","v":0},0,null,null,"AQ",{"$f":"IF(ISBLANK(B37),0,IFERROR(INDEX($B$15:$B$46,MATCH($I9&J$5,$K$15:$K$46,0))-INDEX($D$15:$D$46,MATCH($I9&J$5,$K$15:$K$46,0)),0-INDEX($J$6:$O$11,MATCH(J$5,$I$6:$I$11,0),MATCH($I9,$J$5:$O$5,0))))","v":0},{"$f":"IF(ISBLANK(B46),0,IFERROR(INDEX($B$15:$B$46,MATCH($I9&K$5,$K$15:$K$46,0))-INDEX($D$15:$D$46,MATCH($I9&K$5,$K$15:$K$46,0)),0-INDEX($J$6:$O$11,MATCH(K$5,$I$6:$I$11,0),MATCH($I9,$J$5:$O$5,0))))","v":0},{"$f":"IF(ISBLANK(B17),0,IFERROR(INDEX($B$15:$B$46,MATCH($I9&L$5,$K$15:$K$46,0))-INDEX($D$15:$D$46,MATCH($I9&L$5,$K$15:$K$46,0)),0-INDEX($J$6:$O$11,MATCH(L$5,$I$6:$I$11,0),MATCH($I9,$J$5:$O$5,0))))","v":0},null,{"$f":"IF(ISBLANK(B31),0,IFERROR(INDEX($B$15:$B$46,MATCH($I9&N$5,$K$15:$K$46,0))-INDEX($D$15:$D$46,MATCH($I9&N$5,$K$15:$K$46,0)),0-INDEX($J$6:$O$11,MATCH(N$5,$I$6:$I$11,0),MATCH($I9,$J$5:$O$5,0))))","v":0},{"$f":"IF(ISBLANK(B25),0,IFERROR(INDEX($B$15:$B$46,MATCH($I9&O$5,$K$15:$K$46,0))-INDEX($D$15:$D$46,MATCH($I9&O$5,$K$15:$K$46,0)),0-INDEX($J$6:$O$11,MATCH(O$5,$I$6:$I$11,0),MATCH($I9,$J$5:$O$5,0))))","v":0}]
["AR","3E",{"$f":"SUM(E18,F24,E31,F39,E45)","v":0},{"$f":"I18+J24+I31+J39+I45","v":0},{"$f":"J18+I24+J31+I39+J45","v":0},0,null,null,"AR",{"$f":"IF(ISBLANK(B45),0,IFERROR(INDEX($B$15:$B$46,MATCH($I10&J$5,$K$15:$K$46,0))-INDEX($D$15:$D$46,MATCH($I10&J$5,$K$15:$K$46,0)),0-INDEX($J$6:$O$11,MATCH(J$5,$I$6:$I$11,0),MATCH($I10,$J$5:$O$5,0))))","v":0},{"$f":"IF(ISBLANK(B24),0,IFERROR(INDEX($B$15:$B$46,MATCH($I10&K$5,$K$15:$K$46,0))-INDEX($D$15:$D$46,MATCH($I10&K$5,$K$15:$K$46,0)),0-INDEX($J$6:$O$11,MATCH(K$5,$I$6:$I$11,0),MATCH($I10,$J$5:$O$5,0))))","v":0},{"$f":"IF(ISBLANK(B39),0,IFERROR(INDEX($B$15:$B$46,MATCH($I10&L$5,$K$15:$K$46,0))-INDEX($D$15:$D$46,MATCH($I10&L$5,$K$15:$K$46,0)),0-INDEX($J$6:$O$11,MATCH(L$5,$I$6:$I$11,0),MATCH($I10,$J$5:$O$5,0))))","v":0},{"$f":"IF(ISBLANK(B31),0,IFERROR(INDEX($B$15:$B$46,MATCH($I10&M$5,$K$15:$K$46,0))-INDEX($D$15:$D$46,MATCH($I10&M$5,$K$15:$K$46,0)),0-INDEX($J$6:$O$11,MATCH(M$5,$I$6:$I$11,0),MATCH($I10,$J$5:$O$5,0))))","v":0},null,{"$f":"IF(ISBLANK(B18),0,IFERROR(INDEX($B$15:$B$46,MATCH($I10&O$5,$K$15:$K$46,0))-INDEX($D$15:$D$46,MATCH($I10&O$5,$K$15:$K$46,0)),0-INDEX($J$6:$O$11,MATCH(O$5,$I$6:$I$11,0),MATCH($I10,$J$5:$O$5,0))))","v":0}]
["AS","3F",{"$f":"SUM(F18,F25,F30,F38,F44)","v":0},{"$f":"J18+J25+J30+J38+J44","v":0},{"$f":"I18+I25+I30+I38+I44","v":0},0,null,null,"AS",{"$f":"IF(ISBLANK(B30),0,IFERROR(INDEX($B$15:$B$46,MATCH($I11&J$5,$K$15:$K$46,0))-INDEX($D$15:$D$46,MATCH($I11&J$5,$K$15:$K$46,0)),0-INDEX($J$6:$O$11,MATCH(J$5,$I$6:$I$11,0),MATCH($I11,$J$5:$O$5,0))))","v":0},{"$f":"IF(ISBLANK(B38),0,IFERROR(INDEX($B$15:$B$46,MATCH($I11&K$5,$K$15:$K$46,0))-INDEX($D$15:$D$46,MATCH($I11&K$5,$K$15:$K$46,0)),0-INDEX($J$6:$O$11,MATCH(K$5,$I$6:$I$11,0),MATCH($I11,$J$5:$O$5,0))))","v":0},{"$f":"IF(ISBLANK(B44),0,IFERROR(INDEX($B$15:$B$46,MATCH($I11&L$5,$K$15:$K$46,0))-INDEX($D$15:$D$46,MATCH($I11&L$5,$K$15:$K$46,0)),0-INDEX($J$6:$O$11,MATCH(L$5,$I$6:$I$11,0),MATCH($I11,$J$5:$O$5,0))))","v":0},{"$f":"IF(ISBLANK(B25),0,IFERROR(INDEX($B$15:$B$46,MATCH($I11&M$5,$K$15:$K$46,0))-INDEX($D$15:$D$46,MATCH($I11&M$5,$K$15:$K$46,0)),0-INDEX($J$6:$O$11,MATCH(M$5,$I$6:$I$11,0),MATCH($I11,$J$5:$O$5,0))))","v":0},{"$f":"IF(ISBLANK(B18),0,IFERROR(INDEX($B$15:$B$46,MATCH($I11&N$5,$K$15:$K$46,0))-INDEX($D$15:$D$46,MATCH($I11&N$5,$K$15:$K$46,0)),0-INDEX($J$6:$O$11,MATCH(N$5,$I$6:$I$11,0),MATCH($I11,$J$5:$O$5,0))))","v":0}]
[null,null,null,null,null,null,null,null,"Les concaténations en rouge permettent de remplir par formules le récapitulatif au dessus"]
["1er MATCH le 15 mai","à",{"$f":"A6","v":"AN"},null,null,null,null,null,"Ce récap servira à départager les ex aequos"]
[null,null,null,null,null,null,"SI forfait éq recevante"]
["Equipes","score","Equipes","score"]
[{"$f":"$A$6","v":"AN"},null,{"$f":"$A$7","v":"AO"},{"$f":"IF(G16=19,19,IF(ISBLANK(B16),\"\",IF(B16=19,0,36-B16)))","v":""},{"$f":"IF(G16=19,0,IF(ISBLANK(B16),\"\",IF(B16<18,1,IF(B16=18,2,IF(B16>18,3)))))","v":""},{"$f":"IF(G16=19,3,IF(ISBLANK(B16),\"\",IF(B16=19,0,IF(D16<18,1,IF(D16=18,2,IF(D16>=20,3))))))","v":""},null,null,{"$f":"IF(ISBLANK(B16),0,B16)","v":0},{"$f":"IF(ISBLANK(B16),0,D16)","v":0},{"$f":"A16&C16","v":"ANAO"}]
[{"$f":"$A$8","v":"AP"},null,{"$f":"$A$9","v":"AQ"},{"$f":"IF(G17=19,19,IF(ISBLANK(B17),\"\",IF(B17=19,0,36-B17)))","v":""},{"$f":"IF(G17=19,0,IF(ISBLANK(B17),\"\",IF(B17<18,1,IF(B17=18,2,IF(B17>18,3)))))","v":""},{"$f":"IF(G17=19,3,IF(ISBLANK(B17),\"\",IF(B17=19,0,IF(D17<18,1,IF(D17=18,2,IF(D17>=20,3))))))","v":""},null,null,{"$f":"IF(ISBLANK(B17),0,B17)","v":0},{"$f":"IF(ISBLANK(B17),0,D17)","v":0},{"$f":"A17&C17","v":"APAQ"}]
[{"$f":"$A$10","v":"AR"},null,{"$f":"$A$11","v":"AS"},{"$f":"IF(G18=19,19,IF(ISBLANK(B18),\"\",IF(B18=19,0,36-B18)))","v":""},{"$f":"IF(G18=19,0,IF(ISBLANK(B18),\"\",IF(B18<18,1,IF(B18=18,2,IF(B18>18,3)))))","v":""},{"$f":"IF(G18=19,3,IF(ISBLANK(B18),\"\",IF(B18=19,0,IF(D18<18,1,IF(D18=18,2,IF(D18>=20,3))))))","v":""},null,null,{"$f":"IF(ISBLANK(B18),0,B18)","v":0},{"$f":"IF(ISBLANK(B18),0,D18)","v":0},{"$f":"A18&C18","v":"ARAS"}]
[]
["2 éme MATCH le 22 mai","à",{"$f":"A7","v":"AO"}]
[null,null,null,null,null,null,"SI forfait éq recevante"]
["Equipes","score","Equipes","score"]
[{"$f":"$A$6","v":"AN"},null,{"$f":"$A$8","v":"AP"},{"$f":"IF(G23=19,19,IF(ISBLANK(B23),\"\",IF(B23=19,0,36-B23)))","v":""},{"$f":"IF(G23=19,0,IF(ISBLANK(B23),\"\",IF(B23<18,1,IF(B23=18,2,IF(B23>18,3)))))","v":""},{"$f":"IF(G23=19,3,IF(ISBLANK(B23),\"\",IF(B23=19,0,IF(D23<18,1,IF(D23=18,2,IF(D23>=20,3))))))","v":""},null,null,{"$f":"IF(ISBLANK(B23),0,B23)","v":0},{"$f":"IF(ISBLANK(B23),0,D23)","v":0},{"$f":"A23&C23","v":"ANAP"}]
[{"$f":"$A$7","v":"AO"},null,{"$f":"$A$10","v":"AR"},{"$f":"IF(G24=19,19,IF(ISBLANK(B24),\"\",IF(B24=19,0,36-B24)))","v":""},{"$f":"IF(G24=19,0,IF(ISBLANK(B24),\"\",IF(B24<18,1,IF(B24=18,2,IF(B24>18,3)))))","v":""},{"$f":"IF(G24=19,3,IF(ISBLANK(B24),\"\",IF(B24=19,0,IF(D24<18,1,IF(D24=18,2,IF(D24>=20,3))))))","v":""},null,null,{"$f":"IF(ISBLANK(B24),0,B24)","v":0},{"$f":"IF(ISBLANK(B24),0,D24)","v":0},{"$f":"A24&C24","v":"AOAR"}]
[{"$f":"$A$9","v":"AQ"},null,{"$f":"$A$11","v":"AS"},{"$f":"IF(G25=19,19,IF(ISBLANK(B25),\"\",IF(B25=19,0,36-B25)))","v":""},{"$f":"IF(G25=19,0,IF(ISBLANK(B25),\"\",IF(B25<18,1,IF(B25=18,2,IF(B25>18,3)))))","v":""},{"$f":"IF(G25=19,3,IF(ISBLANK(B25),\"\",IF(B25=19,0,IF(D25<18,1,IF(D25=18,2,IF(D25>=20,3))))))","v":""},null,null,{"$f":"IF(ISBLANK(B25),0,B25)","v":0},{"$f":"IF(ISBLANK(B25),0,D25)","v":0},{"$f":"A25&C25","v":"AQAS"}]
[]
["3 éme MATCH le 29 mai","à",{"$f":"A8","v":"AP"}]
[null,null,null,null,null,null,"SI forfait éq recevante"]
["Equipes","score","Equipes","score"]
[{"$f":"$A$6","v":"AN"},null,{"$f":"$A$11","v":"AS"},{"$f":"IF(G30=19,19,IF(ISBLANK(B30),\"\",IF(B30=19,0,36-B30)))","v":""},{"$f":"IF(G30=19,0,IF(ISBLANK(B30),\"\",IF(B30<18,1,IF(B30=18,2,IF(B30>18,3)))))","v":""},{"$f":"IF(G30=19,3,IF(ISBLANK(B30),\"\",IF(B30=19,0,IF(D30<18,1,IF(D30=18,2,IF(D30>=20,3))))))","v":""},null,null,{"$f":"IF(ISBLANK(B30),0,B30)","v":0},{"$f":"IF(ISBLANK(B30),0,D30)","v":0},{"$f":"A30&C30","v":"ANAS"}]
[{"$f":"$A$10","v":"AR"},null,{"$f":"$A$9","v":"AQ"},{"$f":"IF(G31=19,19,IF(ISBLANK(B31),\"\",IF(B31=19,0,36-B31)))","v":""},{"$f":"IF(G31=19,0,IF(ISBLANK(B31),\"\",IF(B31<18,1,IF(B31=18,2,IF(B31>18,3)))))","v":""},{"$f":"IF(G31=19,3,IF(ISBLANK(B31),\"\",IF(B31=19,0,IF(D31<18,1,IF(D31=18,2,IF(D31>=20,3))))))","v":""},null,null,{"$f":"IF(ISBLANK(B31),0,B31)","v":0},{"$f":"IF(ISBLANK(B31),0,D31)","v":0},{"$f":"A31&C31","v":"ARAQ"}]
[{"$f":"$A$8","v":"AP"},null,{"$f":"$A$7","v":"AO"},{"$f":"IF(G32=19,19,IF(ISBLANK(B32),\"\",IF(B32=19,0,36-B32)))","v":""},{"$f":"IF(G32=19,0,IF(ISBLANK(B32),\"\",IF(B32<18,1,IF(B32=18,2,IF(B32>18,3)))))","v":""},{"$f":"IF(G32=19,3,IF(ISBLANK(B32),\"\",IF(B32=19,0,IF(D32<18,1,IF(D32=18,2,IF(D32>=20,3))))))","v":""},null,null,{"$f":"IF(ISBLANK(B32),0,B32)","v":0},{"$f":"IF(ISBLANK(B32),0,D32)","v":0},{"$f":"A32&C32","v":"APAO"}]
[]
["4 éme MATCH le 5 juin","à",{"$f":"A9","v":"AQ"}]
[null,null,null,null,null,null,"SI forfait éq recevante"]
["Equipes","score","Equipes","score"]
[{"$f":"A6","v":"AN"},null,{"$f":"$A$9","v":"AQ"},{"$f":"IF(G37=19,19,IF(ISBLANK(B37),\"\",IF(B37=19,0,36-B37)))","v":""},{"$f":"IF(G37=19,0,IF(ISBLANK(B37),\"\",IF(B37<18,1,IF(B37=18,2,IF(B37>18,3)))))","v":""},{"$f":"IF(G37=19,3,IF(ISBLANK(B37),\"\",IF(B37=19,0,IF(D37<18,1,IF(D37=18,2,IF(D37>=20,3))))))","v":""},null,null,{"$f":"IF(ISBLANK(B37),0,B37)","v":0},{"$f":"IF(ISBLANK(B37),0,D37)","v":0},{"$f":"A37&C37","v":"ANAQ"}]
[{"$f":"$A$7","v":"AO"},null,{"$f":"$A$11","v":"AS"},{"$f":"IF(G38=19,19,IF(ISBLANK(B38),\"\",IF(B38=19,0,36-B38)))","v":""},{"$f":"IF(G38=19,0,IF(ISBLANK(B38),\"\",IF(B38<18,1,IF(B38=18,2,IF(B38>18,3)))))","v":""},{"$f":"IF(G38=19,3,IF(ISBLANK(B38),\"\",IF(B38=19,0,IF(D38<18,1,IF(D38=18,2,IF(D38>=20,3))))))","v":""},null,null,{"$f":"IF(ISBLANK(B38),0,B38)","v":0},{"$f":"IF(ISBLANK(B38),0,D38)","v":0},{"$f":"A38&C38","v":"AOAS"}]
[{"$f":"A8","v":"AP"},null,{"$f":"$A$10","v":"AR"},{"$f":"IF(G39=19,19,IF(ISBLANK(B39),\"\",IF(B39=19,0,36-B39)))","v":""},{"$f":"IF(G39=19,0,IF(ISBLANK(B39),\"\",IF(B39<18,1,IF(B39=18,2,IF(B39>18,3)))))","v":""},{"$f":"IF(G39=19,3,IF(ISBLANK(B39),\"\",IF(B39=19,0,IF(D39<18,1,IF(D39=18,2,IF(D39>=20,3))))))","v":""},null,null,{"$f":"IF(ISBLANK(B39),0,B39)","v":0},{"$f":"IF(ISBLANK(B39),0,D39)","v":0},{"$f":"A39&C39","v":"APAR"}]
[]
["5 éme MATCH le 12 juin","à",{"$f":"A10","v":"AR"}]
[null,null,null,null,null,null,"SI forfait éq recevante"]
["Equipes","score","Equipes","score"]
[{"$f":"A8","v":"AP"},null,{"$f":"$A$11","v":"AS"},{"$f":"IF(G44=19,19,IF(ISBLANK(B44),\"\",IF(B44=19,0,36-B44)))","v":""},{"$f":"IF(G44=19,0,IF(ISBLANK(B44),\"\",IF(B44<18,1,IF(B44=18,2,IF(B44>18,3)))))","v":""},{"$f":"IF(G44=19,3,IF(ISBLANK(B44),\"\",IF(B44=19,0,IF(D44<18,1,IF(D44=18,2,IF(D44>=20,3))))))","v":""},null,null,{"$f":"IF(ISBLANK(B44),0,B44)","v":0},{"$f":"IF(ISBLANK(B44),0,D44)","v":0},{"$f":"A44&C44","v":"APAS"}]
[{"$f":"$A$10","v":"AR"},null,{"$f":"A6","v":"AN"},{"$f":"IF(G45=19,19,IF(ISBLANK(B45),\"\",IF(B45=19,0,36-B45)))","v":""},{"$f":"IF(G45=19,0,IF(ISBLANK(B45),\"\",IF(B45<18,1,IF(B45=18,2,IF(B45>18,3)))))","v":""},{"$f":"IF(G45=19,3,IF(ISBLANK(B45),\"\",IF(B45=19,0,IF(D45<18,1,IF(D45=18,2,IF(D45>=20,3))))))","v":""},null,null,{"$f":"IF(ISBLANK(B45),0,B45)","v":0},{"$f":"IF(ISBLANK(B45),0,D45)","v":0},{"$f":"A45&C45","v":"ARAN"}]
[{"$f":"A7","v":"AO"},null,{"$f":"$A$9","v":"AQ"},{"$f":"IF(G46=19,19,IF(ISBLANK(B46),\"\",IF(B46=19,0,36-B46)))","v":""},{"$f":"IF(G46=19,0,IF(ISBLANK(B46),\"\",IF(B46<18,1,IF(B46=18,2,IF(B46>18,3)))))","v":""},{"$f":"IF(G46=19,3,IF(ISBLANK(B46),\"\",IF(B46=19,0,IF(D46<18,1,IF(D46=18,2,IF(D46>=20,3))))))","v":""},null,null,{"$f":"IF(ISBLANK(B46),0,B46)","v":0},{"$f":"IF(ISBLANK(B46),0,D46)","v":0},{"$f":"A46&C46","v":"AOAQ"}]
[]
["CLASSEMENT"]
["EQUIPES",null,"POINTS","Pour","Contre","Diff","CLASST"]
["AN","3A",0,0,0,0,{"$f":"B59","v":1},{"$f":"IF(AND(G50=1,COUNTIF(rang1,1)>1),COUNTIF(G$50:G50,1),IF(AND(G50=2,COUNTIF(rang1,2)>1),COUNTIF(G$50:G50,2)+3,\"\"))","v":1}]
["AO","3B",0,0,0,0,1,{"$f":"IF(AND(G51=1,COUNTIF(rang1,1)>1),COUNTIF(G$50:G51,1),IF(AND(G51=2,COUNTIF(rang1,2)>1),COUNTIF(G$50:G51,2)+3,\"\"))","v":2}]
["AP","3C",0,0,0,0,1,{"$f":"IF(AND(G52=1,COUNTIF(rang1,1)>1),COUNTIF(G$50:G52,1),IF(AND(G52=2,COUNTIF(rang1,2)>1),COUNTIF(G$50:G52,2)+3,\"\"))","v":3}]
["AQ","3D",0,0,0,0,1,{"$f":"IF(AND(G53=1,COUNTIF(rang1,1)>1),COUNTIF(G$50:G53,1),IF(AND(G53=2,COUNTIF(rang1,2)>1),COUNTIF(G$50:G53,2)+3,\"\"))","v":4}]
["AR","3E",0,0,0,0,1,{"$f":"IF(AND(G54=1,COUNTIF(rang1,1)>1),COUNTIF(G$50:G54,1),IF(AND(G54=2,COUNTIF(rang1,2)>1),COUNTIF(G$50:G54,2)+3,\"\"))","v":5}]
["AS","3F",0,0,0,0,1,{"$f":"IF(AND(G55=1,COUNTIF(rang1,1)>1),COUNTIF(G$50:G55,1),IF(AND(G55=2,COUNTIF(rang1,2)>1),COUNTIF(G$50:G55,2)+3,\"\"))","v":6}]
[]
[null,"CLASSEMENT FINAL et DEPARTAGE EX AEQUOS",null,null,null,null,null,null,null,null,null,null,"CLASSEMENT"]
[null,"Rang","Equipes","Pts","diff pts avec exaequo","cumul","departage goalaverage si même cumul","RP",null,null,null,"RP","Rang","Equipe","Pts"]
[null,{"$f":"RANK(G59,$G$59:$G$64)","v":1},{"$f":"INDEX($A$50:$A$55,MATCH(H59,$L$59:$L$64,0))","v":"AN"},{"$f":"VLOOKUP(C59,$A$50:$C$55,3,0)","v":0},{"$f":"IF(D59=D60,INDEX($J$6:$O$11,MATCH(C59,$I$6:$I$11,0),MATCH(C60,$J$5:$O$5,0)),IF(D59=D58,INDEX($J$6:$O$11,MATCH(C59,$I$6:$I$11,0),MATCH(C58,$J$5:$O$5,0)),0))","v":0},{"$f":"D59+E59/100","v":0},{"$f":"IF(AND(F59<>F58,F59<>F60),F59,F59+VLOOKUP(C59,$A$50:$F$55,6,0)/100)","v":0},1,null,null,null,{"$f":"RANK(C50,$C$50:$C$55)+COUNTIF($C$50:C50,C50)-1","v":1},{"$f":"B59","v":1},"AN",{"$f":"VLOOKUP(N59,$C$59:$D$64,2,0)","v":0}]
[null,1,"AO",0,{"$f":"IF(D60=D61,INDEX($J$6:$O$11,MATCH(C60,$I$6:$I$11,0),MATCH(C61,$J$5:$O$5,0)),IF(D60=D59,INDEX($J$6:$O$11,MATCH(C60,$I$6:$I$11,0),MATCH(C59,$J$5:$O$5,0)),0))","v":0},0,{"$f":"IF(AND(F60<>F59,F60<>F61),F60,F60+VLOOKUP(C60,$A$50:$F$55,6,0)/100)","v":0},2,null,null,null,{"$f":"RANK(C51,$C$50:$C$55)+COUNTIF($C$50:C51,C51)-1","v":2},1,"AO",0]
[null,1,"AP",0,{"$f":"IF(D61=D62,INDEX($J$6:$O$11,MATCH(C61,$I$6:$I$11,0),MATCH(C62,$J$5:$O$5,0)),IF(D61=D60,INDEX($J$6:$O$11,MATCH(C61,$I$6:$I$11,0),MATCH(C60,$J$5:$O$5,0)),0))","v":0},0,{"$f":"IF(AND(F61<>F60,F61<>F62),F61,F61+VLOOKUP(C61,$A$50:$F$55,6,0)/100)","v":0},3,null,null,null,{"$f":"RANK(C52,$C$50:$C$55)+COUNTIF($C$50:C52,C52)-1","v":3},1,"AP",0]
[null,1,"AQ",0,{"$f":"IF(D62=D63,INDEX($J$6:$O$11,MATCH(C62,$I$6:$I$11,0),MATCH(C63,$J$5:$O$5,0)),IF(D62=D61,INDEX($J$6:$O$11,MATCH(C62,$I$6:$I$11,0),MATCH(C61,$J$5:$O$5,0)),0))","v":0},0,{"$f":"IF(AND(F62<>F61,F62<>F63),F62,F62+VLOOKUP(C62,$A$50:$F$55,6,0)/100)","v":0},4,null,null,null,{"$f":"RANK(C53,$C$50:$C$55)+COUNTIF($C$50:C53,C53)-1","v":4},1,"AQ",0]
[null,1,"AR",0,{"$f":"IF(D63=D64,INDEX($J$6:$O$11,MATCH(C63,$I$6:$I$11,0),MATCH(C64,$J$5:$O$5,0)),IF(D63=D62,INDEX($J$6:$O$11,MATCH(C63,$I$6:$I$11,0),MATCH(C62,$J$5:$O$5,0)),0))","v":0},0,{"$f":"IF(AND(F63<>F62,F63<>F64),F63,F63+VLOOKUP(C63,$A$50:$F$55,6,0)/100)","v":0},5,null,null,null,{"$f":"RANK(C54,$C$50:$C$55)+COUNTIF($C$50:C54,C54)-1","v":5},1,"AR",0]
[null,1,"AS",0,{"$f":"IF(D64=D59,INDEX($J$6:$O$11,MATCH(C64,$I$6:$I$11,0),MATCH(C59,$J$5:$O$5,0)),IF(D64=D63,INDEX($J$6:$O$11,MATCH(C64,$I$6:$I$11,0),MATCH(C63,$J$5:$O$5,0)),0))","v":0},0,{"$f":"IF(AND(F64<>F63,F64<>F59),F64,F64+VLOOKUP(C64,$A$50:$F$55,6,0)/100)","v":0},6,null,null,null,{"$f":"RANK(C55,$C$50:$C$55)+COUNTIF($C$50:C55,C55)-1","v":6},1,"AS",0]

{"sheet":"P4","index":3,"n_rows":64,"n_cols":15,"rows_kept":64,"cut":false,"hidden":false,"merged":[[0,0,0,5],[1,0,1,5],[2,0,2,5],[3,0,3,5],[13,6,14,6],[56,1,56,6],[56,12,56,14],[20,6,21,6],[27,6,28,6],[34,6,35,6],[41,6,42,6],[47,0,47,5]]}
[]
["CHAMPIONNAT DES CLUBS"]
[]
["POULE 4",null,null,null,null,null,null,null,"Récapitulatif  différence match entre 2 équipes"]
["EQUIPES",null,"POINTS","Pour","Contre","Diff",null,null,null,{"$f":"A6","v":"AT"},{"$f":"A7","v":"AU"},{"$f":"A8","v":"AV"},{"$f":"A9","v":"AW"},{"$f":"A10","v":"AX"},{"$f":"A11","v":"AY"}]
["AT","4A",{"$f":"SUM(E16,E23,E30,E37,F45)","v":0},{"$f":"I16+I23+I30+I37+J45","v":0},{"$f":"J16+J23+J30+J37+I45","v":0},{"$f":"D6-E6","v":0},null,null,{"$f":"A6","v":"AT"},null,{"$f":"IF(ISBLANK(B16),0,IFERROR(INDEX($B$15:$B$46,MATCH($I6&K$5,$K$15:$K$46,0))-INDEX($D$15:$D$46,MATCH($I6&K$5,$K$15:$K$46,0)),0-INDEX($J$6:$O$11,MATCH(K$5,$I$6:$I$11,0),MATCH($I6,$J$5:$O$5,0))))","v":0},{"$f":"IF(ISBLANK(B23),0,IFERROR(INDEX($B$15:$B$46,MATCH($I6&L$5,$K$15:$K$46,0))-INDEX($D$15:$D$46,MATCH($I6&L$5,$K$15:$K$46,0)),0-INDEX($J$6:$O$11,MATCH(L$5,$I$6:$I$11,0),MATCH($I6,$J$5:$O$5,0))))","v":0},{"$f":"IF(ISBLANK(B37),0,IFERROR(INDEX($B$15:$B$46,MATCH($I6&M$5,$K$15:$K$46,0))-INDEX($D$15:$D$46,MATCH($I6&M$5,$K$15:$K$46,0)),0-INDEX($J$6:$O$11,MATCH(M$5,$I$6:$I$11,0),MATCH($I6,$J$5:$O$5,0))))","v":0},{"$f":"IF(ISBLANK(B45),0,IFERROR(INDEX($B$15:$B$46,MATCH($I6&N$5,$K$15:$K$46,0))-INDEX($D$15:$D$46,MATCH($I6&N$5,$K$15:$K$46,0)),0-INDEX($J$6:$O$11,MATCH(N$5,$I$6:$I$11,0),MATCH($I6,$J$5:$O$5,0))))","v":0},{"$f":"IF(ISBLANK(B30),0,IFERROR(INDEX($B$15:$B$46,MATCH($I6&O$5,$K$15:$K$46,0))-INDEX($D$15:$D$46,MATCH($I6&O$5,$K$15:$K$46,0)),0-INDEX($J$6:$O$11,MATCH(O$5,$I$6:$I$11,0),MATCH($I6,$J$5:$O$5,0))))","v":0}]
["AU","4B",{"$f":"SUM(F16,E24,F32,E38,E46)","v":0},{"$f":"J16+I24+J32+I38+I46","v":0},{"$f":"I16+J24+I32+J38+J46","v":0},0,null,null,"AU",{"$f":"IF(ISBLANK(B16),0,IFERROR(INDEX($B$15:$B$46,MATCH($I7&J$5,$K$15:$K$46,0))-INDEX($D$15:$D$46,MATCH($I7&J$5,$K$15:$K$46,0)),0-INDEX($J$6:$O$11,MATCH(J$5,$I$6:$I$11,0),MATCH($I7,$J$5:$O$5,0))))","v":0},null,{"$f":"IF(ISBLANK(B32),0,IFERROR(INDEX($B$15:$B$46,MATCH($I7&L$5,$K$15:$K$46,0))-INDEX($D$15:$D$46,MATCH($I7&L$5,$K$15:$K$46,0)),0-INDEX($J$6:$O$11,MATCH(L$5,$I$6:$I$11,0),MATCH($I7,$J$5:$O$5,0))))","v":0},{"$f":"IF(ISBLANK(B46),0,IFERROR(INDEX($B$15:$B$46,MATCH($I7&M$5,$K$15:$K$46,0))-INDEX($D$15:$D$46,MATCH($I7&M$5,$K$15:$K$46,0)),0-INDEX($J$6:$O$11,MATCH(M$5,$I$6:$I$11,0),MATCH($I7,$J$5:$O$5,0))))","v":0},{"$f":"IF(ISBLANK(B24),0,IFERROR(INDEX($B$15:$B$46,MATCH($I7&N$5,$K$15:$K$46,0))-INDEX($D$15:$D$46,MATCH($I7&N$5,$K$15:$K$46,0)),0-INDEX($J$6:$O$11,MATCH(N$5,$I$6:$I$11,0),MATCH($I7,$J$5:$O$5,0))))","v":0},{"$f":"IF(ISBLANK(B38),0,IFERROR(INDEX($B$15:$B$46,MATCH($I7&O$5,$K$15:$K$46,0))-INDEX($D$15:$D$46,MATCH($I7&O$5,$K$15:$K$46,0)),0-INDEX($J$6:$O$11,MATCH(O$5,$I$6:$I$11,0),MATCH($I7,$J$5:$O$5,0))))","v":0}]
["AV","4C",{"$f":"SUM(E17,F23,E32,E39,E44)","v":0},{"$f":"I17+J23+I32+I39+I44","v":0},{"$f":"J17+I23+J32+J39+J44","v":0},0,null,null,"AV",{"$f":"IF(ISBLANK(B23),0,IFERROR(INDEX($B$15:$B$46,MATCH($I8&J$5,$K$15:$K$46,0))-INDEX($D$15:$D$46,MATCH($I8&J$5,$K$15:$K$46,0)),0-INDEX($J$6:$O$11,MATCH(J$5,$I$6:$I$11,0),MATCH($I8,$J$5:$O$5,0))))","v":0},{"$f":"IF(ISBLANK(B32),0,IFERROR(INDEX($B$15:$B$46,MATCH($I8&K$5,$K$15:$K$46,0))-INDEX($D$15:$D$46,MATCH($I8&K$5,$K$15:$K$46,0)),0-INDEX($J$6:$O$11,MATCH(K$5,$I$6:$I$11,0),MATCH($I8,$J$5:$O$5,0))))","v":0},null,{"$f":"IF(ISBLANK(B17),0,IFERROR(INDEX($B$15:$B$46,MATCH($I8&M$5,$K$15:$K$46,0))-INDEX($D$15:$D$46,MATCH($I8&M$5,$K$15:$K$46,0)),0-INDEX($J$6:$O$11,MATCH(M$5,$I$6:$I$11,0),MATCH($I8,$J$5:$O$5,0))))","v":0},{"$f":"IF(ISBLANK(B39),0,IFERROR(INDEX($B$15:$B$46,MATCH($I8&N$5,$K$15:$K$46,0))-INDEX($D$15:$D$46,MATCH($I8&N$5,$K$15:$K$46,0)),0-INDEX($J$6:$O$11,MATCH(N$5,$I$6:$I$11,0),MATCH($I8,$J$5:$O$5,0))))","v":0},{"$f":"IF(ISBLANK(B44),0,IFERROR(INDEX($B$15:$B$46,MATCH($I8&O$5,$K$15:$K$46,0))-INDEX($D$15:$D$46,MATCH($I8&O$5,$K$15:$K$46,0)),0-INDEX($J$6:$O$11,MATCH(O$5,$I$6:$I$11,0),MATCH($I8,$J$5:$O$5,0))))","v":0}]
["AW","4D",{"$f":"SUM(F17,E25,F31,F37,F46)","v":0},{"$f":"J17+I25+J31+J37+J46","v":0},{"$f":"I17+J25+I31+I37+I46","v":0},0,null,null,"AW",{"$f":"IF(ISBLANK(B37),0,IFERROR(INDEX($B$15:$B$46,MATCH($I9&J$5,$K$15:$K$46,0))-INDEX($D$15:$D$46,MATCH($I9&J$5,$K$15:$K$46,0)),0-INDEX($J$6:$O$11,MATCH(J$5,$I$6:$I$11,0),MATCH($I9,$J$5:$O$5,0))))","v":0},{"$f":"IF(ISBLANK(B46),0,IFERROR(INDEX($B$15:$B$46,MATCH($I9&K$5,$K$15:$K$46,0))-INDEX($D$15:$D$46,MATCH($I9&K$5,$K$15:$K$46,0)),0-INDEX($J$6:$O$11,MATCH(K$5,$I$6:$I$11,0),MATCH($I9,$J$5:$O$5,0))))","v":0},{"$f":"IF(ISBLANK(B17),0,IFERROR(INDEX($B$15:$B$46,MATCH($I9&L$5,$K$15:$K$46,0))-INDEX($D$15:$D$46,MATCH($I9&L$5,$K$15:$K$46,0)),0-INDEX($J$6:$O$11,MATCH(L$5,$I$6:$I$11,0),MATCH($I9,$J$5:$O$5,0))))","v":0},null,{"$f":"IF(ISBLANK(B31),0,IFERROR(INDEX($B$15:$B$46,MATCH($I9&N$5,$K$15:$K$46,0))-INDEX($D$15:$D$46,MATCH($I9&N$5,$K$15:$K$46,0)),0-INDEX($J$6:$O$11,MATCH(N$5,$I$6:$I$11,0),MATCH($I9,$J$5:$O$5,0))))","v":0},{"$f":"IF(ISBLANK(B25),0,IFERROR(INDEX($B$15:$B$46,MATCH($I9&O$5,$K$15:$K$46,0))-INDEX($D$15:$D$46,MATCH($I9&O$5,$K$15:$K$46,0)),0-INDEX($J$6:$O$11,MATCH(O$5,$I$6:$I$11,0),MATCH($I9,$J$5:$O$5,0))))","v":0}]
["AX","4E",{"$f":"SUM(E18,F24,E31,F39,E45)","v":0},{"$f":"I18+J24+I31+J39+I45","v":0},{"$f":"J18+I24+J31+I39+J45","v":0},0,null,null,"AX",{"$f":"IF(ISBLANK(B45),0,IFERROR(INDEX($B$15:$B$46,MATCH($I10&J$5,$K$15:$K$46,0))-INDEX($D$15:$D$46,MATCH($I10&J$5,$K$15:$K$46,0)),0-INDEX($J$6:$O$11,MATCH(J$5,$I$6:$I$11,0),MATCH($I10,$J$5:$O$5,0))))","v":0},{"$f":"IF(ISBLANK(B24),0,IFERROR(INDEX($B$15:$B$46,MATCH($I10&K$5,$K$15:$K$46,0))-INDEX($D$15:$D$46,MATCH($I10&K$5,$K$15:$K$46,0)),0-INDEX($J$6:$O$11,MATCH(K$5,$I$6:$I$11,0),MATCH($I10,$J$5:$O$5,0))))","v":0},{"$f":"IF(ISBLANK(B39),0,IFERROR(INDEX($B$15:$B$46,MATCH($I10&L$5,$K$15:$K$46,0))-INDEX($D$15:$D$46,MATCH($I10&L$5,$K$15:$K$46,0)),0-INDEX($J$6:$O$11,MATCH(L$5,$I$6:$I$11,0),MATCH($I10,$J$5:$O$5,0))))","v":0},{"$f":"IF(ISBLANK(B31),0,IFERROR(INDEX($B$15:$B$46,MATCH($I10&M$5,$K$15:$K$46,0))-INDEX($D$15:$D$46,MATCH($I10&M$5,$K$15:$K$46,0)),0-INDEX($J$6:$O$11,MATCH(M$5,$I$6:$I$11,0),MATCH($I10,$J$5:$O$5,0))))","v":0},null,{"$f":"IF(ISBLANK(B18),0,IFERROR(INDEX($B$15:$B$46,MATCH($I10&O$5,$K$15:$K$46,0))-INDEX($D$15:$D$46,MATCH($I10&O$5,$K$15:$K$46,0)),0-INDEX($J$6:$O$11,MATCH(O$5,$I$6:$I$11,0),MATCH($I10,$J$5:$O$5,0))))","v":0}]
["AY","4F",{"$f":"SUM(F18,F25,F30,F38,F44)","v":0},{"$f":"J18+J25+J30+J38+J44","v":0},{"$f":"I18+I25+I30+I38+I44","v":0},0,null,null,"AY",{"$f":"IF(ISBLANK(B30),0,IFERROR(INDEX($B$15:$B$46,MATCH($I11&J$5,$K$15:$K$46,0))-INDEX($D$15:$D$46,MATCH($I11&J$5,$K$15:$K$46,0)),0-INDEX($J$6:$O$11,MATCH(J$5,$I$6:$I$11,0),MATCH($I11,$J$5:$O$5,0))))","v":0},{"$f":"IF(ISBLANK(B38),0,IFERROR(INDEX($B$15:$B$46,MATCH($I11&K$5,$K$15:$K$46,0))-INDEX($D$15:$D$46,MATCH($I11&K$5,$K$15:$K$46,0)),0-INDEX($J$6:$O$11,MATCH(K$5,$I$6:$I$11,0),MATCH($I11,$J$5:$O$5,0))))","v":0},{"$f":"IF(ISBLANK(B44),0,IFERROR(INDEX($B$15:$B$46,MATCH($I11&L$5,$K$15:$K$46,0))-INDEX($D$15:$D$46,MATCH($I11&L$5,$K$15:$K$46,0)),0-INDEX($J$6:$O$11,MATCH(L$5,$I$6:$I$11,0),MATCH($I11,$J$5:$O$5,0))))","v":0},{"$f":"IF(ISBLANK(B25),0,IFERROR(INDEX($B$15:$B$46,MATCH($I11&M$5,$K$15:$K$46,0))-INDEX($D$15:$D$46,MATCH($I11&M$5,$K$15:$K$46,0)),0-INDEX($J$6:$O$11,MATCH(M$5,$I$6:$I$11,0),MATCH($I11,$J$5:$O$5,0))))","v":0},{"$f":"IF(ISBLANK(B18),0,IFERROR(INDEX($B$15:$B$46,MATCH($I11&N$5,$K$15:$K$46,0))-INDEX($D$15:$D$46,MATCH($I11&N$5,$K$15:$K$46,0)),0-INDEX($J$6:$O$11,MATCH(N$5,$I$6:$I$11,0),MATCH($I11,$J$5:$O$5,0))))","v":0}]
[null,null,null,null,null,null,null,null,"Les concaténations en rouge permettent de remplir par formules le récapitulatif au dessus"]
["1er MATCH le 15 mai","à",{"$f":"A6","v":"AT"},null,null,null,null,null,"Ce récap servira à départager les ex aequos"]
[null,null,null,null,null,null,"SI forfait éq recevante"]
["Equipes","score","Equipes","score"]
[{"$f":"$A$6","v":"AT"},null,{"$f":"$A$7","v":"AU"},{"$f":"IF(G16=19,19,IF(ISBLANK(B16),\"\",IF(B16=19,0,36-B16)))","v":""},{"$f":"IF(G16=19,0,IF(ISBLANK(B16),\"\",IF(B16<18,1,IF(B16=18,2,IF(B16>18,3)))))","v":""},{"$f":"IF(G16=19,3,IF(ISBLANK(B16),\"\",IF(B16=19,0,IF(D16<18,1,IF(D16=18,2,IF(D16>=20,3))))))","v":""},null,null,{"$f":"IF(ISBLANK(B16),0,B16)","v":0},{"$f":"IF(ISBLANK(B16),0,D16)","v":0},{"$f":"A16&C16","v":"ATAU"}]
[{"$f":"$A$8","v":"AV"},null,{"$f":"$A$9","v":"AW"},{"$f":"IF(G17=19,19,IF(ISBLANK(B17),\"\",IF(B17=19,0,36-B17)))","v":""},{"$f":"IF(G17=19,0,IF(ISBLANK(B17),\"\",IF(B17<18,1,IF(B17=18,2,IF(B17>18,3)))))","v":""},{"$f":"IF(G17=19,3,IF(ISBLANK(B17),\"\",IF(B17=19,0,IF(D17<18,1,IF(D17=18,2,IF(D17>=20,3))))))","v":""},null,null,{"$f":"IF(ISBLANK(B17),0,B17)","v":0},{"$f":"IF(ISBLANK(B17),0,D17)","v":0},{"$f":"A17&C17","v":"AVAW"}]
[{"$f":"$A$10","v":"AX"},null,{"$f":"$A$11","v":"AY"},{"$f":"IF(G18=19,19,IF(ISBLANK(B18),\"\",IF(B18=19,0,36-B18)))","v":""},{"$f":"IF(G18=19,0,IF(ISBLANK(B18),\"\",IF(B18<18,1,IF(B18=18,2,IF(B18>18,3)))))","v":""},{"$f":"IF(G18=19,3,IF(ISBLANK(B18),\"\",IF(B18=19,0,IF(D18<18,1,IF(D18=18,2,IF(D18>=20,3))))))","v":""},null,null,{"$f":"IF(ISBLANK(B18),0,B18)","v":0},{"$f":"IF(ISBLANK(B18),0,D18)","v":0},{"$f":"A18&C18","v":"AXAY"}]
[]
["2 éme MATCH le 22 mai","à",{"$f":"A7","v":"AU"}]
[null,null,null,null,null,null,"SI forfait éq recevante"]
["Equipes","score","Equipes","score"]
[{"$f":"$A$6","v":"AT"},null,{"$f":"$A$8","v":"AV"},{"$f":"IF(G23=19,19,IF(ISBLANK(B23),\"\",IF(B23=19,0,36-B23)))","v":""},{"$f":"IF(G23=19,0,IF(ISBLANK(B23),\"\",IF(B23<18,1,IF(B23=18,2,IF(B23>18,3)))))","v":""},{"$f":"IF(G23=19,3,IF(ISBLANK(B23),\"\",IF(B23=19,0,IF(D23<18,1,IF(D23=18,2,IF(D23>=20,3))))))","v":""},null,null,{"$f":"IF(ISBLANK(B23),0,B23)","v":0},{"$f":"IF(ISBLANK(B23),0,D23)","v":0},{"$f":"A23&C23","v":"ATAV"}]
[{"$f":"$A$7","v":"AU"},null,{"$f":"$A$10","v":"AX"},{"$f":"IF(G24=19,19,IF(ISBLANK(B24),\"\",IF(B24=19,0,36-B24)))","v":""},{"$f":"IF(G24=19,0,IF(ISBLANK(B24),\"\",IF(B24<18,1,IF(B24=18,2,IF(B24>18,3)))))","v":""},{"$f":"IF(G24=19,3,IF(ISBLANK(B24),\"\",IF(B24=19,0,IF(D24<18,1,IF(D24=18,2,IF(D24>=20,3))))))","v":""},null,null,{"$f":"IF(ISBLANK(B24),0,B24)","v":0},{"$f":"IF(ISBLANK(B24),0,D24)","v":0},{"$f":"A24&C24","v":"AUAX"}]
[{"$f":"$A$9","v":"AW"},null,{"$f":"$A$11","v":"AY"},{"$f":"IF(G25=19,19,IF(ISBLANK(B25),\"\",IF(B25=19,0,36-B25)))","v":""},{"$f":"IF(G25=19,0,IF(ISBLANK(B25),\"\",IF(B25<18,1,IF(B25=18,2,IF(B25>18,3)))))","v":""},{"$f":"IF(G25=19,3,IF(ISBLANK(B25),\"\",IF(B25=19,0,IF(D25<18,1,IF(D25=18,2,IF(D25>=20,3))))))","v":""},null,null,{"$f":"IF(ISBLANK(B25),0,B25)","v":0},{"$f":"IF(ISBLANK(B25),0,D25)","v":0},{"$f":"A25&C25","v":"AWAY"}]
[]
["3 éme MATCH le 29 mai","à",{"$f":"A8","v":"AV"}]
[null,null,null,null,null,null,"SI forfait éq recevante"]
["Equipes","score","Equipes","score"]
[{"$f":"$A$6","v":"AT"},null,{"$f":"$A$11","v":"AY"},{"$f":"IF(G30=19,19,IF(ISBLANK(B30),\"\",IF(B30=19,0,36-B30)))","v":""},{"$f":"IF(G30=19,0,IF(ISBLANK(B30),\"\",IF(B30<18,1,IF(B30=18,2,IF(B30>18,3)))))","v":""},{"$f":"IF(G30=19,3,IF(ISBLANK(B30),\"\",IF(B30=19,0,IF(D30<18,1,IF(D30=18,2,IF(D30>=20,3))))))","v":""},null,null,{"$f":"IF(ISBLANK(B30),0,B30)","v":0},{"$f":"IF(ISBLANK(B30),0,D30)","v":0},{"$f":"A30&C30","v":"ATAY"}]
[{"$f":"$A$10","v":"AX"},null,{"$f":"$A$9","v":"AW"},{"$f":"IF(G31=19,19,IF(ISBLANK(B31),\"\",IF(B31=19,0,36-B31)))","v":""},{"$f":"IF(G31=19,0,IF(ISBLANK(B31),\"\",IF(B31<18,1,IF(B31=18,2,IF(B31>18,3)))))","v":""},{"$f":"IF(G31=19,3,IF(ISBLANK(B31),\"\",IF(B31=19,0,IF(D31<18,1,IF(D31=18,2,IF(D31>=20,3))))))","v":""},null,null,{"$f":"IF(ISBLANK(B31),0,B31)","v":0},{"$f":"IF(ISBLANK(B31),0,D31)","v":0},{"$f":"A31&C31","v":"AXAW"}]
[{"$f":"$A$8","v":"AV"},null,{"$f":"$A$7","v":"AU"},{"$f":"IF(G32=19,19,IF(ISBLANK(B32),\"\",IF(B32=19,0,36-B32)))","v":""},{"$f":"IF(G32=19,0,IF(ISBLANK(B32),\"\",IF(B32<18,1,IF(B32=18,2,IF(B32>18,3)))))","v":""},{"$f":"IF(G32=19,3,IF(ISBLANK(B32),\"\",IF(B32=19,0,IF(D32<18,1,IF(D32=18,2,IF(D32>=20,3))))))","v":""},null,null,{"$f":"IF(ISBLANK(B32),0,B32)","v":0},{"$f":"IF(ISBLANK(B32),0,D32)","v":0},{"$f":"A32&C32","v":"AVAU"}]
[]
["4 éme MATCH le 5 juin","à",{"$f":"A9","v":"AW"}]
[null,null,null,null,null,null,"SI forfait éq recevante"]
["Equipes","score","Equipes","score"]
[{"$f":"A6","v":"AT"},null,{"$f":"$A$9","v":"AW"},{"$f":"IF(G37=19,19,IF(ISBLANK(B37),\"\",IF(B37=19,0,36-B37)))","v":""},{"$f":"IF(G37=19,0,IF(ISBLANK(B37),\"\",IF(B37<18,1,IF(B37=18,2,IF(B37>18,3)))))","v":""},{"$f":"IF(G37=19,3,IF(ISBLANK(B37),\"\",IF(B37=19,0,IF(D37<18,1,IF(D37=18,2,IF(D37>=20,3))))))","v":""},null,null,{"$f":"IF(ISBLANK(B37),0,B37)","v":0},{"$f":"IF(ISBLANK(B37),0,D37)","v":0},{"$f":"A37&C37","v":"ATAW"}]
[{"$f":"$A$7","v":"AU"},null,{"$f":"$A$11","v":"AY"},{"$f":"IF(G38=19,19,IF(ISBLANK(B38),\"\",IF(B38=19,0,36-B38)))","v":""},{"$f":"IF(G38=19,0,IF(ISBLANK(B38),\"\",IF(B38<18,1,IF(B38=18,2,IF(B38>18,3)))))","v":""},{"$f":"IF(G38=19,3,IF(ISBLANK(B38),\"\",IF(B38=19,0,IF(D38<18,1,IF(D38=18,2,IF(D38>=20,3))))))","v":""},null,null,{"$f":"IF(ISBLANK(B38),0,B38)","v":0},{"$f":"IF(ISBLANK(B38),0,D38)","v":0},{"$f":"A38&C38","v":"AUAY"}]
[{"$f":"A8","v":"AV"},null,{"$f":"$A$10","v":"AX"},{"$f":"IF(G39=19,19,IF(ISBLANK(B39),\"\",IF(B39=19,0,36-B39)))","v":""},{"$f":"IF(G39=19,0,IF(ISBLANK(B39),\"\",IF(B39<18,1,IF(B39=18,2,IF(B39>18,3)))))","v":""},{"$f":"IF(G39=19,3,IF(ISBLANK(B39),\"\",IF(B39=19,0,IF(D39<18,1,IF(D39=18,2,IF(D39>=20,3))))))","v":""},null,null,{"$f":"IF(ISBLANK(B39),0,B39)","v":0},{"$f":"IF(ISBLANK(B39),0,D39)","v":0},{"$f":"A39&C39","v":"AVAX"}]
[]
["5 éme MATCH le 12 juin","à",{"$f":"A10","v":"AX"}]
[null,null,null,null,null,null,"SI forfait éq recevante"]
["Equipes","score","Equipes","score"]
[{"$f":"A8","v":"AV"},null,{"$f":"$A$11","v":"AY"},{"$f":"IF(G44=19,19,IF(ISBLANK(B44),\"\",IF(B44=19,0,36-B44)))","v":""},{"$f":"IF(G44=19,0,IF(ISBLANK(B44),\"\",IF(B44<18,1,IF(B44=18,2,IF(B44>18,3)))))","v":""},{"$f":"IF(G44=19,3,IF(ISBLANK(B44),\"\",IF(B44=19,0,IF(D44<18,1,IF(D44=18,2,IF(D44>=20,3))))))","v":""},null,null,{"$f":"IF(ISBLANK(B44),0,B44)","v":0},{"$f":"IF(ISBLANK(B44),0,D44)","v":0},{"$f":"A44&C44","v":"AVAY"}]
[{"$f":"$A$10","v":"AX"},null,{"$f":"A6","v":"AT"},{"$f":"IF(G45=19,19,IF(ISBLANK(B45),\"\",IF(B45=19,0,36-B45)))","v":""},{"$f":"IF(G45=19,0,IF(ISBLANK(B45),\"\",IF(B45<18,1,IF(B45=18,2,IF(B45>18,3)))))","v":""},{"$f":"IF(G45=19,3,IF(ISBLANK(B45),\"\",IF(B45=19,0,IF(D45<18,1,IF(D45=18,2,IF(D45>=20,3))))))","v":""},null,null,{"$f":"IF(ISBLANK(B45),0,B45)","v":0},{"$f":"IF(ISBLANK(B45),0,D45)","v":0},{"$f":"A45&C45","v":"AXAT"}]
[{"$f":"A7","v":"AU"},null,{"$f":"$A$9","v":"AW"},{"$f":"IF(G46=19,19,IF(ISBLANK(B46),\"\",IF(B46=19,0,36-B46)))","v":""},{"$f":"IF(G46=19,0,IF(ISBLANK(B46),\"\",IF(B46<18,1,IF(B46=18,2,IF(B46>18,3)))))","v":""},{"$f":"IF(G46=19,3,IF(ISBLANK(B46),\"\",IF(B46=19,0,IF(D46<18,1,IF(D46=18,2,IF(D46>=20,3))))))","v":""},null,null,{"$f":"IF(ISBLANK(B46),0,B46)","v":0},{"$f":"IF(ISBLANK(B46),0,D46)","v":0},{"$f":"A46&C46","v":"AUAW"}]
[]
["CLASSEMENT"]
["EQUIPES",null,"POINTS","Pour","Contre","Diff","CLASST"]
["AT","4A",0,0,0,0,{"$f":"B59","v":1},{"$f":"IF(AND(G50=1,COUNTIF(rang1,1)>1),COUNTIF(G$50:G50,1),IF(AND(G50=2,COUNTIF(rang1,2)>1),COUNTIF(G$50:G50,2)+3,\"\"))","v":1}]
["AU","4B",0,0,0,0,1,{"$f":"IF(AND(G51=1,COUNTIF(rang1,1)>1),COUNTIF(G$50:G51,1),IF(AND(G51=2,COUNTIF(rang1,2)>1),COUNTIF(G$50:G51,2)+3,\"\"))","v":2}]
["AV","4C",0,0,0,0,1,{"$f":"IF(AND(G52=1,COUNTIF(rang1,1)>1),COUNTIF(G$50:G52,1),IF(AND(G52=2,COUNTIF(rang1,2)>1),COUNTIF(G$50:G52,2)+3,\"\"))","v":3}]
["AW","4D",0,0,0,0,1,{"$f":"IF(AND(G53=1,COUNTIF(rang1,1)>1),COUNTIF(G$50:G53,1),IF(AND(G53=2,COUNTIF(rang1,2)>1),COUNTIF(G$50:G53,2)+3,\"\"))","v":4}]
["AX","4E",0,0,0,0,1,{"$f":"IF(AND(G54=1,COUNTIF(rang1,1)>1),COUNTIF(G$50:G54,1),IF(AND(G54=2,COUNTIF(rang1,2)>1),COUNTIF(G$50:G54,2)+3,\"\"))","v":5}]
["AY","4F",0,0,0,0,1,{"$f":"IF(AND(G55=1,COUNTIF(rang1,1)>1),COUNTIF(G$50:G55,1),IF(AND(G55=2,COUNTIF(rang1,2)>1),COUNTIF(G$50:G55,2)+3,\"\"))","v":6}]
[]
[null,"CLASSEMENT FINAL et DEPARTAGE EX AEQUOS",null,null,null,null,null,null,null,null,null,null,"CLASSEMENT"]
[null,"Rang","Equipes","Pts","diff pts avec exaequo","cumul","departage goalaverage si même cumul","RP",null,null,null,"RP","Rang","Equipe","Pts"]
[null,{"$f":"RANK(G59,$G$59:$G$64)","v":1},{"$f":"INDEX($A$50:$A$55,MATCH(H59,$L$59:$L$64,0))","v":"AT"},{"$f":"VLOOKUP(C59,$A$50:$C$55,3,0)","v":0},{"$f":"IF(D59=D60,INDEX($J$6:$O$11,MATCH(C59,$I$6:$I$11,0),MATCH(C60,$J$5:$O$5,0)),IF(D59=D58,INDEX($J$6:$O$11,MATCH(C59,$I$6:$I$11,0),MATCH(C58,$J$5:$O$5,0)),0))","v":0},{"$f":"D59+E59/100","v":0},{"$f":"IF(AND(F59<>F58,F59<>F60),F59,F59+VLOOKUP(C59,$A$50:$F$55,6,0)/100)","v":0},1,null,null,null,{"$f":"RANK(C50,$C$50:$C$55)+COUNTIF($C$50:C50,C50)-1","v":1},{"$f":"B59","v":1},"AT",{"$f":"VLOOKUP(N59,$C$59:$D$64,2,0)","v":0}]
[null,1,"AU",0,{"$f":"IF(D60=D61,INDEX($J$6:$O$11,MATCH(C60,$I$6:$I$11,0),MATCH(C61,$J$5:$O$5,0)),IF(D60=D59,INDEX($J$6:$O$11,MATCH(C60,$I$6:$I$11,0),MATCH(C59,$J$5:$O$5,0)),0))","v":0},0,{"$f":"IF(AND(F60<>F59,F60<>F61),F60,F60+VLOOKUP(C60,$A$50:$F$55,6,0)/100)","v":0},2,null,null,null,{"$f":"RANK(C51,$C$50:$C$55)+COUNTIF($C$50:C51,C51)-1","v":2},1,"AU",0]
[null,1,"AV",0,{"$f":"IF(D61=D62,INDEX($J$6:$O$11,MATCH(C61,$I$6:$I$11,0),MATCH(C62,$J$5:$O$5,0)),IF(D61=D60,INDEX($J$6:$O$11,MATCH(C61,$I$6:$I$11,0),MATCH(C60,$J$5:$O$5,0)),0))","v":0},0,{"$f":"IF(AND(F61<>F60,F61<>F62),F61,F61+VLOOKUP(C61,$A$50:$F$55,6,0)/100)","v":0},3,null,null,null,{"$f":"RANK(C52,$C$50:$C$55)+COUNTIF($C$50:C52,C52)-1","v":3},1,"AV",0]
[null,1,"AW",0,{"$f":"IF(D62=D63,INDEX($J$6:$O$11,MATCH(C62,$I$6:$I$11,0),MATCH(C63,$J$5:$O$5,0)),IF(D62=D61,INDEX($J$6:$O$11,MATCH(C62,$I$6:$I$11,0),MATCH(C61,$J$5:$O$5,0)),0))","v":0},0,{"$f":"IF(AND(F62<>F61,F62<>F63),F62,F62+VLOOKUP(C62,$A$50:$F$55,6,0)/100)","v":0},4,null,null,null,{"$f":"RANK(C53,$C$50:$C$55)+COUNTIF($C$50:C53,C53)-1","v":4},1,"AW",0]
[null,1,"AX",0,{"$f":"IF(D63=D64,INDEX($J$6:$O$11,MATCH(C63,$I$6:$I$11,0),MATCH(C64,$J$5:$O$5,0)),IF(D63=D62,INDEX($J$6:$O$11,MATCH(C63,$I$6:$I$11,0),MATCH(C62,$J$5:$O$5,0)),0))","v":0},0,{"$f":"IF(AND(F63<>F62,F63<>F64),F63,F63+VLOOKUP(C63,$A$50:$F$55,6,0)/100)","v":0},5,null,null,null,{"$f":"RANK(C54,$C$50:$C$55)+COUNTIF($C$50:C54,C54)-1","v":5},1,"AX",0]
[null,1,"AY",0,{"$f":"IF(D64=D59,INDEX($J$6:$O$11,MATCH(C64,$I$6:$I$11,0),MATCH(C59,$J$5:$O$5,0)),IF(D64=D63,INDEX($J$6:$O$11,MATCH(C64,$I$6:$I$11,0),MATCH(C63,$J$5:$O$5,0)),0))","v":0},0,{"$f":"IF(AND(F64<>F63,F64<>F59),F64,F64+VLOOKUP(C64,$A$50:$F$55,6,0)/100)","v":0},6,null,null,null,{"$f":"RANK(C55,$C$50:$C$55)+COUNTIF($C$50:C55,C55)-1","v":6},1,"AY",0]

{"sheet":"P5","index":4,"n_rows":64,"n_cols":15,"rows_kept":64,"cut":false,"hidden":false,"merged":[[0,0,0,5],[1,0,1,5],[2,0,2,5],[3,0,3,5],[13,6,14,6],[56,1,56,6],[56,12,56,14],[20,6,21,6],[27,6,28,6],[34,6,35,6],[41,6,42,6],[47,0,47,5]]}
[]
["CHAMPIONNAT DES CLUBS"]
[]
["POULE 5",null,null,null,null,null,null,null,"Récapitulatif  différence match entre 2 équipes"]
["EQUIPES",null,"POINTS","Pour","Contre","Diff",null,null,null,{"$f":"A6","v":"AZ"},{"$f":"A7","v":"BA"},{"$f":"A8","v":"BB"},{"$f":"A9","v":"BC"},{"$f":"A10","v":"BD"},{"$f":"A11","v":"BE"}]
["AZ","5A",{"$f":"SUM(E16,E23,E30,E37,F45)","v":0},{"$f":"I16+I23+I30+I37+J45","v":0},{"$f":"J16+J23+J30+J37+I45","v":0},{"$f":"D6-E6","v":0},null,null,{"$f":"A6","v":"AZ"},null,{"$f":"IF(ISBLANK(B16),0,IFERROR(INDEX($B$15:$B$46,MATCH($I6&K$5,$K$15:$K$46,0))-INDEX($D$15:$D$46,MATCH($I6&K$5,$K$15:$K$46,0)),0-INDEX($J$6:$O$11,MATCH(K$5,$I$6:$I$11,0),MATCH($I6,$J$5:$O$5,0))))","v":0},{"$f":"IF(ISBLANK(B23),0,IFERROR(INDEX($B$15:$B$46,MATCH($I6&L$5,$K$15:$K$46,0))-INDEX($D$15:$D$46,MATCH($I6&L$5,$K$15:$K$46,0)),0-INDEX($J$6:$O$11,MATCH(L$5,$I$6:$I$11,0),MATCH($I6,$J$5:$O$5,0))))","v":0},{"$f":"IF(ISBLANK(B37),0,IFERROR(INDEX($B$15:$B$46,MATCH($I6&M$5,$K$15:$K$46,0))-INDEX($D$15:$D$46,MATCH($I6&M$5,$K$15:$K$46,0)),0-INDEX($J$6:$O$11,MATCH(M$5,$I$6:$I$11,0),MATCH($I6,$J$5:$O$5,0))))","v":0},{"$f":"IF(ISBLANK(B45),0,IFERROR(INDEX($B$15:$B$46,MATCH($I6&N$5,$K$15:$K$46,0))-INDEX($D$15:$D$46,MATCH($I6&N$5,$K$15:$K$46,0)),0-INDEX($J$6:$O$11,MATCH(N$5,$I$6:$I$11,0),MATCH($I6,$J$5:$O$5,0))))","v":0},{"$f":"IF(ISBLANK(B30),0,IFERROR(INDEX($B$15:$B$46,MATCH($I6&O$5,$K$15:$K$46,0))-INDEX($D$15:$D$46,MATCH($I6&O$5,$K$15:$K$46,0)),0-INDEX($J$6:$O$11,MATCH(O$5,$I$6:$I$11,0),MATCH($I6,$J$5:$O$5,0))))","v":0}]
["BA","5B",{"$f":"SUM(F16,E24,F32,E38,E46)","v":0},{"$f":"J16+I24+J32+I38+I46","v":0},{"$f":"I16+J24+I32+J38+J46","v":0},0,null,null,"BA",{"$f":"IF(ISBLANK(B16),0,IFERROR(INDEX($B$15:$B$46,MATCH($I7&J$5,$K$15:$K$46,0))-INDEX($D$15:$D$46,MATCH($I7&J$5,$K$15:$K$46,0)),0-INDEX($J$6:$O$11,MATCH(J$5,$I$6:$I$11,0),MATCH($I7,$J$5:$O$5,0))))","v":0},null,{"$f":"IF(ISBLANK(B32),0,IFERROR(INDEX($B$15:$B$46,MATCH($I7&L$5,$K$15:$K$46,0))-INDEX($D$15:$D$46,MATCH($I7&L$5,$K$15:$K$46,0)),0-INDEX($J$6:$O$11,MATCH(L$5,$I$6:$I$11,0),MATCH($I7,$J$5:$O$5,0))))","v":0},{"$f":"IF(ISBLANK(B46),0,IFERROR(INDEX($B$15:$B$46,MATCH($I7&M$5,$K$15:$K$46,0))-INDEX($D$15:$D$46,MATCH($I7&M$5,$K$15:$K$46,0)),0-INDEX($J$6:$O$11,MATCH(M$5,$I$6:$I$11,0),MATCH($I7,$J$5:$O$5,0))))","v":0},{"$f":"IF(ISBLANK(B24),0,IFERROR(INDEX($B$15:$B$46,MATCH($I7&N$5,$K$15:$K$46,0))-INDEX($D$15:$D$46,MATCH($I7&N$5,$K$15:$K$46,0)),0-INDEX($J$6:$O$11,MATCH(N$5,$I$6:$I$11,0),MATCH($I7,$J$5:$O$5,0))))","v":0},{"$f":"IF(ISBLANK(B38),0,IFERROR(INDEX($B$15:$B$46,MATCH($I7&O$5,$K$15:$K$46,0))-INDEX($D$15:$D$46,MATCH($I7&O$5,$K$15:$K$46,0)),0-INDEX($J$6:$O$11,MATCH(O$5,$I$6:$I$11,0),MATCH($I7,$J$5:$O$5,0))))","v":0}]
["BB","5C",{"$f":"SUM(E17,F23,E32,E39,E44)","v":0},{"$f":"I17+J23+I32+I39+I44","v":0},{"$f":"J17+I23+J32+J39+J44","v":0},0,null,null,"BB",{"$f":"IF(ISBLANK(B23),0,IFERROR(INDEX($B$15:$B$46,MATCH($I8&J$5,$K$15:$K$46,0))-INDEX($D$15:$D$46,MATCH($I8&J$5,$K$15:$K$46,0)),0-INDEX($J$6:$O$11,MATCH(J$5,$I$6:$I$11,0),MATCH($I8,$J$5:$O$5,0))))","v":0},{"$f":"IF(ISBLANK(B32),0,IFERROR(INDEX($B$15:$B$46,MATCH($I8&K$5,$K$15:$K$46,0))-INDEX($D$15:$D$46,MATCH($I8&K$5,$K$15:$K$46,0)),0-INDEX($J$6:$O$11,MATCH(K$5,$I$6:$I$11,0),MATCH($I8,$J$5:$O$5,0))))","v":0},null,{"$f":"IF(ISBLANK(B17),0,IFERROR(INDEX($B$15:$B$46,MATCH($I8&M$5,$K$15:$K$46,0))-INDEX($D$15:$D$46,MATCH($I8&M$5,$K$15:$K$46,0)),0-INDEX($J$6:$O$11,MATCH(M$5,$I$6:$I$11,0),MATCH($I8,$J$5:$O$5,0))))","v":0},{"$f":"IF(ISBLANK(B39),0,IFERROR(INDEX($B$15:$B$46,MATCH($I8&N$5,$K$15:$K$46,0))-INDEX($D$15:$D$46,MATCH($I8&N$5,$K$15:$K$46,0)),0-INDEX($J$6:$O$11,MATCH(N$5,$I$6:$I$11,0),MATCH($I8,$J$5:$O$5,0))))","v":0},{"$f":"IF(ISBLANK(B44),0,IFERROR(INDEX($B$15:$B$46,MATCH($I8&O$5,$K$15:$K$46,0))-INDEX($D$15:$D$46,MATCH($I8&O$5,$K$15:$K$46,0)),0-INDEX($J$6:$O$11,MATCH(O$5,$I$6:$I$11,0),MATCH($I8,$J$5:$O$5,0))))","v":0}]
["BC","5D",{"$f":"SUM(F17,E25,F31,F37,F46)","v":0},{"$f":"J17+I25+J31+J37+J46","v":0},{"$f":"I17+J25+I31+I37+I46","v":0},0,null,null,"BC",{"$f":"IF(ISBLANK(B37),0,IFERROR(INDEX($B$15:$B$46,MATCH($I9&J$5,$K$15:$K$46,0))-INDEX($D$15:$D$46,MATCH($I9&J$5,$K$15:$K$46,0)),0-INDEX($J$6:$O$11,MATCH(J$5,$I$6:$I$11,0),MATCH($I9,$J$5:$O$5,0))))","v":0},{"$f":"IF(ISBLANK(B46),0,IFERROR(INDEX($B$15:$B$46,MATCH($I9&K$5,$K$15:$K$46,0))-INDEX($D$15:$D$46,MATCH($I9&K$5,$K$15:$K$46,0)),0-INDEX($J$6:$O$11,MATCH(K$5,$I$6:$I$11,0),MATCH($I9,$J$5:$O$5,0))))","v":0},{"$f":"IF(ISBLANK(B17),0,IFERROR(INDEX($B$15:$B$46,MATCH($I9&L$5,$K$15:$K$46,0))-INDEX($D$15:$D$46,MATCH($I9&L$5,$K$15:$K$46,0)),0-INDEX($J$6:$O$11,MATCH(L$5,$I$6:$I$11,0),MATCH($I9,$J$5:$O$5,0))))","v":0},null,{"$f":"IF(ISBLANK(B31),0,IFERROR(INDEX($B$15:$B$46,MATCH($I9&N$5,$K$15:$K$46,0))-INDEX($D$15:$D$46,MATCH($I9&N$5,$K$15:$K$46,0)),0-INDEX($J$6:$O$11,MATCH(N$5,$I$6:$I$11,0),MATCH($I9,$J$5:$O$5,0))))","v":0},{"$f":"IF(ISBLANK(B25),0,IFERROR(INDEX($B$15:$B$46,MATCH($I9&O$5,$K$15:$K$46,0))-INDEX($D$15:$D$46,MATCH($I9&O$5,$K$15:$K$46,0)),0-INDEX($J$6:$O$11,MATCH(O$5,$I$6:$I$11,0),MATCH($I9,$J$5:$O$5,0))))","v":0}]
["BD","5E",{"$f":"SUM(E18,F24,E31,F39,E45)","v":0},{"$f":"I18+J24+I31+J39+I45","v":0},{"$f":"J18+I24+J31+I39+J45","v":0},0,null,null,"BD",{"$f":"IF(ISBLANK(B45),0,IFERROR(INDEX($B$15:$B$46,MATCH($I10&J$5,$K$15:$K$46,0))-INDEX($D$15:$D$46,MATCH($I10&J$5,$K$15:$K$46,0)),0-INDEX($J$6:$O$11,MATCH(J$5,$I$6:$I$11,0),MATCH($I10,$J$5:$O$5,0))))","v":0},{"$f":"IF(ISBLANK(B24),0,IFERROR(INDEX($B$15:$B$46,MATCH($I10&K$5,$K$15:$K$46,0))-INDEX($D$15:$D$46,MATCH($I10&K$5,$K$15:$K$46,0)),0-INDEX($J$6:$O$11,MATCH(K$5,$I$6:$I$11,0),MATCH($I10,$J$5:$O$5,0))))","v":0},{"$f":"IF(ISBLANK(B39),0,IFERROR(INDEX($B$15:$B$46,MATCH($I10&L$5,$K$15:$K$46,0))-INDEX($D$15:$D$46,MATCH($I10&L$5,$K$15:$K$46,0)),0-INDEX($J$6:$O$11,MATCH(L$5,$I$6:$I$11,0),MATCH($I10,$J$5:$O$5,0))))","v":0},{"$f":"IF(ISBLANK(B31),0,IFERROR(INDEX($B$15:$B$46,MATCH($I10&M$5,$K$15:$K$46,0))-INDEX($D$15:$D$46,MATCH($I10&M$5,$K$15:$K$46,0)),0-INDEX($J$6:$O$11,MATCH(M$5,$I$6:$I$11,0),MATCH($I10,$J$5:$O$5,0))))","v":0},null,{"$f":"IF(ISBLANK(B18),0,IFERROR(INDEX($B$15:$B$46,MATCH($I10&O$5,$K$15:$K$46,0))-INDEX($D$15:$D$46,MATCH($I10&O$5,$K$15:$K$46,0)),0-INDEX($J$6:$O$11,MATCH(O$5,$I$6:$I$11,0),MATCH($I10,$J$5:$O$5,0))))","v":0}]
["BE","5F",{"$f":"SUM(F18,F25,F30,F38,F44)","v":0},{"$f":"J18+J25+J30+J38+J44","v":0},{"$f":"I18+I25+I30+I38+I44","v":0},0,null,null,"BE",{"$f":"IF(ISBLANK(B30),0,IFERROR(INDEX($B$15:$B$46,MATCH($I11&J$5,$K$15:$K$46,0))-INDEX($D$15:$D$46,MATCH($I11&J$5,$K$15:$K$46,0)),0-INDEX($J$6:$O$11,MATCH(J$5,$I$6:$I$11,0),MATCH($I11,$J$5:$O$5,0))))","v":0},{"$f":"IF(ISBLANK(B38),0,IFERROR(INDEX($B$15:$B$46,MATCH($I11&K$5,$K$15:$K$46,0))-INDEX($D$15:$D$46,MATCH($I11&K$5,$K$15:$K$46,0)),0-INDEX($J$6:$O$11,MATCH(K$5,$I$6:$I$11,0),MATCH($I11,$J$5:$O$5,0))))","v":0},{"$f":"IF(ISBLANK(B44),0,IFERROR(INDEX($B$15:$B$46,MATCH($I11&L$5,$K$15:$K$46,0))-INDEX($D$15:$D$46,MATCH($I11&L$5,$K$15:$K$46,0)),0-INDEX($J$6:$O$11,MATCH(L$5,$I$6:$I$11,0),MATCH($I11,$J$5:$O$5,0))))","v":0},{"$f":"IF(ISBLANK(B25),0,IFERROR(INDEX($B$15:$B$46,MATCH($I11&M$5,$K$15:$K$46,0))-INDEX($D$15:$D$46,MATCH($I11&M$5,$K$15:$K$46,0)),0-INDEX($J$6:$O$11,MATCH(M$5,$I$6:$I$11,0),MATCH($I11,$J$5:$O$5,0))))","v":0},{"$f":"IF(ISBLANK(B18),0,IFERROR(INDEX($B$15:$B$46,MATCH($I11&N$5,$K$15:$K$46,0))-INDEX($D$15:$D$46,MATCH($I11&N$5,$K$15:$K$46,0)),0-INDEX($J$6:$O$11,MATCH(N$5,$I$6:$I$11,0),MATCH($I11,$J$5:$O$5,0))))","v":0}]
[null,null,null,null,null,null,null,null,"Les concaténations en rouge permettent de remplir par formules le récapitulatif au dessus"]
["1er MATCH le 15 mai","à",{"$f":"A6","v":"AZ"},null,null,null,null,null,"Ce récap servira à départager les ex aequos"]
[null,null,null,null,null,null,"SI forfait éq recevante"]
["Equipes","score","Equipes","score"]
[{"$f":"$A$6","v":"AZ"},null,{"$f":"$A$7","v":"BA"},{"$f":"IF(G16=19,19,IF(ISBLANK(B16),\"\",IF(B16=19,0,36-B16)))","v":""},{"$f":"IF(G16=19,0,IF(ISBLANK(B16),\"\",IF(B16<18,1,IF(B16=18,2,IF(B16>18,3)))))","v":""},{"$f":"IF(G16=19,3,IF(ISBLANK(B16),\"\",IF(B16=19,0,IF(D16<18,1,IF(D16=18,2,IF(D16>=20,3))))))","v":""},null,null,{"$f":"IF(ISBLANK(B16),0,B16)","v":0},{"$f":"IF(ISBLANK(B16),0,D16)","v":0},{"$f":"A16&C16","v":"AZBA"}]
[{"$f":"$A$8","v":"BB"},null,{"$f":"$A$9","v":"BC"},{"$f":"IF(G17=19,19,IF(ISBLANK(B17),\"\",IF(B17=19,0,36-B17)))","v":""},{"$f":"IF(G17=19,0,IF(ISBLANK(B17),\"\",IF(B17<18,1,IF(B17=18,2,IF(B17>18,3)))))","v":""},{"$f":"IF(G17=19,3,IF(ISBLANK(B17),\"\",IF(B17=19,0,IF(D17<18,1,IF(D17=18,2,IF(D17>=20,3))))))","v":""},null,null,{"$f":"IF(ISBLANK(B17),0,B17)","v":0},{"$f":"IF(ISBLANK(B17),0,D17)","v":0},{"$f":"A17&C17","v":"BBBC"}]
[{"$f":"$A$10","v":"BD"},null,{"$f":"$A$11","v":"BE"},{"$f":"IF(G18=19,19,IF(ISBLANK(B18),\"\",IF(B18=19,0,36-B18)))","v":""},{"$f":"IF(G18=19,0,IF(ISBLANK(B18),\"\",IF(B18<18,1,IF(B18=18,2,IF(B18>18,3)))))","v":""},{"$f":"IF(G18=19,3,IF(ISBLANK(B18),\"\",IF(B18=19,0,IF(D18<18,1,IF(D18=18,2,IF(D18>=20,3))))))","v":""},null,null,{"$f":"IF(ISBLANK(B18),0,B18)","v":0},{"$f":"IF(ISBLANK(B18),0,D18)","v":0},{"$f":"A18&C18","v":"BDBE"}]
[]
["2 éme MATCH le 22 mai","à",{"$f":"A7","v":"BA"}]
[null,null,null,null,null,null,"SI forfait éq recevante"]
["Equipes","score","Equipes","score"]
[{"$f":"$A$6","v":"AZ"},null,{"$f":"$A$8","v":"BB"},{"$f":"IF(G23=19,19,IF(ISBLANK(B23),\"\",IF(B23=19,0,36-B23)))","v":""},{"$f":"IF(G23=19,0,IF(ISBLANK(B23),\"\",IF(B23<18,1,IF(B23=18,2,IF(B23>18,3)))))","v":""},{"$f":"IF(G23=19,3,IF(ISBLANK(B23),\"\",IF(B23=19,0,IF(D23<18,1,IF(D23=18,2,IF(D23>=20,3))))))","v":""},null,null,{"$f":"IF(ISBLANK(B23),0,B23)","v":0},{"$f":"IF(ISBLANK(B23),0,D23)","v":0},{"$f":"A23&C23","v":"AZBB"}]
[{"$f":"$A$7","v":"BA"},null,{"$f":"$A$10","v":"BD"},{"$f":"IF(G24=19,19,IF(ISBLANK(B24),\"\",IF(B24=19,0,36-B24)))","v":""},{"$f":"IF(G24=19,0,IF(ISBLANK(B24),\"\",IF(B24<18,1,IF(B24=18,2,IF(B24>18,3)))))","v":""},{"$f":"IF(G24=19,3,IF(ISBLANK(B24),\"\",IF(B24=19,0,IF(D24<18,1,IF(D24=18,2,IF(D24>=20,3))))))","v":""},null,null,{"$f":"IF(ISBLANK(B24),0,B24)","v":0},{"$f":"IF(ISBLANK(B24),0,D24)","v":0},{"$f":"A24&C24","v":"BABD"}]
[{"$f":"$A$9","v":"BC"},null,{"$f":"$A$11","v":"BE"},{"$f":"IF(G25=19,19,IF(ISBLANK(B25),\"\",IF(B25=19,0,36-B25)))","v":""},{"$f":"IF(G25=19,0,IF(ISBLANK(B25),\"\",IF(B25<18,1,IF(B25=18,2,IF(B25>18,3)))))","v":""},{"$f":"IF(G25=19,3,IF(ISBLANK(B25),\"\",IF(B25=19,0,IF(D25<18,1,IF(D25=18,2,IF(D25>=20,3))))))","v":""},null,null,{"$f":"IF(ISBLANK(B25),0,B25)","v":0},{"$f":"IF(ISBLANK(B25),0,D25)","v":0},{"$f":"A25&C25","v":"BCBE"}]
[]
["3 éme MATCH le 29 mai","à",{"$f":"A8","v":"BB"}]
[null,null,null,null,null,null,"SI forfait éq recevante"]
["Equipes","score","Equipes","score"]
[{"$f":"$A$6","v":"AZ"},null,{"$f":"$A$11","v":"BE"},{"$f":"IF(G30=19,19,IF(ISBLANK(B30),\"\",IF(B30=19,0,36-B30)))","v":""},{"$f":"IF(G30=19,0,IF(ISBLANK(B30),\"\",IF(B30<18,1,IF(B30=18,2,IF(B30>18,3)))))","v":""},{"$f":"IF(G30=19,3,IF(ISBLANK(B30),\"\",IF(B30=19,0,IF(D30<18,1,IF(D30=18,2,IF(D30>=20,3))))))","v":""},null,null,{"$f":"IF(ISBLANK(B30),0,B30)","v":0},{"$f":"IF(ISBLANK(B30),0,D30)","v":0},{"$f":"A30&C30","v":"AZBE"}]
[{"$f":"$A$10","v":"BD"},null,{"$f":"$A$9","v":"BC"},{"$f":"IF(G31=19,19,IF(ISBLANK(B31),\"\",IF(B31=19,0,36-B31)))","v":""},{"$f":"IF(G31=19,0,IF(ISBLANK(B31),\"\",IF(B31<18,1,IF(B31=18,2,IF(B31>18,3)))))","v":""},{"$f":"IF(G31=19,3,IF(ISBLANK(B31),\"\",IF(B31=19,0,IF(D31<18,1,IF(D31=18,2,IF(D31>=20,3))))))","v":""},null,null,{"$f":"IF(ISBLANK(B31),0,B31)","v":0},{"$f":"IF(ISBLANK(B31),0,D31)","v":0},{"$f":"A31&C31","v":"BDBC"}]
[{"$f":"$A$8","v":"BB"},null,{"$f":"$A$7","v":"BA"},{"$f":"IF(G32=19,19,IF(ISBLANK(B32),\"\",IF(B32=19,0,36-B32)))","v":""},{"$f":"IF(G32=19,0,IF(ISBLANK(B32),\"\",IF(B32<18,1,IF(B32=18,2,IF(B32>18,3)))))","v":""},{"$f":"IF(G32=19,3,IF(ISBLANK(B32),\"\",IF(B32=19,0,IF(D32<18,1,IF(D32=18,2,IF(D32>=20,3))))))","v":""},null,null,{"$f":"IF(ISBLANK(B32),0,B32)","v":0},{"$f":"IF(ISBLANK(B32),0,D32)","v":0},{"$f":"A32&C32","v":"BBBA"}]
[]
["4 éme MATCH le 5 juin","à",{"$f":"A9","v":"BC"}]
[null,null,null,null,null,null,"SI forfait éq recevante"]
["Equipes","score","Equipes","score"]
[{"$f":"A6","v":"AZ"},null,{"$f":"$A$9","v":"BC"},{"$f":"IF(G37=19,19,IF(ISBLANK(B37),\"\",IF(B37=19,0,36-B37)))","v":""},{"$f":"IF(G37=19,0,IF(ISBLANK(B37),\"\",IF(B37<18,1,IF(B37=18,2,IF(B37>18,3)))))","v":""},{"$f":"IF(G37=19,3,IF(ISBLANK(B37),\"\",IF(B37=19,0,IF(D37<18,1,IF(D37=18,2,IF(D37>=20,3))))))","v":""},null,null,{"$f":"IF(ISBLANK(B37),0,B37)","v":0},{"$f":"IF(ISBLANK(B37),0,D37)","v":0},{"$f":"A37&C37","v":"AZBC"}]
[{"$f":"$A$7","v":"BA"},null,{"$f":"$A$11","v":"BE"},{"$f":"IF(G38=19,19,IF(ISBLANK(B38),\"\",IF(B38=19,0,36-B38)))","v":""},{"$f":"IF(G38=19,0,IF(ISBLANK(B38),\"\",IF(B38<18,1,IF(B38=18,2,IF(B38>18,3)))))","v":""},{"$f":"IF(G38=19,3,IF(ISBLANK(B38),\"\",IF(B38=19,0,IF(D38<18,1,IF(D38=18,2,IF(D38>=20,3))))))","v":""},null,null,{"$f":"IF(ISBLANK(B38),0,B38)","v":0},{"$f":"IF(ISBLANK(B38),0,D38)","v":0},{"$f":"A38&C38","v":"BABE"}]
[{"$f":"A8","v":"BB"},null,{"$f":"$A$10","v":"BD"},{"$f":"IF(G39=19,19,IF(ISBLANK(B39),\"\",IF(B39=19,0,36-B39)))","v":""},{"$f":"IF(G39=19,0,IF(ISBLANK(B39),\"\",IF(B39<18,1,IF(B39=18,2,IF(B39>18,3)))))","v":""},{"$f":"IF(G39=19,3,IF(ISBLANK(B39),\"\",IF(B39=19,0,IF(D39<18,1,IF(D39=18,2,IF(D39>=20,3))))))","v":""},null,null,{"$f":"IF(ISBLANK(B39),0,B39)","v":0},{"$f":"IF(ISBLANK(B39),0,D39)","v":0},{"$f":"A39&C39","v":"BBBD"}]
[]
["5 éme MATCH le 12 juin","à",{"$f":"A10","v":"BD"}]
[null,null,null,null,null,null,"SI forfait éq recevante"]
["Equipes","score","Equipes","score"]
[{"$f":"A8","v":"BB"},null,{"$f":"$A$11","v":"BE"},{"$f":"IF(G44=19,19,IF(ISBLANK(B44),\"\",IF(B44=19,0,36-B44)))","v":""},{"$f":"IF(G44=19,0,IF(ISBLANK(B44),\"\",IF(B44<18,1,IF(B44=18,2,IF(B44>18,3)))))","v":""},{"$f":"IF(G44=19,3,IF(ISBLANK(B44),\"\",IF(B44=19,0,IF(D44<18,1,IF(D44=18,2,IF(D44>=20,3))))))","v":""},null,null,{"$f":"IF(ISBLANK(B44),0,B44)","v":0},{"$f":"IF(ISBLANK(B44),0,D44)","v":0},{"$f":"A44&C44","v":"BBBE"}]
[{"$f":"$A$10","v":"BD"},null,{"$f":"A6","v":"AZ"},{"$f":"IF(G45=19,19,IF(ISBLANK(B45),\"\",IF(B45=19,0,36-B45)))","v":""},{"$f":"IF(G45=19,0,IF(ISBLANK(B45),\"\",IF(B45<18,1,IF(B45=18,2,IF(B45>18,3)))))","v":""},{"$f":"IF(G45=19,3,IF(ISBLANK(B45),\"\",IF(B45=19,0,IF(D45<18,1,IF(D45=18,2,IF(D45>=20,3))))))","v":""},null,null,{"$f":"IF(ISBLANK(B45),0,B45)","v":0},{"$f":"IF(ISBLANK(B45),0,D45)","v":0},{"$f":"A45&C45","v":"BDAZ"}]
[{"$f":"A7","v":"BA"},null,{"$f":"$A$9","v":"BC"},{"$f":"IF(G46=19,19,IF(ISBLANK(B46),\"\",IF(B46=19,0,36-B46)))","v":""},{"$f":"IF(G46=19,0,IF(ISBLANK(B46),\"\",IF(B46<18,1,IF(B46=18,2,IF(B46>18,3)))))","v":""},{"$f":"IF(G46=19,3,IF(ISBLANK(B46),\"\",IF(B46=19,0,IF(D46<18,1,IF(D46=18,2,IF(D46>=20,3))))))","v":""},null,null,{"$f":"IF(ISBLANK(B46),0,B46)","v":0},{"$f":"IF(ISBLANK(B46),0,D46)","v":0},{"$f":"A46&C46","v":"BABC"}]
[]
["CLASSEMENT"]
["EQUIPES",null,"POINTS","Pour","Contre","Diff","CLASST"]
["AZ","5A",0,0,0,0,{"$f":"B59","v":1},{"$f":"IF(AND(G50=1,COUNTIF(rang1,1)>1),COUNTIF(G$50:G50,1),IF(AND(G50=2,COUNTIF(rang1,2)>1),COUNTIF(G$50:G50,2)+3,\"\"))","v":1}]
["BA","5B",0,0,0,0,1,{"$f":"IF(AND(G51=1,COUNTIF(rang1,1)>1),COUNTIF(G$50:G51,1),IF(AND(G51=2,COUNTIF(rang1,2)>1),COUNTIF(G$50:G51,2)+3,\"\"))","v":2}]
["BB","5C",0,0,0,0,1,{"$f":"IF(AND(G52=1,COUNTIF(rang1,1)>1),COUNTIF(G$50:G52,1),IF(AND(G52=2,COUNTIF(rang1,2)>1),COUNTIF(G$50:G52,2)+3,\"\"))","v":3}]
["BC","5D",0,0,0,0,1,{"$f":"IF(AND(G53=1,COUNTIF(rang1,1)>1),COUNTIF(G$50:G53,1),IF(AND(G53=2,COUNTIF(rang1,2)>1),COUNTIF(G$50:G53,2)+3,\"\"))","v":4}]
["BD","5E",0,0,0,0,1,{"$f":"IF(AND(G54=1,COUNTIF(rang1,1)>1),COUNTIF(G$50:G54,1),IF(AND(G54=2,COUNTIF(rang1,2)>1),COUNTIF(G$50:G54,2)+3,\"\"))","v":5}]
["BE","5F",0,0,0,0,1,{"$f":"IF(AND(G55=1,COUNTIF(rang1,1)>1),COUNTIF(G$50:G55,1),IF(AND(G55=2,COUNTIF(rang1,2)>1),COUNTIF(G$50:G55,2)+3,\"\"))","v":6}]
[]
[null,"CLASSEMENT FINAL et DEPARTAGE EX AEQUOS",null,null,null,null,null,null,null,null,null,null,"CLASSEMENT"]
[null,"Rang","Equipes","Pts","diff pts avec exaequo","cumul","departage goalaverage si même cumul","RP",null,null,null,"RP","Rang","Equipe","Pts"]
[null,{"$f":"RANK(G59,$G$59:$G$64)","v":1},{"$f":"INDEX($A$50:$A$55,MATCH(H59,$L$59:$L$64,0))","v":"AZ"},{"$f":"VLOOKUP(C59,$A$50:$C$55,3,0)","v":0},{"$f":"IF(D59=D60,INDEX($J$6:$O$11,MATCH(C59,$I$6:$I$11,0),MATCH(C60,$J$5:$O$5,0)),IF(D59=D58,INDEX($J$6:$O$11,MATCH(C59,$I$6:$I$11,0),MATCH(C58,$J$5:$O$5,0)),0))","v":0},{"$f":"D59+E59/100","v":0},{"$f":"IF(AND(F59<>F58,F59<>F60),F59,F59+VLOOKUP(C59,$A$50:$F$55,6,0)/100)","v":0},1,null,null,null,{"$f":"RANK(C50,$C$50:$C$55)+COUNTIF($C$50:C50,C50)-1","v":1},{"$f":"B59","v":1},"AZ",{"$f":"VLOOKUP(N59,$C$59:$D$64,2,0)","v":0}]
[null,1,"BA",0,{"$f":"IF(D60=D61,INDEX($J$6:$O$11,MATCH(C60,$I$6:$I$11,0),MATCH(C61,$J$5:$O$5,0)),IF(D60=D59,INDEX($J$6:$O$11,MATCH(C60,$I$6:$I$11,0),MATCH(C59,$J$5:$O$5,0)),0))","v":0},0,{"$f":"IF(AND(F60<>F59,F60<>F61),F60,F60+VLOOKUP(C60,$A$50:$F$55,6,0)/100)","v":0},2,null,null,null,{"$f":"RANK(C51,$C$50:$C$55)+COUNTIF($C$50:C51,C51)-1","v":2},1,"BA",0]
[null,1,"BB",0,{"$f":"IF(D61=D62,INDEX($J$6:$O$11,MATCH(C61,$I$6:$I$11,0),MATCH(C62,$J$5:$O$5,0)),IF(D61=D60,INDEX($J$6:$O$11,MATCH(C61,$I$6:$I$11,0),MATCH(C60,$J$5:$O$5,0)),0))","v":0},0,{"$f":"IF(AND(F61<>F60,F61<>F62),F61,F61+VLOOKUP(C61,$A$50:$F$55,6,0)/100)","v":0},3,null,null,null,{"$f":"RANK(C52,$C$50:$C$55)+COUNTIF($C$50:C52,C52)-1","v":3},1,"BB",0]
[null,1,"BC",0,{"$f":"IF(D62=D63,INDEX($J$6:$O$11,MATCH(C62,$I$6:$I$11,0),MATCH(C63,$J$5:$O$5,0)),IF(D62=D61,INDEX($J$6:$O$11,MATCH(C62,$I$6:$I$11,0),MATCH(C61,$J$5:$O$5,0)),0))","v":0},0,{"$f":"IF(AND(F62<>F61,F62<>F63),F62,F62+VLOOKUP(C62,$A$50:$F$55,6,0)/100)","v":0},4,null,null,null,{"$f":"RANK(C53,$C$50:$C$55)+COUNTIF($C$50:C53,C53)-1","v":4},1,"BC",0]
[null,1,"BD",0,{"$f":"IF(D63=D64,INDEX($J$6:$O$11,MATCH(C63,$I$6:$I$11,0),MATCH(C64,$J$5:$O$5,0)),IF(D63=D62,INDEX($J$6:$O$11,MATCH(C63,$I$6:$I$11,0),MATCH(C62,$J$5:$O$5,0)),0))","v":0},0,{"$f":"IF(AND(F63<>F62,F63<>F64),F63,F63+VLOOKUP(C63,$A$50:$F$55,6,0)/100)","v":0},5,null,null,null,{"$f":"RANK(C54,$C$50:$C$55)+COUNTIF($C$50:C54,C54)-1","v":5},1,"BD",0]
[null,1,"BE",0,{"$f":"IF(D64=D59,INDEX($J$6:$O$11,MATCH(C64,$I$6:$I$11,0),MATCH(C59,$J$5:$O$5,0)),IF(D64=D63,INDEX($J$6:$O$11,MATCH(C64,$I$6:$I$11,0),MATCH(C63,$J$5:$O$5,0)),0))","v":0},0,{"$f":"IF(AND(F64<>F63,F64<>F59),F64,F64+VLOOKUP(C64,$A$50:$F$55,6,0)/100)","v":0},6,null,null,null,{"$f":"RANK(C55,$C$50:$C$55)+COUNTIF($C$50:C55,C55)-1","v":6},1,"BE",0]

{"sheet":"P6","index":5,"n_rows":64,"n_cols":15,"rows_kept":64,"cut":false,"hidden":false,"merged":[[0,0,0,5],[1,0,1,5],[2,0,2,5],[3,0,3,5],[13,6,14,6],[56,1,56,6],[56,12,56,14],[20,6,21,6],[27,6,28,6],[34,6,35,6],[41,6,42,6],[47,0,47,5]]}
[]
["CHAMPIONNAT DES CLUBS"]
[]
["POULE 6",null,null,null,null,null,null,null,"Récapitulatif  différence match entre 2 équipes"]
["EQUIPES",null,"POINTS","Pour","Contre","Diff",null,null,null,{"$f":"A6","v":"BF"},{"$f":"A7","v":"BG"},{"$f":"A8","v":"BH"},{"$f":"A9","v":"BI"},{"$f":"A10","v":"BJ"},{"$f":"A11","v":"BK"}]
["BF","6A",{"$f":"SUM(E16,E23,E30,E37,F45)","v":0},{"$f":"I16+I23+I30+I37+J45","v":0},{"$f":"J16+J23+J30+J37+I45","v":0},{"$f":"D6-E6","v":0},null,null,{"$f":"A6","v":"BF"},null,{"$f":"IF(ISBLANK(B16),0,IFERROR(INDEX($B$15:$B$46,MATCH($I6&K$5,$K$15:$K$46,0))-INDEX($D$15:$D$46,MATCH($I6&K$5,$K$15:$K$46,0)),0-INDEX($J$6:$O$11,MATCH(K$5,$I$6:$I$11,0),MATCH($I6,$J$5:$O$5,0))))","v":0},{"$f":"IF(ISBLANK(B23),0,IFERROR(INDEX($B$15:$B$46,MATCH($I6&L$5,$K$15:$K$46,0))-INDEX($D$15:$D$46,MATCH($I6&L$5,$K$15:$K$46,0)),0-INDEX($J$6:$O$11,MATCH(L$5,$I$6:$I$11,0),MATCH($I6,$J$5:$O$5,0))))","v":0},{"$f":"IF(ISBLANK(B37),0,IFERROR(INDEX($B$15:$B$46,MATCH($I6&M$5,$K$15:$K$46,0))-INDEX($D$15:$D$46,MATCH($I6&M$5,$K$15:$K$46,0)),0-INDEX($J$6:$O$11,MATCH(M$5,$I$6:$I$11,0),MATCH($I6,$J$5:$O$5,0))))","v":0},{"$f":"IF(ISBLANK(B45),0,IFERROR(INDEX($B$15:$B$46,MATCH($I6&N$5,$K$15:$K$46,0))-INDEX($D$15:$D$46,MATCH($I6&N$5,$K$15:$K$46,0)),0-INDEX($J$6:$O$11,MATCH(N$5,$I$6:$I$11,0),MATCH($I6,$J$5:$O$5,0))))","v":0},{"$f":"IF(ISBLANK(B30),0,IFERROR(INDEX($B$15:$B$46,MATCH($I6&O$5,$K$15:$K$46,0))-INDEX($D$15:$D$46,MATCH($I6&O$5,$K$15:$K$46,0)),0-INDEX($J$6:$O$11,MATCH(O$5,$I$6:$I$11,0),MATCH($I6,$J$5:$O$5,0))))","v":0}]
["BG","6B",{"$f":"SUM(F16,E24,F32,E38,E46)","v":0},{"$f":"J16+I24+J32+I38+I46","v":0},{"$f":"I16+J24+I32+J38+J46","v":0},0,null,null,"BG",{"$f":"IF(ISBLANK(B16),0,IFERROR(INDEX($B$15:$B$46,MATCH($I7&J$5,$K$15:$K$46,0))-INDEX($D$15:$D$46,MATCH($I7&J$5,$K$15:$K$46,0)),0-INDEX($J$6:$O$11,MATCH(J$5,$I$6:$I$11,0),MATCH($I7,$J$5:$O$5,0))))","v":0},null,{"$f":"IF(ISBLANK(B32),0,IFERROR(INDEX($B$15:$B$46,MATCH($I7&L$5,$K$15:$K$46,0))-INDEX($D$15:$D$46,MATCH($I7&L$5,$K$15:$K$46,0)),0-INDEX($J$6:$O$11,MATCH(L$5,$I$6:$I$11,0),MATCH($I7,$J$5:$O$5,0))))","v":0},{"$f":"IF(ISBLANK(B46),0,IFERROR(INDEX($B$15:$B$46,MATCH($I7&M$5,$K$15:$K$46,0))-INDEX($D$15:$D$46,MATCH($I7&M$5,$K$15:$K$46,0)),0-INDEX($J$6:$O$11,MATCH(M$5,$I$6:$I$11,0),MATCH($I7,$J$5:$O$5,0))))","v":0},{"$f":"IF(ISBLANK(B24),0,IFERROR(INDEX($B$15:$B$46,MATCH($I7&N$5,$K$15:$K$46,0))-INDEX($D$15:$D$46,MATCH($I7&N$5,$K$15:$K$46,0)),0-INDEX($J$6:$O$11,MATCH(N$5,$I$6:$I$11,0),MATCH($I7,$J$5:$O$5,0))))","v":0},{"$f":"IF(ISBLANK(B38),0,IFERROR(INDEX($B$15:$B$46,MATCH($I7&O$5,$K$15:$K$46,0))-INDEX($D$15:$D$46,MATCH($I7&O$5,$K$15:$K$46,0)),0-INDEX($J$6:$O$11,MATCH(O$5,$I$6:$I$11,0),MATCH($I7,$J$5:$O$5,0))))","v":0}]
["BH","6C",{"$f":"SUM(E17,F23,E32,E39,E44)","v":0},{"$f":"I17+J23+I32+I39+I44","v":0},{"$f":"J17+I23+J32+J39+J44","v":0},0,null,null,"BH",{"$f":"IF(ISBLANK(B23),0,IFERROR(INDEX($B$15:$B$46,MATCH($I8&J$5,$K$15:$K$46,0))-INDEX($D$15:$D$46,MATCH($I8&J$5,$K$15:$K$46,0)),0-INDEX($J$6:$O$11,MATCH(J$5,$I$6:$I$11,0),MATCH($I8,$J$5:$O$5,0))))","v":0},{"$f":"IF(ISBLANK(B32),0,IFERROR(INDEX($B$15:$B$46,MATCH($I8&K$5,$K$15:$K$46,0))-INDEX($D$15:$D$46,MATCH($I8&K$5,$K$15:$K$46,0)),0-INDEX($J$6:$O$11,MATCH(K$5,$I$6:$I$11,0),MATCH($I8,$J$5:$O$5,0))))","v":0},null,{"$f":"IF(ISBLANK(B17),0,IFERROR(INDEX($B$15:$B$46,MATCH($I8&M$5,$K$15:$K$46,0))-INDEX($D$15:$D$46,MATCH($I8&M$5,$K$15:$K$46,0)),0-INDEX($J$6:$O$11,MATCH(M$5,$I$6:$I$11,0),MATCH($I8,$J$5:$O$5,0))))","v":0},{"$f":"IF(ISBLANK(B39),0,IFERROR(INDEX($B$15:$B$46,MATCH($I8&N$5,$K$15:$K$46,0))-INDEX($D$15:$D$46,MATCH($I8&N$5,$K$15:$K$46,0)),0-INDEX($J$6:$O$11,MATCH(N$5,$I$6:$I$11,0),MATCH($I8,$J$5:$O$5,0))))","v":0},{"$f":"IF(ISBLANK(B44),0,IFERROR(INDEX($B$15:$B$46,MATCH($I8&O$5,$K$15:$K$46,0))-INDEX($D$15:$D$46,MATCH($I8&O$5,$K$15:$K$46,0)),0-INDEX($J$6:$O$11,MATCH(O$5,$I$6:$I$11,0),MATCH($I8,$J$5:$O$5,0))))","v":0}]
["BI","6D",{"$f":"SUM(F17,E25,F31,F37,F46)","v":0},{"$f":"J17+I25+J31+J37+J46","v":0},{"$f":"I17+J25+I31+I37+I46","v":0},0,null,null,"BI",{"$f":"IF(ISBLANK(B37),0,IFERROR(INDEX($B$15:$B$46,MATCH($I9&J$5,$K$15:$K$46,0))-INDEX($D$15:$D$46,MATCH($I9&J$5,$K$15:$K$46,0)),0-INDEX($J$6:$O$11,MATCH(J$5,$I$6:$I$11,0),MATCH($I9,$J$5:$O$5,0))))","v":0},{"$f":"IF(ISBLANK(B46),0,IFERROR(INDEX($B$15:$B$46,MATCH($I9&K$5,$K$15:$K$46,0))-INDEX($D$15:$D$46,MATCH($I9&K$5,$K$15:$K$46,0)),0-INDEX($J$6:$O$11,MATCH(K$5,$I$6:$I$11,0),MATCH($I9,$J$5:$O$5,0))))","v":0},{"$f":"IF(ISBLANK(B17),0,IFERROR(INDEX($B$15:$B$46,MATCH($I9&L$5,$K$15:$K$46,0))-INDEX($D$15:$D$46,MATCH($I9&L$5,$K$15:$K$46,0)),0-INDEX($J$6:$O$11,MATCH(L$5,$I$6:$I$11,0),MATCH($I9,$J$5:$O$5,0))))","v":0},null,{"$f":"IF(ISBLANK(B31),0,IFERROR(INDEX($B$15:$B$46,MATCH($I9&N$5,$K$15:$K$46,0))-INDEX($D$15:$D$46,MATCH($I9&N$5,$K$15:$K$46,0)),0-INDEX($J$6:$O$11,MATCH(N$5,$I$6:$I$11,0),MATCH($I9,$J$5:$O$5,0))))","v":0},{"$f":"IF(ISBLANK(B25),0,IFERROR(INDEX($B$15:$B$46,MATCH($I9&O$5,$K$15:$K$46,0))-INDEX($D$15:$D$46,MATCH($I9&O$5,$K$15:$K$46,0)),0-INDEX($J$6:$O$11,MATCH(O$5,$I$6:$I$11,0),MATCH($I9,$J$5:$O$5,0))))","v":0}]
["BJ","6E",{"$f":"SUM(E18,F24,E31,F39,E45)","v":0},{"$f":"I18+J24+I31+J39+I45","v":0},{"$f":"J18+I24+J31+I39+J45","v":0},0,null,null,"BJ",{"$f":"IF(ISBLANK(B45),0,IFERROR(INDEX($B$15:$B$46,MATCH($I10&J$5,$K$15:$K$46,0))-INDEX($D$15:$D$46,MATCH($I10&J$5,$K$15:$K$46,0)),0-INDEX($J$6:$O$11,MATCH(J$5,$I$6:$I$11,0),MATCH($I10,$J$5:$O$5,0))))","v":0},{"$f":"IF(ISBLANK(B24),0,IFERROR(INDEX($B$15:$B$46,MATCH($I10&K$5,$K$15:$K$46,0))-INDEX($D$15:$D$46,MATCH($I10&K$5,$K$15:$K$46,0)),0-INDEX($J$6:$O$11,MATCH(K$5,$I$6:$I$11,0),MATCH($I10,$J$5:$O$5,0))))","v":0},{"$f":"IF(ISBLANK(B39),0,IFERROR(INDEX($B$15:$B$46,MATCH($I10&L$5,$K$15:$K$46,0))-INDEX($D$15:$D$46,MATCH($I10&L$5,$K$15:$K$46,0)),0-INDEX($J$6:$O$11,MATCH(L$5,$I$6:$I$11,0),MATCH($I10,$J$5:$O$5,0))))","v":0},{"$f":"IF(ISBLANK(B31),0,IFERROR(INDEX($B$15:$B$46,MATCH($I10&M$5,$K$15:$K$46,0))-INDEX($D$15:$D$46,MATCH($I10&M$5,$K$15:$K$46,0)),0-INDEX($J$6:$O$11,MATCH(M$5,$I$6:$I$11,0),MATCH($I10,$J$5:$O$5,0))))","v":0},null,{"$f":"IF(ISBLANK(B18),0,IFERROR(INDEX($B$15:$B$46,MATCH($I10&O$5,$K$15:$K$46,0))-INDEX($D$15:$D$46,MATCH($I10&O$5,$K$15:$K$46,0)),0-INDEX($J$6:$O$11,MATCH(O$5,$I$6:$I$11,0),MATCH($I10,$J$5:$O$5,0))))","v":0}]
["BK","6F",{"$f":"SUM(F18,F25,F30,F38,F44)","v":0},{"$f":"J18+J25+J30+J38+J44","v":0},{"$f":"I18+I25+I30+I38+I44","v":0},0,null,null,"BK",{"$f":"IF(ISBLANK(B30),0,IFERROR(INDEX($B$15:$B$46,MATCH($I11&J$5,$K$15:$K$46,0))-INDEX($D$15:$D$46,MATCH($I11&J$5,$K$15:$K$46,0)),0-INDEX($J$6:$O$11,MATCH(J$5,$I$6:$I$11,0),MATCH($I11,$J$5:$O$5,0))))","v":0},{"$f":"IF(ISBLANK(B38),0,IFERROR(INDEX($B$15:$B$46,MATCH($I11&K$5,$K$15:$K$46,0))-INDEX($D$15:$D$46,MATCH($I11&K$5,$K$15:$K$46,0)),0-INDEX($J$6:$O$11,MATCH(K$5,$I$6:$I$11,0),MATCH($I11,$J$5:$O$5,0))))","v":0},{"$f":"IF(ISBLANK(B44),0,IFERROR(INDEX($B$15:$B$46,MATCH($I11&L$5,$K$15:$K$46,0))-INDEX($D$15:$D$46,MATCH($I11&L$5,$K$15:$K$46,0)),0-INDEX($J$6:$O$11,MATCH(L$5,$I$6:$I$11,0),MATCH($I11,$J$5:$O$5,0))))","v":0},{"$f":"IF(ISBLANK(B25),0,IFERROR(INDEX($B$15:$B$46,MATCH($I11&M$5,$K$15:$K$46,0))-INDEX($D$15:$D$46,MATCH($I11&M$5,$K$15:$K$46,0)),0-INDEX($J$6:$O$11,MATCH(M$5,$I$6:$I$11,0),MATCH($I11,$J$5:$O$5,0))))","v":0},{"$f":"IF(ISBLANK(B18),0,IFERROR(INDEX($B$15:$B$46,MATCH($I11&N$5,$K$15:$K$46,0))-INDEX($D$15:$D$46,MATCH($I11&N$5,$K$15:$K$46,0)),0-INDEX($J$6:$O$11,MATCH(N$5,$I$6:$I$11,0),MATCH($I11,$J$5:$O$5,0))))","v":0}]
[null,null,null,null,null,null,null,null,"Les concaténations en rouge permettent de remplir par formules le récapitulatif au dessus"]
["1er MATCH le 15 mai","à",{"$f":"A6","v":"BF"},null,null,null,null,null,"Ce récap servira à départager les ex aequos"]
[null,null,null,null,null,null,"SI forfait éq recevante"]
["Equipes","score","Equipes","score"]
[{"$f":"$A$6","v":"BF"},null,{"$f":"$A$7","v":"BG"},{"$f":"IF(G16=19,19,IF(ISBLANK(B16),\"\",IF(B16=19,0,36-B16)))","v":""},{"$f":"IF(G16=19,0,IF(ISBLANK(B16),\"\",IF(B16<18,1,IF(B16=18,2,IF(B16>18,3)))))","v":""},{"$f":"IF(G16=19,3,IF(ISBLANK(B16),\"\",IF(B16=19,0,IF(D16<18,1,IF(D16=18,2,IF(D16>=20,3))))))","v":""},null,null,{"$f":"IF(ISBLANK(B16),0,B16)","v":0},{"$f":"IF(ISBLANK(B16),0,D16)","v":0},{"$f":"A16&C16","v":"BFBG"}]
[{"$f":"$A$8","v":"BH"},null,{"$f":"$A$9","v":"BI"},{"$f":"IF(G17=19,19,IF(ISBLANK(B17),\"\",IF(B17=19,0,36-B17)))","v":""},{"$f":"IF(G17=19,0,IF(ISBLANK(B17),\"\",IF(B17<18,1,IF(B17=18,2,IF(B17>18,3)))))","v":""},{"$f":"IF(G17=19,3,IF(ISBLANK(B17),\"\",IF(B17=19,0,IF(D17<18,1,IF(D17=18,2,IF(D17>=20,3))))))","v":""},null,null,{"$f":"IF(ISBLANK(B17),0,B17)","v":0},{"$f":"IF(ISBLANK(B17),0,D17)","v":0},{"$f":"A17&C17","v":"BHBI"}]
[{"$f":"$A$10","v":"BJ"},null,{"$f":"$A$11","v":"BK"},{"$f":"IF(G18=19,19,IF(ISBLANK(B18),\"\",IF(B18=19,0,36-B18)))","v":""},{"$f":"IF(G18=19,0,IF(ISBLANK(B18),\"\",IF(B18<18,1,IF(B18=18,2,IF(B18>18,3)))))","v":""},{"$f":"IF(G18=19,3,IF(ISBLANK(B18),\"\",IF(B18=19,0,IF(D18<18,1,IF(D18=18,2,IF(D18>=20,3))))))","v":""},null,null,{"$f":"IF(ISBLANK(B18),0,B18)","v":0},{"$f":"IF(ISBLANK(B18),0,D18)","v":0},{"$f":"A18&C18","v":"BJBK"}]
[]
["2 éme MATCH le 22 mai","à",{"$f":"A7","v":"BG"}]
[null,null,null,null,null,null,"SI forfait éq recevante"]
["Equipes","score","Equipes","score"]
[{"$f":"$A$6","v":"BF"},null,{"$f":"$A$8","v":"BH"},{"$f":"IF(G23=19,19,IF(ISBLANK(B23),\"\",IF(B23=19,0,36-B23)))","v":""},{"$f":"IF(G23=19,0,IF(ISBLANK(B23),\"\",IF(B23<18,1,IF(B23=18,2,IF(B23>18,3)))))","v":""},{"$f":"IF(G23=19,3,IF(ISBLANK(B23),\"\",IF(B23=19,0,IF(D23<18,1,IF(D23=18,2,IF(D23>=20,3))))))","v":""},null,null,{"$f":"IF(ISBLANK(B23),0,B23)","v":0},{"$f":"IF(ISBLANK(B23),0,D23)","v":0},{"$f":"A23&C23","v":"BFBH"}]
[{"$f":"$A$7","v":"BG"},null,{"$f":"$A$10","v":"BJ"},{"$f":"IF(G24=19,19,IF(ISBLANK(B24),\"\",IF(B24=19,0,36-B24)))","v":""},{"$f":"IF(G24=19,0,IF(ISBLANK(B24),\"\",IF(B24<18,1,IF(B24=18,2,IF(B24>18,3)))))","v":""},{"$f":"IF(G24=19,3,IF(ISBLANK(B24),\"\",IF(B24=19,0,IF(D24<18,1,IF(D24=18,2,IF(D24>=20,3))))))","v":""},null,null,{"$f":"IF(ISBLANK(B24),0,B24)","v":0},{"$f":"IF(ISBLANK(B24),0,D24)","v":0},{"$f":"A24&C24","v":"BGBJ"}]
[{"$f":"$A$9","v":"BI"},null,{"$f":"$A$11","v":"BK"},{"$f":"IF(G25=19,19,IF(ISBLANK(B25),\"\",IF(B25=19,0,36-B25)))","v":""},{"$f":"IF(G25=19,0,IF(ISBLANK(B25),\"\",IF(B25<18,1,IF(B25=18,2,IF(B25>18,3)))))","v":""},{"$f":"IF(G25=19,3,IF(ISBLANK(B25),\"\",IF(B25=19,0,IF(D25<18,1,IF(D25=18,2,IF(D25>=20,3))))))","v":""},null,null,{"$f":"IF(ISBLANK(B25),0,B25)","v":0},{"$f":"IF(ISBLANK(B25),0,D25)","v":0},{"$f":"A25&C25","v":"BIBK"}]
[]
["3 éme MATCH le 29 mai","à",{"$f":"A8","v":"BH"}]
[null,null,null,null,null,null,"SI forfait éq recevante"]
["Equipes","score","Equipes","score"]
[{"$f":"$A$6","v":"BF"},null,{"$f":"$A$11","v":"BK"},{"$f":"IF(G30=19,19,IF(ISBLANK(B30),\"\",IF(B30=19,0,36-B30)))","v":""},{"$f":"IF(G30=19,0,IF(ISBLANK(B30),\"\",IF(B30<18,1,IF(B30=18,2,IF(B30>18,3)))))","v":""},{"$f":"IF(G30=19,3,IF(ISBLANK(B30),\"\",IF(B30=19,0,IF(D30<18,1,IF(D30=18,2,IF(D30>=20,3))))))","v":""},null,null,{"$f":"IF(ISBLANK(B30),0,B30)","v":0},{"$f":"IF(ISBLANK(B30),0,D30)","v":0},{"$f":"A30&C30","v":"BFBK"}]
[{"$f":"$A$10","v":"BJ"},null,{"$f":"$A$9","v":"BI"},{"$f":"IF(G31=19,19,IF(ISBLANK(B31),\"\",IF(B31=19,0,36-B31)))","v":""},{"$f":"IF(G31=19,0,IF(ISBLANK(B31),\"\",IF(B31<18,1,IF(B31=18,2,IF(B31>18,3)))))","v":""},{"$f":"IF(G31=19,3,IF(ISBLANK(B31),\"\",IF(B31=19,0,IF(D31<18,1,IF(D31=18,2,IF(D31>=20,3))))))","v":""},null,null,{"$f":"IF(ISBLANK(B31),0,B31)","v":0},{"$f":"IF(ISBLANK(B31),0,D31)","v":0},{"$f":"A31&C31","v":"BJBI"}]
[{"$f":"$A$8","v":"BH"},null,{"$f":"$A$7","v":"BG"},{"$f":"IF(G32=19,19,IF(ISBLANK(B32),\"\",IF(B32=19,0,36-B32)))","v":""},{"$f":"IF(G32=19,0,IF(ISBLANK(B32),\"\",IF(B32<18,1,IF(B32=18,2,IF(B32>18,3)))))","v":""},{"$f":"IF(G32=19,3,IF(ISBLANK(B32),\"\",IF(B32=19,0,IF(D32<18,1,IF(D32=18,2,IF(D32>=20,3))))))","v":""},null,null,{"$f":"IF(ISBLANK(B32),0,B32)","v":0},{"$f":"IF(ISBLANK(B32),0,D32)","v":0},{"$f":"A32&C32","v":"BHBG"}]
[]
["4 éme MATCH le 5 juin","à",{"$f":"A9","v":"BI"}]
[null,null,null,null,null,null,"SI forfait éq recevante"]
["Equipes","score","Equipes","score"]
[{"$f":"A6","v":"BF"},null,{"$f":"$A$9","v":"BI"},{"$f":"IF(G37=19,19,IF(ISBLANK(B37),\"\",IF(B37=19,0,36-B37)))","v":""},{"$f":"IF(G37=19,0,IF(ISBLANK(B37),\"\",IF(B37<18,1,IF(B37=18,2,IF(B37>18,3)))))","v":""},{"$f":"IF(G37=19,3,IF(ISBLANK(B37),\"\",IF(B37=19,0,IF(D37<18,1,IF(D37=18,2,IF(D37>=20,3))))))","v":""},null,null,{"$f":"IF(ISBLANK(B37),0,B37)","v":0},{"$f":"IF(ISBLANK(B37),0,D37)","v":0},{"$f":"A37&C37","v":"BFBI"}]
[{"$f":"$A$7","v":"BG"},null,{"$f":"$A$11","v":"BK"},{"$f":"IF(G38=19,19,IF(ISBLANK(B38),\"\",IF(B38=19,0,36-B38)))","v":""},{"$f":"IF(G38=19,0,IF(ISBLANK(B38),\"\",IF(B38<18,1,IF(B38=18,2,IF(B38>18,3)))))","v":""},{"$f":"IF(G38=19,3,IF(ISBLANK(B38),\"\",IF(B38=19,0,IF(D38<18,1,IF(D38=18,2,IF(D38>=20,3))))))","v":""},null,null,{"$f":"IF(ISBLANK(B38),0,B38)","v":0},{"$f":"IF(ISBLANK(B38),0,D38)","v":0},{"$f":"A38&C38","v":"BGBK"}]
[{"$f":"A8","v":"BH"},null,{"$f":"$A$10","v":"BJ"},{"$f":"IF(G39=19,19,IF(ISBLANK(B39),\"\",IF(B39=19,0,36-B39)))","v":""},{"$f":"IF(G39=19,0,IF(ISBLANK(B39),\"\",IF(B39<18,1,IF(B39=18,2,IF(B39>18,3)))))","v":""},{"$f":"IF(G39=19,3,IF(ISBLANK(B39),\"\",IF(B39=19,0,IF(D39<18,1,IF(D39=18,2,IF(D39>=20,3))))))","v":""},null,null,{"$f":"IF(ISBLANK(B39),0,B39)","v":0},{"$f":"IF(ISBLANK(B39),0,D39)","v":0},{"$f":"A39&C39","v":"BHBJ"}]
[]
["5 éme MATCH le 12 juin","à",{"$f":"A10","v":"BJ"}]
[null,null,null,null,null,null,"SI forfait éq recevante"]
["Equipes","score","Equipes","score"]
[{"$f":"A8","v":"BH"},null,{"$f":"$A$11","v":"BK"},{"$f":"IF(G44=19,19,IF(ISBLANK(B44),\"\",IF(B44=19,0,36-B44)))","v":""},{"$f":"IF(G44=19,0,IF(ISBLANK(B44),\"\",IF(B44<18,1,IF(B44=18,2,IF(B44>18,3)))))","v":""},{"$f":"IF(G44=19,3,IF(ISBLANK(B44),\"\",IF(B44=19,0,IF(D44<18,1,IF(D44=18,2,IF(D44>=20,3))))))","v":""},null,null,{"$f":"IF(ISBLANK(B44),0,B44)","v":0},{"$f":"IF(ISBLANK(B44),0,D44)","v":0},{"$f":"A44&C44","v":"BHBK"}]
[{"$f":"$A$10","v":"BJ"},null,{"$f":"A6","v":"BF"},{"$f":"IF(G45=19,19,IF(ISBLANK(B45),\"\",IF(B45=19,0,36-B45)))","v":""},{"$f":"IF(G45=19,0,IF(ISBLANK(B45),\"\",IF(B45<18,1,IF(B45=18,2,IF(B45>18,3)))))","v":""},{"$f":"IF(G45=19,3,IF(ISBLANK(B45),\"\",IF(B45=19,0,IF(D45<18,1,IF(D45=18,2,IF(D45>=20,3))))))","v":""},null,null,{"$f":"IF(ISBLANK(B45),0,B45)","v":0},{"$f":"IF(ISBLANK(B45),0,D45)","v":0},{"$f":"A45&C45","v":"BJBF"}]
[{"$f":"A7","v":"BG"},null,{"$f":"$A$9","v":"BI"},{"$f":"IF(G46=19,19,IF(ISBLANK(B46),\"\",IF(B46=19,0,36-B46)))","v":""},{"$f":"IF(G46=19,0,IF(ISBLANK(B46),\"\",IF(B46<18,1,IF(B46=18,2,IF(B46>18,3)))))","v":""},{"$f":"IF(G46=19,3,IF(ISBLANK(B46),\"\",IF(B46=19,0,IF(D46<18,1,IF(D46=18,2,IF(D46>=20,3))))))","v":""},null,null,{"$f":"IF(ISBLANK(B46),0,B46)","v":0},{"$f":"IF(ISBLANK(B46),0,D46)","v":0},{"$f":"A46&C46","v":"BGBI"}]
[]
["CLASSEMENT"]
["EQUIPES",null,"POINTS","Pour","Contre","Diff","CLASST"]
["BF","6A",0,0,0,0,{"$f":"B59","v":1},{"$f":"IF(AND(G50=1,COUNTIF(rang1,1)>1),COUNTIF(G$50:G50,1),IF(AND(G50=2,COUNTIF(rang1,2)>1),COUNTIF(G$50:G50,2)+3,\"\"))","v":1}]
["BG","6B",0,0,0,0,1,{"$f":"IF(AND(G51=1,COUNTIF(rang1,1)>1),COUNTIF(G$50:G51,1),IF(AND(G51=2,COUNTIF(rang1,2)>1),COUNTIF(G$50:G51,2)+3,\"\"))","v":2}]
["BH","6C",0,0,0,0,1,{"$f":"IF(AND(G52=1,COUNTIF(rang1,1)>1),COUNTIF(G$50:G52,1),IF(AND(G52=2,COUNTIF(rang1,2)>1),COUNTIF(G$50:G52,2)+3,\"\"))","v":3}]
["BI","6D",0,0,0,0,1,{"$f":"IF(AND(G53=1,COUNTIF(rang1,1)>1),COUNTIF(G$50:G53,1),IF(AND(G53=2,COUNTIF(rang1,2)>1),COUNTIF(G$50:G53,2)+3,\"\"))","v":4}]
["BJ","6E",0,0,0,0,1,{"$f":"IF(AND(G54=1,COUNTIF(rang1,1)>1),COUNTIF(G$50:G54,1),IF(AND(G54=2,COUNTIF(rang1,2)>1),COUNTIF(G$50:G54,2)+3,\"\"))","v":5}]
["BK","6F",0,0,0,0,1,{"$f":"IF(AND(G55=1,COUNTIF(rang1,1)>1),COUNTIF(G$50:G55,1),IF(AND(G55=2,COUNTIF(rang1,2)>1),COUNTIF(G$50:G55,2)+3,\"\"))","v":6}]
[]
[null,"CLASSEMENT FINAL et DEPARTAGE EX AEQUOS",null,null,null,null,null,null,null,null,null,null,"CLASSEMENT"]
[null,"Rang","Equipes","Pts","diff pts avec exaequo","cumul","departage goalaverage si même cumul","RP",null,null,null,"RP","Rang","Equipe","Pts"]
[null,{"$f":"RANK(G59,$G$59:$G$64)","v":1},{"$f":"INDEX($A$50:$A$55,MATCH(H59,$L$59:$L$64,0))","v":"BF"},{"$f":"VLOOKUP(C59,$A$50:$C$55,3,0)","v":0},{"$f":"IF(D59=D60,INDEX($J$6:$O$11,MATCH(C59,$I$6:$I$11,0),MATCH(C60,$J$5:$O$5,0)),IF(D59=D58,INDEX($J$6:$O$11,MATCH(C59,$I$6:$I$11,0),MATCH(C58,$J$5:$O$5,0)),0))","v":0},{"$f":"D59+E59/100","v":0},{"$f":"IF(AND(F59<>F58,F59<>F60),F59,F59+VLOOKUP(C59,$A$50:$F$55,6,0)/100)","v":0},1,null,null,null,{"$f":"RANK(C50,$C$50:$C$55)+COUNTIF($C$50:C50,C50)-1","v":1},{"$f":"B59","v":1},"BF",{"$f":"VLOOKUP(N59,$C$59:$D$64,2,0)","v":0}]
[null,1,"BG",0,{"$f":"IF(D60=D61,INDEX($J$6:$O$11,MATCH(C60,$I$6:$I$11,0),MATCH(C61,$J$5:$O$5,0)),IF(D60=D59,INDEX($J$6:$O$11,MATCH(C60,$I$6:$I$11,0),MATCH(C59,$J$5:$O$5,0)),0))","v":0},0,{"$f":"IF(AND(F60<>F59,F60<>F61),F60,F60+VLOOKUP(C60,$A$50:$F$55,6,0)/100)","v":0},2,null,null,null,{"$f":"RANK(C51,$C$50:$C$55)+COUNTIF($C$50:C51,C51)-1","v":2},1,"BG",0]
[null,1,"BH",0,{"$f":"IF(D61=D62,INDEX($J$6:$O$11,MATCH(C61,$I$6:$I$11,0),MATCH(C62,$J$5:$O$5,0)),IF(D61=D60,INDEX($J$6:$O$11,MATCH(C61,$I$6:$I$11,0),MATCH(C60,$J$5:$O$5,0)),0))","v":0},0,{"$f":"IF(AND(F61<>F60,F61<>F62),F61,F61+VLOOKUP(C61,$A$50:$F$55,6,0)/100)","v":0},3,null,null,null,{"$f":"RANK(C52,$C$50:$C$55)+COUNTIF($C$50:C52,C52)-1","v":3},1,"BH",0]
[null,1,"BI",0,{"$f":"IF(D62=D63,INDEX($J$6:$O$11,MATCH(C62,$I$6:$I$11,0),MATCH(C63,$J$5:$O$5,0)),IF(D62=D61,INDEX($J$6:$O$11,MATCH(C62,$I$6:$I$11,0),MATCH(C61,$J$5:$O$5,0)),0))","v":0},0,{"$f":"IF(AND(F62<>F61,F62<>F63),F62,F62+VLOOKUP(C62,$A$50:$F$55,6,0)/100)","v":0},4,null,null,null,{"$f":"RANK(C53,$C$50:$C$55)+COUNTIF($C$50:C53,C53)-1","v":4},1,"BI",0]
[null,1,"BJ",0,{"$f":"IF(D63=D64,INDEX($J$6:$O$11,MATCH(C63,$I$6:$I$11,0),MATCH(C64,$J$5:$O$5,0)),IF(D63=D62,INDEX($J$6:$O$11,MATCH(C63,$I$6:$I$11,0),MATCH(C62,$J$5:$O$5,0)),0))","v":0},0,{"$f":"IF(AND(F63<>F62,F63<>F64),F63,F63+VLOOKUP(C63,$A$50:$F$55,6,0)/100)","v":0},5,null,null,null,{"$f":"RANK(C54,$C$50:$C$55)+COUNTIF($C$50:C54,C54)-1","v":5},1,"BJ",0]
[null,1,"BK",0,{"$f":"IF(D64=D59,INDEX($J$6:$O$11,MATCH(C64,$I$6:$I$11,0),MATCH(C59,$J$5:$O$5,0)),IF(D64=D63,INDEX($J$6:$O$11,MATCH(C64,$I$6:$I$11,0),MATCH(C63,$J$5:$O$5,0)),0))","v":0},0,{"$f":"IF(AND(F64<>F63,F64<>F59),F64,F64+VLOOKUP(C64,$A$50:$F$55,6,0)/100)","v":0},6,null,null,null,{"$f":"RANK(C55,$C$50:$C$55)+COUNTIF($C$50:C55,C55)-1","v":6},1,"BK",0]

{"sheet":"P7","index":6,"n_rows":64,"n_cols":15,"rows_kept":64,"cut":false,"hidden":false,"merged":[[0,0,0,5],[1,0,1,5],[2,0,2,5],[3,0,3,5],[13,6,14,6],[56,1,56,6],[56,12,56,14],[20,6,21,6],[27,6,28,6],[34,6,35,6],[41,6,42,6],[47,0,47,5]]}
[]
["CHAMPIONNAT DES CLUBS"]
[]
["POULE 7",null,null,null,null,null,null,null,"Récapitulatif  différence match entre 2 équipes"]
["EQUIPES",null,"POINTS","Pour","Contre","Diff",null,null,null,{"$f":"A6","v":"BL"},{"$f":"A7","v":"BM"},{"$f":"A8","v":"BN"},{"$f":"A9","v":"BO"},{"$f":"A10","v":"BP"},{"$f":"A11","v":"BQ"}]
["BL","7A",{"$f":"SUM(E16,E23,E30,E37,F45)","v":0},{"$f":"I16+I23+I30+I37+J45","v":0},{"$f":"J16+J23+J30+J37+I45","v":0},{"$f":"D6-E6","v":0},null,null,{"$f":"A6","v":"BL"},null,{"$f":"IF(ISBLANK(B16),0,IFERROR(INDEX($B$15:$B$46,MATCH($I6&K$5,$K$15:$K$46,0))-INDEX($D$15:$D$46,MATCH($I6&K$5,$K$15:$K$46,0)),0-INDEX($J$6:$O$11,MATCH(K$5,$I$6:$I$11,0),MATCH($I6,$J$5:$O$5,0))))","v":0},{"$f":"IF(ISBLANK(B23),0,IFERROR(INDEX($B$15:$B$46,MATCH($I6&L$5,$K$15:$K$46,0))-INDEX($D$15:$D$46,MATCH($I6&L$5,$K$15:$K$46,0)),0-INDEX($J$6:$O$11,MATCH(L$5,$I$6:$I$11,0),MATCH($I6,$J$5:$O$5,0))))","v":0},{"$f":"IF(ISBLANK(B37),0,IFERROR(INDEX($B$15:$B$46,MATCH($I6&M$5,$K$15:$K$46,0))-INDEX($D$15:$D$46,MATCH($I6&M$5,$K$15:$K$46,0)),0-INDEX($J$6:$O$11,MATCH(M$5,$I$6:$I$11,0),MATCH($I6,$J$5:$O$5,0))))","v":0},{"$f":"IF(ISBLANK(B45),0,IFERROR(INDEX($B$15:$B$46,MATCH($I6&N$5,$K$15:$K$46,0))-INDEX($D$15:$D$46,MATCH($I6&N$5,$K$15:$K$46,0)),0-INDEX($J$6:$O$11,MATCH(N$5,$I$6:$I$11,0),MATCH($I6,$J$5:$O$5,0))))","v":0},{"$f":"IF(ISBLANK(B30),0,IFERROR(INDEX($B$15:$B$46,MATCH($I6&O$5,$K$15:$K$46,0))-INDEX($D$15:$D$46,MATCH($I6&O$5,$K$15:$K$46,0)),0-INDEX($J$6:$O$11,MATCH(O$5,$I$6:$I$11,0),MATCH($I6,$J$5:$O$5,0))))","v":0}]
["BM","7B",{"$f":"SUM(F16,E24,F32,E38,E46)","v":0},{"$f":"J16+I24+J32+I38+I46","v":0},{"$f":"I16+J24+I32+J38+J46","v":0},0,null,null,"BM",{"$f":"IF(ISBLANK(B16),0,IFERROR(INDEX($B$15:$B$46,MATCH($I7&J$5,$K$15:$K$46,0))-INDEX($D$15:$D$46,MATCH($I7&J$5,$K$15:$K$46,0)),0-INDEX($J$6:$O$11,MATCH(J$5,$I$6:$I$11,0),MATCH($I7,$J$5:$O$5,0))))","v":0},null,{"$f":"IF(ISBLANK(B32),0,IFERROR(INDEX($B$15:$B$46,MATCH($I7&L$5,$K$15:$K$46,0))-INDEX($D$15:$D$46,MATCH($I7&L$5,$K$15:$K$46,0)),0-INDEX($J$6:$O$11,MATCH(L$5,$I$6:$I$11,0),MATCH($I7,$J$5:$O$5,0))))","v":0},{"$f":"IF(ISBLANK(B46),0,IFERROR(INDEX($B$15:$B$46,MATCH($I7&M$5,$K$15:$K$46,0))-INDEX($D$15:$D$46,MATCH($I7&M$5,$K$15:$K$46,0)),0-INDEX($J$6:$O$11,MATCH(M$5,$I$6:$I$11,0),MATCH($I7,$J$5:$O$5,0))))","v":0},{"$f":"IF(ISBLANK(B24),0,IFERROR(INDEX($B$15:$B$46,MATCH($I7&N$5,$K$15:$K$46,0))-INDEX($D$15:$D$46,MATCH($I7&N$5,$K$15:$K$46,0)),0-INDEX($J$6:$O$11,MATCH(N$5,$I$6:$I$11,0),MATCH($I7,$J$5:$O$5,0))))","v":0},{"$f":"IF(ISBLANK(B38),0,IFERROR(INDEX($B$15:$B$46,MATCH($I7&O$5,$K$15:$K$46,0))-INDEX($D$15:$D$46,MATCH($I7&O$5,$K$15:$K$46,0)),0-INDEX($J$6:$O$11,MATCH(O$5,$I$6:$I$11,0),MATCH($I7,$J$5:$O$5,0))))","v":0}]
["BN","7C",{"$f":"SUM(E17,F23,E32,E39,E44)","v":0},{"$f":"I17+J23+I32+I39+I44","v":0},{"$f":"J17+I23+J32+J39+J44","v":0},0,null,null,"BN",{"$f":"IF(ISBLANK(B23),0,IFERROR(INDEX($B$15:$B$46,MATCH($I8&J$5,$K$15:$K$46,0))-INDEX($D$15:$D$46,MATCH($I8&J$5,$K$15:$K$46,0)),0-INDEX($J$6:$O$11,MATCH(J$5,$I$6:$I$11,0),MATCH($I8,$J$5:$O$5,0))))","v":0},{"$f":"IF(ISBLANK(B32),0,IFERROR(INDEX($B$15:$B$46,MATCH($I8&K$5,$K$15:$K$46,0))-INDEX($D$15:$D$46,MATCH($I8&K$5,$K$15:$K$46,0)),0-INDEX($J$6:$O$11,MATCH(K$5,$I$6:$I$11,0),MATCH($I8,$J$5:$O$5,0))))","v":0},null,{"$f":"IF(ISBLANK(B17),0,IFERROR(INDEX($B$15:$B$46,MATCH($I8&M$5,$K$15:$K$46,0))-INDEX($D$15:$D$46,MATCH($I8&M$5,$K$15:$K$46,0)),0-INDEX($J$6:$O$11,MATCH(M$5,$I$6:$I$11,0),MATCH($I8,$J$5:$O$5,0))))","v":0},{"$f":"IF(ISBLANK(B39),0,IFERROR(INDEX($B$15:$B$46,MATCH($I8&N$5,$K$15:$K$46,0))-INDEX($D$15:$D$46,MATCH($I8&N$5,$K$15:$K$46,0)),0-INDEX($J$6:$O$11,MATCH(N$5,$I$6:$I$11,0),MATCH($I8,$J$5:$O$5,0))))","v":0},{"$f":"IF(ISBLANK(B44),0,IFERROR(INDEX($B$15:$B$46,MATCH($I8&O$5,$K$15:$K$46,0))-INDEX($D$15:$D$46,MATCH($I8&O$5,$K$15:$K$46,0)),0-INDEX($J$6:$O$11,MATCH(O$5,$I$6:$I$11,0),MATCH($I8,$J$5:$O$5,0))))","v":0}]
["BO","7D",{"$f":"SUM(F17,E25,F31,F37,F46)","v":0},{"$f":"J17+I25+J31+J37+J46","v":0},{"$f":"I17+J25+I31+I37+I46","v":0},0,null,null,"BO",{"$f":"IF(ISBLANK(B37),0,IFERROR(INDEX($B$15:$B$46,MATCH($I9&J$5,$K$15:$K$46,0))-INDEX($D$15:$D$46,MATCH($I9&J$5,$K$15:$K$46,0)),0-INDEX($J$6:$O$11,MATCH(J$5,$I$6:$I$11,0),MATCH($I9,$J$5:$O$5,0))))","v":0},{"$f":"IF(ISBLANK(B46),0,IFERROR(INDEX($B$15:$B$46,MATCH($I9&K$5,$K$15:$K$46,0))-INDEX($D$15:$D$46,MATCH($I9&K$5,$K$15:$K$46,0)),0-INDEX($J$6:$O$11,MATCH(K$5,$I$6:$I$11,0),MATCH($I9,$J$5:$O$5,0))))","v":0},{"$f":"IF(ISBLANK(B17),0,IFERROR(INDEX($B$15:$B$46,MATCH($I9&L$5,$K$15:$K$46,0))-INDEX($D$15:$D$46,MATCH($I9&L$5,$K$15:$K$46,0)),0-INDEX($J$6:$O$11,MATCH(L$5,$I$6:$I$11,0),MATCH($I9,$J$5:$O$5,0))))","v":0},null,{"$f":"IF(ISBLANK(B31),0,IFERROR(INDEX($B$15:$B$46,MATCH($I9&N$5,$K$15:$K$46,0))-INDEX($D$15:$D$46,MATCH($I9&N$5,$K$15:$K$46,0)),0-INDEX($J$6:$O$11,MATCH(N$5,$I$6:$I$11,0),MATCH($I9,$J$5:$O$5,0))))","v":0},{"$f":"IF(ISBLANK(B25),0,IFERROR(INDEX($B$15:$B$46,MATCH($I9&O$5,$K$15:$K$46,0))-INDEX($D$15:$D$46,MATCH($I9&O$5,$K$15:$K$46,0)),0-INDEX($J$6:$O$11,MATCH(O$5,$I$6:$I$11,0),MATCH($I9,$J$5:$O$5,0))))","v":0}]
["BP","7E",{"$f":"SUM(E18,F24,E31,F39,E45)","v":0},{"$f":"I18+J24+I31+J39+I45","v":0},{"$f":"J18+I24+J31+I39+J45","v":0},0,null,null,"BP",{"$f":"IF(ISBLANK(B45),0,IFERROR(INDEX($B$15:$B$46,MATCH($I10&J$5,$K$15:$K$46,0))-INDEX($D$15:$D$46,MATCH($I10&J$5,$K$15:$K$46,0)),0-INDEX($J$6:$O$11,MATCH(J$5,$I$6:$I$11,0),MATCH($I10,$J$5:$O$5,0))))","v":0},{"$f":"IF(ISBLANK(B24),0,IFERROR(INDEX($B$15:$B$46,MATCH($I10&K$5,$K$15:$K$46,0))-INDEX($D$15:$D$46,MATCH($I10&K$5,$K$15:$K$46,0)),0-INDEX($J$6:$O$11,MATCH(K$5,$I$6:$I$11,0),MATCH($I10,$J$5:$O$5,0))))","v":0},{"$f":"IF(ISBLANK(B39),0,IFERROR(INDEX($B$15:$B$46,MATCH($I10&L$5,$K$15:$K$46,0))-INDEX($D$15:$D$46,MATCH($I10&L$5,$K$15:$K$46,0)),0-INDEX($J$6:$O$11,MATCH(L$5,$I$6:$I$11,0),MATCH($I10,$J$5:$O$5,0))))","v":0},{"$f":"IF(ISBLANK(B31),0,IFERROR(INDEX($B$15:$B$46,MATCH($I10&M$5,$K$15:$K$46,0))-INDEX($D$15:$D$46,MATCH($I10&M$5,$K$15:$K$46,0)),0-INDEX($J$6:$O$11,MATCH(M$5,$I$6:$I$11,0),MATCH($I10,$J$5:$O$5,0))))","v":0},null,{"$f":"IF(ISBLANK(B18),0,IFERROR(INDEX($B$15:$B$46,MATCH($I10&O$5,$K$15:$K$46,0))-INDEX($D$15:$D$46,MATCH($I10&O$5,$K$15:$K$46,0)),0-INDEX($J$6:$O$11,MATCH(O$5,$I$6:$I$11,0),MATCH($I10,$J$5:$O$5,0))))","v":0}]
["BQ","7F",{"$f":"SUM(F18,F25,F30,F38,F44)","v":0},{"$f":"J18+J25+J30+J38+J44","v":0},{"$f":"I18+I25+I30+I38+I44","v":0},0,null,null,"BQ",{"$f":"IF(ISBLANK(B30),0,IFERROR(INDEX($B$15:$B$46,MATCH($I11&J$5,$K$15:$K$46,0))-INDEX($D$15:$D$46,MATCH($I11&J$5,$K$15:$K$46,0)),0-INDEX($J$6:$O$11,MATCH(J$5,$I$6:$I$11,0),MATCH($I11,$J$5:$O$5,0))))","v":0},{"$f":"IF(ISBLANK(B38),0,IFERROR(INDEX($B$15:$B$46,MATCH($I11&K$5,$K$15:$K$46,0))-INDEX($D$15:$D$46,MATCH($I11&K$5,$K$15:$K$46,0)),0-INDEX($J$6:$O$11,MATCH(K$5,$I$6:$I$11,0),MATCH($I11,$J$5:$O$5,0))))","v":0},{"$f":"IF(ISBLANK(B44),0,IFERROR(INDEX($B$15:$B$46,MATCH($I11&L$5,$K$15:$K$46,0))-INDEX($D$15:$D$46,MATCH($I11&L$5,$K$15:$K$46,0)),0-INDEX($J$6:$O$11,MATCH(L$5,$I$6:$I$11,0),MATCH($I11,$J$5:$O$5,0))))","v":0},{"$f":"IF(ISBLANK(B25),0,IFERROR(INDEX($B$15:$B$46,MATCH($I11&M$5,$K$15:$K$46,0))-INDEX($D$15:$D$46,MATCH($I11&M$5,$K$15:$K$46,0)),0-INDEX($J$6:$O$11,MATCH(M$5,$I$6:$I$11,0),MATCH($I11,$J$5:$O$5,0))))","v":0},{"$f":"IF(ISBLANK(B18),0,IFERROR(INDEX($B$15:$B$46,MATCH($I11&N$5,$K$15:$K$46,0))-INDEX($D$15:$D$46,MATCH($I11&N$5,$K$15:$K$46,0)),0-INDEX($J$6:$O$11,MATCH(N$5,$I$6:$I$11,0),MATCH($I11,$J$5:$O$5,0))))","v":0}]
[null,null,null,null,null,null,null,null,"Les concaténations en rouge permettent de remplir par formules le récapitulatif au dessus"]
["1er MATCH le 15 mai","à",{"$f":"A6","v":"BL"},null,null,null,null,null,"Ce récap servira à départager les ex aequos"]
[null,null,null,null,null,null,"SI forfait éq recevante"]
["Equipes","score","Equipes","score"]
[{"$f":"$A$6","v":"BL"},null,{"$f":"$A$7","v":"BM"},{"$f":"IF(G16=19,19,IF(ISBLANK(B16),\"\",IF(B16=19,0,36-B16)))","v":""},{"$f":"IF(G16=19,0,IF(ISBLANK(B16),\"\",IF(B16<18,1,IF(B16=18,2,IF(B16>18,3)))))","v":""},{"$f":"IF(G16=19,3,IF(ISBLANK(B16),\"\",IF(B16=19,0,IF(D16<18,1,IF(D16=18,2,IF(D16>=20,3))))))","v":""},null,null,{"$f":"IF(ISBLANK(B16),0,B16)","v":0},{"$f":"IF(ISBLANK(B16),0,D16)","v":0},{"$f":"A16&C16","v":"BLBM"}]
[{"$f":"$A$8","v":"BN"},null,{"$f":"$A$9","v":"BO"},{"$f":"IF(G17=19,19,IF(ISBLANK(B17),\"\",IF(B17=19,0,36-B17)))","v":""},{"$f":"IF(G17=19,0,IF(ISBLANK(B17),\"\",IF(B17<18,1,IF(B17=18,2,IF(B17>18,3)))))","v":""},{"$f":"IF(G17=19,3,IF(ISBLANK(B17),\"\",IF(B17=19,0,IF(D17<18,1,IF(D17=18,2,IF(D17>=20,3))))))","v":""},null,null,{"$f":"IF(ISBLANK(B17),0,B17)","v":0},{"$f":"IF(ISBLANK(B17),0,D17)","v":0},{"$f":"A17&C17","v":"BNBO"}]
[{"$f":"$A$10","v":"BP"},null,{"$f":"$A$11","v":"BQ"},{"$f":"IF(G18=19,19,IF(ISBLANK(B18),\"\",IF(B18=19,0,36-B18)))","v":""},{"$f":"IF(G18=19,0,IF(ISBLANK(B18),\"\",IF(B18<18,1,IF(B18=18,2,IF(B18>18,3)))))","v":""},{"$f":"IF(G18=19,3,IF(ISBLANK(B18),\"\",IF(B18=19,0,IF(D18<18,1,IF(D18=18,2,IF(D18>=20,3))))))","v":""},null,null,{"$f":"IF(ISBLANK(B18),0,B18)","v":0},{"$f":"IF(ISBLANK(B18),0,D18)","v":0},{"$f":"A18&C18","v":"BPBQ"}]
[]
["2 éme MATCH le 22 mai","à",{"$f":"A7","v":"BM"}]
[null,null,null,null,null,null,"SI forfait éq recevante"]
["Equipes","score","Equipes","score"]
[{"$f":"$A$6","v":"BL"},null,{"$f":"$A$8","v":"BN"},{"$f":"IF(G23=19,19,IF(ISBLANK(B23),\"\",IF(B23=19,0,36-B23)))","v":""},{"$f":"IF(G23=19,0,IF(ISBLANK(B23),\"\",IF(B23<18,1,IF(B23=18,2,IF(B23>18,3)))))","v":""},{"$f":"IF(G23=19,3,IF(ISBLANK(B23),\"\",IF(B23=19,0,IF(D23<18,1,IF(D23=18,2,IF(D23>=20,3))))))","v":""},null,null,{"$f":"IF(ISBLANK(B23),0,B23)","v":0},{"$f":"IF(ISBLANK(B23),0,D23)","v":0},{"$f":"A23&C23","v":"BLBN"}]
[{"$f":"$A$7","v":"BM"},null,{"$f":"$A$10","v":"BP"},{"$f":"IF(G24=19,19,IF(ISBLANK(B24),\"\",IF(B24=19,0,36-B24)))","v":""},{"$f":"IF(G24=19,0,IF(ISBLANK(B24),\"\",IF(B24<18,1,IF(B24=18,2,IF(B24>18,3)))))","v":""},{"$f":"IF(G24=19,3,IF(ISBLANK(B24),\"\",IF(B24=19,0,IF(D24<18,1,IF(D24=18,2,IF(D24>=20,3))))))","v":""},null,null,{"$f":"IF(ISBLANK(B24),0,B24)","v":0},{"$f":"IF(ISBLANK(B24),0,D24)","v":0},{"$f":"A24&C24","v":"BMBP"}]
[{"$f":"$A$9","v":"BO"},null,{"$f":"$A$11","v":"BQ"},{"$f":"IF(G25=19,19,IF(ISBLANK(B25),\"\",IF(B25=19,0,36-B25)))","v":""},{"$f":"IF(G25=19,0,IF(ISBLANK(B25),\"\",IF(B25<18,1,IF(B25=18,2,IF(B25>18,3)))))","v":""},{"$f":"IF(G25=19,3,IF(ISBLANK(B25),\"\",IF(B25=19,0,IF(D25<18,1,IF(D25=18,2,IF(D25>=20,3))))))","v":""},null,null,{"$f":"IF(ISBLANK(B25),0,B25)","v":0},{"$f":"IF(ISBLANK(B25),0,D25)","v":0},{"$f":"A25&C25","v":"BOBQ"}]
[]
["3 éme MATCH le 29 mai","à",{"$f":"A8","v":"BN"}]
[null,null,null,null,null,null,"SI forfait éq recevante"]
["Equipes","score","Equipes","score"]
[{"$f":"$A$6","v":"BL"},null,{"$f":"$A$11","v":"BQ"},{"$f":"IF(G30=19,19,IF(ISBLANK(B30),\"\",IF(B30=19,0,36-B30)))","v":""},{"$f":"IF(G30=19,0,IF(ISBLANK(B30),\"\",IF(B30<18,1,IF(B30=18,2,IF(B30>18,3)))))","v":""},{"$f":"IF(G30=19,3,IF(ISBLANK(B30),\"\",IF(B30=19,0,IF(D30<18,1,IF(D30=18,2,IF(D30>=20,3))))))","v":""},null,null,{"$f":"IF(ISBLANK(B30),0,B30)","v":0},{"$f":"IF(ISBLANK(B30),0,D30)","v":0},{"$f":"A30&C30","v":"BLBQ"}]
[{"$f":"$A$10","v":"BP"},null,{"$f":"$A$9","v":"BO"},{"$f":"IF(G31=19,19,IF(ISBLANK(B31),\"\",IF(B31=19,0,36-B31)))","v":""},{"$f":"IF(G31=19,0,IF(ISBLANK(B31),\"\",IF(B31<18,1,IF(B31=18,2,IF(B31>18,3)))))","v":""},{"$f":"IF(G31=19,3,IF(ISBLANK(B31),\"\",IF(B31=19,0,IF(D31<18,1,IF(D31=18,2,IF(D31>=20,3))))))","v":""},null,null,{"$f":"IF(ISBLANK(B31),0,B31)","v":0},{"$f":"IF(ISBLANK(B31),0,D31)","v":0},{"$f":"A31&C31","v":"BPBO"}]
[{"$f":"$A$8","v":"BN"},null,{"$f":"$A$7","v":"BM"},{"$f":"IF(G32=19,19,IF(ISBLANK(B32),\"\",IF(B32=19,0,36-B32)))","v":""},{"$f":"IF(G32=19,0,IF(ISBLANK(B32),\"\",IF(B32<18,1,IF(B32=18,2,IF(B32>18,3)))))","v":""},{"$f":"IF(G32=19,3,IF(ISBLANK(B32),\"\",IF(B32=19,0,IF(D32<18,1,IF(D32=18,2,IF(D32>=20,3))))))","v":""},null,null,{"$f":"IF(ISBLANK(B32),0,B32)","v":0},{"$f":"IF(ISBLANK(B32),0,D32)","v":0},{"$f":"A32&C32","v":"BNBM"}]
[]
["4 éme MATCH le 5 juin","à",{"$f":"A9","v":"BO"}]
[null,null,null,null,null,null,"SI forfait éq recevante"]
["Equipes","score","Equipes","score"]
[{"$f":"A6","v":"BL"},null,{"$f":"$A$9","v":"BO"},{"$f":"IF(G37=19,19,IF(ISBLANK(B37),\"\",IF(B37=19,0,36-B37)))","v":""},{"$f":"IF(G37=19,0,IF(ISBLANK(B37),\"\",IF(B37<18,1,IF(B37=18,2,IF(B37>18,3)))))","v":""},{"$f":"IF(G37=19,3,IF(ISBLANK(B37),\"\",IF(B37=19,0,IF(D37<18,1,IF(D37=18,2,IF(D37>=20,3))))))","v":""},null,null,{"$f":"IF(ISBLANK(B37),0,B37)","v":0},{"$f":"IF(ISBLANK(B37),0,D37)","v":0},{"$f":"A37&C37","v":"BLBO"}]
[{"$f":"$A$7","v":"BM"},null,{"$f":"$A$11","v":"BQ"},{"$f":"IF(G38=19,19,IF(ISBLANK(B38),\"\",IF(B38=19,0,36-B38)))","v":""},{"$f":"IF(G38=19,0,IF(ISBLANK(B38),\"\",IF(B38<18,1,IF(B38=18,2,IF(B38>18,3)))))","v":""},{"$f":"IF(G38=19,3,IF(ISBLANK(B38),\"\",IF(B38=19,0,IF(D38<18,1,IF(D38=18,2,IF(D38>=20,3))))))","v":""},null,null,{"$f":"IF(ISBLANK(B38),0,B38)","v":0},{"$f":"IF(ISBLANK(B38),0,D38)","v":0},{"$f":"A38&C38","v":"BMBQ"}]
[{"$f":"A8","v":"BN"},null,{"$f":"$A$10","v":"BP"},{"$f":"IF(G39=19,19,IF(ISBLANK(B39),\"\",IF(B39=19,0,36-B39)))","v":""},{"$f":"IF(G39=19,0,IF(ISBLANK(B39),\"\",IF(B39<18,1,IF(B39=18,2,IF(B39>18,3)))))","v":""},{"$f":"IF(G39=19,3,IF(ISBLANK(B39),\"\",IF(B39=19,0,IF(D39<18,1,IF(D39=18,2,IF(D39>=20,3))))))","v":""},null,null,{"$f":"IF(ISBLANK(B39),0,B39)","v":0},{"$f":"IF(ISBLANK(B39),0,D39)","v":0},{"$f":"A39&C39","v":"BNBP"}]
[]
["5 éme MATCH le 12 juin","à",{"$f":"A10","v":"BP"}]
[null,null,null,null,null,null,"SI forfait éq recevante"]
["Equipes","score","Equipes","score"]
[{"$f":"A8","v":"BN"},null,{"$f":"$A$11","v":"BQ"},{"$f":"IF(G44=19,19,IF(ISBLANK(B44),\"\",IF(B44=19,0,36-B44)))","v":""},{"$f":"IF(G44=19,0,IF(ISBLANK(B44),\"\",IF(B44<18,1,IF(B44=18,2,IF(B44>18,3)))))","v":""},{"$f":"IF(G44=19,3,IF(ISBLANK(B44),\"\",IF(B44=19,0,IF(D44<18,1,IF(D44=18,2,IF(D44>=20,3))))))","v":""},null,null,{"$f":"IF(ISBLANK(B44),0,B44)","v":0},{"$f":"IF(ISBLANK(B44),0,D44)","v":0},{"$f":"A44&C44","v":"BNBQ"}]
[{"$f":"$A$10","v":"BP"},null,{"$f":"A6","v":"BL"},{"$f":"IF(G45=19,19,IF(ISBLANK(B45),\"\",IF(B45=19,0,36-B45)))","v":""},{"$f":"IF(G45=19,0,IF(ISBLANK(B45),\"\",IF(B45<18,1,IF(B45=18,2,IF(B45>18,3)))))","v":""},{"$f":"IF(G45=19,3,IF(ISBLANK(B45),\"\",IF(B45=19,0,IF(D45<18,1,IF(D45=18,2,IF(D45>=20,3))))))","v":""},null,null,{"$f":"IF(ISBLANK(B45),0,B45)","v":0},{"$f":"IF(ISBLANK(B45),0,D45)","v":0},{"$f":"A45&C45","v":"BPBL"}]
[{"$f":"A7","v":"BM"},null,{"$f":"$A$9","v":"BO"},{"$f":"IF(G46=19,19,IF(ISBLANK(B46),\"\",IF(B46=19,0,36-B46)))","v":""},{"$f":"IF(G46=19,0,IF(ISBLANK(B46),\"\",IF(B46<18,1,IF(B46=18,2,IF(B46>18,3)))))","v":""},{"$f":"IF(G46=19,3,IF(ISBLANK(B46),\"\",IF(B46=19,0,IF(D46<18,1,IF(D46=18,2,IF(D46>=20,3))))))","v":""},null,null,{"$f":"IF(ISBLANK(B46),0,B46)","v":0},{"$f":"IF(ISBLANK(B46),0,D46)","v":0},{"$f":"A46&C46","v":"BMBO"}]
[]
["CLASSEMENT"]
["EQUIPES",null,"POINTS","Pour","Contre","Diff","CLASST"]
["BL","7A",0,0,0,0,{"$f":"B59","v":1},{"$f":"IF(AND(G50=1,COUNTIF(rang1,1)>1),COUNTIF(G$50:G50,1),IF(AND(G50=2,COUNTIF(rang1,2)>1),COUNTIF(G$50:G50,2)+3,\"\"))","v":1}]
["BM","7B",0,0,0,0,1,{"$f":"IF(AND(G51=1,COUNTIF(rang1,1)>1),COUNTIF(G$50:G51,1),IF(AND(G51=2,COUNTIF(rang1,2)>1),COUNTIF(G$50:G51,2)+3,\"\"))","v":2}]
["BN","7C",0,0,0,0,1,{"$f":"IF(AND(G52=1,COUNTIF(rang1,1)>1),COUNTIF(G$50:G52,1),IF(AND(G52=2,COUNTIF(rang1,2)>1),COUNTIF(G$50:G52,2)+3,\"\"))","v":3}]
["BO","7D",0,0,0,0,1,{"$f":"IF(AND(G53=1,COUNTIF(rang1,1)>1),COUNTIF(G$50:G53,1),IF(AND(G53=2,COUNTIF(rang1,2)>1),COUNTIF(G$50:G53,2)+3,\"\"))","v":4}]
["BP","7E",0,0,0,0,1,{"$f":"IF(AND(G54=1,COUNTIF(rang1,1)>1),COUNTIF(G$50:G54,1),IF(AND(G54=2,COUNTIF(rang1,2)>1),COUNTIF(G$50:G54,2)+3,\"\"))","v":5}]
["BQ","7F",0,0,0,0,1,{"$f":"IF(AND(G55=1,COUNTIF(rang1,1)>1),COUNTIF(G$50:G55,1),IF(AND(G55=2,COUNTIF(rang1,2)>1),COUNTIF(G$50:G55,2)+3,\"\"))","v":6}]
[]
[null,"CLASSEMENT FINAL et DEPARTAGE EX AEQUOS",null,null,null,null,null,null,null,null,null,null,"CLASSEMENT"]
[null,"Rang","Equipes","Pts","diff pts avec exaequo","cumul","departage goalaverage si même cumul","RP",null,null,null,"RP","Rang","Equipe","Pts"]
[null,{"$f":"RANK(G59,$G$59:$G$64)","v":1},{"$f":"INDEX($A$50:$A$55,MATCH(H59,$L$59:$L$64,0))","v":"BL"},{"$f":"VLOOKUP(C59,$A$50:$C$55,3,0)","v":0},{"$f":"IF(D59=D60,INDEX($J$6:$O$11,MATCH(C59,$I$6:$I$11,0),MATCH(C60,$J$5:$O$5,0)),IF(D59=D58,INDEX($J$6:$O$11,MATCH(C59,$I$6:$I$11,0),MATCH(C58,$J$5:$O$5,0)),0))","v":0},{"$f":"D59+E59/100","v":0},{"$f":"IF(AND(F59<>F58,F59<>F60),F59,F59+VLOOKUP(C59,$A$50:$F$55,6,0)/100)","v":0},1,null,null,null,{"$f":"RANK(C50,$C$50:$C$55)+COUNTIF($C$50:C50,C50)-1","v":1},{"$f":"B59","v":1},"BL",{"$f":"VLOOKUP(N59,$C$59:$D$64,2,0)","v":0}]
[null,1,"BM",0,{"$f":"IF(D60=D61,INDEX($J$6:$O$11,MATCH(C60,$I$6:$I$11,0),MATCH(C61,$J$5:$O$5,0)),IF(D60=D59,INDEX($J$6:$O$11,MATCH(C60,$I$6:$I$11,0),MATCH(C59,$J$5:$O$5,0)),0))","v":0},0,{"$f":"IF(AND(F60<>F59,F60<>F61),F60,F60+VLOOKUP(C60,$A$50:$F$55,6,0)/100)","v":0},2,null,null,null,{"$f":"RANK(C51,$C$50:$C$55)+COUNTIF($C$50:C51,C51)-1","v":2},1,"BM",0]
[null,1,"BN",0,{"$f":"IF(D61=D62,INDEX($J$6:$O$11,MATCH(C61,$I$6:$I$11,0),MATCH(C62,$J$5:$O$5,0)),IF(D61=D60,INDEX($J$6:$O$11,MATCH(C61,$I$6:$I$11,0),MATCH(C60,$J$5:$O$5,0)),0))","v":0},0,{"$f":"IF(AND(F61<>F60,F61<>F62),F61,F61+VLOOKUP(C61,$A$50:$F$55,6,0)/100)","v":0},3,null,null,null,{"$f":"RANK(C52,$C$50:$C$55)+COUNTIF($C$50:C52,C52)-1","v":3},1,"BN",0]
[null,1,"BO",0,{"$f":"IF(D62=D63,INDEX($J$6:$O$11,MATCH(C62,$I$6:$I$11,0),MATCH(C63,$J$5:$O$5,0)),IF(D62=D61,INDEX($J$6:$O$11,MATCH(C62,$I$6:$I$11,0),MATCH(C61,$J$5:$O$5,0)),0))","v":0},0,{"$f":"IF(AND(F62<>F61,F62<>F63),F62,F62+VLOOKUP(C62,$A$50:$F$55,6,0)/100)","v":0},4,null,null,null,{"$f":"RANK(C53,$C$50:$C$55)+COUNTIF($C$50:C53,C53)-1","v":4},1,"BO",0]
[null,1,"BP",0,{"$f":"IF(D63=D64,INDEX($J$6:$O$11,MATCH(C63,$I$6:$I$11,0),MATCH(C64,$J$5:$O$5,0)),IF(D63=D62,INDEX($J$6:$O$11,MATCH(C63,$I$6:$I$11,0),MATCH(C62,$J$5:$O$5,0)),0))","v":0},0,{"$f":"IF(AND(F63<>F62,F63<>F64),F63,F63+VLOOKUP(C63,$A$50:$F$55,6,0)/100)","v":0},5,null,null,null,{"$f":"RANK(C54,$C$50:$C$55)+COUNTIF($C$50:C54,C54)-1","v":5},1,"BP",0]
[null,1,"BQ",0,{"$f":"IF(D64=D59,INDEX($J$6:$O$11,MATCH(C64,$I$6:$I$11,0),MATCH(C59,$J$5:$O$5,0)),IF(D64=D63,INDEX($J$6:$O$11,MATCH(C64,$I$6:$I$11,0),MATCH(C63,$J$5:$O$5,0)),0))","v":0},0,{"$f":"IF(AND(F64<>F63,F64<>F59),F64,F64+VLOOKUP(C64,$A$50:$F$55,6,0)/100)","v":0},6,null,null,null,{"$f":"RANK(C55,$C$50:$C$55)+COUNTIF($C$50:C55,C55)-1","v":6},1,"BQ",0]

{"sheet":"P8","index":7,"n_rows":64,"n_cols":15,"rows_kept":64,"cut":false,"hidden":false,"merged":[[0,0,0,5],[1,0,1,5],[2,0,2,5],[3,0,3,5],[13,6,14,6],[56,1,56,6],[56,12,56,14],[20,6,21,6],[27,6,28,6],[34,6,35,6],[41,6,42,6],[47,0,47,5]]}
[]
["CHAMPIONNAT DES CLUBS"]
[]
["POULE 8",null,null,null,null,null,null,null,"Récapitulatif  différence match entre 2 équipes"]
["EQUIPES",null,"POINTS","Pour","Contre","Diff",null,null,null,{"$f":"A6","v":"BR"},{"$f":"A7","v":"BS"},{"$f":"A8","v":"BT"},{"$f":"A9","v":"BU"},{"$f":"A10","v":"BV"},{"$f":"A11","v":"BW"}]
["BR","8A",{"$f":"SUM(E16,E23,E30,E37,F45)","v":0},{"$f":"I16+I23+I30+I37+J45","v":0},{"$f":"J16+J23+J30+J37+I45","v":0},{"$f":"D6-E6","v":0},null,null,{"$f":"A6","v":"BR"},null,{"$f":"IF(ISBLANK(B16),0,IFERROR(INDEX($B$15:$B$46,MATCH($I6&K$5,$K$15:$K$46,0))-INDEX($D$15:$D$46,MATCH($I6&K$5,$K$15:$K$46,0)),0-INDEX($J$6:$O$11,MATCH(K$5,$I$6:$I$11,0),MATCH($I6,$J$5:$O$5,0))))","v":0},{"$f":"IF(ISBLANK(B23),0,IFERROR(INDEX($B$15:$B$46,MATCH($I6&L$5,$K$15:$K$46,0))-INDEX($D$15:$D$46,MATCH($I6&L$5,$K$15:$K$46,0)),0-INDEX($J$6:$O$11,MATCH(L$5,$I$6:$I$11,0),MATCH($I6,$J$5:$O$5,0))))","v":0},{"$f":"IF(ISBLANK(B37),0,IFERROR(INDEX($B$15:$B$46,MATCH($I6&M$5,$K$15:$K$46,0))-INDEX($D$15:$D$46,MATCH($I6&M$5,$K$15:$K$46,0)),0-INDEX($J$6:$O$11,MATCH(M$5,$I$6:$I$11,0),MATCH($I6,$J$5:$O$5,0))))","v":0},{"$f":"IF(ISBLANK(B45),0,IFERROR(INDEX($B$15:$B$46,MATCH($I6&N$5,$K$15:$K$46,0))-INDEX($D$15:$D$46,MATCH($I6&N$5,$K$15:$K$46,0)),0-INDEX($J$6:$O$11,MATCH(N$5,$I$6:$I$11,0),MATCH($I6,$J$5:$O$5,0))))","v":0},{"$f":"IF(ISBLANK(B30),0,IFERROR(INDEX($B$15:$B$46,MATCH($I6&O$5,$K$15:$K$46,0))-INDEX($D$15:$D$46,MATCH($I6&O$5,$K$15:$K$46,0)),0-INDEX($J$6:$O$11,MATCH(O$5,$I$6:$I$11,0),MATCH($I6,$J$5:$O$5,0))))","v":0}]
["BS","8B",{"$f":"SUM(F16,E24,F32,E38,E46)","v":0},{"$f":"J16+I24+J32+I38+I46","v":0},{"$f":"I16+J24+I32+J38+J46","v":0},0,null,null,"BS",{"$f":"IF(ISBLANK(B16),0,IFERROR(INDEX($B$15:$B$46,MATCH($I7&J$5,$K$15:$K$46,0))-INDEX($D$15:$D$46,MATCH($I7&J$5,$K$15:$K$46,0)),0-INDEX($J$6:$O$11,MATCH(J$5,$I$6:$I$11,0),MATCH($I7,$J$5:$O$5,0))))","v":0},null,{"$f":"IF(ISBLANK(B32),0,IFERROR(INDEX($B$15:$B$46,MATCH($I7&L$5,$K$15:$K$46,0))-INDEX($D$15:$D$46,MATCH($I7&L$5,$K$15:$K$46,0)),0-INDEX($J$6:$O$11,MATCH(L$5,$I$6:$I$11,0),MATCH($I7,$J$5:$O$5,0))))","v":0},{"$f":"IF(ISBLANK(B46),0,IFERROR(INDEX($B$15:$B$46,MATCH($I7&M$5,$K$15:$K$46,0))-INDEX($D$15:$D$46,MATCH($I7&M$5,$K$15:$K$46,0)),0-INDEX($J$6:$O$11,MATCH(M$5,$I$6:$I$11,0),MATCH($I7,$J$5:$O$5,0))))","v":0},{"$f":"IF(ISBLANK(B24),0,IFERROR(INDEX($B$15:$B$46,MATCH($I7&N$5,$K$15:$K$46,0))-INDEX($D$15:$D$46,MATCH($I7&N$5,$K$15:$K$46,0)),0-INDEX($J$6:$O$11,MATCH(N$5,$I$6:$I$11,0),MATCH($I7,$J$5:$O$5,0))))","v":0},{"$f":"IF(ISBLANK(B38),0,IFERROR(INDEX($B$15:$B$46,MATCH($I7&O$5,$K$15:$K$46,0))-INDEX($D$15:$D$46,MATCH($I7&O$5,$K$15:$K$46,0)),0-INDEX($J$6:$O$11,MATCH(O$5,$I$6:$I$11,0),MATCH($I7,$J$5:$O$5,0))))","v":0}]
["BT","8C",{"$f":"SUM(E17,F23,E32,E39,E44)","v":0},{"$f":"I17+J23+I32+I39+I44","v":0},{"$f":"J17+I23+J32+J39+J44","v":0},0,null,null,"BT",{"$f":"IF(ISBLANK(B23),0,IFERROR(INDEX($B$15:$B$46,MATCH($I8&J$5,$K$15:$K$46,0))-INDEX($D$15:$D$46,MATCH($I8&J$5,$K$15:$K$46,0)),0-INDEX($J$6:$O$11,MATCH(J$5,$I$6:$I$11,0),MATCH($I8,$J$5:$O$5,0))))","v":0},{"$f":"IF(ISBLANK(B32),0,IFERROR(INDEX($B$15:$B$46,MATCH($I8&K$5,$K$15:$K$46,0))-INDEX($D$15:$D$46,MATCH($I8&K$5,$K$15:$K$46,0)),0-INDEX($J$6:$O$11,MATCH(K$5,$I$6:$I$11,0),MATCH($I8,$J$5:$O$5,0))))","v":0},null,{"$f":"IF(ISBLANK(B17),0,IFERROR(INDEX($B$15:$B$46,MATCH($I8&M$5,$K$15:$K$46,0))-INDEX($D$15:$D$46,MATCH($I8&M$5,$K$15:$K$46,0)),0-INDEX($J$6:$O$11,MATCH(M$5,$I$6:$I$11,0),MATCH($I8,$J$5:$O$5,0))))","v":0},{"$f":"IF(ISBLANK(B39),0,IFERROR(INDEX($B$15:$B$46,MATCH($I8&N$5,$K$15:$K$46,0))-INDEX($D$15:$D$46,MATCH($I8&N$5,$K$15:$K$46,0)),0-INDEX($J$6:$O$11,MATCH(N$5,$I$6:$I$11,0),MATCH($I8,$J$5:$O$5,0))))","v":0},{"$f":"IF(ISBLANK(B44),0,IFERROR(INDEX($B$15:$B$46,MATCH($I8&O$5,$K$15:$K$46,0))-INDEX($D$15:$D$46,MATCH($I8&O$5,$K$15:$K$46,0)),0-INDEX($J$6:$O$11,MATCH(O$5,$I$6:$I$11,0),MATCH($I8,$J$5:$O$5,0))))","v":0}]
["BU","8D",{"$f":"SUM(F17,E25,F31,F37,F46)","v":0},{"$f":"J17+I25+J31+J37+J46","v":0},{"$f":"I17+J25+I31+I37+I46","v":0},0,null,null,"BU",{"$f":"IF(ISBLANK(B37),0,IFERROR(INDEX($B$15:$B$46,MATCH($I9&J$5,$K$15:$K$46,0))-INDEX($D$15:$D$46,MATCH($I9&J$5,$K$15:$K$46,0)),0-INDEX($J$6:$O$11,MATCH(J$5,$I$6:$I$11,0),MATCH($I9,$J$5:$O$5,0))))","v":0},{"$f":"IF(ISBLANK(B46),0,IFERROR(INDEX($B$15:$B$46,MATCH($I9&K$5,$K$15:$K$46,0))-INDEX($D$15:$D$46,MATCH($I9&K$5,$K$15:$K$46,0)),0-INDEX($J$6:$O$11,MATCH(K$5,$I$6:$I$11,0),MATCH($I9,$J$5:$O$5,0))))","v":0},{"$f":"IF(ISBLANK(B17),0,IFERROR(INDEX($B$15:$B$46,MATCH($I9&L$5,$K$15:$K$46,0))-INDEX($D$15:$D$46,MATCH($I9&L$5,$K$15:$K$46,0)),0-INDEX($J$6:$O$11,MATCH(L$5,$I$6:$I$11,0),MATCH($I9,$J$5:$O$5,0))))","v":0},null,{"$f":"IF(ISBLANK(B31),0,IFERROR(INDEX($B$15:$B$46,MATCH($I9&N$5,$K$15:$K$46,0))-INDEX($D$15:$D$46,MATCH($I9&N$5,$K$15:$K$46,0)),0-INDEX($J$6:$O$11,MATCH(N$5,$I$6:$I$11,0),MATCH($I9,$J$5:$O$5,0))))","v":0},{"$f":"IF(ISBLANK(B25),0,IFERROR(INDEX($B$15:$B$46,MATCH($I9&O$5,$K$15:$K$46,0))-INDEX($D$15:$D$46,MATCH($I9&O$5,$K$15:$K$46,0)),0-INDEX($J$6:$O$11,MATCH(O$5,$I$6:$I$11,0),MATCH($I9,$J$5:$O$5,0))))","v":0}]
["BV","8E",{"$f":"SUM(E18,F24,E31,F39,E45)","v":0},{"$f":"I18+J24+I31+J39+I45","v":0},{"$f":"J18+I24+J31+I39+J45","v":0},0,null,null,"BV",{"$f":"IF(ISBLANK(B45),0,IFERROR(INDEX($B$15:$B$46,MATCH($I10&J$5,$K$15:$K$46,0))-INDEX($D$15:$D$46,MATCH($I10&J$5,$K$15:$K$46,0)),0-INDEX($J$6:$O$11,MATCH(J$5,$I$6:$I$11,0),MATCH($I10,$J$5:$O$5,0))))","v":0},{"$f":"IF(ISBLANK(B24),0,IFERROR(INDEX($B$15:$B$46,MATCH($I10&K$5,$K$15:$K$46,0))-INDEX($D$15:$D$46,MATCH($I10&K$5,$K$15:$K$46,0)),0-INDEX($J$6:$O$11,MATCH(K$5,$I$6:$I$11,0),MATCH($I10,$J$5:$O$5,0))))","v":0},{"$f":"IF(ISBLANK(B39),0,IFERROR(INDEX($B$15:$B$46,MATCH($I10&L$5,$K$15:$K$46,0))-INDEX($D$15:$D$46,MATCH($I10&L$5,$K$15:$K$46,0)),0-INDEX($J$6:$O$11,MATCH(L$5,$I$6:$I$11,0),MATCH($I10,$J$5:$O$5,0))))","v":0},{"$f":"IF(ISBLANK(B31),0,IFERROR(INDEX($B$15:$B$46,MATCH($I10&M$5,$K$15:$K$46,0))-INDEX($D$15:$D$46,MATCH($I10&M$5,$K$15:$K$46,0)),0-INDEX($J$6:$O$11,MATCH(M$5,$I$6:$I$11,0),MATCH($I10,$J$5:$O$5,0))))","v":0},null,{"$f":"IF(ISBLANK(B18),0,IFERROR(INDEX($B$15:$B$46,MATCH($I10&O$5,$K$15:$K$46,0))-INDEX($D$15:$D$46,MATCH($I10&O$5,$K$15:$K$46,0)),0-INDEX($J$6:$O$11,MATCH(O$5,$I$6:$I$11,0),MATCH($I10,$J$5:$O$5,0))))","v":0}]
["BW","8F",{"$f":"SUM(F18,F25,F30,F38,F44)","v":0},{"$f":"J18+J25+J30+J38+J44","v":0},{"$f":"I18+I25+I30+I38+I44","v":0},0,null,null,"BW",{"$f":"IF(ISBLANK(B30),0,IFERROR(INDEX($B$15:$B$46,MATCH($I11&J$5,$K$15:$K$46,0))-INDEX($D$15:$D$46,MATCH($I11&J$5,$K$15:$K$46,0)),0-INDEX($J$6:$O$11,MATCH(J$5,$I$6:$I$11,0),MATCH($I11,$J$5:$O$5,0))))","v":0},{"$f":"IF(ISBLANK(B38),0,IFERROR(INDEX($B$15:$B$46,MATCH($I11&K$5,$K$15:$K$46,0))-INDEX($D$15:$D$46,MATCH($I11&K$5,$K$15:$K$46,0)),0-INDEX($J$6:$O$11,MATCH(K$5,$I$6:$I$11,0),MATCH($I11,$J$5:$O$5,0))))","v":0},{"$f":"IF(ISBLANK(B44),0,IFERROR(INDEX($B$15:$B$46,MATCH($I11&L$5,$K$15:$K$46,0))-INDEX($D$15:$D$46,MATCH($I11&L$5,$K$15:$K$46,0)),0-INDEX($J$6:$O$11,MATCH(L$5,$I$6:$I$11,0),MATCH($I11,$J$5:$O$5,0))))","v":0},{"$f":"IF(ISBLANK(B25),0,IFERROR(INDEX($B$15:$B$46,MATCH($I11&M$5,$K$15:$K$46,0))-INDEX($D$15:$D$46,MATCH($I11&M$5,$K$15:$K$46,0)),0-INDEX($J$6:$O$11,MATCH(M$5,$I$6:$I$11,0),MATCH($I11,$J$5:$O$5,0))))","v":0},{"$f":"IF(ISBLANK(B18),0,IFERROR(INDEX($B$15:$B$46,MATCH($I11&N$5,$K$15:$K$46,0))-INDEX($D$15:$D$46,MATCH($I11&N$5,$K$15:$K$46,0)),0-INDEX($J$6:$O$11,MATCH(N$5,$I$6:$I$11,0),MATCH($I11,$J$5:$O$5,0))))","v":0}]
[null,null,null,null,null,null,null,null,"Les concaténations en rouge permettent de remplir par formules le récapitulatif au dessus"]
["1er MATCH le 15 mai","à",{"$f":"A6","v":"BR"},null,null,null,null,null,"Ce récap servira à départager les ex aequos"]
[null,null,null,null,null,null,"SI forfait éq recevante"]
["Equipes","score","Equipes","score"]
[{"$f":"$A$6","v":"BR"},null,{"$f":"$A$7","v":"BS"},{"$f":"IF(G16=19,19,IF(ISBLANK(B16),\"\",IF(B16=19,0,36-B16)))","v":""},{"$f":"IF(G16=19,0,IF(ISBLANK(B16),\"\",IF(B16<18,1,IF(B16=18,2,IF(B16>18,3)))))","v":""},{"$f":"IF(G16=19,3,IF(ISBLANK(B16),\"\",IF(B16=19,0,IF(D16<18,1,IF(D16=18,2,IF(D16>=20,3))))))","v":""},null,null,{"$f":"IF(ISBLANK(B16),0,B16)","v":0},{"$f":"IF(ISBLANK(B16),0,D16)","v":0},{"$f":"A16&C16","v":"BRBS"}]
[{"$f":"$A$8","v":"BT"},null,{"$f":"$A$9","v":"BU"},{"$f":"IF(G17=19,19,IF(ISBLANK(B17),\"\",IF(B17=19,0,36-B17)))","v":""},{"$f":"IF(G17=19,0,IF(ISBLANK(B17),\"\",IF(B17<18,1,IF(B17=18,2,IF(B17>18,3)))))","v":""},{"$f":"IF(G17=19,3,IF(ISBLANK(B17),\"\",IF(B17=19,0,IF(D17<18,1,IF(D17=18,2,IF(D17>=20,3))))))","v":""},null,null,{"$f":"IF(ISBLANK(B17),0,B17)","v":0},{"$f":"IF(ISBLANK(B17),0,D17)","v":0},{"$f":"A17&C17","v":"BTBU"}]
[{"$f":"$A$10","v":"BV"},null,{"$f":"$A$11","v":"BW"},{"$f":"IF(G18=19,19,IF(ISBLANK(B18),\"\",IF(B18=19,0,36-B18)))","v":""},{"$f":"IF(G18=19,0,IF(ISBLANK(B18),\"\",IF(B18<18,1,IF(B18=18,2,IF(B18>18,3)))))","v":""},{"$f":"IF(G18=19,3,IF(ISBLANK(B18),\"\",IF(B18=19,0,IF(D18<18,1,IF(D18=18,2,IF(D18>=20,3))))))","v":""},null,null,{"$f":"IF(ISBLANK(B18),0,B18)","v":0},{"$f":"IF(ISBLANK(B18),0,D18)","v":0},{"$f":"A18&C18","v":"BVBW"}]
[]
["2 éme MATCH le 22 mai","à",{"$f":"A7","v":"BS"}]
[null,null,null,null,null,null,"SI forfait éq recevante"]
["Equipes","score","Equipes","score"]
[{"$f":"$A$6","v":"BR"},null,{"$f":"$A$8","v":"BT"},{"$f":"IF(G23=19,19,IF(ISBLANK(B23),\"\",IF(B23=19,0,36-B23)))","v":""},{"$f":"IF(G23=19,0,IF(ISBLANK(B23),\"\",IF(B23<18,1,IF(B23=18,2,IF(B23>18,3)))))","v":""},{"$f":"IF(G23=19,3,IF(ISBLANK(B23),\"\",IF(B23=19,0,IF(D23<18,1,IF(D23=18,2,IF(D23>=20,3))))))","v":""},null,null,{"$f":"IF(ISBLANK(B23),0,B23)","v":0},{"$f":"IF(ISBLANK(B23),0,D23)","v":0},{"$f":"A23&C23","v":"BRBT"}]
[{"$f":"$A$7","v":"BS"},null,{"$f":"$A$10","v":"BV"},{"$f":"IF(G24=19,19,IF(ISBLANK(B24),\"\",IF(B24=19,0,36-B24)))","v":""},{"$f":"IF(G24=19,0,IF(ISBLANK(B24),\"\",IF(B24<18,1,IF(B24=18,2,IF(B24>18,3)))))","v":""},{"$f":"IF(G24=19,3,IF(ISBLANK(B24),\"\",IF(B24=19,0,IF(D24<18,1,IF(D24=18,2,IF(D24>=20,3))))))","v":""},null,null,{"$f":"IF(ISBLANK(B24),0,B24)","v":0},{"$f":"IF(ISBLANK(B24),0,D24)","v":0},{"$f":"A24&C24","v":"BSBV"}]
[{"$f":"$A$9","v":"BU"},null,{"$f":"$A$11","v":"BW"},{"$f":"IF(G25=19,19,IF(ISBLANK(B25),\"\",IF(B25=19,0,36-B25)))","v":""},{"$f":"IF(G25=19,0,IF(ISBLANK(B25),\"\",IF(B25<18,1,IF(B25=18,2,IF(B25>18,3)))))","v":""},{"$f":"IF(G25=19,3,IF(ISBLANK(B25),\"\",IF(B25=19,0,IF(D25<18,1,IF(D25=18,2,IF(D25>=20,3))))))","v":""},null,null,{"$f":"IF(ISBLANK(B25),0,B25)","v":0},{"$f":"IF(ISBLANK(B25),0,D25)","v":0},{"$f":"A25&C25","v":"BUBW"}]
[]
["3 éme MATCH le 29 mai","à",{"$f":"A8","v":"BT"}]
[null,null,null,null,null,null,"SI forfait éq recevante"]
["Equipes","score","Equipes","score"]
[{"$f":"$A$6","v":"BR"},null,{"$f":"$A$11","v":"BW"},{"$f":"IF(G30=19,19,IF(ISBLANK(B30),\"\",IF(B30=19,0,36-B30)))","v":""},{"$f":"IF(G30=19,0,IF(ISBLANK(B30),\"\",IF(B30<18,1,IF(B30=18,2,IF(B30>18,3)))))","v":""},{"$f":"IF(G30=19,3,IF(ISBLANK(B30),\"\",IF(B30=19,0,IF(D30<18,1,IF(D30=18,2,IF(D30>=20,3))))))","v":""},null,null,{"$f":"IF(ISBLANK(B30),0,B30)","v":0},{"$f":"IF(ISBLANK(B30),0,D30)","v":0},{"$f":"A30&C30","v":"BRBW"}]
[{"$f":"$A$10","v":"BV"},null,{"$f":"$A$9","v":"BU"},{"$f":"IF(G31=19,19,IF(ISBLANK(B31),\"\",IF(B31=19,0,36-B31)))","v":""},{"$f":"IF(G31=19,0,IF(ISBLANK(B31),\"\",IF(B31<18,1,IF(B31=18,2,IF(B31>18,3)))))","v":""},{"$f":"IF(G31=19,3,IF(ISBLANK(B31),\"\",IF(B31=19,0,IF(D31<18,1,IF(D31=18,2,IF(D31>=20,3))))))","v":""},null,null,{"$f":"IF(ISBLANK(B31),0,B31)","v":0},{"$f":"IF(ISBLANK(B31),0,D31)","v":0},{"$f":"A31&C31","v":"BVBU"}]
[{"$f":"$A$8","v":"BT"},null,{"$f":"$A$7","v":"BS"},{"$f":"IF(G32=19,19,IF(ISBLANK(B32),\"\",IF(B32=19,0,36-B32)))","v":""},{"$f":"IF(G32=19,0,IF(ISBLANK(B32),\"\",IF(B32<18,1,IF(B32=18,2,IF(B32>18,3)))))","v":""},{"$f":"IF(G32=19,3,IF(ISBLANK(B32),\"\",IF(B32=19,0,IF(D32<18,1,IF(D32=18,2,IF(D32>=20,3))))))","v":""},null,null,{"$f":"IF(ISBLANK(B32),0,B32)","v":0},{"$f":"IF(ISBLANK(B32),0,D32)","v":0},{"$f":"A32&C32","v":"BTBS"}]
[]
["4 éme MATCH le 5 juin","à",{"$f":"A9","v":"BU"}]
[null,null,null,null,null,null,"SI forfait éq recevante"]
["Equipes","score","Equipes","score"]
[{"$f":"A6","v":"BR"},null,{"$f":"$A$9","v":"BU"},{"$f":"IF(G37=19,19,IF(ISBLANK(B37),\"\",IF(B37=19,0,36-B37)))","v":""},{"$f":"IF(G37=19,0,IF(ISBLANK(B37),\"\",IF(B37<18,1,IF(B37=18,2,IF(B37>18,3)))))","v":""},{"$f":"IF(G37=19,3,IF(ISBLANK(B37),\"\",IF(B37=19,0,IF(D37<18,1,IF(D37=18,2,IF(D37>=20,3))))))","v":""},null,null,{"$f":"IF(ISBLANK(B37),0,B37)","v":0},{"$f":"IF(ISBLANK(B37),0,D37)","v":0},{"$f":"A37&C37","v":"BRBU"}]
[{"$f":"$A$7","v":"BS"},null,{"$f":"$A$11","v":"BW"},{"$f":"IF(G38=19,19,IF(ISBLANK(B38),\"\",IF(B38=19,0,36-B38)))","v":""},{"$f":"IF(G38=19,0,IF(ISBLANK(B38),\"\",IF(B38<18,1,IF(B38=18,2,IF(B38>18,3)))))","v":""},{"$f":"IF(G38=19,3,IF(ISBLANK(B38),\"\",IF(B38=19,0,IF(D38<18,1,IF(D38=18,2,IF(D38>=20,3))))))","v":""},null,null,{"$f":"IF(ISBLANK(B38),0,B38)","v":0},{"$f":"IF(ISBLANK(B38),0,D38)","v":0},{"$f":"A38&C38","v":"BSBW"}]
[{"$f":"A8","v":"BT"},null,{"$f":"$A$10","v":"BV"},{"$f":"IF(G39=19,19,IF(ISBLANK(B39),\"\",IF(B39=19,0,36-B39)))","v":""},{"$f":"IF(G39=19,0,IF(ISBLANK(B39),\"\",IF(B39<18,1,IF(B39=18,2,IF(B39>18,3)))))","v":""},{"$f":"IF(G39=19,3,IF(ISBLANK(B39),\"\",IF(B39=19,0,IF(D39<18,1,IF(D39=18,2,IF(D39>=20,3))))))","v":""},null,null,{"$f":"IF(ISBLANK(B39),0,B39)","v":0},{"$f":"IF(ISBLANK(B39),0,D39)","v":0},{"$f":"A39&C39","v":"BTBV"}]
[]
["5 éme MATCH le 12 juin","à",{"$f":"A10","v":"BV"}]
[null,null,null,null,null,null,"SI forfait éq recevante"]
["Equipes","score","Equipes","score"]
[{"$f":"A8","v":"BT"},null,{"$f":"$A$11","v":"BW"},{"$f":"IF(G44=19,19,IF(ISBLANK(B44),\"\",IF(B44=19,0,36-B44)))","v":""},{"$f":"IF(G44=19,0,IF(ISBLANK(B44),\"\",IF(B44<18,1,IF(B44=18,2,IF(B44>18,3)))))","v":""},{"$f":"IF(G44=19,3,IF(ISBLANK(B44),\"\",IF(B44=19,0,IF(D44<18,1,IF(D44=18,2,IF(D44>=20,3))))))","v":""},null,null,{"$f":"IF(ISBLANK(B44),0,B44)","v":0},{"$f":"IF(ISBLANK(B44),0,D44)","v":0},{"$f":"A44&C44","v":"BTBW"}]
[{"$f":"$A$10","v":"BV"},null,{"$f":"A6","v":"BR"},{"$f":"IF(G45=19,19,IF(ISBLANK(B45),\"\",IF(B45=19,0,36-B45)))","v":""},{"$f":"IF(G45=19,0,IF(ISBLANK(B45),\"\",IF(B45<18,1,IF(B45=18,2,IF(B45>18,3)))))","v":""},{"$f":"IF(G45=19,3,IF(ISBLANK(B45),\"\",IF(B45=19,0,IF(D45<18,1,IF(D45=18,2,IF(D45>=20,3))))))","v":""},null,null,{"$f":"IF(ISBLANK(B45),0,B45)","v":0},{"$f":"IF(ISBLANK(B45),0,D45)","v":0},{"$f":"A45&C45","v":"BVBR"}]
[{"$f":"A7","v":"BS"},null,{"$f":"$A$9","v":"BU"},{"$f":"IF(G46=19,19,IF(ISBLANK(B46),\"\",IF(B46=19,0,36-B46)))","v":""},{"$f":"IF(G46=19,0,IF(ISBLANK(B46),\"\",IF(B46<18,1,IF(B46=18,2,IF(B46>18,3)))))","v":""},{"$f":"IF(G46=19,3,IF(ISBLANK(B46),\"\",IF(B46=19,0,IF(D46<18,1,IF(D46=18,2,IF(D46>=20,3))))))","v":""},null,null,{"$f":"IF(ISBLANK(B46),0,B46)","v":0},{"$f":"IF(ISBLANK(B46),0,D46)","v":0},{"$f":"A46&C46","v":"BSBU"}]
[]
["CLASSEMENT"]
["EQUIPES",null,"POINTS","Pour","Contre","Diff","CLASST"]
["BR","8A",0,0,0,0,{"$f":"B59","v":1},{"$f":"IF(AND(G50=1,COUNTIF(rang1,1)>1),COUNTIF(G$50:G50,1),IF(AND(G50=2,COUNTIF(rang1,2)>1),COUNTIF(G$50:G50,2)+3,\"\"))","v":1}]
["BS","8B",0,0,0,0,1,{"$f":"IF(AND(G51=1,COUNTIF(rang1,1)>1),COUNTIF(G$50:G51,1),IF(AND(G51=2,COUNTIF(rang1,2)>1),COUNTIF(G$50:G51,2)+3,\"\"))","v":2}]
["BT","8C",0,0,0,0,1,{"$f":"IF(AND(G52=1,COUNTIF(rang1,1)>1),COUNTIF(G$50:G52,1),IF(AND(G52=2,COUNTIF(rang1,2)>1),COUNTIF(G$50:G52,2)+3,\"\"))","v":3}]
["BU","8D",0,0,0,0,1,{"$f":"IF(AND(G53=1,COUNTIF(rang1,1)>1),COUNTIF(G$50:G53,1),IF(AND(G53=2,COUNTIF(rang1,2)>1),COUNTIF(G$50:G53,2)+3,\"\"))","v":4}]
["BV","8E",0,0,0,0,1,{"$f":"IF(AND(G54=1,COUNTIF(rang1,1)>1),COUNTIF(G$50:G54,1),IF(AND(G54=2,COUNTIF(rang1,2)>1),COUNTIF(G$50:G54,2)+3,\"\"))","v":5}]
["BW","8F",0,0,0,0,1,{"$f":"IF(AND(G55=1,COUNTIF(rang1,1)>1),COUNTIF(G$50:G55,1),IF(AND(G55=2,COUNTIF(rang1,2)>1),COUNTIF(G$50:G55,2)+3,\"\"))","v":6}]
[]
[null,"CLASSEMENT FINAL et DEPARTAGE EX AEQUOS",null,null,null,null,null,null,null,null,null,null,"CLASSEMENT"]
[null,"Rang","Equipes","Pts","diff pts avec exaequo","cumul","departage goalaverage si même cumul","RP",null,null,null,"RP","Rang","Equipe","Pts"]
[null,{"$f":"RANK(G59,$G$59:$G$64)","v":1},{"$f":"INDEX($A$50:$A$55,MATCH(H59,$L$59:$L$64,0))","v":"BR"},{"$f":"VLOOKUP(C59,$A$50:$C$55,3,0)","v":0},{"$f":"IF(D59=D60,INDEX($J$6:$O$11,MATCH(C59,$I$6:$I$11,0),MATCH(C60,$J$5:$O$5,0)),IF(D59=D58,INDEX($J$6:$O$11,MATCH(C59,$I$6:$I$11,0),MATCH(C58,$J$5:$O$5,0)),0))","v":0},{"$f":"D59+E59/100","v":0},{"$f":"IF(AND(F59<>F58,F59<>F60),F59,F59+VLOOKUP(C59,$A$50:$F$55,6,0)/100)","v":0},1,null,null,null,{"$f":"RANK(C50,$C$50:$C$55)+COUNTIF($C$50:C50,C50)-1","v":1},{"$f":"B59","v":1},"BR",{"$f":"VLOOKUP(N59,$C$59:$D$64,2,0)","v":0}]
[null,1,"BS",0,{"$f":"IF(D60=D61,INDEX($J$6:$O$11,MATCH(C60,$I$6:$I$11,0),MATCH(C61,$J$5:$O$5,0)),IF(D60=D59,INDEX($J$6:$O$11,MATCH(C60,$I$6:$I$11,0),MATCH(C59,$J$5:$O$5,0)),0))","v":0},0,{"$f":"IF(AND(F60<>F59,F60<>F61),F60,F60+VLOOKUP(C60,$A$50:$F$55,6,0)/100)","v":0},2,null,null,null,{"$f":"RANK(C51,$C$50:$C$55)+COUNTIF($C$50:C51,C51)-1","v":2},1,"BS",0]
[null,1,"BT",0,{"$f":"IF(D61=D62,INDEX($J$6:$O$11,MATCH(C61,$I$6:$I$11,0),MATCH(C62,$J$5:$O$5,0)),IF(D61=D60,INDEX($J$6:$O$11,MATCH(C61,$I$6:$I$11,0),MATCH(C60,$J$5:$O$5,0)),0))","v":0},0,{"$f":"IF(AND(F61<>F60,F61<>F62),F61,F61+VLOOKUP(C61,$A$50:$F$55,6,0)/100)","v":0},3,null,null,null,{"$f":"RANK(C52,$C$50:$C$55)+COUNTIF($C$50:C52,C52)-1","v":3},1,"BT",0]
[null,1,"BU",0,{"$f":"IF(D62=D63,INDEX($J$6:$O$11,MATCH(C62,$I$6:$I$11,0),MATCH(C63,$J$5:$O$5,0)),IF(D62=D61,INDEX($J$6:$O$11,MATCH(C62,$I$6:$I$11,0),MATCH(C61,$J$5:$O$5,0)),0))","v":0},0,{"$f":"IF(AND(F62<>F61,F62<>F63),F62,F62+VLOOKUP(C62,$A$50:$F$55,6,0)/100)","v":0},4,null,null,null,{"$f":"RANK(C53,$C$50:$C$55)+COUNTIF($C$50:C53,C53)-1","v":4},1,"BU",0]
[null,1,"BV",0,{"$f":"IF(D63=D64,INDEX($J$6:$O$11,MATCH(C63,$I$6:$I$11,0),MATCH(C64,$J$5:$O$5,0)),IF(D63=D62,INDEX($J$6:$O$11,MATCH(C63,$I$6:$I$11,0),MATCH(C62,$J$5:$O$5,0)),0))","v":0},0,{"$f":"IF(AND(F63<>F62,F63<>F64),F63,F63+VLOOKUP(C63,$A$50:$F$55,6,0)/100)","v":0},5,null,null,null,{"$f":"RANK(C54,$C$50:$C$55)+COUNTIF($C$50:C54,C54)-1","v":5},1,"BV",0]
[null,1,"BW",0,{"$f":"IF(D64=D59,INDEX($J$6:$O$11,MATCH(C64,$I$6:$I$11,0),MATCH(C59,$J$5:$O$5,0)),IF(D64=D63,INDEX($J$6:$O$11,MATCH(C64,$I$6:$I$11,0),MATCH(C63,$J$5:$O$5,0)),0))","v":0},0,{"$f":"IF(AND(F64<>F63,F64<>F59),F64,F64+VLOOKUP(C64,$A$50:$F$55,6,0)/100)","v":0},6,null,null,null,{"$f":"RANK(C55,$C$50:$C$55)+COUNTIF($C$50:C55,C55)-1","v":6},1,"BW",0]

{"sheet":"P9","index":8,"n_rows":64,"n_cols":15,"rows_kept":64,"cut":false,"hidden":false,"merged":[[0,0,0,5],[1,0,1,5],[2,0,2,5],[3,0,3,5],[13,6,14,6],[56,1,56,6],[56,12,56,14],[20,6,21,6],[27,6,28,6],[34,6,35,6],[41,6,42,6],[47,0,47,5]]}
[]
["CHAMPIONNAT DES CLUBS"]
[]
["POULE 9",null,null,null,null,null,null,null,"Récapitulatif  différence match entre 2 équipes"]
["EQUIPES",null,"POINTS","Pour","Contre","Diff",null,null,null,{"$f":"A6","v":"BX"},{"$f":"A7","v":"BY"},{"$f":"A8","v":"BZ"},{"$f":"A9","v":"CA"},{"$f":"A10","v":"CB"},{"$f":"A11","v":"CC"}]
["BX","9A",{"$f":"SUM(E16,E23,E30,E37,F45)","v":0},{"$f":"I16+I23+I30+I37+J45","v":0},{"$f":"J16+J23+J30+J37+I45","v":0},{"$f":"D6-E6","v":0},null,null,{"$f":"A6","v":"BX"},null,{"$f":"IF(ISBLANK(B16),0,IFERROR(INDEX($B$15:$B$46,MATCH($I6&K$5,$K$15:$K$46,0))-INDEX($D$15:$D$46,MATCH($I6&K$5,$K$15:$K$46,0)),0-INDEX($J$6:$O$11,MATCH(K$5,$I$6:$I$11,0),MATCH($I6,$J$5:$O$5,0))))","v":0},{"$f":"IF(ISBLANK(B23),0,IFERROR(INDEX($B$15:$B$46,MATCH($I6&L$5,$K$15:$K$46,0))-INDEX($D$15:$D$46,MATCH($I6&L$5,$K$15:$K$46,0)),0-INDEX($J$6:$O$11,MATCH(L$5,$I$6:$I$11,0),MATCH($I6,$J$5:$O$5,0))))","v":0},{"$f":"IF(ISBLANK(B37),0,IFERROR(INDEX($B$15:$B$46,MATCH($I6&M$5,$K$15:$K$46,0))-INDEX($D$15:$D$46,MATCH($I6&M$5,$K$15:$K$46,0)),0-INDEX($J$6:$O$11,MATCH(M$5,$I$6:$I$11,0),MATCH($I6,$J$5:$O$5,0))))","v":0},{"$f":"IF(ISBLANK(B45),0,IFERROR(INDEX($B$15:$B$46,MATCH($I6&N$5,$K$15:$K$46,0))-INDEX($D$15:$D$46,MATCH($I6&N$5,$K$15:$K$46,0)),0-INDEX($J$6:$O$11,MATCH(N$5,$I$6:$I$11,0),MATCH($I6,$J$5:$O$5,0))))","v":0},{"$f":"IF(ISBLANK(B30),0,IFERROR(INDEX($B$15:$B$46,MATCH($I6&O$5,$K$15:$K$46,0))-INDEX($D$15:$D$46,MATCH($I6&O$5,$K$15:$K$46,0)),0-INDEX($J$6:$O$11,MATCH(O$5,$I$6:$I$11,0),MATCH($I6,$J$5:$O$5,0))))","v":0}]
["BY","9B",{"$f":"SUM(F16,E24,F32,E38,E46)","v":0},{"$f":"J16+I24+J32+I38+I46","v":0},{"$f":"I16+J24+I32+J38+J46","v":0},0,null,null,"BY",{"$f":"IF(ISBLANK(B16),0,IFERROR(INDEX($B$15:$B$46,MATCH($I7&J$5,$K$15:$K$46,0))-INDEX($D$15:$D$46,MATCH($I7&J$5,$K$15:$K$46,0)),0-INDEX($J$6:$O$11,MATCH(J$5,$I$6:$I$11,0),MATCH($I7,$J$5:$O$5,0))))","v":0},null,{"$f":"IF(ISBLANK(B32),0,IFERROR(INDEX($B$15:$B$46,MATCH($I7&L$5,$K$15:$K$46,0))-INDEX($D$15:$D$46,MATCH($I7&L$5,$K$15:$K$46,0)),0-INDEX($J$6:$O$11,MATCH(L$5,$I$6:$I$11,0),MATCH($I7,$J$5:$O$5,0))))","v":0},{"$f":"IF(ISBLANK(B46),0,IFERROR(INDEX($B$15:$B$46,MATCH($I7&M$5,$K$15:$K$46,0))-INDEX($D$15:$D$46,MATCH($I7&M$5,$K$15:$K$46,0)),0-INDEX($J$6:$O$11,MATCH(M$5,$I$6:$I$11,0),MATCH($I7,$J$5:$O$5,0))))","v":0},{"$f":"IF(ISBLANK(B24),0,IFERROR(INDEX($B$15:$B$46,MATCH($I7&N$5,$K$15:$K$46,0))-INDEX($D$15:$D$46,MATCH($I7&N$5,$K$15:$K$46,0)),0-INDEX($J$6:$O$11,MATCH(N$5,$I$6:$I$11,0),MATCH($I7,$J$5:$O$5,0))))","v":0},{"$f":"IF(ISBLANK(B38),0,IFERROR(INDEX($B$15:$B$46,MATCH($I7&O$5,$K$15:$K$46,0))-INDEX($D$15:$D$46,MATCH($I7&O$5,$K$15:$K$46,0)),0-INDEX($J$6:$O$11,MATCH(O$5,$I$6:$I$11,0),MATCH($I7,$J$5:$O$5,0))))","v":0}]
["BZ","9C",{"$f":"SUM(E17,F23,E32,E39,E44)","v":0},{"$f":"I17+J23+I32+I39+I44","v":0},{"$f":"J17+I23+J32+J39+J44","v":0},0,null,null,"BZ",{"$f":"IF(ISBLANK(B23),0,IFERROR(INDEX($B$15:$B$46,MATCH($I8&J$5,$K$15:$K$46,0))-INDEX($D$15:$D$46,MATCH($I8&J$5,$K$15:$K$46,0)),0-INDEX($J$6:$O$11,MATCH(J$5,$I$6:$I$11,0),MATCH($I8,$J$5:$O$5,0))))","v":0},{"$f":"IF(ISBLANK(B32),0,IFERROR(INDEX($B$15:$B$46,MATCH($I8&K$5,$K$15:$K$46,0))-INDEX($D$15:$D$46,MATCH($I8&K$5,$K$15:$K$46,0)),0-INDEX($J$6:$O$11,MATCH(K$5,$I$6:$I$11,0),MATCH($I8,$J$5:$O$5,0))))","v":0},null,{"$f":"IF(ISBLANK(B17),0,IFERROR(INDEX($B$15:$B$46,MATCH($I8&M$5,$K$15:$K$46,0))-INDEX($D$15:$D$46,MATCH($I8&M$5,$K$15:$K$46,0)),0-INDEX($J$6:$O$11,MATCH(M$5,$I$6:$I$11,0),MATCH($I8,$J$5:$O$5,0))))","v":0},{"$f":"IF(ISBLANK(B39),0,IFERROR(INDEX($B$15:$B$46,MATCH($I8&N$5,$K$15:$K$46,0))-INDEX($D$15:$D$46,MATCH($I8&N$5,$K$15:$K$46,0)),0-INDEX($J$6:$O$11,MATCH(N$5,$I$6:$I$11,0),MATCH($I8,$J$5:$O$5,0))))","v":0},{"$f":"IF(ISBLANK(B44),0,IFERROR(INDEX($B$15:$B$46,MATCH($I8&O$5,$K$15:$K$46,0))-INDEX($D$15:$D$46,MATCH($I8&O$5,$K$15:$K$46,0)),0-INDEX($J$6:$O$11,MATCH(O$5,$I$6:$I$11,0),MATCH($I8,$J$5:$O$5,0))))","v":0}]
["CA","9D",{"$f":"SUM(F17,E25,F31,F37,F46)","v":0},{"$f":"J17+I25+J31+J37+J46","v":0},{"$f":"I17+J25+I31+I37+I46","v":0},0,null,null,"CA",{"$f":"IF(ISBLANK(B37),0,IFERROR(INDEX($B$15:$B$46,MATCH($I9&J$5,$K$15:$K$46,0))-INDEX($D$15:$D$46,MATCH($I9&J$5,$K$15:$K$46,0)),0-INDEX($J$6:$O$11,MATCH(J$5,$I$6:$I$11,0),MATCH($I9,$J$5:$O$5,0))))","v":0},{"$f":"IF(ISBLANK(B46),0,IFERROR(INDEX($B$15:$B$46,MATCH($I9&K$5,$K$15:$K$46,0))-INDEX($D$15:$D$46,MATCH($I9&K$5,$K$15:$K$46,0)),0-INDEX($J$6:$O$11,MATCH(K$5,$I$6:$I$11,0),MATCH($I9,$J$5:$O$5,0))))","v":0},{"$f":"IF(ISBLANK(B17),0,IFERROR(INDEX($B$15:$B$46,MATCH($I9&L$5,$K$15:$K$46,0))-INDEX($D$15:$D$46,MATCH($I9&L$5,$K$15:$K$46,0)),0-INDEX($J$6:$O$11,MATCH(L$5,$I$6:$I$11,0),MATCH($I9,$J$5:$O$5,0))))","v":0},null,{"$f":"IF(ISBLANK(B31),0,IFERROR(INDEX($B$15:$B$46,MATCH($I9&N$5,$K$15:$K$46,0))-INDEX($D$15:$D$46,MATCH($I9&N$5,$K$15:$K$46,0)),0-INDEX($J$6:$O$11,MATCH(N$5,$I$6:$I$11,0),MATCH($I9,$J$5:$O$5,0))))","v":0},{"$f":"IF(ISBLANK(B25),0,IFERROR(INDEX($B$15:$B$46,MATCH($I9&O$5,$K$15:$K$46,0))-INDEX($D$15:$D$46,MATCH($I9&O$5,$K$15:$K$46,0)),0-INDEX($J$6:$O$11,MATCH(O$5,$I$6:$I$11,0),MATCH($I9,$J$5:$O$5,0))))","v":0}]
["CB","9E",{"$f":"SUM(E18,F24,E31,F39,E45)","v":0},{"$f":"I18+J24+I31+J39+I45","v":0},{"$f":"J18+I24+J31+I39+J45","v":0},0,null,null,"CB",{"$f":"IF(ISBLANK(B45),0,IFERROR(INDEX($B$15:$B$46,MATCH($I10&J$5,$K$15:$K$46,0))-INDEX($D$15:$D$46,MATCH($I10&J$5,$K$15:$K$46,0)),0-INDEX($J$6:$O$11,MATCH(J$5,$I$6:$I$11,0),MATCH($I10,$J$5:$O$5,0))))","v":0},{"$f":"IF(ISBLANK(B24),0,IFERROR(INDEX($B$15:$B$46,MATCH($I10&K$5,$K$15:$K$46,0))-INDEX($D$15:$D$46,MATCH($I10&K$5,$K$15:$K$46,0)),0-INDEX($J$6:$O$11,MATCH(K$5,$I$6:$I$11,0),MATCH($I10,$J$5:$O$5,0))))","v":0},{"$f":"IF(ISBLANK(B39),0,IFERROR(INDEX($B$15:$B$46,MATCH($I10&L$5,$K$15:$K$46,0))-INDEX($D$15:$D$46,MATCH($I10&L$5,$K$15:$K$46,0)),0-INDEX($J$6:$O$11,MATCH(L$5,$I$6:$I$11,0),MATCH($I10,$J$5:$O$5,0))))","v":0},{"$f":"IF(ISBLANK(B31),0,IFERROR(INDEX($B$15:$B$46,MATCH($I10&M$5,$K$15:$K$46,0))-INDEX($D$15:$D$46,MATCH($I10&M$5,$K$15:$K$46,0)),0-INDEX($J$6:$O$11,MATCH(M$5,$I$6:$I$11,0),MATCH($I10,$J$5:$O$5,0))))","v":0},null,{"$f":"IF(ISBLANK(B18),0,IFERROR(INDEX($B$15:$B$46,MATCH($I10&O$5,$K$15:$K$46,0))-INDEX($D$15:$D$46,MATCH($I10&O$5,$K$15:$K$46,0)),0-INDEX($J$6:$O$11,MATCH(O$5,$I$6:$I$11,0),MATCH($I10,$J$5:$O$5,0))))","v":0}]
["CC","9F",{"$f":"SUM(F18,F25,F30,F38,F44)","v":0},{"$f":"J18+J25+J30+J38+J44","v":0},{"$f":"I18+I25+I30+I38+I44","v":0},0,null,null,"CC",{"$f":"IF(ISBLANK(B30),0,IFERROR(INDEX($B$15:$B$46,MATCH($I11&J$5,$K$15:$K$46,0))-INDEX($D$15:$D$46,MATCH($I11&J$5,$K$15:$K$46,0)),0-INDEX($J$6:$O$11,MATCH(J$5,$I$6:$I$11,0),MATCH($I11,$J$5:$O$5,0))))","v":0},{"$f":"IF(ISBLANK(B38),0,IFERROR(INDEX($B$15:$B$46,MATCH($I11&K$5,$K$15:$K$46,0))-INDEX($D$15:$D$46,MATCH($I11&K$5,$K$15:$K$46,0)),0-INDEX($J$6:$O$11,MATCH(K$5,$I$6:$I$11,0),MATCH($I11,$J$5:$O$5,0))))","v":0},{"$f":"IF(ISBLANK(B44),0,IFERROR(INDEX($B$15:$B$46,MATCH($I11&L$5,$K$15:$K$46,0))-INDEX($D$15:$D$46,MATCH($I11&L$5,$K$15:$K$46,0)),0-INDEX($J$6:$O$11,MATCH(L$5,$I$6:$I$11,0),MATCH($I11,$J$5:$O$5,0))))","v":0},{"$f":"IF(ISBLANK(B25),0,IFERROR(INDEX($B$15:$B$46,MATCH($I11&M$5,$K$15:$K$46,0))-INDEX($D$15:$D$46,MATCH($I11&M$5,$K$15:$K$46,0)),0-INDEX($J$6:$O$11,MATCH(M$5,$I$6:$I$11,0),MATCH($I11,$J$5:$O$5,0))))","v":0},{"$f":"IF(ISBLANK(B18),0,IFERROR(INDEX($B$15:$B$46,MATCH($I11&N$5,$K$15:$K$46,0))-INDEX($D$15:$D$46,MATCH($I11&N$5,$K$15:$K$46,0)),0-INDEX($J$6:$O$11,MATCH(N$5,$I$6:$I$11,0),MATCH($I11,$J$5:$O$5,0))))","v":0}]
[null,null,null,null,null,null,null,null,"Les concaténations en rouge permettent de remplir par formules le récapitulatif au dessus"]
["1er MATCH le 15 mai","à",{"$f":"A6","v":"BX"},null,null,null,null,null,"Ce récap servira à départager les ex aequos"]
[null,null,null,null,null,null,"SI forfait éq recevante"]
["Equipes","score","Equipes","score"]
[{"$f":"$A$6","v":"BX"},null,{"$f":"$A$7","v":"BY"},{"$f":"IF(G16=19,19,IF(ISBLANK(B16),\"\",IF(B16=19,0,36-B16)))","v":""},{"$f":"IF(G16=19,0,IF(ISBLANK(B16),\"\",IF(B16<18,1,IF(B16=18,2,IF(B16>18,3)))))","v":""},{"$f":"IF(G16=19,3,IF(ISBLANK(B16),\"\",IF(B16=19,0,IF(D16<18,1,IF(D16=18,2,IF(D16>=20,3))))))","v":""},null,null,{"$f":"IF(ISBLANK(B16),0,B16)","v":0},{"$f":"IF(ISBLANK(B16),0,D16)","v":0},{"$f":"A16&C16","v":"BXBY"}]
[{"$f":"$A$8","v":"BZ"},null,{"$f":"$A$9","v":"CA"},{"$f":"IF(G17=19,19,IF(ISBLANK(B17),\"\",IF(B17=19,0,36-B17)))","v":""},{"$f":"IF(G17=19,0,IF(ISBLANK(B17),\"\",IF(B17<18,1,IF(B17=18,2,IF(B17>18,3)))))","v":""},{"$f":"IF(G17=19,3,IF(ISBLANK(B17),\"\",IF(B17=19,0,IF(D17<18,1,IF(D17=18,2,IF(D17>=20,3))))))","v":""},null,null,{"$f":"IF(ISBLANK(B17),0,B17)","v":0},{"$f":"IF(ISBLANK(B17),0,D17)","v":0},{"$f":"A17&C17","v":"BZCA"}]
[{"$f":"$A$10","v":"CB"},null,{"$f":"$A$11","v":"CC"},{"$f":"IF(G18=19,19,IF(ISBLANK(B18),\"\",IF(B18=19,0,36-B18)))","v":""},{"$f":"IF(G18=19,0,IF(ISBLANK(B18),\"\",IF(B18<18,1,IF(B18=18,2,IF(B18>18,3)))))","v":""},{"$f":"IF(G18=19,3,IF(ISBLANK(B18),\"\",IF(B18=19,0,IF(D18<18,1,IF(D18=18,2,IF(D18>=20,3))))))","v":""},null,null,{"$f":"IF(ISBLANK(B18),0,B18)","v":0},{"$f":"IF(ISBLANK(B18),0,D18)","v":0},{"$f":"A18&C18","v":"CBCC"}]
[]
["2 éme MATCH le 22 mai","à",{"$f":"A7","v":"BY"}]
[null,null,null,null,null,null,"SI forfait éq recevante"]
["Equipes","score","Equipes","score"]
[{"$f":"$A$6","v":"BX"},null,{"$f":"$A$8","v":"BZ"},{"$f":"IF(G23=19,19,IF(ISBLANK(B23),\"\",IF(B23=19,0,36-B23)))","v":""},{"$f":"IF(G23=19,0,IF(ISBLANK(B23),\"\",IF(B23<18,1,IF(B23=18,2,IF(B23>18,3)))))","v":""},{"$f":"IF(G23=19,3,IF(ISBLANK(B23),\"\",IF(B23=19,0,IF(D23<18,1,IF(D23=18,2,IF(D23>=20,3))))))","v":""},null,null,{"$f":"IF(ISBLANK(B23),0,B23)","v":0},{"$f":"IF(ISBLANK(B23),0,D23)","v":0},{"$f":"A23&C23","v":"BXBZ"}]
[{"$f":"$A$7","v":"BY"},null,{"$f":"$A$10","v":"CB"},{"$f":"IF(G24=19,19,IF(ISBLANK(B24),\"\",IF(B24=19,0,36-B24)))","v":""},{"$f":"IF(G24=19,0,IF(ISBLANK(B24),\"\",IF(B24<18,1,IF(B24=18,2,IF(B24>18,3)))))","v":""},{"$f":"IF(G24=19,3,IF(ISBLANK(B24),\"\",IF(B24=19,0,IF(D24<18,1,IF(D24=18,2,IF(D24>=20,3))))))","v":""},null,null,{"$f":"IF(ISBLANK(B24),0,B24)","v":0},{"$f":"IF(ISBLANK(B24),0,D24)","v":0},{"$f":"A24&C24","v":"BYCB"}]
[{"$f":"$A$9","v":"CA"},null,{"$f":"$A$11","v":"CC"},{"$f":"IF(G25=19,19,IF(ISBLANK(B25),\"\",IF(B25=19,0,36-B25)))","v":""},{"$f":"IF(G25=19,0,IF(ISBLANK(B25),\"\",IF(B25<18,1,IF(B25=18,2,IF(B25>18,3)))))","v":""},{"$f":"IF(G25=19,3,IF(ISBLANK(B25),\"\",IF(B25=19,0,IF(D25<18,1,IF(D25=18,2,IF(D25>=20,3))))))","v":""},null,null,{"$f":"IF(ISBLANK(B25),0,B25)","v":0},{"$f":"IF(ISBLANK(B25),0,D25)","v":0},{"$f":"A25&C25","v":"CACC"}]
[]
["3 éme MATCH le 29 mai","à",{"$f":"A8","v":"BZ"}]
[null,null,null,null,null,null,"SI forfait éq recevante"]
["Equipes","score","Equipes","score"]
[{"$f":"$A$6","v":"BX"},null,{"$f":"$A$11","v":"CC"},{"$f":"IF(G30=19,19,IF(ISBLANK(B30),\"\",IF(B30=19,0,36-B30)))","v":""},{"$f":"IF(G30=19,0,IF(ISBLANK(B30),\"\",IF(B30<18,1,IF(B30=18,2,IF(B30>18,3)))))","v":""},{"$f":"IF(G30=19,3,IF(ISBLANK(B30),\"\",IF(B30=19,0,IF(D30<18,1,IF(D30=18,2,IF(D30>=20,3))))))","v":""},null,null,{"$f":"IF(ISBLANK(B30),0,B30)","v":0},{"$f":"IF(ISBLANK(B30),0,D30)","v":0},{"$f":"A30&C30","v":"BXCC"}]
[{"$f":"$A$10","v":"CB"},null,{"$f":"$A$9","v":"CA"},{"$f":"IF(G31=19,19,IF(ISBLANK(B31),\"\",IF(B31=19,0,36-B31)))","v":""},{"$f":"IF(G31=19,0,IF(ISBLANK(B31),\"\",IF(B31<18,1,IF(B31=18,2,IF(B31>18,3)))))","v":""},{"$f":"IF(G31=19,3,IF(ISBLANK(B31),\"\",IF(B31=19,0,IF(D31<18,1,IF(D31=18,2,IF(D31>=20,3))))))","v":""},null,null,{"$f":"IF(ISBLANK(B31),0,B31)","v":0},{"$f":"IF(ISBLANK(B31),0,D31)","v":0},{"$f":"A31&C31","v":"CBCA"}]
[{"$f":"$A$8","v":"BZ"},null,{"$f":"$A$7","v":"BY"},{"$f":"IF(G32=19,19,IF(ISBLANK(B32),\"\",IF(B32=19,0,36-B32)))","v":""},{"$f":"IF(G32=19,0,IF(ISBLANK(B32),\"\",IF(B32<18,1,IF(B32=18,2,IF(B32>18,3)))))","v":""},{"$f":"IF(G32=19,3,IF(ISBLANK(B32),\"\",IF(B32=19,0,IF(D32<18,1,IF(D32=18,2,IF(D32>=20,3))))))","v":""},null,null,{"$f":"IF(ISBLANK(B32),0,B32)","v":0},{"$f":"IF(ISBLANK(B32),0,D32)","v":0},{"$f":"A32&C32","v":"BZBY"}]
[]
["4 éme MATCH le 5 juin","à",{"$f":"A9","v":"CA"}]
[null,null,null,null,null,null,"SI forfait éq recevante"]
["Equipes","score","Equipes","score"]
[{"$f":"A6","v":"BX"},null,{"$f":"$A$9","v":"CA"},{"$f":"IF(G37=19,19,IF(ISBLANK(B37),\"\",IF(B37=19,0,36-B37)))","v":""},{"$f":"IF(G37=19,0,IF(ISBLANK(B37),\"\",IF(B37<18,1,IF(B37=18,2,IF(B37>18,3)))))","v":""},{"$f":"IF(G37=19,3,IF(ISBLANK(B37),\"\",IF(B37=19,0,IF(D37<18,1,IF(D37=18,2,IF(D37>=20,3))))))","v":""},null,null,{"$f":"IF(ISBLANK(B37),0,B37)","v":0},{"$f":"IF(ISBLANK(B37),0,D37)","v":0},{"$f":"A37&C37","v":"BXCA"}]
[{"$f":"$A$7","v":"BY"},null,{"$f":"$A$11","v":"CC"},{"$f":"IF(G38=19,19,IF(ISBLANK(B38),\"\",IF(B38=19,0,36-B38)))","v":""},{"$f":"IF(G38=19,0,IF(ISBLANK(B38),\"\",IF(B38<18,1,IF(B38=18,2,IF(B38>18,3)))))","v":""},{"$f":"IF(G38=19,3,IF(ISBLANK(B38),\"\",IF(B38=19,0,IF(D38<18,1,IF(D38=18,2,IF(D38>=20,3))))))","v":""},null,null,{"$f":"IF(ISBLANK(B38),0,B38)","v":0},{"$f":"IF(ISBLANK(B38),0,D38)","v":0},{"$f":"A38&C38","v":"BYCC"}]
[{"$f":"A8","v":"BZ"},null,{"$f":"$A$10","v":"CB"},{"$f":"IF(G39=19,19,IF(ISBLANK(B39),\"\",IF(B39=19,0,36-B39)))","v":""},{"$f":"IF(G39=19,0,IF(ISBLANK(B39),\"\",IF(B39<18,1,IF(B39=18,2,IF(B39>18,3)))))","v":""},{"$f":"IF(G39=19,3,IF(ISBLANK(B39),\"\",IF(B39=19,0,IF(D39<18,1,IF(D39=18,2,IF(D39>=20,3))))))","v":""},null,null,{"$f":"IF(ISBLANK(B39),0,B39)","v":0},{"$f":"IF(ISBLANK(B39),0,D39)","v":0},{"$f":"A39&C39","v":"BZCB"}]
[]
["5 éme MATCH le 12 juin","à",{"$f":"A10","v":"CB"}]
[null,null,null,null,null,null,"SI forfait éq recevante"]
["Equipes","score","Equipes","score"]
[{"$f":"A8","v":"BZ"},null,{"$f":"$A$11","v":"CC"},{"$f":"IF(G44=19,19,IF(ISBLANK(B44),\"\",IF(B44=19,0,36-B44)))","v":""},{"$f":"IF(G44=19,0,IF(ISBLANK(B44),\"\",IF(B44<18,1,IF(B44=18,2,IF(B44>18,3)))))","v":""},{"$f":"IF(G44=19,3,IF(ISBLANK(B44),\"\",IF(B44=19,0,IF(D44<18,1,IF(D44=18,2,IF(D44>=20,3))))))","v":""},null,null,{"$f":"IF(ISBLANK(B44),0,B44)","v":0},{"$f":"IF(ISBLANK(B44),0,D44)","v":0},{"$f":"A44&C44","v":"BZCC"}]
[{"$f":"$A$10","v":"CB"},null,{"$f":"A6","v":"BX"},{"$f":"IF(G45=19,19,IF(ISBLANK(B45),\"\",IF(B45=19,0,36-B45)))","v":""},{"$f":"IF(G45=19,0,IF(ISBLANK(B45),\"\",IF(B45<18,1,IF(B45=18,2,IF(B45>18,3)))))","v":""},{"$f":"IF(G45=19,3,IF(ISBLANK(B45),\"\",IF(B45=19,0,IF(D45<18,1,IF(D45=18,2,IF(D45>=20,3))))))","v":""},null,null,{"$f":"IF(ISBLANK(B45),0,B45)","v":0},{"$f":"IF(ISBLANK(B45),0,D45)","v":0},{"$f":"A45&C45","v":"CBBX"}]
[{"$f":"A7","v":"BY"},null,{"$f":"$A$9","v":"CA"},{"$f":"IF(G46=19,19,IF(ISBLANK(B46),\"\",IF(B46=19,0,36-B46)))","v":""},{"$f":"IF(G46=19,0,IF(ISBLANK(B46),\"\",IF(B46<18,1,IF(B46=18,2,IF(B46>18,3)))))","v":""},{"$f":"IF(G46=19,3,IF(ISBLANK(B46),\"\",IF(B46=19,0,IF(D46<18,1,IF(D46=18,2,IF(D46>=20,3))))))","v":""},null,null,{"$f":"IF(ISBLANK(B46),0,B46)","v":0},{"$f":"IF(ISBLANK(B46),0,D46)","v":0},{"$f":"A46&C46","v":"BYCA"}]
[]
["CLASSEMENT"]
["EQUIPES",null,"POINTS","Pour","Contre","Diff","CLASST"]
["BX","9A",0,0,0,0,{"$f":"B59","v":1},{"$f":"IF(AND(G50=1,COUNTIF(rang1,1)>1),COUNTIF(G$50:G50,1),IF(AND(G50=2,COUNTIF(rang1,2)>1),COUNTIF(G$50:G50,2)+3,\"\"))","v":1}]
["BY","9B",0,0,0,0,1,{"$f":"IF(AND(G51=1,COUNTIF(rang1,1)>1),COUNTIF(G$50:G51,1),IF(AND(G51=2,COUNTIF(rang1,2)>1),COUNTIF(G$50:G51,2)+3,\"\"))","v":2}]
["BZ","9C",0,0,0,0,1,{"$f":"IF(AND(G52=1,COUNTIF(rang1,1)>1),COUNTIF(G$50:G52,1),IF(AND(G52=2,COUNTIF(rang1,2)>1),COUNTIF(G$50:G52,2)+3,\"\"))","v":3}]
["CA","9D",0,0,0,0,1,{"$f":"IF(AND(G53=1,COUNTIF(rang1,1)>1),COUNTIF(G$50:G53,1),IF(AND(G53=2,COUNTIF(rang1,2)>1),COUNTIF(G$50:G53,2)+3,\"\"))","v":4}]
["CB","9E",0,0,0,0,1,{"$f":"IF(AND(G54=1,COUNTIF(rang1,1)>1),COUNTIF(G$50:G54,1),IF(AND(G54=2,COUNTIF(rang1,2)>1),COUNTIF(G$50:G54,2)+3,\"\"))","v":5}]
["CC","9F",0,0,0,0,1,{"$f":"IF(AND(G55=1,COUNTIF(rang1,1)>1),COUNTIF(G$50:G55,1),IF(AND(G55=2,COUNTIF(rang1,2)>1),COUNTIF(G$50:G55,2)+3,\"\"))","v":6}]
[]
[null,"CLASSEMENT FINAL et DEPARTAGE EX AEQUOS",null,null,null,null,null,null,null,null,null,null,"CLASSEMENT"]
[null,"Rang","Equipes","Pts","diff pts avec exaequo","cumul","departage goalaverage si même cumul","RP",null,null,null,"RP","Rang","Equipe","Pts"]
[null,{"$f":"RANK(G59,$G$59:$G$64)","v":1},{"$f":"INDEX($A$50:$A$55,MATCH(H59,$L$59:$L$64,0))","v":"BX"},{"$f":"VLOOKUP(C59,$A$50:$C$55,3,0)","v":0},{"$f":"IF(D59=D60,INDEX($J$6:$O$11,MATCH(C59,$I$6:$I$11,0),MATCH(C60,$J$5:$O$5,0)),IF(D59=D58,INDEX($J$6:$O$11,MATCH(C59,$I$6:$I$11,0),MATCH(C58,$J$5:$O$5,0)),0))","v":0},{"$f":"D59+E59/100","v":0},{"$f":"IF(AND(F59<>F58,F59<>F60),F59,F59+VLOOKUP(C59,$A$50:$F$55,6,0)/100)","v":0},1,null,null,null,{"$f":"RANK(C50,$C$50:$C$55)+COUNTIF($C$50:C50,C50)-1","v":1},{"$f":"B59","v":1},"BX",{"$f":"VLOOKUP(N59,$C$59:$D$64,2,0)","v":0}]
[null,1,"BY",0,{"$f":"IF(D60=D61,INDEX($J$6:$O$11,MATCH(C60,$I$6:$I$11,0),MATCH(C61,$J$5:$O$5,0)),IF(D60=D59,INDEX($J$6:$O$11,MATCH(C60,$I$6:$I$11,0),MATCH(C59,$J$5:$O$5,0)),0))","v":0},0,{"$f":"IF(AND(F60<>F59,F60<>F61),F60,F60+VLOOKUP(C60,$A$50:$F$55,6,0)/100)","v":0},2,null,null,null,{"$f":"RANK(C51,$C$50:$C$55)+COUNTIF($C$50:C51,C51)-1","v":2},1,"BY",0]
[null,1,"BZ",0,{"$f":"IF(D61=D62,INDEX($J$6:$O$11,MATCH(C61,$I$6:$I$11,0),MATCH(C62,$J$5:$O$5,0)),IF(D61=D60,INDEX($J$6:$O$11,MATCH(C61,$I$6:$I$11,0),MATCH(C60,$J$5:$O$5,0)),0))","v":0},0,{"$f":"IF(AND(F61<>F60,F61<>F62),F61,F61+VLOOKUP(C61,$A$50:$F$55,6,0)/100)","v":0},3,null,null,null,{"$f":"RANK(C52,$C$50:$C$55)+COUNTIF($C$50:C52,C52)-1","v":3},1,"BZ",0]
[null,1,"CA",0,{"$f":"IF(D62=D63,INDEX($J$6:$O$11,MATCH(C62,$I$6:$I$11,0),MATCH(C63,$J$5:$O$5,0)),IF(D62=D61,INDEX($J$6:$O$11,MATCH(C62,$I$6:$I$11,0),MATCH(C61,$J$5:$O$5,0)),0))","v":0},0,{"$f":"IF(AND(F62<>F61,F62<>F63),F62,F62+VLOOKUP(C62,$A$50:$F$55,6,0)/100)","v":0},4,null,null,null,{"$f":"RANK(C53,$C$50:$C$55)+COUNTIF($C$50:C53,C53)-1","v":4},1,"CA",0]
[null,1,"CB",0,{"$f":"IF(D63=D64,INDEX($J$6:$O$11,MATCH(C63,$I$6:$I$11,0),MATCH(C64,$J$5:$O$5,0)),IF(D63=D62,INDEX($J$6:$O$11,MATCH(C63,$I$6:$I$11,0),MATCH(C62,$J$5:$O$5,0)),0))","v":0},0,{"$f":"IF(AND(F63<>F62,F63<>F64),F63,F63+VLOOKUP(C63,$A$50:$F$55,6,0)/100)","v":0},5,null,null,null,{"$f":"RANK(C54,$C$50:$C$55)+COUNTIF($C$50:C54,C54)-1","v":5},1,"CB",0]
[null,1,"CC",0,{"$f":"IF(D64=D59,INDEX($J$6:$O$11,MATCH(C64,$I$6:$I$11,0),MATCH(C59,$J$5:$O$5,0)),IF(D64=D63,INDEX($J$6:$O$11,MATCH(C64,$I$6:$I$11,0),MATCH(C63,$J$5:$O$5,0)),0))","v":0},0,{"$f":"IF(AND(F64<>F63,F64<>F59),F64,F64+VLOOKUP(C64,$A$50:$F$55,6,0)/100)","v":0},6,null,null,null,{"$f":"RANK(C55,$C$50:$C$55)+COUNTIF($C$50:C55,C55)-1","v":6},1,"CC",0]

{"sheet":"P10","index":9,"n_rows":64,"n_cols":15,"rows_kept":64,"cut":false,"hidden":false,"merged":[[0,0,0,5],[1,0,1,5],[2,0,2,5],[3,0,3,5],[13,6,14,6],[56,1,56,6],[56,12,56,14],[20,6,21,6],[27,6,28,6],[34,6,35,6],[41,6,42,6],[47,0,47,5]]}
[]
["CHAMPIONNAT DES CLUBS"]
[]
["POULE 10",null,null,null,null,null,null,null,"Récapitulatif  différence match entre 2 équipes"]
["EQUIPES",null,"POINTS","Pour","Contre","Diff",null,null,null,{"$f":"A6","v":"CD"},{"$f":"A7","v":"CE"},{"$f":"A8","v":"CF"},{"$f":"A9","v":"CG"},{"$f":"A10","v":"CH"},{"$f":"A11","v":"CI"}]
["CD","10A",{"$f":"SUM(E16,E23,E30,E37,F45)","v":0},{"$f":"I16+I23+I30+I37+J45","v":0},{"$f":"J16+J23+J30+J37+I45","v":0},{"$f":"D6-E6","v":0},null,null,{"$f":"A6","v":"CD"},null,{"$f":"IF(ISBLANK(B16),0,IFERROR(INDEX($B$15:$B$46,MATCH($I6&K$5,$K$15:$K$46,0))-INDEX($D$15:$D$46,MATCH($I6&K$5,$K$15:$K$46,0)),0-INDEX($J$6:$O$11,MATCH(K$5,$I$6:$I$11,0),MATCH($I6,$J$5:$O$5,0))))","v":0},{"$f":"IF(ISBLANK(B23),0,IFERROR(INDEX($B$15:$B$46,MATCH($I6&L$5,$K$15:$K$46,0))-INDEX($D$15:$D$46,MATCH($I6&L$5,$K$15:$K$46,0)),0-INDEX($J$6:$O$11,MATCH(L$5,$I$6:$I$11,0),MATCH($I6,$J$5:$O$5,0))))","v":0},{"$f":"IF(ISBLANK(B37),0,IFERROR(INDEX($B$15:$B$46,MATCH($I6&M$5,$K$15:$K$46,0))-INDEX($D$15:$D$46,MATCH($I6&M$5,$K$15:$K$46,0)),0-INDEX($J$6:$O$11,MATCH(M$5,$I$6:$I$11,0),MATCH($I6,$J$5:$O$5,0))))","v":0},{"$f":"IF(ISBLANK(B45),0,IFERROR(INDEX($B$15:$B$46,MATCH($I6&N$5,$K$15:$K$46,0))-INDEX($D$15:$D$46,MATCH($I6&N$5,$K$15:$K$46,0)),0-INDEX($J$6:$O$11,MATCH(N$5,$I$6:$I$11,0),MATCH($I6,$J$5:$O$5,0))))","v":0},{"$f":"IF(ISBLANK(B30),0,IFERROR(INDEX($B$15:$B$46,MATCH($I6&O$5,$K$15:$K$46,0))-INDEX($D$15:$D$46,MATCH($I6&O$5,$K$15:$K$46,0)),0-INDEX($J$6:$O$11,MATCH(O$5,$I$6:$I$11,0),MATCH($I6,$J$5:$O$5,0))))","v":0}]
["CE","10B",{"$f":"SUM(F16,E24,F32,E38,E46)","v":0},{"$f":"J16+I24+J32+I38+I46","v":0},{"$f":"I16+J24+I32+J38+J46","v":0},0,null,null,"CE",{"$f":"IF(ISBLANK(B16),0,IFERROR(INDEX($B$15:$B$46,MATCH($I7&J$5,$K$15:$K$46,0))-INDEX($D$15:$D$46,MATCH($I7&J$5,$K$15:$K$46,0)),0-INDEX($J$6:$O$11,MATCH(J$5,$I$6:$I$11,0),MATCH($I7,$J$5:$O$5,0))))","v":0},null,{"$f":"IF(ISBLANK(B32),0,IFERROR(INDEX($B$15:$B$46,MATCH($I7&L$5,$K$15:$K$46,0))-INDEX($D$15:$D$46,MATCH($I7&L$5,$K$15:$K$46,0)),0-INDEX($J$6:$O$11,MATCH(L$5,$I$6:$I$11,0),MATCH($I7,$J$5:$O$5,0))))","v":0},{"$f":"IF(ISBLANK(B46),0,IFERROR(INDEX($B$15:$B$46,MATCH($I7&M$5,$K$15:$K$46,0))-INDEX($D$15:$D$46,MATCH($I7&M$5,$K$15:$K$46,0)),0-INDEX($J$6:$O$11,MATCH(M$5,$I$6:$I$11,0),MATCH($I7,$J$5:$O$5,0))))","v":0},{"$f":"IF(ISBLANK(B24),0,IFERROR(INDEX($B$15:$B$46,MATCH($I7&N$5,$K$15:$K$46,0))-INDEX($D$15:$D$46,MATCH($I7&N$5,$K$15:$K$46,0)),0-INDEX($J$6:$O$11,MATCH(N$5,$I$6:$I$11,0),MATCH($I7,$J$5:$O$5,0))))","v":0},{"$f":"IF(ISBLANK(B38),0,IFERROR(INDEX($B$15:$B$46,MATCH($I7&O$5,$K$15:$K$46,0))-INDEX($D$15:$D$46,MATCH($I7&O$5,$K$15:$K$46,0)),0-INDEX($J$6:$O$11,MATCH(O$5,$I$6:$I$11,0),MATCH($I7,$J$5:$O$5,0))))","v":0}]
["CF","10C",{"$f":"SUM(E17,F23,E32,E39,E44)","v":0},{"$f":"I17+J23+I32+I39+I44","v":0},{"$f":"J17+I23+J32+J39+J44","v":0},0,null,null,"CF",{"$f":"IF(ISBLANK(B23),0,IFERROR(INDEX($B$15:$B$46,MATCH($I8&J$5,$K$15:$K$46,0))-INDEX($D$15:$D$46,MATCH($I8&J$5,$K$15:$K$46,0)),0-INDEX($J$6:$O$11,MATCH(J$5,$I$6:$I$11,0),MATCH($I8,$J$5:$O$5,0))))","v":0},{"$f":"IF(ISBLANK(B32),0,IFERROR(INDEX($B$15:$B$46,MATCH($I8&K$5,$K$15:$K$46,0))-INDEX($D$15:$D$46,MATCH($I8&K$5,$K$15:$K$46,0)),0-INDEX($J$6:$O$11,MATCH(K$5,$I$6:$I$11,0),MATCH($I8,$J$5:$O$5,0))))","v":0},null,{"$f":"IF(ISBLANK(B17),0,IFERROR(INDEX($B$15:$B$46,MATCH($I8&M$5,$K$15:$K$46,0))-INDEX($D$15:$D$46,MATCH($I8&M$5,$K$15:$K$46,0)),0-INDEX($J$6:$O$11,MATCH(M$5,$I$6:$I$11,0),MATCH($I8,$J$5:$O$5,0))))","v":0},{"$f":"IF(ISBLANK(B39),0,IFERROR(INDEX($B$15:$B$46,MATCH($I8&N$5,$K$15:$K$46,0))-INDEX($D$15:$D$46,MATCH($I8&N$5,$K$15:$K$46,0)),0-INDEX($J$6:$O$11,MATCH(N$5,$I$6:$I$11,0),MATCH($I8,$J$5:$O$5,0))))","v":0},{"$f":"IF(ISBLANK(B44),0,IFERROR(INDEX($B$15:$B$46,MATCH($I8&O$5,$K$15:$K$46,0))-INDEX($D$15:$D$46,MATCH($I8&O$5,$K$15:$K$46,0)),0-INDEX($J$6:$O$11,MATCH(O$5,$I$6:$I$11,0),MATCH($I8,$J$5:$O$5,0))))","v":0}]
["CG","10D",{"$f":"SUM(F17,E25,F31,F37,F46)","v":0},{"$f":"J17+I25+J31+J37+J46","v":0},{"$f":"I17+J25+I31+I37+I46","v":0},0,null,null,"CG",{"$f":"IF(ISBLANK(B37),0,IFERROR(INDEX($B$15:$B$46,MATCH($I9&J$5,$K$15:$K$46,0))-INDEX($D$15:$D$46,MATCH($I9&J$5,$K$15:$K$46,0)),0-INDEX($J$6:$O$11,MATCH(J$5,$I$6:$I$11,0),MATCH($I9,$J$5:$O$5,0))))","v":0},{"$f":"IF(ISBLANK(B46),0,IFERROR(INDEX($B$15:$B$46,MATCH($I9&K$5,$K$15:$K$46,0))-INDEX($D$15:$D$46,MATCH($I9&K$5,$K$15:$K$46,0)),0-INDEX($J$6:$O$11,MATCH(K$5,$I$6:$I$11,0),MATCH($I9,$J$5:$O$5,0))))","v":0},{"$f":"IF(ISBLANK(B17),0,IFERROR(INDEX($B$15:$B$46,MATCH($I9&L$5,$K$15:$K$46,0))-INDEX($D$15:$D$46,MATCH($I9&L$5,$K$15:$K$46,0)),0-INDEX($J$6:$O$11,MATCH(L$5,$I$6:$I$11,0),MATCH($I9,$J$5:$O$5,0))))","v":0},null,{"$f":"IF(ISBLANK(B31),0,IFERROR(INDEX($B$15:$B$46,MATCH($I9&N$5,$K$15:$K$46,0))-INDEX($D$15:$D$46,MATCH($I9&N$5,$K$15:$K$46,0)),0-INDEX($J$6:$O$11,MATCH(N$5,$I$6:$I$11,0),MATCH($I9,$J$5:$O$5,0))))","v":0},{"$f":"IF(ISBLANK(B25),0,IFERROR(INDEX($B$15:$B$46,MATCH($I9&O$5,$K$15:$K$46,0))-INDEX($D$15:$D$46,MATCH($I9&O$5,$K$15:$K$46,0)),0-INDEX($J$6:$O$11,MATCH(O$5,$I$6:$I$11,0),MATCH($I9,$J$5:$O$5,0))))","v":0}]
["CH","10E",{"$f":"SUM(E18,F24,E31,F39,E45)","v":0},{"$f":"I18+J24+I31+J39+I45","v":0},{"$f":"J18+I24+J31+I39+J45","v":0},0,null,null,"CH",{"$f":"IF(ISBLANK(B45),0,IFERROR(INDEX($B$15:$B$46,MATCH($I10&J$5,$K$15:$K$46,0))-INDEX($D$15:$D$46,MATCH($I10&J$5,$K$15:$K$46,0)),0-INDEX($J$6:$O$11,MATCH(J$5,$I$6:$I$11,0),MATCH($I10,$J$5:$O$5,0))))","v":0},{"$f":"IF(ISBLANK(B24),0,IFERROR(INDEX($B$15:$B$46,MATCH($I10&K$5,$K$15:$K$46,0))-INDEX($D$15:$D$46,MATCH($I10&K$5,$K$15:$K$46,0)),0-INDEX($J$6:$O$11,MATCH(K$5,$I$6:$I$11,0),MATCH($I10,$J$5:$O$5,0))))","v":0},{"$f":"IF(ISBLANK(B39),0,IFERROR(INDEX($B$15:$B$46,MATCH($I10&L$5,$K$15:$K$46,0))-INDEX($D$15:$D$46,MATCH($I10&L$5,$K$15:$K$46,0)),0-INDEX($J$6:$O$11,MATCH(L$5,$I$6:$I$11,0),MATCH($I10,$J$5:$O$5,0))))","v":0},{"$f":"IF(ISBLANK(B31),0,IFERROR(INDEX($B$15:$B$46,MATCH($I10&M$5,$K$15:$K$46,0))-INDEX($D$15:$D$46,MATCH($I10&M$5,$K$15:$K$46,0)),0-INDEX($J$6:$O$11,MATCH(M$5,$I$6:$I$11,0),MATCH($I10,$J$5:$O$5,0))))","v":0},null,{"$f":"IF(ISBLANK(B18),0,IFERROR(INDEX($B$15:$B$46,MATCH($I10&O$5,$K$15:$K$46,0))-INDEX($D$15:$D$46,MATCH($I10&O$5,$K$15:$K$46,0)),0-INDEX($J$6:$O$11,MATCH(O$5,$I$6:$I$11,0),MATCH($I10,$J$5:$O$5,0))))","v":0}]
["CI","10F",{"$f":"SUM(F18,F25,F30,F38,F44)","v":0},{"$f":"J18+J25+J30+J38+J44","v":0},{"$f":"I18+I25+I30+I38+I44","v":0},0,null,null,"CI",{"$f":"IF(ISBLANK(B30),0,IFERROR(INDEX($B$15:$B$46,MATCH($I11&J$5,$K$15:$K$46,0))-INDEX($D$15:$D$46,MATCH($I11&J$5,$K$15:$K$46,0)),0-INDEX($J$6:$O$11,MATCH(J$5,$I$6:$I$11,0),MATCH($I11,$J$5:$O$5,0))))","v":0},{"$f":"IF(ISBLANK(B38),0,IFERROR(INDEX($B$15:$B$46,MATCH($I11&K$5,$K$15:$K$46,0))-INDEX($D$15:$D$46,MATCH($I11&K$5,$K$15:$K$46,0)),0-INDEX($J$6:$O$11,MATCH(K$5,$I$6:$I$11,0),MATCH($I11,$J$5:$O$5,0))))","v":0},{"$f":"IF(ISBLANK(B44),0,IFERROR(INDEX($B$15:$B$46,MATCH($I11&L$5,$K$15:$K$46,0))-INDEX($D$15:$D$46,MATCH($I11&L$5,$K$15:$K$46,0)),0-INDEX($J$6:$O$11,MATCH(L$5,$I$6:$I$11,0),MATCH($I11,$J$5:$O$5,0))))","v":0},{"$f":"IF(ISBLANK(B25),0,IFERROR(INDEX($B$15:$B$46,MATCH($I11&M$5,$K$15:$K$46,0))-INDEX($D$15:$D$46,MATCH($I11&M$5,$K$15:$K$46,0)),0-INDEX($J$6:$O$11,MATCH(M$5,$I$6:$I$11,0),MATCH($I11,$J$5:$O$5,0))))","v":0},{"$f":"IF(ISBLANK(B18),0,IFERROR(INDEX($B$15:$B$46,MATCH($I11&N$5,$K$15:$K$46,0))-INDEX($D$15:$D$46,MATCH($I11&N$5,$K$15:$K$46,0)),0-INDEX($J$6:$O$11,MATCH(N$5,$I$6:$I$11,0),MATCH($I11,$J$5:$O$5,0))))","v":0}]
[null,null,null,null,null,null,null,null,"Les concaténations en rouge permettent de remplir par formules le récapitulatif au dessus"]
["1er MATCH le 15 mai","à",{"$f":"A6","v":"CD"},null,null,null,null,null,"Ce récap servira à départager les ex aequos"]
[null,null,null,null,null,null,"SI forfait éq recevante"]
["Equipes","score","Equipes","score"]
[{"$f":"$A$6","v":"CD"},null,{"$f":"$A$7","v":"CE"},{"$f":"IF(G16=19,19,IF(ISBLANK(B16),\"\",IF(B16=19,0,36-B16)))","v":""},{"$f":"IF(G16=19,0,IF(ISBLANK(B16),\"\",IF(B16<18,1,IF(B16=18,2,IF(B16>18,3)))))","v":""},{"$f":"IF(G16=19,3,IF(ISBLANK(B16),\"\",IF(B16=19,0,IF(D16<18,1,IF(D16=18,2,IF(D16>=20,3))))))","v":""},null,null,{"$f":"IF(ISBLANK(B16),0,B16)","v":0},{"$f":"IF(ISBLANK(B16),0,D16)","v":0},{"$f":"A16&C16","v":"CDCE"}]
[{"$f":"$A$8","v":"CF"},null,{"$f":"$A$9","v":"CG"},{"$f":"IF(G17=19,19,IF(ISBLANK(B17),\"\",IF(B17=19,0,36-B17)))","v":""},{"$f":"IF(G17=19,0,IF(ISBLANK(B17),\"\",IF(B17<18,1,IF(B17=18,2,IF(B17>18,3)))))","v":""},{"$f":"IF(G17=19,3,IF(ISBLANK(B17),\"\",IF(B17=19,0,IF(D17<18,1,IF(D17=18,2,IF(D17>=20,3))))))","v":""},null,null,{"$f":"IF(ISBLANK(B17),0,B17)","v":0},{"$f":"IF(ISBLANK(B17),0,D17)","v":0},{"$f":"A17&C17","v":"CFCG"}]
[{"$f":"$A$10","v":"CH"},null,{"$f":"$A$11","v":"CI"},{"$f":"IF(G18=19,19,IF(ISBLANK(B18),\"\",IF(B18=19,0,36-B18)))","v":""},{"$f":"IF(G18=19,0,IF(ISBLANK(B18),\"\",IF(B18<18,1,IF(B18=18,2,IF(B18>18,3)))))","v":""},{"$f":"IF(G18=19,3,IF(ISBLANK(B18),\"\",IF(B18=19,0,IF(D18<18,1,IF(D18=18,2,IF(D18>=20,3))))))","v":""},null,null,{"$f":"IF(ISBLANK(B18),0,B18)","v":0},{"$f":"IF(ISBLANK(B18),0,D18)","v":0},{"$f":"A18&C18","v":"CHCI"}]
[]
["2 éme MATCH le 22 mai","à",{"$f":"A7","v":"CE"}]
[null,null,null,null,null,null,"SI forfait éq recevante"]
["Equipes","score","Equipes","score"]
[{"$f":"$A$6","v":"CD"},null,{"$f":"$A$8","v":"CF"},{"$f":"IF(G23=19,19,IF(ISBLANK(B23),\"\",IF(B23=19,0,36-B23)))","v":""},{"$f":"IF(G23=19,0,IF(ISBLANK(B23),\"\",IF(B23<18,1,IF(B23=18,2,IF(B23>18,3)))))","v":""},{"$f":"IF(G23=19,3,IF(ISBLANK(B23),\"\",IF(B23=19,0,IF(D23<18,1,IF(D23=18,2,IF(D23>=20,3))))))","v":""},null,null,{"$f":"IF(ISBLANK(B23),0,B23)","v":0},{"$f":"IF(ISBLANK(B23),0,D23)","v":0},{"$f":"A23&C23","v":"CDCF"}]
[{"$f":"$A$7","v":"CE"},null,{"$f":"$A$10","v":"CH"},{"$f":"IF(G24=19,19,IF(ISBLANK(B24),\"\",IF(B24=19,0,36-B24)))","v":""},{"$f":"IF(G24=19,0,IF(ISBLANK(B24),\"\",IF(B24<18,1,IF(B24=18,2,IF(B24>18,3)))))","v":""},{"$f":"IF(G24=19,3,IF(ISBLANK(B24),\"\",IF(B24=19,0,IF(D24<18,1,IF(D24=18,2,IF(D24>=20,3))))))","v":""},null,null,{"$f":"IF(ISBLANK(B24),0,B24)","v":0},{"$f":"IF(ISBLANK(B24),0,D24)","v":0},{"$f":"A24&C24","v":"CECH"}]
[{"$f":"$A$9","v":"CG"},null,{"$f":"$A$11","v":"CI"},{"$f":"IF(G25=19,19,IF(ISBLANK(B25),\"\",IF(B25=19,0,36-B25)))","v":""},{"$f":"IF(G25=19,0,IF(ISBLANK(B25),\"\",IF(B25<18,1,IF(B25=18,2,IF(B25>18,3)))))","v":""},{"$f":"IF(G25=19,3,IF(ISBLANK(B25),\"\",IF(B25=19,0,IF(D25<18,1,IF(D25=18,2,IF(D25>=20,3))))))","v":""},null,null,{"$f":"IF(ISBLANK(B25),0,B25)","v":0},{"$f":"IF(ISBLANK(B25),0,D25)","v":0},{"$f":"A25&C25","v":"CGCI"}]
[]
["3 éme MATCH le 29 mai","à",{"$f":"A8","v":"CF"}]
[null,null,null,null,null,null,"SI forfait éq recevante"]
["Equipes","score","Equipes","score"]
[{"$f":"$A$6","v":"CD"},null,{"$f":"$A$11","v":"CI"},{"$f":"IF(G30=19,19,IF(ISBLANK(B30),\"\",IF(B30=19,0,36-B30)))","v":""},{"$f":"IF(G30=19,0,IF(ISBLANK(B30),\"\",IF(B30<18,1,IF(B30=18,2,IF(B30>18,3)))))","v":""},{"$f":"IF(G30=19,3,IF(ISBLANK(B30),\"\",IF(B30=19,0,IF(D30<18,1,IF(D30=18,2,IF(D30>=20,3))))))","v":""},null,null,{"$f":"IF(ISBLANK(B30),0,B30)","v":0},{"$f":"IF(ISBLANK(B30),0,D30)","v":0},{"$f":"A30&C30","v":"CDCI"}]
[{"$f":"$A$10","v":"CH"},null,{"$f":"$A$9","v":"CG"},{"$f":"IF(G31=19,19,IF(ISBLANK(B31),\"\",IF(B31=19,0,36-B31)))","v":""},{"$f":"IF(G31=19,0,IF(ISBLANK(B31),\"\",IF(B31<18,1,IF(B31=18,2,IF(B31>18,3)))))","v":""},{"$f":"IF(G31=19,3,IF(ISBLANK(B31),\"\",IF(B31=19,0,IF(D31<18,1,IF(D31=18,2,IF(D31>=20,3))))))","v":""},null,null,{"$f":"IF(ISBLANK(B31),0,B31)","v":0},{"$f":"IF(ISBLANK(B31),0,D31)","v":0},{"$f":"A31&C31","v":"CHCG"}]
[{"$f":"$A$8","v":"CF"},null,{"$f":"$A$7","v":"CE"},{"$f":"IF(G32=19,19,IF(ISBLANK(B32),\"\",IF(B32=19,0,36-B32)))","v":""},{"$f":"IF(G32=19,0,IF(ISBLANK(B32),\"\",IF(B32<18,1,IF(B32=18,2,IF(B32>18,3)))))","v":""},{"$f":"IF(G32=19,3,IF(ISBLANK(B32),\"\",IF(B32=19,0,IF(D32<18,1,IF(D32=18,2,IF(D32>=20,3))))))","v":""},null,null,{"$f":"IF(ISBLANK(B32),0,B32)","v":0},{"$f":"IF(ISBLANK(B32),0,D32)","v":0},{"$f":"A32&C32","v":"CFCE"}]
[]
["4 éme MATCH le 5 juin","à",{"$f":"A9","v":"CG"}]
[null,null,null,null,null,null,"SI forfait éq recevante"]
["Equipes","score","Equipes","score"]
[{"$f":"A6","v":"CD"},null,{"$f":"$A$9","v":"CG"},{"$f":"IF(G37=19,19,IF(ISBLANK(B37),\"\",IF(B37=19,0,36-B37)))","v":""},{"$f":"IF(G37=19,0,IF(ISBLANK(B37),\"\",IF(B37<18,1,IF(B37=18,2,IF(B37>18,3)))))","v":""},{"$f":"IF(G37=19,3,IF(ISBLANK(B37),\"\",IF(B37=19,0,IF(D37<18,1,IF(D37=18,2,IF(D37>=20,3))))))","v":""},null,null,{"$f":"IF(ISBLANK(B37),0,B37)","v":0},{"$f":"IF(ISBLANK(B37),0,D37)","v":0},{"$f":"A37&C37","v":"CDCG"}]
[{"$f":"$A$7","v":"CE"},null,{"$f":"$A$11","v":"CI"},{"$f":"IF(G38=19,19,IF(ISBLANK(B38),\"\",IF(B38=19,0,36-B38)))","v":""},{"$f":"IF(G38=19,0,IF(ISBLANK(B38),\"\",IF(B38<18,1,IF(B38=18,2,IF(B38>18,3)))))","v":""},{"$f":"IF(G38=19,3,IF(ISBLANK(B38),\"\",IF(B38=19,0,IF(D38<18,1,IF(D38=18,2,IF(D38>=20,3))))))","v":""},null,null,{"$f":"IF(ISBLANK(B38),0,B38)","v":0},{"$f":"IF(ISBLANK(B38),0,D38)","v":0},{"$f":"A38&C38","v":"CECI"}]
[{"$f":"A8","v":"CF"},null,{"$f":"$A$10","v":"CH"},{"$f":"IF(G39=19,19,IF(ISBLANK(B39),\"\",IF(B39=19,0,36-B39)))","v":""},{"$f":"IF(G39=19,0,IF(ISBLANK(B39),\"\",IF(B39<18,1,IF(B39=18,2,IF(B39>18,3)))))","v":""},{"$f":"IF(G39=19,3,IF(ISBLANK(B39),\"\",IF(B39=19,0,IF(D39<18,1,IF(D39=18,2,IF(D39>=20,3))))))","v":""},null,null,{"$f":"IF(ISBLANK(B39),0,B39)","v":0},{"$f":"IF(ISBLANK(B39),0,D39)","v":0},{"$f":"A39&C39","v":"CFCH"}]
[]
["5 éme MATCH le 12 juin","à",{"$f":"A10","v":"CH"}]
[null,null,null,null,null,null,"SI forfait éq recevante"]
["Equipes","score","Equipes","score"]
[{"$f":"A8","v":"CF"},null,{"$f":"$A$11","v":"CI"},{"$f":"IF(G44=19,19,IF(ISBLANK(B44),\"\",IF(B44=19,0,36-B44)))","v":""},{"$f":"IF(G44=19,0,IF(ISBLANK(B44),\"\",IF(B44<18,1,IF(B44=18,2,IF(B44>18,3)))))","v":""},{"$f":"IF(G44=19,3,IF(ISBLANK(B44),\"\",IF(B44=19,0,IF(D44<18,1,IF(D44=18,2,IF(D44>=20,3))))))","v":""},null,null,{"$f":"IF(ISBLANK(B44),0,B44)","v":0},{"$f":"IF(ISBLANK(B44),0,D44)","v":0},{"$f":"A44&C44","v":"CFCI"}]
[{"$f":"$A$10","v":"CH"},null,{"$f":"A6","v":"CD"},{"$f":"IF(G45=19,19,IF(ISBLANK(B45),\"\",IF(B45=19,0,36-B45)))","v":""},{"$f":"IF(G45=19,0,IF(ISBLANK(B45),\"\",IF(B45<18,1,IF(B45=18,2,IF(B45>18,3)))))","v":""},{"$f":"IF(G45=19,3,IF(ISBLANK(B45),\"\",IF(B45=19,0,IF(D45<18,1,IF(D45=18,2,IF(D45>=20,3))))))","v":""},null,null,{"$f":"IF(ISBLANK(B45),0,B45)","v":0},{"$f":"IF(ISBLANK(B45),0,D45)","v":0},{"$f":"A45&C45","v":"CHCD"}]
[{"$f":"A7","v":"CE"},null,{"$f":"$A$9","v":"CG"},{"$f":"IF(G46=19,19,IF(ISBLANK(B46),\"\",IF(B46=19,0,36-B46)))","v":""},{"$f":"IF(G46=19,0,IF(ISBLANK(B46),\"\",IF(B46<18,1,IF(B46=18,2,IF(B46>18,3)))))","v":""},{"$f":"IF(G46=19,3,IF(ISBLANK(B46),\"\",IF(B46=19,0,IF(D46<18,1,IF(D46=18,2,IF(D46>=20,3))))))","v":""},null,null,{"$f":"IF(ISBLANK(B46),0,B46)","v":0},{"$f":"IF(ISBLANK(B46),0,D46)","v":0},{"$f":"A46&C46","v":"CECG"}]
[]
["CLASSEMENT"]
["EQUIPES",null,"POINTS","Pour","Contre","Diff","CLASST"]
["CD","10A",0,0,0,0,{"$f":"B59","v":1},{"$f":"IF(AND(G50=1,COUNTIF(rang1,1)>1),COUNTIF(G$50:G50,1),IF(AND(G50=2,COUNTIF(rang1,2)>1),COUNTIF(G$50:G50,2)+3,\"\"))","v":1}]
["CE","10B",0,0,0,0,1,{"$f":"IF(AND(G51=1,COUNTIF(rang1,1)>1),COUNTIF(G$50:G51,1),IF(AND(G51=2,COUNTIF(rang1,2)>1),COUNTIF(G$50:G51,2)+3,\"\"))","v":2}]
["CF","10C",0,0,0,0,1,{"$f":"IF(AND(G52=1,COUNTIF(rang1,1)>1),COUNTIF(G$50:G52,1),IF(AND(G52=2,COUNTIF(rang1,2)>1),COUNTIF(G$50:G52,2)+3,\"\"))","v":3}]
["CG","10D",0,0,0,0,1,{"$f":"IF(AND(G53=1,COUNTIF(rang1,1)>1),COUNTIF(G$50:G53,1),IF(AND(G53=2,COUNTIF(rang1,2)>1),COUNTIF(G$50:G53,2)+3,\"\"))","v":4}]
["CH","10E",0,0,0,0,1,{"$f":"IF(AND(G54=1,COUNTIF(rang1,1)>1),COUNTIF(G$50:G54,1),IF(AND(G54=2,COUNTIF(rang1,2)>1),COUNTIF(G$50:G54,2)+3,\"\"))","v":5}]
["CI","10F",0,0,0,0,1,{"$f":"IF(AND(G55=1,COUNTIF(rang1,1)>1),COUNTIF(G$50:G55,1),IF(AND(G55=2,COUNTIF(rang1,2)>1),COUNTIF(G$50:G55,2)+3,\"\"))","v":6}]
[]
[null,"CLASSEMENT FINAL et DEPARTAGE EX AEQUOS",null,null,null,null,null,null,null,null,null,null,"CLASSEMENT"]
[null,"Rang","Equipes","Pts","diff pts avec exaequo","cumul","departage goalaverage si même cumul","RP",null,null,null,"RP","Rang","Equipe","Pts"]
[null,{"$f":"RANK(G59,$G$59:$G$64)","v":1},{"$f":"INDEX($A$50:$A$55,MATCH(H59,$L$59:$L$64,0))","v":"CD"},{"$f":"VLOOKUP(C59,$A$50:$C$55,3,0)","v":0},{"$f":"IF(D59=D60,INDEX($J$6:$O$11,MATCH(C59,$I$6:$I$11,0),MATCH(C60,$J$5:$O$5,0)),IF(D59=D58,INDEX($J$6:$O$11,MATCH(C59,$I$6:$I$11,0),MATCH(C58,$J$5:$O$5,0)),0))","v":0},{"$f":"D59+E59/100","v":0},{"$f":"IF(AND(F59<>F58,F59<>F60),F59,F59+VLOOKUP(C59,$A$50:$F$55,6,0)/100)","v":0},1,null,null,null,{"$f":"RANK(C50,$C$50:$C$55)+COUNTIF($C$50:C50,C50)-1","v":1},{"$f":"B59","v":1},"CD",{"$f":"VLOOKUP(N59,$C$59:$D$64,2,0)","v":0}]
[null,1,"CE",0,{"$f":"IF(D60=D61,INDEX($J$6:$O$11,MATCH(C60,$I$6:$I$11,0),MATCH(C61,$J$5:$O$5,0)),IF(D60=D59,INDEX($J$6:$O$11,MATCH(C60,$I$6:$I$11,0),MATCH(C59,$J$5:$O$5,0)),0))","v":0},0,{"$f":"IF(AND(F60<>F59,F60<>F61),F60,F60+VLOOKUP(C60,$A$50:$F$55,6,0)/100)","v":0},2,null,null,null,{"$f":"RANK(C51,$C$50:$C$55)+COUNTIF($C$50:C51,C51)-1","v":2},1,"CE",0]
[null,1,"CF",0,{"$f":"IF(D61=D62,INDEX($J$6:$O$11,MATCH(C61,$I$6:$I$11,0),MATCH(C62,$J$5:$O$5,0)),IF(D61=D60,INDEX($J$6:$O$11,MATCH(C61,$I$6:$I$11,0),MATCH(C60,$J$5:$O$5,0)),0))","v":0},0,{"$f":"IF(AND(F61<>F60,F61<>F62),F61,F61+VLOOKUP(C61,$A$50:$F$55,6,0)/100)","v":0},3,null,null,null,{"$f":"RANK(C52,$C$50:$C$55)+COUNTIF($C$50:C52,C52)-1","v":3},1,"CF",0]
[null,1,"CG",0,{"$f":"IF(D62=D63,INDEX($J$6:$O$11,MATCH(C62,$I$6:$I$11,0),MATCH(C63,$J$5:$O$5,0)),IF(D62=D61,INDEX($J$6:$O$11,MATCH(C62,$I$6:$I$11,0),MATCH(C61,$J$5:$O$5,0)),0))","v":0},0,{"$f":"IF(AND(F62<>F61,F62<>F63),F62,F62+VLOOKUP(C62,$A$50:$F$55,6,0)/100)","v":0},4,null,null,null,{"$f":"RANK(C53,$C$50:$C$55)+COUNTIF($C$50:C53,C53)-1","v":4},1,"CG",0]
[null,1,"CH",0,{"$f":"IF(D63=D64,INDEX($J$6:$O$11,MATCH(C63,$I$6:$I$11,0),MATCH(C64,$J$5:$O$5,0)),IF(D63=D62,INDEX($J$6:$O$11,MATCH(C63,$I$6:$I$11,0),MATCH(C62,$J$5:$O$5,0)),0))","v":0},0,{"$f":"IF(AND(F63<>F62,F63<>F64),F63,F63+VLOOKUP(C63,$A$50:$F$55,6,0)/100)","v":0},5,null,null,null,{"$f":"RANK(C54,$C$50:$C$55)+COUNTIF($C$50:C54,C54)-1","v":5},1,"CH",0]
[null,1,"CI",0,{"$f":"IF(D64=D59,INDEX($J$6:$O$11,MATCH(C64,$I$6:$I$11,0),MATCH(C59,$J$5:$O$5,0)),IF(D64=D63,INDEX($J$6:$O$11,MATCH(C64,$I$6:$I$11,0),MATCH(C63,$J$5:$O$5,0)),0))","v":0},0,{"$f":"IF(AND(F64<>F63,F64<>F59),F64,F64+VLOOKUP(C64,$A$50:$F$55,6,0)/100)","v":0},6,null,null,null,{"$f":"RANK(C55,$C$50:$C$55)+COUNTIF($C$50:C55,C55)-1","v":6},1,"CI",0]

{"sheet":"P11","index":10,"n_rows":64,"n_cols":15,"rows_kept":64,"cut":false,"hidden":false,"merged":[[0,0,0,5],[1,0,1,5],[2,0,2,5],[3,0,3,5],[13,6,14,6],[56,1,56,6],[56,12,56,14],[20,6,21,6],[27,6,28,6],[34,6,35,6],[41,6,42,6],[47,0,47,5]]}
[]
["CHAMPIONNAT DES CLUBS"]
[]
["POULE 11",null,null,null,null,null,null,null,"Récapitulatif  différence match entre 2 équipes"]
["EQUIPES",null,"POINTS","Pour","Contre","Diff",null,null,null,{"$f":"A6","v":"CJ"},{"$f":"A7","v":"CK"},{"$f":"A8","v":"CL"},{"$f":"A9","v":"CM"},{"$f":"A10","v":"CN"},{"$f":"A11","v":"CO"}]
["CJ","11A",{"$f":"SUM(E16,E23,E30,E37,F45)","v":0},{"$f":"I16+I23+I30+I37+J45","v":0},{"$f":"J16+J23+J30+J37+I45","v":0},{"$f":"D6-E6","v":0},null,null,{"$f":"A6","v":"CJ"},null,{"$f":"IF(ISBLANK(B16),0,IFERROR(INDEX($B$15:$B$46,MATCH($I6&K$5,$K$15:$K$46,0))-INDEX($D$15:$D$46,MATCH($I6&K$5,$K$15:$K$46,0)),0-INDEX($J$6:$O$11,MATCH(K$5,$I$6:$I$11,0),MATCH($I6,$J$5:$O$5,0))))","v":0},{"$f":"IF(ISBLANK(B23),0,IFERROR(INDEX($B$15:$B$46,MATCH($I6&L$5,$K$15:$K$46,0))-INDEX($D$15:$D$46,MATCH($I6&L$5,$K$15:$K$46,0)),0-INDEX($J$6:$O$11,MATCH(L$5,$I$6:$I$11,0),MATCH($I6,$J$5:$O$5,0))))","v":0},{"$f":"IF(ISBLANK(B37),0,IFERROR(INDEX($B$15:$B$46,MATCH($I6&M$5,$K$15:$K$46,0))-INDEX($D$15:$D$46,MATCH($I6&M$5,$K$15:$K$46,0)),0-INDEX($J$6:$O$11,MATCH(M$5,$I$6:$I$11,0),MATCH($I6,$J$5:$O$5,0))))","v":0},{"$f":"IF(ISBLANK(B45),0,IFERROR(INDEX($B$15:$B$46,MATCH($I6&N$5,$K$15:$K$46,0))-INDEX($D$15:$D$46,MATCH($I6&N$5,$K$15:$K$46,0)),0-INDEX($J$6:$O$11,MATCH(N$5,$I$6:$I$11,0),MATCH($I6,$J$5:$O$5,0))))","v":0},{"$f":"IF(ISBLANK(B30),0,IFERROR(INDEX($B$15:$B$46,MATCH($I6&O$5,$K$15:$K$46,0))-INDEX($D$15:$D$46,MATCH($I6&O$5,$K$15:$K$46,0)),0-INDEX($J$6:$O$11,MATCH(O$5,$I$6:$I$11,0),MATCH($I6,$J$5:$O$5,0))))","v":0}]
["CK","11B",{"$f":"SUM(F16,E24,F32,E38,E46)","v":0},{"$f":"J16+I24+J32+I38+I46","v":0},{"$f":"I16+J24+I32+J38+J46","v":0},0,null,null,"CK",{"$f":"IF(ISBLANK(B16),0,IFERROR(INDEX($B$15:$B$46,MATCH($I7&J$5,$K$15:$K$46,0))-INDEX($D$15:$D$46,MATCH($I7&J$5,$K$15:$K$46,0)),0-INDEX($J$6:$O$11,MATCH(J$5,$I$6:$I$11,0),MATCH($I7,$J$5:$O$5,0))))","v":0},null,{"$f":"IF(ISBLANK(B32),0,IFERROR(INDEX($B$15:$B$46,MATCH($I7&L$5,$K$15:$K$46,0))-INDEX($D$15:$D$46,MATCH($I7&L$5,$K$15:$K$46,0)),0-INDEX($J$6:$O$11,MATCH(L$5,$I$6:$I$11,0),MATCH($I7,$J$5:$O$5,0))))","v":0},{"$f":"IF(ISBLANK(B46),0,IFERROR(INDEX($B$15:$B$46,MATCH($I7&M$5,$K$15:$K$46,0))-INDEX($D$15:$D$46,MATCH($I7&M$5,$K$15:$K$46,0)),0-INDEX($J$6:$O$11,MATCH(M$5,$I$6:$I$11,0),MATCH($I7,$J$5:$O$5,0))))","v":0},{"$f":"IF(ISBLANK(B24),0,IFERROR(INDEX($B$15:$B$46,MATCH($I7&N$5,$K$15:$K$46,0))-INDEX($D$15:$D$46,MATCH($I7&N$5,$K$15:$K$46,0)),0-INDEX($J$6:$O$11,MATCH(N$5,$I$6:$I$11,0),MATCH($I7,$J$5:$O$5,0))))","v":0},{"$f":"IF(ISBLANK(B38),0,IFERROR(INDEX($B$15:$B$46,MATCH($I7&O$5,$K$15:$K$46,0))-INDEX($D$15:$D$46,MATCH($I7&O$5,$K$15:$K$46,0)),0-INDEX($J$6:$O$11,MATCH(O$5,$I$6:$I$11,0),MATCH($I7,$J$5:$O$5,0))))","v":0}]
["CL","11C",{"$f":"SUM(E17,F23,E32,E39,E44)","v":0},{"$f":"I17+J23+I32+I39+I44","v":0},{"$f":"J17+I23+J32+J39+J44","v":0},0,null,null,"CL",{"$f":"IF(ISBLANK(B23),0,IFERROR(INDEX($B$15:$B$46,MATCH($I8&J$5,$K$15:$K$46,0))-INDEX($D$15:$D$46,MATCH($I8&J$5,$K$15:$K$46,0)),0-INDEX($J$6:$O$11,MATCH(J$5,$I$6:$I$11,0),MATCH($I8,$J$5:$O$5,0))))","v":0},{"$f":"IF(ISBLANK(B32),0,IFERROR(INDEX($B$15:$B$46,MATCH($I8&K$5,$K$15:$K$46,0))-INDEX($D$15:$D$46,MATCH($I8&K$5,$K$15:$K$46,0)),0-INDEX($J$6:$O$11,MATCH(K$5,$I$6:$I$11,0),MATCH($I8,$J$5:$O$5,0))))","v":0},null,{"$f":"IF(ISBLANK(B17),0,IFERROR(INDEX($B$15:$B$46,MATCH($I8&M$5,$K$15:$K$46,0))-INDEX($D$15:$D$46,MATCH($I8&M$5,$K$15:$K$46,0)),0-INDEX($J$6:$O$11,MATCH(M$5,$I$6:$I$11,0),MATCH($I8,$J$5:$O$5,0))))","v":0},{"$f":"IF(ISBLANK(B39),0,IFERROR(INDEX($B$15:$B$46,MATCH($I8&N$5,$K$15:$K$46,0))-INDEX($D$15:$D$46,MATCH($I8&N$5,$K$15:$K$46,0)),0-INDEX($J$6:$O$11,MATCH(N$5,$I$6:$I$11,0),MATCH($I8,$J$5:$O$5,0))))","v":0},{"$f":"IF(ISBLANK(B44),0,IFERROR(INDEX($B$15:$B$46,MATCH($I8&O$5,$K$15:$K$46,0))-INDEX($D$15:$D$46,MATCH($I8&O$5,$K$15:$K$46,0)),0-INDEX($J$6:$O$11,MATCH(O$5,$I$6:$I$11,0),MATCH($I8,$J$5:$O$5,0))))","v":0}]
["CM","11D",{"$f":"SUM(F17,E25,F31,F37,F46)","v":0},{"$f":"J17+I25+J31+J37+J46","v":0},{"$f":"I17+J25+I31+I37+I46","v":0},0,null,null,"CM",{"$f":"IF(ISBLANK(B37),0,IFERROR(INDEX($B$15:$B$46,MATCH($I9&J$5,$K$15:$K$46,0))-INDEX($D$15:$D$46,MATCH($I9&J$5,$K$15:$K$46,0)),0-INDEX($J$6:$O$11,MATCH(J$5,$I$6:$I$11,0),MATCH($I9,$J$5:$O$5,0))))","v":0},{"$f":"IF(ISBLANK(B46),0,IFERROR(INDEX($B$15:$B$46,MATCH($I9&K$5,$K$15:$K$46,0))-INDEX($D$15:$D$46,MATCH($I9&K$5,$K$15:$K$46,0)),0-INDEX($J$6:$O$11,MATCH(K$5,$I$6:$I$11,0),MATCH($I9,$J$5:$O$5,0))))","v":0},{"$f":"IF(ISBLANK(B17),0,IFERROR(INDEX($B$15:$B$46,MATCH($I9&L$5,$K$15:$K$46,0))-INDEX($D$15:$D$46,MATCH($I9&L$5,$K$15:$K$46,0)),0-INDEX($J$6:$O$11,MATCH(L$5,$I$6:$I$11,0),MATCH($I9,$J$5:$O$5,0))))","v":0},null,{"$f":"IF(ISBLANK(B31),0,IFERROR(INDEX($B$15:$B$46,MATCH($I9&N$5,$K$15:$K$46,0))-INDEX($D$15:$D$46,MATCH($I9&N$5,$K$15:$K$46,0)),0-INDEX($J$6:$O$11,MATCH(N$5,$I$6:$I$11,0),MATCH($I9,$J$5:$O$5,0))))","v":0},{"$f":"IF(ISBLANK(B25),0,IFERROR(INDEX($B$15:$B$46,MATCH($I9&O$5,$K$15:$K$46,0))-INDEX($D$15:$D$46,MATCH($I9&O$5,$K$15:$K$46,0)),0-INDEX($J$6:$O$11,MATCH(O$5,$I$6:$I$11,0),MATCH($I9,$J$5:$O$5,0))))","v":0}]
["CN","11E",{"$f":"SUM(E18,F24,E31,F39,E45)","v":0},{"$f":"I18+J24+I31+J39+I45","v":0},{"$f":"J18+I24+J31+I39+J45","v":0},0,null,null,"CN",{"$f":"IF(ISBLANK(B45),0,IFERROR(INDEX($B$15:$B$46,MATCH($I10&J$5,$K$15:$K$46,0))-INDEX($D$15:$D$46,MATCH($I10&J$5,$K$15:$K$46,0)),0-INDEX($J$6:$O$11,MATCH(J$5,$I$6:$I$11,0),MATCH($I10,$J$5:$O$5,0))))","v":0},{"$f":"IF(ISBLANK(B24),0,IFERROR(INDEX($B$15:$B$46,MATCH($I10&K$5,$K$15:$K$46,0))-INDEX($D$15:$D$46,MATCH($I10&K$5,$K$15:$K$46,0)),0-INDEX($J$6:$O$11,MATCH(K$5,$I$6:$I$11,0),MATCH($I10,$J$5:$O$5,0))))","v":0},{"$f":"IF(ISBLANK(B39),0,IFERROR(INDEX($B$15:$B$46,MATCH($I10&L$5,$K$15:$K$46,0))-INDEX($D$15:$D$46,MATCH($I10&L$5,$K$15:$K$46,0)),0-INDEX($J$6:$O$11,MATCH(L$5,$I$6:$I$11,0),MATCH($I10,$J$5:$O$5,0))))","v":0},{"$f":"IF(ISBLANK(B31),0,IFERROR(INDEX($B$15:$B$46,MATCH($I10&M$5,$K$15:$K$46,0))-INDEX($D$15:$D$46,MATCH($I10&M$5,$K$15:$K$46,0)),0-INDEX($J$6:$O$11,MATCH(M$5,$I$6:$I$11,0),MATCH($I10,$J$5:$O$5,0))))","v":0},null,{"$f":"IF(ISBLANK(B18),0,IFERROR(INDEX($B$15:$B$46,MATCH($I10&O$5,$K$15:$K$46,0))-INDEX($D$15:$D$46,MATCH($I10&O$5,$K$15:$K$46,0)),0-INDEX($J$6:$O$11,MATCH(O$5,$I$6:$I$11,0),MATCH($I10,$J$5:$O$5,0))))","v":0}]
["CO","11F",{"$f":"SUM(F18,F25,F30,F38,F44)","v":0},{"$f":"J18+J25+J30+J38+J44","v":0},{"$f":"I18+I25+I30+I38+I44","v":0},0,null,null,"CO",{"$f":"IF(ISBLANK(B30),0,IFERROR(INDEX($B$15:$B$46,MATCH($I11&J$5,$K$15:$K$46,0))-INDEX($D$15:$D$46,MATCH($I11&J$5,$K$15:$K$46,0)),0-INDEX($J$6:$O$11,MATCH(J$5,$I$6:$I$11,0),MATCH($I11,$J$5:$O$5,0))))","v":0},{"$f":"IF(ISBLANK(B38),0,IFERROR(INDEX($B$15:$B$46,MATCH($I11&K$5,$K$15:$K$46,0))-INDEX($D$15:$D$46,MATCH($I11&K$5,$K$15:$K$46,0)),0-INDEX($J$6:$O$11,MATCH(K$5,$I$6:$I$11,0),MATCH($I11,$J$5:$O$5,0))))","v":0},{"$f":"IF(ISBLANK(B44),0,IFERROR(INDEX($B$15:$B$46,MATCH($I11&L$5,$K$15:$K$46,0))-INDEX($D$15:$D$46,MATCH($I11&L$5,$K$15:$K$46,0)),0-INDEX($J$6:$O$11,MATCH(L$5,$I$6:$I$11,0),MATCH($I11,$J$5:$O$5,0))))","v":0},{"$f":"IF(ISBLANK(B25),0,IFERROR(INDEX($B$15:$B$46,MATCH($I11&M$5,$K$15:$K$46,0))-INDEX($D$15:$D$46,MATCH($I11&M$5,$K$15:$K$46,0)),0-INDEX($J$6:$O$11,MATCH(M$5,$I$6:$I$11,0),MATCH($I11,$J$5:$O$5,0))))","v":0},{"$f":"IF(ISBLANK(B18),0,IFERROR(INDEX($B$15:$B$46,MATCH($I11&N$5,$K$15:$K$46,0))-INDEX($D$15:$D$46,MATCH($I11&N$5,$K$15:$K$46,0)),0-INDEX($J$6:$O$11,MATCH(N$5,$I$6:$I$11,0),MATCH($I11,$J$5:$O$5,0))))","v":0}]
[null,null,null,null,null,null,null,null,"Les concaténations en rouge permettent de remplir par formules le récapitulatif au dessus"]
["1er MATCH le 15 mai","à",{"$f":"A6","v":"CJ"},null,null,null,null,null,"Ce récap servira à départager les ex aequos"]
[null,null,null,null,null,null,"SI forfait éq recevante"]
["Equipes","score","Equipes","score"]
[{"$f":"$A$6","v":"CJ"},null,{"$f":"$A$7","v":"CK"},{"$f":"IF(G16=19,19,IF(ISBLANK(B16),\"\",IF(B16=19,0,36-B16)))","v":""},{"$f":"IF(G16=19,0,IF(ISBLANK(B16),\"\",IF(B16<18,1,IF(B16=18,2,IF(B16>18,3)))))","v":""},{"$f":"IF(G16=19,3,IF(ISBLANK(B16),\"\",IF(B16=19,0,IF(D16<18,1,IF(D16=18,2,IF(D16>=20,3))))))","v":""},null,null,{"$f":"IF(ISBLANK(B16),0,B16)","v":0},{"$f":"IF(ISBLANK(B16),0,D16)","v":0},{"$f":"A16&C16","v":"CJCK"}]
[{"$f":"$A$8","v":"CL"},null,{"$f":"$A$9","v":"CM"},{"$f":"IF(G17=19,19,IF(ISBLANK(B17),\"\",IF(B17=19,0,36-B17)))","v":""},{"$f":"IF(G17=19,0,IF(ISBLANK(B17),\"\",IF(B17<18,1,IF(B17=18,2,IF(B17>18,3)))))","v":""},{"$f":"IF(G17=19,3,IF(ISBLANK(B17),\"\",IF(B17=19,0,IF(D17<18,1,IF(D17=18,2,IF(D17>=20,3))))))","v":""},null,null,{"$f":"IF(ISBLANK(B17),0,B17)","v":0},{"$f":"IF(ISBLANK(B17),0,D17)","v":0},{"$f":"A17&C17","v":"CLCM"}]
[{"$f":"$A$10","v":"CN"},null,{"$f":"$A$11","v":"CO"},{"$f":"IF(G18=19,19,IF(ISBLANK(B18),\"\",IF(B18=19,0,36-B18)))","v":""},{"$f":"IF(G18=19,0,IF(ISBLANK(B18),\"\",IF(B18<18,1,IF(B18=18,2,IF(B18>18,3)))))","v":""},{"$f":"IF(G18=19,3,IF(ISBLANK(B18),\"\",IF(B18=19,0,IF(D18<18,1,IF(D18=18,2,IF(D18>=20,3))))))","v":""},null,null,{"$f":"IF(ISBLANK(B18),0,B18)","v":0},{"$f":"IF(ISBLANK(B18),0,D18)","v":0},{"$f":"A18&C18","v":"CNCO"}]
[]
["2 éme MATCH le 22 mai","à",{"$f":"A7","v":"CK"}]
[null,null,null,null,null,null,"SI forfait éq recevante"]
["Equipes","score","Equipes","score"]
[{"$f":"$A$6","v":"CJ"},null,{"$f":"$A$8","v":"CL"},{"$f":"IF(G23=19,19,IF(ISBLANK(B23),\"\",IF(B23=19,0,36-B23)))","v":""},{"$f":"IF(G23=19,0,IF(ISBLANK(B23),\"\",IF(B23<18,1,IF(B23=18,2,IF(B23>18,3)))))","v":""},{"$f":"IF(G23=19,3,IF(ISBLANK(B23),\"\",IF(B23=19,0,IF(D23<18,1,IF(D23=18,2,IF(D23>=20,3))))))","v":""},null,null,{"$f":"IF(ISBLANK(B23),0,B23)","v":0},{"$f":"IF(ISBLANK(B23),0,D23)","v":0},{"$f":"A23&C23","v":"CJCL"}]
[{"$f":"$A$7","v":"CK"},null,{"$f":"$A$10","v":"CN"},{"$f":"IF(G24=19,19,IF(ISBLANK(B24),\"\",IF(B24=19,0,36-B24)))","v":""},{"$f":"IF(G24=19,0,IF(ISBLANK(B24),\"\",IF(B24<18,1,IF(B24=18,2,IF(B24>18,3)))))","v":""},{"$f":"IF(G24=19,3,IF(ISBLANK(B24),\"\",IF(B24=19,0,IF(D24<18,1,IF(D24=18,2,IF(D24>=20,3))))))","v":""},null,null,{"$f":"IF(ISBLANK(B24),0,B24)","v":0},{"$f":"IF(ISBLANK(B24),0,D24)","v":0},{"$f":"A24&C24","v":"CKCN"}]
[{"$f":"$A$9","v":"CM"},null,{"$f":"$A$11","v":"CO"},{"$f":"IF(G25=19,19,IF(ISBLANK(B25),\"\",IF(B25=19,0,36-B25)))","v":""},{"$f":"IF(G25=19,0,IF(ISBLANK(B25),\"\",IF(B25<18,1,IF(B25=18,2,IF(B25>18,3)))))","v":""},{"$f":"IF(G25=19,3,IF(ISBLANK(B25),\"\",IF(B25=19,0,IF(D25<18,1,IF(D25=18,2,IF(D25>=20,3))))))","v":""},null,null,{"$f":"IF(ISBLANK(B25),0,B25)","v":0},{"$f":"IF(ISBLANK(B25),0,D25)","v":0},{"$f":"A25&C25","v":"CMCO"}]
[]
["3 éme MATCH le 29 mai","à",{"$f":"A8","v":"CL"}]
[null,null,null,null,null,null,"SI forfait éq recevante"]
["Equipes","score","Equipes","score"]
[{"$f":"$A$6","v":"CJ"},null,{"$f":"$A$11","v":"CO"},{"$f":"IF(G30=19,19,IF(ISBLANK(B30),\"\",IF(B30=19,0,36-B30)))","v":""},{"$f":"IF(G30=19,0,IF(ISBLANK(B30),\"\",IF(B30<18,1,IF(B30=18,2,IF(B30>18,3)))))","v":""},{"$f":"IF(G30=19,3,IF(ISBLANK(B30),\"\",IF(B30=19,0,IF(D30<18,1,IF(D30=18,2,IF(D30>=20,3))))))","v":""},null,null,{"$f":"IF(ISBLANK(B30),0,B30)","v":0},{"$f":"IF(ISBLANK(B30),0,D30)","v":0},{"$f":"A30&C30","v":"CJCO"}]
[{"$f":"$A$10","v":"CN"},null,{"$f":"$A$9","v":"CM"},{"$f":"IF(G31=19,19,IF(ISBLANK(B31),\"\",IF(B31=19,0,36-B31)))","v":""},{"$f":"IF(G31=19,0,IF(ISBLANK(B31),\"\",IF(B31<18,1,IF(B31=18,2,IF(B31>18,3)))))","v":""},{"$f":"IF(G31=19,3,IF(ISBLANK(B31),\"\",IF(B31=19,0,IF(D31<18,1,IF(D31=18,2,IF(D31>=20,3))))))","v":""},null,null,{"$f":"IF(ISBLANK(B31),0,B31)","v":0},{"$f":"IF(ISBLANK(B31),0,D31)","v":0},{"$f":"A31&C31","v":"CNCM"}]
[{"$f":"$A$8","v":"CL"},null,{"$f":"$A$7","v":"CK"},{"$f":"IF(G32=19,19,IF(ISBLANK(B32),\"\",IF(B32=19,0,36-B32)))","v":""},{"$f":"IF(G32=19,0,IF(ISBLANK(B32),\"\",IF(B32<18,1,IF(B32=18,2,IF(B32>18,3)))))","v":""},{"$f":"IF(G32=19,3,IF(ISBLANK(B32),\"\",IF(B32=19,0,IF(D32<18,1,IF(D32=18,2,IF(D32>=20,3))))))","v":""},null,null,{"$f":"IF(ISBLANK(B32),0,B32)","v":0},{"$f":"IF(ISBLANK(B32),0,D32)","v":0},{"$f":"A32&C32","v":"CLCK"}]
[]
["4 éme MATCH le 5 juin","à",{"$f":"A9","v":"CM"}]
[null,null,null,null,null,null,"SI forfait éq recevante"]
["Equipes","score","Equipes","score"]
[{"$f":"A6","v":"CJ"},null,{"$f":"$A$9","v":"CM"},{"$f":"IF(G37=19,19,IF(ISBLANK(B37),\"\",IF(B37=19,0,36-B37)))","v":""},{"$f":"IF(G37=19,0,IF(ISBLANK(B37),\"\",IF(B37<18,1,IF(B37=18,2,IF(B37>18,3)))))","v":""},{"$f":"IF(G37=19,3,IF(ISBLANK(B37),\"\",IF(B37=19,0,IF(D37<18,1,IF(D37=18,2,IF(D37>=20,3))))))","v":""},null,null,{"$f":"IF(ISBLANK(B37),0,B37)","v":0},{"$f":"IF(ISBLANK(B37),0,D37)","v":0},{"$f":"A37&C37","v":"CJCM"}]
[{"$f":"$A$7","v":"CK"},null,{"$f":"$A$11","v":"CO"},{"$f":"IF(G38=19,19,IF(ISBLANK(B38),\"\",IF(B38=19,0,36-B38)))","v":""},{"$f":"IF(G38=19,0,IF(ISBLANK(B38),\"\",IF(B38<18,1,IF(B38=18,2,IF(B38>18,3)))))","v":""},{"$f":"IF(G38=19,3,IF(ISBLANK(B38),\"\",IF(B38=19,0,IF(D38<18,1,IF(D38=18,2,IF(D38>=20,3))))))","v":""},null,null,{"$f":"IF(ISBLANK(B38),0,B38)","v":0},{"$f":"IF(ISBLANK(B38),0,D38)","v":0},{"$f":"A38&C38","v":"CKCO"}]
[{"$f":"A8","v":"CL"},null,{"$f":"$A$10","v":"CN"},{"$f":"IF(G39=19,19,IF(ISBLANK(B39),\"\",IF(B39=19,0,36-B39)))","v":""},{"$f":"IF(G39=19,0,IF(ISBLANK(B39),\"\",IF(B39<18,1,IF(B39=18,2,IF(B39>18,3)))))","v":""},{"$f":"IF(G39=19,3,IF(ISBLANK(B39),\"\",IF(B39=19,0,IF(D39<18,1,IF(D39=18,2,IF(D39>=20,3))))))","v":""},null,null,{"$f":"IF(ISBLANK(B39),0,B39)","v":0},{"$f":"IF(ISBLANK(B39),0,D39)","v":0},{"$f":"A39&C39","v":"CLCN"}]
[]
["5 éme MATCH le 12 juin","à",{"$f":"A10","v":"CN"}]
[null,null,null,null,null,null,"SI forfait éq recevante"]
["Equipes","score","Equipes","score"]
[{"$f":"A8","v":"CL"},null,{"$f":"$A$11","v":"CO"},{"$f":"IF(G44=19,19,IF(ISBLANK(B44),\"\",IF(B44=19,0,36-B44)))","v":""},{"$f":"IF(G44=19,0,IF(ISBLANK(B44),\"\",IF(B44<18,1,IF(B44=18,2,IF(B44>18,3)))))","v":""},{"$f":"IF(G44=19,3,IF(ISBLANK(B44),\"\",IF(B44=19,0,IF(D44<18,1,IF(D44=18,2,IF(D44>=20,3))))))","v":""},null,null,{"$f":"IF(ISBLANK(B44),0,B44)","v":0},{"$f":"IF(ISBLANK(B44),0,D44)","v":0},{"$f":"A44&C44","v":"CLCO"}]
[{"$f":"$A$10","v":"CN"},null,{"$f":"A6","v":"CJ"},{"$f":"IF(G45=19,19,IF(ISBLANK(B45),\"\",IF(B45=19,0,36-B45)))","v":""},{"$f":"IF(G45=19,0,IF(ISBLANK(B45),\"\",IF(B45<18,1,IF(B45=18,2,IF(B45>18,3)))))","v":""},{"$f":"IF(G45=19,3,IF(ISBLANK(B45),\"\",IF(B45=19,0,IF(D45<18,1,IF(D45=18,2,IF(D45>=20,3))))))","v":""},null,null,{"$f":"IF(ISBLANK(B45),0,B45)","v":0},{"$f":"IF(ISBLANK(B45),0,D45)","v":0},{"$f":"A45&C45","v":"CNCJ"}]
[{"$f":"A7","v":"CK"},null,{"$f":"$A$9","v":"CM"},{"$f":"IF(G46=19,19,IF(ISBLANK(B46),\"\",IF(B46=19,0,36-B46)))","v":""},{"$f":"IF(G46=19,0,IF(ISBLANK(B46),\"\",IF(B46<18,1,IF(B46=18,2,IF(B46>18,3)))))","v":""},{"$f":"IF(G46=19,3,IF(ISBLANK(B46),\"\",IF(B46=19,0,IF(D46<18,1,IF(D46=18,2,IF(D46>=20,3))))))","v":""},null,null,{"$f":"IF(ISBLANK(B46),0,B46)","v":0},{"$f":"IF(ISBLANK(B46),0,D46)","v":0},{"$f":"A46&C46","v":"CKCM"}]
[]
["CLASSEMENT"]
["EQUIPES",null,"POINTS","Pour","Contre","Diff","CLASST"]
["CJ","11A",0,0,0,0,{"$f":"B59","v":1},{"$f":"IF(AND(G50=1,COUNTIF(rang1,1)>1),COUNTIF(G$50:G50,1),IF(AND(G50=2,COUNTIF(rang1,2)>1),COUNTIF(G$50:G50,2)+3,\"\"))","v":1}]
["CK","11B",0,0,0,0,1,{"$f":"IF(AND(G51=1,COUNTIF(rang1,1)>1),COUNTIF(G$50:G51,1),IF(AND(G51=2,COUNTIF(rang1,2)>1),COUNTIF(G$50:G51,2)+3,\"\"))","v":2}]
["CL","11C",0,0,0,0,1,{"$f":"IF(AND(G52=1,COUNTIF(rang1,1)>1),COUNTIF(G$50:G52,1),IF(AND(G52=2,COUNTIF(rang1,2)>1),COUNTIF(G$50:G52,2)+3,\"\"))","v":3}]
["CM","11D",0,0,0,0,1,{"$f":"IF(AND(G53=1,COUNTIF(rang1,1)>1),COUNTIF(G$50:G53,1),IF(AND(G53=2,COUNTIF(rang1,2)>1),COUNTIF(G$50:G53,2)+3,\"\"))","v":4}]
["CN","11E",0,0,0,0,1,{"$f":"IF(AND(G54=1,COUNTIF(rang1,1)>1),COUNTIF(G$50:G54,1),IF(AND(G54=2,COUNTIF(rang1,2)>1),COUNTIF(G$50:G54,2)+3,\"\"))","v":5}]
["CO","11F",0,0,0,0,1,{"$f":"IF(AND(G55=1,COUNTIF(rang1,1)>1),COUNTIF(G$50:G55,1),IF(AND(G55=2,COUNTIF(rang1,2)>1),COUNTIF(G$50:G55,2)+3,\"\"))","v":6}]
[]
[null,"CLASSEMENT FINAL et DEPARTAGE EX AEQUOS",null,null,null,null,null,null,null,null,null,null,"CLASSEMENT"]
[null,"Rang","Equipes","Pts","diff pts avec exaequo","cumul","departage goalaverage si même cumul","RP",null,null,null,"RP","Rang","Equipe","Pts"]
[null,{"$f":"RANK(G59,$G$59:$G$64)","v":1},{"$f":"INDEX($A$50:$A$55,MATCH(H59,$L$59:$L$64,0))","v":"CJ"},{"$f":"VLOOKUP(C59,$A$50:$C$55,3,0)","v":0},{"$f":"IF(D59=D60,INDEX($J$6:$O$11,MATCH(C59,$I$6:$I$11,0),MATCH(C60,$J$5:$O$5,0)),IF(D59=D58,INDEX($J$6:$O$11,MATCH(C59,$I$6:$I$11,0),MATCH(C58,$J$5:$O$5,0)),0))","v":0},{"$f":"D59+E59/100","v":0},{"$f":"IF(AND(F59<>F58,F59<>F60),F59,F59+VLOOKUP(C59,$A$50:$F$55,6,0)/100)","v":0},1,null,null,null,{"$f":"RANK(C50,$C$50:$C$55)+COUNTIF($C$50:C50,C50)-1","v":1},{"$f":"B59","v":1},"CJ",{"$f":"VLOOKUP(N59,$C$59:$D$64,2,0)","v":0}]
[null,1,"CK",0,{"$f":"IF(D60=D61,INDEX($J$6:$O$11,MATCH(C60,$I$6:$I$11,0),MATCH(C61,$J$5:$O$5,0)),IF(D60=D59,INDEX($J$6:$O$11,MATCH(C60,$I$6:$I$11,0),MATCH(C59,$J$5:$O$5,0)),0))","v":0},0,{"$f":"IF(AND(F60<>F59,F60<>F61),F60,F60+VLOOKUP(C60,$A$50:$F$55,6,0)/100)","v":0},2,null,null,null,{"$f":"RANK(C51,$C$50:$C$55)+COUNTIF($C$50:C51,C51)-1","v":2},1,"CK",0]
[null,1,"CL",0,{"$f":"IF(D61=D62,INDEX($J$6:$O$11,MATCH(C61,$I$6:$I$11,0),MATCH(C62,$J$5:$O$5,0)),IF(D61=D60,INDEX($J$6:$O$11,MATCH(C61,$I$6:$I$11,0),MATCH(C60,$J$5:$O$5,0)),0))","v":0},0,{"$f":"IF(AND(F61<>F60,F61<>F62),F61,F61+VLOOKUP(C61,$A$50:$F$55,6,0)/100)","v":0},3,null,null,null,{"$f":"RANK(C52,$C$50:$C$55)+COUNTIF($C$50:C52,C52)-1","v":3},1,"CL",0]
[null,1,"CM",0,{"$f":"IF(D62=D63,INDEX($J$6:$O$11,MATCH(C62,$I$6:$I$11,0),MATCH(C63,$J$5:$O$5,0)),IF(D62=D61,INDEX($J$6:$O$11,MATCH(C62,$I$6:$I$11,0),MATCH(C61,$J$5:$O$5,0)),0))","v":0},0,{"$f":"IF(AND(F62<>F61,F62<>F63),F62,F62+VLOOKUP(C62,$A$50:$F$55,6,0)/100)","v":0},4,null,null,null,{"$f":"RANK(C53,$C$50:$C$55)+COUNTIF($C$50:C53,C53)-1","v":4},1,"CM",0]
[null,1,"CN",0,{"$f":"IF(D63=D64,INDEX($J$6:$O$11,MATCH(C63,$I$6:$I$11,0),MATCH(C64,$J$5:$O$5,0)),IF(D63=D62,INDEX($J$6:$O$11,MATCH(C63,$I$6:$I$11,0),MATCH(C62,$J$5:$O$5,0)),0))","v":0},0,{"$f":"IF(AND(F63<>F62,F63<>F64),F63,F63+VLOOKUP(C63,$A$50:$F$55,6,0)/100)","v":0},5,null,null,null,{"$f":"RANK(C54,$C$50:$C$55)+COUNTIF($C$50:C54,C54)-1","v":5},1,"CN",0]
[null,1,"CO",0,{"$f":"IF(D64=D59,INDEX($J$6:$O$11,MATCH(C64,$I$6:$I$11,0),MATCH(C59,$J$5:$O$5,0)),IF(D64=D63,INDEX($J$6:$O$11,MATCH(C64,$I$6:$I$11,0),MATCH(C63,$J$5:$O$5,0)),0))","v":0},0,{"$f":"IF(AND(F64<>F63,F64<>F59),F64,F64+VLOOKUP(C64,$A$50:$F$55,6,0)/100)","v":0},6,null,null,null,{"$f":"RANK(C55,$C$50:$C$55)+COUNTIF($C$50:C55,C55)-1","v":6},1,"CO",0]

{"sheet":"P12","index":11,"n_rows":64,"n_cols":15,"rows_kept":64,"cut":false,"hidden":false,"merged":[[0,0,0,5],[1,0,1,5],[2,0,2,5],[3,0,3,5],[13,6,14,6],[56,1,56,6],[56,12,56,14],[20,6,21,6],[27,6,28,6],[34,6,35,6],[41,6,42,6],[47,0,47,5]]}
[]
["CHAMPIONNAT DES CLUBS"]
[]
["POULE 12",null,null,null,null,null,null,null,"Récapitulatif  différence match entre 2 équipes"]
["EQUIPES",null,"POINTS","Pour","Contre","Diff",null,null,null,{"$f":"A6","v":"CP"},{"$f":"A7","v":"CQ"},{"$f":"A8","v":"CR"},{"$f":"A9","v":"CS"},{"$f":"A10","v":"CT"},{"$f":"A11","v":"CU"}]
["CP","12A",{"$f":"SUM(E16,E23,E30,E37,F45)","v":0},{"$f":"I16+I23+I30+I37+J45","v":0},{"$f":"J16+J23+J30+J37+I45","v":0},{"$f":"D6-E6","v":0},null,null,{"$f":"A6","v":"CP"},null,{"$f":"IF(ISBLANK(B16),0,IFERROR(INDEX($B$15:$B$46,MATCH($I6&K$5,$K$15:$K$46,0))-INDEX($D$15:$D$46,MATCH($I6&K$5,$K$15:$K$46,0)),0-INDEX($J$6:$O$11,MATCH(K$5,$I$6:$I$11,0),MATCH($I6,$J$5:$O$5,0))))","v":0},{"$f":"IF(ISBLANK(B23),0,IFERROR(INDEX($B$15:$B$46,MATCH($I6&L$5,$K$15:$K$46,0))-INDEX($D$15:$D$46,MATCH($I6&L$5,$K$15:$K$46,0)),0-INDEX($J$6:$O$11,MATCH(L$5,$I$6:$I$11,0),MATCH($I6,$J$5:$O$5,0))))","v":0},{"$f":"IF(ISBLANK(B37),0,IFERROR(INDEX($B$15:$B$46,MATCH($I6&M$5,$K$15:$K$46,0))-INDEX($D$15:$D$46,MATCH($I6&M$5,$K$15:$K$46,0)),0-INDEX($J$6:$O$11,MATCH(M$5,$I$6:$I$11,0),MATCH($I6,$J$5:$O$5,0))))","v":0},{"$f":"IF(ISBLANK(B45),0,IFERROR(INDEX($B$15:$B$46,MATCH($I6&N$5,$K$15:$K$46,0))-INDEX($D$15:$D$46,MATCH($I6&N$5,$K$15:$K$46,0)),0-INDEX($J$6:$O$11,MATCH(N$5,$I$6:$I$11,0),MATCH($I6,$J$5:$O$5,0))))","v":0},{"$f":"IF(ISBLANK(B30),0,IFERROR(INDEX($B$15:$B$46,MATCH($I6&O$5,$K$15:$K$46,0))-INDEX($D$15:$D$46,MATCH($I6&O$5,$K$15:$K$46,0)),0-INDEX($J$6:$O$11,MATCH(O$5,$I$6:$I$11,0),MATCH($I6,$J$5:$O$5,0))))","v":0}]
["CQ","12B",{"$f":"SUM(F16,E24,F32,E38,E46)","v":0},{"$f":"J16+I24+J32+I38+I46","v":0},{"$f":"I16+J24+I32+J38+J46","v":0},0,null,null,"CQ",{"$f":"IF(ISBLANK(B16),0,IFERROR(INDEX($B$15:$B$46,MATCH($I7&J$5,$K$15:$K$46,0))-INDEX($D$15:$D$46,MATCH($I7&J$5,$K$15:$K$46,0)),0-INDEX($J$6:$O$11,MATCH(J$5,$I$6:$I$11,0),MATCH($I7,$J$5:$O$5,0))))","v":0},null,{"$f":"IF(ISBLANK(B32),0,IFERROR(INDEX($B$15:$B$46,MATCH($I7&L$5,$K$15:$K$46,0))-INDEX($D$15:$D$46,MATCH($I7&L$5,$K$15:$K$46,0)),0-INDEX($J$6:$O$11,MATCH(L$5,$I$6:$I$11,0),MATCH($I7,$J$5:$O$5,0))))","v":0},{"$f":"IF(ISBLANK(B46),0,IFERROR(INDEX($B$15:$B$46,MATCH($I7&M$5,$K$15:$K$46,0))-INDEX($D$15:$D$46,MATCH($I7&M$5,$K$15:$K$46,0)),0-INDEX($J$6:$O$11,MATCH(M$5,$I$6:$I$11,0),MATCH($I7,$J$5:$O$5,0))))","v":0},{"$f":"IF(ISBLANK(B24),0,IFERROR(INDEX($B$15:$B$46,MATCH($I7&N$5,$K$15:$K$46,0))-INDEX($D$15:$D$46,MATCH($I7&N$5,$K$15:$K$46,0)),0-INDEX($J$6:$O$11,MATCH(N$5,$I$6:$I$11,0),MATCH($I7,$J$5:$O$5,0))))","v":0},{"$f":"IF(ISBLANK(B38),0,IFERROR(INDEX($B$15:$B$46,MATCH($I7&O$5,$K$15:$K$46,0))-INDEX($D$15:$D$46,MATCH($I7&O$5,$K$15:$K$46,0)),0-INDEX($J$6:$O$11,MATCH(O$5,$I$6:$I$11,0),MATCH($I7,$J$5:$O$5,0))))","v":0}]
["CR","12C",{"$f":"SUM(E17,F23,E32,E39,E44)","v":0},{"$f":"I17+J23+I32+I39+I44","v":0},{"$f":"J17+I23+J32+J39+J44","v":0},0,null,null,"CR",{"$f":"IF(ISBLANK(B23),0,IFERROR(INDEX($B$15:$B$46,MATCH($I8&J$5,$K$15:$K$46,0))-INDEX($D$15:$D$46,MATCH($I8&J$5,$K$15:$K$46,0)),0-INDEX($J$6:$O$11,MATCH(J$5,$I$6:$I$11,0),MATCH($I8,$J$5:$O$5,0))))","v":0},{"$f":"IF(ISBLANK(B32),0,IFERROR(INDEX($B$15:$B$46,MATCH($I8&K$5,$K$15:$K$46,0))-INDEX($D$15:$D$46,MATCH($I8&K$5,$K$15:$K$46,0)),0-INDEX($J$6:$O$11,MATCH(K$5,$I$6:$I$11,0),MATCH($I8,$J$5:$O$5,0))))","v":0},null,{"$f":"IF(ISBLANK(B17),0,IFERROR(INDEX($B$15:$B$46,MATCH($I8&M$5,$K$15:$K$46,0))-INDEX($D$15:$D$46,MATCH($I8&M$5,$K$15:$K$46,0)),0-INDEX($J$6:$O$11,MATCH(M$5,$I$6:$I$11,0),MATCH($I8,$J$5:$O$5,0))))","v":0},{"$f":"IF(ISBLANK(B39),0,IFERROR(INDEX($B$15:$B$46,MATCH($I8&N$5,$K$15:$K$46,0))-INDEX($D$15:$D$46,MATCH($I8&N$5,$K$15:$K$46,0)),0-INDEX($J$6:$O$11,MATCH(N$5,$I$6:$I$11,0),MATCH($I8,$J$5:$O$5,0))))","v":0},{"$f":"IF(ISBLANK(B44),0,IFERROR(INDEX($B$15:$B$46,MATCH($I8&O$5,$K$15:$K$46,0))-INDEX($D$15:$D$46,MATCH($I8&O$5,$K$15:$K$46,0)),0-INDEX($J$6:$O$11,MATCH(O$5,$I$6:$I$11,0),MATCH($I8,$J$5:$O$5,0))))","v":0}]
["CS","12D",{"$f":"SUM(F17,E25,F31,F37,F46)","v":0},{"$f":"J17+I25+J31+J37+J46","v":0},{"$f":"I17+J25+I31+I37+I46","v":0},0,null,null,"CS",{"$f":"IF(ISBLANK(B37),0,IFERROR(INDEX($B$15:$B$46,MATCH($I9&J$5,$K$15:$K$46,0))-INDEX($D$15:$D$46,MATCH($I9&J$5,$K$15:$K$46,0)),0-INDEX($J$6:$O$11,MATCH(J$5,$I$6:$I$11,0),MATCH($I9,$J$5:$O$5,0))))","v":0},{"$f":"IF(ISBLANK(B46),0,IFERROR(INDEX($B$15:$B$46,MATCH($I9&K$5,$K$15:$K$46,0))-INDEX($D$15:$D$46,MATCH($I9&K$5,$K$15:$K$46,0)),0-INDEX($J$6:$O$11,MATCH(K$5,$I$6:$I$11,0),MATCH($I9,$J$5:$O$5,0))))","v":0},{"$f":"IF(ISBLANK(B17),0,IFERROR(INDEX($B$15:$B$46,MATCH($I9&L$5,$K$15:$K$46,0))-INDEX($D$15:$D$46,MATCH($I9&L$5,$K$15:$K$46,0)),0-INDEX($J$6:$O$11,MATCH(L$5,$I$6:$I$11,0),MATCH($I9,$J$5:$O$5,0))))","v":0},null,{"$f":"IF(ISBLANK(B31),0,IFERROR(INDEX($B$15:$B$46,MATCH($I9&N$5,$K$15:$K$46,0))-INDEX($D$15:$D$46,MATCH($I9&N$5,$K$15:$K$46,0)),0-INDEX($J$6:$O$11,MATCH(N$5,$I$6:$I$11,0),MATCH($I9,$J$5:$O$5,0))))","v":0},{"$f":"IF(ISBLANK(B25),0,IFERROR(INDEX($B$15:$B$46,MATCH($I9&O$5,$K$15:$K$46,0))-INDEX($D$15:$D$46,MATCH($I9&O$5,$K$15:$K$46,0)),0-INDEX($J$6:$O$11,MATCH(O$5,$I$6:$I$11,0),MATCH($I9,$J$5:$O$5,0))))","v":0}]
["CT","12E",{"$f":"SUM(E18,F24,E31,F39,E45)","v":0},{"$f":"I18+J24+I31+J39+I45","v":0},{"$f":"J18+I24+J31+I39+J45","v":0},0,null,null,"CT",{"$f":"IF(ISBLANK(B45),0,IFERROR(INDEX($B$15:$B$46,MATCH($I10&J$5,$K$15:$K$46,0))-INDEX($D$15:$D$46,MATCH($I10&J$5,$K$15:$K$46,0)),0-INDEX($J$6:$O$11,MATCH(J$5,$I$6:$I$11,0),MATCH($I10,$J$5:$O$5,0))))","v":0},{"$f":"IF(ISBLANK(B24),0,IFERROR(INDEX($B$15:$B$46,MATCH($I10&K$5,$K$15:$K$46,0))-INDEX($D$15:$D$46,MATCH($I10&K$5,$K$15:$K$46,0)),0-INDEX($J$6:$O$11,MATCH(K$5,$I$6:$I$11,0),MATCH($I10,$J$5:$O$5,0))))","v":0},{"$f":"IF(ISBLANK(B39),0,IFERROR(INDEX($B$15:$B$46,MATCH($I10&L$5,$K$15:$K$46,0))-INDEX($D$15:$D$46,MATCH($I10&L$5,$K$15:$K$46,0)),0-INDEX($J$6:$O$11,MATCH(L$5,$I$6:$I$11,0),MATCH($I10,$J$5:$O$5,0))))","v":0},{"$f":"IF(ISBLANK(B31),0,IFERROR(INDEX($B$15:$B$46,MATCH($I10&M$5,$K$15:$K$46,0))-INDEX($D$15:$D$46,MATCH($I10&M$5,$K$15:$K$46,0)),0-INDEX($J$6:$O$11,MATCH(M$5,$I$6:$I$11,0),MATCH($I10,$J$5:$O$5,0))))","v":0},null,{"$f":"IF(ISBLANK(B18),0,IFERROR(INDEX($B$15:$B$46,MATCH($I10&O$5,$K$15:$K$46,0))-INDEX($D$15:$D$46,MATCH($I10&O$5,$K$15:$K$46,0)),0-INDEX($J$6:$O$11,MATCH(O$5,$I$6:$I$11,0),MATCH($I10,$J$5:$O$5,0))))","v":0}]
["CU","12F",{"$f":"SUM(F18,F25,F30,F38,F44)","v":0},{"$f":"J18+J25+J30+J38+J44","v":0},{"$f":"I18+I25+I30+I38+I44","v":0},0,null,null,"CU",{"$f":"IF(ISBLANK(B30),0,IFERROR(INDEX($B$15:$B$46,MATCH($I11&J$5,$K$15:$K$46,0))-INDEX($D$15:$D$46,MATCH($I11&J$5,$K$15:$K$46,0)),0-INDEX($J$6:$O$11,MATCH(J$5,$I$6:$I$11,0),MATCH($I11,$J$5:$O$5,0))))","v":0},{"$f":"IF(ISBLANK(B38),0,IFERROR(INDEX($B$15:$B$46,MATCH($I11&K$5,$K$15:$K$46,0))-INDEX($D$15:$D$46,MATCH($I11&K$5,$K$15:$K$46,0)),0-INDEX($J$6:$O$11,MATCH(K$5,$I$6:$I$11,0),MATCH($I11,$J$5:$O$5,0))))","v":0},{"$f":"IF(ISBLANK(B44),0,IFERROR(INDEX($B$15:$B$46,MATCH($I11&L$5,$K$15:$K$46,0))-INDEX($D$15:$D$46,MATCH($I11&L$5,$K$15:$K$46,0)),0-INDEX($J$6:$O$11,MATCH(L$5,$I$6:$I$11,0),MATCH($I11,$J$5:$O$5,0))))","v":0},{"$f":"IF(ISBLANK(B25),0,IFERROR(INDEX($B$15:$B$46,MATCH($I11&M$5,$K$15:$K$46,0))-INDEX($D$15:$D$46,MATCH($I11&M$5,$K$15:$K$46,0)),0-INDEX($J$6:$O$11,MATCH(M$5,$I$6:$I$11,0),MATCH($I11,$J$5:$O$5,0))))","v":0},{"$f":"IF(ISBLANK(B18),0,IFERROR(INDEX($B$15:$B$46,MATCH($I11&N$5,$K$15:$K$46,0))-INDEX($D$15:$D$46,MATCH($I11&N$5,$K$15:$K$46,0)),0-INDEX($J$6:$O$11,MATCH(N$5,$I$6:$I$11,0),MATCH($I11,$J$5:$O$5,0))))","v":0}]
[null,null,null,null,null,null,null,null,"Les concaténations en rouge permettent de remplir par formules le récapitulatif au dessus"]
["1er MATCH le 15 mai","à",{"$f":"A6","v":"CP"},null,null,null,null,null,"Ce récap servira à départager les ex aequos"]
[null,null,null,null,null,null,"SI forfait éq recevante"]
["Equipes","score","Equipes","score"]
[{"$f":"$A$6","v":"CP"},null,{"$f":"$A$7","v":"CQ"},{"$f":"IF(G16=19,19,IF(ISBLANK(B16),\"\",IF(B16=19,0,36-B16)))","v":""},{"$f":"IF(G16=19,0,IF(ISBLANK(B16),\"\",IF(B16<18,1,IF(B16=18,2,IF(B16>18,3)))))","v":""},{"$f":"IF(G16=19,3,IF(ISBLANK(B16),\"\",IF(B16=19,0,IF(D16<18,1,IF(D16=18,2,IF(D16>=20,3))))))","v":""},null,null,{"$f":"IF(ISBLANK(B16),0,B16)","v":0},{"$f":"IF(ISBLANK(B16),0,D16)","v":0},{"$f":"A16&C16","v":"CPCQ"}]
[{"$f":"$A$8","v":"CR"},null,{"$f":"$A$9","v":"CS"},{"$f":"IF(G17=19,19,IF(ISBLANK(B17),\"\",IF(B17=19,0,36-B17)))","v":""},{"$f":"IF(G17=19,0,IF(ISBLANK(B17),\"\",IF(B17<18,1,IF(B17=18,2,IF(B17>18,3)))))","v":""},{"$f":"IF(G17=19,3,IF(ISBLANK(B17),\"\",IF(B17=19,0,IF(D17<18,1,IF(D17=18,2,IF(D17>=20,3))))))","v":""},null,null,{"$f":"IF(ISBLANK(B17),0,B17)","v":0},{"$f":"IF(ISBLANK(B17),0,D17)","v":0},{"$f":"A17&C17","v":"CRCS"}]
[{"$f":"$A$10","v":"CT"},null,{"$f":"$A$11","v":"CU"},{"$f":"IF(G18=19,19,IF(ISBLANK(B18),\"\",IF(B18=19,0,36-B18)))","v":""},{"$f":"IF(G18=19,0,IF(ISBLANK(B18),\"\",IF(B18<18,1,IF(B18=18,2,IF(B18>18,3)))))","v":""},{"$f":"IF(G18=19,3,IF(ISBLANK(B18),\"\",IF(B18=19,0,IF(D18<18,1,IF(D18=18,2,IF(D18>=20,3))))))","v":""},null,null,{"$f":"IF(ISBLANK(B18),0,B18)","v":0},{"$f":"IF(ISBLANK(B18),0,D18)","v":0},{"$f":"A18&C18","v":"CTCU"}]
[]
["2 éme MATCH le 22 mai","à",{"$f":"A7","v":"CQ"}]
[null,null,null,null,null,null,"SI forfait éq recevante"]
["Equipes","score","Equipes","score"]
[{"$f":"$A$6","v":"CP"},null,{"$f":"$A$8","v":"CR"},{"$f":"IF(G23=19,19,IF(ISBLANK(B23),\"\",IF(B23=19,0,36-B23)))","v":""},{"$f":"IF(G23=19,0,IF(ISBLANK(B23),\"\",IF(B23<18,1,IF(B23=18,2,IF(B23>18,3)))))","v":""},{"$f":"IF(G23=19,3,IF(ISBLANK(B23),\"\",IF(B23=19,0,IF(D23<18,1,IF(D23=18,2,IF(D23>=20,3))))))","v":""},null,null,{"$f":"IF(ISBLANK(B23),0,B23)","v":0},{"$f":"IF(ISBLANK(B23),0,D23)","v":0},{"$f":"A23&C23","v":"CPCR"}]
[{"$f":"$A$7","v":"CQ"},null,{"$f":"$A$10","v":"CT"},{"$f":"IF(G24=19,19,IF(ISBLANK(B24),\"\",IF(B24=19,0,36-B24)))","v":""},{"$f":"IF(G24=19,0,IF(ISBLANK(B24),\"\",IF(B24<18,1,IF(B24=18,2,IF(B24>18,3)))))","v":""},{"$f":"IF(G24=19,3,IF(ISBLANK(B24),\"\",IF(B24=19,0,IF(D24<18,1,IF(D24=18,2,IF(D24>=20,3))))))","v":""},null,null,{"$f":"IF(ISBLANK(B24),0,B24)","v":0},{"$f":"IF(ISBLANK(B24),0,D24)","v":0},{"$f":"A24&C24","v":"CQCT"}]
[{"$f":"$A$9","v":"CS"},null,{"$f":"$A$11","v":"CU"},{"$f":"IF(G25=19,19,IF(ISBLANK(B25),\"\",IF(B25=19,0,36-B25)))","v":""},{"$f":"IF(G25=19,0,IF(ISBLANK(B25),\"\",IF(B25<18,1,IF(B25=18,2,IF(B25>18,3)))))","v":""},{"$f":"IF(G25=19,3,IF(ISBLANK(B25),\"\",IF(B25=19,0,IF(D25<18,1,IF(D25=18,2,IF(D25>=20,3))))))","v":""},null,null,{"$f":"IF(ISBLANK(B25),0,B25)","v":0},{"$f":"IF(ISBLANK(B25),0,D25)","v":0},{"$f":"A25&C25","v":"CSCU"}]
[]
["3 éme MATCH le 29 mai","à",{"$f":"A8","v":"CR"}]
[null,null,null,null,null,null,"SI forfait éq recevante"]
["Equipes","score","Equipes","score"]
[{"$f":"$A$6","v":"CP"},null,{"$f":"$A$11","v":"CU"},{"$f":"IF(G30=19,19,IF(ISBLANK(B30),\"\",IF(B30=19,0,36-B30)))","v":""},{"$f":"IF(G30=19,0,IF(ISBLANK(B30),\"\",IF(B30<18,1,IF(B30=18,2,IF(B30>18,3)))))","v":""},{"$f":"IF(G30=19,3,IF(ISBLANK(B30),\"\",IF(B30=19,0,IF(D30<18,1,IF(D30=18,2,IF(D30>=20,3))))))","v":""},null,null,{"$f":"IF(ISBLANK(B30),0,B30)","v":0},{"$f":"IF(ISBLANK(B30),0,D30)","v":0},{"$f":"A30&C30","v":"CPCU"}]
[{"$f":"$A$10","v":"CT"},null,{"$f":"$A$9","v":"CS"},{"$f":"IF(G31=19,19,IF(ISBLANK(B31),\"\",IF(B31=19,0,36-B31)))","v":""},{"$f":"IF(G31=19,0,IF(ISBLANK(B31),\"\",IF(B31<18,1,IF(B31=18,2,IF(B31>18,3)))))","v":""},{"$f":"IF(G31=19,3,IF(ISBLANK(B31),\"\",IF(B31=19,0,IF(D31<18,1,IF(D31=18,2,IF(D31>=20,3))))))","v":""},null,null,{"$f":"IF(ISBLANK(B31),0,B31)","v":0},{"$f":"IF(ISBLANK(B31),0,D31)","v":0},{"$f":"A31&C31","v":"CTCS"}]
[{"$f":"$A$8","v":"CR"},null,{"$f":"$A$7","v":"CQ"},{"$f":"IF(G32=19,19,IF(ISBLANK(B32),\"\",IF(B32=19,0,36-B32)))","v":""},{"$f":"IF(G32=19,0,IF(ISBLANK(B32),\"\",IF(B32<18,1,IF(B32=18,2,IF(B32>18,3)))))","v":""},{"$f":"IF(G32=19,3,IF(ISBLANK(B32),\"\",IF(B32=19,0,IF(D32<18,1,IF(D32=18,2,IF(D32>=20,3))))))","v":""},null,null,{"$f":"IF(ISBLANK(B32),0,B32)","v":0},{"$f":"IF(ISBLANK(B32),0,D32)","v":0},{"$f":"A32&C32","v":"CRCQ"}]
[]
["4 éme MATCH le 5 juin","à",{"$f":"A9","v":"CS"}]
[null,null,null,null,null,null,"SI forfait éq recevante"]
["Equipes","score","Equipes","score"]
[{"$f":"A6","v":"CP"},null,{"$f":"$A$9","v":"CS"},{"$f":"IF(G37=19,19,IF(ISBLANK(B37),\"\",IF(B37=19,0,36-B37)))","v":""},{"$f":"IF(G37=19,0,IF(ISBLANK(B37),\"\",IF(B37<18,1,IF(B37=18,2,IF(B37>18,3)))))","v":""},{"$f":"IF(G37=19,3,IF(ISBLANK(B37),\"\",IF(B37=19,0,IF(D37<18,1,IF(D37=18,2,IF(D37>=20,3))))))","v":""},null,null,{"$f":"IF(ISBLANK(B37),0,B37)","v":0},{"$f":"IF(ISBLANK(B37),0,D37)","v":0},{"$f":"A37&C37","v":"CPCS"}]
[{"$f":"$A$7","v":"CQ"},null,{"$f":"$A$11","v":"CU"},{"$f":"IF(G38=19,19,IF(ISBLANK(B38),\"\",IF(B38=19,0,36-B38)))","v":""},{"$f":"IF(G38=19,0,IF(ISBLANK(B38),\"\",IF(B38<18,1,IF(B38=18,2,IF(B38>18,3)))))","v":""},{"$f":"IF(G38=19,3,IF(ISBLANK(B38),\"\",IF(B38=19,0,IF(D38<18,1,IF(D38=18,2,IF(D38>=20,3))))))","v":""},null,null,{"$f":"IF(ISBLANK(B38),0,B38)","v":0},{"$f":"IF(ISBLANK(B38),0,D38)","v":0},{"$f":"A38&C38","v":"CQCU"}]
[{"$f":"A8","v":"CR"},null,{"$f":"$A$10","v":"CT"},{"$f":"IF(G39=19,19,IF(ISBLANK(B39),\"\",IF(B39=19,0,36-B39)))","v":""},{"$f":"IF(G39=19,0,IF(ISBLANK(B39),\"\",IF(B39<18,1,IF(B39=18,2,IF(B39>18,3)))))","v":""},{"$f":"IF(G39=19,3,IF(ISBLANK(B39),\"\",IF(B39=19,0,IF(D39<18,1,IF(D39=18,2,IF(D39>=20,3))))))","v":""},null,null,{"$f":"IF(ISBLANK(B39),0,B39)","v":0},{"$f":"IF(ISBLANK(B39),0,D39)","v":0},{"$f":"A39&C39","v":"CRCT"}]
[]
["5 éme MATCH le 12 juin","à",{"$f":"A10","v":"CT"}]
[null,null,null,null,null,null,"SI forfait éq recevante"]
["Equipes","score","Equipes","score"]
[{"$f":"A8","v":"CR"},null,{"$f":"$A$11","v":"CU"},{"$f":"IF(G44=19,19,IF(ISBLANK(B44),\"\",IF(B44=19,0,36-B44)))","v":""},{"$f":"IF(G44=19,0,IF(ISBLANK(B44),\"\",IF(B44<18,1,IF(B44=18,2,IF(B44>18,3)))))","v":""},{"$f":"IF(G44=19,3,IF(ISBLANK(B44),\"\",IF(B44=19,0,IF(D44<18,1,IF(D44=18,2,IF(D44>=20,3))))))","v":""},null,null,{"$f":"IF(ISBLANK(B44),0,B44)","v":0},{"$f":"IF(ISBLANK(B44),0,D44)","v":0},{"$f":"A44&C44","v":"CRCU"}]
[{"$f":"$A$10","v":"CT"},null,{"$f":"A6","v":"CP"},{"$f":"IF(G45=19,19,IF(ISBLANK(B45),\"\",IF(B45=19,0,36-B45)))","v":""},{"$f":"IF(G45=19,0,IF(ISBLANK(B45),\"\",IF(B45<18,1,IF(B45=18,2,IF(B45>18,3)))))","v":""},{"$f":"IF(G45=19,3,IF(ISBLANK(B45),\"\",IF(B45=19,0,IF(D45<18,1,IF(D45=18,2,IF(D45>=20,3))))))","v":""},null,null,{"$f":"IF(ISBLANK(B45),0,B45)","v":0},{"$f":"IF(ISBLANK(B45),0,D45)","v":0},{"$f":"A45&C45","v":"CTCP"}]
[{"$f":"A7","v":"CQ"},null,{"$f":"$A$9","v":"CS"},{"$f":"IF(G46=19,19,IF(ISBLANK(B46),\"\",IF(B46=19,0,36-B46)))","v":""},{"$f":"IF(G46=19,0,IF(ISBLANK(B46),\"\",IF(B46<18,1,IF(B46=18,2,IF(B46>18,3)))))","v":""},{"$f":"IF(G46=19,3,IF(ISBLANK(B46),\"\",IF(B46=19,0,IF(D46<18,1,IF(D46=18,2,IF(D46>=20,3))))))","v":""},null,null,{"$f":"IF(ISBLANK(B46),0,B46)","v":0},{"$f":"IF(ISBLANK(B46),0,D46)","v":0},{"$f":"A46&C46","v":"CQCS"}]
[]
["CLASSEMENT"]
["EQUIPES",null,"POINTS","Pour","Contre","Diff","CLASST"]
["CP","12A",0,0,0,0,{"$f":"B59","v":1},{"$f":"IF(AND(G50=1,COUNTIF(rang1,1)>1),COUNTIF(G$50:G50,1),IF(AND(G50=2,COUNTIF(rang1,2)>1),COUNTIF(G$50:G50,2)+3,\"\"))","v":1}]
["CQ","12B",0,0,0,0,1,{"$f":"IF(AND(G51=1,COUNTIF(rang1,1)>1),COUNTIF(G$50:G51,1),IF(AND(G51=2,COUNTIF(rang1,2)>1),COUNTIF(G$50:G51,2)+3,\"\"))","v":2}]
["CR","12C",0,0,0,0,1,{"$f":"IF(AND(G52=1,COUNTIF(rang1,1)>1),COUNTIF(G$50:G52,1),IF(AND(G52=2,COUNTIF(rang1,2)>1),COUNTIF(G$50:G52,2)+3,\"\"))","v":3}]
["CS","12D",0,0,0,0,1,{"$f":"IF(AND(G53=1,COUNTIF(rang1,1)>1),COUNTIF(G$50:G53,1),IF(AND(G53=2,COUNTIF(rang1,2)>1),COUNTIF(G$50:G53,2)+3,\"\"))","v":4}]
["CT","12E",0,0,0,0,1,{"$f":"IF(AND(G54=1,COUNTIF(rang1,1)>1),COUNTIF(G$50:G54,1),IF(AND(G54=2,COUNTIF(rang1,2)>1),COUNTIF(G$50:G54,2)+3,\"\"))","v":5}]
["CU","12F",0,0,0,0,1,{"$f":"IF(AND(G55=1,COUNTIF(rang1,1)>1),COUNTIF(G$50:G55,1),IF(AND(G55=2,COUNTIF(rang1,2)>1),COUNTIF(G$50:G55,2)+3,\"\"))","v":6}]
[]
[null,"CLASSEMENT FINAL et DEPARTAGE EX AEQUOS",null,null,null,null,null,null,null,null,null,null,"CLASSEMENT"]
[null,"Rang","Equipes","Pts","diff pts avec exaequo","cumul","departage goalaverage si même cumul","RP",null,null,null,"RP","Rang","Equipe","Pts"]
[null,{"$f":"RANK(G59,$G$59:$G$64)","v":1},{"$f":"INDEX($A$50:$A$55,MATCH(H59,$L$59:$L$64,0))","v":"CP"},{"$f":"VLOOKUP(C59,$A$50:$C$55,3,0)","v":0},{"$f":"IF(D59=D60,INDEX($J$6:$O$11,MATCH(C59,$I$6:$I$11,0),MATCH(C60,$J$5:$O$5,0)),IF(D59=D58,INDEX($J$6:$O$11,MATCH(C59,$I$6:$I$11,0),MATCH(C58,$J$5:$O$5,0)),0))","v":0},{"$f":"D59+E59/100","v":0},{"$f":"IF(AND(F59<>F58,F59<>F60),F59,F59+VLOOKUP(C59,$A$50:$F$55,6,0)/100)","v":0},1,null,null,null,{"$f":"RANK(C50,$C$50:$C$55)+COUNTIF($C$50:C50,C50)-1","v":1},{"$f":"B59","v":1},"CP",{"$f":"VLOOKUP(N59,$C$59:$D$64,2,0)","v":0}]
[null,1,"CQ",0,{"$f":"IF(D60=D61,INDEX($J$6:$O$11,MATCH(C60,$I$6:$I$11,0),MATCH(C61,$J$5:$O$5,0)),IF(D60=D59,INDEX($J$6:$O$11,MATCH(C60,$I$6:$I$11,0),MATCH(C59,$J$5:$O$5,0)),0))","v":0},0,{"$f":"IF(AND(F60<>F59,F60<>F61),F60,F60+VLOOKUP(C60,$A$50:$F$55,6,0)/100)","v":0},2,null,null,null,{"$f":"RANK(C51,$C$50:$C$55)+COUNTIF($C$50:C51,C51)-1","v":2},1,"CQ",0]
[null,1,"CR",0,{"$f":"IF(D61=D62,INDEX($J$6:$O$11,MATCH(C61,$I$6:$I$11,0),MATCH(C62,$J$5:$O$5,0)),IF(D61=D60,INDEX($J$6:$O$11,MATCH(C61,$I$6:$I$11,0),MATCH(C60,$J$5:$O$5,0)),0))","v":0},0,{"$f":"IF(AND(F61<>F60,F61<>F62),F61,F61+VLOOKUP(C61,$A$50:$F$55,6,0)/100)","v":0},3,null,null,null,{"$f":"RANK(C52,$C$50:$C$55)+COUNTIF($C$50:C52,C52)-1","v":3},1,"CR",0]
[null,1,"CS",0,{"$f":"IF(D62=D63,INDEX($J$6:$O$11,MATCH(C62,$I$6:$I$11,0),MATCH(C63,$J$5:$O$5,0)),IF(D62=D61,INDEX($J$6:$O$11,MATCH(C62,$I$6:$I$11,0),MATCH(C61,$J$5:$O$5,0)),0))","v":0},0,{"$f":"IF(AND(F62<>F61,F62<>F63),F62,F62+VLOOKUP(C62,$A$50:$F$55,6,0)/100)","v":0},4,null,null,null,{"$f":"RANK(C53,$C$50:$C$55)+COUNTIF($C$50:C53,C53)-1","v":4},1,"CS",0]
[null,1,"CT",0,{"$f":"IF(D63=D64,INDEX($J$6:$O$11,MATCH(C63,$I$6:$I$11,0),MATCH(C64,$J$5:$O$5,0)),IF(D63=D62,INDEX($J$6:$O$11,MATCH(C63,$I$6:$I$11,0),MATCH(C62,$J$5:$O$5,0)),0))","v":0},0,{"$f":"IF(AND(F63<>F62,F63<>F64),F63,F63+VLOOKUP(C63,$A$50:$F$55,6,0)/100)","v":0},5,null,null,null,{"$f":"RANK(C54,$C$50:$C$55)+COUNTIF($C$50:C54,C54)-1","v":5},1,"CT",0]
[null,1,"CU",0,{"$f":"IF(D64=D59,INDEX($J$6:$O$11,MATCH(C64,$I$6:$I$11,0),MATCH(C59,$J$5:$O$5,0)),IF(D64=D63,INDEX($J$6:$O$11,MATCH(C64,$I$6:$I$11,0),MATCH(C63,$J$5:$O$5,0)),0))","v":0},0,{"$f":"IF(AND(F64<>F63,F64<>F59),F64,F64+VLOOKUP(C64,$A$50:$F$55,6,0)/100)","v":0},6,null,null,null,{"$f":"RANK(C55,$C$50:$C$55)+COUNTIF($C$50:C55,C55)-1","v":6},1,"CU",0]

{"sheet":"P13","index":12,"n_rows":64,"n_cols":15,"rows_kept":64,"cut":false,"hidden":false,"merged":[[0,0,0,5],[1,0,1,5],[2,0,2,5],[3,0,3,5],[13,6,14,6],[56,1,56,6],[56,12,56,14],[20,6,21,6],[27,6,28,6],[34,6,35,6],[41,6,42,6],[47,0,47,5]]}
[]
["CHAMPIONNAT DES CLUBS"]
[]
["POULE 13",null,null,null,null,null,null,null,"Récapitulatif  différence match entre 2 équipes"]
["EQUIPES",null,"POINTS","Pour","Contre","Diff",null,null,null,{"$f":"A6","v":"CV"},{"$f":"A7","v":"CW"},{"$f":"A8","v":"CX"},{"$f":"A9","v":"CY"},{"$f":"A10","v":"CZ"},{"$f":"A11","v":"DA"}]
["CV","13A",{"$f":"SUM(E16,E23,E30,E37,F45)","v":0},{"$f":"I16+I23+I30+I37+J45","v":0},{"$f":"J16+J23+J30+J37+I45","v":0},{"$f":"D6-E6","v":0},null,null,{"$f":"A6","v":"CV"},null,{"$f":"IF(ISBLANK(B16),0,IFERROR(INDEX($B$15:$B$46,MATCH($I6&K$5,$K$15:$K$46,0))-INDEX($D$15:$D$46,MATCH($I6&K$5,$K$15:$K$46,0)),0-INDEX($J$6:$O$11,MATCH(K$5,$I$6:$I$11,0),MATCH($I6,$J$5:$O$5,0))))","v":0},{"$f":"IF(ISBLANK(B23),0,IFERROR(INDEX($B$15:$B$46,MATCH($I6&L$5,$K$15:$K$46,0))-INDEX($D$15:$D$46,MATCH($I6&L$5,$K$15:$K$46,0)),0-INDEX($J$6:$O$11,MATCH(L$5,$I$6:$I$11,0),MATCH($I6,$J$5:$O$5,0))))","v":0},{"$f":"IF(ISBLANK(B37),0,IFERROR(INDEX($B$15:$B$46,MATCH($I6&M$5,$K$15:$K$46,0))-INDEX($D$15:$D$46,MATCH($I6&M$5,$K$15:$K$46,0)),0-INDEX($J$6:$O$11,MATCH(M$5,$I$6:$I$11,0),MATCH($I6,$J$5:$O$5,0))))","v":0},{"$f":"IF(ISBLANK(B45),0,IFERROR(INDEX($B$15:$B$46,MATCH($I6&N$5,$K$15:$K$46,0))-INDEX($D$15:$D$46,MATCH($I6&N$5,$K$15:$K$46,0)),0-INDEX($J$6:$O$11,MATCH(N$5,$I$6:$I$11,0),MATCH($I6,$J$5:$O$5,0))))","v":0},{"$f":"IF(ISBLANK(B30),0,IFERROR(INDEX($B$15:$B$46,MATCH($I6&O$5,$K$15:$K$46,0))-INDEX($D$15:$D$46,MATCH($I6&O$5,$K$15:$K$46,0)),0-INDEX($J$6:$O$11,MATCH(O$5,$I$6:$I$11,0),MATCH($I6,$J$5:$O$5,0))))","v":0}]
["CW","13B",{"$f":"SUM(F16,E24,F32,E38,E46)","v":0},{"$f":"J16+I24+J32+I38+I46","v":0},{"$f":"I16+J24+I32+J38+J46","v":0},0,null,null,"CW",{"$f":"IF(ISBLANK(B16),0,IFERROR(INDEX($B$15:$B$46,MATCH($I7&J$5,$K$15:$K$46,0))-INDEX($D$15:$D$46,MATCH($I7&J$5,$K$15:$K$46,0)),0-INDEX($J$6:$O$11,MATCH(J$5,$I$6:$I$11,0),MATCH($I7,$J$5:$O$5,0))))","v":0},null,{"$f":"IF(ISBLANK(B32),0,IFERROR(INDEX($B$15:$B$46,MATCH($I7&L$5,$K$15:$K$46,0))-INDEX($D$15:$D$46,MATCH($I7&L$5,$K$15:$K$46,0)),0-INDEX($J$6:$O$11,MATCH(L$5,$I$6:$I$11,0),MATCH($I7,$J$5:$O$5,0))))","v":0},{"$f":"IF(ISBLANK(B46),0,IFERROR(INDEX($B$15:$B$46,MATCH($I7&M$5,$K$15:$K$46,0))-INDEX($D$15:$D$46,MATCH($I7&M$5,$K$15:$K$46,0)),0-INDEX($J$6:$O$11,MATCH(M$5,$I$6:$I$11,0),MATCH($I7,$J$5:$O$5,0))))","v":0},{"$f":"IF(ISBLANK(B24),0,IFERROR(INDEX($B$15:$B$46,MATCH($I7&N$5,$K$15:$K$46,0))-INDEX($D$15:$D$46,MATCH($I7&N$5,$K$15:$K$46,0)),0-INDEX($J$6:$O$11,MATCH(N$5,$I$6:$I$11,0),MATCH($I7,$J$5:$O$5,0))))","v":0},{"$f":"IF(ISBLANK(B38),0,IFERROR(INDEX($B$15:$B$46,MATCH($I7&O$5,$K$15:$K$46,0))-INDEX($D$15:$D$46,MATCH($I7&O$5,$K$15:$K$46,0)),0-INDEX($J$6:$O$11,MATCH(O$5,$I$6:$I$11,0),MATCH($I7,$J$5:$O$5,0))))","v":0}]
["CX","13C",{"$f":"SUM(E17,F23,E32,E39,E44)","v":0},{"$f":"I17+J23+I32+I39+I44","v":0},{"$f":"J17+I23+J32+J39+J44","v":0},0,null,null,"CX",{"$f":"IF(ISBLANK(B23),0,IFERROR(INDEX($B$15:$B$46,MATCH($I8&J$5,$K$15:$K$46,0))-INDEX($D$15:$D$46,MATCH($I8&J$5,$K$15:$K$46,0)),0-INDEX($J$6:$O$11,MATCH(J$5,$I$6:$I$11,0),MATCH($I8,$J$5:$O$5,0))))","v":0},{"$f":"IF(ISBLANK(B32),0,IFERROR(INDEX($B$15:$B$46,MATCH($I8&K$5,$K$15:$K$46,0))-INDEX($D$15:$D$46,MATCH($I8&K$5,$K$15:$K$46,0)),0-INDEX($J$6:$O$11,MATCH(K$5,$I$6:$I$11,0),MATCH($I8,$J$5:$O$5,0))))","v":0},null,{"$f":"IF(ISBLANK(B17),0,IFERROR(INDEX($B$15:$B$46,MATCH($I8&M$5,$K$15:$K$46,0))-INDEX($D$15:$D$46,MATCH($I8&M$5,$K$15:$K$46,0)),0-INDEX($J$6:$O$11,MATCH(M$5,$I$6:$I$11,0),MATCH($I8,$J$5:$O$5,0))))","v":0},{"$f":"IF(ISBLANK(B39),0,IFERROR(INDEX($B$15:$B$46,MATCH($I8&N$5,$K$15:$K$46,0))-INDEX($D$15:$D$46,MATCH($I8&N$5,$K$15:$K$46,0)),0-INDEX($J$6:$O$11,MATCH(N$5,$I$6:$I$11,0),MATCH($I8,$J$5:$O$5,0))))","v":0},{"$f":"IF(ISBLANK(B44),0,IFERROR(INDEX($B$15:$B$46,MATCH($I8&O$5,$K$15:$K$46,0))-INDEX($D$15:$D$46,MATCH($I8&O$5,$K$15:$K$46,0)),0-INDEX($J$6:$O$11,MATCH(O$5,$I$6:$I$11,0),MATCH($I8,$J$5:$O$5,0))))","v":0}]
["CY","13D",{"$f":"SUM(F17,E25,F31,F37,F46)","v":0},{"$f":"J17+I25+J31+J37+J46","v":0},{"$f":"I17+J25+I31+I37+I46","v":0},0,null,null,"CY",{"$f":"IF(ISBLANK(B37),0,IFERROR(INDEX($B$15:$B$46,MATCH($I9&J$5,$K$15:$K$46,0))-INDEX($D$15:$D$46,MATCH($I9&J$5,$K$15:$K$46,0)),0-INDEX($J$6:$O$11,MATCH(J$5,$I$6:$I$11,0),MATCH($I9,$J$5:$O$5,0))))","v":0},{"$f":"IF(ISBLANK(B46),0,IFERROR(INDEX($B$15:$B$46,MATCH($I9&K$5,$K$15:$K$46,0))-INDEX($D$15:$D$46,MATCH($I9&K$5,$K$15:$K$46,0)),0-INDEX($J$6:$O$11,MATCH(K$5,$I$6:$I$11,0),MATCH($I9,$J$5:$O$5,0))))","v":0},{"$f":"IF(ISBLANK(B17),0,IFERROR(INDEX($B$15:$B$46,MATCH($I9&L$5,$K$15:$K$46,0))-INDEX($D$15:$D$46,MATCH($I9&L$5,$K$15:$K$46,0)),0-INDEX($J$6:$O$11,MATCH(L$5,$I$6:$I$11,0),MATCH($I9,$J$5:$O$5,0))))","v":0},null,{"$f":"IF(ISBLANK(B31),0,IFERROR(INDEX($B$15:$B$46,MATCH($I9&N$5,$K$15:$K$46,0))-INDEX($D$15:$D$46,MATCH($I9&N$5,$K$15:$K$46,0)),0-INDEX($J$6:$O$11,MATCH(N$5,$I$6:$I$11,0),MATCH($I9,$J$5:$O$5,0))))","v":0},{"$f":"IF(ISBLANK(B25),0,IFERROR(INDEX($B$15:$B$46,MATCH($I9&O$5,$K$15:$K$46,0))-INDEX($D$15:$D$46,MATCH($I9&O$5,$K$15:$K$46,0)),0-INDEX($J$6:$O$11,MATCH(O$5,$I$6:$I$11,0),MATCH($I9,$J$5:$O$5,0))))","v":0}]
["CZ","13E",{"$f":"SUM(E18,F24,E31,F39,E45)","v":0},{"$f":"I18+J24+I31+J39+I45","v":0},{"$f":"J18+I24+J31+I39+J45","v":0},0,null,null,"CZ",{"$f":"IF(ISBLANK(B45),0,IFERROR(INDEX($B$15:$B$46,MATCH($I10&J$5,$K$15:$K$46,0))-INDEX($D$15:$D$46,MATCH($I10&J$5,$K$15:$K$46,0)),0-INDEX($J$6:$O$11,MATCH(J$5,$I$6:$I$11,0),MATCH($I10,$J$5:$O$5,0))))","v":0},{"$f":"IF(ISBLANK(B24),0,IFERROR(INDEX($B$15:$B$46,MATCH($I10&K$5,$K$15:$K$46,0))-INDEX($D$15:$D$46,MATCH($I10&K$5,$K$15:$K$46,0)),0-INDEX($J$6:$O$11,MATCH(K$5,$I$6:$I$11,0),MATCH($I10,$J$5:$O$5,0))))","v":0},{"$f":"IF(ISBLANK(B39),0,IFERROR(INDEX($B$15:$B$46,MATCH($I10&L$5,$K$15:$K$46,0))-INDEX($D$15:$D$46,MATCH($I10&L$5,$K$15:$K$46,0)),0-INDEX($J$6:$O$11,MATCH(L$5,$I$6:$I$11,0),MATCH($I10,$J$5:$O$5,0))))","v":0},{"$f":"IF(ISBLANK(B31),0,IFERROR(INDEX($B$15:$B$46,MATCH($I10&M$5,$K$15:$K$46,0))-INDEX($D$15:$D$46,MATCH($I10&M$5,$K$15:$K$46,0)),0-INDEX($J$6:$O$11,MATCH(M$5,$I$6:$I$11,0),MATCH($I10,$J$5:$O$5,0))))","v":0},null,{"$f":"IF(ISBLANK(B18),0,IFERROR(INDEX($B$15:$B$46,MATCH($I10&O$5,$K$15:$K$46,0))-INDEX($D$15:$D$46,MATCH($I10&O$5,$K$15:$K$46,0)),0-INDEX($J$6:$O$11,MATCH(O$5,$I$6:$I$11,0),MATCH($I10,$J$5:$O$5,0))))","v":0}]
["DA","13F",{"$f":"SUM(F18,F25,F30,F38,F44)","v":0},{"$f":"J18+J25+J30+J38+J44","v":0},{"$f":"I18+I25+I30+I38+I44","v":0},0,null,null,"DA",{"$f":"IF(ISBLANK(B30),0,IFERROR(INDEX($B$15:$B$46,MATCH($I11&J$5,$K$15:$K$46,0))-INDEX($D$15:$D$46,MATCH($I11&J$5,$K$15:$K$46,0)),0-INDEX($J$6:$O$11,MATCH(J$5,$I$6:$I$11,0),MATCH($I11,$J$5:$O$5,0))))","v":0},{"$f":"IF(ISBLANK(B38),0,IFERROR(INDEX($B$15:$B$46,MATCH($I11&K$5,$K$15:$K$46,0))-INDEX($D$15:$D$46,MATCH($I11&K$5,$K$15:$K$46,0)),0-INDEX($J$6:$O$11,MATCH(K$5,$I$6:$I$11,0),MATCH($I11,$J$5:$O$5,0))))","v":0},{"$f":"IF(ISBLANK(B44),0,IFERROR(INDEX($B$15:$B$46,MATCH($I11&L$5,$K$15:$K$46,0))-INDEX($D$15:$D$46,MATCH($I11&L$5,$K$15:$K$46,0)),0-INDEX($J$6:$O$11,MATCH(L$5,$I$6:$I$11,0),MATCH($I11,$J$5:$O$5,0))))","v":0},{"$f":"IF(ISBLANK(B25),0,IFERROR(INDEX($B$15:$B$46,MATCH($I11&M$5,$K$15:$K$46,0))-INDEX($D$15:$D$46,MATCH($I11&M$5,$K$15:$K$46,0)),0-INDEX($J$6:$O$11,MATCH(M$5,$I$6:$I$11,0),MATCH($I11,$J$5:$O$5,0))))","v":0},{"$f":"IF(ISBLANK(B18),0,IFERROR(INDEX($B$15:$B$46,MATCH($I11&N$5,$K$15:$K$46,0))-INDEX($D$15:$D$46,MATCH($I11&N$5,$K$15:$K$46,0)),0-INDEX($J$6:$O$11,MATCH(N$5,$I$6:$I$11,0),MATCH($I11,$J$5:$O$5,0))))","v":0}]
[null,null,null,null,null,null,null,null,"Les concaténations en rouge permettent de remplir par formules le récapitulatif au dessus"]
["1er MATCH le 15 mai","à",{"$f":"A6","v":"CV"},null,null,null,null,null,"Ce récap servira à départager les ex aequos"]
[null,null,null,null,null,null,"SI forfait éq recevante"]
["Equipes","score","Equipes","score"]
[{"$f":"$A$6","v":"CV"},null,{"$f":"$A$7","v":"CW"},{"$f":"IF(G16=19,19,IF(ISBLANK(B16),\"\",IF(B16=19,0,36-B16)))","v":""},{"$f":"IF(G16=19,0,IF(ISBLANK(B16),\"\",IF(B16<18,1,IF(B16=18,2,IF(B16>18,3)))))","v":""},{"$f":"IF(G16=19,3,IF(ISBLANK(B16),\"\",IF(B16=19,0,IF(D16<18,1,IF(D16=18,2,IF(D16>=20,3))))))","v":""},null,null,{"$f":"IF(ISBLANK(B16),0,B16)","v":0},{"$f":"IF(ISBLANK(B16),0,D16)","v":0},{"$f":"A16&C16","v":"CVCW"}]
[{"$f":"$A$8","v":"CX"},null,{"$f":"$A$9","v":"CY"},{"$f":"IF(G17=19,19,IF(ISBLANK(B17),\"\",IF(B17=19,0,36-B17)))","v":""},{"$f":"IF(G17=19,0,IF(ISBLANK(B17),\"\",IF(B17<18,1,IF(B17=18,2,IF(B17>18,3)))))","v":""},{"$f":"IF(G17=19,3,IF(ISBLANK(B17),\"\",IF(B17=19,0,IF(D17<18,1,IF(D17=18,2,IF(D17>=20,3))))))","v":""},null,null,{"$f":"IF(ISBLANK(B17),0,B17)","v":0},{"$f":"IF(ISBLANK(B17),0,D17)","v":0},{"$f":"A17&C17","v":"CXCY"}]
[{"$f":"$A$10","v":"CZ"},null,{"$f":"$A$11","v":"DA"},{"$f":"IF(G18=19,19,IF(ISBLANK(B18),\"\",IF(B18=19,0,36-B18)))","v":""},{"$f":"IF(G18=19,0,IF(ISBLANK(B18),\"\",IF(B18<18,1,IF(B18=18,2,IF(B18>18,3)))))","v":""},{"$f":"IF(G18=19,3,IF(ISBLANK(B18),\"\",IF(B18=19,0,IF(D18<18,1,IF(D18=18,2,IF(D18>=20,3))))))","v":""},null,null,{"$f":"IF(ISBLANK(B18),0,B18)","v":0},{"$f":"IF(ISBLANK(B18),0,D18)","v":0},{"$f":"A18&C18","v":"CZDA"}]
[]
["2 éme MATCH le 22 mai","à",{"$f":"A7","v":"CW"}]
[null,null,null,null,null,null,"SI forfait éq recevante"]
["Equipes","score","Equipes","score"]
[{"$f":"$A$6","v":"CV"},null,{"$f":"$A$8","v":"CX"},{"$f":"IF(G23=19,19,IF(ISBLANK(B23),\"\",IF(B23=19,0,36-B23)))","v":""},{"$f":"IF(G23=19,0,IF(ISBLANK(B23),\"\",IF(B23<18,1,IF(B23=18,2,IF(B23>18,3)))))","v":""},{"$f":"IF(G23=19,3,IF(ISBLANK(B23),\"\",IF(B23=19,0,IF(D23<18,1,IF(D23=18,2,IF(D23>=20,3))))))","v":""},null,null,{"$f":"IF(ISBLANK(B23),0,B23)","v":0},{"$f":"IF(ISBLANK(B23),0,D23)","v":0},{"$f":"A23&C23","v":"CVCX"}]
[{"$f":"$A$7","v":"CW"},null,{"$f":"$A$10","v":"CZ"},{"$f":"IF(G24=19,19,IF(ISBLANK(B24),\"\",IF(B24=19,0,36-B24)))","v":""},{"$f":"IF(G24=19,0,IF(ISBLANK(B24),\"\",IF(B24<18,1,IF(B24=18,2,IF(B24>18,3)))))","v":""},{"$f":"IF(G24=19,3,IF(ISBLANK(B24),\"\",IF(B24=19,0,IF(D24<18,1,IF(D24=18,2,IF(D24>=20,3))))))","v":""},null,null,{"$f":"IF(ISBLANK(B24),0,B24)","v":0},{"$f":"IF(ISBLANK(B24),0,D24)","v":0},{"$f":"A24&C24","v":"CWCZ"}]
[{"$f":"$A$9","v":"CY"},null,{"$f":"$A$11","v":"DA"},{"$f":"IF(G25=19,19,IF(ISBLANK(B25),\"\",IF(B25=19,0,36-B25)))","v":""},{"$f":"IF(G25=19,0,IF(ISBLANK(B25),\"\",IF(B25<18,1,IF(B25=18,2,IF(B25>18,3)))))","v":""},{"$f":"IF(G25=19,3,IF(ISBLANK(B25),\"\",IF(B25=19,0,IF(D25<18,1,IF(D25=18,2,IF(D25>=20,3))))))","v":""},null,null,{"$f":"IF(ISBLANK(B25),0,B25)","v":0},{"$f":"IF(ISBLANK(B25),0,D25)","v":0},{"$f":"A25&C25","v":"CYDA"}]
[]
["3 éme MATCH le 29 mai","à",{"$f":"A8","v":"CX"}]
[null,null,null,null,null,null,"SI forfait éq recevante"]
["Equipes","score","Equipes","score"]
[{"$f":"$A$6","v":"CV"},null,{"$f":"$A$11","v":"DA"},{"$f":"IF(G30=19,19,IF(ISBLANK(B30),\"\",IF(B30=19,0,36-B30)))","v":""},{"$f":"IF(G30=19,0,IF(ISBLANK(B30),\"\",IF(B30<18,1,IF(B30=18,2,IF(B30>18,3)))))","v":""},{"$f":"IF(G30=19,3,IF(ISBLANK(B30),\"\",IF(B30=19,0,IF(D30<18,1,IF(D30=18,2,IF(D30>=20,3))))))","v":""},null,null,{"$f":"IF(ISBLANK(B30),0,B30)","v":0},{"$f":"IF(ISBLANK(B30),0,D30)","v":0},{"$f":"A30&C30","v":"CVDA"}]
[{"$f":"$A$10","v":"CZ"},null,{"$f":"$A$9","v":"CY"},{"$f":"IF(G31=19,19,IF(ISBLANK(B31),\"\",IF(B31=19,0,36-B31)))","v":""},{"$f":"IF(G31=19,0,IF(ISBLANK(B31),\"\",IF(B31<18,1,IF(B31=18,2,IF(B31>18,3)))))","v":""},{"$f":"IF(G31=19,3,IF(ISBLANK(B31),\"\",IF(B31=19,0,IF(D31<18,1,IF(D31=18,2,IF(D31>=20,3))))))","v":""},null,null,{"$f":"IF(ISBLANK(B31),0,B31)","v":0},{"$f":"IF(ISBLANK(B31),0,D31)","v":0},{"$f":"A31&C31","v":"CZCY"}]
[{"$f":"$A$8","v":"CX"},null,{"$f":"$A$7","v":"CW"},{"$f":"IF(G32=19,19,IF(ISBLANK(B32),\"\",IF(B32=19,0,36-B32)))","v":""},{"$f":"IF(G32=19,0,IF(ISBLANK(B32),\"\",IF(B32<18,1,IF(B32=18,2,IF(B32>18,3)))))","v":""},{"$f":"IF(G32=19,3,IF(ISBLANK(B32),\"\",IF(B32=19,0,IF(D32<18,1,IF(D32=18,2,IF(D32>=20,3))))))","v":""},null,null,{"$f":"IF(ISBLANK(B32),0,B32)","v":0},{"$f":"IF(ISBLANK(B32),0,D32)","v":0},{"$f":"A32&C32","v":"CXCW"}]
[]
["4 éme MATCH le 5 juin","à",{"$f":"A9","v":"CY"}]
[null,null,null,null,null,null,"SI forfait éq recevante"]
["Equipes","score","Equipes","score"]
[{"$f":"A6","v":"CV"},null,{"$f":"$A$9","v":"CY"},{"$f":"IF(G37=19,19,IF(ISBLANK(B37),\"\",IF(B37=19,0,36-B37)))","v":""},{"$f":"IF(G37=19,0,IF(ISBLANK(B37),\"\",IF(B37<18,1,IF(B37=18,2,IF(B37>18,3)))))","v":""},{"$f":"IF(G37=19,3,IF(ISBLANK(B37),\"\",IF(B37=19,0,IF(D37<18,1,IF(D37=18,2,IF(D37>=20,3))))))","v":""},null,null,{"$f":"IF(ISBLANK(B37),0,B37)","v":0},{"$f":"IF(ISBLANK(B37),0,D37)","v":0},{"$f":"A37&C37","v":"CVCY"}]
[{"$f":"$A$7","v":"CW"},null,{"$f":"$A$11","v":"DA"},{"$f":"IF(G38=19,19,IF(ISBLANK(B38),\"\",IF(B38=19,0,36-B38)))","v":""},{"$f":"IF(G38=19,0,IF(ISBLANK(B38),\"\",IF(B38<18,1,IF(B38=18,2,IF(B38>18,3)))))","v":""},{"$f":"IF(G38=19,3,IF(ISBLANK(B38),\"\",IF(B38=19,0,IF(D38<18,1,IF(D38=18,2,IF(D38>=20,3))))))","v":""},null,null,{"$f":"IF(ISBLANK(B38),0,B38)","v":0},{"$f":"IF(ISBLANK(B38),0,D38)","v":0},{"$f":"A38&C38","v":"CWDA"}]
[{"$f":"A8","v":"CX"},null,{"$f":"$A$10","v":"CZ"},{"$f":"IF(G39=19,19,IF(ISBLANK(B39),\"\",IF(B39=19,0,36-B39)))","v":""},{"$f":"IF(G39=19,0,IF(ISBLANK(B39),\"\",IF(B39<18,1,IF(B39=18,2,IF(B39>18,3)))))","v":""},{"$f":"IF(G39=19,3,IF(ISBLANK(B39),\"\",IF(B39=19,0,IF(D39<18,1,IF(D39=18,2,IF(D39>=20,3))))))","v":""},null,null,{"$f":"IF(ISBLANK(B39),0,B39)","v":0},{"$f":"IF(ISBLANK(B39),0,D39)","v":0},{"$f":"A39&C39","v":"CXCZ"}]
[]
["5 éme MATCH le 12 juin","à",{"$f":"A10","v":"CZ"}]
[null,null,null,null,null,null,"SI forfait éq recevante"]
["Equipes","score","Equipes","score"]
[{"$f":"A8","v":"CX"},null,{"$f":"$A$11","v":"DA"},{"$f":"IF(G44=19,19,IF(ISBLANK(B44),\"\",IF(B44=19,0,36-B44)))","v":""},{"$f":"IF(G44=19,0,IF(ISBLANK(B44),\"\",IF(B44<18,1,IF(B44=18,2,IF(B44>18,3)))))","v":""},{"$f":"IF(G44=19,3,IF(ISBLANK(B44),\"\",IF(B44=19,0,IF(D44<18,1,IF(D44=18,2,IF(D44>=20,3))))))","v":""},null,null,{"$f":"IF(ISBLANK(B44),0,B44)","v":0},{"$f":"IF(ISBLANK(B44),0,D44)","v":0},{"$f":"A44&C44","v":"CXDA"}]
[{"$f":"$A$10","v":"CZ"},null,{"$f":"A6","v":"CV"},{"$f":"IF(G45=19,19,IF(ISBLANK(B45),\"\",IF(B45=19,0,36-B45)))","v":""},{"$f":"IF(G45=19,0,IF(ISBLANK(B45),\"\",IF(B45<18,1,IF(B45=18,2,IF(B45>18,3)))))","v":""},{"$f":"IF(G45=19,3,IF(ISBLANK(B45),\"\",IF(B45=19,0,IF(D45<18,1,IF(D45=18,2,IF(D45>=20,3))))))","v":""},null,null,{"$f":"IF(ISBLANK(B45),0,B45)","v":0},{"$f":"IF(ISBLANK(B45),0,D45)","v":0},{"$f":"A45&C45","v":"CZCV"}]
[{"$f":"A7","v":"CW"},null,{"$f":"$A$9","v":"CY"},{"$f":"IF(G46=19,19,IF(ISBLANK(B46),\"\",IF(B46=19,0,36-B46)))","v":""},{"$f":"IF(G46=19,0,IF(ISBLANK(B46),\"\",IF(B46<18,1,IF(B46=18,2,IF(B46>18,3)))))","v":""},{"$f":"IF(G46=19,3,IF(ISBLANK(B46),\"\",IF(B46=19,0,IF(D46<18,1,IF(D46=18,2,IF(D46>=20,3))))))","v":""},null,null,{"$f":"IF(ISBLANK(B46),0,B46)","v":0},{"$f":"IF(ISBLANK(B46),0,D46)","v":0},{"$f":"A46&C46","v":"CWCY"}]
[]
["CLASSEMENT"]
["EQUIPES",null,"POINTS","Pour","Contre","Diff","CLASST"]
["CV","13A",0,0,0,0,{"$f":"B59","v":1},{"$f":"IF(AND(G50=1,COUNTIF(rang1,1)>1),COUNTIF(G$50:G50,1),IF(AND(G50=2,COUNTIF(rang1,2)>1),COUNTIF(G$50:G50,2)+3,\"\"))","v":1}]
["CW","13B",0,0,0,0,1,{"$f":"IF(AND(G51=1,COUNTIF(rang1,1)>1),COUNTIF(G$50:G51,1),IF(AND(G51=2,COUNTIF(rang1,2)>1),COUNTIF(G$50:G51,2)+3,\"\"))","v":2}]
["CX","13C",0,0,0,0,1,{"$f":"IF(AND(G52=1,COUNTIF(rang1,1)>1),COUNTIF(G$50:G52,1),IF(AND(G52=2,COUNTIF(rang1,2)>1),COUNTIF(G$50:G52,2)+3,\"\"))","v":3}]
["CY","13D",0,0,0,0,1,{"$f":"IF(AND(G53=1,COUNTIF(rang1,1)>1),COUNTIF(G$50:G53,1),IF(AND(G53=2,COUNTIF(rang1,2)>1),COUNTIF(G$50:G53,2)+3,\"\"))","v":4}]
["CZ","13E",0,0,0,0,1,{"$f":"IF(AND(G54=1,COUNTIF(rang1,1)>1),COUNTIF(G$50:G54,1),IF(AND(G54=2,COUNTIF(rang1,2)>1),COUNTIF(G$50:G54,2)+3,\"\"))","v":5}]
["DA","13F",0,0,0,0,1,{"$f":"IF(AND(G55=1,COUNTIF(rang1,1)>1),COUNTIF(G$50:G55,1),IF(AND(G55=2,COUNTIF(rang1,2)>1),COUNTIF(G$50:G55,2)+3,\"\"))","v":6}]
[]
[null,"CLASSEMENT FINAL et DEPARTAGE EX AEQUOS",null,null,null,null,null,null,null,null,null,null,"CLASSEMENT"]
[null,"Rang","Equipes","Pts","diff pts avec exaequo","cumul","departage goalaverage si même cumul","RP",null,null,null,"RP","Rang","Equipe","Pts"]
[null,{"$f":"RANK(G59,$G$59:$G$64)","v":1},{"$f":"INDEX($A$50:$A$55,MATCH(H59,$L$59:$L$64,0))","v":"CV"},{"$f":"VLOOKUP(C59,$A$50:$C$55,3,0)","v":0},{"$f":"IF(D59=D60,INDEX($J$6:$O$11,MATCH(C59,$I$6:$I$11,0),MATCH(C60,$J$5:$O$5,0)),IF(D59=D58,INDEX($J$6:$O$11,MATCH(C59,$I$6:$I$11,0),MATCH(C58,$J$5:$O$5,0)),0))","v":0},{"$f":"D59+E59/100","v":0},{"$f":"IF(AND(F59<>F58,F59<>F60),F59,F59+VLOOKUP(C59,$A$50:$F$55,6,0)/100)","v":0},1,null,null,null,{"$f":"RANK(C50,$C$50:$C$55)+COUNTIF($C$50:C50,C50)-1","v":1},{"$f":"B59","v":1},"CV",{"$f":"VLOOKUP(N59,$C$59:$D$64,2,0)","v":0}]
[null,1,"CW",0,{"$f":"IF(D60=D61,INDEX($J$6:$O$11,MATCH(C60,$I$6:$I$11,0),MATCH(C61,$J$5:$O$5,0)),IF(D60=D59,INDEX($J$6:$O$11,MATCH(C60,$I$6:$I$11,0),MATCH(C59,$J$5:$O$5,0)),0))","v":0},0,{"$f":"IF(AND(F60<>F59,F60<>F61),F60,F60+VLOOKUP(C60,$A$50:$F$55,6,0)/100)","v":0},2,null,null,null,{"$f":"RANK(C51,$C$50:$C$55)+COUNTIF($C$50:C51,C51)-1","v":2},1,"CW",0]
[null,1,"CX",0,{"$f":"IF(D61=D62,INDEX($J$6:$O$11,MATCH(C61,$I$6:$I$11,0),MATCH(C62,$J$5:$O$5,0)),IF(D61=D60,INDEX($J$6:$O$11,MATCH(C61,$I$6:$I$11,0),MATCH(C60,$J$5:$O$5,0)),0))","v":0},0,{"$f":"IF(AND(F61<>F60,F61<>F62),F61,F61+VLOOKUP(C61,$A$50:$F$55,6,0)/100)","v":0},3,null,null,null,{"$f":"RANK(C52,$C$50:$C$55)+COUNTIF($C$50:C52,C52)-1","v":3},1,"CX",0]
[null,1,"CY",0,{"$f":"IF(D62=D63,INDEX($J$6:$O$11,MATCH(C62,$I$6:$I$11,0),MATCH(C63,$J$5:$O$5,0)),IF(D62=D61,INDEX($J$6:$O$11,MATCH(C62,$I$6:$I$11,0),MATCH(C61,$J$5:$O$5,0)),0))","v":0},0,{"$f":"IF(AND(F62<>F61,F62<>F63),F62,F62+VLOOKUP(C62,$A$50:$F$55,6,0)/100)","v":0},4,null,null,null,{"$f":"RANK(C53,$C$50:$C$55)+COUNTIF($C$50:C53,C53)-1","v":4},1,"CY",0]
[null,1,"CZ",0,{"$f":"IF(D63=D64,INDEX($J$6:$O$11,MATCH(C63,$I$6:$I$11,0),MATCH(C64,$J$5:$O$5,0)),IF(D63=D62,INDEX($J$6:$O$11,MATCH(C63,$I$6:$I$11,0),MATCH(C62,$J$5:$O$5,0)),0))","v":0},0,{"$f":"IF(AND(F63<>F62,F63<>F64),F63,F63+VLOOKUP(C63,$A$50:$F$55,6,0)/100)","v":0},5,null,null,null,{"$f":"RANK(C54,$C$50:$C$55)+COUNTIF($C$50:C54,C54)-1","v":5},1,"CZ",0]
[null,1,"DA",0,{"$f":"IF(D64=D59,INDEX($J$6:$O$11,MATCH(C64,$I$6:$I$11,0),MATCH(C59,$J$5:$O$5,0)),IF(D64=D63,INDEX($J$6:$O$11,MATCH(C64,$I$6:$I$11,0),MATCH(C63,$J$5:$O$5,0)),0))","v":0},0,{"$f":"IF(AND(F64<>F63,F64<>F59),F64,F64+VLOOKUP(C64,$A$50:$F$55,6,0)/100)","v":0},6,null,null,null,{"$f":"RANK(C55,$C$50:$C$55)+COUNTIF($C$50:C55,C55)-1","v":6},1,"DA",0]

{"sheet":"P14","index":13,"n_rows":64,"n_cols":15,"rows_kept":64,"cut":false,"hidden":false,"merged":[[0,0,0,5],[1,0,1,5],[2,0,2,5],[3,0,3,5],[13,6,14,6],[56,1,56,6],[56,12,56,14],[20,6,21,6],[27,6,28,6],[34,6,35,6],[41,6,42,6],[47,0,47,5]]}
[]
["CHAMPIONNAT DES CLUBS"]
[]
["POULE 12",null,null,null,null,null,null,null,"Récapitulatif  différence match entre 2 équipes"]
["EQUIPES",null,"POINTS","Pour","Contre","Diff",null,null,null,{"$f":"A6","v":"DB"},{"$f":"A7","v":"DE"},{"$f":"A8","v":"DF"},{"$f":"A9","v":"DG"},{"$f":"A10","v":"DH"},{"$f":"A11","v":"DI"}]
["DB","14A",{"$f":"SUM(E16,E23,E30,E37,F45)","v":0},{"$f":"I16+I23+I30+I37+J45","v":0},{"$f":"J16+J23+J30+J37+I45","v":0},{"$f":"D6-E6","v":0},null,null,{"$f":"A6","v":"DB"},null,{"$f":"IF(ISBLANK(B16),0,IFERROR(INDEX($B$15:$B$46,MATCH($I6&K$5,$K$15:$K$46,0))-INDEX($D$15:$D$46,MATCH($I6&K$5,$K$15:$K$46,0)),0-INDEX($J$6:$O$11,MATCH(K$5,$I$6:$I$11,0),MATCH($I6,$J$5:$O$5,0))))","v":0},{"$f":"IF(ISBLANK(B23),0,IFERROR(INDEX($B$15:$B$46,MATCH($I6&L$5,$K$15:$K$46,0))-INDEX($D$15:$D$46,MATCH($I6&L$5,$K$15:$K$46,0)),0-INDEX($J$6:$O$11,MATCH(L$5,$I$6:$I$11,0),MATCH($I6,$J$5:$O$5,0))))","v":0},{"$f":"IF(ISBLANK(B37),0,IFERROR(INDEX($B$15:$B$46,MATCH($I6&M$5,$K$15:$K$46,0))-INDEX($D$15:$D$46,MATCH($I6&M$5,$K$15:$K$46,0)),0-INDEX($J$6:$O$11,MATCH(M$5,$I$6:$I$11,0),MATCH($I6,$J$5:$O$5,0))))","v":0},{"$f":"IF(ISBLANK(B45),0,IFERROR(INDEX($B$15:$B$46,MATCH($I6&N$5,$K$15:$K$46,0))-INDEX($D$15:$D$46,MATCH($I6&N$5,$K$15:$K$46,0)),0-INDEX($J$6:$O$11,MATCH(N$5,$I$6:$I$11,0),MATCH($I6,$J$5:$O$5,0))))","v":0},{"$f":"IF(ISBLANK(B30),0,IFERROR(INDEX($B$15:$B$46,MATCH($I6&O$5,$K$15:$K$46,0))-INDEX($D$15:$D$46,MATCH($I6&O$5,$K$15:$K$46,0)),0-INDEX($J$6:$O$11,MATCH(O$5,$I$6:$I$11,0),MATCH($I6,$J$5:$O$5,0))))","v":0}]
["DE","14B",{"$f":"SUM(F16,E24,F32,E38,E46)","v":0},{"$f":"J16+I24+J32+I38+I46","v":0},{"$f":"I16+J24+I32+J38+J46","v":0},0,null,null,"DE",{"$f":"IF(ISBLANK(B16),0,IFERROR(INDEX($B$15:$B$46,MATCH($I7&J$5,$K$15:$K$46,0))-INDEX($D$15:$D$46,MATCH($I7&J$5,$K$15:$K$46,0)),0-INDEX($J$6:$O$11,MATCH(J$5,$I$6:$I$11,0),MATCH($I7,$J$5:$O$5,0))))","v":0},null,{"$f":"IF(ISBLANK(B32),0,IFERROR(INDEX($B$15:$B$46,MATCH($I7&L$5,$K$15:$K$46,0))-INDEX($D$15:$D$46,MATCH($I7&L$5,$K$15:$K$46,0)),0-INDEX($J$6:$O$11,MATCH(L$5,$I$6:$I$11,0),MATCH($I7,$J$5:$O$5,0))))","v":0},{"$f":"IF(ISBLANK(B46),0,IFERROR(INDEX($B$15:$B$46,MATCH($I7&M$5,$K$15:$K$46,0))-INDEX($D$15:$D$46,MATCH($I7&M$5,$K$15:$K$46,0)),0-INDEX($J$6:$O$11,MATCH(M$5,$I$6:$I$11,0),MATCH($I7,$J$5:$O$5,0))))","v":0},{"$f":"IF(ISBLANK(B24),0,IFERROR(INDEX($B$15:$B$46,MATCH($I7&N$5,$K$15:$K$46,0))-INDEX($D$15:$D$46,MATCH($I7&N$5,$K$15:$K$46,0)),0-INDEX($J$6:$O$11,MATCH(N$5,$I$6:$I$11,0),MATCH($I7,$J$5:$O$5,0))))","v":0},{"$f":"IF(ISBLANK(B38),0,IFERROR(INDEX($B$15:$B$46,MATCH($I7&O$5,$K$15:$K$46,0))-INDEX($D$15:$D$46,MATCH($I7&O$5,$K$15:$K$46,0)),0-INDEX($J$6:$O$11,MATCH(O$5,$I$6:$I$11,0),MATCH($I7,$J$5:$O$5,0))))","v":0}]
["DF","14C",{"$f":"SUM(E17,F23,E32,E39,E44)","v":0},{"$f":"I17+J23+I32+I39+I44","v":0},{"$f":"J17+I23+J32+J39+J44","v":0},0,null,null,"DF",{"$f":"IF(ISBLANK(B23),0,IFERROR(INDEX($B$15:$B$46,MATCH($I8&J$5,$K$15:$K$46,0))-INDEX($D$15:$D$46,MATCH($I8&J$5,$K$15:$K$46,0)),0-INDEX($J$6:$O$11,MATCH(J$5,$I$6:$I$11,0),MATCH($I8,$J$5:$O$5,0))))","v":0},{"$f":"IF(ISBLANK(B32),0,IFERROR(INDEX($B$15:$B$46,MATCH($I8&K$5,$K$15:$K$46,0))-INDEX($D$15:$D$46,MATCH($I8&K$5,$K$15:$K$46,0)),0-INDEX($J$6:$O$11,MATCH(K$5,$I$6:$I$11,0),MATCH($I8,$J$5:$O$5,0))))","v":0},null,{"$f":"IF(ISBLANK(B17),0,IFERROR(INDEX($B$15:$B$46,MATCH($I8&M$5,$K$15:$K$46,0))-INDEX($D$15:$D$46,MATCH($I8&M$5,$K$15:$K$46,0)),0-INDEX($J$6:$O$11,MATCH(M$5,$I$6:$I$11,0),MATCH($I8,$J$5:$O$5,0))))","v":0},{"$f":"IF(ISBLANK(B39),0,IFERROR(INDEX($B$15:$B$46,MATCH($I8&N$5,$K$15:$K$46,0))-INDEX($D$15:$D$46,MATCH($I8&N$5,$K$15:$K$46,0)),0-INDEX($J$6:$O$11,MATCH(N$5,$I$6:$I$11,0),MATCH($I8,$J$5:$O$5,0))))","v":0},{"$f":"IF(ISBLANK(B44),0,IFERROR(INDEX($B$15:$B$46,MATCH($I8&O$5,$K$15:$K$46,0))-INDEX($D$15:$D$46,MATCH($I8&O$5,$K$15:$K$46,0)),0-INDEX($J$6:$O$11,MATCH(O$5,$I$6:$I$11,0),MATCH($I8,$J$5:$O$5,0))))","v":0}]
["DG","14D",{"$f":"SUM(F17,E25,F31,F37,F46)","v":0},{"$f":"J17+I25+J31+J37+J46","v":0},{"$f":"I17+J25+I31+I37+I46","v":0},0,null,null,"DG",{"$f":"IF(ISBLANK(B37),0,IFERROR(INDEX($B$15:$B$46,MATCH($I9&J$5,$K$15:$K$46,0))-INDEX($D$15:$D$46,MATCH($I9&J$5,$K$15:$K$46,0)),0-INDEX($J$6:$O$11,MATCH(J$5,$I$6:$I$11,0),MATCH($I9,$J$5:$O$5,0))))","v":0},{"$f":"IF(ISBLANK(B46),0,IFERROR(INDEX($B$15:$B$46,MATCH($I9&K$5,$K$15:$K$46,0))-INDEX($D$15:$D$46,MATCH($I9&K$5,$K$15:$K$46,0)),0-INDEX($J$6:$O$11,MATCH(K$5,$I$6:$I$11,0),MATCH($I9,$J$5:$O$5,0))))","v":0},{"$f":"IF(ISBLANK(B17),0,IFERROR(INDEX($B$15:$B$46,MATCH($I9&L$5,$K$15:$K$46,0))-INDEX($D$15:$D$46,MATCH($I9&L$5,$K$15:$K$46,0)),0-INDEX($J$6:$O$11,MATCH(L$5,$I$6:$I$11,0),MATCH($I9,$J$5:$O$5,0))))","v":0},null,{"$f":"IF(ISBLANK(B31),0,IFERROR(INDEX($B$15:$B$46,MATCH($I9&N$5,$K$15:$K$46,0))-INDEX($D$15:$D$46,MATCH($I9&N$5,$K$15:$K$46,0)),0-INDEX($J$6:$O$11,MATCH(N$5,$I$6:$I$11,0),MATCH($I9,$J$5:$O$5,0))))","v":0},{"$f":"IF(ISBLANK(B25),0,IFERROR(INDEX($B$15:$B$46,MATCH($I9&O$5,$K$15:$K$46,0))-INDEX($D$15:$D$46,MATCH($I9&O$5,$K$15:$K$46,0)),0-INDEX($J$6:$O$11,MATCH(O$5,$I$6:$I$11,0),MATCH($I9,$J$5:$O$5,0))))","v":0}]
["DH","14E",{"$f":"SUM(E18,F24,E31,F39,E45)","v":0},{"$f":"I18+J24+I31+J39+I45","v":0},{"$f":"J18+I24+J31+I39+J45","v":0},0,null,null,"DH",{"$f":"IF(ISBLANK(B45),0,IFERROR(INDEX($B$15:$B$46,MATCH($I10&J$5,$K$15:$K$46,0))-INDEX($D$15:$D$46,MATCH($I10&J$5,$K$15:$K$46,0)),0-INDEX($J$6:$O$11,MATCH(J$5,$I$6:$I$11,0),MATCH($I10,$J$5:$O$5,0))))","v":0},{"$f":"IF(ISBLANK(B24),0,IFERROR(INDEX($B$15:$B$46,MATCH($I10&K$5,$K$15:$K$46,0))-INDEX($D$15:$D$46,MATCH($I10&K$5,$K$15:$K$46,0)),0-INDEX($J$6:$O$11,MATCH(K$5,$I$6:$I$11,0),MATCH($I10,$J$5:$O$5,0))))","v":0},{"$f":"IF(ISBLANK(B39),0,IFERROR(INDEX($B$15:$B$46,MATCH($I10&L$5,$K$15:$K$46,0))-INDEX($D$15:$D$46,MATCH($I10&L$5,$K$15:$K$46,0)),0-INDEX($J$6:$O$11,MATCH(L$5,$I$6:$I$11,0),MATCH($I10,$J$5:$O$5,0))))","v":0},{"$f":"IF(ISBLANK(B31),0,IFERROR(INDEX($B$15:$B$46,MATCH($I10&M$5,$K$15:$K$46,0))-INDEX($D$15:$D$46,MATCH($I10&M$5,$K$15:$K$46,0)),0-INDEX($J$6:$O$11,MATCH(M$5,$I$6:$I$11,0),MATCH($I10,$J$5:$O$5,0))))","v":0},null,{"$f":"IF(ISBLANK(B18),0,IFERROR(INDEX($B$15:$B$46,MATCH($I10&O$5,$K$15:$K$46,0))-INDEX($D$15:$D$46,MATCH($I10&O$5,$K$15:$K$46,0)),0-INDEX($J$6:$O$11,MATCH(O$5,$I$6:$I$11,0),MATCH($I10,$J$5:$O$5,0))))","v":0}]
["DI","14F",{"$f":"SUM(F18,F25,F30,F38,F44)","v":0},{"$f":"J18+J25+J30+J38+J44","v":0},{"$f":"I18+I25+I30+I38+I44","v":0},0,null,null,"DI",{"$f":"IF(ISBLANK(B30),0,IFERROR(INDEX($B$15:$B$46,MATCH($I11&J$5,$K$15:$K$46,0))-INDEX($D$15:$D$46,MATCH($I11&J$5,$K$15:$K$46,0)),0-INDEX($J$6:$O$11,MATCH(J$5,$I$6:$I$11,0),MATCH($I11,$J$5:$O$5,0))))","v":0},{"$f":"IF(ISBLANK(B38),0,IFERROR(INDEX($B$15:$B$46,MATCH($I11&K$5,$K$15:$K$46,0))-INDEX($D$15:$D$46,MATCH($I11&K$5,$K$15:$K$46,0)),0-INDEX($J$6:$O$11,MATCH(K$5,$I$6:$I$11,0),MATCH($I11,$J$5:$O$5,0))))","v":0},{"$f":"IF(ISBLANK(B44),0,IFERROR(INDEX($B$15:$B$46,MATCH($I11&L$5,$K$15:$K$46,0))-INDEX($D$15:$D$46,MATCH($I11&L$5,$K$15:$K$46,0)),0-INDEX($J$6:$O$11,MATCH(L$5,$I$6:$I$11,0),MATCH($I11,$J$5:$O$5,0))))","v":0},{"$f":"IF(ISBLANK(B25),0,IFERROR(INDEX($B$15:$B$46,MATCH($I11&M$5,$K$15:$K$46,0))-INDEX($D$15:$D$46,MATCH($I11&M$5,$K$15:$K$46,0)),0-INDEX($J$6:$O$11,MATCH(M$5,$I$6:$I$11,0),MATCH($I11,$J$5:$O$5,0))))","v":0},{"$f":"IF(ISBLANK(B18),0,IFERROR(INDEX($B$15:$B$46,MATCH($I11&N$5,$K$15:$K$46,0))-INDEX($D$15:$D$46,MATCH($I11&N$5,$K$15:$K$46,0)),0-INDEX($J$6:$O$11,MATCH(N$5,$I$6:$I$11,0),MATCH($I11,$J$5:$O$5,0))))","v":0}]
[null,null,null,null,null,null,null,null,"Les concaténations en rouge permettent de remplir par formules le récapitulatif au dessus"]
["1er MATCH le 15 mai","à",{"$f":"A6","v":"DB"},null,null,null,null,null,"Ce récap servira à départager les ex aequos"]
[null,null,null,null,null,null,"SI forfait éq recevante"]
["Equipes","score","Equipes","score"]
[{"$f":"$A$6","v":"DB"},null,{"$f":"$A$7","v":"DE"},{"$f":"IF(G16=19,19,IF(ISBLANK(B16),\"\",IF(B16=19,0,36-B16)))","v":""},{"$f":"IF(G16=19,0,IF(ISBLANK(B16),\"\",IF(B16<18,1,IF(B16=18,2,IF(B16>18,3)))))","v":""},{"$f":"IF(G16=19,3,IF(ISBLANK(B16),\"\",IF(B16=19,0,IF(D16<18,1,IF(D16=18,2,IF(D16>=20,3))))))","v":""},null,null,{"$f":"IF(ISBLANK(B16),0,B16)","v":0},{"$f":"IF(ISBLANK(B16),0,D16)","v":0},{"$f":"A16&C16","v":"DBDE"}]
[{"$f":"$A$8","v":"DF"},null,{"$f":"$A$9","v":"DG"},{"$f":"IF(G17=19,19,IF(ISBLANK(B17),\"\",IF(B17=19,0,36-B17)))","v":""},{"$f":"IF(G17=19,0,IF(ISBLANK(B17),\"\",IF(B17<18,1,IF(B17=18,2,IF(B17>18,3)))))","v":""},{"$f":"IF(G17=19,3,IF(ISBLANK(B17),\"\",IF(B17=19,0,IF(D17<18,1,IF(D17=18,2,IF(D17>=20,3))))))","v":""},null,null,{"$f":"IF(ISBLANK(B17),0,B17)","v":0},{"$f":"IF(ISBLANK(B17),0,D17)","v":0},{"$f":"A17&C17","v":"DFDG"}]
[{"$f":"$A$10","v":"DH"},null,{"$f":"$A$11","v":"DI"},{"$f":"IF(G18=19,19,IF(ISBLANK(B18),\"\",IF(B18=19,0,36-B18)))","v":""},{"$f":"IF(G18=19,0,IF(ISBLANK(B18),\"\",IF(B18<18,1,IF(B18=18,2,IF(B18>18,3)))))","v":""},{"$f":"IF(G18=19,3,IF(ISBLANK(B18),\"\",IF(B18=19,0,IF(D18<18,1,IF(D18=18,2,IF(D18>=20,3))))))","v":""},null,null,{"$f":"IF(ISBLANK(B18),0,B18)","v":0},{"$f":"IF(ISBLANK(B18),0,D18)","v":0},{"$f":"A18&C18","v":"DHDI"}]
[]
["2 éme MATCH le 22 mai","à",{"$f":"A7","v":"DE"}]
[null,null,null,null,null,null,"SI forfait éq recevante"]
["Equipes","score","Equipes","score"]
[{"$f":"$A$6","v":"DB"},null,{"$f":"$A$8","v":"DF"},{"$f":"IF(G23=19,19,IF(ISBLANK(B23),\"\",IF(B23=19,0,36-B23)))","v":""},{"$f":"IF(G23=19,0,IF(ISBLANK(B23),\"\",IF(B23<18,1,IF(B23=18,2,IF(B23>18,3)))))","v":""},{"$f":"IF(G23=19,3,IF(ISBLANK(B23),\"\",IF(B23=19,0,IF(D23<18,1,IF(D23=18,2,IF(D23>=20,3))))))","v":""},null,null,{"$f":"IF(ISBLANK(B23),0,B23)","v":0},{"$f":"IF(ISBLANK(B23),0,D23)","v":0},{"$f":"A23&C23","v":"DBDF"}]
[{"$f":"$A$7","v":"DE"},null,{"$f":"$A$10","v":"DH"},{"$f":"IF(G24=19,19,IF(ISBLANK(B24),\"\",IF(B24=19,0,36-B24)))","v":""},{"$f":"IF(G24=19,0,IF(ISBLANK(B24),\"\",IF(B24<18,1,IF(B24=18,2,IF(B24>18,3)))))","v":""},{"$f":"IF(G24=19,3,IF(ISBLANK(B24),\"\",IF(B24=19,0,IF(D24<18,1,IF(D24=18,2,IF(D24>=20,3))))))","v":""},null,null,{"$f":"IF(ISBLANK(B24),0,B24)","v":0},{"$f":"IF(ISBLANK(B24),0,D24)","v":0},{"$f":"A24&C24","v":"DEDH"}]
[{"$f":"$A$9","v":"DG"},null,{"$f":"$A$11","v":"DI"},{"$f":"IF(G25=19,19,IF(ISBLANK(B25),\"\",IF(B25=19,0,36-B25)))","v":""},{"$f":"IF(G25=19,0,IF(ISBLANK(B25),\"\",IF(B25<18,1,IF(B25=18,2,IF(B25>18,3)))))","v":""},{"$f":"IF(G25=19,3,IF(ISBLANK(B25),\"\",IF(B25=19,0,IF(D25<18,1,IF(D25=18,2,IF(D25>=20,3))))))","v":""},null,null,{"$f":"IF(ISBLANK(B25),0,B25)","v":0},{"$f":"IF(ISBLANK(B25),0,D25)","v":0},{"$f":"A25&C25","v":"DGDI"}]
[]
["3 éme MATCH le 29 mai","à",{"$f":"A8","v":"DF"}]
[null,null,null,null,null,null,"SI forfait éq recevante"]
["Equipes","score","Equipes","score"]
[{"$f":"$A$6","v":"DB"},null,{"$f":"$A$11","v":"DI"},{"$f":"IF(G30=19,19,IF(ISBLANK(B30),\"\",IF(B30=19,0,36-B30)))","v":""},{"$f":"IF(G30=19,0,IF(ISBLANK(B30),\"\",IF(B30<18,1,IF(B30=18,2,IF(B30>18,3)))))","v":""},{"$f":"IF(G30=19,3,IF(ISBLANK(B30),\"\",IF(B30=19,0,IF(D30<18,1,IF(D30=18,2,IF(D30>=20,3))))))","v":""},null,null,{"$f":"IF(ISBLANK(B30),0,B30)","v":0},{"$f":"IF(ISBLANK(B30),0,D30)","v":0},{"$f":"A30&C30","v":"DBDI"}]
[{"$f":"$A$10","v":"DH"},null,{"$f":"$A$9","v":"DG"},{"$f":"IF(G31=19,19,IF(ISBLANK(B31),\"\",IF(B31=19,0,36-B31)))","v":""},{"$f":"IF(G31=19,0,IF(ISBLANK(B31),\"\",IF(B31<18,1,IF(B31=18,2,IF(B31>18,3)))))","v":""},{"$f":"IF(G31=19,3,IF(ISBLANK(B31),\"\",IF(B31=19,0,IF(D31<18,1,IF(D31=18,2,IF(D31>=20,3))))))","v":""},null,null,{"$f":"IF(ISBLANK(B31),0,B31)","v":0},{"$f":"IF(ISBLANK(B31),0,D31)","v":0},{"$f":"A31&C31","v":"DHDG"}]
[{"$f":"$A$8","v":"DF"},null,{"$f":"$A$7","v":"DE"},{"$f":"IF(G32=19,19,IF(ISBLANK(B32),\"\",IF(B32=19,0,36-B32)))","v":""},{"$f":"IF(G32=19,0,IF(ISBLANK(B32),\"\",IF(B32<18,1,IF(B32=18,2,IF(B32>18,3)))))","v":""},{"$f":"IF(G32=19,3,IF(ISBLANK(B32),\"\",IF(B32=19,0,IF(D32<18,1,IF(D32=18,2,IF(D32>=20,3))))))","v":""},null,null,{"$f":"IF(ISBLANK(B32),0,B32)","v":0},{"$f":"IF(ISBLANK(B32),0,D32)","v":0},{"$f":"A32&C32","v":"DFDE"}]
[]
["4 éme MATCH le 5 juin","à",{"$f":"A9","v":"DG"}]
[null,null,null,null,null,null,"SI forfait éq recevante"]
["Equipes","score","Equipes","score"]
[{"$f":"A6","v":"DB"},null,{"$f":"$A$9","v":"DG"},{"$f":"IF(G37=19,19,IF(ISBLANK(B37),\"\",IF(B37=19,0,36-B37)))","v":""},{"$f":"IF(G37=19,0,IF(ISBLANK(B37),\"\",IF(B37<18,1,IF(B37=18,2,IF(B37>18,3)))))","v":""},{"$f":"IF(G37=19,3,IF(ISBLANK(B37),\"\",IF(B37=19,0,IF(D37<18,1,IF(D37=18,2,IF(D37>=20,3))))))","v":""},null,null,{"$f":"IF(ISBLANK(B37),0,B37)","v":0},{"$f":"IF(ISBLANK(B37),0,D37)","v":0},{"$f":"A37&C37","v":"DBDG"}]
[{"$f":"$A$7","v":"DE"},null,{"$f":"$A$11","v":"DI"},{"$f":"IF(G38=19,19,IF(ISBLANK(B38),\"\",IF(B38=19,0,36-B38)))","v":""},{"$f":"IF(G38=19,0,IF(ISBLANK(B38),\"\",IF(B38<18,1,IF(B38=18,2,IF(B38>18,3)))))","v":""},{"$f":"IF(G38=19,3,IF(ISBLANK(B38),\"\",IF(B38=19,0,IF(D38<18,1,IF(D38=18,2,IF(D38>=20,3))))))","v":""},null,null,{"$f":"IF(ISBLANK(B38),0,B38)","v":0},{"$f":"IF(ISBLANK(B38),0,D38)","v":0},{"$f":"A38&C38","v":"DEDI"}]
[{"$f":"A8","v":"DF"},null,{"$f":"$A$10","v":"DH"},{"$f":"IF(G39=19,19,IF(ISBLANK(B39),\"\",IF(B39=19,0,36-B39)))","v":""},{"$f":"IF(G39=19,0,IF(ISBLANK(B39),\"\",IF(B39<18,1,IF(B39=18,2,IF(B39>18,3)))))","v":""},{"$f":"IF(G39=19,3,IF(ISBLANK(B39),\"\",IF(B39=19,0,IF(D39<18,1,IF(D39=18,2,IF(D39>=20,3))))))","v":""},null,null,{"$f":"IF(ISBLANK(B39),0,B39)","v":0},{"$f":"IF(ISBLANK(B39),0,D39)","v":0},{"$f":"A39&C39","v":"DFDH"}]
[]
["5 éme MATCH le 12 juin","à",{"$f":"A10","v":"DH"}]
[null,null,null,null,null,null,"SI forfait éq recevante"]
["Equipes","score","Equipes","score"]
[{"$f":"A8","v":"DF"},null,{"$f":"$A$11","v":"DI"},{"$f":"IF(G44=19,19,IF(ISBLANK(B44),\"\",IF(B44=19,0,36-B44)))","v":""},{"$f":"IF(G44=19,0,IF(ISBLANK(B44),\"\",IF(B44<18,1,IF(B44=18,2,IF(B44>18,3)))))","v":""},{"$f":"IF(G44=19,3,IF(ISBLANK(B44),\"\",IF(B44=19,0,IF(D44<18,1,IF(D44=18,2,IF(D44>=20,3))))))","v":""},null,null,{"$f":"IF(ISBLANK(B44),0,B44)","v":0},{"$f":"IF(ISBLANK(B44),0,D44)","v":0},{"$f":"A44&C44","v":"DFDI"}]
[{"$f":"$A$10","v":"DH"},null,{"$f":"A6","v":"DB"},{"$f":"IF(G45=19,19,IF(ISBLANK(B45),\"\",IF(B45=19,0,36-B45)))","v":""},{"$f":"IF(G45=19,0,IF(ISBLANK(B45),\"\",IF(B45<18,1,IF(B45=18,2,IF(B45>18,3)))))","v":""},{"$f":"IF(G45=19,3,IF(ISBLANK(B45),\"\",IF(B45=19,0,IF(D45<18,1,IF(D45=18,2,IF(D45>=20,3))))))","v":""},null,null,{"$f":"IF(ISBLANK(B45),0,B45)","v":0},{"$f":"IF(ISBLANK(B45),0,D45)","v":0},{"$f":"A45&C45","v":"DHDB"}]
[{"$f":"A7","v":"DE"},null,{"$f":"$A$9","v":"DG"},{"$f":"IF(G46=19,19,IF(ISBLANK(B46),\"\",IF(B46=19,0,36-B46)))","v":""},{"$f":"IF(G46=19,0,IF(ISBLANK(B46),\"\",IF(B46<18,1,IF(B46=18,2,IF(B46>18,3)))))","v":""},{"$f":"IF(G46=19,3,IF(ISBLANK(B46),\"\",IF(B46=19,0,IF(D46<18,1,IF(D46=18,2,IF(D46>=20,3))))))","v":""},null,null,{"$f":"IF(ISBLANK(B46),0,B46)","v":0},{"$f":"IF(ISBLANK(B46),0,D46)","v":0},{"$f":"A46&C46","v":"DEDG"}]
[]
["CLASSEMENT"]
["EQUIPES",null,"POINTS","Pour","Contre","Diff","CLASST"]
["DB","14A",0,0,0,0,{"$f":"B59","v":1},{"$f":"IF(AND(G50=1,COUNTIF(rang1,1)>1),COUNTIF(G$50:G50,1),IF(AND(G50=2,COUNTIF(rang1,2)>1),COUNTIF(G$50:G50,2)+3,\"\"))","v":1}]
["DE","14B",0,0,0,0,1,{"$f":"IF(AND(G51=1,COUNTIF(rang1,1)>1),COUNTIF(G$50:G51,1),IF(AND(G51=2,COUNTIF(rang1,2)>1),COUNTIF(G$50:G51,2)+3,\"\"))","v":2}]
["DF","14C",0,0,0,0,1,{"$f":"IF(AND(G52=1,COUNTIF(rang1,1)>1),COUNTIF(G$50:G52,1),IF(AND(G52=2,COUNTIF(rang1,2)>1),COUNTIF(G$50:G52,2)+3,\"\"))","v":3}]
["DG","14D",0,0,0,0,1,{"$f":"IF(AND(G53=1,COUNTIF(rang1,1)>1),COUNTIF(G$50:G53,1),IF(AND(G53=2,COUNTIF(rang1,2)>1),COUNTIF(G$50:G53,2)+3,\"\"))","v":4}]
["DH","14E",0,0,0,0,1,{"$f":"IF(AND(G54=1,COUNTIF(rang1,1)>1),COUNTIF(G$50:G54,1),IF(AND(G54=2,COUNTIF(rang1,2)>1),COUNTIF(G$50:G54,2)+3,\"\"))","v":5}]
["DI","14F",0,0,0,0,1,{"$f":"IF(AND(G55=1,COUNTIF(rang1,1)>1),COUNTIF(G$50:G55,1),IF(AND(G55=2,COUNTIF(rang1,2)>1),COUNTIF(G$50:G55,2)+3,\"\"))","v":6}]
[]
[null,"CLASSEMENT FINAL et DEPARTAGE EX AEQUOS",null,null,null,null,null,null,null,null,null,null,"CLASSEMENT"]
[null,"Rang","Equipes","Pts","diff pts avec exaequo","cumul","departage goalaverage si même cumul","RP",null,null,null,"RP","Rang","Equipe","Pts"]
[null,{"$f":"RANK(G59,$G$59:$G$64)","v":1},{"$f":"INDEX($A$50:$A$55,MATCH(H59,$L$59:$L$64,0))","v":"DB"},{"$f":"VLOOKUP(C59,$A$50:$C$55,3,0)","v":0},{"$f":"IF(D59=D60,INDEX($J$6:$O$11,MATCH(C59,$I$6:$I$11,0),MATCH(C60,$J$5:$O$5,0)),IF(D59=D58,INDEX($J$6:$O$11,MATCH(C59,$I$6:$I$11,0),MATCH(C58,$J$5:$O$5,0)),0))","v":0},{"$f":"D59+E59/100","v":0},{"$f":"IF(AND(F59<>F58,F59<>F60),F59,F59+VLOOKUP(C59,$A$50:$F$55,6,0)/100)","v":0},1,null,null,null,{"$f":"RANK(C50,$C$50:$C$55)+COUNTIF($C$50:C50,C50)-1","v":1},{"$f":"B59","v":1},"DB",{"$f":"VLOOKUP(N59,$C$59:$D$64,2,0)","v":0}]
[null,1,"DE",0,{"$f":"IF(D60=D61,INDEX($J$6:$O$11,MATCH(C60,$I$6:$I$11,0),MATCH(C61,$J$5:$O$5,0)),IF(D60=D59,INDEX($J$6:$O$11,MATCH(C60,$I$6:$I$11,0),MATCH(C59,$J$5:$O$5,0)),0))","v":0},0,{"$f":"IF(AND(F60<>F59,F60<>F61),F60,F60+VLOOKUP(C60,$A$50:$F$55,6,0)/100)","v":0},2,null,null,null,{"$f":"RANK(C51,$C$50:$C$55)+COUNTIF($C$50:C51,C51)-1","v":2},1,"DE",0]
[null,1,"DF",0,{"$f":"IF(D61=D62,INDEX($J$6:$O$11,MATCH(C61,$I$6:$I$11,0),MATCH(C62,$J$5:$O$5,0)),IF(D61=D60,INDEX($J$6:$O$11,MATCH(C61,$I$6:$I$11,0),MATCH(C60,$J$5:$O$5,0)),0))","v":0},0,{"$f":"IF(AND(F61<>F60,F61<>F62),F61,F61+VLOOKUP(C61,$A$50:$F$55,6,0)/100)","v":0},3,null,null,null,{"$f":"RANK(C52,$C$50:$C$55)+COUNTIF($C$50:C52,C52)-1","v":3},1,"DF",0]
[null,1,"DG",0,{"$f":"IF(D62=D63,INDEX($J$6:$O$11,MATCH(C62,$I$6:$I$11,0),MATCH(C63,$J$5:$O$5,0)),IF(D62=D61,INDEX($J$6:$O$11,MATCH(C62,$I$6:$I$11,0),MATCH(C61,$J$5:$O$5,0)),0))","v":0},0,{"$f":"IF(AND(F62<>F61,F62<>F63),F62,F62+VLOOKUP(C62,$A$50:$F$55,6,0)/100)","v":0},4,null,null,null,{"$f":"RANK(C53,$C$50:$C$55)+COUNTIF($C$50:C53,C53)-1","v":4},1,"DG",0]
[null,1,"DH",0,{"$f":"IF(D63=D64,INDEX($J$6:$O$11,MATCH(C63,$I$6:$I$11,0),MATCH(C64,$J$5:$O$5,0)),IF(D63=D62,INDEX($J$6:$O$11,MATCH(C63,$I$6:$I$11,0),MATCH(C62,$J$5:$O$5,0)),0))","v":0},0,{"$f":"IF(AND(F63<>F62,F63<>F64),F63,F63+VLOOKUP(C63,$A$50:$F$55,6,0)/100)","v":0},5,null,null,null,{"$f":"RANK(C54,$C$50:$C$55)+COUNTIF($C$50:C54,C54)-1","v":5},1,"DH",0]
[null,1,"DI",0,{"$f":"IF(D64=D59,INDEX($J$6:$O$11,MATCH(C64,$I$6:$I$11,0),MATCH(C59,$J$5:$O$5,0)),IF(D64=D63,INDEX($J$6:$O$11,MATCH(C64,$I$6:$I$11,0),MATCH(C63,$J$5:$O$5,0)),0))","v":0},0,{"$f":"IF(AND(F64<>F63,F64<>F59),F64,F64+VLOOKUP(C64,$A$50:$F$55,6,0)/100)","v":0},6,null,null,null,{"$f":"RANK(C55,$C$50:$C$55)+COUNTIF($C$50:C55,C55)-1","v":6},1,"DI",0]

{"sheet":"P15","index":14,"n_rows":64,"n_cols":15,"rows_kept":64,"cut":false,"hidden":false,"merged":[[0,0,0,5],[1,0,1,5],[2,0,2,5],[3,0,3,5],[13,6,14,6],[56,1,56,6],[56,12,56,14],[20,6,21,6],[27,6,28,6],[34,6,35,6],[41,6,42,6],[47,0,47,5]]}
[]
["CHAMPIONNAT DES CLUBS"]
[]
["POULE 15",null,null,null,null,null,null,null,"Récapitulatif  différence match entre 2 équipes"]
["EQUIPES",null,"POINTS","Pour","Contre","Diff",null,null,null,{"$f":"A6","v":"DJ"},{"$f":"A7","v":"DK"},{"$f":"A8","v":"DL"},{"$f":"A9","v":"DM"},{"$f":"A10","v":"DN"},{"$f":"A11","v":"DO"}]
["DJ","15A",{"$f":"SUM(E16,E23,E30,E37,F45)","v":0},{"$f":"I16+I23+I30+I37+J45","v":0},{"$f":"J16+J23+J30+J37+I45","v":0},{"$f":"D6-E6","v":0},null,null,{"$f":"A6","v":"DJ"},null,{"$f":"IF(ISBLANK(B16),0,IFERROR(INDEX($B$15:$B$46,MATCH($I6&K$5,$K$15:$K$46,0))-INDEX($D$15:$D$46,MATCH($I6&K$5,$K$15:$K$46,0)),0-INDEX($J$6:$O$11,MATCH(K$5,$I$6:$I$11,0),MATCH($I6,$J$5:$O$5,0))))","v":0},{"$f":"IF(ISBLANK(B23),0,IFERROR(INDEX($B$15:$B$46,MATCH($I6&L$5,$K$15:$K$46,0))-INDEX($D$15:$D$46,MATCH($I6&L$5,$K$15:$K$46,0)),0-INDEX($J$6:$O$11,MATCH(L$5,$I$6:$I$11,0),MATCH($I6,$J$5:$O$5,0))))","v":0},{"$f":"IF(ISBLANK(B37),0,IFERROR(INDEX($B$15:$B$46,MATCH($I6&M$5,$K$15:$K$46,0))-INDEX($D$15:$D$46,MATCH($I6&M$5,$K$15:$K$46,0)),0-INDEX($J$6:$O$11,MATCH(M$5,$I$6:$I$11,0),MATCH($I6,$J$5:$O$5,0))))","v":0},{"$f":"IF(ISBLANK(B45),0,IFERROR(INDEX($B$15:$B$46,MATCH($I6&N$5,$K$15:$K$46,0))-INDEX($D$15:$D$46,MATCH($I6&N$5,$K$15:$K$46,0)),0-INDEX($J$6:$O$11,MATCH(N$5,$I$6:$I$11,0),MATCH($I6,$J$5:$O$5,0))))","v":0},{"$f":"IF(ISBLANK(B30),0,IFERROR(INDEX($B$15:$B$46,MATCH($I6&O$5,$K$15:$K$46,0))-INDEX($D$15:$D$46,MATCH($I6&O$5,$K$15:$K$46,0)),0-INDEX($J$6:$O$11,MATCH(O$5,$I$6:$I$11,0),MATCH($I6,$J$5:$O$5,0))))","v":0}]
["DK","15B",{"$f":"SUM(F16,E24,F32,E38,E46)","v":0},{"$f":"J16+I24+J32+I38+I46","v":0},{"$f":"I16+J24+I32+J38+J46","v":0},0,null,null,"DK",{"$f":"IF(ISBLANK(B16),0,IFERROR(INDEX($B$15:$B$46,MATCH($I7&J$5,$K$15:$K$46,0))-INDEX($D$15:$D$46,MATCH($I7&J$5,$K$15:$K$46,0)),0-INDEX($J$6:$O$11,MATCH(J$5,$I$6:$I$11,0),MATCH($I7,$J$5:$O$5,0))))","v":0},null,{"$f":"IF(ISBLANK(B32),0,IFERROR(INDEX($B$15:$B$46,MATCH($I7&L$5,$K$15:$K$46,0))-INDEX($D$15:$D$46,MATCH($I7&L$5,$K$15:$K$46,0)),0-INDEX($J$6:$O$11,MATCH(L$5,$I$6:$I$11,0),MATCH($I7,$J$5:$O$5,0))))","v":0},{"$f":"IF(ISBLANK(B46),0,IFERROR(INDEX($B$15:$B$46,MATCH($I7&M$5,$K$15:$K$46,0))-INDEX($D$15:$D$46,MATCH($I7&M$5,$K$15:$K$46,0)),0-INDEX($J$6:$O$11,MATCH(M$5,$I$6:$I$11,0),MATCH($I7,$J$5:$O$5,0))))","v":0},{"$f":"IF(ISBLANK(B24),0,IFERROR(INDEX($B$15:$B$46,MATCH($I7&N$5,$K$15:$K$46,0))-INDEX($D$15:$D$46,MATCH($I7&N$5,$K$15:$K$46,0)),0-INDEX($J$6:$O$11,MATCH(N$5,$I$6:$I$11,0),MATCH($I7,$J$5:$O$5,0))))","v":0},{"$f":"IF(ISBLANK(B38),0,IFERROR(INDEX($B$15:$B$46,MATCH($I7&O$5,$K$15:$K$46,0))-INDEX($D$15:$D$46,MATCH($I7&O$5,$K$15:$K$46,0)),0-INDEX($J$6:$O$11,MATCH(O$5,$I$6:$I$11,0),MATCH($I7,$J$5:$O$5,0))))","v":0}]
["DL","15C",{"$f":"SUM(E17,F23,E32,E39,E44)","v":0},{"$f":"I17+J23+I32+I39+I44","v":0},{"$f":"J17+I23+J32+J39+J44","v":0},0,null,null,"DL",{"$f":"IF(ISBLANK(B23),0,IFERROR(INDEX($B$15:$B$46,MATCH($I8&J$5,$K$15:$K$46,0))-INDEX($D$15:$D$46,MATCH($I8&J$5,$K$15:$K$46,0)),0-INDEX($J$6:$O$11,MATCH(J$5,$I$6:$I$11,0),MATCH($I8,$J$5:$O$5,0))))","v":0},{"$f":"IF(ISBLANK(B32),0,IFERROR(INDEX($B$15:$B$46,MATCH($I8&K$5,$K$15:$K$46,0))-INDEX($D$15:$D$46,MATCH($I8&K$5,$K$15:$K$46,0)),0-INDEX($J$6:$O$11,MATCH(K$5,$I$6:$I$11,0),MATCH($I8,$J$5:$O$5,0))))","v":0},null,{"$f":"IF(ISBLANK(B17),0,IFERROR(INDEX($B$15:$B$46,MATCH($I8&M$5,$K$15:$K$46,0))-INDEX($D$15:$D$46,MATCH($I8&M$5,$K$15:$K$46,0)),0-INDEX($J$6:$O$11,MATCH(M$5,$I$6:$I$11,0),MATCH($I8,$J$5:$O$5,0))))","v":0},{"$f":"IF(ISBLANK(B39),0,IFERROR(INDEX($B$15:$B$46,MATCH($I8&N$5,$K$15:$K$46,0))-INDEX($D$15:$D$46,MATCH($I8&N$5,$K$15:$K$46,0)),0-INDEX($J$6:$O$11,MATCH(N$5,$I$6:$I$11,0),MATCH($I8,$J$5:$O$5,0))))","v":0},{"$f":"IF(ISBLANK(B44),0,IFERROR(INDEX($B$15:$B$46,MATCH($I8&O$5,$K$15:$K$46,0))-INDEX($D$15:$D$46,MATCH($I8&O$5,$K$15:$K$46,0)),0-INDEX($J$6:$O$11,MATCH(O$5,$I$6:$I$11,0),MATCH($I8,$J$5:$O$5,0))))","v":0}]
["DM","15D",{"$f":"SUM(F17,E25,F31,F37,F46)","v":0},{"$f":"J17+I25+J31+J37+J46","v":0},{"$f":"I17+J25+I31+I37+I46","v":0},0,null,null,"DM",{"$f":"IF(ISBLANK(B37),0,IFERROR(INDEX($B$15:$B$46,MATCH($I9&J$5,$K$15:$K$46,0))-INDEX($D$15:$D$46,MATCH($I9&J$5,$K$15:$K$46,0)),0-INDEX($J$6:$O$11,MATCH(J$5,$I$6:$I$11,0),MATCH($I9,$J$5:$O$5,0))))","v":0},{"$f":"IF(ISBLANK(B46),0,IFERROR(INDEX($B$15:$B$46,MATCH($I9&K$5,$K$15:$K$46,0))-INDEX($D$15:$D$46,MATCH($I9&K$5,$K$15:$K$46,0)),0-INDEX($J$6:$O$11,MATCH(K$5,$I$6:$I$11,0),MATCH($I9,$J$5:$O$5,0))))","v":0},{"$f":"IF(ISBLANK(B17),0,IFERROR(INDEX($B$15:$B$46,MATCH($I9&L$5,$K$15:$K$46,0))-INDEX($D$15:$D$46,MATCH($I9&L$5,$K$15:$K$46,0)),0-INDEX($J$6:$O$11,MATCH(L$5,$I$6:$I$11,0),MATCH($I9,$J$5:$O$5,0))))","v":0},null,{"$f":"IF(ISBLANK(B31),0,IFERROR(INDEX($B$15:$B$46,MATCH($I9&N$5,$K$15:$K$46,0))-INDEX($D$15:$D$46,MATCH($I9&N$5,$K$15:$K$46,0)),0-INDEX($J$6:$O$11,MATCH(N$5,$I$6:$I$11,0),MATCH($I9,$J$5:$O$5,0))))","v":0},{"$f":"IF(ISBLANK(B25),0,IFERROR(INDEX($B$15:$B$46,MATCH($I9&O$5,$K$15:$K$46,0))-INDEX($D$15:$D$46,MATCH($I9&O$5,$K$15:$K$46,0)),0-INDEX($J$6:$O$11,MATCH(O$5,$I$6:$I$11,0),MATCH($I9,$J$5:$O$5,0))))","v":0}]
["DN","15E",{"$f":"SUM(E18,F24,E31,F39,E45)","v":0},{"$f":"I18+J24+I31+J39+I45","v":0},{"$f":"J18+I24+J31+I39+J45","v":0},0,null,null,"DN",{"$f":"IF(ISBLANK(B45),0,IFERROR(INDEX($B$15:$B$46,MATCH($I10&J$5,$K$15:$K$46,0))-INDEX($D$15:$D$46,MATCH($I10&J$5,$K$15:$K$46,0)),0-INDEX($J$6:$O$11,MATCH(J$5,$I$6:$I$11,0),MATCH($I10,$J$5:$O$5,0))))","v":0},{"$f":"IF(ISBLANK(B24),0,IFERROR(INDEX($B$15:$B$46,MATCH($I10&K$5,$K$15:$K$46,0))-INDEX($D$15:$D$46,MATCH($I10&K$5,$K$15:$K$46,0)),0-INDEX($J$6:$O$11,MATCH(K$5,$I$6:$I$11,0),MATCH($I10,$J$5:$O$5,0))))","v":0},{"$f":"IF(ISBLANK(B39),0,IFERROR(INDEX($B$15:$B$46,MATCH($I10&L$5,$K$15:$K$46,0))-INDEX($D$15:$D$46,MATCH($I10&L$5,$K$15:$K$46,0)),0-INDEX($J$6:$O$11,MATCH(L$5,$I$6:$I$11,0),MATCH($I10,$J$5:$O$5,0))))","v":0},{"$f":"IF(ISBLANK(B31),0,IFERROR(INDEX($B$15:$B$46,MATCH($I10&M$5,$K$15:$K$46,0))-INDEX($D$15:$D$46,MATCH($I10&M$5,$K$15:$K$46,0)),0-INDEX($J$6:$O$11,MATCH(M$5,$I$6:$I$11,0),MATCH($I10,$J$5:$O$5,0))))","v":0},null,{"$f":"IF(ISBLANK(B18),0,IFERROR(INDEX($B$15:$B$46,MATCH($I10&O$5,$K$15:$K$46,0))-INDEX($D$15:$D$46,MATCH($I10&O$5,$K$15:$K$46,0)),0-INDEX($J$6:$O$11,MATCH(O$5,$I$6:$I$11,0),MATCH($I10,$J$5:$O$5,0))))","v":0}]
["DO","15F",{"$f":"SUM(F18,F25,F30,F38,F44)","v":0},{"$f":"J18+J25+J30+J38+J44","v":0},{"$f":"I18+I25+I30+I38+I44","v":0},0,null,null,"DO",{"$f":"IF(ISBLANK(B30),0,IFERROR(INDEX($B$15:$B$46,MATCH($I11&J$5,$K$15:$K$46,0))-INDEX($D$15:$D$46,MATCH($I11&J$5,$K$15:$K$46,0)),0-INDEX($J$6:$O$11,MATCH(J$5,$I$6:$I$11,0),MATCH($I11,$J$5:$O$5,0))))","v":0},{"$f":"IF(ISBLANK(B38),0,IFERROR(INDEX($B$15:$B$46,MATCH($I11&K$5,$K$15:$K$46,0))-INDEX($D$15:$D$46,MATCH($I11&K$5,$K$15:$K$46,0)),0-INDEX($J$6:$O$11,MATCH(K$5,$I$6:$I$11,0),MATCH($I11,$J$5:$O$5,0))))","v":0},{"$f":"IF(ISBLANK(B44),0,IFERROR(INDEX($B$15:$B$46,MATCH($I11&L$5,$K$15:$K$46,0))-INDEX($D$15:$D$46,MATCH($I11&L$5,$K$15:$K$46,0)),0-INDEX($J$6:$O$11,MATCH(L$5,$I$6:$I$11,0),MATCH($I11,$J$5:$O$5,0))))","v":0},{"$f":"IF(ISBLANK(B25),0,IFERROR(INDEX($B$15:$B$46,MATCH($I11&M$5,$K$15:$K$46,0))-INDEX($D$15:$D$46,MATCH($I11&M$5,$K$15:$K$46,0)),0-INDEX($J$6:$O$11,MATCH(M$5,$I$6:$I$11,0),MATCH($I11,$J$5:$O$5,0))))","v":0},{"$f":"IF(ISBLANK(B18),0,IFERROR(INDEX($B$15:$B$46,MATCH($I11&N$5,$K$15:$K$46,0))-INDEX($D$15:$D$46,MATCH($I11&N$5,$K$15:$K$46,0)),0-INDEX($J$6:$O$11,MATCH(N$5,$I$6:$I$11,0),MATCH($I11,$J$5:$O$5,0))))","v":0}]
[null,null,null,null,null,null,null,null,"Les concaténations en rouge permettent de remplir par formules le récapitulatif au dessus"]
["1er MATCH le 15 mai","à",{"$f":"A6","v":"DJ"},null,null,null,null,null,"Ce récap servira à départager les ex aequos"]
[null,null,null,null,null,null,"SI forfait éq recevante"]
["Equipes","score","Equipes","score"]
[{"$f":"$A$6","v":"DJ"},null,{"$f":"$A$7","v":"DK"},{"$f":"IF(G16=19,19,IF(ISBLANK(B16),\"\",IF(B16=19,0,36-B16)))","v":""},{"$f":"IF(G16=19,0,IF(ISBLANK(B16),\"\",IF(B16<18,1,IF(B16=18,2,IF(B16>18,3)))))","v":""},{"$f":"IF(G16=19,3,IF(ISBLANK(B16),\"\",IF(B16=19,0,IF(D16<18,1,IF(D16=18,2,IF(D16>=20,3))))))","v":""},null,null,{"$f":"IF(ISBLANK(B16),0,B16)","v":0},{"$f":"IF(ISBLANK(B16),0,D16)","v":0},{"$f":"A16&C16","v":"DJDK"}]
[{"$f":"$A$8","v":"DL"},null,{"$f":"$A$9","v":"DM"},{"$f":"IF(G17=19,19,IF(ISBLANK(B17),\"\",IF(B17=19,0,36-B17)))","v":""},{"$f":"IF(G17=19,0,IF(ISBLANK(B17),\"\",IF(B17<18,1,IF(B17=18,2,IF(B17>18,3)))))","v":""},{"$f":"IF(G17=19,3,IF(ISBLANK(B17),\"\",IF(B17=19,0,IF(D17<18,1,IF(D17=18,2,IF(D17>=20,3))))))","v":""},null,null,{"$f":"IF(ISBLANK(B17),0,B17)","v":0},{"$f":"IF(ISBLANK(B17),0,D17)","v":0},{"$f":"A17&C17","v":"DLDM"}]
[{"$f":"$A$10","v":"DN"},null,{"$f":"$A$11","v":"DO"},{"$f":"IF(G18=19,19,IF(ISBLANK(B18),\"\",IF(B18=19,0,36-B18)))","v":""},{"$f":"IF(G18=19,0,IF(ISBLANK(B18),\"\",IF(B18<18,1,IF(B18=18,2,IF(B18>18,3)))))","v":""},{"$f":"IF(G18=19,3,IF(ISBLANK(B18),\"\",IF(B18=19,0,IF(D18<18,1,IF(D18=18,2,IF(D18>=20,3))))))","v":""},null,null,{"$f":"IF(ISBLANK(B18),0,B18)","v":0},{"$f":"IF(ISBLANK(B18),0,D18)","v":0},{"$f":"A18&C18","v":"DNDO"}]
[]
["2 éme MATCH le 22 mai","à",{"$f":"A7","v":"DK"}]
[null,null,null,null,null,null,"SI forfait éq recevante"]
["Equipes","score","Equipes","score"]
[{"$f":"$A$6","v":"DJ"},null,{"$f":"$A$8","v":"DL"},{"$f":"IF(G23=19,19,IF(ISBLANK(B23),\"\",IF(B23=19,0,36-B23)))","v":""},{"$f":"IF(G23=19,0,IF(ISBLANK(B23),\"\",IF(B23<18,1,IF(B23=18,2,IF(B23>18,3)))))","v":""},{"$f":"IF(G23=19,3,IF(ISBLANK(B23),\"\",IF(B23=19,0,IF(D23<18,1,IF(D23=18,2,IF(D23>=20,3))))))","v":""},null,null,{"$f":"IF(ISBLANK(B23),0,B23)","v":0},{"$f":"IF(ISBLANK(B23),0,D23)","v":0},{"$f":"A23&C23","v":"DJDL"}]
[{"$f":"$A$7","v":"DK"},null,{"$f":"$A$10","v":"DN"},{"$f":"IF(G24=19,19,IF(ISBLANK(B24),\"\",IF(B24=19,0,36-B24)))","v":""},{"$f":"IF(G24=19,0,IF(ISBLANK(B24),\"\",IF(B24<18,1,IF(B24=18,2,IF(B24>18,3)))))","v":""},{"$f":"IF(G24=19,3,IF(ISBLANK(B24),\"\",IF(B24=19,0,IF(D24<18,1,IF(D24=18,2,IF(D24>=20,3))))))","v":""},null,null,{"$f":"IF(ISBLANK(B24),0,B24)","v":0},{"$f":"IF(ISBLANK(B24),0,D24)","v":0},{"$f":"A24&C24","v":"DKDN"}]
[{"$f":"$A$9","v":"DM"},null,{"$f":"$A$11","v":"DO"},{"$f":"IF(G25=19,19,IF(ISBLANK(B25),\"\",IF(B25=19,0,36-B25)))","v":""},{"$f":"IF(G25=19,0,IF(ISBLANK(B25),\"\",IF(B25<18,1,IF(B25=18,2,IF(B25>18,3)))))","v":""},{"$f":"IF(G25=19,3,IF(ISBLANK(B25),\"\",IF(B25=19,0,IF(D25<18,1,IF(D25=18,2,IF(D25>=20,3))))))","v":""},null,null,{"$f":"IF(ISBLANK(B25),0,B25)","v":0},{"$f":"IF(ISBLANK(B25),0,D25)","v":0},{"$f":"A25&C25","v":"DMDO"}]
[]
["3 éme MATCH le 29 mai","à",{"$f":"A8","v":"DL"}]
[null,null,null,null,null,null,"SI forfait éq recevante"]
["Equipes","score","Equipes","score"]
[{"$f":"$A$6","v":"DJ"},null,{"$f":"$A$11","v":"DO"},{"$f":"IF(G30=19,19,IF(ISBLANK(B30),\"\",IF(B30=19,0,36-B30)))","v":""},{"$f":"IF(G30=19,0,IF(ISBLANK(B30),\"\",IF(B30<18,1,IF(B30=18,2,IF(B30>18,3)))))","v":""},{"$f":"IF(G30=19,3,IF(ISBLANK(B30),\"\",IF(B30=19,0,IF(D30<18,1,IF(D30=18,2,IF(D30>=20,3))))))","v":""},null,null,{"$f":"IF(ISBLANK(B30),0,B30)","v":0},{"$f":"IF(ISBLANK(B30),0,D30)","v":0},{"$f":"A30&C30","v":"DJDO"}]
[{"$f":"$A$10","v":"DN"},null,{"$f":"$A$9","v":"DM"},{"$f":"IF(G31=19,19,IF(ISBLANK(B31),\"\",IF(B31=19,0,36-B31)))","v":""},{"$f":"IF(G31=19,0,IF(ISBLANK(B31),\"\",IF(B31<18,1,IF(B31=18,2,IF(B31>18,3)))))","v":""},{"$f":"IF(G31=19,3,IF(ISBLANK(B31),\"\",IF(B31=19,0,IF(D31<18,1,IF(D31=18,2,IF(D31>=20,3))))))","v":""},null,null,{"$f":"IF(ISBLANK(B31),0,B31)","v":0},{"$f":"IF(ISBLANK(B31),0,D31)","v":0},{"$f":"A31&C31","v":"DNDM"}]
[{"$f":"$A$8","v":"DL"},null,{"$f":"$A$7","v":"DK"},{"$f":"IF(G32=19,19,IF(ISBLANK(B32),\"\",IF(B32=19,0,36-B32)))","v":""},{"$f":"IF(G32=19,0,IF(ISBLANK(B32),\"\",IF(B32<18,1,IF(B32=18,2,IF(B32>18,3)))))","v":""},{"$f":"IF(G32=19,3,IF(ISBLANK(B32),\"\",IF(B32=19,0,IF(D32<18,1,IF(D32=18,2,IF(D32>=20,3))))))","v":""},null,null,{"$f":"IF(ISBLANK(B32),0,B32)","v":0},{"$f":"IF(ISBLANK(B32),0,D32)","v":0},{"$f":"A32&C32","v":"DLDK"}]
[]
["4 éme MATCH le 5 juin","à",{"$f":"A9","v":"DM"}]
[null,null,null,null,null,null,"SI forfait éq recevante"]
["Equipes","score","Equipes","score"]
[{"$f":"A6","v":"DJ"},null,{"$f":"$A$9","v":"DM"},{"$f":"IF(G37=19,19,IF(ISBLANK(B37),\"\",IF(B37=19,0,36-B37)))","v":""},{"$f":"IF(G37=19,0,IF(ISBLANK(B37),\"\",IF(B37<18,1,IF(B37=18,2,IF(B37>18,3)))))","v":""},{"$f":"IF(G37=19,3,IF(ISBLANK(B37),\"\",IF(B37=19,0,IF(D37<18,1,IF(D37=18,2,IF(D37>=20,3))))))","v":""},null,null,{"$f":"IF(ISBLANK(B37),0,B37)","v":0},{"$f":"IF(ISBLANK(B37),0,D37)","v":0},{"$f":"A37&C37","v":"DJDM"}]
[{"$f":"$A$7","v":"DK"},null,{"$f":"$A$11","v":"DO"},{"$f":"IF(G38=19,19,IF(ISBLANK(B38),\"\",IF(B38=19,0,36-B38)))","v":""},{"$f":"IF(G38=19,0,IF(ISBLANK(B38),\"\",IF(B38<18,1,IF(B38=18,2,IF(B38>18,3)))))","v":""},{"$f":"IF(G38=19,3,IF(ISBLANK(B38),\"\",IF(B38=19,0,IF(D38<18,1,IF(D38=18,2,IF(D38>=20,3))))))","v":""},null,null,{"$f":"IF(ISBLANK(B38),0,B38)","v":0},{"$f":"IF(ISBLANK(B38),0,D38)","v":0},{"$f":"A38&C38","v":"DKDO"}]
[{"$f":"A8","v":"DL"},null,{"$f":"$A$10","v":"DN"},{"$f":"IF(G39=19,19,IF(ISBLANK(B39),\"\",IF(B39=19,0,36-B39)))","v":""},{"$f":"IF(G39=19,0,IF(ISBLANK(B39),\"\",IF(B39<18,1,IF(B39=18,2,IF(B39>18,3)))))","v":""},{"$f":"IF(G39=19,3,IF(ISBLANK(B39),\"\",IF(B39=19,0,IF(D39<18,1,IF(D39=18,2,IF(D39>=20,3))))))","v":""},null,null,{"$f":"IF(ISBLANK(B39),0,B39)","v":0},{"$f":"IF(ISBLANK(B39),0,D39)","v":0},{"$f":"A39&C39","v":"DLDN"}]
[]
["5 éme MATCH le 12 juin","à",{"$f":"A10","v":"DN"}]
[null,null,null,null,null,null,"SI forfait éq recevante"]
["Equipes","score","Equipes","score"]
[{"$f":"A8","v":"DL"},null,{"$f":"$A$11","v":"DO"},{"$f":"IF(G44=19,19,IF(ISBLANK(B44),\"\",IF(B44=19,0,36-B44)))","v":""},{"$f":"IF(G44=19,0,IF(ISBLANK(B44),\"\",IF(B44<18,1,IF(B44=18,2,IF(B44>18,3)))))","v":""},{"$f":"IF(G44=19,3,IF(ISBLANK(B44),\"\",IF(B44=19,0,IF(D44<18,1,IF(D44=18,2,IF(D44>=20,3))))))","v":""},null,null,{"$f":"IF(ISBLANK(B44),0,B44)","v":0},{"$f":"IF(ISBLANK(B44),0,D44)","v":0},{"$f":"A44&C44","v":"DLDO"}]
[{"$f":"$A$10","v":"DN"},null,{"$f":"A6","v":"DJ"},{"$f":"IF(G45=19,19,IF(ISBLANK(B45),\"\",IF(B45=19,0,36-B45)))","v":""},{"$f":"IF(G45=19,0,IF(ISBLANK(B45),\"\",IF(B45<18,1,IF(B45=18,2,IF(B45>18,3)))))","v":""},{"$f":"IF(G45=19,3,IF(ISBLANK(B45),\"\",IF(B45=19,0,IF(D45<18,1,IF(D45=18,2,IF(D45>=20,3))))))","v":""},null,null,{"$f":"IF(ISBLANK(B45),0,B45)","v":0},{"$f":"IF(ISBLANK(B45),0,D45)","v":0},{"$f":"A45&C45","v":"DNDJ"}]
[{"$f":"A7","v":"DK"},null,{"$f":"$A$9","v":"DM"},{"$f":"IF(G46=19,19,IF(ISBLANK(B46),\"\",IF(B46=19,0,36-B46)))","v":""},{"$f":"IF(G46=19,0,IF(ISBLANK(B46),\"\",IF(B46<18,1,IF(B46=18,2,IF(B46>18,3)))))","v":""},{"$f":"IF(G46=19,3,IF(ISBLANK(B46),\"\",IF(B46=19,0,IF(D46<18,1,IF(D46=18,2,IF(D46>=20,3))))))","v":""},null,null,{"$f":"IF(ISBLANK(B46),0,B46)","v":0},{"$f":"IF(ISBLANK(B46),0,D46)","v":0},{"$f":"A46&C46","v":"DKDM"}]
[]
["CLASSEMENT"]
["EQUIPES",null,"POINTS","Pour","Contre","Diff","CLASST"]
["DJ","15A",0,0,0,0,{"$f":"B59","v":1},{"$f":"IF(AND(G50=1,COUNTIF(rang1,1)>1),COUNTIF(G$50:G50,1),IF(AND(G50=2,COUNTIF(rang1,2)>1),COUNTIF(G$50:G50,2)+3,\"\"))","v":1}]
["DK","15B",0,0,0,0,1,{"$f":"IF(AND(G51=1,COUNTIF(rang1,1)>1),COUNTIF(G$50:G51,1),IF(AND(G51=2,COUNTIF(rang1,2)>1),COUNTIF(G$50:G51,2)+3,\"\"))","v":2}]
["DL","15C",0,0,0,0,1,{"$f":"IF(AND(G52=1,COUNTIF(rang1,1)>1),COUNTIF(G$50:G52,1),IF(AND(G52=2,COUNTIF(rang1,2)>1),COUNTIF(G$50:G52,2)+3,\"\"))","v":3}]
["DM","15D",0,0,0,0,1,{"$f":"IF(AND(G53=1,COUNTIF(rang1,1)>1),COUNTIF(G$50:G53,1),IF(AND(G53=2,COUNTIF(rang1,2)>1),COUNTIF(G$50:G53,2)+3,\"\"))","v":4}]
["DN","15E",0,0,0,0,1,{"$f":"IF(AND(G54=1,COUNTIF(rang1,1)>1),COUNTIF(G$50:G54,1),IF(AND(G54=2,COUNTIF(rang1,2)>1),COUNTIF(G$50:G54,2)+3,\"\"))","v":5}]
["DO","15F",0,0,0,0,1,{"$f":"IF(AND(G55=1,COUNTIF(rang1,1)>1),COUNTIF(G$50:G55,1),IF(AND(G55=2,COUNTIF(rang1,2)>1),COUNTIF(G$50:G55,2)+3,\"\"))","v":6}]
[]
[null,"CLASSEMENT FINAL et DEPARTAGE EX AEQUOS",null,null,null,null,null,null,null,null,null,null,"CLASSEMENT"]
[null,"Rang","Equipes","Pts","diff pts avec exaequo","cumul","departage goalaverage si même cumul","RP",null,null,null,"RP","Rang","Equipe","Pts"]
[null,{"$f":"RANK(G59,$G$59:$G$64)","v":1},{"$f":"INDEX($A$50:$A$55,MATCH(H59,$L$59:$L$64,0))","v":"DJ"},{"$f":"VLOOKUP(C59,$A$50:$C$55,3,0)","v":0},{"$f":"IF(D59=D60,INDEX($J$6:$O$11,MATCH(C59,$I$6:$I$11,0),MATCH(C60,$J$5:$O$5,0)),IF(D59=D58,INDEX($J$6:$O$11,MATCH(C59,$I$6:$I$11,0),MATCH(C58,$J$5:$O$5,0)),0))","v":0},{"$f":"D59+E59/100","v":0},{"$f":"IF(AND(F59<>F58,F59<>F60),F59,F59+VLOOKUP(C59,$A$50:$F$55,6,0)/100)","v":0},1,null,null,null,{"$f":"RANK(C50,$C$50:$C$55)+COUNTIF($C$50:C50,C50)-1","v":1},{"$f":"B59","v":1},"DJ",{"$f":"VLOOKUP(N59,$C$59:$D$64,2,0)","v":0}]
[null,1,"DK",0,{"$f":"IF(D60=D61,INDEX($J$6:$O$11,MATCH(C60,$I$6:$I$11,0),MATCH(C61,$J$5:$O$5,0)),IF(D60=D59,INDEX($J$6:$O$11,MATCH(C60,$I$6:$I$11,0),MATCH(C59,$J$5:$O$5,0)),0))","v":0},0,{"$f":"IF(AND(F60<>F59,F60<>F61),F60,F60+VLOOKUP(C60,$A$50:$F$55,6,0)/100)","v":0},2,null,null,null,{"$f":"RANK(C51,$C$50:$C$55)+COUNTIF($C$50:C51,C51)-1","v":2},1,"DK",0]
[null,1,"DL",0,{"$f":"IF(D61=D62,INDEX($J$6:$O$11,MATCH(C61,$I$6:$I$11,0),MATCH(C62,$J$5:$O$5,0)),IF(D61=D60,INDEX($J$6:$O$11,MATCH(C61,$I$6:$I$11,0),MATCH(C60,$J$5:$O$5,0)),0))","v":0},0,{"$f":"IF(AND(F61<>F60,F61<>F62),F61,F61+VLOOKUP(C61,$A$50:$F$55,6,0)/100)","v":0},3,null,null,null,{"$f":"RANK(C52,$C$50:$C$55)+COUNTIF($C$50:C52,C52)-1","v":3},1,"DL",0]
[null,1,"DM",0,{"$f":"IF(D62=D63,INDEX($J$6:$O$11,MATCH(C62,$I$6:$I$11,0),MATCH(C63,$J$5:$O$5,0)),IF(D62=D61,INDEX($J$6:$O$11,MATCH(C62,$I$6:$I$11,0),MATCH(C61,$J$5:$O$5,0)),0))","v":0},0,{"$f":"IF(AND(F62<>F61,F62<>F63),F62,F62+VLOOKUP(C62,$A$50:$F$55,6,0)/100)","v":0},4,null,null,null,{"$f":"RANK(C53,$C$50:$C$55)+COUNTIF($C$50:C53,C53)-1","v":4},1,"DM",0]
[null,1,"DN",0,{"$f":"IF(D63=D64,INDEX($J$6:$O$11,MATCH(C63,$I$6:$I$11,0),MATCH(C64,$J$5:$O$5,0)),IF(D63=D62,INDEX($J$6:$O$11,MATCH(C63,$I$6:$I$11,0),MATCH(C62,$J$5:$O$5,0)),0))","v":0},0,{"$f":"IF(AND(F63<>F62,F63<>F64),F63,F63+VLOOKUP(C63,$A$50:$F$55,6,0)/100)","v":0},5,null,null,null,{"$f":"RANK(C54,$C$50:$C$55)+COUNTIF($C$50:C54,C54)-1","v":5},1,"DN",0]
[null,1,"DO",0,{"$f":"IF(D64=D59,INDEX($J$6:$O$11,MATCH(C64,$I$6:$I$11,0),MATCH(C59,$J$5:$O$5,0)),IF(D64=D63,INDEX($J$6:$O$11,MATCH(C64,$I$6:$I$11,0),MATCH(C63,$J$5:$O$5,0)),0))","v":0},0,{"$f":"IF(AND(F64<>F63,F64<>F59),F64,F64+VLOOKUP(C64,$A$50:$F$55,6,0)/100)","v":0},6,null,null,null,{"$f":"RANK(C55,$C$50:$C$55)+COUNTIF($C$50:C55,C55)-1","v":6},1,"DO",0]

{"sheet":"Classt","index":15,"n_rows":62,"n_cols":26,"rows_kept":62,"cut":false,"hidden":false,"merged":[[32,0,61,0],[0,11,0,17],[2,0,31,0],[0,19,0,25],[0,1,0,9]]}
[null,"CLASSEMENT PAR POULES",null,null,null,null,null,null,null,null,null,"CLASSEMENT DES 1ers",null,null,null,null,null,null,null,"CLASSEMENT DES 2nds"]
[null,"N°POULES","EQUIPES","N°Poules      Equipes","POINTS","Pour","Contre","Diff","RANG","Pts+pour",null,"RANG","EQUIPES","N°Equipes","POINTS","Pour","Contre","Diff",null,"RANG","EQUIPES","N°Equipes","POINTS","Pour","Contre","Diff"]
["PREMIERS","P1",{"$f":"INDEX(INDIRECT(\"'\"&$B3&\"'!$A$50:$A$55\"),MATCH(1,INDIRECT(\"'\"&$B3&\"'!$G$50:$G$55\"),0))","v":{"$error":"#N/A"}},{"$f":"IFERROR(VLOOKUP($C3,INDIRECT(\"'\"&$B3&\"'!$A$50:$F$55\"),2,0),\"\")","v":""},{"$f":"IFERROR(VLOOKUP($C3,INDIRECT(\"'\"&$B3&\"'!$A$50:$F$55\"),3,0),\"\")","v":""},{"$f":"IFERROR(VLOOKUP($C3,INDIRECT(\"'\"&$B3&\"'!$A$50:$F$55\"),4,0),\"\")","v":""},{"$f":"IFERROR(VLOOKUP($C3,INDIRECT(\"'\"&$B3&\"'!$A$50:$F$55\"),5,0),\"\")","v":""},{"$f":"IFERROR(VLOOKUP($C3,INDIRECT(\"'\"&$B3&\"'!$A$50:$F$55\"),6,0),\"\")","v":""},{"$f":"IFERROR(RANK(J3,$J$3:$J$32)+COUNTIF($J$3:J3,J3)-1,\"\")","v":""},{"$f":"IFERROR(E3+H3/100+F3/10000,\"\")","v":""},null,1,{"$f":"IFERROR(INDEX($C$3:$C$32,MATCH(L3,$I$3:$I$32,0)),\"\")","v":"AI"},{"$f":"IF(M3=\"\",\"\",VLOOKUP($M3,$C:$H,2,0))","v":"2B"},{"$f":"IF(N3=\"\",\"\",VLOOKUP($M3,$C:$H,3,0))","v":0},{"$f":"IF(O3=\"\",\"\",VLOOKUP($M3,$C:$H,4,0))","v":0},{"$f":"IF(P3=\"\",\"\",VLOOKUP($M3,$C:$H,5,0))","v":0},{"$f":"IF(Q3=\"\",\"\",VLOOKUP($M3,$C:$H,6,0))","v":0},null,1,{"$f":"IFERROR(INDEX($C$33:$C$62,MATCH(T3,$I$33:$I$62,0)),\"\")","v":"AJ"},{"$f":"IF(U3=\"\",\"\",VLOOKUP($U3,$C:$H,2,0))","v":"2C"},{"$f":"IF(V3=\"\",\"\",VLOOKUP($U3,$C:$H,3,0))","v":0},{"$f":"IF(W3=\"\",\"\",VLOOKUP($U3,$C:$H,4,0))","v":0},{"$f":"IF(X3=\"\",\"\",VLOOKUP($U3,$C:$H,5,0))","v":0},{"$f":"IF(Y3=\"\",\"\",VLOOKUP($U3,$C:$H,6,0))","v":0}]
[null,{"$f":"B3","v":"P1"},{"$f":"IFERROR(INDEX(INDIRECT(\"'\"&$B4&\"'!$A$50:$A$55\"),MATCH(2,INDIRECT(\"'\"&$B4&\"'!$H$50:$H$55\"),0)),\"\")","v":""},"","","","","",{"$f":"IFERROR(RANK(J4,$J$3:$J$32)+COUNTIF($J$3:J4,J4)-1,\"\")","v":""},{"$f":"IFERROR(E4+H4/100+F4/10000,\"\")","v":""},null,2,"AN","3A",0,0,0,0,null,2,"AR","3E",0,0,0,0]
[null,"P2",{"$f":"INDEX(INDIRECT(\"'\"&$B5&\"'!$A$50:$A$55\"),MATCH(1,INDIRECT(\"'\"&$B5&\"'!$G$50:$G$55\"),0))","v":"AI"},"2B",0,0,0,0,{"$f":"IFERROR(RANK(J5,$J$3:$J$32)+COUNTIF($J$3:J5,J5)-1,\"\")","v":1},0,null,3,"AO","3B",0,0,0,0,null,3,"AX","4E",0,0,0,0]
[null,{"$f":"B5","v":"P2"},{"$f":"IFERROR(INDEX(INDIRECT(\"'\"&$B6&\"'!$A$50:$A$55\"),MATCH(2,INDIRECT(\"'\"&$B6&\"'!$H$50:$H$55\"),0)),\"\")","v":""},"","","","","",{"$f":"IFERROR(RANK(J6,$J$3:$J$32)+COUNTIF($J$3:J6,J6)-1,\"\")","v":""},"",null,4,"AT","4A",0,0,0,0,null,4,"BD","5E",0,0,0,0]
[null,"P3",{"$f":"INDEX(INDIRECT(\"'\"&$B7&\"'!$A$50:$A$55\"),MATCH(1,INDIRECT(\"'\"&$B7&\"'!$G$50:$G$55\"),0))","v":"AN"},"3A",0,0,0,0,{"$f":"IFERROR(RANK(J7,$J$3:$J$32)+COUNTIF($J$3:J7,J7)-1,\"\")","v":2},0,null,5,"AU","4B",0,0,0,0,null,5,"BJ","6E",0,0,0,0]
[null,{"$f":"B7","v":"P3"},{"$f":"IFERROR(INDEX(INDIRECT(\"'\"&$B8&\"'!$A$50:$A$55\"),MATCH(2,INDIRECT(\"'\"&$B8&\"'!$H$50:$H$55\"),0)),\"\")","v":"AO"},"3B",0,0,0,0,{"$f":"IFERROR(RANK(J8,$J$3:$J$32)+COUNTIF($J$3:J8,J8)-1,\"\")","v":3},0,null,6,"AZ","5A",0,0,0,0,null,6,"BP","7E",0,0,0,0]
[null,"P4",{"$f":"INDEX(INDIRECT(\"'\"&$B9&\"'!$A$50:$A$55\"),MATCH(1,INDIRECT(\"'\"&$B9&\"'!$G$50:$G$55\"),0))","v":"AT"},"4A",0,0,0,0,{"$f":"IFERROR(RANK(J9,$J$3:$J$32)+COUNTIF($J$3:J9,J9)-1,\"\")","v":4},0,null,7,"BA","5B",0,0,0,0,null,7,"BV","8E",0,0,0,0]
[null,{"$f":"B9","v":"P4"},{"$f":"IFERROR(INDEX(INDIRECT(\"'\"&$B10&\"'!$A$50:$A$55\"),MATCH(2,INDIRECT(\"'\"&$B10&\"'!$H$50:$H$55\"),0)),\"\")","v":"AU"},"4B",0,0,0,0,{"$f":"IFERROR(RANK(J10,$J$3:$J$32)+COUNTIF($J$3:J10,J10)-1,\"\")","v":5},0,null,8,"BF","6A",0,0,0,0,null,8,"CB","9E",0,0,0,0]
[null,"P5",{"$f":"INDEX(INDIRECT(\"'\"&$B11&\"'!$A$50:$A$55\"),MATCH(1,INDIRECT(\"'\"&$B11&\"'!$G$50:$G$55\"),0))","v":"AZ"},"5A",0,0,0,0,{"$f":"IFERROR(RANK(J11,$J$3:$J$32)+COUNTIF($J$3:J11,J11)-1,\"\")","v":6},0,null,9,"BG","6B",0,0,0,0,null,9,"CH","10E",0,0,0,0]
[null,{"$f":"B11","v":"P5"},{"$f":"IFERROR(INDEX(INDIRECT(\"'\"&$B12&\"'!$A$50:$A$55\"),MATCH(2,INDIRECT(\"'\"&$B12&\"'!$H$50:$H$55\"),0)),\"\")","v":"BA"},"5B",0,0,0,0,{"$f":"IFERROR(RANK(J12,$J$3:$J$32)+COUNTIF($J$3:J12,J12)-1,\"\")","v":7},0,null,10,"BL","7A",0,0,0,0,null,10,"CN","11E",0,0,0,0]
[null,"P6",{"$f":"INDEX(INDIRECT(\"'\"&$B13&\"'!$A$50:$A$55\"),MATCH(1,INDIRECT(\"'\"&$B13&\"'!$G$50:$G$55\"),0))","v":"BF"},"6A",0,0,0,0,{"$f":"IFERROR(RANK(J13,$J$3:$J$32)+COUNTIF($J$3:J13,J13)-1,\"\")","v":8},0,null,11,"BM","7B",0,0,0,0,null,11,"CT","12E",0,0,0,0]
[null,{"$f":"B13","v":"P6"},{"$f":"IFERROR(INDEX(INDIRECT(\"'\"&$B14&\"'!$A$50:$A$55\"),MATCH(2,INDIRECT(\"'\"&$B14&\"'!$H$50:$H$55\"),0)),\"\")","v":"BG"},"6B",0,0,0,0,{"$f":"IFERROR(RANK(J14,$J$3:$J$32)+COUNTIF($J$3:J14,J14)-1,\"\")","v":9},0,null,12,"BR","8A",0,0,0,0,null,12,"CZ","13E",0,0,0,0]
[null,"P7",{"$f":"INDEX(INDIRECT(\"'\"&$B15&\"'!$A$50:$A$55\"),MATCH(1,INDIRECT(\"'\"&$B15&\"'!$G$50:$G$55\"),0))","v":"BL"},"7A",0,0,0,0,{"$f":"IFERROR(RANK(J15,$J$3:$J$32)+COUNTIF($J$3:J15,J15)-1,\"\")","v":10},0,null,13,"BS","8B",0,0,0,0,null,13,"DH","14E",0,0,0,0]
[null,{"$f":"B15","v":"P7"},{"$f":"IFERROR(INDEX(INDIRECT(\"'\"&$B16&\"'!$A$50:$A$55\"),MATCH(2,INDIRECT(\"'\"&$B16&\"'!$H$50:$H$55\"),0)),\"\")","v":"BM"},"7B",0,0,0,0,{"$f":"IFERROR(RANK(J16,$J$3:$J$32)+COUNTIF($J$3:J16,J16)-1,\"\")","v":11},0,null,14,"BX","9A",0,0,0,0,null,14,"DN","15E",0,0,0,0]
[null,"P8",{"$f":"INDEX(INDIRECT(\"'\"&$B17&\"'!$A$50:$A$55\"),MATCH(1,INDIRECT(\"'\"&$B17&\"'!$G$50:$G$55\"),0))","v":"BR"},"8A",0,0,0,0,{"$f":"IFERROR(RANK(J17,$J$3:$J$32)+COUNTIF($J$3:J17,J17)-1,\"\")","v":12},0,null,15,"BY","9B",0,0,0,0,null,15,"","","","","",""]
[null,{"$f":"B17","v":"P8"},{"$f":"IFERROR(INDEX(INDIRECT(\"'\"&$B18&\"'!$A$50:$A$55\"),MATCH(2,INDIRECT(\"'\"&$B18&\"'!$H$50:$H$55\"),0)),\"\")","v":"BS"},"8B",0,0,0,0,{"$f":"IFERROR(RANK(J18,$J$3:$J$32)+COUNTIF($J$3:J18,J18)-1,\"\")","v":13},0,null,16,"CD","10A",0,0,0,0,null,16,"","","","","",""]
[null,"P9",{"$f":"INDEX(INDIRECT(\"'\"&$B19&\"'!$A$50:$A$55\"),MATCH(1,INDIRECT(\"'\"&$B19&\"'!$G$50:$G$55\"),0))","v":"BX"},"9A",0,0,0,0,{"$f":"IFERROR(RANK(J19,$J$3:$J$32)+COUNTIF($J$3:J19,J19)-1,\"\")","v":14},0,null,17,"CE","10B",0,0,0,0,null,17,"","","","","",""]
[null,{"$f":"B19","v":"P9"},{"$f":"IFERROR(INDEX(INDIRECT(\"'\"&$B20&\"'!$A$50:$A$55\"),MATCH(2,INDIRECT(\"'\"&$B20&\"'!$H$50:$H$55\"),0)),\"\")","v":"BY"},"9B",0,0,0,0,{"$f":"IFERROR(RANK(J20,$J$3:$J$32)+COUNTIF($J$3:J20,J20)-1,\"\")","v":15},0,null,18,"CJ","11A",0,0,0,0,null,18,"","","","","",""]
[null,"P10",{"$f":"INDEX(INDIRECT(\"'\"&$B21&\"'!$A$50:$A$55\"),MATCH(1,INDIRECT(\"'\"&$B21&\"'!$G$50:$G$55\"),0))","v":"CD"},"10A",0,0,0,0,{"$f":"IFERROR(RANK(J21,$J$3:$J$32)+COUNTIF($J$3:J21,J21)-1,\"\")","v":16},0,null,19,"CK","11B",0,0,0,0,null,19,"","","","","",""]
[null,{"$f":"B21","v":"P10"},{"$f":"IFERROR(INDEX(INDIRECT(\"'\"&$B22&\"'!$A$50:$A$55\"),MATCH(2,INDIRECT(\"'\"&$B22&\"'!$H$50:$H$55\"),0)),\"\")","v":"CE"},"10B",0,0,0,0,{"$f":"IFERROR(RANK(J22,$J$3:$J$32)+COUNTIF($J$3:J22,J22)-1,\"\")","v":17},0,null,20,"CP","12A",0,0,0,0,null,20,"","","","","",""]
[null,"P11",{"$f":"INDEX(INDIRECT(\"'\"&$B23&\"'!$A$50:$A$55\"),MATCH(1,INDIRECT(\"'\"&$B23&\"'!$G$50:$G$55\"),0))","v":"CJ"},"11A",0,0,0,0,{"$f":"IFERROR(RANK(J23,$J$3:$J$32)+COUNTIF($J$3:J23,J23)-1,\"\")","v":18},0]
[null,{"$f":"B23","v":"P11"},{"$f":"IFERROR(INDEX(INDIRECT(\"'\"&$B24&\"'!$A$50:$A$55\"),MATCH(2,INDIRECT(\"'\"&$B24&\"'!$H$50:$H$55\"),0)),\"\")","v":"CK"},"11B",0,0,0,0,{"$f":"IFERROR(RANK(J24,$J$3:$J$32)+COUNTIF($J$3:J24,J24)-1,\"\")","v":19},0]
[null,"P12",{"$f":"INDEX(INDIRECT(\"'\"&$B25&\"'!$A$50:$A$55\"),MATCH(1,INDIRECT(\"'\"&$B25&\"'!$G$50:$G$55\"),0))","v":"CP"},"12A",0,0,0,0,{"$f":"IFERROR(RANK(J25,$J$3:$J$32)+COUNTIF($J$3:J25,J25)-1,\"\")","v":20},0]
[null,{"$f":"B25","v":"P12"},{"$f":"IFERROR(INDEX(INDIRECT(\"'\"&$B26&\"'!$A$50:$A$55\"),MATCH(2,INDIRECT(\"'\"&$B26&\"'!$H$50:$H$55\"),0)),\"\")","v":"CQ"},"12B",0,0,0,0,{"$f":"IFERROR(RANK(J26,$J$3:$J$32)+COUNTIF($J$3:J26,J26)-1,\"\")","v":21},0]
[null,"P13",{"$f":"INDEX(INDIRECT(\"'\"&$B27&\"'!$A$50:$A$55\"),MATCH(1,INDIRECT(\"'\"&$B27&\"'!$G$50:$G$55\"),0))","v":"CV"},"13A",0,0,0,0,{"$f":"IFERROR(RANK(J27,$J$3:$J$32)+COUNTIF($J$3:J27,J27)-1,\"\")","v":22},0]
[null,{"$f":"B27","v":"P13"},{"$f":"IFERROR(INDEX(INDIRECT(\"'\"&$B28&\"'!$A$50:$A$55\"),MATCH(2,INDIRECT(\"'\"&$B28&\"'!$H$50:$H$55\"),0)),\"\")","v":"CW"},"13B",0,0,0,0,{"$f":"IFERROR(RANK(J28,$J$3:$J$32)+COUNTIF($J$3:J28,J28)-1,\"\")","v":23},0]
[null,"P14",{"$f":"INDEX(INDIRECT(\"'\"&$B29&\"'!$A$50:$A$55\"),MATCH(1,INDIRECT(\"'\"&$B29&\"'!$G$50:$G$55\"),0))","v":"DB"},"14A",0,0,0,0,{"$f":"IFERROR(RANK(J29,$J$3:$J$32)+COUNTIF($J$3:J29,J29)-1,\"\")","v":24},0]
[null,{"$f":"B29","v":"P14"},{"$f":"IFERROR(INDEX(INDIRECT(\"'\"&$B30&\"'!$A$50:$A$55\"),MATCH(2,INDIRECT(\"'\"&$B30&\"'!$H$50:$H$55\"),0)),\"\")","v":"DE"},"14B",0,0,0,0,{"$f":"IFERROR(RANK(J30,$J$3:$J$32)+COUNTIF($J$3:J30,J30)-1,\"\")","v":25},0]
[null,"P15",{"$f":"INDEX(INDIRECT(\"'\"&$B31&\"'!$A$50:$A$55\"),MATCH(1,INDIRECT(\"'\"&$B31&\"'!$G$50:$G$55\"),0))","v":"DJ"},"15A",0,0,0,0,{"$f":"IFERROR(RANK(J31,$J$3:$J$32)+COUNTIF($J$3:J31,J31)-1,\"\")","v":26},0]
[null,{"$f":"B31","v":"P15"},{"$f":"IFERROR(INDEX(INDIRECT(\"'\"&$B32&\"'!$A$50:$A$55\"),MATCH(2,INDIRECT(\"'\"&$B32&\"'!$H$50:$H$55\"),0)),\"\")","v":"DK"},"15B",0,0,0,0,{"$f":"IFERROR(RANK(J32,$J$3:$J$32)+COUNTIF($J$3:J32,J32)-1,\"\")","v":27},0]
["SECONDS","P1",{"$f":"IFERROR(INDEX(INDIRECT(\"'\"&$B33&\"'!$A$50:$A$55\"),MATCH(2,INDIRECT(\"'\"&$B33&\"'!$G$50:$G$55\"),0)),\"2 premiers\")","v":"2 premiers"},"","","","","",{"$f":"IFERROR(RANK(J33,$J$33:$J$62)+COUNTIF($J$33:J33,J33)-1,\"\")","v":""},""]
[null,{"$f":"B33","v":"P1"},{"$f":"IFERROR(INDEX(INDIRECT(\"'\"&$B34&\"'!$A$50:$A$55\"),MATCH(5,INDIRECT(\"'\"&$B34&\"'!$H$50:$H$55\"),0)),\"\")","v":""},"","","","","",{"$f":"IFERROR(RANK(J34,$J$33:$J$62)+COUNTIF($J$33:J34,J34)-1,\"\")","v":""},""]
[null,"P2",{"$f":"IFERROR(INDEX(INDIRECT(\"'\"&$B35&\"'!$A$50:$A$55\"),MATCH(2,INDIRECT(\"'\"&$B35&\"'!$G$50:$G$55\"),0)),\"2 premiers\")","v":"AJ"},{"$f":"IFERROR(VLOOKUP($C35,INDIRECT(\"'\"&$B35&\"'!$A$50:$F$55\"),2,0),\"\")","v":"2C"},{"$f":"IFERROR(VLOOKUP($C35,INDIRECT(\"'\"&$B35&\"'!$A$50:$F$55\"),3,0),\"\")","v":0},{"$f":"IFERROR(VLOOKUP($C35,INDIRECT(\"'\"&$B35&\"'!$A$50:$F$55\"),4,0),\"\")","v":0},{"$f":"IFERROR(VLOOKUP($C35,INDIRECT(\"'\"&$B35&\"'!$A$50:$F$55\"),5,0),\"\")","v":0},{"$f":"IFERROR(VLOOKUP($C35,INDIRECT(\"'\"&$B35&\"'!$A$50:$F$55\"),6,0),\"\")","v":0},{"$f":"IFERROR(RANK(J35,$J$33:$J$62)+COUNTIF($J$33:J35,J35)-1,\"\")","v":1},0]
[null,{"$f":"B35","v":"P2"},{"$f":"IFERROR(INDEX(INDIRECT(\"'\"&$B36&\"'!$A$50:$A$55\"),MATCH(5,INDIRECT(\"'\"&$B36&\"'!$H$50:$H$55\"),0)),\"\")","v":""},"","","","","",{"$f":"IFERROR(RANK(J36,$J$33:$J$62)+COUNTIF($J$33:J36,J36)-1,\"\")","v":""},""]
[null,"P3",{"$f":"IFERROR(INDEX(INDIRECT(\"'\"&$B37&\"'!$A$50:$A$55\"),MATCH(2,INDIRECT(\"'\"&$B37&\"'!$G$50:$G$55\"),0)),\"2 premiers\")","v":"2 premiers"},"","","","","",{"$f":"IFERROR(RANK(J37,$J$33:$J$62)+COUNTIF($J$33:J37,J37)-1,\"\")","v":""},""]
[null,{"$f":"B37","v":"P3"},{"$f":"IFERROR(INDEX(INDIRECT(\"'\"&$B38&\"'!$A$50:$A$55\"),MATCH(5,INDIRECT(\"'\"&$B38&\"'!$H$50:$H$55\"),0)),\"\")","v":"AR"},"3E",0,0,0,0,{"$f":"IFERROR(RANK(J38,$J$33:$J$62)+COUNTIF($J$33:J38,J38)-1,\"\")","v":2},0]
[null,"P4",{"$f":"IFERROR(INDEX(INDIRECT(\"'\"&$B39&\"'!$A$50:$A$55\"),MATCH(2,INDIRECT(\"'\"&$B39&\"'!$G$50:$G$55\"),0)),\"2 premiers\")","v":"2 premiers"},"","","","","",{"$f":"IFERROR(RANK(J39,$J$33:$J$62)+COUNTIF($J$33:J39,J39)-1,\"\")","v":""},""]
[null,{"$f":"B39","v":"P4"},{"$f":"IFERROR(INDEX(INDIRECT(\"'\"&$B40&\"'!$A$50:$A$55\"),MATCH(5,INDIRECT(\"'\"&$B40&\"'!$H$50:$H$55\"),0)),\"\")","v":"AX"},"4E",0,0,0,0,{"$f":"IFERROR(RANK(J40,$J$33:$J$62)+COUNTIF($J$33:J40,J40)-1,\"\")","v":3},0]
[null,"P5",{"$f":"IFERROR(INDEX(INDIRECT(\"'\"&$B41&\"'!$A$50:$A$55\"),MATCH(2,INDIRECT(\"'\"&$B41&\"'!$G$50:$G$55\"),0)),\"2 premiers\")","v":"2 premiers"},"","","","","",{"$f":"IFERROR(RANK(J41,$J$33:$J$62)+COUNTIF($J$33:J41,J41)-1,\"\")","v":""},""]
[null,{"$f":"B41","v":"P5"},{"$f":"IFERROR(INDEX(INDIRECT(\"'\"&$B42&\"'!$A$50:$A$55\"),MATCH(5,INDIRECT(\"'\"&$B42&\"'!$H$50:$H$55\"),0)),\"\")","v":"BD"},"5E",0,0,0,0,{"$f":"IFERROR(RANK(J42,$J$33:$J$62)+COUNTIF($J$33:J42,J42)-1,\"\")","v":4},0]
[null,"P6",{"$f":"IFERROR(INDEX(INDIRECT(\"'\"&$B43&\"'!$A$50:$A$55\"),MATCH(2,INDIRECT(\"'\"&$B43&\"'!$G$50:$G$55\"),0)),\"2 premiers\")","v":"2 premiers"},"","","","","",{"$f":"IFERROR(RANK(J43,$J$33:$J$62)+COUNTIF($J$33:J43,J43)-1,\"\")","v":""},""]
[null,{"$f":"B43","v":"P6"},{"$f":"IFERROR(INDEX(INDIRECT(\"'\"&$B44&\"'!$A$50:$A$55\"),MATCH(5,INDIRECT(\"'\"&$B44&\"'!$H$50:$H$55\"),0)),\"\")","v":"BJ"},"6E",0,0,0,0,{"$f":"IFERROR(RANK(J44,$J$33:$J$62)+COUNTIF($J$33:J44,J44)-1,\"\")","v":5},0]
[null,"P7",{"$f":"IFERROR(INDEX(INDIRECT(\"'\"&$B45&\"'!$A$50:$A$55\"),MATCH(2,INDIRECT(\"'\"&$B45&\"'!$G$50:$G$55\"),0)),\"2 premiers\")","v":"2 premiers"},"","","","","",{"$f":"IFERROR(RANK(J45,$J$33:$J$62)+COUNTIF($J$33:J45,J45)-1,\"\")","v":""},""]
[null,{"$f":"B45","v":"P7"},{"$f":"IFERROR(INDEX(INDIRECT(\"'\"&$B46&\"'!$A$50:$A$55\"),MATCH(5,INDIRECT(\"'\"&$B46&\"'!$H$50:$H$55\"),0)),\"\")","v":"BP"},"7E",0,0,0,0,{"$f":"IFERROR(RANK(J46,$J$33:$J$62)+COUNTIF($J$33:J46,J46)-1,\"\")","v":6},0]
[null,"P8",{"$f":"IFERROR(INDEX(INDIRECT(\"'\"&$B47&\"'!$A$50:$A$55\"),MATCH(2,INDIRECT(\"'\"&$B47&\"'!$G$50:$G$55\"),0)),\"2 premiers\")","v":"2 premiers"},"","","","","",{"$f":"IFERROR(RANK(J47,$J$33:$J$62)+COUNTIF($J$33:J47,J47)-1,\"\")","v":""},""]
[null,{"$f":"B47","v":"P8"},{"$f":"IFERROR(INDEX(INDIRECT(\"'\"&$B48&\"'!$A$50:$A$55\"),MATCH(5,INDIRECT(\"'\"&$B48&\"'!$H$50:$H$55\"),0)),\"\")","v":"BV"},"8E",0,0,0,0,{"$f":"IFERROR(RANK(J48,$J$33:$J$62)+COUNTIF($J$33:J48,J48)-1,\"\")","v":7},0]
[null,"P9",{"$f":"IFERROR(INDEX(INDIRECT(\"'\"&$B49&\"'!$A$50:$A$55\"),MATCH(2,INDIRECT(\"'\"&$B49&\"'!$G$50:$G$55\"),0)),\"2 premiers\")","v":"2 premiers"},"","","","","",{"$f":"IFERROR(RANK(J49,$J$33:$J$62)+COUNTIF($J$33:J49,J49)-1,\"\")","v":""},""]
[null,{"$f":"B49","v":"P9"},{"$f":"IFERROR(INDEX(INDIRECT(\"'\"&$B50&\"'!$A$50:$A$55\"),MATCH(5,INDIRECT(\"'\"&$B50&\"'!$H$50:$H$55\"),0)),\"\")","v":"CB"},"9E",0,0,0,0,{"$f":"IFERROR(RANK(J50,$J$33:$J$62)+COUNTIF($J$33:J50,J50)-1,\"\")","v":8},0]
[null,"P10",{"$f":"IFERROR(INDEX(INDIRECT(\"'\"&$B51&\"'!$A$50:$A$55\"),MATCH(2,INDIRECT(\"'\"&$B51&\"'!$G$50:$G$55\"),0)),\"2 premiers\")","v":"2 premiers"},"","","","","",{"$f":"IFERROR(RANK(J51,$J$33:$J$62)+COUNTIF($J$33:J51,J51)-1,\"\")","v":""},""]
[null,{"$f":"B51","v":"P10"},{"$f":"IFERROR(INDEX(INDIRECT(\"'\"&$B52&\"'!$A$50:$A$55\"),MATCH(5,INDIRECT(\"'\"&$B52&\"'!$H$50:$H$55\"),0)),\"\")","v":"CH"},"10E",0,0,0,0,{"$f":"IFERROR(RANK(J52,$J$33:$J$62)+COUNTIF($J$33:J52,J52)-1,\"\")","v":9},0]
[null,"P11",{"$f":"IFERROR(INDEX(INDIRECT(\"'\"&$B53&\"'!$A$50:$A$55\"),MATCH(2,INDIRECT(\"'\"&$B53&\"'!$G$50:$G$55\"),0)),\"2 premiers\")","v":"2 premiers"},"","","","","",{"$f":"IFERROR(RANK(J53,$J$33:$J$62)+COUNTIF($J$33:J53,J53)-1,\"\")","v":""},""]
[null,{"$f":"B53","v":"P11"},{"$f":"IFERROR(INDEX(INDIRECT(\"'\"&$B54&\"'!$A$50:$A$55\"),MATCH(5,INDIRECT(\"'\"&$B54&\"'!$H$50:$H$55\"),0)),\"\")","v":"CN"},"11E",0,0,0,0,{"$f":"IFERROR(RANK(J54,$J$33:$J$62)+COUNTIF($J$33:J54,J54)-1,\"\")","v":10},0]
[null,"P12",{"$f":"IFERROR(INDEX(INDIRECT(\"'\"&$B55&\"'!$A$50:$A$55\"),MATCH(2,INDIRECT(\"'\"&$B55&\"'!$G$50:$G$55\"),0)),\"2 premiers\")","v":"2 premiers"},"","","","","",{"$f":"IFERROR(RANK(J55,$J$33:$J$62)+COUNTIF($J$33:J55,J55)-1,\"\")","v":""},""]
[null,{"$f":"B55","v":"P12"},{"$f":"IFERROR(INDEX(INDIRECT(\"'\"&$B56&\"'!$A$50:$A$55\"),MATCH(5,INDIRECT(\"'\"&$B56&\"'!$H$50:$H$55\"),0)),\"\")","v":"CT"},"12E",0,0,0,0,{"$f":"IFERROR(RANK(J56,$J$33:$J$62)+COUNTIF($J$33:J56,J56)-1,\"\")","v":11},0]
[null,"P13",{"$f":"IFERROR(INDEX(INDIRECT(\"'\"&$B57&\"'!$A$50:$A$55\"),MATCH(2,INDIRECT(\"'\"&$B57&\"'!$G$50:$G$55\"),0)),\"2 premiers\")","v":"2 premiers"},"","","","","",{"$f":"IFERROR(RANK(J57,$J$33:$J$62)+COUNTIF($J$33:J57,J57)-1,\"\")","v":""},""]
[null,{"$f":"B57","v":"P13"},{"$f":"IFERROR(INDEX(INDIRECT(\"'\"&$B58&\"'!$A$50:$A$55\"),MATCH(5,INDIRECT(\"'\"&$B58&\"'!$H$50:$H$55\"),0)),\"\")","v":"CZ"},"13E",0,0,0,0,{"$f":"IFERROR(RANK(J58,$J$33:$J$62)+COUNTIF($J$33:J58,J58)-1,\"\")","v":12},0]
[null,"P14",{"$f":"IFERROR(INDEX(INDIRECT(\"'\"&$B59&\"'!$A$50:$A$55\"),MATCH(2,INDIRECT(\"'\"&$B59&\"'!$G$50:$G$55\"),0)),\"2 premiers\")","v":"2 premiers"},"","","","","",{"$f":"IFERROR(RANK(J59,$J$33:$J$62)+COUNTIF($J$33:J59,J59)-1,\"\")","v":""},""]
[null,{"$f":"B59","v":"P14"},{"$f":"IFERROR(INDEX(INDIRECT(\"'\"&$B60&\"'!$A$50:$A$55\"),MATCH(5,INDIRECT(\"'\"&$B60&\"'!$H$50:$H$55\"),0)),\"\")","v":"DH"},"14E",0,0,0,0,{"$f":"IFERROR(RANK(J60,$J$33:$J$62)+COUNTIF($J$33:J60,J60)-1,\"\")","v":13},0]
[null,"P15",{"$f":"IFERROR(INDEX(INDIRECT(\"'\"&$B61&\"'!$A$50:$A$55\"),MATCH(2,INDIRECT(\"'\"&$B61&\"'!$G$50:$G$55\"),0)),\"2 premiers\")","v":"2 premiers"},"","","","","",{"$f":"IFERROR(RANK(J61,$J$33:$J$62)+COUNTIF($J$33:J61,J61)-1,\"\")","v":""},""]
[null,{"$f":"B61","v":"P15"},{"$f":"IFERROR(INDEX(INDIRECT(\"'\"&$B62&\"'!$A$50:$A$55\"),MATCH(5,INDIRECT(\"'\"&$B62&\"'!$H$50:$H$55\"),0)),\"\")","v":"DN"},"15E",0,0,0,0,{"$f":"IFERROR(RANK(J62,$J$33:$J$62)+COUNTIF($J$33:J62,J62)-1,\"\")","v":14},0]

{"sheet":"Macros","index":16,"n_rows":4,"n_cols":6,"rows_kept":4,"cut":false,"hidden":false,"merged":[]}
[null,null,null,null,null,{"$f":"AND(Classt!O3=Classt!O4,Classt!R3=Classt!R4,Classt!P3=Classt!P4)","v":true}]
[null,null,null,null,null,{"$f":"AND(Classt!O5=Classt!O3,Classt!R5=Classt!R3,Classt!P5=Classt!P3)","v":true}]
[null,null,null,null,null,{"$f":"AND(Classt!O6=Classt!O3,Classt!R6=Classt!R3,Classt!P6=Classt!P3)","v":true}]
[null,null,null,null,null,{"$f":"AND(Classt!O7=Classt!O3,Classt!R7=Classt!R3,Classt!P7=Classt!P3)","v":true}]