{"text_format":"1","workbook":"xlsx","n_sheets":2,"sheets":["GESTION","BASE_DE_DONNEE"],"not_rendered":{"charts":0,"images":0,"macros":1,"external_links":0,"defined_names":0,"comments":0,"pivot_tables":0},"unopened":[],"bounds":{"document_bytes":16777216,"sheet_cells":100000,"rows_first":2000,"rows_last":500,"rows_between":2000,"halvings":0,"cell_chars":16384,"cell_head_chars":4096},"cells_cut":0,"cells_raw":0,"read":"whole","date_system":"1900"}

{"sheet":"GESTION","index":0,"n_rows":21,"n_cols":12,"rows_kept":21,"cut":false,"hidden":false,"merged":[[16,2,16,4],[16,8,16,10],[17,1,20,5],[17,7,20,11],[11,1,14,5],[10,8,10,10],[11,7,14,11],[1,5,1,7],[2,5,2,7],[4,2,4,5],[6,2,6,5],[4,8,4,10],[5,7,8,11],[10,2,10,4]]}
[]
[null,null,null,null,null,"SELECTIONNEZ UN NOM :"]
[null,null,null,null,null,"DEF"]
[]
[null,"ADRESSE: ",null,null,null,null,null,null,"Etat de santé / mobilité"]
[null,null,null,null,null,null,null,null,{"$f":"VLOOKUP($F$3,BASE_DE_DONNEE!$B$4:$K$26,5,FALSE)","v":0},{"$f":"VLOOKUP($F$3,BASE_DE_DONNEE!$B$4:$K$26,5,FALSE)","v":0},{"$f":"VLOOKUP($F$3,BASE_DE_DONNEE!$B$4:$K$26,5,FALSE)","v":0},{"$f":"VLOOKUP($F$3,BASE_DE_DONNEE!$B$4:$K$26,5,FALSE)","v":0}]
[null,"TELEPHONE :",null,null,null,null,null,{"$f":"VLOOKUP($F$3,BASE_DE_DONNEE!$B$4:$K$26,5,FALSE)","v":0},{"$f":"VLOOKUP($F$3,BASE_DE_DONNEE!$B$4:$K$26,5,FALSE)","v":0},{"$f":"VLOOKUP($F$3,BASE_DE_DONNEE!$B$4:$K$26,5,FALSE)","v":0},{"$f":"VLOOKUP($F$3,BASE_DE_DONNEE!$B$4:$K$26,5,FALSE)","v":0},{"$f":"VLOOKUP($F$3,BASE_DE_DONNEE!$B$4:$K$26,5,FALSE)","v":0}]
[null,null,null,null,null,null,null,{"$f":"VLOOKUP($F$3,BASE_DE_DONNEE!$B$4:$K$26,5,FALSE)","v":0},{"$f":"VLOOKUP($F$3,BASE_DE_DONNEE!$B$4:$K$26,5,FALSE)","v":0},{"$f":"VLOOKUP($F$3,BASE_DE_DONNEE!$B$4:$K$26,5,FALSE)","v":0},{"$f":"VLOOKUP($F$3,BASE_DE_DONNEE!$B$4:$K$26,5,FALSE)","v":0},{"$f":"VLOOKUP($F$3,BASE_DE_DONNEE!$B$4:$K$26,5,FALSE)","v":0}]
[null,"AJOUT LE :",null,null,"DERNIER CONTACT :  ",null,null,{"$f":"VLOOKUP($F$3,BASE_DE_DONNEE!$B$4:$K$26,5,FALSE)","v":0},{"$f":"VLOOKUP($F$3,BASE_DE_DONNEE!$B$4:$K$26,5,FALSE)","v":0},{"$f":"VLOOKUP($F$3,BASE_DE_DONNEE!$B$4:$K$26,5,FALSE)","v":0},{"$f":"VLOOKUP($F$3,BASE_DE_DONNEE!$B$4:$K$26,5,FALSE)","v":0},{"$f":"VLOOKUP($F$3,BASE_DE_DONNEE!$B$4:$K$26,5,FALSE)","v":0}]
[]
[null,null,"Situation d'isolement",null,null,null,null,null,"Souhaits exprimés"]
[null,null,{"$f":"VLOOKUP($F$3,BASE_DE_DONNEE!$B$4:$K$26,5,FALSE)","v":0},{"$f":"VLOOKUP($F$3,BASE_DE_DONNEE!$B$4:$K$26,5,FALSE)","v":0},{"$f":"VLOOKUP($F$3,BASE_DE_DONNEE!$B$4:$K$26,5,FALSE)","v":0},{"$f":"VLOOKUP($F$3,BASE_DE_DONNEE!$B$4:$K$26,5,FALSE)","v":0},null,null,{"$f":"VLOOKUP($F$3,BASE_DE_DONNEE!$B$4:$K$26,5,FALSE)","v":0},{"$f":"VLOOKUP($F$3,BASE_DE_DONNEE!$B$4:$K$26,5,FALSE)","v":0},{"$f":"VLOOKUP($F$3,BASE_DE_DONNEE!$B$4:$K$26,5,FALSE)","v":0},{"$f":"VLOOKUP($F$3,BASE_DE_DONNEE!$B$4:$K$26,5,FALSE)","v":0}]
[null,{"$f":"VLOOKUP($F$3,BASE_DE_DONNEE!$B$4:$K$26,5,FALSE)","v":0},{"$f":"VLOOKUP($F$3,BASE_DE_DONNEE!$B$4:$K$26,5,FALSE)","v":0},{"$f":"VLOOKUP($F$3,BASE_DE_DONNEE!$B$4:$K$26,5,FALSE)","v":0},{"$f":"VLOOKUP($F$3,BASE_DE_DONNEE!$B$4:$K$26,5,FALSE)","v":0},{"$f":"VLOOKUP($F$3,BASE_DE_DONNEE!$B$4:$K$26,5,FALSE)","v":0},null,{"$f":"VLOOKUP($F$3,BASE_DE_DONNEE!$B$4:$K$26,5,FALSE)","v":0},{"$f":"VLOOKUP($F$3,BASE_DE_DONNEE!$B$4:$K$26,5,FALSE)","v":0},{"$f":"VLOOKUP($F$3,BASE_DE_DONNEE!$B$4:$K$26,5,FALSE)","v":0},{"$f":"VLOOKUP($F$3,BASE_DE_DONNEE!$B$4:$K$26,5,FALSE)","v":0},{"$f":"VLOOKUP($F$3,BASE_DE_DONNEE!$B$4:$K$26,5,FALSE)","v":0}]
[null,{"$f":"VLOOKUP($F$3,BASE_DE_DONNEE!$B$4:$K$26,5,FALSE)","v":0},{"$f":"VLOOKUP($F$3,BASE_DE_DONNEE!$B$4:$K$26,5,FALSE)","v":0},{"$f":"VLOOKUP($F$3,BASE_DE_DONNEE!$B$4:$K$26,5,FALSE)","v":0},{"$f":"VLOOKUP($F$3,BASE_DE_DONNEE!$B$4:$K$26,5,FALSE)","v":0},{"$f":"VLOOKUP($F$3,BASE_DE_DONNEE!$B$4:$K$26,5,FALSE)","v":0},null,{"$f":"VLOOKUP($F$3,BASE_DE_DONNEE!$B$4:$K$26,5,FALSE)","v":0},{"$f":"VLOOKUP($F$3,BASE_DE_DONNEE!$B$4:$K$26,5,FALSE)","v":0},{"$f":"VLOOKUP($F$3,BASE_DE_DONNEE!$B$4:$K$26,5,FALSE)","v":0},{"$f":"VLOOKUP($F$3,BASE_DE_DONNEE!$B$4:$K$26,5,FALSE)","v":0},{"$f":"VLOOKUP($F$3,BASE_DE_DONNEE!$B$4:$K$26,5,FALSE)","v":0}]
[null,{"$f":"VLOOKUP($F$3,BASE_DE_DONNEE!$B$4:$K$26,5,FALSE)","v":0},{"$f":"VLOOKUP($F$3,BASE_DE_DONNEE!$B$4:$K$26,5,FALSE)","v":0},{"$f":"VLOOKUP($F$3,BASE_DE_DONNEE!$B$4:$K$26,5,FALSE)","v":0},{"$f":"VLOOKUP($F$3,BASE_DE_DONNEE!$B$4:$K$26,5,FALSE)","v":0},{"$f":"VLOOKUP($F$3,BASE_DE_DONNEE!$B$4:$K$26,5,FALSE)","v":0},null,{"$f":"VLOOKUP($F$3,BASE_DE_DONNEE!$B$4:$K$26,5,FALSE)","v":0},{"$f":"VLOOKUP($F$3,BASE_DE_DONNEE!$B$4:$K$26,5,FALSE)","v":0},{"$f":"VLOOKUP($F$3,BASE_DE_DONNEE!$B$4:$K$26,5,FALSE)","v":0},{"$f":"VLOOKUP($F$3,BASE_DE_DONNEE!$B$4:$K$26,5,FALSE)","v":0},{"$f":"VLOOKUP($F$3,BASE_DE_DONNEE!$B$4:$K$26,5,FALSE)","v":0}]
[]
[null,null,"Propositions faites par le service",null,null,null,null,null,"Actions données par le service"]
[null,null,{"$f":"VLOOKUP($F$3,BASE_DE_DONNEE!$B$4:$K$26,5,FALSE)","v":0},{"$f":"VLOOKUP($F$3,BASE_DE_DONNEE!$B$4:$K$26,5,FALSE)","v":0},{"$f":"VLOOKUP($F$3,BASE_DE_DONNEE!$B$4:$K$26,5,FALSE)","v":0},{"$f":"VLOOKUP($F$3,BASE_DE_DONNEE!$B$4:$K$26,5,FALSE)","v":0},null,null,{"$f":"VLOOKUP($F$3,BASE_DE_DONNEE!$B$4:$K$26,5,FALSE)","v":0},{"$f":"VLOOKUP($F$3,BASE_DE_DONNEE!$B$4:$K$26,5,FALSE)","v":0},{"$f":"VLOOKUP($F$3,BASE_DE_DONNEE!$B$4:$K$26,5,FALSE)","v":0},{"$f":"VLOOKUP($F$3,BASE_DE_DONNEE!$B$4:$K$26,5,FALSE)","v":0}]
[null,{"$f":"VLOOKUP($F$3,BASE_DE_DONNEE!$B$4:$K$26,5,FALSE)","v":0},{"$f":"VLOOKUP($F$3,BASE_DE_DONNEE!$B$4:$K$26,5,FALSE)","v":0},{"$f":"VLOOKUP($F$3,BASE_DE_DONNEE!$B$4:$K$26,5,FALSE)","v":0},{"$f":"VLOOKUP($F$3,BASE_DE_DONNEE!$B$4:$K$26,5,FALSE)","v":0},{"$f":"VLOOKUP($F$3,BASE_DE_DONNEE!$B$4:$K$26,5,FALSE)","v":0},null,{"$f":"VLOOKUP($F$3,BASE_DE_DONNEE!$B$4:$K$26,5,FALSE)","v":0},{"$f":"VLOOKUP($F$3,BASE_DE_DONNEE!$B$4:$K$26,5,FALSE)","v":0},{"$f":"VLOOKUP($F$3,BASE_DE_DONNEE!$B$4:$K$26,5,FALSE)","v":0},{"$f":"VLOOKUP($F$3,BASE_DE_DONNEE!$B$4:$K$26,5,FALSE)","v":0},{"$f":"VLOOKUP($F$3,BASE_DE_DONNEE!$B$4:$K$26,5,FALSE)","v":0}]
[null,{"$f":"VLOOKUP($F$3,BASE_DE_DONNEE!$B$4:$K$26,5,FALSE)","v":0},{"$f":"VLOOKUP($F$3,BASE_DE_DONNEE!$B$4:$K$26,5,FALSE)","v":0},{"$f":"VLOOKUP($F$3,BASE_DE_DONNEE!$B$4:$K$26,5,FALSE)","v":0},{"$f":"VLOOKUP($F$3,BASE_DE_DONNEE!$B$4:$K$26,5,FALSE)","v":0},{"$f":"VLOOKUP($F$3,BASE_DE_DONNEE!$B$4:$K$26,5,FALSE)","v":0},null,{"$f":"VLOOKUP($F$3,BASE_DE_DONNEE!$B$4:$K$26,5,FALSE)","v":0},{"$f":"VLOOKUP($F$3,BASE_DE_DONNEE!$B$4:$K$26,5,FALSE)","v":0},{"$f":"VLOOKUP($F$3,BASE_DE_DONNEE!$B$4:$K$26,5,FALSE)","v":0},{"$f":"VLOOKUP($F$3,BASE_DE_DONNEE!$B$4:$K$26,5,FALSE)","v":0},{"$f":"VLOOKUP($F$3,BASE_DE_DONNEE!$B$4:$K$26,5,FALSE)","v":0}]
[null,{"$f":"VLOOKUP($F$3,BASE_DE_DONNEE!$B$4:$K$26,5,FALSE)","v":0},{"$f":"VLOOKUP($F$3,BASE_DE_DONNEE!$B$4:$K$26,5,FALSE)","v":0},{"$f":"VLOOKUP($F$3,BASE_DE_DONNEE!$B$4:$K$26,5,FALSE)","v":0},{"$f":"VLOOKUP($F$3,BASE_DE_DONNEE!$B$4:$K$26,5,FALSE)","v":0},{"$f":"VLOOKUP($F$3,BASE_DE_DONNEE!$B$4:$K$26,5,FALSE)","v":0},null,{"$f":"VLOOKUP($F$3,BASE_DE_DONNEE!$B$4:$K$26,5,FALSE)","v":0},{"$f":"VLOOKUP($F$3,BASE_DE_DONNEE!$B$4:$K$26,5,FALSE)","v":0},{"$f":"VLOOKUP($F$3,BASE_DE_DONNEE!$B$4:$K$26,5,FALSE)","v":0},{"$f":"VLOOKUP($F$3,BASE_DE_DONNEE!$B$4:$K$26,5,FALSE)","v":0},{"$f":"VLOOKUP($F$3,BASE_DE_DONNEE!$B$4:$K$26,5,FALSE)","v":0}]

{"sheet":"BASE_DE_DONNEE","index":1,"n_rows":13,"n_cols":11,"rows_kept":13,"cut":false,"hidden":false,"merged":[[1,1,1,3]]}
[]
[null,"Coordonnées"]
[null,"NOM","ADRESSE","TELEPHONE","AJOUTE DEPUIS","DERNIER CONTACT","Etat de santé / mobilité","Situation d'isolement (descriptif / fréquence)","Souhaits exprimés","Propositions faites par le service","Actions données par le service"]
[null,"ABC","1",2,"1900-01-03","1900-01-04",5,6,7,8,9]
[null,"BLANC Georgette","125 Rue des fleurs bleu , 12333 NOMDEVILLE","89 76 45 23 01","2013-02-01","2015-05-12","FAUTEUIL","EXEMPLE SITUATION 2","EXEMPLE 02 ","PAS GRAND-CHOSE","PAS MIEUX NON PLUS"]
[null,"DEF"]
[null,"DUPOND Charle","111 Rue de ABCD, 11111 NOMDEVILLE","11 11 11 11 11 ","2021-11-19","2020-11-15","ABCDE","EXEMPLE SITUATION 3","EXEMPLE 03","PLEINS DE CHOSES","EXEMPLE ACTION 3"]
[null,"DUPONT François","123 Rue de ABCD, 1234 NOMDEVILLE2","01 23 45 67 89","2021-11-12","2021-11-15","OK","EXEMPLE SITUATION 1","EXEMPLE 01","RIEN","PAS MIEUX"]
[null,"GHI"]
[null,"JKL"]
[null,"LMN"]
[null,"OPQ"]
[null,"SMITH John","999 Residence des XXXXXX, 9999 NOMDEVILLE","99 99 99 99 99 ","2013-02-09","2014-05-12","FGHIJ","EXEMPLE SITUATION 4","EXEMPLE 04","TOURNOIS DE BELOTTE","EXEMPLE ACTION 4"]