{"text_format":"1","workbook":"xlsx","n_sheets":12,"sheets":["Formulaire","imprimée","Inscription","contrôle","Archive","les affectations","les missions","les villes","les proffessions","les véhicules","les personnes","les personnes1"],"not_rendered":{"charts":0,"images":13,"macros":1,"external_links":2,"defined_names":15,"comments":0,"pivot_tables":0},"unopened":[],"bounds":{"document_bytes":16777216,"sheet_cells":100000,"rows_first":2000,"rows_last":500,"rows_between":2000,"halvings":0,"cell_chars":16384,"cell_head_chars":4096},"cells_cut":0,"cells_raw":0,"read":"whole","date_system":"1900"}

{"sheet":"Formulaire","index":0,"n_rows":86,"n_cols":11,"rows_kept":86,"cut":false,"hidden":false,"merged":[[2,7,2,10],[3,7,3,10],[4,7,4,10],[36,4,36,5],[37,4,37,5],[38,4,38,5],[39,4,39,5],[2,1,2,3],[3,1,3,3],[4,1,4,3],[1,4,5,6]]}
[]
[null,null,null,null,"الإستمارة"]
[null,"              Royaume marocaine",null,null,null,null,null,"المملكة المغربية"]
[null,"          Haut commissariat au plan",null,null,null,null,null," المندوبية السامية للتخطيط"]
[null,"   direction régionale du Drâa-Tafilalet",null,null,null,null,null,"المديرية الجهوية لدرعة - تافيلالت"]
[]
[]
[null,{"$f":"IF(I8=8,IF(K8=3,3,IF(K8=4,4,IF(K8=1,IF(G23<>\"\",12,11),0))),0)","v":0},"<-- 1",null,"Auto3 (7)",{"$f":"IF(G60=\"بمرافقة السيارات التالية\",1,IF(G60=\"بمرافقة أي سيارة\",2,IF(G60=\"بإستعمال السيارة أو الدراجة النارية رقم\",3,IF(G60=\"بإستعمال وسائل النقل العمومية\",4,\"\"))))","v":3},{"$f":"IF(OR($I$8=6,$I$8=8,$I$8=9),0,F8)","v":0},"AUTOR1 (8)",6,{"$f":"IF(G21=\"بمرافقة السيارات التالية\",1,IF(G21=\"بمرافقة أي سيارة\",2,IF(G21=\"بإستعمال السيارة أو الدراجة النارية رقم\",3,IF(G21=\"بإستعمال وسائل النقل العمومية\",4,\"\"))))","v":1},{"$f":"IF(OR($I$8=6,$I$8=7,$I$8=9),0,J8)","v":0}]
[null,{"$f":"IF(I8=7,IF(G8=3,3,IF(G8=4,4,IF(G8=1,IF(G62<>\"\",12,11),0))),0)","v":0},"<-- 3",null,"VILLES (7)",{"$f":"IF(G66=\"بمدينة\",1,IF(G66=\"بالأقاليم التالية\",2,IF(G66=\"بالأقاليم و العمالات التالية\",3,\"\")))","v":1},{"$f":"IF(OR($I$8=6,$I$8=8,$I$8=9),0,F9)","v":0},"VILLES1 (8)",null,{"$f":"IF(G27=\"بمدينة\",1,IF(G27=\"بالأقاليم التالية\",2,IF(G27=\"بالأقاليم و العمالات التالية\",3,\"\")))","v":2},{"$f":"IF(OR($I$8=6,$I$8=7,$I$8=9),0,J9)","v":0}]
[null,false,{"$f":"IF(C13=\"\",0,IF(B10=FALSE,0,IF(B10=TRUE,1,\"\")))","v":0},null,"VILLES (6)",{"$f":"IF(G82=\"بمدينة\",1,IF(G82=\"بالأقاليم التالية\",2,IF(G82=\"بالأقاليم و العمالات التالية\",3,\"\")))","v":2},{"$f":"IF(OR($I$8=7,$I$8=8,$I$8=9),0,F10)","v":2},"VILLES2 (9)",null,{"$f":"IF(G48=\"بمدينة\",1,IF(G48=\"بالأقاليم التالية\",2,IF(G48=\"بالأقاليم و العمالات التالية\",3,\"\")))","v":2},{"$f":"IF(OR($I$8=6,$I$8=7,$I$8=8),0,J10)","v":0}]
[]
[]
[null,"N° :",293]
[]
[]
[]
[]
[]
[null,null,null,null,"الإسم الكامل    :",null,"مراقب",null,"                الصفة              :"]
[]
[null,null,{"$f":"\"\"","v":""},"البحث الوطني حول التشغيل ","موضوع المهمة :",{"$f":"IF(G21=\"بإستعمال السيارة أو الدراجة النارية رقم\",_xlfn.IFNA((VLOOKUP(D19,Tab_affectations1,2,0)),\"لا توجد\"),\"\")","v":""},"بمرافقة السيارات التالية",null,{"$f":"_xlfn.IFNA(IF(VLOOKUP(D19,Tableau1[],4,0)=\"أنثى\",\"             مسموح لها          :\",\"              مسموح له          :\"),\"              مسموح له          :\")","v":"              مسموح له          :"}]
[null,null,null,null,{"$f":"CONCATENATE(\"الخاصة ب :\",_xlfn.IFNA(VLOOKUP(G22,Tab_affectations,2,0),\"لا أحد\"))","v":"الخاصة ب :الحسواني إبراهيم"},null,"38058 - و - 6",{"$f":"IF(G21=\"بمرافقة السيارات التالية\",\"السيارة 1 :  \",\"\")","v":"السيارة 1 :  "}]
[null,null,null,null,{"$f":"CONCATENATE(\"الخاصة ب :\",_xlfn.IFNA(VLOOKUP(G23,Tab_affectations,2,0),\"لا أحد\"))","v":"الخاصة ب :لا أحد"},null,null,{"$f":"IF(G21=\"بمرافقة السيارات التالية\",\"السيارة 2 :  \",\"\")","v":"السيارة 2 :  "}]
[]
[null,null,null,"2021-10-31","                إلى  :",null,"2021-10-01",null,"                المدة         من  :"]
[]
[null,null,null,null,"الرشيدية",{"$f":"IF(K9=1,\":\",IF(K9=2,\"الإقليم 1 :\",IF(K9=3,\"إقلــيم  : \",\"\")))","v":""},"بالأقاليم التالية",null,"               ستجري المهمة :"]
[null,null,null,null,null,"عمالة  :"]
[null,null,null,null,"ميدلت","الإقليم 2 :"]
[null,null,null,null,"تنغير","الإقليم 3 :"]
[null,null,null,null,null,"الإقليم 4 :"]
[]
[]
[]
[]
[]
[null,null,null,null,null,null,"                                  الشخـــص 1 :",null,"                الإسم الكــامل     :"]
[null,null,null,null,null,null,"                                  الشخـــص 2 :"]
[null,null,null,null,null,null,"                                  الشخـــص 3 :"]
[null,null,null,null,null,null,"                                  الشخـــص 4 :"]
{"$rows_left_out":47}
{"sheet":"imprimée","index":1,"n_rows":144,"n_cols":9,"rows_kept":144,"cut":false,"hidden":false,"merged":[[137,3,138,8],[139,3,140,8],[141,3,142,8],[143,3,144,8],[137,1,138,2],[139,1,140,2],[141,1,142,2],[143,1,144,2],[0,0,0,8],[1,0,1,8],[8,0,10,8],[77,0,79,8],[135,3,136,8],[42,0,44,8],[119,0,121,8],[125,1,133,8],[135,1,136,2]]}
["                المملكة المغربية                                                               الرشيديـــة، في :  "]
["     المندوبية السامية للتخطيط"]
[null,null,null,null,null,null,null,null,"المديرية الجهوية لدرعة - تافيلالت"]
[{"$f":"Formulaire!B8","v":0},{"$f":"Formulaire!B9","v":0}]
[null,null,null,null,null,null,null,null,{"$f":"CONCATENATE(\"رقـــــم :    \",Formulaire!$C$13,\"    /2021/ م .ج . د . ت\")","v":"رقـــــم :    293    /2021/ م .ج . د . ت"}]
[]
[]
[]
[{"$f":"IF([1]Saisie!E6=\"ordre_de_mission\",\"أمــر بمهمــــــة\",\"\")","v":"أمــر بمهمــــــة"}]
[]
[]
[]
[]
[]
[]
[null,null,null,null,null,{"$f":"IF(Formulaire!D19=\"\",\" - \",Formulaire!D19)","v":" - "},":",null,"   الاسم الكامـــــل   "]
[]
[null,null,null,null,null,{"$f":"Formulaire!$G$19","v":"مراقب"},":",null,"   الصــفــــة  "]
[]
[null,null,null,null,null,{"$f":"Formulaire!$G$21","v":"بمرافقة السيارات التالية"},":",null,{"$f":"_xlfn.IFNA(IF(VLOOKUP(Formulaire!$D$19,Tableau1[],4,0)=\"أنثى\",\"   مسمـوح لهــا\",\"    مسمـوح لــه\"),\"    مسمـوح لــه\")","v":"    مسمـوح لــه"}]
[null,null,null,null,null,{"$f":"_xlfn.IFNA(CONCATENATE(\"بسياقة \",VLOOKUP(Formulaire!$F$21,Tab_véhicules,2,0),\" رقم \",Formulaire!$F$21,\" من نوع \",VLOOKUP(Formulaire!$F$21,Tab_véhicules,3,0)),\"-\")","v":"-"},":",null,{"$f":"_xlfn.IFNA(IF(VLOOKUP(Formulaire!$D$19,Tableau1[],4,0)=\"أنثى\",\"   مسمـوح لهــا\",\"    مسمـوح لــه\"),\"    مسمـوح لــه\")","v":"    مسمـوح لــه"}]
[null,null,null,null,null,{"$f":"_xlfn.IFNA(CONCATENATE(\"بمرافقة \",VLOOKUP(Formulaire!$G$22,Tab_véhicules,2,0),\" رقم \",Formulaire!$G$22,\" من نوع \",VLOOKUP(Formulaire!$G$22,Tab_véhicules,3,0)),\"-\")","v":"بمرافقة السيارة رقم 38058 - و - 6 من نوع ستروين"},":",null,{"$f":"_xlfn.IFNA(IF(VLOOKUP(Formulaire!$D$19,Tableau1[],4,0)=\"أنثى\",\"     مسموح لهـــا\",\"    مسمـوح لــه \"),\"    مسمـوح لــه \")","v":"    مسمـوح لــه "}]
[null,null,null,null,null,{"$f":"_xlfn.IFNA(CONCATENATE(\"         و \",VLOOKUP(Formulaire!$G$23,Tab_véhicules,2,0),\" رقم \",Formulaire!$G$23,\" من نوع \",VLOOKUP(Formulaire!$G$23,Tab_véhicules,3,0)),\"-\")","v":"-"}]
[]
[null,null,null,null,null,{"$f":"Formulaire!$D$21","v":"البحث الوطني حول التشغيل "},":",null,"   موضوع المهمة "]
[]
[null,null,null,null,null,{"$f":"CONCATENATE(\"من  \",TEXT(Formulaire!G25,\"aaaa/mm/jj\"),\"  إلى  \",IF(Formulaire!$D$25=Formulaire!$G$25,\"يومه\",TEXT(Formulaire!$D$25,\"aaaa/mm/jj\")))","v":"من  2021/10/01  إلى  2021/10/31"},":",null,"   مدة المهمـــة"]
[]
[null,null,null,null,null,null,null,null,{"$f":"CONCATENATE(\"   ستجري المهمة \",Formulaire!G27,\" :  \",IF(Formulaire!E27<>\"\",Formulaire!E27,\"\"),IF(Formulaire!E28<>\"\",CONCATENATE(\" - \",Formulaire!E28),\"\"),IF(Formulaire!E29<>\"\",CONCATENATE(\" - \",Formulaire!E29),\"\"),IF(Formulaire!E30<>\"\",CONCATENATE(\" - \",Formulaire!E30),\"\"),IF(Formulaire!E31<>\"\",CONCATENATE(\" - \",Formulaire!E31),\"\"))","v":"   ستجري المهمة بالأقاليم التالية :  الرشيدية - ميدلت - تنغير"}]
[]
[]
[]
[]
[]
[]
[]
[]
[]
[]
[]
{"$rows_left_out":105}
{"sheet":"Inscription","index":2,"n_rows":41,"n_cols":11,"rows_kept":41,"cut":false,"hidden":false,"merged":[[3,1,3,3],[4,1,4,3],[2,8,2,10],[3,8,3,10],[4,8,4,10],[1,4,5,7],[2,1,2,3]]}
[]
[null,null,null,null,"فضاء التسجيل"]
[null,"Royaume marocaine",null,null,null,null,null,null,"المملكة المغربية"]
[null," Haut commissariat au plan",null,null,null,null,null,null," المندوبية السامية للتخطيط"]
[null,"direction régionale du Drâa-Tafilalet",null,null,null,null,null,null,"المديرية الجهوية لدرعة - تافيلالت"]
[null,null,""]
[]
[{"$f":"CONCATENATE(B8,\" \",C8)","v":"- -"},{"$f":"IF(G15=\"\",\"-\",G15)","v":"-"},{"$f":"IF(E15=\"\",\"-\",E15)","v":"-"},{"$f":"IF(F19=\"\",\"-\",F19)","v":"-"},{"$f":"IF(G17=\"\",\"-\",G17)","v":"-"},{"$f":"IF(E17=\"\",\"-\",E17)","v":"-"},{"$f":"IF(G21=\"\",\"-\",G21)","v":"-"},{"$f":"IF(E21=\"\",\"-\",E21)","v":"-"},{"$f":"IF(G23=\"\",\"-\",G23)","v":"-"},{"$f":"_xlfn.IFNA(VLOOKUP(E8,Tableau2[],2,0),\"\")","v":""},{"$f":"IF(E8=\"\",\"\",IF(E8=\"M\",\"\",IF(LEFT(E8,4)=\"سائق\",\"S\",\"E\")))","v":"E"}]
[null,null,null,null,null,null,null,null,{"$f":"IF(G29=\"\",\"-\",G29)","v":"-"},{"$f":"IF(G27=\"\",\"-\",G27)","v":"-"},{"$f":"IF(E27=\"\",\"-\",E27)","v":"-"}]
[null,null,null,{"$f":"IF(G34=\"\",\"\",IF(G34=\"إضافة صفة جديدة\",\"proffessions\",IF(G34=\"إضافة مدينة\",\"villes\",IF(G34=\"إضافة مهمة جديدة\",\"missions\",\"\"))))","v":"proffessions"},{"$f":"IF(G41=\"\",\"\",G41)","v":""},{"$f":"IF(E41=\"\",\"\",E41)","v":""},{"$f":"IF(G41=\"\",\"\",G41)","v":""},null,{"$f":"IF(E34=\"\",\"\",E34)","v":""},{"$f":"IF(G36=\"\",\"-\",IF(G36=\"موظف\",\"M\",IF(G36=\"أجير\",\"A\",\"\")))","v":"A"},{"$f":"IF(E34=\"\",\"\",E34)","v":""}]
[]
[]
[null,null,null,null,null,null,null,null,{"$f":"_xlfn.IFNA(VLOOKUP(G17,tab_proffessions,2,0),\"\")","v":""}]
[]
[null,null,null,null,null,"              الإسم الشخصي     :",null,null,"                  الإسم العائلي    :"]
[]
[null,null,null,null,null,"             رقم بطاقة التعريف :",null,null,"                  الصفة              :"]
[]
[null,null,null,null,null,null,"                        الجنس     :"]
[]
[null,null,null,null,null,{"$f":"IF(I13=\"A\",\"              نوع الصفقة            :\",\"\")","v":""},null,null,{"$f":"IF($I$13=\"A\",\"                 تابع(ة) لشركة   :\",\"\")","v":""}]
[]
[null,null,null,null,null,null,null,null,{"$f":"IF($I$13=\"A\",\"                رقم الصفقة      :\",\"\")","v":""}]
[]
[]
[]
[null,null,null,null,null,"                            النوع       :",null,null,"                  الصنف            :"]
[]
[null,null,null,null,null,"   مثال : 10000 - و - 6",null,null,"                  رقم التسجيل   :"]
[]
[]
[]
[]
[null,null,null,{"$f":"\"\"","v":""},null,{"$f":"IF($G$34=\"إضافة مدينة\",\"   :        إسم المدينة               \",IF($G$34=\"إضافة صفة جديدة\",\"   :        إسم الصفـــــــة               \",IF($G$34=\"إضافة مهمة جديدة\",\"   :         إسم المهمــة               \",\"\")))","v":"   :        إسم الصفـــــــة               "},"إضافة صفة جديدة",null,"           نوعية الأضافة         :"]
[]
[null,null,null,null,null,null,"أجير",null,{"$f":"IF($G$34=\"إضافة صفة جديدة\",\"           تصنيف الصفة        :    \",\"\")","v":"           تصنيف الصفة        :    "}]
[]
[]
[]
[]
{"$rows_left_out":2}
{"sheet":"contrôle","index":3,"n_rows":12,"n_cols":11,"rows_kept":12,"cut":false,"hidden":false,"merged":[[1,4,5,7],[2,1,2,3],[2,8,2,10],[3,1,3,3],[3,8,3,10],[4,1,4,3],[4,8,4,10]]}
[]
[null,null,null,null,"التحكم"]
[null,"Royaume marocaine",null,null,null,null,null,null,"المملكة المغربية"]
[null," Haut commissariat au plan",null,null,null,null,null,null," المندوبية السامية للتخطيط"]
[null,"direction régionale du Drâa-Tafilalet",null,null,null,null,null,null,"المديرية الجهوية لدرعة - تافيلالت"]
[null,null,""]
[]
[null,null,null,null,null,null,null,null,null,{"$f":"IF(K8=TRUE,1,0)","v":0},false]
[]
[null,null,null,null,null,null,null,null,null,"ملاحضة : قبل الضغظ على أي زر تأكد أن خانة الموافقة مفعلة "]
[]
[null,null,null,null,null,"أنا موافق"]

{"sheet":"Archive","index":4,"n_rows":44,"n_cols":5,"rows_kept":44,"cut":false,"hidden":true,"merged":[]}
[{"$f":"Formulaire!C13","v":293},{"$f":"TODAY()","v":"2021-09-30"},{"$f":"IF(Formulaire!D19<>0,Formulaire!D19,IF(Formulaire!E37<>0,Formulaire!E37,IF(Formulaire!G59<>0,Formulaire!G59,IF(Formulaire!G76<>0,Formulaire!G76,\"\"))))","v":"جلوق المصطفى"},{"$f":"IF(Formulaire!D19<>0,Formulaire!D21,IF(Formulaire!E37<>0,Formulaire!D42,IF(Formulaire!G59<>0,Formulaire!D60,IF(Formulaire!G76<>0,Formulaire!D78,\"\"))))","v":"مهمة إدارية"},{"$f":"IF(Formulaire!D19<>\"\",CONCATENATE(Formulaire!E27,\"\",IF(Formulaire!E28<>\"\",CONCATENATE(\" - \",Formulaire!E28),\"\"),IF(Formulaire!E29<>\"\",CONCATENATE(\" - \",Formulaire!E29),\"\"),IF(Formulaire!E30<>\"\",CONCATENATE(\" - \",Formulaire!E30),\"\"),IF(Formulaire!E31<>\"\",CONCATENATE(\" - \",Formulaire!E31),\"\")),IF(Formulaire!E37<>\"\",CONCATENATE(Formulaire!E48,\"\",IF(Formulaire!E49<>\"\",CONCATENATE(\" - \",Formulaire!E49),\"\"),IF(Formulaire!E50<>\"\",CONCATENATE(\" - \",Formulaire!E50),\"\"),IF(Formulaire!E51<>\"\",CONCATENATE(\" - \",Formulaire!E51),\"\"),IF(Formulaire!E52<>\"\",CONCATENATE(\" - \",Formulaire!E52),\"\")),IF(Formulaire!G58<>\"\",CONCATENATE(Formulaire!E66,\"\",IF(Formulaire!E67<>\"\",CONCATENATE(\" - \",Formulaire!E67),\"\"),IF(Formulaire!E68<>\"\",CONCATENATE(\" - \",Formulaire!E68),\"\"),IF(Formulaire!E69<>\"\",CONCATENATE(\" - \",Formulaire!E69),\"\"),IF(Formulaire!E70<>\"\",CONCATENATE(\" - \",Formulaire!E70),\"\")),IF(Formulaire!G76<>\"\",CONCATENATE(Formulaire!E82,\"\",IF(Formulaire!E83<>\"\",CONCATENATE(\" - \",Formulaire!E83),\"\"),IF(Formulaire!E84<>\"\",CONCATENATE(\" - \",Formulaire!E84),\"\"),IF(Formulaire!E85<>\"\",CONCATENATE(\" - \",Formulaire!E85),\"\"),IF(Formulaire!E86<>\"\",CONCATENATE(\" - \",Formulaire!E86),\"\")),\"-\"))))","v":"الرشيدية"}]
[]
["رقم الترتيبي","التاريخ","الإسم الكامل","موضوع المهمة","المكان"]
[]
[]
[293,"2021-09-30","جلوق المصطفى","مهمة إدارية","الرشيدية"]
[293,"2021-09-30","جلوق المصطفى","مهمة إدارية","الرشيدية"]
[306,"2021-09-30","الرقبة طارق","مهمة إدارية","الرشيدية - الرباط"]
[305,"2021-09-29","قاسمي عبد الرحمان","البحث الوطني حول مؤشر الأسعار عند الإستهلاك","الرشيدية"]
[304,"2021-09-29","بارو محمد","البحث الوطني حول المؤسسات غير الهادفة للربح ","الرشيدية - ميدلت - تنغير"]
[304,"2021-09-29","مغاري سعاد","البحث الوطني حول التشغيل ","الرشيدية - ميدلت - تنغير"]
[303,"2021-09-29","مغاري سعاد","البحث الوطني حول التشغيل ","الرشيدية - ميدلت - تنغير"]
[303,"2021-09-29","جندي عبد العزيز","البحث الوطني حول التشغيل ","الرشيدية - ميدلت - تنغير"]
[302,"2021-09-29","همو زين الدين","البحث الوطني حول التشغيل ","الرشيدية - ميدلت - تنغير"]
[302,"2021-09-29","أهامي خالد","البحث الوطني حول المؤسسات غير الهادفة للربح ","الرشيدية - ميدلت - تنغير"]
[302,"2021-09-29","أهامي خالد","البحث الوطني حول المؤسسات غير الهادفة للربح 2021","الرشيدية - ميدلت - تنغير"]
[301,"2021-09-29","بارو محمد","البحث الوطني حول المؤسسات غير الهادفة للربح 2021","الرشيدية - ميدلت - تنغير"]
[301,"2021-09-29","مغاري سعاد","البحث الوطني حول التشغيل 2021","الرشيدية - ميدلت - تنغير"]
[300,"2021-09-29","همو زين الدين","البحث الوطني حول التشغيل 2021","الرشيدية - ميدلت - تنغير"]
[300,"2021-09-29","جندي عبد العزيز","البحث الوطني حول التشغيل 2021","الرشيدية - ميدلت - تنغير"]
[299,"2021-09-29","حجوج سارة","البحث الوطني حول مؤشر الأسعار عند الإستهلاك","الرشيدية"]
[298,"2021-09-29","أغشي محمد","البحث الوطني حول مؤشر الأسعار عند الإستهلاك","الرشيدية"]
[298,"2021-09-29","","","الرشيدية"]
[297,"2021-09-29","أوسيدي محمد","مهمة إدارية","الرشيدية - ميدلت - تنغير"]
[296,"2021-09-29","والخلف سعيد","مهمة إدارية","الرشيدية"]
[295,"2021-09-29","الحسواني إبراهيم","مهمة إدارية","الرشيدية - ميدلت - تنغير"]
[294,"2021-09-29","بوشام العربي","مهمة إدارية","الرشيدية"]
[293,"2021-09-29","جلوق المصطفى","مهمة إدارية","الرشيدية"]
[292,"2021-09-29","العماري عبد اللطيف","مهمة إدارية","الرشيدية - ميدلت - تنغير"]
[292,"2021-09-29","العماري عبد اللطيف","مهمة إدارية","الرشيدية"]
[291,"2021-09-29","شعبان عسو","مهمة إدارية","الرشيدية"]
[289,"2021-09-24","بوشام العربي","مهمة إدارية","الرشيدية - الرباط"]
[288,"2021-09-24","جبوري أسماء","البحث الوطني حول الظرفية لدى الأسر","الرشيدية - ميدلت"]
[287,"2021-09-24","جلوق المصطفى","مهمة إدارية","الرشيدية - ميدلت"]
[295,"2021-09-24","أغشي محمد","البحث الوطني حول مؤشر الأسعار عند الإستهلاك","الرشيدية"]
[294,"2021-09-24","حجوج سارة","البحث الوطني حول مؤشر الأسعار عند الإستهلاك","الرشيدية"]
[293,"2021-09-24","شعبان عسو","مهمة إدارية","الرشيدية"]
[292,"2021-09-24","أوسيدي محمد","مهمة إدارية","الرشيدية"]
[291,"2021-09-24","والخلف سعيد","مهمة إدارية","الرشيدية"]
[290,"2021-09-24","بوشام العربي","مهمة إدارية","الرشيدية"]
{"$rows_left_out":5}
{"sheet":"les affectations","index":5,"n_rows":15,"n_cols":3,"rows_kept":15,"cut":false,"hidden":true,"merged":[]}
["num","chauffeurs","num1"]
[]
["14262 - و - 6","الرقبة طارق","14262 - و - 6"]
["M 130937","شعبان عسو","M 130937"]
["V 92155","قاسيمي عبد الرحمان","V 92155"]
["62581 - و - 6","جلوق المصطفى","62581 - و - 6"]
["62583 - و - 6","منتصر محمد","62583 - و - 6"]
["62582 - و - 6","العماري عبد اللطيف","62582 - و - 6"]
["62437 - و - 6","بوشام العربي","62437 - و - 6"]
["V 92154","أغشي محمد","V 92154"]
["38247 - و - 6","أمناض عبد الرحمان","38247 - و - 6"]
["38246 - و - 6","ندكزا عبد الرحمان","38246 - و - 6"]
["38058 - و - 6","الحسواني إبراهيم","38058 - و - 6"]
["38057 - و - 6","والخلف سعيد","38057 - و - 6"]
["38056 - و - 6","أوسيدي محمد","38056 - و - 6"]

{"sheet":"les missions","index":6,"n_rows":12,"n_cols":1,"rows_kept":12,"cut":false,"hidden":true,"merged":[]}
["nom"]
[]
["تأثير كوفيد 19 على الأسر (المرحلة الثالثة)"]
["البحث الوطني حول المؤسسات غير الهادفة للربح "]
["البحث الوطني حول التشغيل "]
["البحث الوطني حول الظرفية لدى المقاولات"]
["البحث الوطني حول مؤشر الأسعار عند الإستهلاك"]
["البحث الوطني حول الظرفية لدى الأسر"]
["البحث الوطني حول التشغيل"]
["البحث السنوي حول المقاولات"]
["مهمة إدارية"]
["البحث السنوي لدى المقاولات "]

{"sheet":"les villes","index":7,"n_rows":14,"n_cols":1,"rows_kept":14,"cut":false,"hidden":true,"merged":[]}
["nom"]
[]
["الرباط"]
["زاكورة"]
["ميدلت"]
["ورزازات"]
["تنغير"]
["الرشيدية"]
[]
[]
[]
[]
[]
[""]

{"sheet":"les proffessions","index":8,"n_rows":12,"n_cols":3,"rows_kept":12,"cut":false,"hidden":true,"merged":[]}
["nom","type","nom1"]
[]
["مراقب","M","مراقب"]
["رئيس المصلحة الإقليمية بورزازات","M","رئيس المصلحة الإقليمية بورزازات"]
["مشرفة","M","مشرفة"]
["سائق","M","سائق"]
["مهندس دولة من الدرجة الأولى","M","مهندس دولة من الدرجة الأولى"]
["باحث","M","باحث"]
["باحثة","M","باحثة"]
["باحث أجير","A","باحث أجير"]
["باحثة أجير","A","باحثة أجير"]
["سائق أجير","A","سائق أجير"]

{"sheet":"les véhicules","index":9,"n_rows":18,"n_cols":3,"rows_kept":18,"cut":false,"hidden":true,"merged":[]}
["num","الصنف","النوع"]
[]
["14262 - و - 6","السيارة","داسيا"]
["-","-","-"]
["62581 - و - 6","السيارة","ستروين"]
["62621 - و - 6","السيارة","ستروين"]
["62583 - و - 6","السيارة","ستروين"]
["62582 - و - 6","السيارة","ستروين"]
["62437 - و - 6","السيارة","ستروين"]
["V 92155","الدراجة نارية","KEEWAY"]
["V 92154","الدراجة نارية","KEEWAY"]
["38247 - و - 6","السيارة","بيجو"]
["38246 - و - 6","السيارة","بيجو"]
["38058 - و - 6","السيارة","ستروين"]
["38057 - و - 6","السيارة","ستروين"]
["38056 - و - 6","السيارة","ستروين"]
["M 130937","السيارة","لندروفر"]
["M 130911","السيارة","لندروفر"]

{"sheet":"les personnes","index":10,"n_rows":33,"n_cols":26,"rows_kept":33,"cut":false,"hidden":true,"merged":[]}
["nom","الإسم العائلي","الإسم الشخصي","الجنس","الصفة","رقم بطاقة التعريف الوطنية","تابع لشركة (إسم الشركة)","Colonne1","Colonne2","نوع الصفقة","رقم الصفقة","jj","hh",null,null,null,null,null,null,null,null,null,null,null,null,{"$f":"Formulaire!G19","v":"مراقب"}]
[]
["الرقبة طارق","الرقبة","طارق","ذكر","سائق أجير","GK 114507","3STD","HCP","03/2021/HCP","A","S"]
["قاسيمي عبد الرحمان","قاسيمي","عبد الرحمان","ذكر","باحث أجير","UA 77295","NEGACH","DS","02/2021/DS","A","E"]
["مغاري سعاد","مغاري","سعاد","أنثى","باحثة أجير","U 176092","NEGACH","DS","02/2021/DS","A","E"]
["جبوري أسماء","جبوري","أسماء","أنثى","باحثة أجير","U 184694","NEGACH","DS","02/2021/DS","A","E"]
["بارو محمد","بارو","محمد","ذكر","باحث أجير","U 167413","NEGACH","DS","02/2021/DS","A","E"]
["أيت عليا نادية","أيت عليا","نادية","أنثى","باحثة أجير","P 238939","NEGACH","DS","02/2021/DS","A","E"]
["الوافي حنان","الوافي","حنان","أنثى","باحثة أجير","UA 112464","NEGACH","DS","02/2021/DS","A","E"]
["النايلي مصطفى","النايلي","مصطفى","ذكر","باحث أجير","PB 126080","NEGACH","DS","02/2021/DS","A","E"]
["شعبان عسو","شعبان","عسو","ذكر","سائق أجير","UB 21834","3STD","DRH","11/2018/DRHAG","A","S"]
["منتصر محمد","منتصر","محمد","ذكر","سائق أجير","H 453129","3STD","DS","03/2019/DS","A","S"]
["العماري عبد اللطيف","العماري","عبد اللطيف","ذكر","سائق أجير","U 83324","3STD","DS","03/2019/DS","A","S"]
["جلوق المصطفى","جلوق","المصطفى","ذكر","سائق أجير","UA 28304","3STD","DS","03/2019/DS","A","S"]
["بوشام العربي","بوشام","العربي","ذكر","سائق أجير","U 88051","3STD","DS","03/2019/DS","A","S"]
["أمناض عبد الرحمان","أمناض","عبد الرحمان","ذكر","سائق أجير","P 116826","3STD","DRH","11/2018/DRHAG","A","S"]
["الحسواني إبراهيم","الحسواني","إبراهيم","ذكر","سائق أجير","U 112893","3STD","DRH","11/2018/DRHAG","A","S"]
["والخلف سعيد","والخلف","سعيد","ذكر","سائق أجير","U117911","3STD","DRH","11/2018/DRHAG","A","S"]
["أوسيدي محمد","أوسيدي","محمد","ذكر","سائق أجير","U 137605","3STD","DRH","11/2018/DRHAG","A","S"]
["ندكزا عبد الرحمان","ندكزا","عبد الرحمان","ذكر","سائق","-","-","-","-","M","S"]
["بويزمي ياسر","بويزمي","ياسر","ذكر","مهندس دولة من الدرجة الأولى","-","-","-","-","M","E"]
["برحمة عبد الإله","برحمة","عبد الإله","ذكر","مهندس دولة من الدرجة الأولى","-","-","-","-","M","E"]
["جندي عبد العزيز","جندي","عبد العزيز","ذكر","مراقب","-","-","-","-","M","E"]
["أهامي خالد","أهامي","خالد","ذكر","باحث","-","-","-","-","M","E"]
["أغشي محمد","أغشي","محمد","ذكر","باحث","-","-","-","-","M","E"]
["نباوي زياد","نباوي","زياد","ذكر","مهندس دولة من الدرجة الأولى","-","-","-","-","M","E"]
["همو زين الدين","همو","زين الدين","ذكر","باحث","-","-","-","-","M","E"]
["شعبان علي","شعبان","علي","ذكر","مراقب","-","-","-","-","M","E"]
["زروال خولة","زروال","خولة","أنثى","مشرفة","-","-","-","-","M","E"]
["درفوفي أيوب","درفوفي","أيوب","ذكر","مهندس دولة من الدرجة الأولى","-","-","-","-","M","E"]
["حداد محمد","حداد","محمد","ذكر","رئيس المصلحة الإقليمية بورزازات","-","-","-","-","M","E"]
["حجوج سارة","حجوج","سارة","أنثى","مشرفة","-","-","-","-","M","E"]
["أوجيل مليكة","أوجيل","مليكة","أنثى","باحثة","-","-","-","-","M","E"]

{"sheet":"les personnes1","index":11,"n_rows":11,"n_cols":13,"rows_kept":11,"cut":false,"hidden":true,"merged":[]}
["nom","Colonne2","Colonne3","Colonne4","pro","Colonne6","Colonne7","Colonne8","Colonne9","Colonne10","Colonne11","Colonne12","Colonne13"]
["الرقبة طارق","الرقبة","طارق","ذكر","سائق أجير","GK 114507","3STD","HCP","03/2021/HCP","A","S"]
["شعبان عسو","شعبان","عسو","ذكر","سائق أجير","UB 21834","3STD","DRH","11/2018/DRHAG","A","S"]
["منتصر محمد","منتصر","محمد","ذكر","سائق أجير","H 453129","3STD","DS","03/2019/DS","A","S"]
["العماري عبد اللطيف","العماري","عبد اللطيف","ذكر","سائق أجير","U 83324","3STD","DS","03/2019/DS","A","S"]
["جلوق المصطفى","جلوق","المصطفى","ذكر","سائق أجير","UA 28304","3STD","DS","03/2019/DS","A","S"]
["بوشام العربي","بوشام","العربي","ذكر","سائق أجير","U 88051","3STD","DS","03/2019/DS","A","S"]
["أمناض عبد الرحمان","أمناض","عبد الرحمان","ذكر","سائق أجير","P 116826","3STD","DRH","11/2018/DRHAG","A","S"]
["الحسواني إبراهيم","الحسواني","إبراهيم","ذكر","سائق أجير","U 112893","3STD","DRH","11/2018/DRHAG","A","S"]
["والخلف سعيد","والخلف","سعيد","ذكر","سائق أجير","U117911","3STD","DRH","11/2018/DRHAG","A","S"]
["أوسيدي محمد","أوسيدي","محمد","ذكر","سائق أجير","U 137605","3STD","DRH","11/2018/DRHAG","A","S"]