{"text_format":"1","workbook":"xlsx","n_sheets":21,"sheets":["Joueurs","Points","Poule1","Poule2","Poule3","Poule4","Poule5","Poule6","Class_Poule","Tab_Finale","Tab_Conso","Feuil1","Valeurs","Handicap","Equivalence","TeteSerie","Grille4","Grille5","Grille6","Grille8","JoueursPoule"],"not_rendered":{"charts":0,"images":0,"macros":1,"external_links":0,"defined_names":7,"comments":0,"pivot_tables":0},"unopened":[],"bounds":{"document_bytes":16777216,"sheet_cells":100000,"rows_first":2000,"rows_last":500,"rows_between":2000,"halvings":0,"cell_chars":16384,"cell_head_chars":4096},"cells_cut":0,"cells_raw":0,"read":"whole","date_system":"1900"}

{"sheet":"Joueurs","index":0,"n_rows":72,"n_cols":7,"rows_kept":72,"cut":false,"hidden":false,"merged":[[70,0,70,1],[70,3,70,4]]}
[]
["Nom","Prénom",null,"Class.","Poule","Aléat."]
["BILAS ","CLEMENT",{"$f":"CONCATENATE(A3,\" \",LEFT(B3,1))","v":"BILAS  C"},"B4",4,872,16]
["CAMILLETTI","ADRIEN","CAMILLETTI A","E4",3,650,15]
["CHÂTEAU ","LUC","CHÂTEAU  L","C4",1,861,15]
["CHOISI","VINCENT","CHOISI V","C0",2,5,14]
["DANTHINE","JEAN","DANTHINE J","D4",5,101,13]
["DE VETTOR","MAITE","DE VETTOR M","E4",5,840,13]
["DEFAWE","MICHEL","DEFAWE M","C2",1,61,12]
["DELCOUR","CHRISTIAN","DELCOUR C","C0",1,379,12]
["DELCOUR","MILO","DELCOUR M","E6",2,909,12]
["DELCOUR ","VALENTIN","DELCOUR  V","D4",4,74,11]
["DELPEREE ","LOUIS ","DELPEREE  L","NC",1,95,11]
["DOUIN ","MICHEL","DOUIN  M","C4",4,230,11]
["EL HAMRAOUI","YANIS","EL HAMRAOUI Y","E6",6,450,11]
["FAYS","MAGALI","FAYS M","E4",6,574,11]
["FOCAN","ROBIN","FOCAN R","C4",6,625,11]
["FONTAINE ","FRANCIS","FONTAINE  F","E2",2,102,10]
["FOUARGE ","ALBERT","FOUARGE  A","E4",5,133,10]
["GRISARD","JEAN","GRISARD J","D2",2,199,9]
["HAVELANGE ","ETHAN","HAVELANGE  E","C2",2,785,9]
["HIEL","MARIE LAURENCE","HIEL M","NC",2,579,8]
["HOUBA","BENOIT","HOUBA B","C4",5,26,7]
["IRMAK","YANIS","IRMAK Y","NC",4,316,7]
["JOANNES","ALEXIA","JOANNES A","NC",3,377,7]
["KLEIN ","CAROLE ANNE","KLEIN  C","E4",4,827,7]
["LAMALLE","NOA","LAMALLE N","E4",2,231,5]
["LAMALLE","JEAN","LAMALLE J","E6",3,804,4]
["LAMALLE ","MATHIS","LAMALLE  M","E6",1,224,3]
["LAVALLEE","SIMON ","LAVALLEE S","C4",3,278,3]
["LECLERC ","NOLAN","LECLERC  N","E6",4,316,3]
["LEO","ALESSANDRO","LEO A","E4",4,374,3]
["MAKA ","CHRISTIAN ","MAKA  C","B2",3,620,3]
["MAKA ","MAXENCE","MAKA  M","B4",5,719,3]
["MASSAR","PATRICK","MASSAR P","D0",1,749,3]
["NOEL ","XAVIER","NOEL  X","B6",6,852,3]
["ORSINI ","MATTEO","ORSINI  M","C2",6,875,3]
["PAGNA ","FABRICE","PAGNA  F","C6",5,971,3]
["PIANGIVINO ","SYLVIE ","PIANGIVINO  S","NC",5,973,3]
["PIRARD","PHILIPPE","PIRARD P","D4",3,516,2]
["PITER ","BJORN","PITER  B","E0",1,745,2]
["POLIZZI ","ALESSANDRO","POLIZZI  A","E4",3,762,2]
["RASKIN ","JEREMY","RASKIN  J","D0",3,801,2]
["RENKIN","GAUTHIER","RENKIN G","E4",5,994,2]
["SIMON","TIM","SIMON T","D4",6,20,1]
["SMEET","DIMITRI","SMEET D","E4",1,52,1]
["SMEET ","CLAUDE","SMEET  C","C4",2,229,1]
["TOUSSAINT","ANNE SOPHIE","TOUSSAINT A","NC",6,294,1]
["VANDENBERGH","VINCENT","VANDENBERGH V","E4",6,862,1]
["WIKET ","JEAN MARIE","WIKET  J","C6",4,909,1]
[]
[]
[]
[]
[]
[]
[]
[]
[]
[]
[]
[]
[]
[]
[]
[]
[]
[]
[]
[]
[" ",null,null," "]
[" "," "]

{"sheet":"Points","index":1,"n_rows":49,"n_cols":3,"rows_kept":49,"cut":false,"hidden":false,"merged":[]}
["Nom Joueur","Class.","Points"]
["BILAS  C.","B4",121]
["MAKA  C.","B2",111]
["FOCAN R.","C4",101]
["NOEL  X.","B6",101]
["HOUBA B.","C4",91]
["PAGNA  F.","C6",91]
["SIMON T.","D4",91]
["SMEET D.","E4",91]
["CHÂTEAU  L.","C4",81]
["DELCOUR C.","C0",81]
["DOUIN  M.","C4",81]
["GRISARD J.","D2",81]
["HAVELANGE  E.","C2",81]
["LECLERC  N.","E6",81]
["MAKA  M.","B4",81]
["RASKIN  J.","D0",81]
["DEFAWE M.","C2",71]
["KLEIN  C.","E4",71]
["LAMALLE N.","E4",71]
["LAVALLEE S.","C4",71]
["ORSINI  M.","C2",71]
["PIRARD P.","D4",71]
["RENKIN G.","E4",71]
["SMEET  C.","C4",71]
["WIKET  J.","C6",61]
["DELCOUR  V.","D4",51]
["DE VETTOR M.","E4",41]
["VANDENBERGH V.","E4",41]
["CAMILLETTI A.","E4",31]
["DELPEREE  L.","NC",31]
["LAMALLE  M.","E6",31]
["PITER  B.","E0",31]
["DELCOUR M.","E6",21]
["FAYS M.","E4",21]
["FONTAINE  F.","E2",21]
["FOUARGE  A.","E4",21]
["HIEL M.","NC",21]
["LAMALLE J.","E6",21]
["MASSAR P.","D0",21]
["POLIZZI  A.","E4",21]
["CHOISI V.","C0",11]
["DANTHINE J.","D4",11]
["EL HAMRAOUI Y.","E6",11]
["IRMAK Y.","NC",11]
["JOANNES A.","NC",11]
["LEO A.","E4",11]
["PIANGIVINO  S.","NC",11]
["TOUSSAINT A.","NC",11]

{"sheet":"Poule1","index":2,"n_rows":68,"n_cols":68,"rows_kept":68,"cut":false,"hidden":false,"merged":[[49,7,49,8],[50,7,50,8],[51,7,51,8],[52,7,52,8],[53,7,53,8]]}
[1,null,null,null,null,null,null,null,null,null,null,null,null,null,null,null,null,null,null,null,null,null,null,null,null,null,null,null,null,null,null,null,null,null,null,null,null,null,null,null,null,null,null,null,null,null,null,null,null,null,null,null,null,null,null,null,null,null,null,null,"Saive R.","Iacolino J.","Douin C.","Fissette B.","Galand A.","Neman P.","Larbanois J.","Labasse M."]
[null,"Joueur","Class."]
["Joueur 1","DELCOUR C.","C0"]
["Joueur 2","DEFAWE M.","C2"]
["Joueur 3","CHÂTEAU  L.","C4"]
["Joueur 4","MASSAR P.","D0"]
["Joueur 5","PITER  B.","E0"]
["Joueur 6","SMEET D.","E4"]
["Joueur 7","LAMALLE  M.","E6"]
["Joueur 8","DELPEREE  L.","NC"]
[]
["Match n°","Joueur A","Class.","Joueur B","Class.","Hand.","Set 1","Set 2","Set 3","Score","Arbitre"]
["Match n ° 1A","DELCOUR C.","C0","LAMALLE  M.","E6",6,"11-8","11-8",null,"2-0","DELPEREE  L."]
["Match n ° 2B","DEFAWE M.","C2","DELPEREE  L.","NC",6,"11-8","11-7",null,"2-0","LAMALLE  M."]
["Match n ° 3A","MASSAR P.","D0","SMEET D.","E4",3,"5-11","4-11",null,"0-2","PITER  B."]
["Match n ° 4B","CHÂTEAU  L.","C4","PITER  B.","E0",3,"11-9","11-8",null,"2-0","SMEET D."]
["Match n ° 5A","DELCOUR C.","C0","SMEET D.","E4",5,"11-8","11-7",null,"2-0","CHÂTEAU  L."]
["Match n ° 6B","DEFAWE M.","C2","PITER  B.","E0",4,"11-9","8-11","11-9","2-1","MASSAR P."]
["Match n ° 7A","MASSAR P.","D0","LAMALLE  M.","E6",4,"11-7","11-8",null,"2-0","DEFAWE M."]
["Match n ° 8B","CHÂTEAU  L.","C4","DELPEREE  L.","NC",5,"11-7","11-8",null,"2-0","DELCOUR C."]
["Match n ° 9A","DELCOUR C.","C0","MASSAR P.","D0",2,"9-11","11-7","11-7","2-1","PITER  B."]
["Match n ° 10B","DEFAWE M.","C2","CHÂTEAU  L.","C4",1,"8-11","11-5","7-11","1-2","LAMALLE  M."]
["Match n ° 11A","SMEET D.","E4","LAMALLE  M.","E6",1,"11-7","11-6",null,"2-0","DELPEREE  L."]
["Match n ° 12B","PITER  B.","E0","DELPEREE  L.","NC",2,"10-12","12-10","11-4","2-1","SMEET D."]
[]
[]
[]
[]
[]
[null,"Joueurs","Class.","Victoires","Sets Gagnés","Sets Perdus","Points Gagnés","Points Perdus","Défaites"]
[1,"DELCOUR C.","C0",3,6,1,75,56,0]
[2,"SMEET D.","E4",2,4,2,59,44,1]
[3,"MASSAR P.","D0",1,3,4,56,68,2]
[4,"LAMALLE  M.","E6",0,0,6,44,66,3]
[]
[]
[]
[]
[]
[null,"Joueurs","Class.","Victoires","Sets Gagnés","Sets Perdus","Points Gagnés","Points Perdus","Défaites"]
[1,"CHÂTEAU  L.","C4",3,6,1,71,58,0]
[2,"DEFAWE M.","C2",2,5,3,78,71,1]
[3,"PITER  B.","E0",1,3,5,79,78,2]
[4,"DELPEREE  L.","NC",0,1,6,56,77,3]
[]
[]
[]
[]
[]
["Match n°","Joueur A","Class.","Joueur B","Class.","Hand.","Score","Arbitre"]
["Match n° 1","DELCOUR C.","C0","CHÂTEAU  L.","C4",1,"1-2","SMEET D."]
["Match n° 2","SMEET D.","E4","DEFAWE M.","C2",5,"1-2","MASSAR P."]
["Match n° 3","MASSAR P.","D0","PITER  B.","E0",2,"2-1","LAMALLE  M."]
["Match n° 4","LAMALLE  M.","E6","DELPEREE  L.","NC",1,"1-2","DELCOUR C."]
[]
[]
[]
[]
[]
[null,"Joueurs","Class.","Défaites"]
[1,"CHÂTEAU  L.","C4",0]
[2,"DELCOUR C.","C0",1]
[3,"DEFAWE M.","C2",1]
[4,"SMEET D.","E4",2]
[5,"MASSAR P.","D0",2]
[6,"PITER  B.","E0",3]
[7,"DELPEREE  L.","NC",3]
[8,"LAMALLE  M.","E6",4]

{"sheet":"Poule2","index":3,"n_rows":68,"n_cols":68,"rows_kept":68,"cut":false,"hidden":false,"merged":[[49,7,49,8],[50,7,50,8],[51,7,51,8],[52,7,52,8],[53,7,53,8]]}
[2,null,null,null,null,null,null,null,null,null,null,null,null,null,null,null,null,null,null,null,null,null,null,null,null,null,null,null,null,null,null,null,null,null,null,null,null,null,null,null,null,null,null,null,null,null,null,null,null,null,null,null,null,null,null,null,null,null,null,null,"Saive R.","Iacolino J.","Douin C.","Fissette B.","Galand A.","Neman P.","Larbanois J.","Labasse M."]
[null,"Joueur","Class."]
["Joueur 1","CHOISI V.","C0"]
["Joueur 2","HAVELANGE  E.","C2"]
["Joueur 3","SMEET  C.","C4"]
["Joueur 4","GRISARD J.","D2"]
["Joueur 5","FONTAINE  F.","E2"]
["Joueur 6","LAMALLE N.","E4"]
["Joueur 7","DELCOUR M.","E6"]
["Joueur 8","HIEL M.","NC"]
[]
["Match n°","Joueur A","Class.","Joueur B","Class.","Hand.","Set 1","Set 2","Set 3","Score","Arbitre"]
["Match n ° 1A","CHOISI V.","C0","DELCOUR M.","E6",6,"0-11","0-11",null,"0-2","HIEL M."]
["Match n ° 2B","HAVELANGE  E.","C2","HIEL M.","NC",6,"11-7","12-10",null,"2-0","DELCOUR M."]
["Match n ° 3A","GRISARD J.","D2","LAMALLE N.","E4",3,"11-6","11-7",null,"2-0","FONTAINE  F."]
["Match n ° 4B","SMEET  C.","C4","FONTAINE  F.","E2",4,"11-9","13-11",null,"2-0","LAMALLE N."]
["Match n ° 5A","CHOISI V.","C0","LAMALLE N.","E4",5,"0-11","0-11",null,"0-2","SMEET  C."]
["Match n ° 6B","HAVELANGE  E.","C2","FONTAINE  F.","E2",4,"11-8","11-8",null,"2-0","GRISARD J."]
["Match n ° 7A","GRISARD J.","D2","DELCOUR M.","E6",3,"11-6","9-11","11-5","2-1","HAVELANGE  E."]
["Match n ° 8B","SMEET  C.","C4","HIEL M.","NC",5,"11-9","12-10",null,"2-0","CHOISI V."]
["Match n ° 9A","CHOISI V.","C0","GRISARD J.","D2",3,"0-11","0-11",null,"0-2","FONTAINE  F."]
["Match n ° 10B","HAVELANGE  E.","C2","SMEET  C.","C4",1,"11-8","5-11","11-7","2-1","DELCOUR M."]
["Match n ° 11A","LAMALLE N.","E4","DELCOUR M.","E6",1,"11-5","11-6",null,"2-0","HIEL M."]
["Match n ° 12B","FONTAINE  F.","E2","HIEL M.","NC",2,"5-11","11-6","11-6","2-1","LAMALLE N."]
[]
[]
[]
[]
[]
[null,"Joueurs","Class.","Victoires","Sets Gagnés","Sets Perdus","Points Gagnés","Points Perdus","Défaites"]
[1,"GRISARD J.","D2",3,6,1,75,35,0]
[2,"LAMALLE N.","E4",2,4,2,57,33,1]
[3,"DELCOUR M.","E6",1,3,4,55,53,2]
[4,"CHOISI V.","C0",0,0,6,0,66,3]
[]
[]
[]
[]
[]
[null,"Joueurs","Class.","Victoires","Sets Gagnés","Sets Perdus","Points Gagnés","Points Perdus","Défaites"]
[1,"HAVELANGE  E.","C2",3,6,1,72,59,0]
[2,"SMEET  C.","C4",2,5,2,73,66,1]
[3,"FONTAINE  F.","E2",1,2,5,63,69,2]
[4,"HIEL M.","NC",0,1,6,59,73,3]
[]
[]
[]
[]
[]
["Match n°","Joueur A","Class.","Joueur B","Class.","Hand.","Score","Arbitre"]
["Match n° 1","GRISARD J.","D2","HAVELANGE  E.","C2",2,"0-2","LAMALLE N."]
["Match n° 2","LAMALLE N.","E4","SMEET  C.","C4",4,"0-2","DELCOUR M."]
["Match n° 3","DELCOUR M.","E6","FONTAINE  F.","E2",1,"1-2","CHOISI V."]
["Match n° 4","CHOISI V.","C0","HIEL M.","NC",6,"0-2","GRISARD J."]
[]
[]
[]
[]
[]
[null,"Joueurs","Class.","Défaites"]
[1,"HAVELANGE  E.","C2",0]
[2,"GRISARD J.","D2",1]
[3,"SMEET  C.","C4",1]
[4,"LAMALLE N.","E4",2]
[5,"FONTAINE  F.","E2",2]
[6,"DELCOUR M.","E6",3]
[7,"HIEL M.","NC",3]
[8,"CHOISI V.","C0",4]

{"sheet":"Poule3","index":4,"n_rows":82,"n_cols":68,"rows_kept":82,"cut":false,"hidden":false,"merged":[[49,7,49,8],[50,7,50,8],[51,7,51,8],[52,7,52,8],[53,7,53,8]]}
[3,null,null,null,null,null,null,null,null,null,null,null,null,null,null,null,null,null,null,null,null,null,null,null,null,null,null,null,null,null,null,null,null,null,null,null,null,null,null,null,null,null,null,null,null,null,null,null,null,null,null,null,null,null,null,null,null,null,null,null,"Saive R.","Iacolino J.","Douin C.","Fissette B.","Galand A.","Neman P.","Larbanois J.","Labasse M."]
[null,"Joueur","Class."]
["Joueur 1","MAKA  C.","B2"]
["Joueur 2","LAVALLEE S.","C4"]
["Joueur 3","RASKIN  J.","D0"]
["Joueur 4","PIRARD P.","D4"]
["Joueur 5","POLIZZI  A.","E4"]
["Joueur 6","CAMILLETTI A.","E4"]
["Joueur 7","LAMALLE J.","E6"]
["Joueur 8","JOANNES A.","NC"]
[]
["Match n°","Joueur A","Class.","Joueur B","Class.","Hand.","Set 1","Set 2","Set 3","Score","Arbitre"]
["Match n ° 1A","MAKA  C.","B2","LAMALLE J.","E6",7,"11-7","11-9",null,"2-0","JOANNES A."]
["Match n ° 2B","LAVALLEE S.","C4","JOANNES A.","NC",5,"11-8","11-9",null,"2-0","LAMALLE J."]
["Match n ° 3A","PIRARD P.","D4","CAMILLETTI A.","E4",2,"11-5","8-11","11-9","2-1","POLIZZI  A."]
["Match n ° 4B","RASKIN  J.","D0","POLIZZI  A.","E4",3,"11-9","12-10",null,"2-0","CAMILLETTI A."]
["Match n ° 5A","MAKA  C.","B2","CAMILLETTI A.","E4",7,"9-11","9-11",null,"0-2","RASKIN  J."]
["Match n ° 6B","LAVALLEE S.","C4","POLIZZI  A.","E4",4,"11-6","11-6",null,"2-0","PIRARD P."]
["Match n ° 7A","PIRARD P.","D4","LAMALLE J.","E6",3,"12-10","9-11","11-5","2-1","LAVALLEE S."]
["Match n ° 8B","RASKIN  J.","D0","JOANNES A.","NC",4,"11-7","12-10",null,"2-0","MAKA  C."]
["Match n ° 9A","MAKA  C.","B2","PIRARD P.","D4",5,"12-10","11-8",null,"2-0","POLIZZI  A."]
["Match n ° 10B","LAVALLEE S.","C4","RASKIN  J.","D0",1,"11-9","4-11","9-11","1-2","LAMALLE J."]
["Match n ° 11A","CAMILLETTI A.","E4","LAMALLE J.","E6",1,"3-11","10-12",null,"0-2","JOANNES A."]
["Match n ° 12B","POLIZZI  A.","E4","JOANNES A.","NC",1,"11-7","11-6",null,"2-0","CAMILLETTI A."]
[]
[]
[]
[]
[]
[null,"Joueurs","Class.","Victoires","Sets Gagnés","Sets Perdus","Points Gagnés","Points Perdus","Défaites"]
[1,"MAKA  C.","B2",2,4,2,63,56,1]
[2,"PIRARD P.","D4",2,4,4,80,74,1]
[3,"LAMALLE J.","E6",1,3,4,65,67,2]
[4,"CAMILLETTI A.","E4",1,3,4,60,71,2]
[]
[]
[]
[]
[]
[null,"Joueurs","Class.","Victoires","Sets Gagnés","Sets Perdus","Points Gagnés","Points Perdus","Défaites"]
[1,"RASKIN  J.","D0",3,6,1,77,60,0]
[2,"LAVALLEE S.","C4",2,5,2,68,60,1]
[3,"POLIZZI  A.","E4",1,2,4,53,58,2]
[4,"JOANNES A.","NC",0,0,6,47,67,3]
[]
[]
[]
[]
[]
["Match n°","Joueur A","Class.","Joueur B","Class.","Hand.","Score","Arbitre"]
["Match n° 1","MAKA  C.","B2","RASKIN  J.","D0",4,"2-0","PIRARD P."]
["Match n° 2","PIRARD P.","D4","LAVALLEE S.","C4",2,"0-2","LAMALLE J."]
["Match n° 3","LAMALLE J.","E6","POLIZZI  A.","E4",1,"0-2","CAMILLETTI A."]
["Match n° 4","CAMILLETTI A.","E4","JOANNES A.","NC",1,"2-0","MAKA  C."]
[]
[]
[]
[]
[]
[null,"Joueurs","Class.","Défaites"]
[1,"MAKA  C.","B2",1]
[2,"RASKIN  J.","D0",1]
[3,"LAVALLEE S.","C4",1]
[4,"PIRARD P.","D4",2]
[5,"POLIZZI  A.","E4",2]
[6,"LAMALLE J.","E6",3]
[7,"CAMILLETTI A.","E4",2]
[8,"JOANNES A.","NC",4]
[]
[]
[1,"MAKA  C.","B2",1,2,0,23,18,0,2,5]
[2,"PIRARD P.","D4",0,0,2,18,23,1,-2,-5]
[]
[]
[]
[]
[]
[]
[]
[]
[3,"LAMALLE J.","E6",1,2,0,23,13,0,2,10]
[4,"CAMILLETTI A.","E4",0,0,2,13,23,1,-2,-10]

{"sheet":"Poule4","index":5,"n_rows":73,"n_cols":68,"rows_kept":73,"cut":false,"hidden":false,"merged":[[49,7,49,8],[50,7,50,8],[51,7,51,8],[52,7,52,8],[53,7,53,8]]}
[4,null,null,null,null,null,null,null,null,null,null,null,null,null,null,null,null,null,null,null,null,null,null,null,null,null,null,null,null,null,null,null,null,null,null,null,null,null,null,null,null,null,null,null,null,null,null,null,null,null,null,null,null,null,null,null,null,null,null,null,"Saive R.","Iacolino J.","Douin C.","Fissette B.","Galand A.","Neman P.","Larbanois J.","Labasse M."]
[null,"Joueur","Class."]
["Joueur 1","BILAS  C.","B4"]
["Joueur 2","DOUIN  M.","C4"]
["Joueur 3","WIKET  J.","C6"]
["Joueur 4","DELCOUR  V.","D4"]
["Joueur 5","KLEIN  C.","E4"]
["Joueur 6","LEO A.","E4"]
["Joueur 7","LECLERC  N.","E6"]
["Joueur 8","IRMAK Y.","NC"]
[]
["Match n°","Joueur A","Class.","Joueur B","Class.","Hand.","Set 1","Set 2","Set 3","Score","Arbitre"]
["Match n ° 1A","BILAS  C.","B4","LECLERC  N.","E6",7,"11-8","11-9",null,"2-0","IRMAK Y."]
["Match n ° 2B","DOUIN  M.","C4","IRMAK Y.","NC",5,"11-0","11-0",null,"2-0","LECLERC  N."]
["Match n ° 3A","DELCOUR  V.","D4","LEO A.","E4",2,"11-0","11-0",null,"2-0","KLEIN  C."]
["Match n ° 4B","WIKET  J.","C6","KLEIN  C.","E4",4,"9-11","9-11",null,"0-2","LEO A."]
["Match n ° 5A","BILAS  C.","B4","LEO A.","E4",6,"11-0","11-0",null,"2-0","WIKET  J."]
["Match n ° 6B","DOUIN  M.","C4","KLEIN  C.","E4",4,"9-11","11-9","19-17","2-1","DELCOUR  V."]
["Match n ° 7A","DELCOUR  V.","D4","LECLERC  N.","E6",3,"6-11","10-12",null,"0-2","DOUIN  M."]
["Match n ° 8B","WIKET  J.","C6","IRMAK Y.","NC",5,"11-0","11-0",null,"2-0","BILAS  C."]
["Match n ° 9A","BILAS  C.","B4","DELCOUR  V.","D4",4,"6-11","11-9","10-12","1-2","KLEIN  C."]
["Match n ° 10B","DOUIN  M.","C4","WIKET  J.","C6",1,"11-8","11-8",null,"2-0","LECLERC  N."]
["Match n ° 11A","LEO A.","E4","LECLERC  N.","E6",1,"0-11","0-11",null,"0-2","IRMAK Y."]
["Match n ° 12B","KLEIN  C.","E4","IRMAK Y.","NC",1,"11-0","11-0",null,"2-0","LEO A."]
[]
[]
[]
[]
[]
[null,"Joueurs","Class.","Victoires","Sets Gagnés","Sets Perdus","Points Gagnés","Points Perdus","Défaites"]
[1,"BILAS  C.","B4",2,5,2,71,49,1]
[2,"LECLERC  N.","E6",2,4,2,62,38,1]
[3,"DELCOUR  V.","D4",2,4,3,70,50,1]
[4,"LEO A.","E4",0,0,6,0,66,3]
[]
[]
[]
[]
[]
[null,"Joueurs","Class.","Victoires","Sets Gagnés","Sets Perdus","Points Gagnés","Points Perdus","Défaites"]
[1,"DOUIN  M.","C4",3,6,1,83,53,0]
[2,"KLEIN  C.","E4",2,5,2,81,57,1]
[3,"WIKET  J.","C6",1,2,4,56,44,2]
[4,"IRMAK Y.","NC",0,0,6,0,66,3]
[]
[]
[]
[]
[]
["Match n°","Joueur A","Class.","Joueur B","Class.","Hand.","Score","Arbitre"]
["Match n° 1","BILAS  C.","B4","DOUIN  M.","C4",2,"2-0","LECLERC  N."]
["Match n° 2","LECLERC  N.","E6","KLEIN  C.","E4",1,"2-0","DELCOUR  V."]
["Match n° 3","DELCOUR  V.","D4","WIKET  J.","C6",2,"0-2","LEO A."]
["Match n° 4","LEO A.","E4","IRMAK Y.","NC",1,"2-0","BILAS  C."]
[]
[]
[]
[]
[]
[null,"Joueurs","Class.","Défaites"]
[1,"BILAS  C.","B4",1]
[2,"DOUIN  M.","C4",1]
[3,"LECLERC  N.","E6",1]
[4,"KLEIN  C.","E4",2]
[5,"WIKET  J.","C6",2]
[6,"DELCOUR  V.","D4",2]
[7,"LEO A.","E4",3]
[8,"IRMAK Y.","NC",4]
[]
[]
[1,"BILAS  C.","B4",1,3,2,49,49,1,1,0]
[2,"LECLERC  N.","E6",1,2,2,40,38,1,0,2]
[3,"DELCOUR  V.","D4",1,2,3,48,50,1,-1,-2]

{"sheet":"Poule5","index":6,"n_rows":68,"n_cols":68,"rows_kept":68,"cut":false,"hidden":false,"merged":[[49,7,49,8],[50,7,50,8],[51,7,51,8],[52,7,52,8],[53,7,53,8]]}
[5,null,null,null,null,null,null,null,null,null,null,null,null,null,null,null,null,null,null,null,null,null,null,null,null,null,null,null,null,null,null,null,null,null,null,null,null,null,null,null,null,null,null,null,null,null,null,null,null,null,null,null,null,null,null,null,null,null,null,null,"Saive R.","Iacolino J.","Douin C.","Fissette B.","Galand A.","Neman P.","Larbanois J.","Labasse M."]
[null,"Joueur","Class."]
["Joueur 1","MAKA  M.","B4"]
["Joueur 2","HOUBA B.","C4"]
["Joueur 3","PAGNA  F.","C6"]
["Joueur 4","DANTHINE J.","D4"]
["Joueur 5","DE VETTOR M.","E4"]
["Joueur 6","FOUARGE  A.","E4"]
["Joueur 7","RENKIN G.","E4"]
["Joueur 8","PIANGIVINO  S.","NC"]
[]
["Match n°","Joueur A","Class.","Joueur B","Class.","Hand.","Set 1","Set 2","Set 3","Score","Arbitre"]
["Match n ° 1A","MAKA  M.","B4","RENKIN G.","E4",6,"11-6","6-11","11-9","2-1","PIANGIVINO  S."]
["Match n ° 2B","HOUBA B.","C4","PIANGIVINO  S.","NC",5,"11-6","11-7",null,"2-0","RENKIN G."]
["Match n ° 3A","DANTHINE J.","D4","FOUARGE  A.","E4",2,"5-11","5-11",null,"0-2","DE VETTOR M."]
["Match n ° 4B","PAGNA  F.","C6","DE VETTOR M.","E4",4,"11-6","11-6",null,"2-0","FOUARGE  A."]
["Match n ° 5A","MAKA  M.","B4","FOUARGE  A.","E4",6,"11-7","7-11","11-8","2-1","PAGNA  F."]
["Match n ° 6B","HOUBA B.","C4","DE VETTOR M.","E4",4,"11-7","11-7",null,"2-0","DANTHINE J."]
["Match n ° 7A","DANTHINE J.","D4","RENKIN G.","E4",2,"0-11","0-11",null,"0-2","HOUBA B."]
["Match n ° 8B","PAGNA  F.","C6","PIANGIVINO  S.","NC",5,"9-11","11-8","11-9","2-1","MAKA  M."]
["Match n ° 9A","MAKA  M.","B4","DANTHINE J.","D4",4,"11-0","11-0",null,"2-0","DE VETTOR M."]
["Match n ° 10B","HOUBA B.","C4","PAGNA  F.","C6",1,"11-8","11-6",null,"2-0","RENKIN G."]
["Match n ° 11A","FOUARGE  A.","E4","RENKIN G.","E4",1,"7-11","19-21",null,"0-2","PIANGIVINO  S."]
["Match n ° 12B","DE VETTOR M.","E4","PIANGIVINO  S.","NC",1,"11-6","11-7",null,"2-0","FOUARGE  A."]
[]
[]
[]
[]
[]
[null,"Joueurs","Class.","Victoires","Sets Gagnés","Sets Perdus","Points Gagnés","Points Perdus","Défaites"]
[1,"MAKA  M.","B4",3,6,2,79,52,0]
[2,"RENKIN G.","E4",2,5,2,80,54,1]
[3,"FOUARGE  A.","E4",1,3,4,74,71,2]
[4,"DANTHINE J.","D4",0,0,6,10,66,3]
[]
[]
[]
[]
[]
[null,"Joueurs","Class.","Victoires","Sets Gagnés","Sets Perdus","Points Gagnés","Points Perdus","Défaites"]
[1,"HOUBA B.","C4",3,6,0,66,41,0]
[2,"PAGNA  F.","C6",2,4,3,67,62,1]
[3,"DE VETTOR M.","E4",1,2,4,48,57,2]
[4,"PIANGIVINO  S.","NC",0,1,6,54,75,3]
[]
[]
[]
[]
[]
["Match n°","Joueur A","Class.","Joueur B","Class.","Hand.","Score","Arbitre"]
["Match n° 1","MAKA  M.","B4","HOUBA B.","C4",2,"2-1","RENKIN G."]
["Match n° 2","RENKIN G.","E4","PAGNA  F.","C6",4,"1-2","FOUARGE  A."]
["Match n° 3","FOUARGE  A.","E4","DE VETTOR M.","E4",1,"0-2","DANTHINE J."]
["Match n° 4","DANTHINE J.","D4","PIANGIVINO  S.","NC",3,"0-2","MAKA  M."]
[]
[]
[]
[]
[]
[null,"Joueurs","Class.","Défaites"]
[1,"MAKA  M.","B4",0]
[2,"HOUBA B.","C4",1]
[3,"PAGNA  F.","C6",1]
[4,"RENKIN G.","E4",2]
[5,"DE VETTOR M.","E4",2]
[6,"FOUARGE  A.","E4",3]
[7,"PIANGIVINO  S.","NC",3]
[8,"DANTHINE J.","D4",4]

{"sheet":"Poule6","index":7,"n_rows":68,"n_cols":68,"rows_kept":68,"cut":false,"hidden":false,"merged":[[49,7,49,8],[50,7,50,8],[51,7,51,8],[52,7,52,8],[53,7,53,8]]}
[6,null,null,null,null,null,null,null,null,null,null,null,null,null,null,null,null,null,null,null,null,null,null,null,null,null,null,null,null,null,null,null,null,null,null,null,null,null,null,null,null,null,null,null,null,null,null,null,null,null,null,null,null,null,null,null,null,null,null,null,"Saive R.","Iacolino J.","Douin C.","Fissette B.","Galand A.","Neman P.","Larbanois J.","Labasse M."]
[null,"Joueur","Class."]
["Joueur 1","NOEL  X.","B6"]
["Joueur 2","ORSINI  M.","C2"]
["Joueur 3","FOCAN R.","C4"]
["Joueur 4","SIMON T.","D4"]
["Joueur 5","FAYS M.","E4"]
["Joueur 6","VANDENBERGH V.","E4"]
["Joueur 7","EL HAMRAOUI Y.","E6"]
["Joueur 8","TOUSSAINT A.","NC"]
[]
["Match n°","Joueur A","Class.","Joueur B","Class.","Hand.","Set 1","Set 2","Set 3","Score","Arbitre"]
["Match n ° 1A","NOEL  X.","B6","EL HAMRAOUI Y.","E6",6,"11-6","12-10",null,"2-0","TOUSSAINT A."]
["Match n ° 2B","ORSINI  M.","C2","TOUSSAINT A.","NC",6,"11-7","11-8",null,"2-0","EL HAMRAOUI Y."]
["Match n ° 3A","SIMON T.","D4","VANDENBERGH V.","E4",2,"3-11","13-11","11-9","2-1","FAYS M."]
["Match n ° 4B","FOCAN R.","C4","FAYS M.","E4",4,"11-7","11-6",null,"2-0","VANDENBERGH V."]
["Match n ° 5A","NOEL  X.","B6","VANDENBERGH V.","E4",6,"13-11","11-7",null,"2-0","FOCAN R."]
["Match n ° 6B","ORSINI  M.","C2","FAYS M.","E4",5,"15-13","11-13","11-9","2-1","SIMON T."]
["Match n ° 7A","SIMON T.","D4","EL HAMRAOUI Y.","E6",3,"11-8","9-11","12-10","2-1","ORSINI  M."]
["Match n ° 8B","FOCAN R.","C4","TOUSSAINT A.","NC",5,"11-7","11-7",null,"2-0","NOEL  X."]
["Match n ° 9A","NOEL  X.","B6","SIMON T.","D4",4,"11-7","11-9",null,"2-0","FAYS M."]
["Match n ° 10B","ORSINI  M.","C2","FOCAN R.","C4",1,"9-11","6-11",null,"0-2","EL HAMRAOUI Y."]
["Match n ° 11A","VANDENBERGH V.","E4","EL HAMRAOUI Y.","E6",1,"11-6","11-4",null,"2-0","TOUSSAINT A."]
["Match n ° 12B","FAYS M.","E4","TOUSSAINT A.","NC",1,"11-3","7-11","11-4","2-1","VANDENBERGH V."]
[]
[]
[]
[]
[]
[null,"Joueurs","Class.","Victoires","Sets Gagnés","Sets Perdus","Points Gagnés","Points Perdus","Défaites"]
[1,"NOEL  X.","B6",3,6,0,69,50,0]
[2,"SIMON T.","D4",2,4,4,75,82,1]
[3,"VANDENBERGH V.","E4",1,3,4,71,61,2]
[4,"EL HAMRAOUI Y.","E6",0,1,6,55,77,3]
[]
[]
[]
[]
[]
[null,"Joueurs","Class.","Victoires","Sets Gagnés","Sets Perdus","Points Gagnés","Points Perdus","Défaites"]
[1,"FOCAN R.","C4",3,6,0,66,42,0]
[2,"ORSINI  M.","C2",2,4,3,74,72,1]
[3,"FAYS M.","E4",1,3,5,77,77,2]
[4,"TOUSSAINT A.","NC",0,1,6,47,73,3]
[]
[]
[]
[]
[]
["Match n°","Joueur A","Class.","Joueur B","Class.","Hand.","Score","Arbitre"]
["Match n° 1","NOEL  X.","B6","FOCAN R.","C4",2,"2-1","SIMON T."]
["Match n° 2","SIMON T.","D4","ORSINI  M.","C2",3,"2-1","VANDENBERGH V."]
["Match n° 3","VANDENBERGH V.","E4","FAYS M.","E4",1,"2-1","EL HAMRAOUI Y."]
["Match n° 4","EL HAMRAOUI Y.","E6","TOUSSAINT A.","NC",1,"2-0","NOEL  X."]
[]
[]
[]
[]
[]
[null,"Joueurs","Class.","Défaites"]
[1,"NOEL  X.","B6",0]
[2,"FOCAN R.","C4",1]
[3,"SIMON T.","D4",1]
[4,"ORSINI  M.","C2",2]
[5,"VANDENBERGH V.","E4",2]
[6,"FAYS M.","E4",3]
[7,"EL HAMRAOUI Y.","E6",3]
[8,"TOUSSAINT A.","NC",4]

{"sheet":"Class_Poule","index":8,"n_rows":86,"n_cols":12,"rows_kept":86,"cut":false,"hidden":false,"merged":[]}
[]
[]
[]
[]
[]
[]
[]
[null,null,null,null,null,null,"Finale",null,null,null,"Consolation"]
[]
[]
["MAKA  M.","B4",0,5,null,1,"MAKA  M.","B4",null,1,"WIKET  J.","C6"]
["NOEL  X.","B6",0,6,null,2,"NOEL  X.","B6",null,2,"MASSAR P.","D0"]
["HAVELANGE  E.","C2",0,2,null,3,"HAVELANGE  E.","C2",null,3,"FONTAINE  F.","E2"]
["CHÂTEAU  L.","C4",0,1,null,4,"CHÂTEAU  L.","C4",null,4,"POLIZZI  A.","E4"]
["MAKA  C.","B2",1,3,null,5,"MAKA  C.","B2",null,5,"DE VETTOR M.","E4"]
["BILAS  C.","B4",1,4,null,6,"BILAS  C.","B4",null,6,"VANDENBERGH V.","E4"]
[null,null,null,null,null,7,"DELCOUR C.","C0",null,7,"DELCOUR  V.","D4"]
[null,null,null,null,null,8,"DOUIN  M.","C4",null,8,"PITER  B.","E0"]
[null,null,null,null,null,9,"FOCAN R.","C4",null,9,"FAYS M.","E4"]
[null,null,null,null,null,10,"HOUBA B.","C4",null,10,"FOUARGE  A.","E4"]
["DELCOUR C.","C0",1,1,null,11,"RASKIN  J.","D0",null,11,"LAMALLE J.","E6"]
["DOUIN  M.","C4",1,4,null,12,"GRISARD J.","D2",null,12,"DELCOUR M.","E6"]
["HOUBA B.","C4",1,5,null,13,"PAGNA  F.","C6",null,13,"LEO A.","E4"]
["FOCAN R.","C4",1,6,null,14,"DEFAWE M.","C2",null,14,"DELPEREE  L.","NC"]
["RASKIN  J.","D0",1,3,null,15,"SMEET  C.","C4",null,15,"CAMILLETTI A.","E4"]
["GRISARD J.","D2",1,2,null,16,"LAVALLEE S.","C4",null,16,"HIEL M.","NC"]
[null,null,null,null,null,17,"SMEET D.","E4",null,17,"PIANGIVINO  S.","NC"]
[null,null,null,null,null,18,"LECLERC  N.","E6",null,18,"EL HAMRAOUI Y.","E6"]
[null,null,null,null,null,19,"SIMON T.","D4",null,19,"DANTHINE J.","D4"]
[null,null,null,null,null,20,"ORSINI  M.","C2",null,20,"LAMALLE  M.","E6"]
["DEFAWE M.","C2",1,1,null,21,"KLEIN  C.","E4",null,21,"TOUSSAINT A.","NC"]
["SMEET  C.","C4",1,2,null,22,"RENKIN G.","E4",null,22,"IRMAK Y.","NC"]
["LAVALLEE S.","C4",1,3,null,23,"PIRARD P.","D4",null,23,"CHOISI V.","C0"]
["PAGNA  F.","C6",1,5,null,24,"LAMALLE N.","E4",null,24,"JOANNES A.","NC"]
["SIMON T.","D4",1,6,null,25,null,null,null,25]
["LECLERC  N.","E6",1,4,null,26,null,null,null,26]
[null,null,null,null,null,27,null,null,null,27]
[null,null,null,null,null,28,null,null,null,28]
[null,null,null,null,null,29,null,null,null,29]
[null,null,null,null,null,30,null,null,null,30]
["ORSINI  M.","C2",2,6,null,31,null,null,null,31]
["PIRARD P.","D4",2,3,null,32,null,null,null,32]
["SMEET D.","E4",2,1]
["LAMALLE N.","E4",2,2]
["KLEIN  C.","E4",2,4]
["RENKIN G.","E4",2,5]
[]
[]
[]
[]
["WIKET  J.","C6",2,4]
["MASSAR P.","D0",2,1]
["FONTAINE  F.","E2",2,2]
["POLIZZI  A.","E4",2,3]
["DE VETTOR M.","E4",2,5]
["VANDENBERGH V.","E4",2,6]
[]
[]
[]
[]
["DELCOUR  V.","D4",2,4]
["PITER  B.","E0",3,1]
["FOUARGE  A.","E4",3,5]
["FAYS M.","E4",3,6]
["DELCOUR M.","E6",3,2]
["LAMALLE J.","E6",3,3]
[]
[]
[]
[]
["CAMILLETTI A.","E4",2,3]
["LEO A.","E4",3,4]
["EL HAMRAOUI Y.","E6",3,6]
["DELPEREE  L.","NC",3,1]
["HIEL M.","NC",3,2]
["PIANGIVINO  S.","NC",3,5]
[]
[]
[]
[]
["CHOISI V.","C0",4,2]
["DANTHINE J.","D4",4,5]
["LAMALLE  M.","E6",4,1]
["JOANNES A.","NC",4,3]
["IRMAK Y.","NC",4,4]
["TOUSSAINT A.","NC",4,6]

{"sheet":"Tab_Finale","index":9,"n_rows":83,"n_cols":19,"rows_kept":83,"cut":false,"hidden":false,"merged":[[55,13,55,14]]}
[]
[]
[1,"MAKA  M.","B4",null,null,null,null,null,null,null,null,null,null,null,null,null,null,null,"MAKA  M."]
[null,null,null,null,"MAKA  M.","B4",null,null,null,null,null,null,null,null,null,null,null,null,""]
[32,null,null,null,null,null,null,null,null,null,null,null,null,null,null,null,null,null,{"$f":"B7","v":"SMEET D."}]
[null,null,null,null,"0-2",6,null,"SMEET D.","E4",null,null,null,null,null,null,null,null,null,{"$f":"B9","v":"LAVALLEE S."}]
[17,"SMEET D.","E4",null,null,null,null,null,null,null,null,null,null,null,null,null,null,null,{"$f":"B11","v":"FOCAN R."}]
[null,"2-0",4,null,"SMEET D.","E4",null,null,null,null,null,null,null,null,null,null,null,null,{"$f":"B13","v":"LAMALLE N."}]
[16,"LAVALLEE S.","C4",null,null,null,null,null,null,null,null,null,null,null,null,null,null,null,{"$f":"B15","v":0}]
[null,null,null,null,null,null,null,"1-2",4,null,"FOCAN R.","C4",null,null,null,null,null,null,{"$f":"B17","v":"DOUIN  M."}]
[9,"FOCAN R.","C4",null,null,null,null,null,null,null,null,null,null,null,null,null,null,null,{"$f":"B19","v":"MAKA  C."}]
[null,"2-0",4,null,"FOCAN R.","C4",null,null,null,null,null,null,null,null,null,null,null,null,{"$f":"B21","v":0}]
[24,"LAMALLE N.","E4",null,null,null,null,null,null,null,null,null,null,null,null,null,null,null,{"$f":"B23","v":"KLEIN  C."}]
[null,null,null,null,"2-0",0,null,"FOCAN R.","C4",null,null,null,null,null,null,null,null,null,{"$f":"B25","v":"GRISARD J."}]
[25,null,null,null,null,null,null,null,null,null,null,null,null,null,null,null,null,null,{"$f":"B27","v":"PAGNA  F."}]
[null,null,null,null,"DOUIN  M.","C4",null,null,null,null,null,null,null,null,null,null,null,null,{"$f":"B29","v":"ORSINI  M."}]
[8,"DOUIN  M.","C4",null,null,null,null,null,null,null,null,null,null,null,null,null,null,null,{"$f":"B31","v":0}]
[null,null,null,null,null,null,null,null,null,null,"0-3",3,null,"MAKA  C.","B2",null,null,null,{"$f":"B33","v":"CHÂTEAU  L."}]
[5,"MAKA  C.","B2",null,null,null,null,null,null,null,null,null,null,null,null,null,null,null,{"$f":"B35","v":"HAVELANGE  E."}]
[null,null,null,null,"MAKA  C.","B2",null,null,null,null,null,null,null,null,null,null,null,null,{"$f":"B37","v":0}]
[28,null,null,null,null,null,null,null,null,null,null,null,null,null,null,null,null,null,{"$f":"B39","v":"SIMON T."}]
[null,null,null,null,"2-1",4,null,"MAKA  C.","B2",null,null,null,null,null,null,null,null,null,{"$f":"B41","v":"DEFAWE M."}]
[21,"KLEIN  C.","E4",null,null,null,null,null,null,null,null,null,null,null,null,null,null,null,{"$f":"B43","v":"RASKIN  J."}]
[null,"0-2",3,null,"GRISARD J.","D2",null,null,null,null,null,null,null,null,null,null,null,null,{"$f":"B45","v":"RENKIN G."}]
[12,"GRISARD J.","D2",null,null,null,null,null,null,null,null,null,null,null,null,null,null,null,{"$f":"B47","v":0}]
[null,null,null,null,null,null,null,"2-0",3,null,"MAKA  C.","B2",null,null,null,null,null,null,{"$f":"B49","v":"BILAS  C."}]
[13,"PAGNA  F.","C6",null,null,null,null,null,null,null,null,null,null,null,null,null,null,null,{"$f":"B51","v":"DELCOUR C."}]
[null,"2-0",1,null,"PAGNA  F.","C6",null,null,null,null,null,null,null,null,null,null,null,null,{"$f":"B53","v":0}]
[20,"ORSINI  M.","C2",null,null,null,null,null,null,null,null,null,null,null,null,null,null,null,{"$f":"B55","v":"PIRARD P."}]
[null,null,null,null,"2-1",1,null,"PAGNA  F.","C6",null,null,null,null,null,null,null,null,null,{"$f":"B57","v":"HOUBA B."}]
[29,null,null,null,null,null,null,null,null,null,null,null,null,null,null,null,null,null,{"$f":"B59","v":"SMEET  C."}]
[null,null,null,null,"CHÂTEAU  L.","C4",null,null,null,null,null,null,null,null,null,null,null,null,{"$f":"B61","v":"=RECHERCHEV(LC(-1);Joueurs!L(-58)C(1):L(-11)C(2);2;FAUX)"}]
[4,"CHÂTEAU  L.","C4",null,null,null,null,null,null,null,null,null,null,null,null,null,null,null,{"$f":"B63","v":0}]
[null,null,null,null,null,null,null,null,null,null,null,null,null,"1-3",1,null,"BILAS  C.",null,{"$f":"B65","v":"NOEL  X."}]
[3,"HAVELANGE  E.","C2"]
[null,null,null,null,"HAVELANGE  E.","C2"]
[30]
[null,null,null,null,"1-2",3,null,"SIMON T.","D4"]
[19,"SIMON T.","D4"]
[null,"2-0",3,null,"SIMON T.","D4"]
[14,"DEFAWE M.","C2"]
[null,null,null,null,null,null,null,"0-2",4,null,"BILAS  C.","B4"]
[11,"RASKIN  J.","D0"]
[null,"2-1",3,null,"RASKIN  J.","D0"]
[22,"RENKIN G.","E4"]
[null,null,null,null,"0-2",3,null,"BILAS  C.","B4"]
[27]
[null,null,null,null,"BILAS  C.","B4",null,null,null,null,"=Tab_Finale!L24C3"]
[6,"BILAS  C.","B4"]
[null,null,null,null,null,null,null,null,null,null,"3-2",1,null,"BILAS  C.","B4"]
[7,"DELCOUR C.","C0"]
[null,null,null,null,"DELCOUR C.","C0"]
[26]
[null,null,null,null,"0-2",1,null,"HOUBA B.","C4"]
[23,"PIRARD P.","D4"]
[null,"1-2",2,null,"HOUBA B.","C4"]
[10,"HOUBA B.","C4"]
[null,null,null,null,null,null,null,"1-2",2,null,"NOEL  X.","B6",null,"FOCAN R.","C4"]
[15,"SMEET  C.","C4"]
[null,"0-2",5,null,"LECLERC  N.","E6",null,null,null,null,null,null,null,null,2]
[null,"=RECHERCHEV(LC(-1);Joueurs!L(-58)C(1):L(-11)C(2);2;FAUX)","E6"]
[null,null,null,null,"0-2",6,null,"NOEL  X.","B6",null,null,null,null,"NOEL  X.","B6"]
[31]
[null,null,null,null,"NOEL  X.","B6"]
[null,"NOEL  X.","B6"]
[]
[]
[]
[]
[]
[]
[]
[]
[]
[]
[]
[]
[]
[null,null,null,null,null,null,null,null,null,null,"=Tab_Finale!L(-40)C(-8)"]
[null,null,null,null,null,null,null,null,null,null,"=Tab_Finale!L40C3"]
[]
[]
[null,null,null,null,null,null,null,null,null,null,"=Tab_Finale!L40C3"]

{"sheet":"Tab_Conso","index":10,"n_rows":65,"n_cols":17,"rows_kept":65,"cut":false,"hidden":false,"merged":[[55,13,55,14]]}
[]
[]
[1,"WIKET  J.","C6"]
[null,null,null,null,"WIKET  J.","C6"]
[32]
[null,null,null,null,"2-0",5,null,"WIKET  J.","C6"]
[17,"PIANGIVINO  S.","NC"]
[null,"0-2",0,null,"HIEL M.","NC"]
[16,"HIEL M.","NC"]
[null,null,null,null,null,null,null,"2-0",3,null,"WIKET  J.","C6"]
[9,"FAYS M.","E4"]
[null,"2-0",1,null,"FAYS M.","E4"]
[24,"JOANNES A.","NC"]
[null,null,null,null,"0-2",1,null,"PITER  B.","E0"]
[25]
[null,null,null,null,"PITER  B.","E0"]
[8,"PITER  B.","E0"]
[null,null,null,null,null,null,null,null,null,null,"3-1",4,null,"WIKET  J.","C6"]
[5,"DE VETTOR M.","E4"]
[null,null,null,null,"DE VETTOR M.","E4"]
[28]
[null,null,null,null,"2-0",1,null,"DE VETTOR M.","E4"]
[21,"TOUSSAINT A.","NC"]
[null,"0-2",1,null,"DELCOUR M.","E6"]
[12,"DELCOUR M.","E6"]
[null,null,null,null,null,null,null,"2-0",1,null,"DE VETTOR M.","E4"]
[13,"LEO A.","E4"]
[null,"0-2",1,null,"LAMALLE  M.","E6"]
[20,"LAMALLE  M.","E6"]
[null,null,null,null,"2-0",1,null,"LAMALLE  M.","E6"]
[29]
[null,null,null,null,"POLIZZI  A.","E4"]
[4,"POLIZZI  A.","E4"]
[null,null,null,null,null,null,null,null,null,null,null,null,null,"3-1",2,null,"WIKET  J."]
[3,"FONTAINE  F.","E2"]
[null,null,null,null,"FONTAINE  F.","E2"]
[30]
[null,null,null,null,"0-2",2,null,"DELPEREE  L.","NC"]
[19,"DANTHINE J.","D4"]
[null,"0-2",3,null,"DELPEREE  L.","NC"]
[14,"DELPEREE  L.","NC"]
[null,null,null,null,null,null,null,"1-2",1,null,"VANDENBERGH V.","E4"]
[11,"LAMALLE J.","E6"]
[null,"2-0",1,null,"LAMALLE J.","E6"]
[22,"IRMAK Y.","NC"]
[null,null,null,null,"0-2",1,null,"VANDENBERGH V.","E4"]
[27]
[null,null,null,null,"VANDENBERGH V.","E4"]
[6,"VANDENBERGH V.","E4"]
[null,null,null,null,null,null,null,null,null,null,"0-3",2,null,"DELCOUR  V.","D4"]
[7,"DELCOUR  V.","D4"]
[null,null,null,null,"DELCOUR  V.","D4"]
[26]
[null,null,null,null,"2-0",2,null,"DELCOUR  V.","D4"]
[23,"CHOISI V.","C0"]
[null,"0-2",5,null,"FOUARGE  A.","E4"]
[10,"FOUARGE  A.","E4"]
[null,null,null,null,null,null,null,"2-1",2,null,"DELCOUR  V.","D4"]
[15,"CAMILLETTI A.","E4"]
[null,"2-0",1,null,"CAMILLETTI A.","E4"]
[18,"EL HAMRAOUI Y.","E6"]
[null,null,null,null,"2-1",3,null,"CAMILLETTI A.","E4"]
[31]
[null,null,null,null,"MASSAR P.","D0"]
[2,"MASSAR P.","D0"]

{"sheet":"Feuil1","index":11,"n_rows":138,"n_cols":19,"rows_kept":138,"cut":false,"hidden":false,"merged":[[32,0,32,6],[32,9,32,15],[4,11,4,14],[21,2,21,5],[28,12,29,12],[28,13,29,13],[28,14,29,14],[28,15,29,15],[25,11,26,11],[25,12,26,12],[25,13,26,13],[25,14,26,14],[25,15,26,15],[20,2,20,6],[20,11,20,15],[21,11,21,15],[28,16,29,16],[30,11,30,16],[27,11,27,16],[28,0,29,0],[28,2,29,2],[28,3,29,3],[28,4,29,4],[28,5,29,5],[28,6,29,6],[28,7,29,7],[28,9,29,9],[28,11,29,11],[25,16,26,16],[24,0,24,6],[24,9,24,15],[25,0,26,0],[25,2,26,2],[25,3,26,3],[25,4,26,4],[25,5,26,5],[25,6,26,6],[25,7,26,7],[25,9,26,9],[11,15,12,15],[8,15,9,15],[22,2,22,6],[22,11,22,15],[11,16,12,16],[13,11,13,16],[15,0,15,6],[15,9,15,15],[16,0,16,16],[17,2,17,6],[17,11,17,15],[11,9,12,9],[11,11,12,11],[11,12,12,12],[11,13,12,13],[11,14,12,14],[11,0,12,0],[11,2,12,2],[11,6,12,6],[11,7,12,7],[8,7,9,7],[8,9,9,9],[8,11,9,11],[8,12,9,12],[8,13,9,13],[11,3,12,3],[11,4,12,4],[11,5,12,5],[8,6,9,6],[35,2,35,6],[35,11,35,15],[38,2,38,6],[38,11,38,15],[39,2,39,5],[39,11,39,14],[28,18,29,18],[0,2,0,6],[0,11,0,15],[3,2,3,6],[3,11,3,15],[4,2,4,5],[8,14,9,14],[5,2,5,6],[5,11,5,15],[7,0,7,6],[7,9,7,15],[8,0,9,0],[8,2,9,2],[8,3,9,3],[8,4,9,4],[8,5,9,5],[8,16,9,16],[10,11,10,16],[40,2,40,6],[40,11,40,15],[42,0,42,6],[42,9,42,15],[43,0,44,0],[43,2,44,2],[43,3,44,3],[43,4,44,4],[43,5,44,5],[43,6,44,6],[43,7,44,7],[43,9,44,9],[43,11,44,11],[43,12,44,12],[43,13,44,13],[43,14,44,14],[43,15,44,15],[43,16,44,16],[45,11,45,16],[46,0,47,0],[46,2,47,2],[46,3,47,3],[46,4,47,4],[46,5,47,5],[46,6,47,6],[46,7,47,7],[46,9,47,9],[46,11,47,11],[46,12,47,12],[46,13,47,13],[46,14,47,14],[46,15,47,15],[52,2,52,6],[52,11,52,15],[55,2,55,6],[55,11,55,15],[56,2,56,5],[56,11,56,15],[46,16,47,16],[48,11,48,16],[50,0,50,6],[50,9,50,15],[51,0,51,16],[57,2,57,6],[57,11,57,15],[59,0,59,6],[59,9,59,15],[60,0,61,0],[60,2,61,2],[60,3,61,3],[60,4,61,4],[60,5,61,5],[60,6,61,6],[60,7,61,7],[60,9,61,9],[60,11,61,11],[60,12,61,12],[60,13,61,13],[60,14,61,14],[60,15,61,15],[60,16,61,16],[62,11,62,16],[63,0,64,0],[63,2,64,2],[63,3,64,3],[63,4,64,4],[63,5,64,5],[63,6,64,6],[63,7,64,7],[63,9,64,9],[63,11,64,11],[63,12,64,12],[63,13,64,13],[63,14,64,14],[63,15,64,15],[73,2,73,6],[73,11,73,15],[74,2,74,5],[74,11,74,14],[75,2,75,6],[75,11,75,15],[63,16,64,16],[65,11,65,16],[67,0,67,6],[67,9,67,15],[70,2,70,6],[70,11,70,15],[77,0,77,6],[77,9,77,15],[78,0,79,0],[78,2,79,2],[78,3,79,3],[78,4,79,4],[78,5,79,5],[78,6,79,6],[78,7,79,7],[78,9,79,9],[78,11,79,11],[78,12,79,12],[78,13,79,13],[78,14,79,14],[78,15,79,15],[78,16,79,16],[80,11,80,16],[81,0,82,0],[81,2,82,2],[81,3,82,3],[81,4,82,4],[81,5,82,5],[81,6,82,6],[81,7,82,7],[81,9,82,9],[81,11,82,11],[81,12,82,12],[81,13,82,13],[81,14,82,14],[81,15,82,15],[81,16,82,16],[90,2,90,6],[90,11,90,15],[91,2,91,5],[91,11,91,15],[92,2,92,6],[92,11,92,15],[83,11,83,16],[85,0,85,6],[85,9,85,15],[86,0,86,16],[87,2,87,6],[87,11,87,15],[94,0,94,6],[94,9,94,15],[95,0,96,0],[95,2,96,2],[95,3,96,3],[95,4,96,4],[95,5,96,5],[95,6,96,6],[95,7,96,7],[95,9,96,9],[95,11,96,11],[95,12,96,12],[95,13,96,13],[95,14,96,14],[95,15,96,15],[95,16,96,16],[97,11,97,16],[98,0,99,0],[98,2,99,2],[98,3,99,3],[98,4,99,4],[98,5,99,5],[98,6,99,6],[98,7,99,7],[98,9,99,9],[98,11,99,11],[98,12,99,12],[98,13,99,13],[98,14,99,14],[98,15,99,15],[98,16,99,16],[108,2,108,6],[108,11,108,15],[109,2,109,5],[109,11,109,14],[110,2,110,6],[110,11,110,15],[100,11,100,16],[102,0,102,6],[102,9,102,15],[105,2,105,6],[105,11,105,15],[112,0,112,6],[112,9,112,15],[113,0,114,0],[113,2,114,2],[113,3,114,3],[113,4,114,4],[113,5,114,5],[113,6,114,6],[113,7,114,7],[113,9,114,9],[113,11,114,11],[113,12,114,12],[113,13,114,13],[113,14,114,14],[113,15,114,15],[113,16,114,16],[115,11,115,16],[116,0,117,0],[116,2,117,2],[116,3,117,3],[116,4,117,4],[116,5,117,5],[116,6,117,6],[116,7,117,7],[116,9,117,9],[116,11,117,11],[116,12,117,12],[116,13,117,13],[116,14,117,14],[116,15,117,15],[116,16,117,16],[125,2,125,6],[125,11,125,15],[126,2,126,5],[126,11,126,15],[127,2,127,6],[127,11,127,15],[118,11,118,16],[120,0,120,6],[120,9,120,15],[121,0,121,16],[122,2,122,6],[122,11,122,15],[129,0,129,6],[129,9,129,15],[130,0,131,0],[130,2,131,2],[130,3,131,3],[130,4,131,4],[130,5,131,5],[130,6,131,6],[130,7,131,7],[130,9,131,9],[130,11,131,11],[130,12,131,12],[130,13,131,13],[130,14,131,14],[130,15,131,15],[135,11,135,16],[137,0,137,6],[137,9,137,15],[130,16,131,16],[132,11,132,16],[133,0,134,0],[133,2,134,2],[133,3,134,3],[133,4,134,4],[133,5,134,5],[133,6,134,6],[133,7,134,7],[133,9,134,9],[133,11,134,11],[133,12,134,12],[133,13,134,13],[133,14,134,14],[133,15,134,15],[133,16,134,16]]}
[null,null,"Critérium",null,null,null,null,null,null,null,null,"Critérium"]
["16ème finale",null,null,null,null,null,null,null,null,"16ème finale",null,null,null,null,null,null,null,null,"Bonjour,"]
[null,null,null,null,null,null,null,null,null,null,null,null,null,null,null,null,null,null,"Tu vois dans la ellule A9  il y a un opier de cellule de la feuille Tab_Finale"]
["Arbitre",null,null,null,null,null,null,null,null,"Arbitre",null,null,null,null,null,null,null,null,"et cela marche mais à d'autres cela ne marche pas par exemple cellule A26"]
[null,null,"Table n°",null,null,null,null,null,null,null,null,"Table n°",null,null,null,null,null,null,"mais si je fais un copier coller ctrl C +Ctrl v le nom se copie bien"]
[null,null,"Manches",null,null,null,null,null,null,null,null,"Manches",null,null,null,null,null,null,"Moi je voudrais automatiser cela par la formule =Tab_Finale!"]
[null,null,1,2,3,4,5,null,null,null,null,1,2,3,4,5,null,null,"Ca va puis ça va pas et je ne sais pas pourquoi ou peut-être que c'est mon pc qui déonne!"]
["Premier service: Gauche - Droite",null,null,null,null,null,null,"Score",null,"Premier service: Gauche - Droite",null,null,null,null,null,null,"Score"]
[{"$f":"Tab_Finale!$B$3","v":"MAKA  M."},{"$f":"Tab_Finale!C3","v":"B4"},null,null,null,null,null,null,null,{"$f":"Tab_Finale!$B$7","v":"SMEET D."},{"$f":"Tab_Finale!C7","v":"E4"},null,null,null,null,null,null,null,"Merci"]
[null,{"$f":"Tab_Finale!C4","v":0},null,null,null,null,null,null,null,null,{"$f":"Tab_Finale!$C$8","v":4}]
["contre",null,null,null,null,null,null,null,null,"contre"]
[{"$f":"Tab_Finale!$B$5","v":0},{"$f":"Tab_Finale!C5","v":0},null,null,null,null,null,null,null,{"$f":"Tab_Finale!$B$9","v":"LAVALLEE S."},{"$f":"VLOOKUP(J12,Joueurs!$C$3:$D$50,2)","v":"C4"}]
[null,{"$f":"Tab_Finale!C4","v":0},null,null,null,null,null,null,null,null,{"$f":"Tab_Finale!$C$8","v":4}]
[null,null,null,null,null,null,null,null,null,null,null,null,null,null,null,null,null,null,"²"]
[]
["Sitôt la partie terminée, rapporter cette fiche au Juge Arbitre",null,null,null,null,null,null,null,null,"Sitôt la partie terminée, rapporter cette fiche au Juge Arbitre"]
["-----------------------------------------------------------------------------------------------------------------------------------------------------------------------------"]
[null,null,"Critérium",null,null,null,null,null,null,null,null,"Critérium"]
["16ème finale",null,null,null,null,null,null,null,null,"16ème finale"]
[]
["Arbitre",null,null,null,null,null,null,null,null,"Arbitre"]
[null,null,"Table n°",null,null,null,{"$f":"IF(OR(A26=0,A29=0),\"\",2)","v":2},null,null,null,null,"Table n°"]
[null,null,"Manches",null,null,null,null,null,null,null,null,"Manches"]
[null,null,1,2,3,4,5,null,null,null,null,1,2,3,4,5]
["Premier service: Gauche - Droite",null,null,null,null,null,null,"Score",null,"Premier service: Gauche - Droite",null,null,null,null,null,null,"Score"]
["=Tab_Finale!$B$11","C4",null,null,null,null,null,null,null,null,{"$f":"Tab_Finale!$C$15","v":0}]
[null,{"$f":"Tab_Finale!C12","v":4},null,null,null,null,null,null,null,null,{"$f":"Tab_Finale!$C16","v":0}]
["contre",null,null,null,null,null,null,null,null,"contre"]
["LAMALLE N.",{"$f":"Tab_Finale!$C13","v":"E4"},null,null,null,null,null,null,null,"DOUIN  M.",{"$f":"Tab_Finale!$C17","v":"C4"}]
[null,{"$f":"Tab_Finale!$C12","v":4},null,null,null,null,null,null,null,null,{"$f":"Tab_Finale!$C16","v":0}]
[]
[]
["Sitôt la partie terminée, rapporter cette fiche au Juge Arbitre",null,null,null,null,null,null,null,null,"Sitôt la partie terminée, rapporter cette fiche au Juge Arbitre"]
[]
[]
[null,null,"Critérium",null,null,null,null,null,null,null,null,"Critérium"]
["16ème finale",null,null,null,null,null,null,null,null,"16ème finale"]
[]
["Arbitre",null,null,null,null,null,null,null,null,"Arbitre"]
[null,null,"Table n°",null,null,null,null,null,null,null,null,"Table n°"]
[null,null,"Manches",null,null,null,null,null,null,null,null,"Manches"]
[null,null,1,2,3,4,5,null,null,null,null,1,2,3,4,5]
["Premier service: Gauche - Droite",null,null,null,null,null,null,"Score",null,"Premier service: Gauche - Droite",null,null,null,null,null,null,"Score"]
["MAKA  C.","B2",null,null,null,null,null,null,null,"KLEIN  C.",{"$f":"Tab_Finale!C23","v":"E4"}]
[null,{"$f":"Tab_Finale!C20","v":0},null,null,null,null,null,null,null,null,{"$f":"Tab_Finale!$C$24","v":3}]
["contre",null,null,null,null,null,null,null,null,"contre"]
[null,{"$f":"Tab_Finale!C20","v":0},null,null,null,null,null,null,null,"GRISARD J.",{"$f":"VLOOKUP(J47,Joueurs!$C$3:$D$50,2)","v":"D2"}]
[null,{"$f":"Tab_Finale!C21","v":0},null,null,null,null,null,null,null,null,{"$f":"Tab_Finale!$C$24","v":3}]
[]
[]
["Sitôt la partie terminée, rapporter cette fiche au Juge Arbitre",null,null,null,null,null,null,null,null,"Sitôt la partie terminée, rapporter cette fiche au Juge Arbitre"]
["-----------------------------------------------------------------------------------------------------------------------------------------------------------------------------"]
[null,null,"Critérium",null,null,null,null,null,null,null,null,"Critérium"]
["16ème finale",null,null,null,null,null,null,null,null,"16ème finale"]
[]
["Arbitre",null,null,null,null,null,null,null,null,"Arbitre"]
[null,null,"Table n°",null,null,null,{"$f":"IF(OR(A61=0,A64=0),\"\",2)","v":""},null,null,null,null,"Table n°"]
[null,null,"Manches",null,null,null,null,null,null,null,null,"Manches"]
[null,null,1,2,3,4,5,null,null,null,null,1,2,3,4,5]
["Premier service: Gauche - Droite",null,null,null,null,null,null,"Score",null,"Premier service: Gauche - Droite",null,null,null,null,null,null,"Score"]
[null,{"$f":"VLOOKUP(A61,Joueurs!$C$3:$D$50,2)","v":{"$error":"#N/A"}},null,null,null,null,null,null,null,null,{"$f":"Tab_Finale!$C$31","v":0}]
[null,{"$f":"Tab_Finale!C28","v":1},null,null,null,null,null,null,null,null,{"$f":"Tab_Finale!$C32","v":0}]
["contre",null,null,null,null,null,null,null,null,"contre"]
["=Tab_Finale!$B$29",{"$f":"VLOOKUP(A64,Joueurs!$C$3:$D$50,2)","v":{"$error":"#N/A"}},null,null,null,null,null,null,null,"CHÂTEAU  L.",{"$f":"VLOOKUP(J64,Joueurs!$C$3:$D$50,2)","v":"C4"}]
[null,{"$f":"Tab_Finale!$C28","v":1},null,null,null,null,null,null,null,null,{"$f":"Tab_Finale!$C32","v":0}]
[]
[]
["Sitôt la partie terminée, rapporter cette fiche au Juge Arbitre",null,null,null,null,null,null,null,null,"Sitôt la partie terminée, rapporter cette fiche au Juge Arbitre"]
[]
[]
[null,null,"Critérium",null,null,null,null,null,null,null,null,"Critérium"]
["16ème finale",null,null,null,null,null,null,null,null,"16ème finale"]
[]
["Arbitre",null,null,null,null,null,null,null,null,"Arbitre"]
[null,null,"Table n°",null,null,null,null,null,null,null,null,"Table n°"]
[null,null,"Manches",null,null,null,null,null,null,null,null,"Manches"]
[null,null,1,2,3,4,5,null,null,null,null,1,2,3,4,5]
["Premier service: Gauche - Droite",null,null,null,null,null,null,"Score",null,"Premier service: Gauche - Droite",null,null,null,null,null,null,"Score"]
["HAVELANGE  E.",{"$f":"Tab_Finale!C35","v":"C2"},null,null,null,null,null,null,null,"SIMON T.",{"$f":"Tab_Finale!C39","v":"D4"}]
[null,{"$f":"Tab_Finale!C36","v":0},null,null,null,null,null,null,null,null,{"$f":"Tab_Finale!$C$40","v":3}]
["contre",null,null,null,null,null,null,null,null,"contre"]
[null,{"$f":"Tab_Finale!C37","v":0},null,null,null,null,null,null,null,"DEFAWE M.",{"$f":"VLOOKUP(J82,Joueurs!$C$3:$D$50,2)","v":"C2"}]
[null,{"$f":"Tab_Finale!C36","v":0},null,null,null,null,null,null,null,null,{"$f":"Tab_Finale!$C$40","v":3}]
[]
[]
["Sitôt la partie terminée, rapporter cette fiche au Juge Arbitre",null,null,null,null,null,null,null,null,"Sitôt la partie terminée, rapporter cette fiche au Juge Arbitre"]
["-----------------------------------------------------------------------------------------------------------------------------------------------------------------------------"]
[null,null,"Critérium",null,null,null,null,null,null,null,null,"Critérium"]
["16ème finale",null,null,null,null,null,null,null,null,"16ème finale"]
[]
["Arbitre",null,null,null,null,null,null,null,null,"Arbitre"]
[null,null,"Table n°",null,null,null,{"$f":"IF(OR(A96=0,A99=0),\"\",2)","v":2},null,null,null,null,"Table n°"]
[null,null,"Manches",null,null,null,null,null,null,null,null,"Manches"]
[null,null,1,2,3,4,5,null,null,null,null,1,2,3,4,5]
["Premier service: Gauche - Droite",null,null,null,null,null,null,"Score",null,"Premier service: Gauche - Droite",null,null,null,null,null,null,"Score"]
["FOCAN R.","C4",null,null,null,null,null,null,null,null,{"$f":"Tab_Finale!$C$15","v":0}]
[null,{"$f":"Tab_Finale!C82","v":0},null,null,null,null,null,null,null,null,{"$f":"Tab_Finale!$C86","v":0}]
["contre",null,null,null,null,null,null,null,null,"contre"]
["LAMALLE N.",{"$f":"Tab_Finale!$C83","v":0},null,null,null,null,null,null,null,"DOUIN  M.",{"$f":"Tab_Finale!$C87","v":0}]
[null,{"$f":"Tab_Finale!$C82","v":0},null,null,null,null,null,null,null,null,{"$f":"Tab_Finale!$C86","v":0}]
[]
[]
["Sitôt la partie terminée, rapporter cette fiche au Juge Arbitre",null,null,null,null,null,null,null,null,"Sitôt la partie terminée, rapporter cette fiche au Juge Arbitre"]
[]
[]
[null,null,"Critérium",null,null,null,null,null,null,null,null,"Critérium"]
["16ème finale",null,null,null,null,null,null,null,null,"16ème finale"]
[]
["Arbitre",null,null,null,null,null,null,null,null,"Arbitre"]
[null,null,"Table n°",null,null,null,null,null,null,null,null,"Table n°"]
[null,null,"Manches",null,null,null,null,null,null,null,null,"Manches"]
[null,null,1,2,3,4,5,null,null,null,null,1,2,3,4,5]
["Premier service: Gauche - Droite",null,null,null,null,null,null,"Score",null,"Premier service: Gauche - Droite",null,null,null,null,null,null,"Score"]
["MAKA  C.","B2",null,null,null,null,null,null,null,"KLEIN  C.",{"$f":"Tab_Finale!C93","v":0}]
[null,{"$f":"Tab_Finale!C90","v":0},null,null,null,null,null,null,null,null,{"$f":"Tab_Finale!$C$24","v":3}]
["contre",null,null,null,null,null,null,null,null,"contre"]
[null,{"$f":"Tab_Finale!C90","v":0},null,null,null,null,null,null,null,"GRISARD J.",{"$f":"VLOOKUP(J117,Joueurs!$C$3:$D$50,2)","v":"D2"}]
[null,{"$f":"Tab_Finale!C91","v":0},null,null,null,null,null,null,null,null,{"$f":"Tab_Finale!$C$24","v":3}]
[]
[]
["Sitôt la partie terminée, rapporter cette fiche au Juge Arbitre",null,null,null,null,null,null,null,null,"Sitôt la partie terminée, rapporter cette fiche au Juge Arbitre"]
["-----------------------------------------------------------------------------------------------------------------------------------------------------------------------------"]
[null,null,"Critérium",null,null,null,null,null,null,null,null,"Critérium"]
["16ème finale",null,null,null,null,null,null,null,null,"16ème finale"]
[]
["Arbitre",null,null,null,null,null,null,null,null,"Arbitre"]
[null,null,"Table n°",null,null,null,{"$f":"IF(OR(A131=0,A134=0),\"\",2)","v":""},null,null,null,null,"Table n°"]
[null,null,"Manches",null,null,null,null,null,null,null,null,"Manches"]
[null,null,1,2,3,4,5,null,null,null,null,1,2,3,4,5]
["Premier service: Gauche - Droite",null,null,null,null,null,null,"Score",null,"Premier service: Gauche - Droite",null,null,null,null,null,null,"Score"]
[null,{"$f":"VLOOKUP(A131,Joueurs!$C$3:$D$50,2)","v":{"$error":"#N/A"}},null,null,null,null,null,null,null,null,{"$f":"Tab_Finale!$C$31","v":0}]
[null,{"$f":"Tab_Finale!C98","v":0},null,null,null,null,null,null,null,null,{"$f":"Tab_Finale!$C102","v":0}]
["contre",null,null,null,null,null,null,null,null,"contre"]
["ORSINI  M.",{"$f":"VLOOKUP(A134,Joueurs!$C$3:$D$50,2)","v":"C2"},null,null,null,null,null,null,null,"CHÂTEAU  L.",{"$f":"VLOOKUP(J134,Joueurs!$C$3:$D$50,2)","v":"C4"}]
[null,{"$f":"Tab_Finale!$C98","v":0},null,null,null,null,null,null,null,null,{"$f":"Tab_Finale!$C102","v":0}]
[]
[]
["Sitôt la partie terminée, rapporter cette fiche au Juge Arbitre",null,null,null,null,null,null,null,null,"Sitôt la partie terminée, rapporter cette fiche au Juge Arbitre"]

{"sheet":"Valeurs","index":12,"n_rows":19,"n_cols":3,"rows_kept":19,"cut":false,"hidden":true,"merged":[]}
["Classement","Valeurs"]
["NC",1," "]
["E6",2]
["E4",3]
["E2",4]
["E0",5]
["D6",6]
["D4",7]
["D2",8]
["D0",9]
["C6",10]
["C4",11]
["C2",12]
["C0",13]
["B6",14]
["B4",15]
["B2",16]
["B0",17]
["A",18]

{"sheet":"Handicap","index":13,"n_rows":19,"n_cols":20,"rows_kept":19,"cut":false,"hidden":true,"merged":[]}
[" ","NC","E6","E4","E2","E0","D6","D4","D2","D0","C6","C4","C2","C0","B6","B4","B2","B0","A"]
["NC",null,1,1,2,2,3,3,4,4,5,5,6,6,7,7,8,8,8]
["E6",-1,null,1,1,2,2,3,3,4,4,5,5,6,6,7,7,8,8]
["E4",-1,-1,1,1,1,2,2,3,3,4,4,5,5,6,6,7,7,8]
["E2",-2,-1,-1,null,1,1,2,2,3,3,4,4,5,5,6,6,7,7]
["E0",-2,-2,-1,-1,null,1,1,2,2,3,3,4,4,5,5,6,6,7]
["D6",-3,-2,-2,-1,{"$f":"$E$6","v":-1},null,1,1,2,2,3,3,4,4,5,5,6,6]
["D4",-3,-3,-2,-2,-1,-1,null,1,1,2,2,3,3,4,4,5,5,6]
["D2",-4,-3,-3,-2,-2,-1,-1,null,1,1,2,2,3,3,4,4,5,5]
["D0",-4,-4,-3,-3,2,-2,-1,-1,null,1,1,2,2,3,3,4,4,5]
["C6",-5,-4,-4,-3,-3,-2,-2,-1,-1,null,1,1,2,2,3,3,4,4]
["C4",-5,-5,-4,-4,-3,-3,-2,-2,-1,-1,null,1,1,2,2,3,3,4]
["C2",-6,-5,-5,-4,-4,-3,-3,-2,-2,-1,-1,null,1,1,2,2,3,3]
["C0",-6,-6,-5,-5,-4,-4,-3,-3,-2,-2,-1,-1,null,1,1,2,2,3]
["B6",-7,-6,-6,-5,-5,-4,-4,-3,-3,-2,-2,-1,-1,null,1,1,2,2]
["B4",-7,-7,-6,-6,-5,-5,-4,-4,-3,-3,-2,-2,-1,-1,null,1,1,2]
["B2",-8,-7,-7,-6,-6,-5,-5,-4,-4,-3,-3,-2,-2,-1,-1,null,1,1," "]
["B0",-8,-8,-7,-7,-6,-6,-5,-5,-4,-4,-3,-3,-2,-2,-1,-1,null,1," "]
["A",-9,-8,-8,-7,-7,-6,-6,-5,-5,-4,-4,-3,-3,-2,-2,-1,-1]

{"sheet":"Equivalence","index":14,"n_rows":30,"n_cols":3,"rows_kept":30,"cut":false,"hidden":true,"merged":[]}
["Fédération ouvrière","Fédération belge","RIL"]
["NC","NC","NC"]
["F2","E6","E6"]
["F1","E4","E4"]
["E6","E2","E2"]
["E5","E0","E0"]
["E4","D6","D6"]
["E3","D4","D4"]
["E2","D4","D4"]
["E1","D4","D4"]
["D6","D2","D2"]
["D5","D2","D2"]
["D4","D2","D2"]
["D3","D0","D0"]
["D2","D0","D0"]
["D1","D0","D0"]
["C6","C6","C6"]
["C5","C6","C6"]
["C4","C4","C4"]
["C3","C4","C4"]
["C2","C2","C2"]
["C1","C2","C2"]
["B6","C0","C0"]
["B5","C0","C0"]
["B4","B6","B6"]
["B3","B6","B6"]
["B2","B4","B4"]
["B1","B2","B2"]
["A","B0","B0"]
[null,"A","A"]

{"sheet":"TeteSerie","index":15,"n_rows":32,"n_cols":1,"rows_kept":32,"cut":false,"hidden":true,"merged":[]}
[1]
[4]
[3]
[2]
[2]
[3]
[4]
[1]
[1]
[4]
[3]
[2]
[2]
[3]
[4]
[1]
[1]
[4]
[3]
[2]
[2]
[3]
[4]
[1]
[1]
[4]
[3]
[2]
[2]
[3]
[4]
[1]

{"sheet":"Grille4","index":16,"n_rows":7,"n_cols":3,"rows_kept":7,"cut":false,"hidden":true,"merged":[]}
["Joueur A","Joueur B","Arbitre"]
[1,4,3]
[2,3,4]
[1,3,2]
[2,4,3]
[3,4,1]
[1,2,4]

{"sheet":"Grille5","index":17,"n_rows":11,"n_cols":3,"rows_kept":11,"cut":false,"hidden":true,"merged":[]}
["Joueur A","Joueur B","Arbitre"]
[1,5,3]
[2,4,1]
[3,5,2]
[1,4,5]
[2,3,4]
[4,5,3]
[1,3,5]
[2,5,1]
[3,4,2]
[1,2,4]

{"sheet":"Grille6","index":18,"n_rows":16,"n_cols":3,"rows_kept":16,"cut":false,"hidden":true,"merged":[]}
["Joueur A","Joueur B","Arbitre"]
[1,6,5]
[2,5,6]
[3,4,2]
[1,5,3]
[2,4,1]
[3,6,4]
[1,4,5]
[2,3,6]
[5,6,1]
[1,3,4]
[2,6,3]
[4,5,2]
[1,2,6]
[3,5,4]
[4,6,5]

{"sheet":"Grille8","index":19,"n_rows":13,"n_cols":3,"rows_kept":13,"cut":false,"hidden":true,"merged":[]}
["Joueur A","Joueur B","Arbitre"]
[1,7,8]
[2,8,7]
[4,6,5]
[3,5,6]
[1,6,3]
[2,5,4]
[4,7,2]
[3,8,1]
[1,4,5]
[2,3,7]
[6,7,8]
[5,8,6]

{"sheet":"JoueursPoule","index":20,"n_rows":45,"n_cols":8,"rows_kept":45,"cut":false,"hidden":true,"merged":[]}
["Joueurs","Nbr Poules","Poule 1","Poule 2","Poule 3","Poule 4","Poule 5","Poule 6"]
[5,1,5,0,0,0,0,0]
[6,1,6,0,0,0,0,0]
[7,1,7,0,0,0,0,0]
[8,1,8,0,0,0,0,0]
[9,1,9,0,0,0,0,0]
[10,2,5,5,0,0,0,0]
[11,2,6,5,0,0,0,0]
[12,2,6,6,0,0,0,0]
[13,2,8,5,0,0,0,0]
[14,2,8,6,0,0,0,0]
[15,3,5,5,5,0,0,0]
[16,3,6,5,5,0,0,0]
[17,3,6,6,5,0,0,0]
[18,3,6,6,6,0,0,0]
[19,3,8,6,5,0,0,0]
[20,4,5,5,5,5,0,0]
[21,4,6,5,5,5,0,0]
[22,4,6,6,5,5,0,0]
[23,4,6,6,6,5,0,0]
[24,4,6,6,6,6,0,0]
[25,5,5,5,5,5,5,0]
[26,5,6,5,5,5,5,0]
[27,5,6,6,5,5,5,0]
[28,5,6,6,6,5,5,0]
[29,5,6,6,6,6,5,0]
[30,5,6,6,6,6,6,0]
[31,6,6,5,5,5,5,5]
[32,6,6,6,5,5,5,5]
[33,6,6,6,6,5,5,5]
[34,6,6,6,6,6,5,5]
[35,6,6,6,6,6,6,5]
[36,6,6,6,6,6,6,6]
[37,6,8,6,6,6,6,5]
[38,6,8,6,6,6,6,6]
[39,6,8,8,6,6,6,5]
[40,6,8,8,6,6,6,6]
[41,6,8,8,8,6,6,5]
[42,6,8,8,8,6,6,6]
[43,6,8,8,8,8,6,5]
[44,6,8,8,8,8,6,6]
[45,6,8,8,8,8,8,5]
[46,6,8,8,8,8,8,6]
[47,6,8,8,8,8,8,7]
[48,6,8,8,8,8,8,8]