{"text_format":"1","workbook":"xlsx","n_sheets":21,"sheets":["Joueurs","Points","Poule1","Poule2","Poule3","Poule4","Poule5","Poule6","Class_Poule","Tab_Finale","Tab_Conso","Feuil1","Valeurs","Handicap","Equivalence","TeteSerie","Grille4","Grille5","Grille6","Grille8","JoueursPoule"],"not_rendered":{"charts":0,"images":0,"macros":1,"external_links":0,"defined_names":7,"comments":0,"pivot_tables":0},"unopened":[],"bounds":{"document_bytes":16777216,"sheet_cells":100000,"rows_first":2000,"rows_last":500,"rows_between":2000,"halvings":0,"cell_chars":16384,"cell_head_chars":4096},"cells_cut":0,"cells_raw":0,"read":"whole","date_system":"1900"}

{"sheet":"Joueurs","index":0,"n_rows":72,"n_cols":7,"rows_kept":72,"cut":false,"hidden":false,"merged":[[70,0,70,1],[70,3,70,4]]}
[]
["Nom","Prénom",null,"Class.","Poule","Aléat."]
["BILAS ","CLEMENT",{"$f":"CONCATENATE(A3,\" \",LEFT(B3,1))","v":"BILAS  C"},"B4",4,872,16]
["CAMILLETTI","ADRIEN","CAMILLETTI A","E4",3,650,15]
["CHÂTEAU ","LUC","CHÂTEAU  L","C4",1,861,15]
["CHOISI","VINCENT","CHOISI V","C0",2,5,14]
["DANTHINE","JEAN","DANTHINE J","D4",5,101,13]
["DE VETTOR","MAITE","DE VETTOR M","E4",5,840,13]
["DEFAWE","MICHEL","DEFAWE M","C2",1,61,12]
["DELCOUR","CHRISTIAN","DELCOUR C","C0",1,379,12]
["DELCOUR","MILO","DELCOUR M","E6",2,909,12]
["DELCOUR ","VALENTIN","DELCOUR  V","D4",4,74,11]
["DELPEREE ","LOUIS ","DELPEREE  L","NC",1,95,11]
["DOUIN ","MICHEL","DOUIN  M","C4",4,230,11]
["EL HAMRAOUI","YANIS","EL HAMRAOUI Y","E6",6,450,11]
{"$rows_left_out":58}
{"sheet":"Points","index":1,"n_rows":49,"n_cols":3,"rows_kept":49,"cut":false,"hidden":false,"merged":[]}
["Nom Joueur","Class.","Points"]
["BILAS  C.","B4",121]
["MAKA  C.","B2",111]
["FOCAN R.","C4",101]
["NOEL  X.","B6",101]
["HOUBA B.","C4",91]
["PAGNA  F.","C6",91]
["SIMON T.","D4",91]
["SMEET D.","E4",91]
["CHÂTEAU  L.","C4",81]
["DELCOUR C.","C0",81]
["DOUIN  M.","C4",81]
["GRISARD J.","D2",81]
["HAVELANGE  E.","C2",81]
["LECLERC  N.","E6",81]
{"$rows_left_out":35}
{"sheet":"Poule1","index":2,"n_rows":68,"n_cols":68,"rows_kept":68,"cut":false,"hidden":false,"merged":[[49,7,49,8],[50,7,50,8],[51,7,51,8],[52,7,52,8],[53,7,53,8]]}
[1,null,null,null,null,null,null,null,null,null,null,null,null,null,null,null,null,null,null,null,null,null,null,null,null,null,null,null,null,null,null,null,null,null,null,null,null,null,null,null,null,null,null,null,null,null,null,null,null,null,null,null,null,null,null,null,null,null,null,null,"Saive R.","Iacolino J.","Douin C.","Fissette B.","Galand A.","Neman P.","Larbanois J.","Labasse M."]
[null,"Joueur","Class."]
["Joueur 1","DELCOUR C.","C0"]
["Joueur 2","DEFAWE M.","C2"]
["Joueur 3","CHÂTEAU  L.","C4"]
["Joueur 4","MASSAR P.","D0"]
["Joueur 5","PITER  B.","E0"]
["Joueur 6","SMEET D.","E4"]
["Joueur 7","LAMALLE  M.","E6"]
["Joueur 8","DELPEREE  L.","NC"]
[]
["Match n°","Joueur A","Class.","Joueur B","Class.","Hand.","Set 1","Set 2","Set 3","Score","Arbitre"]
["Match n ° 1A","DELCOUR C.","C0","LAMALLE  M.","E6",6,"11-8","11-8",null,"2-0","DELPEREE  L."]
["Match n ° 2B","DEFAWE M.","C2","DELPEREE  L.","NC",6,"11-8","11-7",null,"2-0","LAMALLE  M."]
["Match n ° 3A","MASSAR P.","D0","SMEET D.","E4",3,"5-11","4-11",null,"0-2","PITER  B."]
{"$rows_left_out":54}
{"sheet":"Poule2","index":3,"n_rows":68,"n_cols":68,"rows_kept":68,"cut":false,"hidden":false,"merged":[[49,7,49,8],[50,7,50,8],[51,7,51,8],[52,7,52,8],[53,7,53,8]]}
[2,null,null,null,null,null,null,null,null,null,null,null,null,null,null,null,null,null,null,null,null,null,null,null,null,null,null,null,null,null,null,null,null,null,null,null,null,null,null,null,null,null,null,null,null,null,null,null,null,null,null,null,null,null,null,null,null,null,null,null,"Saive R.","Iacolino J.","Douin C.","Fissette B.","Galand A.","Neman P.","Larbanois J.","Labasse M."]
[null,"Joueur","Class."]
["Joueur 1","CHOISI V.","C0"]
["Joueur 2","HAVELANGE  E.","C2"]
["Joueur 3","SMEET  C.","C4"]
["Joueur 4","GRISARD J.","D2"]
["Joueur 5","FONTAINE  F.","E2"]
["Joueur 6","LAMALLE N.","E4"]
["Joueur 7","DELCOUR M.","E6"]
["Joueur 8","HIEL M.","NC"]
[]
["Match n°","Joueur A","Class.","Joueur B","Class.","Hand.","Set 1","Set 2","Set 3","Score","Arbitre"]
["Match n ° 1A","CHOISI V.","C0","DELCOUR M.","E6",6,"0-11","0-11",null,"0-2","HIEL M."]
["Match n ° 2B","HAVELANGE  E.","C2","HIEL M.","NC",6,"11-7","12-10",null,"2-0","DELCOUR M."]
["Match n ° 3A","GRISARD J.","D2","LAMALLE N.","E4",3,"11-6","11-7",null,"2-0","FONTAINE  F."]
{"$rows_left_out":54}
{"sheet":"Poule3","index":4,"n_rows":82,"n_cols":68,"rows_kept":82,"cut":false,"hidden":false,"merged":[[49,7,49,8],[50,7,50,8],[51,7,51,8],[52,7,52,8],[53,7,53,8]]}
[3,null,null,null,null,null,null,null,null,null,null,null,null,null,null,null,null,null,null,null,null,null,null,null,null,null,null,null,null,null,null,null,null,null,null,null,null,null,null,null,null,null,null,null,null,null,null,null,null,null,null,null,null,null,null,null,null,null,null,null,"Saive R.","Iacolino J.","Douin C.","Fissette B.","Galand A.","Neman P.","Larbanois J.","Labasse M."]
[null,"Joueur","Class."]
["Joueur 1","MAKA  C.","B2"]
["Joueur 2","LAVALLEE S.","C4"]
["Joueur 3","RASKIN  J.","D0"]
["Joueur 4","PIRARD P.","D4"]
["Joueur 5","POLIZZI  A.","E4"]
["Joueur 6","CAMILLETTI A.","E4"]
["Joueur 7","LAMALLE J.","E6"]
["Joueur 8","JOANNES A.","NC"]
[]
["Match n°","Joueur A","Class.","Joueur B","Class.","Hand.","Set 1","Set 2","Set 3","Score","Arbitre"]
["Match n ° 1A","MAKA  C.","B2","LAMALLE J.","E6",7,"11-7","11-9",null,"2-0","JOANNES A."]
["Match n ° 2B","LAVALLEE S.","C4","JOANNES A.","NC",5,"11-8","11-9",null,"2-0","LAMALLE J."]
["Match n ° 3A","PIRARD P.","D4","CAMILLETTI A.","E4",2,"11-5","8-11","11-9","2-1","POLIZZI  A."]
{"$rows_left_out":68}
{"sheet":"Poule4","index":5,"n_rows":73,"n_cols":68,"rows_kept":73,"cut":false,"hidden":false,"merged":[[49,7,49,8],[50,7,50,8],[51,7,51,8],[52,7,52,8],[53,7,53,8]]}
[4,null,null,null,null,null,null,null,null,null,null,null,null,null,null,null,null,null,null,null,null,null,null,null,null,null,null,null,null,null,null,null,null,null,null,null,null,null,null,null,null,null,null,null,null,null,null,null,null,null,null,null,null,null,null,null,null,null,null,null,"Saive R.","Iacolino J.","Douin C.","Fissette B.","Galand A.","Neman P.","Larbanois J.","Labasse M."]
[null,"Joueur","Class."]
["Joueur 1","BILAS  C.","B4"]
["Joueur 2","DOUIN  M.","C4"]
["Joueur 3","WIKET  J.","C6"]
["Joueur 4","DELCOUR  V.","D4"]
["Joueur 5","KLEIN  C.","E4"]
["Joueur 6","LEO A.","E4"]
["Joueur 7","LECLERC  N.","E6"]
["Joueur 8","IRMAK Y.","NC"]
[]
["Match n°","Joueur A","Class.","Joueur B","Class.","Hand.","Set 1","Set 2","Set 3","Score","Arbitre"]
["Match n ° 1A","BILAS  C.","B4","LECLERC  N.","E6",7,"11-8","11-9",null,"2-0","IRMAK Y."]
["Match n ° 2B","DOUIN  M.","C4","IRMAK Y.","NC",5,"11-0","11-0",null,"2-0","LECLERC  N."]
["Match n ° 3A","DELCOUR  V.","D4","LEO A.","E4",2,"11-0","11-0",null,"2-0","KLEIN  C."]
{"$rows_left_out":59}
{"sheet":"Poule5","index":6,"n_rows":68,"n_cols":68,"rows_kept":68,"cut":false,"hidden":false,"merged":[[49,7,49,8],[50,7,50,8],[51,7,51,8],[52,7,52,8],[53,7,53,8]]}
[5,null,null,null,null,null,null,null,null,null,null,null,null,null,null,null,null,null,null,null,null,null,null,null,null,null,null,null,null,null,null,null,null,null,null,null,null,null,null,null,null,null,null,null,null,null,null,null,null,null,null,null,null,null,null,null,null,null,null,null,"Saive R.","Iacolino J.","Douin C.","Fissette B.","Galand A.","Neman P.","Larbanois J.","Labasse M."]
[null,"Joueur","Class."]
["Joueur 1","MAKA  M.","B4"]
["Joueur 2","HOUBA B.","C4"]
["Joueur 3","PAGNA  F.","C6"]
["Joueur 4","DANTHINE J.","D4"]
["Joueur 5","DE VETTOR M.","E4"]
["Joueur 6","FOUARGE  A.","E4"]
["Joueur 7","RENKIN G.","E4"]
["Joueur 8","PIANGIVINO  S.","NC"]
[]
["Match n°","Joueur A","Class.","Joueur B","Class.","Hand.","Set 1","Set 2","Set 3","Score","Arbitre"]
["Match n ° 1A","MAKA  M.","B4","RENKIN G.","E4",6,"11-6","6-11","11-9","2-1","PIANGIVINO  S."]
["Match n ° 2B","HOUBA B.","C4","PIANGIVINO  S.","NC",5,"11-6","11-7",null,"2-0","RENKIN G."]
["Match n ° 3A","DANTHINE J.","D4","FOUARGE  A.","E4",2,"5-11","5-11",null,"0-2","DE VETTOR M."]
{"$rows_left_out":54}
{"sheet":"Poule6","index":7,"n_rows":68,"n_cols":68,"rows_kept":68,"cut":false,"hidden":false,"merged":[[49,7,49,8],[50,7,50,8],[51,7,51,8],[52,7,52,8],[53,7,53,8]]}
[6,null,null,null,null,null,null,null,null,null,null,null,null,null,null,null,null,null,null,null,null,null,null,null,null,null,null,null,null,null,null,null,null,null,null,null,null,null,null,null,null,null,null,null,null,null,null,null,null,null,null,null,null,null,null,null,null,null,null,null,"Saive R.","Iacolino J.","Douin C.","Fissette B.","Galand A.","Neman P.","Larbanois J.","Labasse M."]
[null,"Joueur","Class."]
["Joueur 1","NOEL  X.","B6"]
["Joueur 2","ORSINI  M.","C2"]
["Joueur 3","FOCAN R.","C4"]
["Joueur 4","SIMON T.","D4"]
["Joueur 5","FAYS M.","E4"]
["Joueur 6","VANDENBERGH V.","E4"]
["Joueur 7","EL HAMRAOUI Y.","E6"]
["Joueur 8","TOUSSAINT A.","NC"]
[]
["Match n°","Joueur A","Class.","Joueur B","Class.","Hand.","Set 1","Set 2","Set 3","Score","Arbitre"]
["Match n ° 1A","NOEL  X.","B6","EL HAMRAOUI Y.","E6",6,"11-6","12-10",null,"2-0","TOUSSAINT A."]
["Match n ° 2B","ORSINI  M.","C2","TOUSSAINT A.","NC",6,"11-7","11-8",null,"2-0","EL HAMRAOUI Y."]
["Match n ° 3A","SIMON T.","D4","VANDENBERGH V.","E4",2,"3-11","13-11","11-9","2-1","FAYS M."]
{"$rows_left_out":54}
{"sheet":"Class_Poule","index":8,"n_rows":86,"n_cols":12,"rows_kept":86,"cut":false,"hidden":false,"merged":[]}
[]
[]
[]
[]
[]
[]
[]
[null,null,null,null,null,null,"Finale",null,null,null,"Consolation"]
[]
[]
["MAKA  M.","B4",0,5,null,1,"MAKA  M.","B4",null,1,"WIKET  J.","C6"]
["NOEL  X.","B6",0,6,null,2,"NOEL  X.","B6",null,2,"MASSAR P.","D0"]
["HAVELANGE  E.","C2",0,2,null,3,"HAVELANGE  E.","C2",null,3,"FONTAINE  F.","E2"]
["CHÂTEAU  L.","C4",0,1,null,4,"CHÂTEAU  L.","C4",null,4,"POLIZZI  A.","E4"]
["MAKA  C.","B2",1,3,null,5,"MAKA  C.","B2",null,5,"DE VETTOR M.","E4"]
{"$rows_left_out":72}
{"sheet":"Tab_Finale","index":9,"n_rows":83,"n_cols":19,"rows_kept":83,"cut":false,"hidden":false,"merged":[[55,13,55,14]]}
[]
[]
[1,"MAKA  M.","B4",null,null,null,null,null,null,null,null,null,null,null,null,null,null,null,"MAKA  M."]
[null,null,null,null,"MAKA  M.","B4",null,null,null,null,null,null,null,null,null,null,null,null,""]
[32,null,null,null,null,null,null,null,null,null,null,null,null,null,null,null,null,null,{"$f":"B7","v":"SMEET D."}]
[null,null,null,null,"0-2",6,null,"SMEET D.","E4",null,null,null,null,null,null,null,null,null,{"$f":"B9","v":"LAVALLEE S."}]
[17,"SMEET D.","E4",null,null,null,null,null,null,null,null,null,null,null,null,null,null,null,{"$f":"B11","v":"FOCAN R."}]
[null,"2-0",4,null,"SMEET D.","E4",null,null,null,null,null,null,null,null,null,null,null,null,{"$f":"B13","v":"LAMALLE N."}]
[16,"LAVALLEE S.","C4",null,null,null,null,null,null,null,null,null,null,null,null,null,null,null,{"$f":"B15","v":0}]
[null,null,null,null,null,null,null,"1-2",4,null,"FOCAN R.","C4",null,null,null,null,null,null,{"$f":"B17","v":"DOUIN  M."}]
[9,"FOCAN R.","C4",null,null,null,null,null,null,null,null,null,null,null,null,null,null,null,{"$f":"B19","v":"MAKA  C."}]
[null,"2-0",4,null,"FOCAN R.","C4",null,null,null,null,null,null,null,null,null,null,null,null,{"$f":"B21","v":0}]
[24,"LAMALLE N.","E4",null,null,null,null,null,null,null,null,null,null,null,null,null,null,null,{"$f":"B23","v":"KLEIN  C."}]
[null,null,null,null,"2-0",0,null,"FOCAN R.","C4",null,null,null,null,null,null,null,null,null,{"$f":"B25","v":"GRISARD J."}]
[25,null,null,null,null,null,null,null,null,null,null,null,null,null,null,null,null,null,{"$f":"B27","v":"PAGNA  F."}]
{"$rows_left_out":69}
{"sheet":"Tab_Conso","index":10,"n_rows":65,"n_cols":17,"rows_kept":65,"cut":false,"hidden":false,"merged":[[55,13,55,14]]}
[]
[]
[1,"WIKET  J.","C6"]
[null,null,null,null,"WIKET  J.","C6"]
[32]
[null,null,null,null,"2-0",5,null,"WIKET  J.","C6"]
[17,"PIANGIVINO  S.","NC"]
[null,"0-2",0,null,"HIEL M.","NC"]
[16,"HIEL M.","NC"]
[null,null,null,null,null,null,null,"2-0",3,null,"WIKET  J.","C6"]
[9,"FAYS M.","E4"]
[null,"2-0",1,null,"FAYS M.","E4"]
[24,"JOANNES A.","NC"]
[null,null,null,null,"0-2",1,null,"PITER  B.","E0"]
[25]
{"$rows_left_out":51}
{"sheet":"Feuil1","index":11,"n_rows":138,"n_cols":19,"rows_kept":138,"cut":false,"hidden":false,"merged":[[32,0,32,6],[32,9,32,15],[4,11,4,14],[21,2,21,5],[28,12,29,12],[28,13,29,13],[28,14,29,14],[28,15,29,15],[25,11,26,11],[25,12,26,12],[25,13,26,13],[25,14,26,14],[25,15,26,15],[20,2,20,6],[20,11,20,15],[21,11,21,15],[28,16,29,16],[30,11,30,16],[27,11,27,16],[28,0,29,0],[28,2,29,2],[28,3,29,3],[28,4,29,4],[28,5,29,5],[28,6,29,6],[28,7,29,7],[28,9,29,9],[28,11,29,11],[25,16,26,16],[24,0,24,6],[24,9,24,15],[25,0,26,0],[25,2,26,2],[25,3,26,3],[25,4,26,4],[25,5,26,5],[25,6,26,6],[25,7,26,7],[25,9,26,9],[11,15,12,15],[8,15,9,15],[22,2,22,6],[22,11,22,15],[11,16,12,16],[13,11,13,16],[15,0,15,6],[15,9,15,15],[16,0,16,16],[17,2,17,6],[17,11,17,15],[11,9,12,9],[11,11,12,11],[11,12,12,12],[11,13,12,13],[11,14,12,14],[11,0,12,0],[11,2,12,2],[11,6,12,6],[11,7,12,7],[8,7,9,7],[8,9,9,9],[8,11,9,11],[8,12,9,12],[8,13,9,13],[11,3,12,3],[11,4,12,4],[11,5,12,5],[8,6,9,6],[35,2,35,6],[35,11,35,15],[38,2,38,6],[38,11,38,15],[39,2,39,5],[39,11,39,14],[28,18,29,18],[0,2,0,6],[0,11,0,15],[3,2,3,6],[3,11,3,15],[4,2,4,5],[8,14,9,14],[5,2,5,6],[5,11,5,15],[7,0,7,6],[7,9,7,15],[8,0,9,0],[8,2,9,2],[8,3,9,3],[8,4,9,4],[8,5,9,5],[8,16,9,16],[10,11,10,16],[40,2,40,6],[40,11,40,15],[42,0,42,6],[42,9,42,15],[43,0,44,0],[43,2,44,2],[43,3,44,3],[43,4,44,4],[43,5,44,5],[43,6,44,6],[43,7,44,7],[43,9,44,9],[43,11,44,11],[43,12,44,12],[43,13,44,13],[43,14,44,14],[43,15,44,15],[43,16,44,16],[45,11,45,16],[46,0,47,0],[46,2,47,2],[46,3,47,3],[46,4,47,4],[46,5,47,5],[46,6,47,6],[46,7,47,7],[46,9,47,9],[46,11,47,11],[46,12,47,12],[46,13,47,13],[46,14,47,14],[46,15,47,15],[52,2,52,6],[52,11,52,15],[55,2,55,6],[55,11,55,15],[56,2,56,5],[56,11,56,15],[46,16,47,16],[48,11,48,16],[50,0,50,6],[50,9,50,15],[51,0,51,16],[57,2,57,6],[57,11,57,15],[59,0,59,6],[59,9,59,15],[60,0,61,0],[60,2,61,2],[60,3,61,3],[60,4,61,4],[60,5,61,5],[60,6,61,6],[60,7,61,7],[60,9,61,9],[60,11,61,11],[60,12,61,12],[60,13,61,13],[60,14,61,14],[60,15,61,15],[60,16,61,16],[62,11,62,16],[63,0,64,0],[63,2,64,2],[63,3,64,3],[63,4,64,4],[63,5,64,5],[63,6,64,6],[63,7,64,7],[63,9,64,9],[63,11,64,11],[63,12,64,12],[63,13,64,13],[63,14,64,14],[63,15,64,15],[73,2,73,6],[73,11,73,15],[74,2,74,5],[74,11,74,14],[75,2,75,6],[75,11,75,15],[63,16,64,16],[65,11,65,16],[67,0,67,6],[67,9,67,15],[70,2,70,6],[70,11,70,15],[77,0,77,6],[77,9,77,15],[78,0,79,0],[78,2,79,2],[78,3,79,3],[78,4,79,4],[78,5,79,5],[78,6,79,6],[78,7,79,7],[78,9,79,9],[78,11,79,11],[78,12,79,12],[78,13,79,13],[78,14,79,14],[78,15,79,15],[78,16,79,16],[80,11,80,16],[81,0,82,0],[81,2,82,2],[81,3,82,3],[81,4,82,4],[81,5,82,5],[81,6,82,6],[81,7,82,7],[81,9,82,9],[81,11,82,11],[81,12,82,12],[81,13,82,13],[81,14,82,14],[81,15,82,15],[81,16,82,16],[90,2,90,6],[90,11,90,15],[91,2,91,5],[91,11,91,15],[92,2,92,6],[92,11,92,15],[83,11,83,16],[85,0,85,6],[85,9,85,15],[86,0,86,16],[87,2,87,6],[87,11,87,15],[94,0,94,6],[94,9,94,15],[95,0,96,0],[95,2,96,2],[95,3,96,3],[95,4,96,4],[95,5,96,5],[95,6,96,6],[95,7,96,7],[95,9,96,9],[95,11,96,11],[95,12,96,12],[95,13,96,13],[95,14,96,14],[95,15,96,15],[95,16,96,16],[97,11,97,16],[98,0,99,0],[98,2,99,2],[98,3,99,3],[98,4,99,4],[98,5,99,5],[98,6,99,6],[98,7,99,7],[98,9,99,9],[98,11,99,11],[98,12,99,12],[98,13,99,13],[98,14,99,14],[98,15,99,15],[98,16,99,16],[108,2,108,6],[108,11,108,15],[109,2,109,5],[109,11,109,14],[110,2,110,6],[110,11,110,15],[100,11,100,16],[102,0,102,6],[102,9,102,15],[105,2,105,6],[105,11,105,15],[112,0,112,6],[112,9,112,15],[113,0,114,0],[113,2,114,2],[113,3,114,3],[113,4,114,4],[113,5,114,5],[113,6,114,6],[113,7,114,7],[113,9,114,9],[113,11,114,11],[113,12,114,12],[113,13,114,13],[113,14,114,14],[113,15,114,15],[113,16,114,16],[115,11,115,16],[116,0,117,0],[116,2,117,2],[116,3,117,3],[116,4,117,4],[116,5,117,5],[116,6,117,6],[116,7,117,7],[116,9,117,9],[116,11,117,11],[116,12,117,12],[116,13,117,13],[116,14,117,14],[116,15,117,15],[116,16,117,16],[125,2,125,6],[125,11,125,15],[126,2,126,5],[126,11,126,15],[127,2,127,6],[127,11,127,15],[118,11,118,16],[120,0,120,6],[120,9,120,15],[121,0,121,16],[122,2,122,6],[122,11,122,15],[129,0,129,6],[129,9,129,15],[130,0,131,0],[130,2,131,2],[130,3,131,3],[130,4,131,4],[130,5,131,5],[130,6,131,6],[130,7,131,7],[130,9,131,9],[130,11,131,11],[130,12,131,12],[130,13,131,13],[130,14,131,14],[130,15,131,15],[135,11,135,16],[137,0,137,6],[137,9,137,15],[130,16,131,16],[132,11,132,16],[133,0,134,0],[133,2,134,2],[133,3,134,3],[133,4,134,4],[133,5,134,5],[133,6,134,6],[133,7,134,7],[133,9,134,9],[133,11,134,11],[133,12,134,12],[133,13,134,13],[133,14,134,14],[133,15,134,15],[133,16,134,16]]}
[null,null,"Critérium",null,null,null,null,null,null,null,null,"Critérium"]
["16ème finale",null,null,null,null,null,null,null,null,"16ème finale",null,null,null,null,null,null,null,null,"Bonjour,"]
[null,null,null,null,null,null,null,null,null,null,null,null,null,null,null,null,null,null,"Tu vois dans la ellule A9  il y a un opier de cellule de la feuille Tab_Finale"]
["Arbitre",null,null,null,null,null,null,null,null,"Arbitre",null,null,null,null,null,null,null,null,"et cela marche mais à d'autres cela ne marche pas par exemple cellule A26"]
[null,null,"Table n°",null,null,null,null,null,null,null,null,"Table n°",null,null,null,null,null,null,"mais si je fais un copier coller ctrl C +Ctrl v le nom se copie bien"]
[null,null,"Manches",null,null,null,null,null,null,null,null,"Manches",null,null,null,null,null,null,"Moi je voudrais automatiser cela par la formule =Tab_Finale!"]
[null,null,1,2,3,4,5,null,null,null,null,1,2,3,4,5,null,null,"Ca va puis ça va pas et je ne sais pas pourquoi ou peut-être que c'est mon pc qui déonne!"]
["Premier service: Gauche - Droite",null,null,null,null,null,null,"Score",null,"Premier service: Gauche - Droite",null,null,null,null,null,null,"Score"]
[{"$f":"Tab_Finale!$B$3","v":"MAKA  M."},{"$f":"Tab_Finale!C3","v":"B4"},null,null,null,null,null,null,null,{"$f":"Tab_Finale!$B$7","v":"SMEET D."},{"$f":"Tab_Finale!C7","v":"E4"},null,null,null,null,null,null,null,"Merci"]
[null,{"$f":"Tab_Finale!C4","v":0},null,null,null,null,null,null,null,null,{"$f":"Tab_Finale!$C$8","v":4}]
["contre",null,null,null,null,null,null,null,null,"contre"]
[{"$f":"Tab_Finale!$B$5","v":0},{"$f":"Tab_Finale!C5","v":0},null,null,null,null,null,null,null,{"$f":"Tab_Finale!$B$9","v":"LAVALLEE S."},{"$f":"VLOOKUP(J12,Joueurs!$C$3:$D$50,2)","v":"C4"}]
[null,{"$f":"Tab_Finale!C4","v":0},null,null,null,null,null,null,null,null,{"$f":"Tab_Finale!$C$8","v":4}]
[null,null,null,null,null,null,null,null,null,null,null,null,null,null,null,null,null,null,"²"]
[]
{"$rows_left_out":124}
{"sheet":"Valeurs","index":12,"n_rows":19,"n_cols":3,"rows_kept":19,"cut":false,"hidden":true,"merged":[]}
["Classement","Valeurs"]
["NC",1," "]
["E6",2]
["E4",3]
["E2",4]
["E0",5]
["D6",6]
["D4",7]
["D2",8]
["D0",9]
["C6",10]
["C4",11]
["C2",12]
["C0",13]
["B6",14]
{"$rows_left_out":5}
{"sheet":"Handicap","index":13,"n_rows":19,"n_cols":20,"rows_kept":19,"cut":false,"hidden":true,"merged":[]}
[" ","NC","E6","E4","E2","E0","D6","D4","D2","D0","C6","C4","C2","C0","B6","B4","B2","B0","A"]
["NC",null,1,1,2,2,3,3,4,4,5,5,6,6,7,7,8,8,8]
["E6",-1,null,1,1,2,2,3,3,4,4,5,5,6,6,7,7,8,8]
["E4",-1,-1,1,1,1,2,2,3,3,4,4,5,5,6,6,7,7,8]
["E2",-2,-1,-1,null,1,1,2,2,3,3,4,4,5,5,6,6,7,7]
["E0",-2,-2,-1,-1,null,1,1,2,2,3,3,4,4,5,5,6,6,7]
["D6",-3,-2,-2,-1,{"$f":"$E$6","v":-1},null,1,1,2,2,3,3,4,4,5,5,6,6]
["D4",-3,-3,-2,-2,-1,-1,null,1,1,2,2,3,3,4,4,5,5,6]
["D2",-4,-3,-3,-2,-2,-1,-1,null,1,1,2,2,3,3,4,4,5,5]
["D0",-4,-4,-3,-3,2,-2,-1,-1,null,1,1,2,2,3,3,4,4,5]
["C6",-5,-4,-4,-3,-3,-2,-2,-1,-1,null,1,1,2,2,3,3,4,4]
["C4",-5,-5,-4,-4,-3,-3,-2,-2,-1,-1,null,1,1,2,2,3,3,4]
["C2",-6,-5,-5,-4,-4,-3,-3,-2,-2,-1,-1,null,1,1,2,2,3,3]
["C0",-6,-6,-5,-5,-4,-4,-3,-3,-2,-2,-1,-1,null,1,1,2,2,3]
["B6",-7,-6,-6,-5,-5,-4,-4,-3,-3,-2,-2,-1,-1,null,1,1,2,2]
{"$rows_left_out":5}
{"sheet":"Equivalence","index":14,"n_rows":30,"n_cols":3,"rows_kept":30,"cut":false,"hidden":true,"merged":[]}
["Fédération ouvrière","Fédération belge","RIL"]
["NC","NC","NC"]
["F2","E6","E6"]
["F1","E4","E4"]
["E6","E2","E2"]
["E5","E0","E0"]
["E4","D6","D6"]
["E3","D4","D4"]
["E2","D4","D4"]
["E1","D4","D4"]
["D6","D2","D2"]
["D5","D2","D2"]
["D4","D2","D2"]
["D3","D0","D0"]
["D2","D0","D0"]
{"$rows_left_out":16}
{"sheet":"TeteSerie","index":15,"n_rows":32,"n_cols":1,"rows_kept":32,"cut":false,"hidden":true,"merged":[]}
[1]
[4]
[3]
[2]
[2]
[3]
[4]
[1]
[1]
[4]
[3]
[2]
[2]
[3]
[4]
{"$rows_left_out":18}
{"sheet":"Grille4","index":16,"n_rows":7,"n_cols":3,"rows_kept":7,"cut":false,"hidden":true,"merged":[]}
["Joueur A","Joueur B","Arbitre"]
[1,4,3]
[2,3,4]
[1,3,2]
[2,4,3]
[3,4,1]
[1,2,4]

{"sheet":"Grille5","index":17,"n_rows":11,"n_cols":3,"rows_kept":11,"cut":false,"hidden":true,"merged":[]}
["Joueur A","Joueur B","Arbitre"]
[1,5,3]
[2,4,1]
[3,5,2]
[1,4,5]
[2,3,4]
[4,5,3]
[1,3,5]
[2,5,1]
[3,4,2]
[1,2,4]

{"sheet":"Grille6","index":18,"n_rows":16,"n_cols":3,"rows_kept":16,"cut":false,"hidden":true,"merged":[]}
["Joueur A","Joueur B","Arbitre"]
[1,6,5]
[2,5,6]
[3,4,2]
[1,5,3]
[2,4,1]
[3,6,4]
[1,4,5]
[2,3,6]
[5,6,1]
[1,3,4]
[2,6,3]
[4,5,2]
[1,2,6]
[3,5,4]
{"$rows_left_out":2}
{"sheet":"Grille8","index":19,"n_rows":13,"n_cols":3,"rows_kept":13,"cut":false,"hidden":true,"merged":[]}
["Joueur A","Joueur B","Arbitre"]
[1,7,8]
[2,8,7]
[4,6,5]
[3,5,6]
[1,6,3]
[2,5,4]
[4,7,2]
[3,8,1]
[1,4,5]
[2,3,7]
[6,7,8]
[5,8,6]

{"sheet":"JoueursPoule","index":20,"n_rows":45,"n_cols":8,"rows_kept":45,"cut":false,"hidden":true,"merged":[]}
["Joueurs","Nbr Poules","Poule 1","Poule 2","Poule 3","Poule 4","Poule 5","Poule 6"]
[5,1,5,0,0,0,0,0]
[6,1,6,0,0,0,0,0]
[7,1,7,0,0,0,0,0]
[8,1,8,0,0,0,0,0]
[9,1,9,0,0,0,0,0]
[10,2,5,5,0,0,0,0]
[11,2,6,5,0,0,0,0]
[12,2,6,6,0,0,0,0]
[13,2,8,5,0,0,0,0]
[14,2,8,6,0,0,0,0]
[15,3,5,5,5,0,0,0]
[16,3,6,5,5,0,0,0]
[17,3,6,6,5,0,0,0]
[18,3,6,6,6,0,0,0]
{"$rows_left_out":30}