{"text_format":"1","workbook":"xlsx","n_sheets":2,"sheets":["GENERATION FICHE","Pour enregistrement"],"not_rendered":{"charts":0,"images":5,"macros":1,"external_links":3,"defined_names":12,"comments":0,"pivot_tables":0},"unopened":[],"bounds":{"document_bytes":16777216,"sheet_cells":100000,"rows_first":2000,"rows_last":500,"rows_between":2000,"halvings":0,"cell_chars":16384,"cell_head_chars":4096},"cells_cut":0,"cells_raw":0,"read":"whole","date_system":"1900"}

{"sheet":"GENERATION FICHE","index":0,"n_rows":103,"n_cols":32,"rows_kept":103,"cut":false,"hidden":false,"merged":[[68,1,71,3],[68,4,68,6],[68,7,68,21],[93,1,93,24],[54,1,54,24],[83,1,83,24],[80,22,80,24],[81,4,81,6],[81,7,81,9],[81,10,81,12],[81,13,81,15],[81,16,81,18],[81,19,81,21],[81,22,81,24],[80,4,80,6],[80,7,80,9],[80,10,80,12],[80,13,80,15],[80,16,80,18],[80,19,80,21],[79,7,79,9],[73,1,76,3],[73,4,73,6],[78,1,81,3],[51,1,51,6],[51,7,51,17],[51,18,51,21],[51,22,51,24],[53,1,53,4],[53,5,53,6],[53,13,53,15],[53,16,53,18],[53,19,53,21],[53,22,53,24],[78,4,78,6],[78,7,78,9],[78,10,78,12],[78,13,78,15],[78,16,78,18],[78,19,78,21],[78,22,78,24],[79,4,79,6],[75,4,75,6],[75,7,75,9],[75,10,75,12],[75,13,75,15],[75,16,75,18],[75,19,75,21],[75,22,75,24],[79,10,79,12],[79,13,79,15],[79,16,79,18],[79,19,79,21],[79,22,79,24],[76,22,76,24],[76,4,76,6],[76,7,76,9],[76,10,76,12],[76,13,76,15],[76,16,76,18],[76,19,76,21],[74,4,74,6],[74,7,74,12],[74,13,74,15],[74,16,74,18],[70,13,70,15],[70,16,70,18],[70,19,70,21],[70,22,70,24],[71,4,71,6],[71,7,71,12],[71,13,71,15],[71,16,71,18],[71,19,71,21],[71,22,71,24],[74,19,74,21],[74,22,74,24],[73,7,73,15],[73,16,73,18],[73,19,73,21],[73,22,73,24],[68,22,68,24],[69,4,69,6],[69,7,69,18],[69,19,69,21],[69,22,69,24],[70,4,70,6],[70,7,70,12],[64,16,64,18],[64,19,64,21],[64,22,64,24],[65,4,65,6],[65,7,65,9],[65,10,65,12],[65,13,65,15],[65,16,65,18],[65,19,65,21],[65,22,65,24],[66,4,66,6],[66,7,66,9],[66,10,66,12],[66,13,66,15],[66,16,66,18],[66,19,66,21],[66,22,66,24],[61,22,61,24],[63,1,66,3],[63,4,63,6],[63,7,63,12],[63,13,63,15],[63,16,63,18],[63,19,63,21],[63,22,63,24],[64,4,64,6],[64,7,64,9],[61,4,61,6],[61,7,61,9],[61,10,61,12],[61,13,61,15],[61,16,61,18],[61,19,61,21],[58,1,61,3],[58,4,58,6],[58,7,58,15],[58,16,58,18],[58,19,58,21],[58,22,58,24],[64,10,64,12],[64,13,64,15],[59,16,59,18],[59,19,59,21],[59,22,59,24],[60,4,60,6],[60,7,60,9],[60,10,60,12],[60,13,60,15],[60,16,60,18],[60,19,60,21],[60,22,60,24],[59,4,59,6],[59,7,59,9],[59,10,59,12],[59,13,59,15],[56,1,56,6],[56,7,56,24],[57,1,57,3],[57,4,57,6],[57,7,57,9],[57,10,57,12],[57,13,57,15],[57,16,57,18],[57,19,57,21],[57,22,57,24],[37,1,40,3],[37,4,40,24],[41,1,44,3],[41,4,44,24],[55,1,55,24],[28,21,28,22],[28,23,28,24],[29,1,32,3],[29,4,32,24],[33,1,36,3],[33,4,36,24],[24,1,28,3],[28,4,28,6],[28,7,28,9],[28,10,28,12],[28,13,28,14],[28,15,28,17],[28,18,28,20],[27,4,27,6],[27,7,27,9],[27,10,27,12],[27,13,27,14],[26,4,26,6],[26,7,26,9],[26,10,26,12],[26,13,26,14],[26,15,26,17],[26,18,26,20],[26,21,26,22],[26,23,26,24],[27,15,27,17],[27,18,27,20],[27,21,27,22],[27,23,27,24],[24,18,24,20],[24,21,24,22],[24,23,24,24],[25,4,25,6],[25,7,25,9],[25,10,25,12],[25,13,25,14],[25,15,25,17],[25,18,25,20],[25,21,25,22],[24,4,24,6],[24,7,24,9],[24,10,24,12],[24,13,24,14],[24,15,24,17],[25,23,25,24],[23,1,23,3],[23,7,23,14],[23,15,23,20],[23,21,23,22],[23,23,23,24],[22,1,22,24],[15,4,15,24],[16,4,16,24],[17,4,17,24],[18,4,18,24],[19,4,19,24],[10,22,10,24],[12,1,12,8],[12,9,13,24],[13,1,13,8],[10,1,10,3],[10,4,10,8],[10,9,10,11],[10,12,10,14],[10,15,10,17],[10,19,10,21],[6,12,6,15],[6,16,9,18],[6,19,6,24],[7,1,7,3],[7,4,7,8],[7,9,7,11],[7,12,7,15],[7,19,7,24],[8,1,8,3],[8,4,8,8],[8,9,8,11],[8,12,8,15],[8,19,8,24],[9,1,9,3],[9,4,9,8],[9,9,9,11],[9,12,9,15],[9,19,9,24],[84,1,84,24],[94,1,94,24],[10,26,11,29],[14,1,14,24],[0,1,1,4],[0,5,1,14],[0,15,0,18],[0,19,0,24],[1,16,1,18],[1,19,1,24],[15,1,19,3],[20,1,20,24],[3,1,3,6],[3,7,3,17],[3,18,3,21],[3,22,3,24],[5,1,6,3],[5,4,5,8],[5,9,5,11],[5,12,5,15],[5,16,5,18],[5,19,5,24],[6,4,6,8],[6,9,6,11]]}
[null,null,null,null,null,"REPERTOIRE HELISURFACES\nET HELISTATIONS",null,null,null,null,null,null,null,null,null,{"$f":"CONCATENATE(\"Ed.\",VLOOKUP(H4,'[2]BDD HOPITAUX HBG'!A4:AQ400,40,FALSE),\"-Amdt-\",VLOOKUP(H4,'[2]BDD HOPITAUX HBG'!A4:AQ400,41,FALSE))","v":"Ed.01-Amdt-00"},null,null,null,"Objet dernière(s) modification(s) : "]
[null,null,null,null,null,null,null,null,null,null,null,null,null,null,null,"Du:",{"$f":"VLOOKUP(H4,'[2]BDD HOPITAUX HBG'!A4:BA400,42,FALSE)","v":"2021-07-20"},null,null,{"$f":"VLOOKUP(H4,'[2]BDD HOPITAUX HBG'!A4:BA400,39,FALSE)","v":"Mise à jour nouveau format"},null,null,null,null,null,null,"C:\\Users\\steph\\Documents\\Travaux divers pour HBG MBH\\Fiches de poser\\IMAGES DZs"]
[null,null,null,null,null,null,null,null,null,null,null,null,null,null,null,null,null,null,null,null,null,null,null,null,null,null,"C:\\Users\\steph\\Documents\\Travaux divers pour HBG MBH\\Fiches de poser\\IMAGES DZs\\00-CAPS D'APPROCHE"]
[null,null,null,null,null,null,null,"CH_COMPIEGNE",null,null,null,null,null,null,null,null,null,null,"Code GPS:",null,null,null,{"$f":"IF(VLOOKUP(H4,'[2]BDD HOPITAUX HBG'!A4:AL400,15,FALSE)=\"\",\"\",VLOOKUP(H4,'[2]BDD HOPITAUX HBG'!A4:AL400,15,FALSE))","v":"HCOM"}]
[]
[null,{"$f":"VLOOKUP(H4,'[2]BDD HOPITAUX HBG'!A4:AL400,38,FALSE)","v":"CP1"},null,null,{"$f":"IF(VLOOKUP(H4,'[2]BDD HOPITAUX HBG'!A4:AL400,16,FALSE)=\"\",\"\",VLOOKUP(H4,'[2]BDD HOPITAUX HBG'!A4:AL400,16,FALSE))","v":"FICHE VAC INEXISTANTE"},null,null,null,null,"Hélisurface",null,null,{"$f":"IF(VLOOKUP(H4,'[2]BDD HOPITAUX HBG'!A4:AL400,22,FALSE)=\"\",\"\",VLOOKUP(H4,'[2]BDD HOPITAUX HBG'!A4:AL400,22,FALSE))","v":"Surface"},null,null,null,"Gestionnaire",null,null,{"$f":"IF(VLOOKUP(H4,'[2]BDD HOPITAUX HBG'!A4:AL400,27,FALSE)=\"\",\"\",VLOOKUP(H4,'[2]BDD HOPITAUX HBG'!A4:AL400,27,FALSE))","v":"CH Compiègne"}]
[null,null,null,null,{"$f":"IF(VLOOKUP(H4,'[2]BDD HOPITAUX HBG'!A4:AL400,17,FALSE)=\"\",\"\",VLOOKUP(H4,'[2]BDD HOPITAUX HBG'!A4:AL400,17,FALSE))","v":"UTILISABLE JOUR ET NUIT"},null,null,null,null,"Nature du sol",null,null,{"$f":"IF(VLOOKUP(H4,'[2]BDD HOPITAUX HBG'!A4:AL400,23,FALSE)=\"\",\"\",VLOOKUP(H4,'[2]BDD HOPITAUX HBG'!A4:AL400,23,FALSE))","v":"goudron"},null,null,null,"Contacts radio",null,null,{"$f":"IF(VLOOKUP(H4,'[2]BDD HOPITAUX HBG'!A4:AL400,28,FALSE)=\"\",\"\",VLOOKUP(H4,'[2]BDD HOPITAUX HBG'!A4:AL400,28,FALSE))","v":"Compiègne Margny 122,300 MHz"}]
[null,"Axes pref",null,null,{"$f":"IF(VLOOKUP(H4,'[2]BDD HOPITAUX HBG'!A4:AL400,18,FALSE)=\"\",\"\",VLOOKUP(H4,'[2]BDD HOPITAUX HBG'!A4:AL400,18,FALSE))","v":"151° - 331°"},null,null,null,null,"Forme",null,null,{"$f":"IF(VLOOKUP(H4,'[2]BDD HOPITAUX HBG'!A4:AL400,24,FALSE)=\"\",\"\",VLOOKUP(H4,'[2]BDD HOPITAUX HBG'!A4:AL400,24,FALSE))","v":"Carré"},null,null,null,null,null,null,{"$f":"IF(VLOOKUP(H4,'[2]BDD HOPITAUX HBG'!A4:AL400,29,FALSE)=\"\",\"\",VLOOKUP(H4,'[2]BDD HOPITAUX HBG'!A4:AL400,29,FALSE))","v":"SIV Beauvais 123,985 MHz"},null,null,null,null,null,null,null,null,null,null,"QFU01",{"$f":"VLOOKUP(H4,'[2]BDD HOPITAUX HBG'!A4:BA400,43,FALSE)","v":"151°"}]
[null,"Altitude FATO",null,null,{"$f":"IF(VLOOKUP(H4,'[2]BDD HOPITAUX HBG'!A4:AL400,14,FALSE)=\"\",\"\",VLOOKUP(H4,'[2]BDD HOPITAUX HBG'!A4:AL400,14,FALSE))","v":110},null,null,null,null,"Dim TLOF",null,null,{"$f":"IF(VLOOKUP(H4,'[2]BDD HOPITAUX HBG'!A4:AL400,25,FALSE)=\"\",\"\",VLOOKUP(H4,'[2]BDD HOPITAUX HBG'!A4:AL400,25,FALSE))","v":"15m x 15m"},null,null,null,null,null,null,{"$f":"IF(VLOOKUP(H4,'[2]BDD HOPITAUX HBG'!A4:AL400,30,FALSE)=\"\",\"\",VLOOKUP(H4,'[2]BDD HOPITAUX HBG'!A4:AL400,30,FALSE))","v":""},null,null,null,null,null,null,null,null,null,null,"QFU02",{"$f":"VLOOKUP(H4,'[2]BDD HOPITAUX HBG'!A4:BA400,45,FALSE)","v":"331°"}]
[null,"Situation",null,null,{"$f":"IF(VLOOKUP(H4,'[2]BDD HOPITAUX HBG'!A4:AL400,19,FALSE)=\"\",\"\",VLOOKUP(H4,'[2]BDD HOPITAUX HBG'!A4:AL400,19,FALSE))","v":"Zone industrielle"},null,null,null,null,"Dim FATO",null,null,{"$f":"IF(VLOOKUP(H4,'[2]BDD HOPITAUX HBG'!A4:AL400,26,FALSE)=\"\",\"\",VLOOKUP(H4,'[2]BDD HOPITAUX HBG'!A4:AL400,26,FALSE))","v":"20m X 20m"},null,null,null,null,null,null,{"$f":"IF(VLOOKUP(H4,'[2]BDD HOPITAUX HBG'!A4:AL400,31,FALSE)=\"\",\"\",VLOOKUP(H4,'[2]BDD HOPITAUX HBG'!A4:AL400,31,FALSE))","v":""}]
[null,"Environnement",null,null,{"$f":"IF(VLOOKUP(H4,'[2]BDD HOPITAUX HBG'!A4:AL400,20,FALSE)=\"\",\"\",VLOOKUP(H4,'[2]BDD HOPITAUX HBG'!A4:AL400,20,FALSE))","v":"Zone hostile inhabitée"},null,null,null,null,"Coordonnées",null,null,{"$f":"CONCATENATE(VLOOKUP(H4,'[2]BDD HOPITAUX HBG'!A4:AL400,2,FALSE),\" \",VLOOKUP(H4,'[2]BDD HOPITAUX HBG'!A4:AL400,5,FALSE),\"° \",VLOOKUP(H4,'[2]BDD HOPITAUX HBG'!A4:AL400,6,FALSE),\"' \",VLOOKUP(H4,'[2]BDD HOPITAUX HBG'!A4:AL400,7,FALSE),\"''\")","v":"N 49° 23' 12''"},null,null,{"$f":"CONCATENATE(VLOOKUP(H4,'[2]BDD HOPITAUX HBG'!A4:AL400,8,FALSE),\" \",VLOOKUP(H4,'[2]BDD HOPITAUX HBG'!A4:AL400,11,FALSE),\"° \",VLOOKUP(H4,'[2]BDD HOPITAUX HBG'!A4:AL400,12,FALSE),\"' \",VLOOKUP(H4,'[2]BDD HOPITAUX HBG'!A4:AL400,13,FALSE),\"''\")","v":"E 002° 47' 29''"},null,null,null,{"$f":"CONCATENATE(VLOOKUP(H4,'[2]BDD HOPITAUX HBG'!A4:AL400,2,FALSE),\" \",VLOOKUP(H4,'[2]BDD HOPITAUX HBG'!A4:AL400,3,FALSE),\"° \",VLOOKUP(H4,'[2]BDD HOPITAUX HBG'!A4:AL400,4,FALSE))","v":"N 49° 23,206"},null,null,{"$f":"CONCATENATE(VLOOKUP(H4,'[2]BDD HOPITAUX HBG'!A4:AL400,8,FALSE),\" \",VLOOKUP(H4,'[2]BDD HOPITAUX HBG'!A4:AL400,9,FALSE),\"° \",VLOOKUP(H4,'[2]BDD HOPITAUX HBG'!A4:AL400,10,FALSE))","v":"E 2° 47,486"},null,null,null,"Recopier les zones de textes ci-dessous avant de les inserer dans la fiche. Elles seront effacées par le bouton delete"]
[]
[null,{"$f":"AA2&\"\\\"&H4&\"\\\"&\"100.jpg\"","v":"C:\\Users\\steph\\Documents\\Travaux divers pour HBG MBH\\Fiches de poser\\IMAGES DZs\\CH_COMPIEGNE\\100.jpg"},null,null,null,null,null,null,null,{"$f":"AA2&\"\\\"&H4&\"\\\"&\"SAT.jpg\"","v":"C:\\Users\\steph\\Documents\\Travaux divers pour HBG MBH\\Fiches de poser\\IMAGES DZs\\CH_COMPIEGNE\\SAT.jpg"},null,null,null,null,null,null,null,null,null,null,null,null,null,null,null,null,{"$f":"AA3&\"\\\"&E8&\"\\\"&\"CAP.png\"","v":"C:\\Users\\steph\\Documents\\Travaux divers pour HBG MBH\\Fiches de poser\\IMAGES DZs\\00-CAPS D'APPROCHE\\151° - 331°\\CAP.png"}]
[null,{"$f":"AA2&\"\\\"&H4&\"\\\"&\"25.jpg\"","v":"C:\\Users\\steph\\Documents\\Travaux divers pour HBG MBH\\Fiches de poser\\IMAGES DZs\\CH_COMPIEGNE\\25.jpg"}]
[null,"Par convention, toutes les cartes et images ci-dessus sont orientées au Nord."]
[null,"Observations\net obstacles à proximité FATO",null,null,{"$f":"IF(VLOOKUP(H4,'[2]BDD HOPITAUX HBG'!A4:AL400,32,FALSE)=\"\",\"\",VLOOKUP(H4,'[2]BDD HOPITAUX HBG'!A4:AL400,32,FALSE))","v":"Privilégier APP et DEC axe 151° "}]
[null,null,null,null,{"$f":"IF(VLOOKUP(H4,'[2]BDD HOPITAUX HBG'!A4:AL400,33,FALSE)=\"\",\"\",VLOOKUP(H4,'[2]BDD HOPITAUX HBG'!A4:AL400,33,FALSE))","v":"Lampadaire au coin sud est de la FATO - Sur axe 151° sud FATO : Haie d'arbres  (hauteur 30ft) + Ateliers à 50m"}]
[null,null,null,null,{"$f":"IF(VLOOKUP(H4,'[2]BDD HOPITAUX HBG'!A4:AL400,34,FALSE)=\"\",\"\",VLOOKUP(H4,'[2]BDD HOPITAUX HBG'!A4:AL400,34,FALSE))","v":"Stationnement sur la FATO"}]
[null,null,null,null,{"$f":"IF(VLOOKUP(H4,'[2]BDD HOPITAUX HBG'!A4:BA400,35,FALSE)=\"\",\"\",VLOOKUP(H4,'[2]BDD HOPITAUX HBG'!A4:BA400,35,FALSE))","v":""}]
[null,null,null,null,{"$f":"IF(VLOOKUP(H4,'[2]BDD HOPITAUX HBG'!A5:BA344,36,FALSE)=\"\",\"\",VLOOKUP(H4,'[2]BDD HOPITAUX HBG'!A5:BA344,36,FALSE))","v":""}]
[null,{"$f":"CONCATENATE('[2]BDD HOPITAUX HBG'!AK2,VLOOKUP(H4,'[2]BDD HOPITAUX HBG'!A4:AL400,37,FALSE))","v":"En cas d'incident aérien grave, les secours seront réalisés par :la sécurité de l'hôpital présent à chaque mvt aérien"}]
[]
[null,"PROCEDURES"]
[null,"Type procédure",null,null,null,null,null,"PDA",null,null,null,null,null,null,null,"PDD",null,null,null,null,null,"VTOSS",null,"Vz"]
[null,"CP1 Ponctuelle",null,null,"135 T1",null,null,"160 ft/FATO",null,null,"460 ft/Baro",null,null,"35 KIAS",null,"160 ft/FATO",null,null,"520 ft/Baro",null,null,"40 KIAS",null,"300 ft/mn"]
[null,null,null,null,"135 T2 +",null,null,"160 ft/FATO",null,null,"520 ft/Baro",null,null,"35 KIAS",null,"160 ft/FATO",null,null,"520 ft/Baro",null,null,"40 KIAS",null,"400 ft/mn"]
[null,null,null,null,"135 T3H",null,null,"160 ft/FATO",null,null,"520 ft/Baro",null,null,"25 KIAS",null,"160 ft/FATO",null,null,"520 ft/Baro",null,null,"40 KIAS",null,"400 ft/mn"]
[null,null,null,null,"145 T2",null,null,"150 ft/FATO",null,null,"320 ft/Baro",null,null,"30 KIAS",null,"160 ft/FATO",null,null,"340 ft/Baro",null,null,"45 KIAS",null,"300 ft/mn"]
[null,null,null,null,"145 T3"]
[null,{"$f":"CONCATENATE(\"Atterrissage  QFU \",VLOOKUP(H4,'[2]BDD HOPITAUX HBG'!A4:BA400,43,FALSE))","v":"Atterrissage  QFU 151°"},null,null,{"$f":"IF(VLOOKUP(H4,'[2]BDD HOPITAUX HBG'!A4:BA400,44,FALSE)=\"\",\"\",VLOOKUP(H4,'[2]BDD HOPITAUX HBG'!A4:BA400,44,FALSE))","v":"Approche CP1 ponctuel - PDA baro 320 ft/QNH (EC 135 T2+), 320 ft/QNH (EC 135 T3), 320 ft/QNH (BK 117D2) Montée en recul sur axe 151° - Au PDD poursuivre décollage Rm 151°"}]
[]
[]
[]
[null,{"$f":"CONCATENATE(\"Atterrissage  QFU \",VLOOKUP(H4,'[2]BDD HOPITAUX HBG'!A4:BA400,45,FALSE))","v":"Atterrissage  QFU 331°"},null,null,{"$f":"IF(VLOOKUP(H4,'[2]BDD HOPITAUX HBG'!A4:BA400,46,FALSE)=\"\",\"\",VLOOKUP(H4,'[2]BDD HOPITAUX HBG'!A4:BA400,46,FALSE))","v":"Approche CP1 ponctuel - PDA baro 320 ft/QNH (EC 135 T2+), 320 ft/QNH (EC 135 T3), 320 ft/QNH (BK 117D2)       API avant PDA Rm 331°"}]
[]
[]
[]
[null,{"$f":"CONCATENATE(\"Décollage  QFU \",VLOOKUP(H4,'[2]BDD HOPITAUX HBG'!A4:BA400,43,FALSE))","v":"Décollage  QFU 151°"},null,null,{"$f":"IF(VLOOKUP(H4,'[2]BDD HOPITAUX HBG'!A4:BA400,47,FALSE)=\"\",\"\",VLOOKUP(H4,'[2]BDD HOPITAUX HBG'!A4:BA400,47,FALSE))","v":"Décollage CP1 ponctuel - PDA baro 320 ft/QNH (EC 135 T2+), 320 ft/QNH (EC 135 T3), 340 ft/QNH (BK 117D2)  Montée en recul sur axe 151° - Au PDD poursuivre décollage Rm 151°"}]
[]
[]
[]
[null,{"$f":"CONCATENATE(\"Décollage QFU \",VLOOKUP(H4,'[2]BDD HOPITAUX HBG'!A4:BA400,45,FALSE))","v":"Décollage QFU 331°"},null,null,{"$f":"IF(VLOOKUP(H4,'[2]BDD HOPITAUX HBG'!A4:BA400,48,FALSE)=\"\",\"\",VLOOKUP(H4,'[2]BDD HOPITAUX HBG'!A4:BA400,48,FALSE))","v":"Décollage CP1 ponctuel - PDA baro 320 ft/QNH (EC 135 T2+), 320 ft/QNH (EC 135 T3), 340 ft/QNH (BK 117D2)  Montée en recul sur axe 331° - Au PDD poursuivre décollage Rm 331°"}]
[]
[]
[]
[]
[]
[]
[]
[]
[]
[null,null,null,null,null,null,null,{"$f":"H4","v":"CH_COMPIEGNE"},null,null,null,null,null,null,null,null,null,null,"Code GPS:",null,null,null,{"$f":"W4","v":"HCOM"}]
[]
[null,"Altitude FATO",null,null,null,{"$f":"E9","v":110},null,null,null,"Coordonnées GPS",null,null,null,{"$f":"M11","v":"N 49° 23' 12''"},null,null,{"$f":"P11","v":"E 002° 47' 29''"},null,null,{"$f":"T11","v":"N 49° 23,206"},null,null,{"$f":"W11","v":"E 2° 47,486"}]
[]
[null,"PERFORMANCES CP1 VTOL EC135 T1 / EC135 T2+ / H135 T3H / H145 T2 / H145 T3"]
[null,null,null,null,null,null,null,"Températures"]
[null,"Hélicoptères",null,null,"Zp",null,null,"10°C",null,null,"+15°C",null,null,"+20°C",null,null,"+25°C",null,null,"+30°C",null,null,"+35°C"]
[null,"EC 135 T1",null,null,"0 ft",null,null,"Masse Max : 2835 kg",null,null,null,null,null,null,null,null,"2775 kg",null,null,"2715 kg",null,null,"2668 kg"]
[null,null,null,null,"500 ft",null,null,"2835 kg",null,null,"2826 kg",null,null,"2788 kg",null,null,"2735 kg",null,null,"2682 kg",null,null,"2635 kg"]
{"$rows_left_out":44}
{"sheet":"Pour enregistrement","index":1,"n_rows":103,"n_cols":32,"rows_kept":103,"cut":false,"hidden":false,"merged":[[0,1,1,4],[0,5,1,14],[0,15,0,18],[0,19,0,24],[1,16,1,18],[1,19,1,24],[3,1,3,6],[3,7,3,17],[3,18,3,21],[3,22,3,24],[5,1,6,3],[5,4,5,8],[5,9,5,11],[5,12,5,15],[5,16,5,18],[5,19,5,24],[6,4,6,8],[6,9,6,11],[6,12,6,15],[6,16,9,18],[6,19,6,24],[7,1,7,3],[7,4,7,8],[7,9,7,11],[7,12,7,15],[7,19,7,24],[8,1,8,3],[8,4,8,8],[8,9,8,11],[8,12,8,15],[8,19,8,24],[9,1,9,3],[9,4,9,8],[9,9,9,11],[9,12,9,15],[9,19,9,24],[19,4,19,24],[20,1,20,24],[22,1,22,24],[23,1,23,3],[23,7,23,14],[23,15,23,20],[23,21,23,22],[23,23,23,24],[10,22,10,24],[12,1,12,8],[12,9,13,24],[13,1,13,8],[14,1,14,24],[15,1,19,3],[15,4,15,24],[16,4,16,24],[17,4,17,24],[18,4,18,24],[10,1,10,3],[10,4,10,8],[10,9,10,11],[10,12,10,14],[10,15,10,17],[10,19,10,21],[24,18,24,20],[24,21,24,22],[24,23,24,24],[25,4,25,6],[25,7,25,9],[25,10,25,12],[25,13,25,14],[25,15,25,17],[25,18,25,20],[25,21,25,22],[24,4,24,6],[24,7,24,9],[24,10,24,12],[24,13,24,14],[24,15,24,17],[25,23,25,24],[26,4,26,6],[26,7,26,9],[26,10,26,12],[26,13,26,14],[26,15,26,17],[26,18,26,20],[26,21,26,22],[26,23,26,24],[28,21,28,22],[28,23,28,24],[29,1,32,3],[29,4,32,24],[33,1,36,3],[33,4,36,24],[27,15,27,17],[27,18,27,20],[27,21,27,22],[27,23,27,24],[28,4,28,6],[28,7,28,9],[28,10,28,12],[28,13,28,14],[28,15,28,17],[28,18,28,20],[24,1,28,3],[27,4,27,6],[27,7,27,9],[27,10,27,12],[27,13,27,14],[53,1,53,4],[53,5,53,6],[53,13,53,15],[53,16,53,18],[53,19,53,21],[53,22,53,24],[37,1,40,3],[37,4,40,24],[41,1,44,3],[41,4,44,24],[51,1,51,6],[51,7,51,17],[51,18,51,21],[51,22,51,24],[54,1,54,24],[55,1,55,24],[56,1,56,6],[56,7,56,24],[57,1,57,3],[57,4,57,6],[57,7,57,9],[57,10,57,12],[57,13,57,15],[57,16,57,18],[57,19,57,21],[57,22,57,24],[58,1,61,3],[58,4,58,6],[58,7,58,15],[58,16,58,18],[58,19,58,21],[58,22,58,24],[59,4,59,6],[59,7,59,9],[59,10,59,12],[59,13,59,15],[59,16,59,18],[59,19,59,21],[59,22,59,24],[60,4,60,6],[60,7,60,9],[60,10,60,12],[60,13,60,15],[60,16,60,18],[60,19,60,21],[60,22,60,24],[61,4,61,6],[61,7,61,9],[61,10,61,12],[61,13,61,15],[61,16,61,18],[61,19,61,21],[61,22,61,24],[63,22,63,24],[64,4,64,6],[64,7,64,9],[64,10,64,12],[64,13,64,15],[64,16,64,18],[64,19,64,21],[64,22,64,24],[63,1,66,3],[63,4,63,6],[63,7,63,12],[63,13,63,15],[63,16,63,18],[63,19,63,21],[65,4,65,6],[65,7,65,9],[65,10,65,12],[65,13,65,15],[65,16,65,18],[65,19,65,21],[65,22,65,24],[66,4,66,6],[66,7,66,9],[66,10,66,12],[66,13,66,15],[66,16,66,18],[66,19,66,21],[66,22,66,24],[68,1,71,3],[68,4,68,6],[68,7,68,21],[68,22,68,24],[69,4,69,6],[69,7,69,18],[69,19,69,21],[69,22,69,24],[70,4,70,6],[70,7,70,12],[70,13,70,15],[70,16,70,18],[70,19,70,21],[70,22,70,24],[71,4,71,6],[71,7,71,12],[71,13,71,15],[71,16,71,18],[71,19,71,21],[71,22,71,24],[74,19,74,21],[74,22,74,24],[75,4,75,6],[75,7,75,9],[75,10,75,12],[75,13,75,15],[75,16,75,18],[75,19,75,21],[75,22,75,24],[74,4,74,6],[74,7,74,12],[74,13,74,15],[74,16,74,18],[79,22,79,24],[76,22,76,24],[78,1,81,3],[78,4,78,6],[78,7,78,9],[78,10,78,12],[78,13,78,15],[78,16,78,18],[78,19,78,21],[78,22,78,24],[79,4,79,6],[76,4,76,6],[76,7,76,9],[76,10,76,12],[76,13,76,15],[76,16,76,18],[76,19,76,21],[73,1,76,3],[73,4,73,6],[73,7,73,15],[73,16,73,18],[73,19,73,21],[73,22,73,24],[83,1,83,24],[84,1,84,24],[93,1,93,24],[94,1,94,24],[10,26,11,33],[80,22,80,24],[81,4,81,6],[81,7,81,9],[81,10,81,12],[81,13,81,15],[81,16,81,18],[81,19,81,21],[81,22,81,24],[80,4,80,6],[80,7,80,9],[80,10,80,12],[80,13,80,15],[80,16,80,18],[80,19,80,21],[79,7,79,9],[79,10,79,12],[79,13,79,15],[79,16,79,18],[79,19,79,21]]}
[null,null,null,null,null,"REPERTOIRE HELISURFACES\nET HELISTATIONS",null,null,null,null,null,null,null,null,null,"Ed.01-Amdt-00",null,null,null,"Objet dernière(s) modification(s) : "]
[null,null,null,null,null,null,null,null,null,null,null,null,null,null,null,"Du:","2021-07-20",null,null,"Mise à jour nouveau format",null,null,null,null,null,null,"C:\\Users\\steph\\Documents\\Travaux divers pour HBG MBH\\Fiches de poser\\IMAGES DZs"]
[null,null,null,null,null,null,null,null,null,null,null,null,null,null,null,null,null,null,null,null,null,null,null,null,null,null,"C:\\Users\\steph\\Documents\\Travaux divers pour HBG MBH\\Fiches de poser\\IMAGES DZs\\00-CAPS D'APPROCHE"]
[null,null,null,null,null,null,null,"CH_COMPIEGNE",null,null,null,null,null,null,null,null,null,null,"Code GPS:",null,null,null,"HCOM"]
[]
[null,"CP1",null,null,"FICHE VAC INEXISTANTE",null,null,null,null,"Hélisurface",null,null,"Surface",null,null,null,"Gestionnaire",null,null,"CH Compiègne"]
[null,null,null,null,"UTILISABLE JOUR ET NUIT",null,null,null,null,"Nature du sol",null,null,"goudron",null,null,null,"Contacts radio",null,null,"Compiègne Margny 122,300 MHz"]
[null,"Axes pref",null,null,"151° - 331°",null,null,null,null,"Forme",null,null,"Carré",null,null,null,null,null,null,"SIV Beauvais 123,985 MHz",null,null,null,null,null,null,null,null,null,null,"QFU01",{"$f":"VLOOKUP(H4,'[2]BDD HOPITAUX HBG'!A4:BA400,43,FALSE)","v":"151°"}]
[null,"Altitude FATO",null,null,110,null,null,null,null,"Dim TLOF",null,null,"15m x 15m",null,null,null,null,null,null,"",null,null,null,null,null,null,null,null,null,null,"QFU02",{"$f":"VLOOKUP(H4,'[2]BDD HOPITAUX HBG'!A4:BA400,45,FALSE)","v":"331°"}]
[null,"Situation",null,null,"Zone industrielle",null,null,null,null,"Dim FATO",null,null,"20m X 20m",null,null,null,null,null,null,""]
[null,"Environnement",null,null,"Zone hostile inhabitée",null,null,null,null,"Coordonnées",null,null,"N 49° 23' 12''",null,null,"E 002° 47' 29''",null,null,null,"N 49° 23,206",null,null,"E 2° 47,486",null,null,null,"Recopier les zones de textes ci-dessous avant de les inserer dans la fiche. Elles seront effacées par le bouton \"Effacer les cartes\""]
[]
[null,"C:\\Users\\steph\\Documents\\Travaux divers pour HBG MBH\\Fiches de poser\\IMAGES DZs\\CH_COMPIEGNE\\100.jpg",null,null,null,null,null,null,null,"C:\\Users\\steph\\Documents\\Travaux divers pour HBG MBH\\Fiches de poser\\IMAGES DZs\\CH_COMPIEGNE\\SAT.jpg",null,null,null,null,null,null,null,null,null,null,null,null,null,null,null,null,{"$f":"AA3&\"\\\"&E8&\"\\\"&\"CAP.png\"","v":"C:\\Users\\steph\\Documents\\Travaux divers pour HBG MBH\\Fiches de poser\\IMAGES DZs\\00-CAPS D'APPROCHE\\151° - 331°\\CAP.png"}]
[null,"C:\\Users\\steph\\Documents\\Travaux divers pour HBG MBH\\Fiches de poser\\IMAGES DZs\\CH_COMPIEGNE\\25.jpg"]
[null,"Par convention, toutes les cartes et images ci-dessus sont orientées au Nord."]
[null,"Observations\net obstacles à proximité FATO",null,null,"Privilégier APP et DEC axe 151° "]
[null,null,null,null,"Lampadaire au coin sud est de la FATO - Sur axe 151° sud FATO : Haie d'arbres  (hauteur 30ft) + Ateliers à 50m"]
[null,null,null,null,"Stationnement sur la FATO"]
[null,null,null,null,""]
[null,null,null,null,""]
[null,"En cas d'incident aérien grave, les secours seront réalisés par :la sécurité de l'hôpital présent à chaque mvt aérien"]
[]
[null,"PROCEDURES"]
[null,"Type procédure",null,null,null,null,null,"PDA",null,null,null,null,null,null,null,"PDD",null,null,null,null,null,"VTOSS",null,"Vz"]
[null,"CP1 Ponctuelle",null,null,"135 T1",null,null,"160 ft/FATO",null,null,"460 ft/Baro",null,null,"35 KIAS",null,"160 ft/FATO",null,null,"520 ft/Baro",null,null,"40 KIAS",null,"300 ft/mn"]
[null,null,null,null,"135 T2 +",null,null,"160 ft/FATO",null,null,"520 ft/Baro",null,null,"35 KIAS",null,"160 ft/FATO",null,null,"520 ft/Baro",null,null,"40 KIAS",null,"400 ft/mn"]
[null,null,null,null,"135 T3H",null,null,"160 ft/FATO",null,null,"520 ft/Baro",null,null,"25 KIAS",null,"160 ft/FATO",null,null,"520 ft/Baro",null,null,"40 KIAS",null,"400 ft/mn"]
[null,null,null,null,"145 T2",null,null,"150 ft/FATO",null,null,"320 ft/Baro",null,null,"30 KIAS",null,"160 ft/FATO",null,null,"340 ft/Baro",null,null,"45 KIAS",null,"300 ft/mn"]
[null,null,null,null,"145 T3"]
[null,"Atterrissage  QFU 151°",null,null,"Approche CP1 ponctuel - PDA baro 320 ft/QNH (EC 135 T2+), 320 ft/QNH (EC 135 T3), 320 ft/QNH (BK 117D2) Montée en recul sur axe 151° - Au PDD poursuivre décollage Rm 151°"]
[]
[]
[]
[null,"Atterrissage  QFU 331°",null,null,"Approche CP1 ponctuel - PDA baro 320 ft/QNH (EC 135 T2+), 320 ft/QNH (EC 135 T3), 320 ft/QNH (BK 117D2)       API avant PDA Rm 331°"]
[]
[]
[]
[null,"Décollage  QFU 151°",null,null,"Décollage CP1 ponctuel - PDA baro 320 ft/QNH (EC 135 T2+), 320 ft/QNH (EC 135 T3), 340 ft/QNH (BK 117D2)  Montée en recul sur axe 151° - Au PDD poursuivre décollage Rm 151°"]
[]
[]
[]
[null,"Décollage QFU 331°",null,null,"Décollage CP1 ponctuel - PDA baro 320 ft/QNH (EC 135 T2+), 320 ft/QNH (EC 135 T3), 340 ft/QNH (BK 117D2)  Montée en recul sur axe 331° - Au PDD poursuivre décollage Rm 331°"]
[]
[]
[]
[]
[]
[]
[]
[]
[]
[null,null,null,null,null,null,null,"CH_COMPIEGNE",null,null,null,null,null,null,null,null,null,null,"Code GPS:",null,null,null,"HCOM"]
[]
[null,"Altitude FATO",null,null,null,110,null,null,null,"Coordonnées GPS",null,null,null,"N 49° 23' 12''",null,null,"E 002° 47' 29''",null,null,"N 49° 23,206",null,null,"E 2° 47,486"]
[]
[null,"PERFORMANCES CP1 VTOL EC135 T1 / EC135 T2+ / H135 T3H / H145 T2 / H145 T3"]
[null,null,null,null,null,null,null,"Températures"]
[null,"Hélicoptères",null,null,"Zp",null,null,"10°C",null,null,"+15°C",null,null,"+20°C",null,null,"+25°C",null,null,"+30°C",null,null,"+35°C"]
[null,"EC 135 T1",null,null,"0 ft",null,null,"Masse Max : 2835 kg",null,null,null,null,null,null,null,null,"2775 kg",null,null,"2715 kg",null,null,"2668 kg"]
[null,null,null,null,"500 ft",null,null,"2835 kg",null,null,"2826 kg",null,null,"2788 kg",null,null,"2735 kg",null,null,"2682 kg",null,null,"2635 kg"]
{"$rows_left_out":43}